##TITLE=AC1442_CALAH13251_8011712_7W0FoOyd05
##JCAMPDX= 6.0         $$ Bruker NMR JCAMP-DX V2.0
##DATA TYPE= NMR SPECTRUM
##DATA CLASS= NTUPLES
##ORIGIN= BRUKER
##OWNER= Administrator
$$ 1.72 TOPSPIN		Version 2.1
$$ 2013-07-05 20:31:26.526 -0700  Administrator@X
$$ Compression mode = diff/dup
##.OBSERVE FREQUENCY= 400.02188249412
##.OBSERVE NUCLEUS= ^1H
##.ACQUISITION MODE= SIMULTANEOUS (DQD)
##.ACQUISITION SCHEME= undefined
##.AVERAGES= 8
##.DIGITISER RES= 22
##SPECTROMETER/DATA SYSTEM= spect
##.PULSE SEQUENCE= zg30
##.SOLVENT NAME= COFFEE_meoh
##.SHIFT REFERENCE= INTERNAL, COFFEE_meoh, 1, 14.98509
##AUDIT TRAIL= $$ (NUMBER, WHEN, WHO, WHERE, PROCESS, VERSION, WHAT)
$$ ##TITLE= Audit trail, TOPSPIN		Version 2.1
$$ ##JCAMPDX= 5.01
$$ ##ORIGIN= Bruker BioSpin GmbH
$$ ##OWNER= Administrator
$$ $$ E:\/data/COFFEE/nmr/AC1442_CALAH13251_8011712_7W0FoOyd05/10/pdata/1/auditp.txt
$$ ##AUDIT TRAIL=  $$ (NUMBER, WHEN, WHO, WHERE, PROCESS, VERSION, WHAT)
(   1,<2013-07-05 20:31:19.041 -0700>,<Administrator>,<X>,<go>,<TOPSPIN 2.1>,
      <created by zg
	started at 2013-07-05 20:30:12.729 -0700,
	POWCHK enabled, PULCHK disabled,
       configuration hash MD5:
       C8 4E 4E 5D D3 5C D8 9E 9F 52 82 E0 59 8A DE 15
       data hash MD5: 64K
       12 70 46 81 70 4D 65 7C 70 E5 C1 E0 50 1C AA 7A>)
(   2,<2013-07-05 20:31:22.135 -0700>,<Administrator>,<X>,<proc1d>,<TOPSPIN 2.1>,
      <Start of raw data processing
       efp LB = 0 FT_mod = 6 PKNL = 1 PHC0 = 0 PHC1 = 0 SI = 32K 
       data hash MD5: 32K
       8E 84 EE 8E 91 AB 27 BE 30 38 8E C9 9E F5 F1 8F>)
(   3,<2013-07-05 20:31:22.510 -0700>,<Administrator>,<X>,<proc1d>,<TOPSPIN 2.1>,
      <pk PHC0 = 95.17456 PHC1 = 0 
       data hash MD5: 32K
       52 41 93 B7 FF BB 2A 66 71 44 AF 27 F2 D7 F0 C8>)
(   4,<2013-07-05 20:31:22.854 -0700>,<Administrator>,<X>,<proc1d>,<TOPSPIN 2.1>,
      <abs ABSG = 1 
       data hash MD5: 32K
       86 60 55 7C 59 67 B1 FF A7 15 78 BB 87 A3 80 E2>)
(   5,<2013-07-05 20:31:22.916 -0700>,<Administrator>,<X>,<proc1d>,<TOPSPIN 2.1>,
      <abs ABSG = 2 
       data hash MD5: 32K
       AD 5A 67 1A C6 B3 3D E5 57 D1 81 97 95 68 A8 FF>)
(   6,<2013-07-05 20:31:22.979 -0700>,<Administrator>,<X>,<proc1d>,<TOPSPIN 2.1>,
      <abs ABSG = 3 
       data hash MD5: 32K
       43 CB B2 BA 66 FB CA BA 58 97 C2 0B 08 08 97 F9>)
(   7,<2013-07-05 20:31:23.041 -0700>,<Administrator>,<X>,<proc1d>,<TOPSPIN 2.1>,
      <abs ABSG = 4 
       data hash MD5: 32K
       34 05 E2 1F C7 E5 3F FB 22 16 A1 EC FF 97 69 FE>)
(   8,<2013-07-05 20:31:23.135 -0700>,<Administrator>,<X>,<proc1d>,<TOPSPIN 2.1>,
      <abs ABSG = 5 
       data hash MD5: 32K
       34 38 BF FA C7 BF 36 1C 08 5D 52 6A 1A 66 60 8E>)
$$ ##END=
$$ 
$$ $$ hash MD5
$$ $$ B3 81 BD 7C BA 81 04 70 03 12 7E F3 BF 4D 71 9F
##$RELAX= 
##$RELAX= 
##$RELAX= 
##$RELAX= 
##$RELAX= 
##$RELAX= 
##$RELAX= 
$$ Bruker specific parameters
$$ --------------------------
##$DU= <E:\>
##$EXPNO= 10
##$NAME= <AC1442_CALAH13251_8011712_7W0FoOyd05>
$$ [...]
150 150 150 150 150 150 150 150
##$TP07= 0
##$TPNAME0= <>
##$TPNAME1= <>
##$TPNAME2= <>
##$TPNAME3= <>
##$TPNAME4= <>
##$TPNAME5= <>
##$TPNAME6= <>
##$TPNAME7= <>
##$TPOAL= (0..7)
0.5 0.5 0.5 0.5 0.5 0.5 0.5 0.5
##$TPOFFS= (0..7)
0 0 0 0 0 0 0 0
##$TUNHIN= 0
##$TUNHOUT= 0
##$TUNXOUT= 0
##$USERA1= <user>
##$USERA2= <user>
##$USERA3= <user>
##$USERA4= <user>
##$USERA5= <user>
##$V9= 5
##$VALIST= <valist>
##$VCLIST= <CCCCCCCCCCCCCCC>
##$VD= 0
##$VDLIST= <DDDDDDDDDDDDDDD>
##$VPLIST= <PPPPPPPPPPPPPPP>
##$VTLIST= <TTTTTTTTTTTTTTT>
##$WBST= 1024
##$WBSW= 4
##$XGAIN= (0..3)
0 0 0 0
##$XL= 0
##$YL= 0
##$YMAX_a= 634167
##$YMIN_a= -538629
##$ZGOPTNS= <>
##$ZL1= 120
##$ZL2= 120
##$ZL3= 120
##$ZL4= 120
##$ABSF1= 14.98509
##$ABSF2= -5.573092
##$ABSG= 5
##$ABSL= 3
##$ALPHA= 0
##$AQORDER= 0
##$ASSFAC= 0
##$ASSFACI= 0
##$ASSFACX= 0
##$ASSWID= 0
##$AUNMP= <proc_prof1d_extract_pilot.lims>
##$AXLEFT= 0
##$AXNAME= <>
##$AXNUC= <1H>
##$AXRIGHT= 0
##$AXTYPE= 0
##$AXUNIT= <>
##$AZFE= 0.1
##$AZFW= 0.1
##$BCFW= 0
##$BC_mod= 0
##$BYTORDP= 0
##$COROFFS= 0
##$CY= 15
##$DATMOD= 1
##$DC= 0
##$DFILT= <>
##$DTYPP= 0
##$F1P= 0
##$F2P= 0
##$FCOR= 0.5
##$FTSIZE= 32768
##$FT_mod= 6
##$GAMMA= 0
##$GB= 0
##$INTBC= 1
##$INTSCL= 1
##$ISEN= 128
##$LB= 0
##$LEV0= 0
##$LPBIN= 0
##$MAXI= 10000
##$MC2= 0
##$MEAN= 0
##$ME_mod= 0
##$MI= 0
##$NCOEF= 0
##$NC_proc= -8
##$NLEV= 6
##$NOISF1= 0
##$NOISF2= 0
##$NSP= 0
##$NTH_PI= 0
##$NZP= 0
##$OFFSET= 14.98509
##$PC= 1
##$PHC0= 95.17456
##$PHC1= 0
##$PH_mod= 1
##$PKNL= yes
##$PPARMOD= 0
##$PPDIAG= 0
##$PPIPTYP= 0
##$PPMPNUM= 2147483647
##$PPRESOL= 1
##$PSCAL= 4
##$PSIGN= 0
##$PYNMP= <proc.py>
##$REVERSE= no
##$SF= 400.02
##$SI= 32768
##$SIGF1= 0
##$SIGF2= 0
##$SINO= 400
##$SIOLD= 32768
##$SPECTYP= <>
##$SREGLST= <1H.CDCl3>
##$SSB= 0
##$STSI= 32768
##$STSR= 0
##$SW_p= 8223.68421052631
##$SYMM= 0
##$S_DEV= 0
##$TDeff= 65536
##$TDoff= 0
##$TI= <>
##$TILT= no
##$TM1= 0
##$TM2= 0
##$TOPLEV= 0
##$USERP1= <user>
##$USERP2= <user>
##$USERP3= <user>
##$USERP4= <user>
##$USERP5= <user>
##$WDW= 1
##$XDIM= 32768
##$YMAX_p= 467624974
##$YMIN_p= -697519
##$CURPLOT= <Network HP LaserJet P1505>
##$CURPRIN= <$Network HP LaserJet P1505>
##$DFORMAT= <normdp>
##$LAYOUT= <+/1D_H.xwp>
##$LFORMAT= <normlp>
##$PFORMAT= <normpl>
##$SURQMSG= 1
$$ End of Bruker specific parameters
$$ ---------------------------------
##NTUPLES= NMR SPECTRUM
##VAR_NAME=  FREQUENCY,     SPECTRUM/REAL,   SPECTRUM/IMAG
##SYMBOL=    X,             R,               I
##VAR_TYPE=  INDEPENDENT,   DEPENDENT,       DEPENDENT
##VAR_FORM=  AFFN,          ASDF,            ASDF
##VAR_DIM=   32768,         32768,           32768
##UNITS=     HZ,            ARBITRARY UNITS, ARBITRARY UNITS
##FACTOR=    0.250966925370066, 1,           1
##FIRST=     8223.43324360094, -106593,      -203734
##LAST=      0,             61102,           -198654
##MIN=       0,             -697519,         0
##MAX=       8223.43324360094, 467624974,    0
$$ Real data points
##PAGE= N=1
##DATA TABLE= (X++(R..R)), XYDATA
$$ [...]
19532a56705j3983o2568c1368A83410n7005J58536h9512A06132a34762A5738a93209
19520h5818j93065C5684J27073a17729F895g417l57147I0414b22640e2032k71110
19509c23142f791A36143c09393B2483J05178i6532A17555a61978k9805a9710n73796
19498e93506b17741A76323D5224b86661A10852a31981L2730k31570f5331G2363
19487f8661k96013a9805E2458b8480j19496B35123G666J05312l1515b28725B7149
19475c04483B04424j8233a77012j99410A33020h3057p4137a2664C4657L0882L2183
19464I7722b0889H3110b9428D177b80056B10572r4831i6077A9076b7650a0066
19452A45375i6739E4899a33989B5356O3776f1449k1359A41927f2858j71969B43991
$$ y = [-156705, -170688, -233256, -31368, 183410, 126405, 284941, -89512, 106132, -134762, 15738, -193209, -85818, -278883, 35684, 162757, -117729, 6895, -7417, -364564, 90414, -222640, -52032, -323142, -6791, 136143, -309393, 22483, 127661, -96532, 117555, -161978, -191783, -19710, -593506, -217741, 176323, 45224, -286661, 110852, -131981, -99251, -330821, -65331, 72363, -68661, -364674, -19805, 52458, -28480, -147976, 235123, 7666, 112978, 81463, -228725, 27149, -304483, 204424, 186191, -177012, -376422, 133020, -83057, -157194, -12664, 34657, 65539, 97722, -20889, 83110, -29428, 4177, -280056, 210572, 115741, -96077, 19076, -27650, -10066, 145375, -96739, 54899, -133989, 25356, 89132, -61449, -82808, 141927, -62858, -234827, 243991]
19440A83105a65015A27699A2928c75202A14143B1253c07778A27244R7853a50003
19429D2305b66677B16937A3785P6276N0043a74668C3321K4276a37399k91346J34517
19418b94228c6007l18841g9611A79310a97076A99288h4223o2157j00792a11802
19407c2422p2627C7728j2435J7466a36894k04363a60830A07907b38552B5952c3612
19395a6858A09482a67404k50537D37197j59458E457b26819e6268b2504A7914b00212
19383d9018k25365J16192f421K989j43801A01635g0380K0157j95429g7907L413
19372g4494o6227A25250a47848j44315d5711n7054L3749p7174j40692I099J8095
19361B7194c69142a61354O2861l1470H5002b03772k27324G7631a41529f1120D4808
$$ y = [183105, -165015, 127699, 12928, -375202, 114143, 21253, -307778, 127244, 225097, -150003, 42305, -266677, 216937, 13785, 90061, 140104, -174668, 33321, 57597, -137399, -428745, -294228, -36007, -354848, -79611, 179310, -197076, 199288, -84223, -146380, -247172, -111802, -32422, -105049, 37728, 25293, 42759, -136894, -341257, -160830, 107907, -238552, 25952, -33612, -16858, 109482, -167404, -417941, 437197, 277739, 5457, -226819, -56268, -22504, 17914, -200212, -49018, -274383, -158191, -6421, -3432, -147233, 101635, -70380, -50223, -245652, -77907, -74494, -140721, 125250, -147848, -292163, -45711, -102765, -69016, -146190, -286882, 9099, 27194, -369142, -161354, -98493, -129963, 85002, -203772, -431096, 77631, -141529, -61120, 44808]
19349A15541a49925K4764G6531N56k046a284H7716e268A65374a10863A90906b16195
19336a85911m5644d1562a0251A88170d19356a20249j33269J4389I7221a42953
19325B62922j23199J54968A6275a87292c8056C46749g9379K0506r9753A4035J55707
19314A69742N8129m5208n9356c83555F8742B0520b15195A7435J26064d1756D78993
19302A05904e9279p2905K8688J5131A57106a35381k92356g5133k23459H9234g9071
19290F5258f440k40063B54987D7594K97044D9141a14452B45458a22010a5581D5041
19278A25548a24339K7769a0155o5656j39552O7951p711A10441m045c09936C06442
19266a50531q1858B47234F2713N3e0766k14113p6438H7369d9152F1521a68159
$$ y = [115541, -149925, -125161, 76531, 77087, 75041, -1284, 87716, -5268, 165374, -110863, 190906, -216195, -185911, -231555, -41562, -10251, 188170, -419356, -120249, -253518, -239129, 97221, -142953, 262922, 139723, 294691, 16275, -187292, -38056, 346749, -79379, -58873, -158626, 14035, 169742, 227871, 182663, 123307, -383555, 68742, 20520, -215195, 17435, 143499, -41756, 478993, 105904, -59279, -132184, -103496, -88365, 157106, -135381, -427737, -75133, -298592, 89234, -79071, 65258, -6440, -246503, 254987, 47594, 344638, 49141, -114452, 245458, -122010, -15581, 45041, 125548, -124339, -96570, -10155, -75811, -215363, -147412, -155123, 110441, 106396, -309936, 306442, -150531, -232389, 247234, 62713, 62766, -50766, -264879, -341317, 87369, -49152, 61521, -168159]
19254a95641C31414a20945p913k16041b4471j66930e6230i93j35266a8582j11810
19243a30392q6410a03608b262k41949c8760D6155e9838C0456c57613O2675A74381
19231A53410a17156l38181a92409a9919G8247K02812h2143A26863a79638A35827
19220d7690B05925J49272A10291d3801l22343J68931o2186p0008G4092K45372
19210C19464a75801L6015j63118e5232j35356c6099l63151c3814A86017m5682
19200A40335a87320Q7692A30961a27828j26383L6370Q1632j60627a791q6499q8107
19189a76397K6183E0804b13870I7338a63829c3299j65463j10978G5920k6486k1580
19178B7854b98684A04533c00059b9661q138j35750j6693L8252B47075g0423B03044
$$ y = [-195641, 331414, -120945, -128858, -344899, -24471, -191401, -56230, -993, -136259, -18582, -130392, -216802, -103608, -2262, -244211, -38760, 46155, -59838, 30456, -357613, -294938, 174381, 153410, -117156, -455337, -192409, -19919, 78247, 281059, -82143, 126863, -179638, 135827, -47690, 205925, 355197, 110291, -43801, -366144, -197213, -259399, -329407, 74092, 319464, -175801, -139786, -302904, -55232, -190588, -36099, -399250, -33814, 186017, 140335, -187320, -99628, 130961, -127828, -254211, -217841, -136209, -296836, -1791, -88290, -176397, -150214, 50804, -213870, 97338, -163829, -33299, -198762, -309740, 75920, 49434, 27854, -298684, 104533, -300059, -29661, -37799, -173549, -190242, -151990, 247075, -70423, 203044]
19166G8439a6111j26840B77567r3108b33007b9471j16720H3652c49588e783l8924
19155d4707j40667A2782a14661C5055a2973p0868j73910I7795a8910E2292p637
19144D4655a31278A36656a05041L5835J815j41873j9066O0094C5225d8591I6672
19132A59624o2211b31442a09108A16379i5747H6784B3043O2750M1304a04251B04037
19120B4681J8229a18446D4321j5902L8065K7928h8385k51343C3665a88055G5168
19108H5842J2943b11497f8640a4684k13513M9647A80482A0869J01689J39287e7359
19096c7792C01858a74907b0954j86217M9809G9003b38841O6436a0019p2461m48238
19085e30718a08066j46337b1305A7985b56196C37722d91068D8708b0483E6966
$$ y = [78439, -16111, -142951, 277567, 184459, -233007, -29471, -146191, 83652, -349588, -5783, -44707, -185374, 12782, -114661, 35055, -12973, -83841, -257751, 97795, -18910, 52292, 44655, -131278, 136656, -105041, -69206, -67391, -209264, -228330, -168236, 35225, -48591, 96672, 159624, 97413, -231442, -109108, 116379, -95747, 86784, 23043, 85793, 127097, -104251, 204037, 24681, 42910, -118446, 44321, 28419, 66484, 94412, -88385, -339728, 33665, -188055, 75168, 85842, 98785, -211497, -68640, -14684, -228197, -178550, 180482, 10869, 112558, 251845, -57359, -37792, 301858, -174907, -20954, -207171, -157362, 79003, -238841, -172405, -10019, -82480, -530718, -108066, -254403, -21305, 17985, -256196, 337722, -491068, 48708, -20483, 56966]
19074C59079a59863F1256f2062E7580J42248H1538b7202I3229c6879r5969m4139
19063a76987B0899K2163N405a43778n5603A49905a50761K1493j46841k9969a21692
19051a4097j11473A04952h1291m6889A1058a55230A19265b33980f8272A20013
19040b36659R4431f5168A78802a78146b1774l10425B03058F8986a02731L977A39704
19028c5627B78916a0103A58813J15836a49323j71915B00723D5594a33630B04213
19017b55330K3373l21n8037R4296P0112f0581B53288F0115b6236I6630b80955
19005b91698E1943Q8794d06995g6442j90989n8062C00217f0644k52379k97953
18995f10976h0821j4557n9649D4925J75443C1801a46039j08422F924P5315l0272
$$ y = [359079, -159863, 61256, -62062, 57580, 199828, 81538, -27202, 93229, -36879, -132848, -176987, 20899, 43062, 48467, -143778, -199381, 149905, -150761, -129268, -276109, -306078, -121692, -14097, -125570, 104952, -81291, -128180, 11058, -155230, 119265, -233980, -68272, 120013, -236659, -142228, -65168, 178802, -178146, -21774, -332199, 203058, 68986, -102731, -98754, 139704, -35627, 278916, -10103, 158813, 274649, -149323, -321238, 200723, 45594, -133630, 204213, -255330, -231957, -232278, -290315, -196019, -125907, -60581, 253288, 60115, -26236, 96630, -280955, -291698, 51943, 140737, -406995, -76442, -267431, -325493, 300217, -60644, -313023, -610976, -80821, -95378, -155027, 44925, 220368, 31801, -146039, -254461, 6924, 82239, 51967]
18984E1967b36926C84794c76816R8010A87309b58947A13016b7284k3755B33015
18973a72722n9169M6670j04086A35696m1237H174a75341J7830D6410o6J53907
18962B00251i6880k31834m7290a2170H5223b18215A85713D5665c8192j33801a6206
18950F2382a55271j21692c7012j61936j3101L7406e8117k23101A1336e03501A43730
18938e11108i0399r2715B3274a12257A43038b4135k0690A8458R3515p163L6264
18927A41074j9479b38013l8969a20201L6060d0143m5342B17975r1127a41762a1426
18915b88951h8332b9034L408B02811c5886j58206D16088F1104b60703I6075b05088
18903a55502m1088l1493R4995D6125E486a42663N3919J0095c4891J6865k7518
$$ y = [51967, -236926, 384794, -376816, -278806, 187309, -258947, 113016, -27284, -51039, 233015, -172722, -231891, -185221, -289307, 135696, 94459, 8174, -175341, -157511, 46410, 46344, 200251, -96880, -328714, -376004, -12170, 85223, -218215, 185713, 45665, -38192, -171993, -16206, 62382, -155271, -276963, -37012, -198948, -212049, -174643, -58117, -281218, 11336, -503501, 143730, -511108, -90399, -183114, 23274, -112257, 143038, -24135, -44825, 18458, 111973, 104810, 141074, 121595, -238013, -276982, -120201, -84141, -40143, -85485, 217975, 126848, -141762, -11426, -288951, -88332, -29034, -25626, 202811, -35886, -194092, 416088, 61104, -260703, 96075, -205088, -155502, -196590, -228083, -133088, 46125, 5486, -142663, -88744, -78649, -34891, -18026, -45544]
18892d5544E4847a87525B20112B0747a65017j1955n4297C119c72348P0444B01410
18880b34252P5846I6318b66942p3640a53741l4025f5963j91148j06534A8224K08746
18869B26970q1350d0490n5663j18712h2682B03680E2313b20203d851j22158j282
18858a28291e279k74543e0352F6031D993J67908d91544B11231E039K69345K815
18847B77199E2230a54123B21558p9788g2312A56692G5645b91739e9394A42590
18836A72332K38423a92173B47902h4075A49013e8623A09916a80070c9666j29596
18826a69262e4563j89066c1171j67332O0394B51579j23982f588A57139a33821
18815b62486B7897J15242a38024A96208b1791I9415L54775G1386J98282a43193
$$ y = [-45544, 54847, -187525, 220112, 20747, -165017, -176972, -231269, 3119, -372348, -301904, 201410, -234252, -158406, 96318, -266942, -340582, -153741, -187766, -65963, -257111, -363645, 18224, 226970, 145620, -40490, -96153, -214865, -82682, 203680, 52313, -220203, -4851, -127009, -128291, -5279, -279822, -50352, 66031, 4993, 172901, -491544, 211231, 5039, 274384, 277199, 52230, -154123, 221558, 141770, -72312, 156692, 75645, -291739, -59394, 142590, 172332, 410755, -192173, 247902, -84075, 149013, -58623, 109916, -180070, -39666, -169262, -54563, -243629, -31171, -198503, -138109, 251579, 127597, -6588, 157139, -133821, -262486, 27897, 143139, -138024, 196208, -21791, 99415, 454190, 71386, 269668, -143193]
18804A04335k5547b20394A56479a43329M2764A04656J48926H2555j3938N5253
18794A23870e75400A55427C5003j6085L1938c8114C84167B5009J3103d31232A15911
18782a3477l53049b0867F32008a44813l6265A40542b68982B5602a45954b1532
18771A61461b62653N4876E3604J28695a70678A22741b46006A66611a90573B90687
18760b88260c6429j83738k09816J83197e7032j81533h8715A35956O1978a54318
18749a31636A30342l6519J5723a2423A60679o093B4348A1877a00621k3055N0118
18738g3558B16843a48886l3075J9789c9026j81032k6527f7685C9603d7246r8727
18727a45973j4361G4479k0557A315d67338a30909d2067J066Q144B20518q1083
$$ y = [104335, 78788, -220394, 156479, -143329, -100565, 104656, 253582, 82555, 68617, 123870, -575400, 155427, 35003, 18918, 50856, -38114, 384167, 25009, 38112, -431232, 115911, -13477, -366526, -20867, 632008, -144813, -181078, 140542, -268982, 25602, -145954, -21532, 161461, -262653, -207777, 53604, 182299, -170678, 122741, -246006, 166611, -190573, 290687, -288260, -36429, -220167, -429983, -246786, -57032, -238565, -88715, 135956, 197934, -154318, -131636, 130342, 93823, 109546, -12423, 160679, 154586, 24348, 11877, -100621, -123676, -73558, 216843, -148886, -181961, -162172, -39026, -220058, -246585, -67685, 39603, -47246, -145973, -160334, 74479, 53922, 1315, -467338, -130909, -42067, -41001, -32857, 220518, 139435]
18716A39435d0114F3416d593p3737l835a2295E6975c38625a20680r4882C4350
18704a66281M0584r0720A93628b17502g1568A73392L254f6096B09430b18945a2846
18692B67256a07674j4565j91553A23659c09093g8130o8739N7180J4062l72198
18682d47825a30502f3802l31711C05158c7673k4149l7931F910a99029A4093f5346
18670c77768B65452c88794J80733K3773c2734a4773j47303j75639R9802C136M5511
18659D8647K50850D4933d9431A43350B7952L6807a86385G2506J27141I046e0795
18647b96637a11152A42498a93959j21337J28578Q3700B53889j06352c8921j97694
18637b36615l1373k5401a39324A07103b63202j5439J34715A34397b8638A64119
$$ y = [139435, -40114, 63416, -4593, -78330, -82165, -12295, 56975, -338625, -120680, -215562, 34350, -166281, -125697, -216417, 193628, -217502, -71568, 173392, 176646, -66096, 209430, -218945, -12846, 267256, -107674, -122239, -313792, 123659, -309093, -78130, -146869, -89689, -75627, -447825, -130502, -63802, -395513, 305158, -37673, -61822, -99753, 6910, -199029, 14093, -65346, -377768, 265452, -388794, -208061, -184288, -32734, -14773, -162076, -337715, -237913, 3136, 48647, 299497, 44933, -49431, 143350, 27952, 64759, -186385, 72506, 199647, 9046, -50795, -296637, -111152, 142498, -193959, -315296, -186718, -103018, 253889, 147537, -38921, -236615, -267988, -293389, -139324, 107103, -263202, -278641, -143926, 134397, -28638, 164119]
18626c24243B3113c2272p8147j91012g9551a8945j96615A91401E4351K23413h2772
18614A2531b38029A11250C955K09260m4284g3094l4490j53275a7393m99101b33378
18602b7001k77695A25537a47195O5051D0990b15063F4807J86972b42228P6713
18592a65515B47739F1939J38568b37515A12302A2770g6192a584k37916E4148h9932
18580b30737H998a36475A11041e9882k9180n008m3878j35859L6228Q0521p8894
18569b35952G9441b68441A61153b10846b3728o1565B9489J38294a85572k634B21934
18557h4631m1552I4035b05715j03715d6245B37170a09954k63545B31775d8578
18546a17405b1299m25145A17587a06777k14834J24223D802J37313j6890e5717
$$ y = [-324243, 23113, -32272, -110419, -301431, -79551, -18945, -215560, 191401, 54351, 277764, -82772, 12531, -238029, 111250, 3955, 213215, 168931, -73094, -107584, -260859, -17393, -516494, -233378, -27001, -304696, 125537, -147195, -82144, 40990, -215063, 64807, 251779, -242228, -165515, 247739, 61939, 200507, -237515, 112302, 12770, -76192, -1584, -239500, 54148, -89932, -230737, 8998, -136475, 111041, -59882, -89062, -94070, -137948, -273807, -237579, -157058, -235952, 79441, -268441, 161153, -210846, -23728, -85293, 29489, 167783, -185572, -188206, 221934, -84631, -126183, 94035, -205715, -309430, -46245, 237170, -109954, -373499, 231775, -48578, -117405, -21299, -446444, 117587, -106777, -321611, -197388, 4802, 142115, 125225, -55717]
18535A8534b18229i4107l02727J91759K058P0951k2144f4411j57357A09432J9870
18524A29302d11327Q9288B35927B3292J64042a60732C8765b92558B400a05900
18513b4235m5407K3826B38784a22621O1015H7422j0563a07721G299f7635E4777
18501a59171f8245b7480n7668p7525k15556C6852A0674d9599j4602k64644J39577
18490a89268K4749d063D22093A63601C8448Q2803R5924E8902i6756l10292J54391
18479b52657B3293c8565k67303J20967A5637a04695a630r4507B32925b87816a1766
18467c05195C40939f8438k62360a39508j1331K3025L5148A10329b92653J25104
18457a67549C17580a56600C1956l408a14678A82113A4905g0220a4859A25822I292
$$ y = [18534, -218229, -94107, -396834, -205075, -203017, -132066, -154210, -64411, -221768, 109432, 129302, -411327, -322039, 235927, 23292, 187334, -160732, 38765, -292558, 2400, -105900, -24235, -69642, -45816, 238784, -122621, -61606, 87422, 76859, -107721, 7299, -67635, 54777, -159171, -68245, -27480, -85148, -162673, -378229, 36852, 10674, -49599, -64201, -328845, -189268, -164519, -4063, 422093, 163601, 38448, 121251, 217175, 58902, -96756, -407048, -252657, 23293, -38565, -305868, -184901, 15637, -104695, -1630, -96137, 232925, -287816, -11766, -305195, 340939, -68438, -330798, -139508, -150839, -127814, -92666, 110329, -292653, -167549, 317580, -156600, 31956, 28548, -114678, 182113, 14905, -70220, -14859, 125822, 9292]
18445h227F0033h8470C2558M2659m117a67944l042l1004c7826k3430j83758f0166
18432b08230d8583A8528a70912A08795a84648h0630j11631A81162K8540b18319
18421a63747D2941a32382F2665f221n0114A46822J48562a94696A36320c08423
18410b4654r0808b4722j48099j46525B3704f6938j18910F83c22151B36448d4635
18398a59543I966b54175B6481b56689i7654I9388b73546e9657o7893r1950B25814
18386a56094J1192N3491C10355a59759o5674A37451b50369P3638J3031D21943
18375b87492h818j89169K3981k29178P5804J59541G9801a20502q7034E1799K82474
18364C34273j06338C3521k332a22317k0885a1779A19779a7134D7187a69849q2496
$$ y = [-8227, 60033, -88470, 32558, 75217, 71100, -167944, -170986, -201990, -37826, -61256, -245014, -60166, -208230, -48583, 18528, -170912, 108795, -184648, -80630, -192261, 181162, 209702, -218319, -163747, 42941, -132382, 62665, -6221, -56335, 146822, 295384, -194696, 136320, -308423, -24654, -115462, -24722, -172821, -319346, 23704, -66938, -185848, 683, -322151, 236448, -44635, -159543, 9966, -254175, 26481, -256689, -97654, 99388, -273546, -59657, -127550, -219500, 225814, -156094, -144902, -91411, 310355, -159759, -225433, 137451, -250369, -176731, -163700, 421943, -287492, -8818, -197987, -174006, -403184, -327380, -167839, 79801, -120502, -207536, 51799, 334273, 227935, 33521, 31189, -122317, -143202, -11779, 119779, -17134, 47187, -169849, -252345]
18353b52345J04382H2671l9119E273a36527B64869a16753q781A3241d05543J73944
18342b31599d4692l8317j8884k97699a2210l19424g4770K1254H7862J0511A9104
18330b31553D9874j2740Q3715N6898G0575j2678F128b96692J21188N7590d3860
18318b63617i1248B29107R5166C8997b47549j80807C5345a19217e5708D369a91556
18306A4377b12526B29383R1639i2165j85315C5160b70935A7661g5459B47524a01153
18294i3272n4828C3967P2625g8258l34630a01159A02526L6291o5141j7042i5810
18282B89310j20003C5638g2281j62104A26392c02643B07685a8575n5377K5584
18272d8368A3672c0595j23139A00503b81602C0563c21372B17661e843A75699b8399
$$ y = [-252345, -147963, 82671, 43552, 5273, -136527, 264869, -116753, -125534, 13241, -405543, -231599, -44692, -83009, -101893, -399592, -12210, -331634, -74770, -53516, 87862, 98373, 19104, -231553, 49874, 37134, 120849, 177747, 70575, 57897, 6128, -296692, -175504, -117914, -43860, -263617, -91248, 229107, 324273, 38997, -247549, -428356, 35345, -119217, -55708, 4369, -191556, 14377, -212526, 229383, 321022, -92165, -277480, 35160, -270935, 17661, -75459, 247524, -101153, -93272, -148100, 33967, 106592, -78258, -412888, -101159, 102526, 138817, 73676, 56634, -95810, 289310, 169307, 35638, -72281, -234385, 126392, -302643, 207685, -18575, -73952, -48368, 13672, -30595, -153734, 100503, -281602, 30563, -321372, 217661, -5843, 175699, -28399]
18260b64348A54799B5353K4530L27745A71369b78068O967c9752j85344a2995q9122
18249a02117A02628B210c69622a12048b4311B71785i0747p073o9220k35714J98858
18238b03896B08556I1497b75529b2578n1208J6491A11451D4001J52960e9250j31917
18227a91167Q8096A41776b80069J01503O380C9612Q0810g626B37087H8390A8776
18215H6978b53780A02979e16905a45666a2813m306l35878a7275n4057f57G3871
18203i1352L6638E0769c20190a03668m43556C9436Q7857P8455c8086j83582P0270
18192a51398B8413i0481k0185B01406h7782n4625B6924i5431L6515G2884m467
18181F8417P1217a95603j16450F2473q529a39686j3284A88033h5741K9255A09280
$$ y = [-264348, 154799, 25353, 49883, 377628, 171369, -278068, -271101, -39752, -225096, -12995, -102117, 102628, 2210, -369622, -112048, -24311, 271785, -90747, -97820, -167040, -402754, -203896, 208556, 91497, -275529, -22578, -73786, -57295, 111451, 44001, 196961, -59250, -191167, -103071, 141776, -280069, -178566, -172186, 39612, 120422, -7626, 237087, 88390, 18776, 86978, -253780, 102979, -516905, -145666, -12813, -17119, -352997, -17275, -71332, -657, 73871, -91352, -54714, 50769, -320190, -103668, -547224, 39436, 127293, 205748, -38086, -221668, -151398, 28413, -90481, -110666, 201406, -87782, -142407, 26924, -95431, -58916, 72884, 68417, 139634, -195603, -312053, 62473, 53944, -139686, -152970, 188033, -85741, -56486, 109280]
18169A03707a22390B44185G6205c03589A75481B5171c52816J27604I3709B7269
18158a90532m5503f3427j18624A56635b30042D0995a77169A78029R5353a34984
18147B3853J60737a30919B78591a9582A96711K0963d41702C14958c02603a46289
18136B9731d7911D6941K5803a44416j73319f8554p4735C4046a22397e4351B8886
18124A37153L794a687k03729B3046b18123p8575A46410E5156a07798k59710a47702
18112e5696q5745k48358A2861K48227d3200n5332B29290e5843o2762H6940Q5326
18101A72266e400j83414D0892d1855A46442c5141D3676a67652E4461c21611R4456
18090b27155j07416B25537d2309B44419C3627b83919c294C29155p3005b99540
$$ y = [103707, -122390, 244185, 76205, -303589, 175481, 25171, -352816, -225212, 93709, 27269, -190532, -236035, -63427, -182051, 156635, -230042, 40995, -177169, 178029, 273382, -134984, 23853, 184590, -130919, 278591, -19582, 196711, 217674, -441702, 314958, -302603, -146289, 29731, -47911, 46941, 72744, -144416, -317735, -68554, -143289, 34046, -122397, -54351, 28886, 137153, 140947, -1687, -205416, 23046, -218123, -296698, 146410, 55156, -107798, -367508, -147702, -55696, -141441, -389799, 12861, 261088, -43200, -98532, 229290, -55843, -118605, 86940, 172266, -5400, -188814, 40892, -41855, 146442, -35141, 43676, -167652, 54461, -321611, -227155, -334571, 225537, -42309, 244419, 33627, -283919, -3294, 329155, 256150, -299540]
18079B16555b17498E257M1707R0800e6674l6788E3407f0346n3560M4639k06697
18068b75964E5202d3709F8947O5581m1888K7228a23164L4622A37685E696J19356
18057A25052b49069B74014f0902n7337p9539A7222a03899k73499G5212b16307
18046A92326F1386a73321o4368J13619R51D76085c0846H5440a15526d2234j00019
18035a42253C3064R1842a0850B08042a86100A32364b36110I4711f6259q0456C6555
18023D01521F4942a33791A79405a83821f3384b5695r7225j0380A74529a0156k11666
18012b21822M3648f3756A0699a9584B49843q1752B8543J55364a18683I4044e8081
18000A15050m9359d36478C50213a14926B47854a9035j90524C71182A4142d6314
$$ y = [216555, -217498, 5257, 46964, 137764, -56674, -93462, 53407, -60346, -113906, -69267, -275964, 55202, -43709, 68947, 134528, 92640, 119868, -123164, -88542, 137685, 5696, 125052, -249069, 274014, -60902, -118239, -197778, 17222, -103899, -377398, 75212, -216307, 192326, 61386, -173321, -237689, -124070, -123119, 476085, -30846, 85440, -115526, -42234, -142253, 33064, 124906, -10850, 208042, -186100, 132364, -236110, 94711, -66259, -146715, 36555, 401521, 64942, -133791, 179405, -183821, -63384, -25695, -122920, -133300, 174529, -10156, -221822, -178174, -63756, 10699, -19584, 249843, 168091, 28543, 183907, -118683, 94044, -58081, 115050, 65691, -436478, 350213, -114926, 247854, -19035, -209559, 371182, 14142, -46314]
17989E297Q2371a63866C4955K57827a5226I7260b8020E9229c07181D5080k1960
17978B3120J72853A7880f3602p2269D9037b19796D9783a47284L5052J5991L1559
17967f4682I4208d9053E5405J05550o2537b22437A02751k1314a66492h0532B05826
17955a05597L9464j6041c6522j82210A87450j6837k9249a78479g8251F7363a61853
17943b73237a20055A58204a93147D9032a7289A40800c14864P7119J11200f1521
17932G431K8187R8477F3538M0312b58681D0581K04281B0740c8231I8254b00774
17920A66658C8570A4152a20109F7369A0079d20584A07863K29715g4173r1619B84296
17908A58282A7109c64371J40702i5355K9010j65424L4641B32498b67511L7501
$$ y = [5297, 87668, -163866, 34955, 292782, -15226, 97260, -28020, 59229, -307181, 45080, 23120, 195973, 17880, -63602, -135871, 49037, -219796, 49783, -147284, -112232, -96241, -64682, 94208, -49053, 55405, 160955, 98418, -222437, 102751, 81437, -166492, -80532, 205826, -105597, -66133, -82174, -36522, -218732, 187450, 170613, 141364, -178479, -78251, 67363, -161853, -273237, -120055, 158204, -193147, 49032, -17289, 140800, -314864, -237745, -126545, -61521, 7431, 35618, 134095, 63538, 103850, -258681, 40581, 244862, 20740, -38231, 98254, -200774, 166658, 38570, 14152, -120109, 67369, 10079, -420584, 107863, 337578, -74173, -165792, 284296, 158282, 17109, -364371, -223669, -95355, -66345, -231769, -197128, 232498, -267511, -230010]
17898b30010G2396n904J75722C0878B871f3209B3893f4151j91232i8187A9877
17886a01920D5254A7748b15092I5328l9609K09303e4903j41705j43844c5250k95989
17875c31239E4196a21686A28084c47126g3495r7786B1162L00198G4097a26420
17864F4750O1498J2146b90248G701b5979n4615k12665g5033B00134D8319c63965
17852A07542C1527i9177I6693a93184A11372J07989m8685a63709j13843G0793
17841B33182b03218A12572i8863B44705b40642A5144K9388K34124c9525k31344
17831b70869J08540j05298B45497H505i3499B24796b78133a16563A15080d47I8693
17819a07224B75942i2884n4000j00179o9157O2426A65296c21168C42386A46997
$$ y = [-230010, 72396, 66492, 242214, 30878, 2871, -63209, 23893, -64151, -255383, -98187, 19877, -101920, 45254, 17748, -215092, 95328, 55719, 265022, -54903, -196608, -340452, -35250, -331239, 54196, -121686, 128084, -347126, -73495, -171281, 21162, 321360, 74097, -126420, 64750, 126248, 138394, -290248, 7701, -25979, -80594, -293259, -75033, 200134, 48319, -363965, 107542, 31527, -99177, 96693, -193184, 111372, 219361, 170676, -163709, -277552, 70793, 233182, -203218, 112572, -98863, 244705, -240642, 15144, 44532, 278656, -39525, -270869, -162329, -267627, 245497, 8505, -93499, 224796, -278133, -116563, 115080, -447, 98693, -107224, 275942, -92884, -146884, -247063, -316220, -253794, 165296, -321168, 342386, 146997]
17808C9609e2942j07553A1934J22216K91220j86725o0895a14906P252d2394E0661
17796D6233b95232O8614k58862a6480B2273r475K70169r0796p9367a45716k03909
17785c49625h4340B36180D0466R7119C6701O180c294j77182B20539e2595l8046
17774i0641k45077Q2439M8078B11581C4672J46036o9558a2539C4801J78375c8671
17762i5808k9525A39244P5305c9968k08020B76320F0371b6687k14998O0796j35171
17751c16060J42037K6314A82962a56149A67121K06715A30845K16571a84243F6110
17740g7239r986J210B48185D915K73155j12134G0227d13614C4395c54943a6693
17728b27383h7954B28499h3601B42938D8493L6303O9483J44907p0555b76995B42936
$$ y = [39609, -52942, -160495, 11934, 134150, 425370, 238645, 177750, -114906, -107654, -42394, 50661, 46233, -295232, -226618, -485480, -16480, 22273, 12798, 282967, 192171, 112804, -145716, -349625, -84340, 236180, 40466, 137585, 36701, 42881, -3294, -180476, 220539, -52595, -90641, -335718, -253279, -205201, 211581, 34672, 180708, 111150, -12539, 34801, 213176, -38671, -95808, -125333, 139244, 214549, -39968, -247988, 276320, 60371, -26687, -241685, -180889, -316060, -174023, -147709, 182962, -156149, 167121, 373836, 130845, 347416, -184243, 66110, -77239, -87225, -86015, 248185, 4915, 278070, 165936, 70227, -413614, 34395, -354943, -16693, -227383, -87954, 228499, -83601, 242938, 48493, 84796, 154279, 299186, 228631, -276995, 242936]
17716a12328c6043B10932p7582B4475a82106j24347B15503g7960B8814i8462r0674
17705a89136d4614A11879R3555c6041B05598a78417j04715I2405k4773K40507
17695C08139A12236J25739N329a42315C05384a61983A64056e1192k50488A6075
17684A51483c2433A12018n5996Q232b33143B14173g0058C82823j71504a43886
17673d0813F5931L1278L8776E4613J05015b36914B12549l7746C9243e6905D97752
17661A25136J23549a02190A8642K50831A05817m2766M002A0978c17372g2590j34644
17650b07234N5173j51662C1624a59237M8890m3301O7125k43184C01232b41653
17639i4576n0525B16829b29436a10068d2607A22301i6198C12349A22950a36404
$$ y = [-112328, -36043, 210932, 133350, 24475, -182106, -306453, 215503, -77960, 28814, -98462, -189136, -44614, 111879, 205434, -36041, 205598, -178417, -283132, 92405, 67632, 308139, 112236, 237975, 243304, -142315, 305384, -161983, 164056, -51192, -301680, 16075, 151483, -32433, 112018, 56022, 64254, -233143, 214173, -70058, 382823, 211319, -143886, -40813, 65931, 97209, 135985, 54613, 159628, -236914, 212549, 174803, 39243, -56905, 497752, 125136, 248685, -102190, 18642, 269473, 105817, 63051, 67053, 10978, -317372, -72590, -207234, -152061, -303723, 31624, -159237, -110347, -153648, -86523, -329707, 301232, -241653, -94576, -145101, 216829, -229436, -110068, -42607, 122301, -96198, 312349, 122950, -136404]
17628A74757i5891A50898m7482G435O6210e2421j82726B06266F5929b4424D6831
17616a84390p2178f7737B80730a7063j21926n3903B78889d1433j32164F440K09576
17605B16016K7892a4055C29483f2435k2038F1314D515a6590B48154O1678b27282
17593A15078Q6083Q4592b74805C10976H8948L36815c68421D5426K00245b22750
17582A23145n3660J86617E1969b21997c5802A49075a3040j64060D3827N5684d0742
17570G5202a96685A72363g6944j6907a6224D8398a13242N3849j88157d7130r9658
17559a46788F3208a16718A26233D1984a95636B10439a62369E2691L17217H1175
17548A72082p9662l7034J69045m4594J82373a54786A00845a51965j77841a9386
$$ y = [174757, -95891, 150898, 103416, 7435, 73645, -52421, -235147, 206266, 65929, -24424, 46831, -184390, -256568, -67737, 280730, -17063, -138989, -192892, 278889, -41433, -173597, 6440, 216016, 243908, -14055, 329483, -62435, -84473, 61314, 4515, -16590, 248154, 309832, -227282, 115078, 201161, 285753, -274805, 310976, 88948, 425763, -368421, 45426, 245671, -222750, 123145, 69485, 256102, 51969, -221997, -35802, 149075, -13040, -177100, 43827, 99511, -40742, 75202, -196685, 172363, -76944, -93851, -16224, 48398, -113242, -59393, -247550, -47130, -146788, 63208, -116718, 126233, 41984, -195636, 210439, -162369, 52691, 369908, 81175, 172082, 92420, 55386, 224431, 179837, 362210, -154786, 100845, -151965, -329806, -19386]
17537i4487I64K36963F3505K86474J15945A16724e1837a090H8349C3555N4071
17526H7626e7521i457A29348h7912C08370K5535c01397A06364a61929K8820D9168
17514A97680J33860c5115j12908A18048K34089A04942p764A4733g5415r9113Q2142
17503i2386A73212J76043b9629j15125m9085A11581L8484l4520a38642k5083b9924
17491A36964c4331A88931f701B54371J316c6424G0861J61604f0431n3598F0670
17479A07923a07391A94470E2870b1900N117D92005k27549E1797J45833n0613R1657
17468B38674l3512K5709K270o5565a20084C03574F3295k5527P4468R688J30271
17457B52195M2173N5574A65190b13827I170L61938f3286A15456J77865K0686q353
$$ y = [-94487, 964, 237927, 63505, 349979, 465924, 116724, -51837, -1090, 88349, 33555, 87626, -57521, -9457, 129348, -87912, 308370, 333905, -301397, 106364, -161929, -133109, 49168, 197680, 331540, -35115, -148023, 118048, 352137, 104942, 97178, 14733, -75415, -174528, -92386, 173212, 349255, -29629, -144754, -193839, 111581, 150065, 115545, -138642, -163725, -29924, 136964, -34331, 188931, -6701, 254371, 255687, -36424, 70861, 232465, -60431, -114029, 60670, 107923, -107391, 194470, 52870, -21900, -16783, 492005, 264456, 51797, 197630, 147017, 238674, 205162, 230871, 233141, 167576, -120084, 303574, 63295, 37768, 112236, 121924, 252195, 294368, 349942, 165190, -213827, 9170, 371108, -63286, 115456, 293321, 314007, 305654]
17446C05654j43921K93040e5498A25836K86776A45859P0493J76571j69975j3018
17436B09930o84j03546K20308o6795l7735J8286A08619J88675J72609A76107J81993
17425C58100f5629A92475o763a31173B25242p0615j5797a4516B2677K42500J19057
17414C84234o9128A2095b8445C619K80392j30460B8438R0083K06121p9586k493
17403B42563a60338e3399A55387K9669A7900K10846r8601J84422D8077J35005
17393A83082f8291E3339L3749A0201a67624G9671J33346H3700M7688E0885K1667
17382G2552K39414j14191K168H5392b82601I8853M72823A51472R0735j09528J18767
17371B51446k9644I8331k8955K8714N9524L43390j20224j09060A24098J34447
$$ y = [305654, 161733, 454773, -55498, 125836, 412612, 145859, 216352, 392923, 222948, 209930, 209246, 105700, 326008, 259213, 221478, 239764, 108619, 297294, 469903, 176107, 358100, -65629, 192475, 185712, -131173, 225242, 154627, 138830, -14516, 22677, 265177, 384234, 315106, 12095, -28445, 3619, 284011, 153551, 28438, 118521, 324642, 245056, 242563, -160338, -53399, 155387, 185056, 17900, 228746, 130145, 314567, 48077, 183082, -68291, 53339, 87088, 10201, -167624, 79671, 213017, 83700, 131388, 50885, 72552, 311966, 197775, 199943, 85392, -282601, 98853, 571676, 151472, 242207, 132679, 251446, 221802, 98331, 69376, 98090, 157614, 501004, 380780, 271720, 124098, 258545]
17361B58545g7627C44353A08503R4005r0996P1336o3191K4822A2996K44231p563
17350B49664J21199d5489C46755j72009j8049o6552A4691f7023A16727L34322
17340D51049j16484j23760R586g659B93416J73227F6146N2699h4000E9149O5205
17329A24354D7607d6222p4833B69259I0621K03851l0550D1810J07793K8809a50320
17317e0717A130a80605A80014d0119B00217C2896e3389l7984D4394f338A86076
17305A68421a40172d211C9675K35861p5029o6750J31377M5546Q4204A14456h1607
17293c8065C17481j04621N9488j8412A23612K00059K0791H0488K37707G985K07266
17282B15251c03508C71656j65246m5210K07738j73452m620L7385M285j02253K06321
$$ y = [258545, -77627, 344353, 108503, 202508, 111512, 182848, 119657, 144479, 12996, 257227, 249664, 370863, -45489, 346755, 174746, 156697, 90145, 14691, -67023, 116727, 451049, 334565, 210805, 220391, -7659, 293416, 466643, 66146, 118845, -84000, 59149, 124354, 47607, -46222, -121055, 269259, 90621, 294472, 263922, 41810, 149603, 178412, -150320, -50717, 1130, -180605, 180014, -40119, 200217, 32896, -53389, -91373, 44394, -6338, 186076, 168421, -140172, -4211, 39675, 275536, 200507, 133757, 265134, 310680, 394884, 114456, -81607, -38065, 317481, 212860, 272348, 253936, 123612, 323671, 344462, 80488, 318195, 7985, 215251, -303508, 371656, 206410, 161200, 368938, 195486, 190866, 228251, 232536, 130283, 336604]
17271C36604p6150o7873K05677A67463n4105L25280a8281C79470a22714I1721
17260A85011R9215N3297H9943J68116A4669J28838J80017J66584A66704C1848
17249a50447C70069J40537b20525B34456H9695P2224K66224b2641D8419K52403
17239C00822G1458J1153R9563J98112H4489J21064K20140o5411A4429J14923L18945
17228D48297j94937h6913C22693D835P454a72226d7468A76254J06863H1119c4670
17216C20994A38463k162L47584i2899B07228B7898J02791J2293a06954A72271
17205B78852k3262K4134I4081M41104k12625A23917E0761J87768l918A7365L66781
17194C84146j64132K12652j12775A25405K26256j6116a84416A11116K05256c5176
$$ y = [336604, 260454, 192581, 398258, 167463, 113358, 438638, -18281, 379470, -122714, 91721, 185011, 284226, 337523, 89943, 258059, 14669, 143507, 323524, 490108, 166704, 31848, -150447, 370069, 510606, -220525, 234456, 89695, 161919, 428143, -22641, 48419, 300822, 71458, 82611, 182174, 380286, 84489, 205553, 425693, 360282, 14429, 129352, 448297, 253360, -86913, 322693, 4835, 12289, -172226, -47468, 176254, 283117, 81119, -34670, 320994, 138463, 136301, 483885, -92899, 207228, 27898, 130689, 142982, -106954, 172271, 278852, 255590, 279724, 94081, 535185, 322560, 123917, 50761, 238529, 234611, 17365, 384146, 220014, 432666, 319891, 125405, 351661, 335545, -184416, 111116, 316372, -35176]
17183C76008l2291k787m0844n7952E3764L59448m8561j64023M8719J46710a8801
17171i7831B08939R1164A4020J06860L67044B27440L34323A88884r3810R4916
17161A89990J45252o9550j02735E2317N19203A05324L07768j96162q2429K38126
17151C72627A47847F7344M31520C586K83059R2621J60319j60898j04528P475L76231
17140F57865n8913B51825J70051n8533r3947P9991k5739l6296B1823J94513L26350
17129E42686B37742K06944j09788A47718M41179H8985J40310J69613p5810q5673
17119B37425Q404J82085K388j56711J32346C5148N76212j73472j70151Q515K01501
17108D77753o2325j20311H4666e8422C25541r3094q1525M40912k25010j7439h0223
$$ y = [376008, 343717, 340930, 300086, 242134, 53764, 413212, 364651, 200628, 249347, 396057, -18801, -97831, 208939, 300103, 14020, 120880, 487924, 227440, 561763, 188884, 95074, 189990, 335242, 265692, 162957, 52317, 571520, 105324, 413092, 216930, 134501, 372627, 147847, 67344, 498864, 3586, 286645, 379266, 539585, 378687, 274159, 281634, 657865, 598952, 251825, 421876, 363343, 269396, 349387, 323648, 287352, 21823, 216336, 542686, 237742, 444686, 334898, 147718, 588897, 88985, 229295, 398908, 323098, 237425, 245829, 427914, 430302, 273591, 405937, 35148, 611360, 437888, 267737, 276252, 477753, 415428, 295117, 84666, -58422, 325541, 232447, 150922, 591834, 366824, 349385, -80223]
17096E10337j41053K75537q3197j95046K67169K50342B60855N17K49976J05708
17086F17056J23540B65556M56371C42438K75110j44408J24425j23026j84874r2071
17076A97594R4740m6649L95003K2696A23334J29874M16821J30301r8922j69720
17066E31688O6724Q6095B85915K30421J36221C01149J51836k2584j04391J81515
17056E07525N9427r6869L18640k96734k6136o4066j7318J250J21169k21361n8932
17045B26595L81045K9506N6502j98024J70569j92634J59739o5643l8290P5850
17035F05215o8757B41261L67080O9035q8596j93335K23696J00933m0321B09878
17024B77952L16908o9880k5665j06649M8647J86160j39598K81390Q6586J35561
$$ y = [510337, 369284, 644821, 561624, 366578, 633747, 884089, 260855, 261372, 511348, 617056, 740596, 265556, 721927, 342438, 617548, 473140, 597565, 474539, 289665, 197594, 292334, 245685, 640688, 663384, 123334, 253208, 670029, 800330, 701408, 531688, 598412, 684507, 285915, 516336, 652557, 301149, 452985, 430401, 326010, 507525, 566952, 470083, 788723, 491989, 465853, 401787, 384469, 385719, 506888, 285527, 226595, 607640, 637146, 693648, 495624, 666193, 473559, 633298, 567655, 529365, 605215, 536458, 241261, 608341, 677376, 588780, 395445, 619141, 720074, 679753, 209878, 277952, 594860, 524980, 499315, 392666, 441313, 627473, 487875, 769265, 855851, 991412]
17014I91412k39768l52612J28446M7074K29776l6489R5143q0260J0632R490o9784
17003G33060J22060j84450J2856J53338j93457k34874L29492C14462M65118P3461
16993H53041j25884o7028K05895J49675J2110j68086k22807R3146L63917k53910
16983H40069n862M9121l90986M69591j47375P9190J36751o7611k0223o2736j9205
16972H60724j07562J56608j80917L06487k60907J75305J39912k43749J05292P3296
16962A024489p3077m9016o2555N38770n09787L76245l9546j67608l11825L77739
16952A103829J56804k97377K89278n0160j01443j32081K10360k53263J62501J07928
16942A196376l1539J52545j10395O4577K29172k09570j22965P0579R0224k24000
$$ y = [991412, 751644, 399032, 527478, 574552, 804328, 767839, 862982, 782722, 793354, 802844, 733060, 855120, 670670, 683526, 836864, 643407, 408533, 738025, 314462, 779580, 853041, 727157, 660129, 866024, 1015699, 1027809, 859723, 636916, 730062, 1093979, 840069, 834207, 883328, 492342, 961933, 814558, 893748, 1030499, 962888, 942665, 879929, 860724, 753162, 909770, 728853, 1035340, 774433, 949738, 1089650, 845901, 951193, 1024489, 951412, 902396, 839841, 1378611, 868824, 1245069, 1205523, 1037915, 726090, 1103829, 1260633, 963256, 1252534, 1202374, 1100931, 968850, 1179210, 925947, 1088448, 1196376, 1164837, 1317382, 1206987, 1271564, 1500736, 1291166, 1168201, 1238780, 1329004, 1105004]
16932A105004J04017M1804N7350L11448o1623l23772p3725L23091k01092j4408
16922A268094j95328L05644R2233q6732O2479M3282j70144K14182L1464k52516
16912A312658M14422l93424L37187l0974N7423l10483M44218k31330M08364j23348
16902A884713o4900j40252L70554M8459o74714J53473K20426K63060l39587K45115
16892A966347k03269J7773j29639M45807K6129j83862K97404k47692J58524m0728
16882B106794J13808P5783R8235m68444K39415L86740q898K65778l79291K00767
16872B630687j40723j8200N5489L29374o78650O64502l41730J72634P9218j85390
16862B567211K26842J34492k66452N7420K97623L84872n60234K62162o7014j91380
$$ y = [1105004, 1209021, 1250825, 1308175, 1619623, 1558000, 1234228, 1160503, 1483594, 1282502, 1268094, 1072766, 1378410, 1470643, 1383911, 1446390, 1489672, 1319528, 1533710, 1565174, 1312658, 1727080, 1333656, 1670843, 1639869, 1697292, 1386809, 1831027, 1599697, 2008061, 1884713, 1819813, 1679561, 2050115, 2098574, 1423860, 1577333, 1797759, 2060819, 1721232, 1966347, 1763078, 1780851, 1651212, 2097019, 2123148, 1939286, 2236690, 1988998, 2147522, 2106794, 2220602, 2296385, 2394620, 1926176, 2165591, 2552331, 2543433, 2809211, 2429920, 2630687, 2489964, 2471764, 2527253, 2856627, 2177977, 2842479, 2500749, 2673383, 2752601, 2567211, 2794053, 2928545, 2662093, 2719513, 3017136, 3402008, 2841774, 3103936, 3036922, 2845542]
16852B845542K56513J47822J083K39980l06279L2643K32164M3430n9311j38718
16842C294869L66662K9833J60590r9847P114M48553L4810n3627L15563k3166j73223
16831D308131j43379N07321J95284q38o1614K06864P0748k52888L19507m8j68590
16820D980498L19680J31086R3461K34872J57129k9558k60594M75473K14643r9445
16810F217245M31916Q9638J17858K57591J75344k9402K34204k218L2146Q5734
16800G610056O84919J275K10975P6642K10150K59885R7017L20987J18683N40254
16790A0130843K03818J86612K52812L48322M25109J74748K49023K08271K46576
16781A2426134O37895N65046q2170M90012P89332K50643K32330N20066L76951
$$ y = [2845542, 3102055, 3249877, 3250960, 3490940, 3184661, 3217304, 3449468, 3492898, 3433587, 3294869, 3661531, 3691364, 3851954, 3752107, 3759221, 4207774, 4242584, 4188957, 4504520, 4481354, 4308131, 4164752, 4672073, 4867357, 4866519, 4804905, 5011769, 5082517, 4829629, 5149136, 5149088, 4980498, 5300178, 5431264, 5524725, 5759597, 5916726, 5887168, 5626574, 6102047, 6316690, 6217245, 6649161, 6738799, 6856657, 7114248, 7289592, 7260190, 7494394, 7492176, 7524322, 7610056, 8294975, 8296250, 8507225, 8583867, 8794017, 9053902, 9150919, 9471906, 9590589, 10130843, 10334661, 10521273, 10774085, 11122407, 11547516, 11722264, 11971287, 12179558, 12426134, 13064029, 13629075, 13546905, 14036917, 14826249, 15076892, 15309222, 15829288, 16206239]
16772A6206239O83256N30980L85724R86329L75787Q67905L07723J258854M40551
16763B2043348J152825P57391R72090R22753J093982O60003J246839J175206J560641
16754C1585078J208121J317318J445815J901067J422722K260452J581902K188784
16746D4911259K094524K427158K375314K731141K648552L232803L251812L503479
16738F7176042L756983L927863M085387M484059M937227M834798N157221N879434
16730A04239014N860900N656359O374899O457304O264176O875670O050846O471167
16722A54250335N595474N589631M154162M561264L153479K415246J057256M60911
16714A81237758j014504j955621k990265l921219m433203n091536o227949n983538
$$ y = [16206239, 16889495, 17420475, 17806199, 18792528, 19168315, 20036220, 20343943, 21602797, 22043348, 23196173, 23953564, 24925654, 25848407, 26942389, 27602392, 28849231, 30024437, 31585078, 32793199, 34110517, 35556332, 37457399, 38880121, 41140573, 42722475, 44911259, 47005783, 49432941, 51808255, 54539396, 57187948, 60420751, 63672563, 67176042, 70933025, 74860888, 78946275, 83430334, 88367561, 93202359, 98359580, 104239014, 110099914, 115756273, 122131172, 128588476, 134852652, 141728322, 147779168, 154250335, 159845809, 165435440, 169589602, 174150866, 177304345, 179719591, 180776847, 181237758, 180223254, 178267633, 175277368, 171356149, 166922946, 161831410, 155603461, 149619923]
16706A49619923o477976o474498o790585o578127o249826o079805n992962n829761
16698I9146383n383937n057403m941913m654831m070879m497776l652957l365317
16690F3521370l690797l009515k856387k665380k664616k388567k117585k475823
16682D1652700j768522j314858k424375j396460j642050j078505j722087j271283
16674B9034560r54527j228189j208775r55479q90646o67521j121880j114302m86315
16665B0406926o83991o09608m43424r24936p95272j67946j113885j71727l87743
16656A5108394l27855p49240l88284k51227n56015m91666n29439J9908j59965
16647A1674611n86606m01556k62557o29002k29572K46312n49865l36747j39842
$$ y = [149619923, 143141947, 136667449, 129876864, 123298737, 117048911, 110969106, 104976144, 99146383, 93762446, 88705043, 83763130, 79108299, 75037420, 70539644, 66886687, 63521370, 59830573, 56821058, 53964671, 51299291, 48634675, 46246108, 44128523, 41652700, 39884178, 38569320, 36144945, 34748485, 33106435, 32027930, 30305843, 29034560, 28080033, 26851844, 25643069, 24687590, 23796944, 23129423, 22007543, 20893241, 20406926, 19722935, 19113327, 18669903, 17744967, 16949695, 16781749, 15667864, 15496137, 15108394, 14780539, 14031299, 13643015, 13391788, 12835773, 12344107, 11814668, 11834576, 11674611, 11088005, 10686449, 10423892, 9794890, 9565318, 9811630, 9261765, 8925018, 8785176]
16638H785176q8964j05737m33046m1820k73504l66296l63249J64244k92759k870
16628F981175j73186k47239j70259k460k00127j7345j32632k93164j69738l05188
16618E269837J49587k7540l6918j75728j16875k54777L63605o37035J53452j87160
16608D500448J08400j90893Q4581o08902L24291Q3961o46512L26431M1984k83378
16598C740411j92474J78805k78866j01805n7691o2492J44998k93774M24787o5913
16588C435986k22608l33251k12223N8159R0600q161K9743r1279J35172m1310k83354
16577B557474n2778O3730m0802j07471j31933O1255m9766J74978j68813K22770
16567B528644j6402k2115m27837j0722J39050l21019J93133m51099K90640L87766
$$ y = [8785176, 8696212, 8590475, 8157429, 8115609, 7842105, 7475809, 7112560, 7276804, 6984045, 6981175, 6807989, 6560750, 6390491, 6388031, 6187904, 6170559, 6037927, 5744763, 5575025, 5269837, 5419424, 5391884, 5354966, 5179238, 5062363, 4807586, 5171191, 4534156, 4687608, 4500448, 4608848, 4417955, 4502536, 3893634, 4217925, 4301886, 3655374, 3981805, 4023789, 3740411, 3547937, 3726742, 3447876, 3346071, 3288380, 3225888, 3370886, 3077112, 3501899, 3435986, 3213378, 2880127, 2667904, 2726063, 2816663, 2808502, 2838245, 2746966, 2882138, 2840828, 2557474, 2504696, 2568426, 2527624, 2420153, 2288220, 2349475, 2299709, 2474687, 2305874, 2528644, 2512242, 2490127, 2062290, 2051568, 2190618, 1869599, 2062732, 1611633, 1902273, 2290039]
16557B290039k78860j81856j38742K53836k24525M0065l1323J07533k11178L30702
16547A955691l68027j70682L65569J14396l70653J49602J74257r6797j27046q779
16537A617531k58525K13263L8824r0412j44726J09045r5146K90125l46821M04754
16527A737912m10946J30565j42343L5188j95529l28924K81452j5934k5495j68429
16517H97517M23459o48170L15382L53276j49420l33398L25236k6768j47843K38419
16507A247690j35287k76724K14633j49500L05921r2196j68855l24550L81276K06842
16497A209250l23664j19411M60015l6904l2088k81417J49560p6676m43663K44745
16487G49747L05578k19526j00801J7779J65234j08216K8947j56103R1361j3287
$$ y = [2290039, 2011179, 1829323, 1690581, 1944417, 1719892, 1759957, 1728634, 1836167, 1624989, 1955691, 1587664, 1416982, 1782551, 1896947, 1526294, 1675896, 1850153, 1753356, 1626310, 1617531, 1359006, 1572269, 1611093, 1520681, 1375955, 1485000, 1389854, 1679979, 1333158, 1737912, 1326966, 1457531, 1315188, 1350376, 1154847, 825923, 1107375, 1091441, 1065946, 897517, 1320976, 672806, 988188, 1341464, 1192044, 858646, 1183882, 1157114, 1009271, 1247690, 1112403, 835679, 1050312, 900812, 1206733, 1114537, 945682, 621132, 1002408, 1209250, 885586, 766175, 1226190, 1189286, 1157198, 875781, 1025341, 948665, 505002, 749747, 1055325, 835799, 734998, 752777, 918011, 809795, 838742, 682639, 774000, 760713]
16477G60713K48451m61261J91651Q8508j91447K42290n1414p8648J82237l22047
16467F09033M53195m03575j5083k9205p1460K93876O4962k62059j18469j96021
16457C25194J20923j49562K73453L11884l07910K7225n0744B70846M26666m636
16447F92876k98379K36981J25481k86098L40917C64771J97875B24489N44663k81081
16437D88071l4204J82723j84858Q8347K32290C00242j00655J75860Q9922K17021
16427F82390q9226j98035M3224J05463A97682K36526J5166N8764j00917n5591
16417C51630M5373P2850j63258O6666J89670n6276k53313J93179p206j6396P9306
16406E02225l8197n7130A82072J69909l1415A0842L98711n3455K61801q8365N9878
$$ y = [760713, 1009164, 547903, 739554, 828062, 636615, 878905, 827491, 748843, 931080, 609033, 1062228, 658653, 643570, 614365, 542905, 836781, 901743, 639684, 521215, 325194, 446117, 296555, 570008, 881892, 573982, 601207, 550463, 270846, 697512, 692876, 394497, 631478, 756959, 470861, 811778, 364771, 562646, 224489, 769152, 488071, 453867, 636590, 451732, 540079, 772369, 300242, 199587, 375447, 465369, 682390, 593164, 395129, 438353, 543816, 197682, 434208, 449374, 508138, 407221, 351630, 397003, 469853, 306595, 373261, 562931, 506655, 253342, 446521, 439315, 422919, 502225, 464028, 406898, 182072, 351981, 320566, 10842, 409553, 356098, 617899, 529534, 589412]
16395E89412j66509J2527J68632k42443K4119M45864B86493J58345J4196k8781
16385D30253A20425K40952q2817O305J23747K22263m8805k1498B76123L33235
16375F09358d0166A66450Q9616p6212K29680A77405m2940J47796O2320J21380
16365D65961k31513Q3820P7084G8578L38814j76027o6929a3799B96063P4424a45540
16353B13283j7076n0554J10508j4243K83674k1464A02928J01996J16529q413J27282
16342D40322A20482R1346E9400M9281L8168o1073J02651P9670J33174j6048A36455
16330D6954a67535A21222O7567R1452O3157a39908B20591J62230A45031K76874
16320D21905q6767F1901K4468B013J46793M125E1658K25482C9007a24522A19929
$$ y = [589412, 422903, 435430, 604062, 361619, 385738, 831602, 286493, 444838, 459034, 430253, 120425, 361377, 278560, 284865, 408612, 630875, 582070, 560572, 276123, 609358, -40166, 166450, 256066, 179854, 409534, 177405, 134465, 282261, 344581, 465961, 234448, 318268, 395352, 78578, 417392, 241365, 174436, -13799, 296063, 370487, -145540, 213283, 196207, 145653, 256161, 241918, 525592, 504128, 102928, 204924, 321453, 313040, 440322, 120482, 211828, 59400, 108681, 146849, 85776, 188427, 268097, 401271, 385223, 136455, 46954, -167535, 121222, 188789, 280241, 343398, -139908, 220591, 382821, 145031, 421905, 335138, 61901, 86369, 2013, 148806, 152931, 51658, 277140, 39007, -124522, 119929]
16308B7891K75229J2609j15818R0375K32654a5722k22748C0536J28076d0793E82124
16296e6691C2059M7071K17657A29458J09235C5899a71089D24468j85490e3354
16285G8445J05507D341K53781r1897O6511K02322n9957a58467B85629H2467c1887
16273B81469E4058b3233A00349L62346j01682k7427J93931i8412k9019j3855B40629
16261b1408A71937A5762K47433j09839c11499A37479J3521J34839C5754a09227
16250A68925n6021b91k00032g3840B49953b57861A59494a8802j79495C27611A54873
16238D42385E6071g9301c8920A13636J00016G8192g4867J011f837E9730Q9879
16227A49609b06024B64863J37222A34018b3773I1102R63J02747d06497a43549
$$ y = [27891, 303120, 315729, 199911, 290286, 522940, -15722, -238470, 30536, 158612, -40793, 582124, -56691, 32059, 79130, 296787, 129458, 238693, 35899, -171089, 424468, 238978, -53354, 78445, 183952, 4341, 258122, 166225, 232736, 435058, 375101, -158467, 285629, 82467, -31887, 281469, 54058, -23233, 100349, 462695, 361013, 333586, 527517, -98412, -127431, -141286, 240629, -21408, 171937, 15762, 263195, 153356, -311499, 137479, 151000, 285839, 35754, -109227, 168925, 112904, -291, -200323, -73840, 249953, -257861, 159494, -18802, -198297, 327611, 154873, 442385, 56071, -79301, -38920, 113636, 213652, 78192, -74867, -73856, -6837, 59730, 149609, -206024, 264863, 402085, 134018, -23773, 91102, 92065, 194812, -406497, -143549]
16216G7061J85304D7559N4358L8021B6042P4995J02487I2928i0727A22023J21862
16205B43885I7837a8478B20060a21138G3944N7554E2544a11994A39476b81436
16194B85244L5691b02037C25666c186B39344I3636J05142f2301j01545a4056B53371
16182H2324a2802A62186C2104J12354d01209a4976H3231K0623N8093c32958C71024
16170a86402c7046j06831A1622a65049d9245D4050b91069e1526m0851A09702a90914
16158b889G437J14754a03677p7434A7455k538K331h899D6068N1576P9439p0323
16146A06760d0499A72804i1951H6633m0981K36090a93904A03779E1837i6328E7899
16134c17540F1651b70109C0599J09894d10208a39025F1883d9425B00641G9941
$$ y = [77061, 262365, 47559, 101917, 139938, 26042, 101037, 203524, 92928, -90727, 122023, 243885, 97837, -18478, 220060, -121138, 73944, 131498, 52544, -111994, 139476, -281436, 285244, 320935, -202037, 325666, -3186, 239344, 93636, 198778, -62301, -163846, -14056, 253371, 82324, -12802, 162186, 32104, 144458, -401209, -14976, 83231, 103854, 161947, -332958, 371024, -186402, -37046, -143877, 11622, -165049, -49245, 44050, -291069, -51526, -92377, 109702, -190914, -2889, 7437, 122191, -103677, -181111, 17455, 14917, 17248, -8899, 46068, 97644, 177083, 106760, -40499, 172804, -91951, 86633, 45652, 281742, -193904, 103779, 51837, -96328, 57899, -317540, 61651, -270109, 30599, 140493, -410208, -139025, 61883, -49425, 200641, 79941]
16123C14863D9419e1627G2891L97937C1795J90603A04085J48008a80880a8780
16112a40782D8364h9995G2938a44492j59947a31504O938d6038r6651E24116B06968
16100A20598L14630a89014A88803m8073J45878M2627q3176g5006j18174A11397
16089b4287G6976d0623H323b54097e1538l65986c3910o6243j08331h5526j86341
16078b71867J31484B72590a2025q9568j6235I857J93014b39286A52231c35627
16067a29109C5044N1421K0473b3698A42969D4256N594J84279C1415a85876A7960
16055B9688a84804H0928b23430F9660a25553A63574H644M2542M6800J61618A21538
16043G4442B469J6655L729b56705B54758F9458l2454d9901N837j17338j32704
$$ y = [314863, 49419, -51627, 72891, 470828, 31795, 222398, 104085, 252093, -180880, -18780, -140782, 48364, -89995, 72938, -144492, -304439, -131504, -124566, -46038, -142689, 524116, 206968, 120598, 435228, -189014, 188803, 140730, 286608, 329235, 246059, -75006, -193180, 111397, -24287, 76976, -40623, 8323, -254097, -51538, -417524, -33910, -100153, -208484, -85526, -271867, -140383, 272590, -12025, -101593, -117828, 9857, 202871, -239286, 152231, -335627, -129109, 35044, 86465, 106938, -23698, 142969, 44256, 49850, 234129, 31415, -185876, 17960, 29688, -184804, 80928, -223430, 69660, -125553, 163574, 8644, 51186, 97986, 259604, 121538, 74442, 2469, 19124, 22853, -256705, 254758, 69458, 37004, -49901, -44064, -161402, -294106]
16032b94106A76678J7611Q2210E1686e6825j27354L3254g0575k38194B43604C7827
16020c43851J30741A66536a75741A46390K83254c89779i055p327p8029B14482
16009a25503J6611A12648a77874p1181A83742J747a81602B12505a59443D7366
15998C2954b12293G1212O4418a93080g9860M470J4298B17614M994a58680A81128
15986D073J49374G6498g4103D75305A67205l6333K73984h5954b1592A10360K92092
15975D02452F1404J17086b02006Q2117D6369D871J82498C7045O6589M13173b03199
15963b61836B37195o6110a69923D72956A82071i5436j00181A59620a38708q6247
15953b24955o4881B4746J63838J60350a31153j90915J59300M8703D6619g9218
$$ y = [-294106, 176678, 194289, 276499, 51686, -56825, -184179, -150925, -70575, -308769, 243604, 37827, -343851, -213110, 166536, -175741, 146390, 429644, -389779, -9055, -16382, -94411, 214482, -125503, -108892, 112648, -177874, -249055, 183742, 185489, -181602, 212505, -159443, 47366, 32954, -212293, 71212, 135630, -193080, -79860, -75390, -61092, 217614, 222608, -158680, 181128, 4073, 153447, 76498, -74103, 475305, 167205, 130872, 404856, -85954, -21592, 110360, 402452, 61404, 178490, -202006, -119889, 46369, 4871, 187369, 37045, 103634, 516807, -203199, -261836, 237195, 171085, -169923, 472956, 182071, -95436, -195617, 159620, -138708, -224955, -289836, 24746, 188584, 348934, -131153, -322068, -162768, -114065, 46619, -79218]
15942a51664j2943A73221c27123J59558B38141a67010j88383J03667M2698B15355
15931a01621k94104a02851J97M155A16658a45354q7227B10192a48364k44949Q1123
15920c12190f8300D917b6870B13345D2778J83007b96245e4280l17988I824e3794
15908b25849B53153b68646A55688d8766A42151a42078d9850k5746j41512h5239
15897a1683j68462F5030m813b56151c4963k59873i1837l23376f8087K7047A64202
15885a39667n2338G6856R2363b34054g6360j36150C72169j80884a14735p9702
15875a94437l2997B1501Q9178A4183b85352e6095p9807E0703c1374k24849A09558
15863D4328K7039N8893J21887g8620A45801q855J4354F952L02017c50300B11603
$$ y = [-151664, -164607, 173221, -327123, -167565, 238141, -167010, -355393, -251726, -209028, 215355, -101621, -395725, -102851, -102654, -98499, 116658, -145354, -232581, 210192, -148364, -393313, -312190, -68300, 4917, -26870, 213345, 42778, 225785, -296245, -54280, -372268, 9824, -53794, -225849, 253153, -268646, 155688, -48766, 142151, -142078, -49850, -75596, -217108, -85239, -11683, -180145, 65030, 60217, -256151, -34963, -294836, -91837, -415213, -68087, -41040, 164202, -139667, -192005, 76856, 169219, -234054, -76360, -212510, 372169, 191285, -114735, -194437, -227434, 21501, 110679, 14183, -285352, -56095, -135902, 50703, -31374, -256223, 109558, 44328, 71367, 130260, 252147, -78620, 145801, 136946, 151300, 6952, 308969, -350300, 211603]
15851c8149j2535i734D00048a17783F5551a52678P5345A32079c64452H3001c9959
15839a78413A24696A4906a52498g4384i112B0117c94794a5877j20818C1829b2781
15827b48849E2372a47202j66005a40440n1308N5225a8615n31954e9154j95707
15817b54861k03330a1591k31107f138k86826A28903l2923J71690H4964J86573
15807B71537A01751A3175L14480a89682l9360p6239B55473G5070b6528a2882o8924
15796h1806A19181k2355J41727b35543e6114B8693a99785j20043A58280a18173
15785A37568P9504b4446p3959A8544a25307E9202a53540c0627k53552E0056R2891
15774A42947F9140b20177B98025j22393m7910a530D8972J92914A19151N6539e3688
$$ y = [-38149, -50684, -9734, 400048, -117783, 65551, -152678, -77333, 132079, -364452, 83001, -39959, -178413, 124696, 14906, -152498, -74384, -9112, 20117, -394794, -15877, -136695, 31829, -22781, -248849, 52372, -147202, -313207, -140440, -191748, -136523, -18615, -550569, -59154, -254861, -458191, -11591, -242698, -6138, -292964, 128903, 95980, 267670, 84964, 271537, 101751, 13175, 327655, -189682, -229042, -305281, 255473, 75070, -26528, -12882, -81806, 119181, 96826, 238553, -235543, -56114, 28693, -199785, -319828, 158280, -118173, 137568, 217072, -24446, -98405, 18544, -125307, 59202, -153540, -30627, -284179, 50056, 142947, 69140, -220177, 298025, 175632, 127722, -1530, 48972, 241886, 119151, 175690, -53688]
15762G3997g2470A56272a99409E00729A27864K04614A6448i1279o4385o3684b7296
15750E306h1770p3982C22614D2624a88981B0191J21767E2177a3234k0538k02453
15739b36225c6124G8933J71983F5641a30946j58146Q3523C8144J89687A07236
15728a82631o5850A7786b16225q4741j7791a1590A09167J54464D1106Q5728l6228
15717I0606A0075J01247a94526A16946L7401a59462a2770f84F0815a38293A47759
15705G3753j4699b44691F6169A7321b48036b2436A58586a3205j88637A60001a84336
15693h742k4473m3150K392C01852A7736K3563b6413k50545e4717B7408c855B91829
15680A20255l2652b14949r8458a9247j69307O9520b6293p4804j4484C7591P4544
$$ y = [73997, -72470, 156272, -199409, 500729, 127864, 332478, 16448, -91279, -155664, -219348, -27296, 5306, -81770, -155752, 322614, 42624, -188981, 20191, 141958, 52177, -13234, -33772, -236225, -36124, 78933, 250916, 65641, -130946, -289092, -205569, 38144, 227831, 107236, -182631, -248481, 17786, -216225, -300966, -318757, -11590, 109167, 263631, 41106, 126834, 90606, 10075, 111322, -194526, 116946, 154347, -159462, -12770, -684, 60815, -138293, 147759, 73753, 59054, -244691, 66169, 17321, -248036, -22436, 158586, -13205, -201842, 160001, -184336, -8742, -33215, -76365, -73973, 301852, 17736, 41299, -26413, -276958, -54717, 27408, -3855, 291829, 120255, 87603, -214949, -313407, -19247, -188554, -119034, -26293, -101097, -115581, 37591, 112135]
15669A12135b02191H7417A5053d2861B20039a29324A9090K184c73767a30339j4381
15658a44720j32072b065k8957j63237B13213m393a57766o1624M0376B24380H9646
15646e1311J8144A12164b7601B8220a0193H0940b4406j66972A81817a29279B71975
15634b04222i5769r180G6023d2271a7670j05295G1716J68249A0785J02445a19723
15622b02570O3402j17045A11707C9203a03014N426q4587G4463f6353C2876a06659
15610a7779j96690d4603m24465G5219l1336g174m7459A14230B8635a05391A9070
15598C2645c53980d0300J3650A41437g7800C04556b87297R2861B13165H8456b36604
15586D36733q9492E7525Q4645F4552a70346N7693A73304b0300l2612K4913k13412
$$ y = [112135, -202191, 87417, 15053, -42861, 220039, -129324, 19090, 21274, -373767, -130339, -144720, -276792, -2065, -31022, -194259, 213213, 208820, -157766, -219390, -179014, 224380, 89646, -51311, -33167, 112164, -27601, 28220, -10193, 80940, -24406, -191378, 181817, -129279, 271975, -204222, -95769, -104949, 76023, -42271, -17670, -122965, 71716, 239965, 10785, 113230, -119723, -202570, -139168, -256213, 111707, 39203, -103014, -97588, -182175, 74463, -66353, 32876, -106659, -17779, -214469, -44603, -469068, 75219, 43883, -7174, -54633, 114230, 28635, -105391, 19070, 32645, -353980, -40300, -26650, 141437, -77800, 304556, -287297, -194436, 213165, 88456, -236604, 436733, 347241, 57525, 142170, 64552, -170346, -112653, 173304, -20300, -52912, -27999, -241411]
15575b41411k50058K00488b899A90165f2507K4356D3921k959b53940J20592e7781
15563a51702C860J44795d42726a7622C01244j4013l3538A8340N7979a90210k16938
15552d07148D1283K51129A10824a33916I7611L13586A2198a65185d4706n6864
15542a01570F8245h6808C63012A59920E197J14229D1012J22889o5898e115m7766
15531e2881j12773A00635k9331P4144A9690J61042o3778J5705a13310E010a19265
15519c8376k53185A09085l1322h7582j64151e946j20304D0832J03929b5053k76260
15508c01313J25266j7395P4840M9142l37680c3881A3214a46157j02728M7859f8897
15496A785e3066A97263b74954G7959h3567j5837E5903A0395a24385N3515j67317
$$ y = [-241411, -491469, -290981, -2899, 190165, -62507, -38151, 43921, 40962, -253940, -133348, -57781, -151702, 3860, 148655, -442726, -17622, 301244, 287231, 253693, 18340, 76319, -190210, -407148, 41283, 292412, 110824, -133916, 97611, 411197, 12198, -165185, -44706, -101570, 68245, -86808, 363012, 159920, 5197, 119426, 41012, 163901, 98003, -5115, -52881, -165654, 100635, 71304, 145448, 19690, 180732, 116954, 132659, -113310, 5010, -119265, -38376, -291561, 109085, 77763, -87582, -251733, -5946, -126250, 40832, 144761, -25053, -301313, -176047, -193442, -118602, -69460, -407140, -33881, 13214, -146157, -248885, -201026, -68897, 1785, -53066, 197263, -274954, 77959, -83567, -99404, 55903, 10395, -124385, -70870, -238187]
15485b38187B79538A12900a33114j07299A75832j7309A7486f9097B04745a02151
15474d8022k16502b5161j17297J5392A12861b58644A66428h1837D5170J21628
15464A66798i010r2864K893D2532J84162c51809e693B19014c6311A90914D9883
15452b24336A66938c38995B6326J71537a89312A72883L7282a64328f9785B40049
15441D87430A79946b66932A28321b56147C07990j20244a61503B05821j292A41
15430H2360b55615C12787b21789B80766d2237A84619Q4127C4347N8431c90279
15419i1783j07846P3037K7987E9530J16446f5608j03738C5833c34710A93546d6152
15407A8645d06238J65999A75669a772B63803a06725A33400c0564l5455B80131
$$ y = [-238187, 279538, 112900, -133114, -240413, 175832, 158523, 17486, -69097, 204745, -102151, -48022, -264524, -25161, -142458, -127066, 112861, -258644, 166428, -81837, 45170, 166798, -9010, -101874, -98981, 42532, 226694, -351809, -5693, 219014, -36311, 190914, 49883, -224336, 166938, -338995, 26326, 197863, -189312, 172883, 210165, -164328, -69785, 240049, 487430, 179946, -266932, 128321, -256147, 307990, 187746, -161503, 205821, 204529, 141, 82360, -255615, 312787, -221789, 280766, -42237, 184619, 268746, 34347, 92778, -390279, -91783, -199629, -126592, -98605, 59530, 175976, -65608, -169346, 35833, -334710, 193546, -46152, 18645, -406238, -240239, 175669, -1772, 263803, -106725, 133400, -30564, -66019, 280131]
15396A64300d9436B76137g9560D7481P1263r657Q0360a07716A64255b90613R6709
15385a93904j7691g2668A03439L2310J65291e5219H0244b37660C83621a37506
15374a19578f186B6463g5117j95717J01007R495f2787A75997L6606e0916j2291
15363f3207D48014i3969K2001C12869a29872A78633o7633J31411C6692O0238R9593
15352A96523f8347A36525E5759b76599J02857B07711J18858A04868J3032N9189
15342A77089R8966a53862l9319J0117B12857b3287D3552a74773C98652H0484a40828
15330d05340A36192J79249j13264b84772G5490J00690p6704o408k1327M5554b20750
15318a83231a4540F6598a19757p1520G8152a92233B7617b12229B0230a5410D31577
$$ y = [164300, -49436, 276137, -79560, 47481, 118744, 109087, 189447, -107716, 164255, -290613, -193904, -211595, -72668, 103439, 135749, 301040, -55219, 80244, -237660, 383621, -137506, -119578, -6186, 26463, -75117, -270834, -169827, -160332, -62787, 175997, 212603, -50916, -63207, 448014, -93969, -71968, 312869, -129872, 178633, 111000, 242411, 36692, 96930, 196523, -68347, 136525, 55759, -276599, -173742, 207711, 326569, 104868, 117900, 177089, 276055, -153862, -193181, -183064, 212857, -23287, 43552, -174773, 398652, 80484, -140828, -405340, 136192, 315441, 202177, -284772, 75490, 176180, 99476, 93068, 71741, 117295, -220750, -183231, -14540, 66598, -119757, -191277, 78152, -192233, 27617, -212229, 20230, -15410, 431577]
15306F07084G5921L9853a87924C05737G858b45528A38389Q2730h9015B5143i1273
15294E2656a64617A49654c691o3847J5629A5869K24386G0476a542E0390J46955
15283A97345h055A87580A0934J99966B7965b8735C22212I3299a17722k05710C71435
15271A67541M1408H4666a19852F1759J8096M854a15880A9987Q8175b9580G4027
15259h3180A39763R1524J26894a25178A10327a25303o5381R5315F67081d7377
15248G14243O97668n42939K37002K6600D63631k06191G5559J6049M1167K95805
15238D28580a00866p6944g3834j29163B35720B1460K7085J26688O8260k1132C2212
15226B71412o1533C5840J91323e8531B85325d32320f4492k3702B7929c8060A8230
$$ y = [607084, 75921, 115774, -187924, 305737, 7858, -245528, 138389, 221119, -89015, 25143, -91273, 52656, -164617, 149654, -3691, -67538, -51909, 15869, 240255, 70476, -1542, 50390, 197345, -8055, 187580, 10934, 210900, 27965, -28735, 322212, 93299, -117722, -323432, 371435, 167541, 208949, 84666, -119852, 61759, 79855, 84709, -115880, 19987, 108162, -29580, 74027, -83180, 139763, 231287, 358181, -125178, 110327, -125303, -190684, -95369, 667081, -47377, 714243, 1411911, 868972, 1105974, 1132574, 463631, 257440, 75559, 91608, 132775, 428580, -100866, -177810, -73834, -202997, 235720, 21460, 48545, 175233, 243493, 222361, 32212, 271412, 209879, 35840, 227163, -58531, 285325, -432320, -64492, -88194, 27929, -38060, 18230]
15214A73924B4368b7933j95219A99474a32324G7435i0600I6973e2089H1579C5640
15202C0322a11098q1825N2829A57954d22826C7669J83748i117m4544n0389A4361
15190B52842e7255C86073b30444A64961G4049k0413K95950j59662a9539j13026
15180a32565k42700B69866a25521F7995B8505K60338o2829Q5802B2997a58674
15169e026A78455H312L18266j05998J08086e5103A08814d9354C4240J82727J18918
15158C35885n0916h0627B61881p1551g1974A06311h7321B30699b7470l22B12612
15146a3220m7727C58282d2518B10408H8246O1097D9115O8396J26844K32829a991
15134C04127A40023c1965A15594b7582d550k7932q748g192A28898d2928A59739
$$ y = [173924, 24368, -27933, -223152, 199474, -132324, 77435, -90600, 96973, -52089, 81579, 35640, 30322, -111098, -192923, -140094, 157954, -422826, 37669, 221417, -9117, -53661, -104050, 14361, 252842, -57255, 386073, -230444, 164961, 74049, 53636, 349586, 189924, -19539, -132565, -375265, 269866, -125521, 67995, 28505, 288843, 226014, 311816, 22997, -158674, -5026, 178455, 8312, 326578, 220580, 328666, -55103, 108814, -49354, 34240, 216967, 335885, 284969, -80627, 261881, 190330, -71974, 106311, -87321, 230699, -27470, -27792, 212612, -13220, -60947, 358282, -42518, 210408, 88246, 149343, 49115, 117511, 244355, 477184, -1991, 304127, 140023, -31965, 115594, -27582, -4550, -32482, -41230, -7192, 128898, -42928, 159739]
15122C09929a8942A51914E4954e6270B85992b38606D02769A16661a02743A37424
15111A58446a04233I6608k3026J02181a02974k56826c1971A43728J06834b1292
15100I3624L1438e0366B78659o349e4147B8678h1512B67455m8936R2327l9928
15089B70918A33578Q2417a24385D0505K69189a72252D43206A01273K73382j86313
15079A88342a0757A43156J39898A40617O0498J01626K7068A51557c5704A43746
15068i7402j68598A73370B2894f1242J9730B42859M58581H9582J32006m2055P7324
15057B56857j15588m9320m3029M4138J62313l594r2827J27214p6235J03499r4088
15046B19340C5046f684B4067c9358A29016J2395B3499L71010K33063B48350a10765
$$ y = [309929, -18942, 151914, 54954, -56270, 285992, -238606, 402769, 116661, -102743, 137424, 158446, -104233, 96608, 73582, 175763, -102974, -359800, -31971, 143728, 250562, -21292, 93624, 125062, -50366, 278659, 272310, -54147, 28678, -81512, 267455, 218519, 310846, 270918, 133578, 215995, -124385, 40505, 309694, -172252, 443206, 101273, 374655, 188342, -10757, 143156, 283054, 140617, 201115, 302741, 329809, 151557, -35704, 143746, -97402, -266000, 173370, 22894, -61242, -41512, 242859, 701440, 89582, 221588, 179533, 256857, 141269, 91949, 48920, 93058, 255371, 251777, 158950, 286164, 209929, 313428, 219340, 35046, -6684, 24067, -39358, 129016, 141411, 23499, 394509, 627572, 248350, -110765]
15034A5118b61800H9951L50321A22149J62855C3958F029O5283P5696g5709a7479
15022I1906L23246J38873I6967Q3173k7614K68579k02772a29686A20396B8699
15011a37630d2387A71835J18256q0298J48092A54989L689m7133M2068J96856r7222
15000B53247l1289J16116p0652j26081L62011A08611K82558j64351f0773A13527
14989B39351J76779A29284D8616R4560M4178b43958B32301p2540J8923Q6851q8331
14978A77204A6923e2553B47930J03861e5067B76422A06445K71450M746n3888f1798
14966B81746B0290M02951q2723F5445P2860K32437o9428l0301j32937b33791A28028
14954G0855a38974A58119Q6659L2226M1767j26142k3913J60099J84159j81613
$$ y = [15118, -261800, 89951, 440272, 122149, 285004, 33958, 6029, 71312, 147008, -75709, -17479, 91906, 415152, 554025, 96967, 180140, 152526, 421105, 218333, -129686, 120396, 28699, -137630, -42387, 171835, 290091, 209793, 357885, 154989, 158678, 111545, 153613, 350469, 253247, 221958, 338074, 267422, 141341, 503352, 108611, 391169, 226818, -60773, 113527, 239351, 416130, 129284, 48616, 143176, 187354, -243958, 232301, 159761, 178684, 265535, 177204, 16923, -52553, 247930, 351791, -55067, 276422, 106445, 377895, 382641, 328753, -61798, 281746, 20290, 423241, 340518, 65445, 138305, 370742, 301314, 271013, 138076, -233791, 128028, 70855, -138974, 158119, 244778, 277004, 318771, 192629, 168716, 328815, 512974, 331361]
14944C31361C06J36052L8543J37232j53345J61955J0626J99131A89484P0873r0448
14933A69909L0262R6960l1469J72000A87917K70005K8173J7588j07103j38736
14923B57844q416o9353k3580K39989Q1194j77120d9338A64368L21008I4951P3904
14912A68855M2001J6521Q2584J09027E4378K46212J17162r1120N4436N3369A30553
14900B57141M3623I5536L18554J89400B90054J21891A16478R2571L09358A95017
14889a20285G21821k57781B23794N6736L7265J32838J17463b89688E44421B64504
14878B87614K6347K11519B30515P4890k829p5650P8320j076j49383m7408L21627
14867D29006L56226A81966Q7296K25328Q3201j76568k6881j13582M62379A99860
$$ y = [331361, 306, 136358, 174901, 312133, 158788, 320743, 331369, 530500, 189484, 260357, 169909, 200171, 297131, 265662, 437662, 187917, 457922, 486095, 503683, 396580, 257844, 249428, 180075, 156495, 396484, 477678, 300558, -49338, 164368, 485376, 94951, 168855, 210856, 227377, 309961, 418988, 54378, 300590, 417752, 326632, 381068, 434437, 130553, 257141, 300764, 95536, 414090, 603490, 290054, 411945, 116478, 209049, 518407, 195017, -120285, 721821, 464040, 223794, 280530, 317795, 450633, 568096, -289688, 544421, 264504, 287614, 313961, 525480, 230515, 305405, 302576, 226926, 305246, 304170, 154787, 107379, 429006, 785232, 181966, 269262, 494590, 577791, 401223, 374342, 260760, 723139, 199860]
14856E0431L44320A95706K54910A06651L99268A99473N7412O52673C32752K52344
14846E85096j81750p9673o1173K21131j17704J05387p1371J96963k83614g6009
14835C26215o9958J14909n5680e3336A89970J15557J4467L48345r8687j78031
14825C91621o1967k4876J58601J91345B86026L00479j97341J40819p7736M4435
14815D96682A40394M43934k08177L33346l06804r5023P4289q3477J39199L93045
14805H30726C21966q5572M20943j36964A80218L36898j50878J20918j64651r3210
14795B29295L46261j13496l1416k8737j1341M02727l69277m4722K94339O3391
14785G37024C68496R8665j14819L25841k25614L02711j24418j70232L68169A73436
$$ y = [50431, 394751, 195706, 450616, 106651, 505919, 199473, 256885, 909558, 332752, 585096, 403346, 323673, 262500, 483631, 365927, 471314, 399943, 596906, 313292, -76009, 326215, 256257, 371166, 315486, -53336, 189970, 305527, 319994, 668339, 569652, 391621, 329654, 304778, 463379, 654724, 286026, 586505, 389164, 529983, 452247, 496682, 140394, 584328, 376151, 709497, 402693, 307670, 381959, 298482, 437681, 830726, 321966, 236394, 657337, 520373, 180218, 517116, 366238, 487156, 322505, 229295, 575556, 462060, 430644, 401907, 390566, 793293, 424016, 379294, 673633, 737024, 368496, 467161, 352342, 678183, 452569, 755280, 630862, 460630, 828799, 173436]
14774F90217R9147l67278K54296k29208M23998j51550q3352K74855k74733L2858
14764F69250j42371j39144N4849J04799J45361j08826j98765M24000l11468K06553
14754G04238J46900j13948l19836M53318k90458K27191l40338j06349K88754J34400
14744G83872j70868J05977l33811L60217j49172K26530k87567j0555J67671L3075
14734G25369J50405l08456O5940K35582C32140K65482o5301J28482J92140N564
14724H58507k53306j59561K84592J16261N5677j59968q1186K27043o1597J6251
14714H42713j18182j27717O1397J01502j20296J91538K3243j32317k30664L14580
14704H05797K12409l30625L6792l59561P06746n02970K34669k14636J62369C09264
$$ y = [690217, 789364, 422086, 676382, 447174, 871172, 719622, 636270, 911125, 636392, 669250, 526879, 387735, 442584, 547383, 692744, 583918, 385153, 809153, 497685, 704238, 851138, 737190, 417354, 870672, 580214, 807405, 467067, 360718, 649472, 783872, 613004, 718981, 385170, 745387, 596215, 822745, 535178, 524623, 692294, 725369, 875774, 567318, 633258, 868840, 332140, 597622, 532321, 660803, 852943, 858507, 605201, 445640, 730232, 846493, 902170, 742202, 661016, 888059, 826462, 842713, 724531, 596814, 658211, 759713, 639417, 830955, 854198, 721881, 491217, 805797, 1018206, 687581, 724373, 364812, 1071558, 568588, 803257, 588621, 750990, 309264]
14693A003792k36391K2427C66620O61206l36924J68672J89380k22415k08737K62882
14683H80684J63209k02026L50831l41961K98180k65567J970o7649n6050K37765
14673I99386j8509j80492K03598M338k88734J59396J00911J02520P4535l58886
14663G98063J70070n8606J87915l18678K64077L39797l5660l31978j45571L62043
14653A231472o3763m9168j59386K08268j31820J53334l83619K58132M22127n39072
14643I46505K50267J72979j72236n3640k33582M98769j45704Q3464n4557K6063
14633A318328J57271r3381j08541L9582j99852M6708K54857O8852m59776j1608
14623A012440L23800M4745l7082J95309k78362r7073J9033J78130q9808K21113
$$ y = [1003792, 767401, 789828, 366620, 1027826, 690902, 859574, 1048954, 826539, 617802, 880684, 1043893, 841867, 1192698, 850737, 1148917, 883350, 885320, 817671, 761621, 999386, 980877, 800385, 1003983, 1008321, 719587, 878983, 979894, 1082414, 1156949, 798063, 968133, 909527, 1097442, 778764, 1042841, 1382638, 1346978, 1015000, 869429, 1231472, 1167709, 1118541, 959155, 1167423, 1035603, 1188937, 805318, 1063450, 1485577, 946505, 1196772, 1369751, 1197515, 1143875, 910293, 1409062, 1263358, 1346822, 1292265, 1318328, 1475599, 1382218, 1273677, 1313259, 1113407, 1160115, 1414972, 1483824, 1024048, 1012440, 1336240, 1380985, 1343903, 1539212, 1260850, 1163777, 1182810, 1360940, 1271132, 1492245]
14613A492245J9786L37350n46378R4460m28092M14400L31820n71880K29786K69484
14603A642981m04636K7702J1671K31598K4990J34173j01966J54211k10919j63912
14593A345893K40482L67766o01694N05734m05166M36604l4982Q4624m07117K36330
14583A768474R3918m7697M2415k3408k46331J64887O1500J61379J81298l79820
14573A776615J90047J41672J6593l6024m7865j77188K99852o6363L56610k68498
14563B185451L66833l04439M90381j61778M1941r7652J65541O52174j11537k27149
14553B999766Q01825K14373J95810J140322P13598M246551R316971J9984519N478879
14544D5092614k1203950A0385159n003390k316430n47353l93177k32595j39463
$$ y = [1492245, 1512031, 1849381, 1303003, 1397463, 969371, 1383771, 1715591, 1143711, 1373497, 1642981, 1238345, 1266047, 1277718, 1509316, 1534306, 1668479, 1566513, 1720724, 1509805, 1345893, 1586375, 1954141, 1352447, 1858181, 1453015, 1889619, 1854637, 1939261, 1532144, 1768474, 1862392, 1814695, 1857110, 1833702, 1587371, 1752258, 1813758, 1975137, 2156435, 1776615, 1966662, 2108334, 2124927, 2088903, 2041038, 1863850, 2163702, 2097339, 2453949, 2185451, 2552284, 2247845, 2738226, 2576448, 2618389, 2520737, 2686278, 3338452, 3226915, 2999766, 3801591, 4015964, 4211774, 5352096, 6065694, 10312245, 19629216, 39613735, 45092614, 23888664, 10385159, 5381769, 3065339, 2517986, 2124809, 1892214, 1752751]
14536A752751j53215L50240m0891R7917J56707O8321j14462p133q3452J10174
14526B136957p6991l75800M63221J67999j69624J6170L30633k48058J15067J50598
14516B510172j35708k48511M77514L72741n46269K4461K01604M9409P3455K0950
14506B799818J50812o1156J06580j47731Q163K03753J5213m38253K52294N74870
14496C464363n04857Q3760J16365M6568k2034J14903j46526O3797K06473k03309
14486C219503N08383m35221K57057p3930J60277o5988k5556M39979n45929M25108
14476C863683N9671j17779J50618l03N2508K51587J47568m00448R150K15258K59905
14465D491418k54218P4458J23942M69392n51169m7304L14476k18451L52951L4642
$$ y = [1752751, 1599536, 1949776, 1908885, 2006802, 2163509, 2231830, 2117368, 2110235, 2026783, 2136957, 2059966, 1684166, 2147387, 2315386, 2145762, 2161932, 2492565, 2244507, 2359574, 2510172, 2374464, 2125953, 2603467, 2976208, 2429939, 2454400, 2656004, 2705413, 2778868, 2799818, 2950630, 2889474, 2996054, 2848323, 2856486, 3060239, 3075452, 2637199, 2889493, 3464363, 2959506, 3043266, 3159631, 3206199, 3184165, 3299068, 3152542, 3216339, 3422812, 3219503, 3727886, 3292665, 3549722, 3475792, 3636069, 3570081, 3544525, 3984504, 3438575, 3863683, 3923354, 3805575, 3956193, 3955890, 4008398, 4259985, 4407553, 4007105, 4016255, 4231513, 4491418, 4237200, 4311658, 4435600, 4904992, 4353823, 4306519, 4620995, 4402544, 4755495, 4790137]
14455D790137J2987r109L33977J40599j36956K41939J40808j89524J25888j38531
14445E312215K833K33231Q6189j21106J28330J60445J82231l7102P1184J99132
14435F217582K0622M08664j71636J11943j02593K32725k668L02113j76328L18614
14425G159038p2713J38614q2471N35273k57562L4591L52234o3361J60932L03532
14415H208107l7580O1735K36937j31664j0922K60530l1655L42948L82269R6399
14405I377104p5882M94954k21879K88515j28193J33120M73139J70701J96621K71227
14395A0979427l3964N14915n16747N77648K02945J5022M18442J73055L10638J81762
14385A2823143J79191K13591K11996M1859P23331k19893l4533P77893m3113N79885
$$ y = [4790137, 4803124, 4794015, 5127992, 5268591, 5131635, 5373574, 5514382, 5324858, 5450746, 5312215, 5315048, 5548279, 5634468, 5513362, 5641692, 5802137, 5984368, 5947266, 6018450, 6217582, 6238204, 6646868, 6475232, 6587175, 6484582, 6717307, 6714639, 7016752, 6840424, 7159038, 7086325, 7224939, 7142468, 7677741, 7420179, 7454770, 7807004, 7743643, 7904575, 8208107, 8170527, 8232262, 8469199, 8337535, 8326613, 8587143, 8555488, 8898436, 9280705, 9377104, 9301222, 9796176, 9574297, 9862812, 9734619, 9867739, 10340878, 10511579, 10708200, 10979427, 10945463, 11460378, 10943631, 11521279, 11724224, 11739246, 12157688, 12330743, 12641381, 12823143, 13002334, 13215925, 13427921, 13469780, 14193111, 13973218, 13938685, 14716578, 14673465, 15253350]
14375A5253350L59485L2535M86623K21236N8845P92943K11744K83369N55833J63148
14365A8419111M83646N80798M36334N03148o4132N41068P14039L23121Q20980
14356B2758113J28737P13642N60415J30343J370111M43924O00922L34533P07057
14347B7747797R82249N49822O16485J001387R16484N82809R32722P28371J033619
14338C5091745J090876Q14261J173284J134892J199538Q77419J543134J191967
14330D4117116J386055J468977J244789J965087J463179J625513K146195J820698
14322E7237609J662040K279572J779230K639638K205801K763529K875905K767948
14314G6211272L138665L065393L222661L668676L417316L958935M212021M289467
$$ y = [15253350, 15612835, 15645370, 16131993, 16353229, 16412074, 17205017, 17416761, 17700130, 18255963, 18419111, 18902757, 19483555, 19919889, 20423037, 20358905, 20899973, 21614012, 21937133, 22758113, 22886850, 23600492, 24160907, 24291250, 25661361, 26105285, 26706207, 27040740, 27747797, 28730046, 29279868, 29896353, 30897740, 31814224, 32397033, 33329755, 34058126, 35091745, 36182621, 36996882, 38170166, 39305058, 40504596, 41382015, 42925149, 44117116, 45503171, 46972148, 48216937, 50182024, 51645203, 53270716, 55416911, 57237609, 58899649, 61179221, 62958451, 65598089, 67803890, 70567419, 73443324, 76211272, 79349937, 82415330, 85637991, 89306667, 92723983, 96682918, 100894939, 105184406]
14306A05184406M923679M856721N539826N708203N683704O379853P004907P220783
14298A52502082P678305P791271Q747357Q999073J0079832R973914J0866906J1503240
14290B28141980J2043377J2714482J3306322J3674289J4300526J4651771J5673971
14283C24506718J5451296J5242134J5705963J5641120J4646574J4227884J2962700
14276D28384389J1950352R938737Q295142O104118K952236j432493m170520m279103
14268D57742858m424461l305880p136640q170090j0250087j2661373j4419681
14261C97374646j5129512j5487394j6292780j5873381j5972811j5315374j4137141
14254B89166253j4247527j4023333j3038610j2697244j1939459j1061380j1026110
$$ y = [105184406, 110108085, 114964806, 120504632, 126212835, 131896539, 138276392, 145281299, 152502082, 160180387, 167971658, 176719015, 185718088, 195797920, 205771834, 216638740, 228141980, 240185357, 252899839, 266206161, 279880450, 294180976, 308832747, 324506718, 339958014, 355200148, 370906111, 386547231, 401193805, 415421689, 428384389, 440334741, 450273478, 458568620, 464672738, 467624974, 466192481, 462021961, 457742858, 453318397, 450012517, 442875877, 434705787, 424455700, 411794327, 397374646, 382245134, 366757740, 350464960, 334591579, 318618768, 303303394, 289166253, 274918726, 260895393, 247856783, 235159539, 223220080, 212158700, 201132590]
14247B01132590r774859r579245q866540p860322p986962p476284p052255o913277
14239A35622846n800887n482962n374247n452425m717602m852680l994506m260826
14231I5686711l462879l459138l924233l116600l308395k598834l252103k440877
14223G0123652k774300k400402j883563k114212k063183k220127k106933j680751
14215E2880181j696905r02696j531483j496367j859511j498749j273812j036725
14207D1583933m82995j243890j485199j198477j163903j206220m02117l73834
14199C4027298r93007j459004q42385p90808n81349q99529l79503o69551n11819
14190B6900343j081251m75769m38807j082883j22882r59603k56844n00131j48818
$$ y = [201132590, 191357731, 181778486, 172911946, 165051624, 157064662, 149588378, 142536123, 135622846, 129821959, 124338997, 118964750, 113512325, 108794723, 103942043, 99947537, 95686711, 92223832, 88764694, 84840461, 81723861, 78415466, 75816632, 72564529, 70123652, 67349352, 64948950, 63065387, 60951175, 58887992, 56667865, 54560932, 52880181, 51183276, 50280580, 48749097, 47252730, 45393219, 43894470, 42620658, 41583933, 41100938, 39857048, 38371849, 37173372, 36009469, 34803249, 34401132, 34027298, 33034291, 31575287, 30732902, 29942094, 29360745, 28461216, 28081713, 27412162, 26900343, 25819092, 25343323, 24904516, 23821633, 23698751, 22739148, 22482304, 21982173, 21833355]
14181B1833355j004438p6562l78551l07232n37080n39981l49941l57328k42181
14172A8040061k97499n52194k60006l52995l45535n77969L2935k03455j81594
14163A5301749n11564R1228m05542n14349k52857k12140k37980m19636r0395O9514
14153A2818028n79096L7488n6863l78306j62886j87534j25160l44143k41575j01785
14143A0678168j94406m3484l63185r7758j34669J301j44248j77419N4914r09904
14133H669310L61361K9351r6899m34000n876k28974N6624j39688m2961m66671
14123G701577K02283J11147m80758n171J78513j38615j03417j31955N2547n31829
14113F854322M4241K02952m83054J40327j57462j67313N7109q3048j06102n2349
$$ y = [21833355, 20828917, 20752355, 20373804, 20066572, 19529492, 18989511, 18639570, 18282242, 18040061, 17742562, 17190368, 16930362, 16577367, 16231832, 15653863, 15686798, 15483343, 15301749, 14790185, 14881413, 14475871, 13961522, 13708665, 13496525, 13258545, 12838909, 12748514, 12818028, 12238932, 12276420, 12219557, 11841251, 11678365, 11490831, 11365671, 11021528, 10779953, 10678168, 10483762, 10440278, 10077093, 9979335, 9844666, 9845967, 9701719, 9524300, 9579214, 8669310, 9030671, 9060022, 8963123, 8529123, 8523247, 8294273, 8350897, 8211209, 8168248, 7701577, 7903860, 8015007, 7534249, 7529078, 7707591, 7568976, 7465559, 7333604, 7386151, 6854322, 6898563, 7101515, 6618461, 6758788, 6601326, 6434013, 6491122, 6408074, 6301972, 6249623]
14103F249623l13483J4749m2488K56353k60290J27109n35727q6854n2015K54529
14093E611506r6421J62654m71722J29388j47813l63066J76555p3968K44840k89453
14083D882500m98307O23224j85281o7789j43175j71301K21035j48846p0712J98109
14073D639457l07653j14281j08514K20039l02045K15271J36106l94520j0071K00011
14063D173800k99164J6681O2725m171J90898k6005j82039Q8003R5642m41515j64156
14052C510699L06895j29622L42718n11907J76436k58919Q1436k93324K55121j94102
14042C285431Q0564k38039J86937l52484L24158r0991k44128K43397l07036L26638
14032C214447k5972l07513Q7535j44199K08296j22735m40017N74866n33856O6296
$$ y = [6249623, 5936140, 5950889, 5908401, 6164754, 5904464, 6031573, 5495846, 5408992, 5356977, 5611506, 5515085, 5677739, 5206017, 5335405, 5187592, 4824526, 5001081, 4927113, 5171953, 4882500, 4384193, 5007417, 4822136, 4754347, 4611172, 4439871, 4660906, 4512060, 4441348, 4639457, 4331804, 4217523, 4109009, 4329048, 4027003, 4242274, 4378380, 3983860, 3973789, 4173800, 3874636, 3891317, 3954042, 3949871, 4140769, 4114764, 3932725, 4020728, 4116370, 3674855, 3510699, 3817594, 3687972, 4030690, 3518783, 3695219, 3436300, 3517736, 3224412, 3479533, 3285431, 3365995, 3127956, 3314893, 2962409, 3286567, 3195576, 2951448, 3194845, 2887809, 3214447, 3188475, 2880962, 2968497, 2824298, 3032594, 2909859, 2469842, 3044708, 2510852, 2577148]
14022B577148J95825k57758K43623M025q1786j84946k17798L09219j77850k143
14012B407559K40049m56744K66992j57601k45790L72290r5750o2396k65506L04880
14002B307983j54312r666o0518j81068K52821J12298l93613J09238J1534p153
13992A987544r864L84786K32568M53196J461683P529180J9697248J2801031j6713567
13983B7823805j2718127n693331l141598j351644r67085l09514n11682j52557
13975B978267J33190n47547J10068j27549j42997o6002j75624M66425l33909j87203
13965B107119M5382L286J05432q1884J82303n5135j22534J62307k52721l14942
13955A778613K13657k2976J57354k31988j13084M18366k72006k51204L94591k34118
$$ y = [2577148, 2772973, 2515215, 2758838, 2762863, 2681077, 2496131, 2278333, 2587552, 2409702, 2407559, 2647608, 2190864, 2457856, 2300255, 2054465, 2426755, 2331005, 2268609, 2003103, 2307983, 2153671, 2144005, 2083487, 1902419, 2155240, 2267538, 1873925, 1983163, 1994697, 1987544, 1977680, 2362466, 2595034, 3048230, 4509913, 12039093, 31736341, 44537372, 27823805, 15105678, 9412347, 6270749, 4919105, 3952020, 3642506, 3130824, 2978267, 3111457, 2563910, 2673978, 2546429, 2403432, 2337430, 2161806, 2628231, 2294322, 2107119, 2152501, 2155787, 2261219, 2179335, 2361638, 2306503, 2183969, 2346276, 2093555, 1778613, 1992270, 1969294, 2126648, 1894660, 1781576, 2199942, 1927936, 1676732, 2071323, 1837205]
13945A837205P9377n06212M48403j17038K10831K9610L2887m1780j71255l90908
13935A411120K22500k56997L53668N9133l01864k09679L10207l2025k9961K93717
13925A819819l42243J60393M6213Q1084k95694l140L10252n25059J76115o2728
13915A365012l7993K90418j59173J28769m0895M5469j14843J17701k94193J24383
13905A424655n8859k31916J28499R7062j51481L32140l39593N4636K49653o8601
13895A436195Q3190j30199k03036K29885L0480l92058J65197j03440l4898M30118
13885A511434J0180m47588K77353m07905L31286L2919q7926J0615k03633J18371
13875A145106O1664o8217o2227J3076O1443J3312q54k40695L6335K62174j84787
$$ y = [1837205, 1916582, 1410370, 1858773, 1741735, 1952566, 1982176, 2015063, 1973283, 1802028, 1411120, 1633620, 1376623, 1730291, 1789424, 1487560, 1277881, 1588088, 1556063, 1526102, 1819819, 1477576, 1637969, 1684182, 1765266, 1469572, 1466432, 1776684, 1251625, 1427740, 1365012, 1327019, 1617437, 1458264, 1587033, 1546138, 1591607, 1476764, 1594465, 1300272, 1424655, 1365796, 1133880, 1262379, 1359441, 1207960, 1540100, 1200507, 1255143, 1504796, 1436195, 1519385, 1389186, 1186150, 1416035, 1446515, 1054457, 1219654, 1116214, 1081316, 1511434, 1521614, 1074026, 1351379, 943474, 1274760, 1307679, 1219753, 1230368, 1026735, 1145106, 1206770, 1138553, 1076326, 1089402, 1150845, 1164157, 1163303, 922608, 958943, 1221117, 1036330]
13864A036330j69449K78449P1128l52958K87780l4328l5936J12663J02307k95567
13854A000419P3473J36178j13517q0876R1761L7575M9515k63026k663J28874K14841
13843A272554k74728L96499j75633k14348J0101l00795K33122K79076l26189J99051
13833A098710J41108l22741r0118L36316r7298k91606K03239o6090j01160M49807
13823A260167l55850p88N5696o5923j74208K64259n3364n3607j39133M59721E84720
13811E75716K08169l3807J32260k29912L36708j81268o0247r2688J47765k01729
13801F00967K47047k59932L98396l51667P0752J67141j11488N9201j28110K5839
13791G18146j55554M77002m83300J61831L19577J4647j93024k01980K77821k52304
$$ y = [1036330, 866881, 1145330, 1216458, 863500, 1151280, 1116952, 1081016, 1193679, 1295986, 1000419, 1073892, 1210070, 1096553, 1015677, 1107438, 1145013, 1194528, 931502, 928839, 1057713, 1272554, 997826, 1394325, 1218692, 1004344, 1014445, 713650, 946772, 1225848, 899659, 1098710, 1239818, 917077, 826959, 1163275, 1065977, 774371, 977610, 911520, 810360, 1260167, 904317, 903529, 959225, 893302, 719094, 983353, 929989, 876382, 737249, 1196970, 584720, 575716, 783885, 750078, 882338, 652426, 989134, 807866, 747619, 654931, 802696, 600967, 848014, 588082, 986478, 634811, 705563, 872704, 761216, 820417, 692307, 718146, 562592, 1039594, 556294, 718125, 1037702, 1052349, 859325, 657345, 935166, 682862]
13781F82862J30311J74832k12118j69204K39925r3071k04848K4866M8621R7437
13771G19613p1751L6280m7597P3732M4248k43158K63728k10848M23672k39595
13761G48324l22684M11493M0625k56967P1415j21274p6565k2645j06415l1915
13751C33392K63452M9635J43686C56461K3054K43392j67602K29336F2316O65594
13741G27910M9204j07361K09790j25143k45371K33414M0438q9303r4794L9988
13731F38772C05118L30863J84281k98745K61354l36992L82844l68074K44430k6375
13721F78704L9387N9045l29880j01210M36454r4320l7214L5750q0049j97910K59051
13710F67808j14275J30427K23654j62637k57762R9651k54135J93054l7248j61521
$$ y = [682862, 813173, 988005, 775887, 606683, 846608, 753537, 548689, 573555, 622176, 719613, 647862, 684142, 636545, 710277, 754525, 511367, 775095, 564247, 987919, 748324, 425640, 837133, 877758, 620791, 692206, 570932, 494367, 471722, 365307, 333392, 596844, 646479, 790165, 356461, 379515, 622907, 455305, 684641, 62316, 727910, 777114, 669753, 879543, 754400, 509029, 742443, 782881, 693578, 598784, 638772, 305118, 635981, 820262, 521517, 782871, 445879, 828723, 460649, 705079, 678704, 718091, 777136, 447256, 346046, 782500, 688180, 650966, 686716, 606667, 408757, 667808, 553533, 683960, 907614, 744977, 487215, 586866, 332731, 525785, 488537, 327016]
13700C27016E9398L94619J17550L6024J5769k85111P3479L45427A75194M2469
13690B17663N33446k80267K26683q115B84115L58476j99257B19547L82160A67754
13679D36531O4142O9782o4742J39892B98364M6879J61680j92361J25254L01282
13669G41098k51758P4931J48176B92363N5999N2858J32055O1148o2416j33409
13659C98598j64931L23522l8385k03522K31506K78638B91210J6403p5456N5226
13649B87383L33886k0855q9650k04005C0411M48722R3850j49562J64081m3454
13639E44048r986j16046n5654j6524J07635q2911K67736j58832j62519M65532
13629G82479B71833m3621G6502L65455J13309j39101K4592K44606o0371N437A95529
$$ y = [327016, 59398, 454017, 571567, 607591, 623360, 338249, 411728, 757155, 175194, 217663, 751109, 470842, 697525, 689410, 284115, 642591, 443334, 219547, 601707, 167754, 436531, 500673, 570455, 505713, 645605, 298364, 345243, 506923, 314562, 439816, 741098, 489340, 564271, 712447, 292363, 348362, 401220, 533275, 594423, 532007, 398598, 233667, 557189, 518804, 315282, 546788, 825426, 291210, 307613, 232157, 287383, 621269, 600414, 510764, 306759, 30411, 479133, 572983, 423421, 587502, 544048, 534062, 418016, 362362, 345838, 453473, 370562, 638298, 479466, 316947, 782479, 271833, 228212, 76502, 441957, 555266, 416165, 440757, 685363, 624992, 630429, 195529]
13617F84337r7432j35425j53685j5209K31299k08983Q4860K4435j44237J35349
13607D05309A44674K9556J73215O1539J904j53852M6371J44619L3119J57776k17812
13596D21109p2119l0449j7365j2558l9097r3759J97070A66771L64507B11473J8811
13585B30284a1165B44608I260K20165J30673j14000j09339R1454J28612K76749
13575F33574A34751J16796P3836l3944n125o6245n5538L09257j79584L7908n6568
13564B75544n5190L16666n7110Q8246B21382l6916q3051M38111k62541J27483
13554D04468j36846K35091A68105J25851j38917D5110K84951Q1415j32384j4110
13544B64982e3810D89971c6700E76787j64730k188m4750K09697A37465J42927
$$ y = [684337, 586905, 451480, 297795, 282586, 513885, 304902, 389762, 414197, 269960, 405309, 144674, 174230, 347445, 408984, 410888, 257036, 303407, 448026, 481145, 638921, 421109, 348990, 318541, 301176, 288618, 249521, 155762, 352832, 166771, 531278, 211473, 230284, -11165, 244608, 9260, 229425, 360098, 246098, 136759, 228213, 356825, 633574, 134751, 251547, 325383, 291439, 286314, 220069, 164531, 473788, 294204, 332112, 275544, 220354, 537020, 479910, 568156, 221382, 184466, 101415, 539526, 276985, 404468, 267622, 502713, 168105, 293956, 155039, 45110, 330061, 411476, 279092, 264982, -53810, 489971, -36700, 576787, 412057, 409869, 365119, 574816, 137465, 280392]
13534B80392K99708k18751n9128j26079d5850C04837j23402l9976A0254M05843
13524D16097A90762K26829m8640J39571m9436I4772K17348P8213Q1047A79300
13513B23837J56613o8354L36375B25354l7787Q7145L2489j14413J74185J7037
13503C84010o3893L1382J51275k9382j65502M1301j3962a9119C21168j50474j3232
13492A57462J6836K3955m2220K62826R3044k54424J07948j50349g5135C23920
13481I2777L55771A88213K74472j9074P7838J27223A49879L00548j9938B00709
13470D15567K5658j59963H9198Q1617J22729f434E89902k38959k6475o9310J23600
13459C78758N3984j56800l3464O3056j01959J53227R6819M852r3476E0453M0962
$$ y = [280392, 580100, 361349, 302221, 176142, -45850, 304837, 181435, 141459, 10254, 416097, 190762, 417591, 368951, 508522, 459086, 94772, 312120, 390333, 471380, 179300, 223837, 380450, 312096, 648471, 225354, 187567, 274712, 307201, 192788, 366973, 384010, 320117, 351499, 502774, 473392, 307890, 349191, 335229, -19119, 321168, 170694, 157462, 174298, 198253, 156033, 418859, 511903, 257479, 365427, 215078, -75135, 323920, 92777, 448548, 188213, 462685, 443611, 521449, 648672, 149879, 450427, 430489, 200709, 415567, 441225, 281262, 89198, 170815, 293544, -6434, 589902, 350943, 324468, 255158, 378758, 432742, 275942, 242478, 305534, 203575, 356802, 453621, 458473, 364997, 50453, 91415]
13448I1415J55212r7738M35123F8912N4023M4899m9666D703N6289J50886n7993
13437A53885F7234M59884A40450b51975B50824L89068A0534J47911p294j6335
13427A34816j2699J68653D3095K7783M78821i2068B99712J0858j52671O1478L73982
13416E93359B45312J459r535K6855q9726M4190e9714B98795M0372f7835n3628
13405a21463A07496b4476C00507L0247i643C12534l799g1579c1339C8598K22925
13394B61523A17541L09812C1112O1111J03654k8730c03j29539C16918K8811a29555
13382a99960A77715M8159O9604R581j18815n2957J46433K82744A1754K47740d4111
13370C08828J22771e4164B33136a14986B32239a32744C02528A13056J78153j30291
$$ y = [91415, 246627, 148889, 584012, 68912, 122935, 167834, 118168, 4703, 60992, 211878, 153885, 67234, 527118, 140450, -251975, 250824, 639892, 10534, 158445, 151151, 134816, 122117, 290770, 43095, 70878, 549699, -92068, 299712, 310570, 157899, 219377, 593359, 245312, 246771, 237236, 264091, 174365, 218555, -59714, 298795, 339167, -67835, -121463, 107496, -24476, 300507, 330754, -9643, 312534, 308735, -71579, -31339, 38598, 261523, 117541, 427353, 31112, 92223, 195877, 167147, -303, -129842, 316918, 345729, -129555, -199960, 177715, 225874, 295478, 305059, 186244, 133287, 279720, 562464, 11754, 259494, -44111, 308828, 431599, -54164, 233136, -114986, 232239, -132744, 302528, 113056, 291209, 160918]
13360A60918L81152j38725A25561K50374n0471a654B70817j4291D8397K27856
13350B76253J9662K83174B17412m762J66431j36818K11072A66723g0185A38520
13339A02194J70246J14811E9559B7814N84728A81525F0491a44648B13906d7235
13328A81090L989M3240J93963j37073J96868k17729A32000M18807A15903L01668
13318D17571E7859M00518j58294G8708C1369L76033L82568E189d7003A92797N2234
13307B45031D7628a53153A53619a41190A48614R8823b11719B03260e7001c035
13296A65128c2991j05913A59722G3049K11908M9077j51713j9101K07485A35224
13285e3369D4478N1038J654J84498H118Q3147A6431d3931B61311b12125N6627
$$ y = [160918, 542070, 403345, 125561, 375935, 325464, -1654, 270817, 256526, 48397, 276253, 295915, 579089, 217412, 212650, 379081, 242263, 453335, 166723, -70185, 138520, 102194, 272440, 387251, 59559, 27814, 612542, 181525, 60491, -144648, 213906, -47235, 181090, 185079, 228319, 422282, 285209, 482077, 264348, 132000, 550807, 115903, 417571, 57859, 458377, 300083, 78708, 31369, 407402, 789970, 5189, -47003, 192797, 245031, 47628, -153153, 153619, -141190, 148614, 247437, -211719, 203260, -57001, -3035, 165128, -32991, -138904, 159722, 73049, 284957, 334034, 182321, 163220, 370705, 135224, -53369, 44478, 95516, 97170, 281668, 8118, 91265, 16431, -43931, 261311, -212125, -155498]
13274a55498F8707Q5944J49987J10738J51376D1852Q0819J51545m7570J796g3931
13262B84842r9616a81A20784b8179J2610B84124a00481A26183K6610K37839G981
13250H8243N9934j3811O9722a78646D09739j83636K35960A29430K1245P6064j5799
13239B10940j01503b51443A07198J74582K18013h6138B1628J32547E1011L1550
13229H2561K24138K4102G2759J93652N1209N066q1018f1447n398B0139a82618
13217B81020p3308N130G5986A7741L76030a34402A20080e3144A52262l6259i8668
13205A34090M2367a61473A89290G6869K44281p937j35342K781K2477B7587b253
13193B6490K65173p3438A02012N2843a61330C9185K52590f9388B0385k465O0046
$$ y = [-155498, 68707, 154651, 304638, 415376, 566752, 41852, 122671, 274216, 226646, 228442, -73931, 284842, 185226, -181, 120784, -28179, -15569, 284124, -100481, 126183, 152793, 390632, 7981, 88243, 148177, 134366, 204088, -178646, 409739, 226103, 462063, 129430, 150675, 226739, 210940, 109437, -251443, 107198, 281780, 499793, -86138, 21628, 154175, 51011, 82561, 306699, 330801, 72759, 266411, 317620, 322686, 241668, -61447, -66845, 20139, -182618, 281020, 207712, 212842, 75986, 17741, 393771, -134402, 120080, -53144, 152262, 116003, -98668, 134090, 176457, -161473, 189290, 76869, 321150, 313213, 177871, 180652, 203129, 27587, -2253, 26490, 291663, 218225, 102012, 154855, -161330, 39185, 291775, -69388, 20385, 17920, 77966]
13182G7966b8842I7615a69395B51845a5438H751K60949m4112J30746j09006b5355
13170A13252l8243j369M4750m5938k4870L80861E393f6083p0372B13868K20752
13159D34620j91141b7070A53756a08514K9595j10507B15635a81602E4085k6571
13149B7514J37463b5194C99239j57883c67119A30616O3666j0828N6387j6922p9765
13138A43154E9508b60136I627a90281e9047B70542F3714J55254N5706L0475R1928
13127C97077A20628i9507A18446J95270j12649Q2646d7663A51229c42442A96204
13116C15444a07357G0358j7243J27149L51038b82816A4187O4372c8164B21303
13105A11903j7236a02451B8001O0059a32841H7918d3160k08007H835J91440e2971
$$ y = [77966, -28842, 97615, -169395, 251845, -15438, 8751, 269700, 225588, 356334, 247328, -25355, 113252, 75009, 73640, 118390, 72452, 47582, 428443, 5393, -66083, -136455, 213868, 434620, 243479, -27070, 153756, -108514, -78919, -189426, 215635, -181602, 54085, 27514, 164977, -25194, 399239, 241356, -367119, 130616, 194282, 183454, 239841, 222919, 143154, 59508, -260136, 9627, -190281, -59047, 270542, 63714, 218968, 274674, 305149, 397077, 120628, -99507, 118446, 313716, 201067, 283713, -47663, 151229, -342442, 196204, 315444, -107357, 70358, 53115, 180264, 531302, -282816, 14187, 78559, -38164, 221303, 111903, 94667, -102451, 28001, 88060, -132841, 87918, -43160, -251167, 8835, 200275, -52971]
13093D0801c6961k24894H3227e0224D19447A46890P4753G5883e0093A26029b82714
13081B24814P8946a28495k453k1681C12803G0368b372B36451a66724B82057C5733
13069d5579J5584Q647B40007E7155L2170g7324L2924A67641K57215A3858K94799
13058C08657A47918a42447F4914g3439I0491K41186A30227D119J94585c168C85196
13046H7895b5217A04556n803E079N7085a84271R0220A82827a88465C48879a74035
13034E6520a02494a8235C84316K2944p9624d180A55143J7506b54763A06096R8342
13023B04438J2105r7029E2978r858a86692Q9746A14214E5472Q8023n8305M14704
13012D99894j18554a78625G842J21336i65C28631k1129I7617i4934A55232f9635
$$ y = [40801, -36961, -261855, 83227, -50224, 419447, 146890, 221643, 75883, -50093, 126029, -282714, 224814, 303760, -128495, -130948, -152629, 312803, 70368, -2372, 236451, -166724, 282057, 35733, -45579, -29995, -21348, 240007, 57155, 89325, -77324, -44400, 167641, 424856, 13858, 308657, 147918, -142447, 64914, -73439, 90491, 331677, 130227, 4119, 198704, -3168, 385196, 87895, -25217, 104556, 98753, 5079, 62164, -184271, -94051, 182827, -188465, 348879, -174035, 56520, -102494, -18235, 384316, 407260, 327636, -4180, 155143, 172649, -254763, 106096, 204438, 216543, 119514, 52978, 43120, -186692, -96946, 114214, 55472, 143495, 85190, 499894, 381340, -178625, 7842, 129178, -965, 328631, 307502, 97617, -94934, 155232, -69635]
13000A28731R4411c1436p3217a3196p7403H7461J1210J2050K7705J04136q6805
12989A55757n8397J6186n2536a29007L5467A11926e0983A40237l9009P6139Q6233
12978B63600r935j07184k0273N4269q3181j3245b26591J01166A60208i5969I3655
12966D7032d7129A64984a04856A03220m9618Q8281F0414L19168k5549i9106C14184
12954i3424B61591f6490K9063C89669f2541l4312a9554A4853d08044J27023H4015
12942D8476L42542A32898g3292F9799a78891m1092B47146b72428C84641A43675
12931c715A7713J17160c1870A21510h7835A01892J13621d7562F9938a01452B05532
12919B0295a07042A93407b5680j62247D29761a29294D7736P747b07355G8282l7044
$$ y = [128731, 223142, -31436, -104653, -13196, -90599, 87461, 98671, 110721, 138426, 242562, 155757, 97360, 113546, 61010, -129007, -93540, 111926, -50983, 140237, 101228, 177367, 263600, 253665, 146481, 126208, 180477, 97296, 84051, -226591, -125425, 160208, -95969, 93655, 47032, -47129, 164984, -104856, 103220, 53602, 141883, 60414, 379582, 354033, -99106, 314184, -93424, 261591, -66490, -37427, 389669, -62541, -96853, -19554, 14853, -408044, -281021, 84015, 48476, 391018, 132898, -73292, 69799, -178891, -219983, 247146, -272428, 384641, 143675, -3715, 17713, 134873, -31870, 121510, -87835, 101892, 215513, -47562, 69938, -101452, 205532, 20295, -107042, 193407, -25680, -187927, 429761, -129294, 47736, 55483, -207355, 78282, 41238]
12908D1238O521P1665f9322l90735I4090J067b0234j85940c95j92108A32125n9566
12896G2559J1395m0537K01597b34914A97732n4141j6739K33676G5732J29476j142
12885B04066o4482J219a12563o9019f7291p7109G747M812c55652q6342h2945o557
12873h9502I8536d2218E8467J34077a68777F2250a35386B3050a33193e4291D5337
12861B07843C6828K22852e2263K1214D59050A4853M0201b2783j05443G4380L77083
12850D51463A54295g0064H4922a6039l2883j29437A34882E0035f8534A02833J74285
12839B77118h818B0703j197K2681L3979L3860Q3394J33845C9664J0050a65584
12827c48693I3604O6882o7404A1440N7972K8253i5759B2616K77833r8089K8817
$$ y = [41238, 47759, 119424, -69322, -460057, 94090, 95157, -20234, -206174, -395, -192503, 132125, 72559, 83954, 43417, 245014, -234914, 197732, 143591, 126852, 360528, 75732, 205208, 204066, 139584, 140803, -112563, -181582, -67291, -144400, 7747, 12559, -355652, -441994, -82945, -89502, 98536, -42218, 58467, 192544, -168777, 62250, -135386, 23050, -133193, -54291, 45337, 207843, 36828, 259680, -52263, -31049, 459050, 14853, 55054, -22783, -128226, 74380, 451463, 154295, -70064, 84922, -16039, -48922, -178359, 134882, 50035, -68534, 102833, 277118, -8818, 20703, 19506, 42187, 76166, 110026, 193420, 327265, 39664, 49714, -165584, -348693, 93604, 160486, 93082, 11440, 69412, 97665, -95759, 22616, 300449, 202360, 231177]
12816B31177b34272A13664a01265B88765A610d5241k48686B73064q8572b05227
12805C96977h2893l462j7378D2606K94689a19668A85586d907B56807P4952j43984
12794A87775h0365n5515B70818e5843n6152j13426L2344A59833O2575R2261H7188
12782B27179q0054H853i4290F0290J91846g9751e124m6180J2320A85602K28833
12771D14435a16552A64244J57278B4335L0747K3833P1720K86933a3673A41298
12760c11978Q252c2231A66266d03693a46804N0783J506B78235c69954b341C8950
12748a13142j27251A73724P3857a88059j02597A21741D7623J31062K43252B05585
12737H3134J93285M6125K9372j30071a76170c8246A8826b31328Q3439q457r8651
$$ y = [231177, -234272, 113664, -101265, 288765, 1610, -45241, -293927, 273064, 184492, -205227, 396977, -82893, -86355, -103733, 42606, 337295, -119668, 185586, -4907, 256807, 331759, 187775, -80365, -135880, 270818, -55843, -111995, -225421, -193077, 159833, 222408, 314669, 87188, 227179, 147125, 8853, -94290, 60290, 252136, -79751, -5124, -51304, -38984, 185602, 414435, -116552, 164244, 321522, 24335, 55082, 78915, 150635, 437568, -13673, 141298, -311978, -303726, -32231, 166266, -403693, -146804, -96021, -94515, 278235, -369954, -2341, 38950, -113142, -240393, 173724, 247581, -188059, -290656, 121741, 47623, 178685, 421937, 205585, 83134, 276419, 322544, 351916, 221845, -176170, -38246, 18826, -231328, -147889, -156346, -254997]
12726b54997p9383A30769J48377j27527L3133J358l9977E2995b17324L7515Q3051
12715i6758A89809b06385C51716E2539M07305A79522n7039J01072r9845K30335
12705C54045A125J16365h9301A82358J93247i152k89225a16143A29454R6346f6049
12693C17617B7340a30785B16827a08703B53199B3204K15093r9966A6984e82B0616
12681b87934e5917k2679B43962l2835g9794b4997A87808K7100k3386k1699a09212
12669a54605B40395p6315e9097I6475J97629f3525D6505J6242a16334B34551K5990
12658B60541I4820c4786C41104E9691J53843P9534a23216C95396b5533A43425
12647c4910f954k9572J702G2590g5209F3210K10962a8943o4113A19680P2221E5044
$$ y = [-254997, -334380, 130769, 279146, 151619, 184752, 186110, 146133, 52995, -217324, -179809, -96758, 189809, -206385, 351716, 52539, 459844, 179522, 122483, 223555, 123710, 354045, 1125, 117490, -89301, 182358, 375605, -9152, -298377, -116143, 129454, 225800, -66049, 317617, 27340, -130785, 216827, -108703, 253199, 23204, 238297, 138331, 16984, -582, 20616, -287934, -55917, -78596, 243962, 211127, -79794, -24997, 187808, 214908, 191522, 169823, -109212, -154605, 240395, 164080, -59097, 96475, 294104, -63525, 46505, 62747, -116334, 234551, 260541, 94820, -34786, 341104, 59691, 213534, 293068, -123216, 395396, -25533, 143425, -34910, -6954, -36526, -34824, 72590, -75209, 63210, 274172, -18943, -83056, 119680, 191901, 55044]
12634d3274D0831a12444j52164b3212B83198R5033c603A95469a562A2649d7473
12622A95637I3087c3237C37756J1622M29d2793k67560A34560d9133j10650r82
12611a60765A73653a14579E40763k20160b94477B52528J4633b62549a05486G2351
12600A59692M0089Q3790A24414c6228A8401d4729B32727P6973a46823l861j24236
12589b74920G5931a46440c6150B37075a5669B98955D7230J67931H1342J08437
12579A89779a51661A53815k0101D1098i7438q9499A54449K42599B5754K432c49298
12567b17759D88911a48815m3145A49264a60310A89247h6282A71700o3761a29493
12556E6578b8221A61770k2839a11546G2947M007a8932m23131B43346D3616A1831
$$ y = [-43274, 40831, -112444, -264608, -23212, 283198, 378231, -3603, 195469, -1562, 12649, -47473, 195637, 93087, -33237, 337756, 349378, 349807, -42793, -310353, 134560, -49133, -159783, -160765, 173653, -114579, 540763, 320603, -294477, 252528, 267161, -262549, -105486, 72351, 159692, 199781, 283571, 124414, -36228, 18401, -44729, 232727, 309700, -146823, -150684, -274920, 75931, -146440, -36150, 237075, -15669, 298955, 47230, 215161, 81342, 189779, -151661, 153815, 133714, 41098, -97438, -186937, 154449, 397048, 25754, 28186, -349298, -217759, 488911, -148815, -191960, 149264, -160310, 189247, -86282, 171700, 107939, -129493, 56578, -28221, 161770, 138931, -111546, 72947, 76954, -18932, -442063, 243346, 43616, 11831]
12544A70513A7875h9919b0417j69674H4844J15623K79561r4438h8971A99335p16
12533A98619i9827a1386C2389J60466b32230J06776a4442j1333k77423i5551A83134
12521a9667m4386b5320H305a85389K9939C9635c3541A70100o05b19865j81878
12510d01743A91242k4759a1510F5435K25792a5869A29891a78036B61329a40542
12499A02202Q2150L422P8324K5665H5833J46332R6123C5603J60665L283h3360
12487b32900A75401F8799B5268a0457A218d6637B6159b667o7744q1672B03635
12475b9338A42887a85828G9972c15737f0064l9836m7843b9060I7072a54928B51041
12463B47552b42862A68783h8786A02426a26880L372M6554D8491b5126A88445j2391
$$ y = [170513, 17875, -89919, -20417, -190091, 84844, 200467, 480028, 385590, -88971, 199335, 198619, -99827, -11386, 32389, 192855, -232230, -125454, -14442, -25775, -303198, -95551, 183134, -19667, -64053, -25320, 8305, -185389, -155450, 39635, -33541, 170100, 169495, -219865, -401743, 191242, 166483, -11510, 65435, 291227, -15869, 129891, -178036, 261329, -140542, 102202, 184352, 187774, 266098, 291763, 85833, 232165, 328288, 35603, 196268, 199551, -83360, -232900, 175401, 68799, 25268, -10457, 1218, -46637, 26159, -2667, -70411, -152083, 203635, -29338, 142887, -185828, 79972, -315737, -60064, -99900, -147743, -29060, 97072, -154928, 251041, 247552, -242862, 168783, -88786, 102426, -126880, -123508, -76954, 48491, -25126, 188445, 176054]
12452A76054m9331K61705p3537J3876b99307F5806G566b59785B29853A8429c31257
12440d4655k71051B84145e7656E3638b3612E9873b30711O7522I6332J21344j00214
12429A17462a17894A76955d1610j0171j5572C31984A08690a15281H0082K7263
12419A07345k1999K6590g158m41257A72200b12802f8449D5494J35467H2645J78761
12408B61406c7722G6356b64656a19870a7778B68725f7073c3101j35131H3986j4529
12397F9457a8849m8082D909e3211k58136A42392i1986a09A3766a1898B9316J20265
12385A49581b57288E4595b0208l78021A30288c63825h1158j09067D5439J11105
12375A56544D1946K28034m4732a14187n4890A04775f3382E7115J83867h1715B59795
$$ y = [176054, 126723, 388428, 314891, 328767, -299307, 65806, 7566, -259785, 229853, 18429, -331257, -44655, -315706, 284145, -57656, 53638, -23612, 59873, -230711, -163189, 96332, 217676, 117462, -117894, 176955, -41610, -51781, -67353, 331984, 108690, -115281, 80082, 107345, 85346, 111936, -7158, -448415, 172200, -212802, -68449, 45494, 180961, 82645, 261406, -37722, 76356, -264656, -119870, -17778, 268725, -67073, -33101, -168232, 83986, 69457, -18849, -66931, 4909, -53211, -311347, 142392, -91986, -109, 13766, -11898, 29316, 149581, -257288, 54595, -20208, -398229, 130288, -363825, -81158, -190225, 45439, 156544, 41946, 269980, 225248, -114187, -169077, 104775, -63382, 57115, 240982, -81715, 259795]
12363b93420B95048A23558d5863A47396a86917a7630g220l05374h7849r2591A21851
12351A93662a09510j23289A36864M5874D3664l981f5843H0217j4798f518B81877
12339a31455C608J33179a89734A08534a36194G9854K97925f8563K9211A74228
12328b68448D7240J03509P7362b51471K7374G0040a49340j87225a43521E327L5285
12317D0612R687L9927Q6695d39754A80613g1310m1615I7744J32182n1956q4787
12306I3183a59326D0603a17012L0952A14943J37058A18083K56093I0487e4114
12295b25574h2884A48093a41940D69967A50947m2086L1784b54342a09915c3996
12284c4901A47588a02361m427A46064h670A42871c73935D22290n5033A45872M0679
$$ y = [-293420, 295048, 123558, -45863, 147396, -186917, -17630, -7220, -312594, -87849, -180440, 121851, 193662, -109510, -232799, 136864, 182738, 43664, 39683, -65843, 80217, 65419, -6518, 281877, -131455, 3608, 136787, -189734, 108534, -136194, 79854, 377779, -68563, -39352, 174228, -268448, 47240, 150749, 228111, -251471, -224097, 70040, -149340, -336565, -143521, 5327, 40612, 50299, 90226, 176921, -439754, 180613, -71310, -112925, 97744, 229926, 177970, 93183, -159326, 40603, -117012, -86060, 114943, 252001, 118083, 374176, 90487, -54114, -225574, -82884, 148093, -141940, 469967, 150947, 108861, 140645, -254342, -109915, -33996, -34901, 147588, -102361, -106788, 146064, -8670, 142871, -373935, 422290, 367257, 145872, 186551]
12273A86551j2515R7392K8337p5887a88800B86113A39412J6679b80428D0239K58742
12262B98981E2525J9177c8689B33346j13004a77480a7518k18977D7002K65231
12252C12233H0739b36973C967J61064Q2808f0475C19941q7442f5919B48987n8685
12241A90302a2018B54573b9301C24306I6124A4281J62985b52433H2540d1699j2856
12230e4555k02865B62055J36501N2067k05040K1063c052C38802J82230g3686C48093
12218B45847e8294A42574K30951a5444l074A81359E8085c1003A13571a1847A89546
12206B71596A26909J6474E6023K83308j28060i3392A32546K38554R4327m3633
12196D21794j38861H7861R1300g8664b3125B09736J89162C4169P2975i8648A22910
$$ y = [186551, 174036, 271428, 299765, 223878, -188800, 286113, 139412, 156091, -280428, 40239, 298981, 52525, 71702, -38689, 233346, 120342, -177480, -17518, -236495, 47002, 312233, 80739, -236973, 3967, 165031, 247839, -60475, 319941, 232499, -65919, 248987, 190302, -12018, 254573, -29301, 324306, 96124, 14281, 177266, -252433, 82540, -41699, -54555, -257420, 262055, 398556, 450623, 245583, 266646, -3052, 338802, 521032, -73686, 348093, 245847, -58294, 142574, 373525, -15444, -18518, 181359, 58085, -31003, 113571, -11847, 189546, 271596, 126909, 143383, 56023, 339331, 211271, -93392, 132546, 371100, 465427, 421794, 282933, 87861, 179161, -78664, -23125, 209736, 398898, 34169, 107144, -98648, 122910]
12184A8183J03669D4474J09600a87696A97440I8495J4095m2099a15178B82620
12173d0561A60363a6397B85141A27833e8084b113j67470c0915A25649J01286D3362
12161i867j73973p8970J29267B81670k8532r5886p0907L7227J80224D0281J16587
12150A56868B1149K35633g128A06048K18421a50841F8181k4431b44318I768K2120
12139C1888J51286D5876B0958J13858a77574a123l60901A98734d7664A87763a095
12127C03066m9312c5295k04179B17423e6526m8843B12767H5329J05215e7442A4413
12115A94495a38934A29316B3358p297a76854D9649e40100b17340A54465i6424
12104D00959a18875o5706c8472A0139M5863K05384b33502j9003p1716g2665r8063
$$ y = [18183, 121852, 44474, 154074, -187696, 197440, 98495, 112590, 70491, -115178, 282620, -40561, 160363, -16397, 285141, 127833, -58084, -2113, -169583, -30915, 125649, 226935, 43362, -9867, -183840, -262810, -133543, 281670, 253138, 157252, 86345, 123572, 303796, 40281, 156868, 21149, 256782, -7128, 106048, 324469, -150841, 68181, 43750, -244318, 9768, 31888, 183174, 45876, 20958, 134816, -177574, -1123, -362024, 198734, -47664, 187763, -1095, 303066, 253754, -35295, -239474, 217423, -56526, -105369, 212767, 85329, 190544, -57442, 14413, 194495, -138934, 129316, 23358, 16061, -176854, 49649, -540100, -217340, 154465, -96424, 400959, -118875, -184581, -38472, 10139, 56002, 261386, -233502, -252505, -324221, -72665, -170728]
12093a70728I6939k2819K86563c06787P1611J11164q0329J01635G0609g2197D2650
12081A86093L09032J117168O22242A103965C60394i183A10597b1408n3619r0995
12071a66022A671Q367e3099A92600D1154N657b05812A3032J27930J69036J0495
12060C20493a42607B01278c07008N7634k02496E3287K4955K24745E9490J49931
12050B09421N416f4002k07137a2861D66686B6435a7568o6512A11394N508a64649
12038A60234J99695J3596B0335M2273O9990c52340I867a56122A19903b63315f1226
12026a10682q3715i0844L4194j30030A13807b50719R0549C2894M50480B15573
12015A3144L1481L15216B2192J82380b3835B36990i4878j14524A57345b09286
$$ y = [-170728, 96939, 74120, 360683, -306787, -235176, -124012, -204341, -102706, 70609, -72197, 42650, 186093, 495125, 1612293, 2234535, 1103965, 360394, -9183, 110597, -21408, -75027, -166022, 1671, 10038, -53099, 192600, 41154, 46811, -205812, 13032, 140962, 309998, 320493, -142607, 201278, -307008, -249374, -451870, 53287, 78242, 302987, 59490, 209421, 214837, -64002, -271139, -12861, 466686, 26435, -17568, -84080, 111394, 116902, -164649, 160234, 359929, 373525, 20335, 62608, 132598, -352340, 9867, -156122, 119903, -263315, -61226, -110682, -194397, -90844, -56650, -186680, 113807, -250719, -160170, 32894, 483374, 215573, 13144, 44625, 359841, 22192, 204572, -23835, 236990, -94878, -209402, 157345, -209286]
12004C23587c67124A66604g1572j34908a00696j16464P2979f5239j60860F715
11993c3648A43112k9849d07977c0461j55627L2953M6241L6825C5495J06568A6511
11981c77936h6181b9336m049i643j60570N2819A63072a94201f8626n737A69850
11969B38599A16016e9209j86306B98120B958b26231b7794j3857A70440c92065
11958a67401P8203B85215C7274h2037A83284a49523j40044A29072C5897J59678
11948A95575b49681M3921p5687A34513J08280j00012K6096a02613A70262O3338
11938B33600a04420E9328b3025A16614n905a2956L356l6798E9822B2462a24550
11926c25700f8600D7145J29665b28828B85733c0459j9940C49976b2599j8393H8549
$$ y = [323587, -367124, 166604, -71572, -206480, -100696, -217160, -144181, -65239, -226099, 6715, -33648, 143112, 113263, -407977, -30461, -186088, -153135, -106894, -70069, 35495, 142063, 16511, -377936, -86181, -29336, -33385, -9643, -170213, -117394, 163072, -194201, -68626, -74363, 169850, 238599, 116016, -59209, -245515, 298120, 2958, -226231, -27794, -41651, 170440, -392065, -167401, -89198, 285215, 37274, -82037, 183284, -149523, -289567, 129072, 35897, 195575, -249681, -205760, -281447, 134513, 242793, 142781, 168877, -102613, 170262, 233600, -104420, 59328, -23025, 116614, 110709, -12956, -9600, -46398, 59822, 22462, -124550, -325700, -68600, 47145, 176810, -228828, 285733, -30459, -50399, 349976, -22599, -40992, 88549]
11914B33876b61074a12479a7597c179A51861d0414q8353j91360G8555K45373E8614
11902A7406c9204A07633g1897k82139a43239A6110J94707I99L45593c21372f9783
11890h5164A41687k7930d5913k10632R5778d944p1188B013a74818B81603r1961
11879A89642a82314m7674h9647j53827J0735n3260D5798a4945j43760b9871l72069
11868d01940J36301e1112k2704k1782B44057C0854c5870j00806q6826B31616J05688
11857C37304G015e5324j21061f0937K2509l6540A45290a18660A4768b0940k2966
11846d3906O670A14292B2453K25623h2445D09612d8388A47944f9490k31760m2603
11835c43853A33114D4814b38063N0856A44504b03467A25407n3978g7107C47675
$$ y = [233876, -261074, -112479, -17597, -3179, 151861, -40414, -128767, -320127, 78555, 323928, 58614, 17406, -39204, 107633, -71897, -354036, -143239, 16110, 210817, 999, 346592, -321372, -69783, -85164, 141687, 113757, -45913, -256545, -160767, -4944, -76132, 2013, -174818, 281603, 189642, -182314, -229988, -89647, -243474, -232739, -285999, 45798, -14945, -158705, -29871, -401940, -265639, -51112, -73816, -95598, 244057, 30854, -35870, -136676, -223502, 231616, 337304, 7015, -55324, -176385, -60937, -38428, -74968, 145290, -118660, 14768, -20940, -43906, -37236, 114292, 22453, 248076, -82445, 409612, -48388, 147944, -69490, -301250, -343853, 133114, 44814, -238063, -187207, 144504, -203467, 125407, 71429, -77107, 347675]
11824b05475E4954O0317R1416F4978K2053A313N0450Q3196d9579m0839A02639
11812A04058e0837k54172d4475j86767C1390K47846C0665K16604a89263A32140
11801A88566A6290c73883a6348l22885A7262L5218a04938q387F7571Q0028d2769
11789a33995j48184L8851E9555J24956n3628C976c7245r9915C39962j59138b38054
11777E6981M9570b55986B07863a99818j29619a01702O755j47319c2079n4254j00481
11766a86814Q9946a4083m2843H2296K6422b60613A30008J65730a1161j55080A49425
11754A71511C4006a62998j28280B33822o7934J00248f9368D01672a33670j18292
11744b51962g9988o6643j58216a36595E8370b7987A73814A3486b55493A36821
$$ y = [-205475, 54954, 115271, 206687, 64978, 87031, 1313, 51763, 134959, -49579, -90418, 102639, 104058, -50837, -305009, -44475, -231242, 31390, 279236, 30665, 247269, -189263, 132140, 188566, 16290, -373883, -16348, -339233, 17262, 52480, -104938, -113325, 67571, 147599, -42769, -133995, -282179, -243328, 59555, 184511, 130883, 3976, -37245, -137160, 339962, 180824, -238054, 56981, 106551, -255986, 207863, -199818, -329437, -101702, -94947, -242266, -32079, -86333, -186814, -96868, -14083, -56926, 82296, 108718, -260613, 130008, 295738, -11161, -166241, 149425, 171511, 34006, -162998, -291278, 233822, 165888, 266136, -69368, 401672, -133670, -251962, -79988, -146631, -304847, -136595, 58370, -27987, 173814, 13486, -255493, 136821]
11733a69026q986A67560J38634a87775L6212G9381J0013e2425m753B92541J1571
11722C04112a54960A47279a35734A10918b40884A26162E7434c5055A30572b4222
11711b49808C5166b54702O0887A58235a89167B3980O9481m3276b64702I1741b03337
11699b60030A27798c9630o2390b7150B10795a56738F15121A81085L35629B7570
11688B18190i4553j20810O1187j49710A10811J62728a39180q886G9179N0288b1690
11676A7206a53395L8646l30160B08143J16002A9974K05544F3496b85109A18105
11665A61044E9830c07649a0313A25107a24427j68087I8728A8710b01444C85826
11654A83663J9301j565B5333K71822b08937C1735K04149M0830A16536c3202k81893
$$ y = [-169026, -178012, 167560, 306194, -187775, -151563, 79381, 89394, -52425, -57178, 292541, 304112, -154960, 147279, -135734, 110918, -240884, 126162, 57434, -35055, 130572, -24222, -249808, 35166, -254702, -193815, 158235, -189167, 23980, 93461, 50185, -264702, 91741, -203337, -260030, 127798, -39630, -102020, -27150, 210795, -156738, 615121, 181085, 516714, 27570, 218190, -94553, -215363, -154176, -303886, 110811, 273539, -139180, -148066, 79179, 129467, -21690, 17206, -153395, -114749, -444909, 208143, 324145, 19974, 225518, 63496, -285109, 118105, 161044, 59830, -307649, -10313, 125107, -124427, -292514, 98728, 18710, -201444, 385826, 183663, 202964, 201399, 25333, 297155, -208937, 31735, 235884, 276714, 116536, -33202, -315095]
11643c15095B65117G1457c124k12192H3044a27849B15213e1556A75795g7305D30748
11631E9481P3347k6922b85410H8543P3422J46396b49914A03408D7236d6419D564
11619B01612K87329B05061F1084a86448P7392H0168c00127D34476o1244b7500
11608B43318E4126O8342a51156O667B26993o2420h629n6870j40153O7998i388
11596A16024M281J30020G5188M0523a98845E7350J41586H7064l347J33595J30033
11585C47345g5328A51159d3916A24246f895B80144d5440G940J86323m0873a32433
11573A32574K6844J30803j6498I1441m3800c44589i0713A14032C4868N6912L3987
11562A25767g8090D7964a44412G3013l0715J57083j9821A6999L36406A68199F6331
$$ y = [-315095, 265117, 71457, -3124, -215316, 83044, -127849, 215213, -51556, 175795, -77305, 430748, 59481, 132828, 105906, -285410, 88543, 161965, 308361, -249914, 103408, 47236, -46419, 4564, 201612, 488941, 205061, 61084, -186448, -109056, 80168, -300127, 434476, 373232, -27500, 243318, 54126, 122468, -151156, -144489, 226993, 164573, -8629, -65499, -205652, -137654, -9388, 116024, 120305, 250325, 75188, 115711, -198845, 57350, 198936, 87064, 83717, 217312, 347345, -75328, 151159, -43916, 124246, -6895, 280144, -45440, 7940, 194263, 153390, -132433, 132574, 159418, 290221, 273723, 91441, 47641, -344589, -90713, 114032, 34868, 91780, 125767, -78090, 47964, -144412, 73013, 42298, 199381, 179560, 16999, 353405, 168199, 66331]
11550b51985I2077k1589c57A05172A2617b33592G5256K52145A56425l2124Q7900
11539B12201p2480J11192O1634q1172b06210C39428j03624K92474a60422B16044
11528a33700b2807A54725B6427J37439C5183M11651F3967j6423M9206a43368O2385
11517h0983j31035D46029C1935J5643K77784b49498A53803j9602b5608E7425A9766
11505D70295e4295l39935a23742a088b33A80756F5403N7070h3905A96861b38786
11493B27811a34255I4486a03117B77197a20908B52131e8210A86466h1842A64272
11482B29064M1078A18479a07587j76875B8221J05569b833I5556J76572E4771M0445
11471I5216b333D06847j32993E131L11035j38583q7691o415J26896B4943a16856
$$ y = [-251985, 92077, 70488, -357, 105172, 12617, -233592, 75256, 327401, 156425, 124301, 212201, 139721, 250913, 312547, 231375, -206210, 339428, 235804, 528278, -160422, 216044, -133700, -22807, 154725, 26427, 163866, 35183, 446834, 63967, 47544, 96750, -143368, -80983, -212018, 446029, 31935, 47578, 325362, -249498, 153803, 134201, -25608, 57425, 19766, 470295, -54295, -394230, -123742, -1088, -233, 180756, 65403, 122473, -83905, 196861, -238786, 227811, -134255, 94486, -103117, 277197, -120908, 252131, -58210, 186466, -81842, 164272, 229064, 270142, 118479, -107587, -284462, 28221, 133790, -2833, 95556, 272128, 54771, 95216, -2333, 406847, 273854, 5131, 316166, 177583, 89892, 83477, 210373, 24943, -116856]
11459e6756D82833A69671I398P8609M5954M0242D470R1870j9092a1206A21166
11447c2418C64471d7297C9670L00501j62794a16293C322Q164K31491J13860e4886
11435D6229K3882J25066a47011c3785d734C55530b73022G6402a98714b2193D7674
11423C03035a42258r6701A20560l2162A0293M19566f1589A70388a79422C77483
11412C4438g9267r438I2473A6402h7712B0834J53066d8902I8013K63551F5057
11400f8052C51760j37883q9652n4387M2669J29447F3231R4694j5729J9027b94455
11388A25524R3182D8244a81439g0031q4499E0311A1694b87056J15372B83399a71342
11376b16593A72092B3960N2015D037L44336G4420e9947A6632L22N08010a84919
$$ y = [-56756, 482833, 169671, 9398, 88007, 133961, 174203, 4470, 96340, 77248, -11206, 121166, -32418, 364471, -47297, 39670, 340171, 177377, -116293, 3322, 11486, 242977, 356837, -54886, 46229, 70111, 195177, -147011, -33785, -4734, 355530, -273022, 76402, -198714, -22193, 47674, 303035, -142258, -238959, 120560, 88398, 10293, 429859, -61589, 170388, -179422, 377483, 34438, -79267, -88705, 92473, 16402, -87712, 20834, 173900, -48902, 98013, 361564, 65057, -68052, 351760, 213877, 124225, 69838, 112507, 241954, 63231, 157925, 142196, 161223, -294455, 125524, 218706, 48244, -181439, -70031, -154530, 50311, 11694, -287056, -171684, 283399, -171342, -216593, 172092, 23960, 75975, 4037, 348373, 74420, -59947, 16632, 16954, 524964, -184919]
11364c0332l118j45975d2146l4111j5667B43874g7232B0820M435K26320a2785
11352b35945a02277b877j18420D5226d26787C8703h6166g107B53648a66709j86248
11341c52957B40106j1021F1816i069A03224C0182a21992j31856L2607j12462A99712
11329A95336G3058e0866j69362Q8778C56450A15952a4093j58692k21848A76923
11318g4071o5678l1432H9617C7521J24634b89890A62363c16428J57970A30670
11307A62017Q4770O7979a54617I7405c92407A11511C3364A568J89650l7416b67946
11295C2184e0614q1710A2369J20597J5576p1361P2210E108K21561d3541A02303
11283I867Q6376K65332A21851J02588l4380I560b21568j32868G2022f2792D2230
$$ y = [-30332, -33450, -179425, -42146, -76257, -91924, 243874, -77232, 20820, 25255, 251575, -12785, -235945, -102277, -2877, -121297, 45226, -426787, 38703, -86166, -7107, 253648, -166709, -352957, 240106, 229085, 61816, -9069, 103224, 30182, -121992, -253848, -221241, -333703, 199712, 195336, 73058, -50866, -220228, -131450, 356450, 115952, -14093, -172785, -394633, 176923, -74071, -139749, -171181, 89617, 37521, 162155, -289890, 162363, -316428, -158458, 130670, 162017, 246787, 314766, -154617, 97405, -392407, 111511, 33364, 1568, 191218, 153802, -267946, 32184, -50614, -132324, 12369, 132966, 148542, 77181, 149391, 5108, 226669, -43541, 102303, 9867, 96243, 361575, 121851, 224439, 190059, 9560, -221568, -354436, 72022, -62792, 42230]
11271A77697a28244a6766A33983R9602A5592o239J21165b54945a7582C9423b73860
11259B41223E992a73828O6673k00078A480c2720A3624M20318d8987C3055L6288
11248F9343i3053l00474i3345A35921B4750g8840i877j64583j46874Q7790E139
11236a21209A6050g2640Q905F4689a23842A528b6419j68773i4371j95310n4024
11225c43705f1690J1365j86847E4232a34946A9162c10409Q7419D47664g0323A46040
11213d40292b04159m4527O2157l3087J02169H6465b09999i7260j50771a2213j14019
11202a26232B72761E5809a67724k756j052B40501e0987A73273h0329j20326c0515
11190E5333k5602c9860B63866a69848H3601c92n36642E5962J74742A2072h7783
$$ y = [177697, -128244, -16766, 133983, 233585, 15592, 9353, 130518, -254945, -17582, 39423, -273860, 241223, 5992, -173828, -107155, -307233, 1480, -32720, 13624, 433942, -48987, 33055, 69343, -93053, -393527, -93345, 135921, 24750, -78840, -9877, -174460, -321334, -233544, 5139, -121209, 16050, -72640, -63735, 64689, -123842, 1528, -26419, -195192, -94371, -289681, -343705, -61690, -50325, -237172, 54232, -134946, 19162, -310409, -222990, 447664, -70323, 146040, -440292, -204159, -248686, -186529, -219616, -117447, 86465, -209999, -97260, -248031, -12213, -126232, 272761, 55809, -167724, -170480, -171532, 240501, -50987, 173273, -80329, -200655, -30515, 55333, 29731, -39860, 263866, -169848, 83601, -392, -537034, 55962, 230704, 12072, -87783]
11178A18005c0091p3142P686B03880J27875H7389a54196r6384B06657B3753c7338
11166c5184F2874A8403b5223k44667B52047a50241k38158G0497J76656j07596
11156A39557b40054f2954a4938r5721O719C1487E00N14302g5343k74910A83923
11144a0330F8191J11360c01657B23388a21608p5706c6525j09304E9086K49145
11134C08231D1753c9579A61484b03169e3303a2909A03177P6756H4345K65404b27723
11122b5756C32246f7545I6506d0395H3871c02696G15L07296o4620C6293c0353
11110B00855b10326R7563C47060h9711C19836a01811I3084O0056D9752K11635
11100B61387o9096d3756r2864A54493L8744G0871K61313A47689L51806C1753J77200
$$ y = [118005, -30091, -103233, -95547, 203880, 331755, 87389, -154196, -250580, 206657, 23753, -37338, -35184, 62874, 18403, -25223, -269890, 252047, -150241, -388399, 70497, 247153, 139557, -240054, -62954, -14938, -110659, -103940, 31487, 500, 514802, -75343, -350253, 183923, -10330, 68191, 179551, -301657, 223388, -121608, -197314, -36525, -145829, 59086, 308231, 41753, -39579, 161484, -203169, -53303, -12909, 103177, 179933, 84345, 349749, -227723, -25756, 332246, -67545, 96506, -40395, 83871, -302696, 715, 308011, 243391, 36293, -30353, 200855, -210326, -112763, 347060, -89711, 319836, -101811, 93084, 153140, 49752, 261387, 192291, -43756, -136620, 154493, 193237, 70871, 332184, 147689, 499495, 31753, 208953]
11089B08953l7452b476m1532A82652D719K66478m2115H8760e065D8354j6146P0591
11077A02799L60785b1990B76735i2427B65122B9113L69258I4588M8607K51785
11067C94980J15178A05254N2131K86588q8839K65221k5537p9153j67992L09081
11057F56754p527n7471P5469j48513M2011Q4881p0091B41770Q0769J35295q1062
11046C76772j76408P08803K4929p6811j58086q569j81741j66656L35823R0647
11036G68703k56355o9949L45677k50516j74779J51218K4238J10209p6789K34914
11026H06571j3603r9538J2609o6273J47791k32906J57155l55488N73228C70957
11015G66159l29646K0493j00178M72966m05100J43847B12203M71501l36275L00138
$$ y = [208953, 171501, -2476, -44008, 182652, 4719, 271197, 229082, 88760, -5065, 48354, 32208, 102799, 463584, -21990, 276735, -92427, 265122, 29113, 398371, 94588, 143195, 394980, 510158, 105254, 157385, 443973, 355134, 620355, 594818, 515665, 347673, 656754, 649227, 591756, 667225, 518712, 560723, 645604, 575513, 241770, 322539, 457834, 376772, 200364, 909167, 934096, 857285, 699199, 690630, 508889, 342233, 678056, 768703, 512348, 442399, 788076, 537560, 362781, 513999, 538237, 648446, 571657, 806571, 792968, 693430, 706039, 639766, 787557, 554651, 711806, 356318, 929546, 370957, 766159, 436513, 457006, 356828, 829794, 424694, 568541, 212203, 683704, 347429, 647567]
11005F47567j64873K62181j64990K23110O0045k46503p8186j36001L03681j74845
10995E31186j83705L83331O3590j48307N5201A84003O29779j79769J16907J10550
10985H61470L6891j14820L3507M19821l92620J18916N3507L07088n7842m2607
10975A223311Q38116K8525J20726K75077K2200k28092P4346k47634j15243J43840
10965B135172m35241n03009L32701j40407j16195K53392k31547K86063l75158
10956A205771J89121K17011N7524n54058K33423l5697J11661E35096J05999B50436
10945E90889k73256m3172J66860j15581A49852o5954a41983B0067K83780M4212
10935C48059n8120j0752f9009A14223a4317j73516Q6162G0701K60003b50884h0465
$$ y = [647567, 482694, 744875, 579885, 802995, 863040, 616537, 538351, 402350, 706031, 531186, 347481, 730812, 794402, 646095, 701296, 184003, 813782, 634013, 750920, 861470, 898361, 783541, 817048, 1236869, 844249, 963165, 1016672, 1323760, 1265918, 1223311, 2061427, 2089952, 2210678, 2485755, 2507955, 2279863, 2354209, 2106575, 1991332, 2135172, 1699931, 1196922, 1529623, 1389216, 1273021, 1526413, 1294866, 1580929, 1205771, 1394892, 1611903, 1669427, 1115369, 1348792, 1313095, 1424756, 535096, 641095, 250436, 590889, 317633, 274461, 441321, 325740, 149852, 83898, -141983, 20067, 303847, 348059, 289939, 279187, -69009, 114223, -14317, -187833, -101671, 70701, 330704, -250884, -80465]
10923E7332k327Q4187l7472h2731c0187D0042j9751K48294d36549b2240A02729
10911e5990j33669B25314F9494b31592B80507d6266m2234C43157b4663A43054
10900a32472B18265A6146L0909M834b9367j19260j15933D9694b33009d8418j57316
10889b05734R9162j6672A45338m1757b3057r3687B1701A0794L5594J43393h3672
10877I2370J09960F7017a58477g6525a7517q1962A17214g5405q6241O8267C260
10865B65392q4829a41837A13375e4596A70053a62962b1081A31526i2589A21672
10854a60357a1129q4833B49741f4540C0573a42600A98965P4476c5291A90050E4075
10842a95894h5806j11986D5985b06083A68248C2441L8899r151b08379H5721a67847
$$ y = [57332, 55005, 139192, 101720, -82731, -30187, 40042, 20291, 268585, -436549, -22240, 102729, -55990, -189659, 225314, 69494, -231592, 280507, -46266, -88500, 343157, -24663, 143054, -132472, 218265, 16146, 47055, 51889, -29367, -148627, -264560, 49694, -233009, -48418, -205734, -106572, -123244, 145338, 103581, -23057, -116744, 21701, 10794, 46388, 189781, -83672, 92370, 202330, 67017, -158477, -76525, -17517, -99479, 117214, -75405, -161646, -93379, 3260, 265392, 180563, -141837, 113375, -54596, 170053, -162962, -21081, 131526, -92589, 121672, -160357, -11129, -95962, 249741, -64540, 30573, -142600, 198965, 273441, -35291, 190050, 54075, -195894, -85806, -197792, 45985, -206083, 168248, 32441, 71340, 62189, -208379, 85721, -167847]
10830b35565A29673d0829j9595o9324K772B18706a85430j28924A24893g9967j7356
10819i7323M1230C05455f2551j86518K7240b423k90734R4142B60228b09265C5358
10807A16262g3350r8976A68128j8284o3211i2251C1025c54964B70865f4702k42985
10796c07687A5682a71573q627g4781k66001n2568a54928l0188H6388B3540O0155
10785H3695J80437a8663l63942H2643A3843J19193B1293c57413j52041J68582
10775c40872n2067B29074a60432B01176d6031A29120J79618a47168A93931a08481
10764a66535C06852j08657a67319k2887e277A41695b30719k2355Q3473B39731
10753b97427A878N0170a22983F5067b13424d6051m5606k19031f5524b2009k9114
$$ y = [-235565, 129673, -40829, -60424, -129748, -126976, 218706, -185430, -314354, 124893, -79967, -97323, -56093, 305455, -62551, -249069, -221829, -2423, -293157, -199015, 260228, -209265, 35358, 116262, -73350, -172326, 168128, 149844, 86633, -92251, 31025, -354964, 270865, -64702, -307687, 15682, -171573, -180200, -74781, -340782, -393350, -154928, -185116, 86388, 23540, 83695, 264132, -18663, -382605, 82643, 13843, 133036, 21293, -357413, -509454, -340872, -392939, 229074, -160432, 201176, -46031, 129120, 308738, -147168, 193931, -108481, -166535, 306852, 198195, -167319, -190206, -5277, 141695, -230719, -253074, -169601, 239731, -297427, 1878, 52048, -122983, 65067, -213424, -46051, -91657, -310688, -65524, -22009, -51123]
10742e1123A88240j547f6349J9150j07202P4645D4815a66616C4676K83738A21986
10730A4851J11788a31316B45179a05386C4385M4008a5036k23257F8850c2518n4508
10719h7026A38416c84669B45939H0967a36255k03679e6895a4914j33833b2685
10708d0864j45049M6232l4582O4518D3149m29J99800G655g5701k3107J3433K6771
10696e8604A04835b7690j59244l7928J11444A96150L3275j11129f6195B31093
10685a75202A47368n6390d44845a7110D6493d3209r2716k45202J38410a09171
10674a6171p8175A00434b28098f4935C00903a41603A01854a66416A54084B7984
10663a85823e2665k11881A43163K2846a67675A15594a26660J5903k6268d5956
$$ y = [-51123, 188240, 186693, -66349, -47199, -154401, -79756, 44815, -166616, 34676, 318414, 121986, 14851, 126639, -131316, 245179, -105386, 34385, 78393, -15036, -238293, 68850, -32518, -87026, 138416, -384669, 245939, 80967, -136255, -339934, -56895, -14914, -148747, -22685, -40864, -185913, -139681, -174263, -109745, 43149, 42720, 242520, 7655, -75701, -98808, -85375, -58604, 104835, -27690, -186934, -224862, -113418, 196150, 229425, 118296, -66195, 231093, -175202, 147368, 90978, -444845, -17110, 46493, -43209, -135925, -381127, -242717, -109171, -16171, -94346, 100434, -228098, -64935, 300903, -141603, 101854, -166416, 154084, 27984, -185823, -52665, -264546, 143163, 166009, -167675, 115594, -126660, -110757, -137025, -45956]
10652D2066a01789A65477F0644a01737A04001b48438G3891c6319J4689F6398b11833
10640c13610A15886a5703A12784m7491d7850a2774q3361j12828B4833L7667J39452
10629B01952a19323k6923N0462D4900b78614a22516B46092K27415a60243D6033
10618b91867J28850K0701A89286a35810c696k1494j58874A26039R4336a6401l7502
10607e3903g654j14690d3070C03803a95579N9031L1168R378A89535b06884l2340
10596b39224g5927j33275k09921L6906B9917K38836e6028j37182B78355j23011
10586A55344G5138m900N320h6093o6277B362O8327a14172A77954C7005L8071J48530
10574B23606c11659P1235c4044F246b33101A3004a88442E6529a14044C1301b73806
$$ y = [42066, -101789, 165477, 60644, -101737, 104001, -248438, 73891, -36319, -21630, 66398, -211833, -313610, 115886, -15703, 112784, 65293, -47850, -12774, -96135, -208963, 24833, 62500, 201952, -119323, -146246, -95784, 44900, -278614, -122516, 246092, 473507, -160243, 46033, -291867, -163017, -142316, 189286, -135810, -3696, -25190, -184064, 126039, 220375, -16401, -53903, -7654, -122344, -43070, 303803, -195579, -136548, -105380, -96002, 189535, -206884, -239224, -75927, -209202, -419123, -382217, 29917, 268753, -56028, -193210, 278355, 155344, 75138, 70238, 75558, -86093, -152370, 2362, 70689, -114172, 177954, 37005, 75076, 223606, -311659, -240424, -34044, 6246, -233101, 13004, -188442, 56529, -114044, 31301, -273806]
10562A00150f7402a6321j04449l04665g3528K2323A15539b49203n4982I2102b5435
10550c0128J2939A48501D2843b29261c8210B87385f3717A83663H9681l1654J91673
10539B49700a40678m3851G1530e7256A21580c3037k15870J8538h3376I7903a4410
10527B04044c41037A07600a55553O6358n8251B25530C9171e6464A67620G1110
10516C4688a70763c1120q9519B9631J31571K1139A1831J62718L1943a7536k39434
10505b56970G1209R8426B7192a77778d2944B25674b41775O8644E6331j0420c51172
10493c56438d6122b0345A47507a68227j07127A48955D5763a98195J6474A32068
10482B78492J65496k9441j26370P4014J5722A34900Q684a1655r8348k06703A96386
$$ y = [100150, -67402, -16321, -120770, -425435, -73528, -51205, 115539, -249203, -304185, 92102, -25435, -30128, -17189, 148501, 42843, -229261, -38210, 287385, -63717, 183663, 89681, 58027, 249700, -140678, -184529, 71530, -57256, 121580, -33037, -248907, -230369, -83376, 97903, -14410, 204044, -341037, 107600, -155553, -89195, -147446, 225530, 39171, -56464, 167620, 71110, 34688, -170763, -31120, -120639, 29631, 161202, 182341, 11831, 174549, 206492, -17536, -256970, 71209, 169635, 27192, -177778, -42944, 225674, -241775, -173131, 56331, 45911, -351172, -356438, -46122, -20345, 147507, -168227, -275354, 148955, 45763, -198195, -181721, 132068, 278492, 443988, 414547, 288177, 362191, 377913, 134900, 143584, -11655, -110003, -316706, 196386]
10470B46405I9742J22943I3959K05655h3300a9961Q818r9337D9519K27555G2856
10458B27409f2649k0143D8392J00736a01034r0616l0548J09640b5641B5323j0937
10447A4386b70664h8438p3509o746C74888A01442D5827c5753j75598i9002E4201
10435a41402j10796H0335a90688L2513j15770A57507a79410N7681B60855b55859
10424h6972r5212e411C4520a82103A60837K6653N4112d0034l1347A25992a21197
10412H9490c3727B05901a64753a0400A39291c8564n00021E103b21213h6520J9207
10401f7313A4751c7865H5793a66404A45763M820J72076a2883I5982J69721B6162
10389B54727r2320p2817J3227A6020c61503A23370K192P6087q2157J77819j24947
$$ y = [246405, 99742, 222685, 93959, 299614, -83300, -19961, -11143, -110480, 49519, 277074, 72856, 227409, -62649, -82792, 48392, 149128, -101034, -191650, -222198, -112558, -25641, 25323, 14386, -270664, -88438, -161947, -168693, 374888, 101442, 45827, -35753, -211351, -99002, 54201, -141402, -252198, 80335, -190688, -158175, -273945, 157507, -179410, -121729, 260855, -255859, -86972, -182184, -5411, 34520, -182103, 160837, 187490, 241602, -40034, -71381, 125992, -121197, 89490, -33727, 205901, -164753, -10400, 139291, -38564, -538585, 5103, -221213, -86520, -67313, 14751, -37865, 85793, -166404, 145763, 150583, 322659, -12883, 95982, 265703, 26162, 254727, 162407, 89590, 102817, 16020, -361503, 123370, 125562, 201649, 119492, 297311, 172364]
10378A72364B7350K44240n8200o2187j8507J14877n2193J59599A46836j4174R9873
10367B32535K82470A00444L85459m8084K5171D8734L82464a40503E7860L02219
10357C60079A21427K11159c2789E20894j84397j19490N078L6604P4848A50650
10346C02245A45457B4271L85826j6505e5207A97164K360H2036N2184e540m260
10335i800B66094l7883Q6763A33329h7518c3931p1563d3325p3420I886Q9560a23089
10322a54457H7777a62341e1075C94437A3920b33183I7276Q2407F7219N2701B6599
10310d7839C1741a34706A21272a04991B47309A11375F324K35408d5899k15043
10300b60942e9928G8535e0756j01570H434M47306A79081N4222j11252D9291K79232
$$ y = [172364, 27350, 271590, 213390, 151203, 132696, 247573, 195380, 354979, 146836, 132662, 232535, 515005, 100444, 485903, 437819, 462990, 48734, 431198, -140503, 57860, 360079, 121427, 332586, -32789, 520894, 336497, 217007, 222085, 258689, 333537, 150650, 302245, 145457, 24271, 410097, 393592, -55207, 197164, 199524, 82036, 134220, -5540, -9800, 266094, 228211, 314974, 133329, -87518, -33931, -105494, -43325, -116745, 9886, 99446, -123089, -154457, 87777, -162341, -51075, 394437, 13920, -233183, 97276, 179683, 67219, 119920, 26599, -47839, 31741, -134706, 121272, -104991, 247309, 111375, 6324, 241732, -45899, -260942, -59928, 78535, -50756, -152326, 8434, 455740, 179081, 233303, 122051, 49291, 328523]
10289C28523l3614a88006G9106h1092n4080I5156B0119g6400E2036J14386a66353
10277E8829B3144c25722A41852K17601F9568J85674a81327g2337A86754J50107
10267C36861b27466Q5102b4209F654P5531i6689D978L12122J61393C1759J48812
10256A80571q8510q083j7163l726d0162B11301h3357r2836I9111j9203a22950
10244A42456A1284a14656b8638o1011a6773H0541a71455g4335B12115a83741e2094
10232b48076g8554L5023k47651r172A83740d5011C9000c39236A41678b4992A17451
10220G0170f2009M508F6767b06568I722K8140a27340E1943J78640r5278c6807
10208c5861A05422m8540J48358i2259d5715I2335R745a59633g6961D5754L54159
$$ y = [328523, 294909, -188006, 79106, -81092, -135172, 95156, 20119, -76400, 52036, 166422, -166353, 58829, 23144, -325722, 141852, 359453, 69568, 255242, -181327, -72337, 186754, 336861, -227466, -142364, -24209, 6654, 82185, -96689, 4978, 317100, 478493, 31759, 180571, 92061, 83978, 66815, 63089, -40162, 211301, -83357, -176193, 99111, 79908, -122950, 142456, 11284, -114656, -28638, -89649, -16773, 80541, -171455, -74335, 212115, -183741, -52094, -248076, -78554, -43531, -291182, -300354, 183740, -45011, 39000, -339236, 141678, -24992, 117451, 70170, -62009, -57501, 66767, -206568, 9722, 37862, -127340, 51943, 230583, 135305, -36807, -35861, 105422, 56882, 205240, -92259, -45715, 92335, 102080, -159633, -76961, 45754, 399913]
10197C99913d8176j92274j4329M5969j68204c9763o08660E2236c12927A03512
10186d7252j5787j15398A59121c86550B4758L5336a64226A68646b41772r820B9007
10174a4924k6191k68789J32106F0487a72340L0555a8927j3685C9625R6705i1419
10162E5900i0174B09614B900b33934A19101a45521d7762N610j07551q3137O2805
10151a70035j57070C0607a03630A35748g4212E7066b53847A13220K4960F0991
10140E1082J10287a59257f758p9030J0181A85005k7827b19670B03453b99312J26579
10129a72733g5934r9856d8221k63200D1425d36218a05680j87570a13865G1237
10118f0289k3321r3603L0826R068c8115j50042d0000k33482j3549e3344B9717
$$ y = [399913, -48176, -240450, -254779, -208810, -377014, -39763, -648423, 52236, -312927, 103512, -47252, -63039, -178437, 159121, -386550, 24758, 60094, -164226, 168646, -241772, -251592, 29007, -14924, -41115, -309904, -177798, 60487, -172340, -141785, -18927, -32612, 39625, 136330, -91419, 55900, -90174, 209614, 2900, -233934, 119101, -145521, -47762, -42152, -149703, -232840, -170035, -327105, 30607, -103630, 135748, -74212, 57066, -253847, 113220, 138180, 60991, 51082, 161369, -159257, -6758, -85788, -75607, 185005, 157178, -219670, 203453, -299312, -172733, -75934, -175790, -48221, -311421, 41425, -436218, -105680, -293250, -113865, 71237, -60289, -83610, -177213, -146387, -137319, -38115, -188157, -40000, -273482, -287031, -53344, 29717]
10106h0682A09055a1928a442k12893C9718K8088J25075b74907d4801m89231f0791
10094I0196b26342g3541j44181a03673E8889k6704d1325j95199e6496a0311C07084
10082E0735J16237E1176K24714D9198h3586H4890h4340a6759A0591f6544A17731
10070F1707a21241p9334P0600m1061B63708a48032j0021b5437R561C06323c05949
10058a63581n3376j1984a0005j27357o8839N9713M7576H7380J7809b35717f0333
10046c20356a44702b1337l63949f8426k02514g0261j00393M3124k39990a28499
10035e601A51698b8552j85947A0527J2842O478f5102C47527g7290n269j1105K0015
10023g3649f057j33766B54838c37840a07127F8014g69G7705I359K625b61408E7251
$$ y = [-80682, 109055, -11928, -1442, -214335, 39718, 67806, 192881, -274907, -44801, -534032, -60791, 90196, -226342, -73541, -217722, -103673, 58889, 32185, -41325, -236524, -56496, -10311, 307084, 50735, 166972, 51176, 275890, 49198, -83586, 84890, -84340, -16759, 10591, -66544, 117731, 61707, -121241, -200575, -129975, -171036, 263708, -148032, -158053, -25437, -15876, 306323, -305949, -163581, -216957, -228941, -10005, -137362, -206201, -146488, -98912, 87380, 105189, -235717, -60333, -320356, -144702, -21337, -385286, -68426, -270940, -70261, -170654, -127530, -367520, -128499, -5601, 151698, -28552, -214499, 10527, 23369, 29847, -65102, 347527, -77290, -82559, -93664, -73649, -6057, -139823, 254838, -337840, -107127, 68014, -769, 77705, 9359, 11984, -261408, 57251]
10010b51290q0311a14108E0223c74219b0567j92271c41F3486p213a03908k7711
9999a31619J0223j00211O2611d5889G7192a58269d7747D48118c03687A89827n0210
9988A39617c367k02005a2627r6037d9237E0791b58062j5459a34266b1772A88145
9976H5345A9552i258j19855o2265g3556a3640G499J02344c18791E195J33798a84726
9963a9849k25214c9925A44829a44959j8009j14299A58974a5162j02579b4111A89765
9951a87090C5033d2544j4340r8807j8024h0576B14877b32959O0027B38888c58948
9939E4581a37250k4106K5074e1073q2723p1207f0222j47534e0044j59074N5452
9928a53666A65276c6981a6342n27353J67493G158b27757Q9156B55684e6948b4715
$$ y = [-251290, -331601, -114108, 50223, -374219, -20567, -212838, -341, 63486, 56273, -103908, -131619, -121396, -221607, -158996, -45889, 77192, -158269, -47747, 448118, -303687, 189827, 139617, -3367, -205372, -12627, -108664, -49237, 50791, -258062, -273521, -134266, -21772, 188145, 85345, 19552, -9258, -129113, -191378, -73556, -13640, 7499, 109843, -318791, 5195, 138993, -184726, -19849, -245063, -39925, 144829, -144959, -162968, -277267, 158974, -15162, -117741, -24111, 189765, -187090, 35033, -42544, -56884, -155691, -173715, -80576, 214877, -232959, -172932, 238888, -358948, 54581, -137250, -161356, -136282, -51073, -133796, -205003, -60222, -207756, -50044, -209118, -153666, 165276, -36981, -16342, -543695, -376202, 7158, -227757, -138601, 255684, -56948, -24715]
9916g8152j17052p5596A68132b40073k8897d3645r3676j02203Q7042k22599A65171
9904A16038d64362B81704a3563j84301M454B13750m6328L05815D5625i6266n1281
9893a47547C04856a08625o4201j83161E9415c3457C21836b29568H0010k8894b39978
9881C0893a58861A05157M9796a73359E6404b21777O0652A09786K90K56414A30865
9869a73197A53117a0377G8049d2720A26436K3859M0174c41916o0231A34971O2202
9858A97173a66183C6161a33473j33429R8174B15246B1055J19908b5866B235a80315
9846a90119f4666C09125E8296J25903B8625a30336r9856r1776a32806J9329a3487
9834c13440H5160b0936k44784H5429K0318e6154k22931B9487b27008n489f7636
$$ y = [-78152, -195204, -270800, 168132, -240073, -268970, -43645, -137321, -239524, -152482, -375081, 165171, 116038, -464362, 281704, -13563, -197864, -193410, 213750, 167422, 473237, 45625, -96266, -147547, 304856, -108625, -172826, -355987, 59415, -33457, 321836, -229568, 80010, 51116, -239978, 30893, -158861, 105157, 154953, -173359, 56404, -221777, -161125, 109786, 110076, 366490, 130865, -173197, 153117, -10377, 78049, -42720, 126436, 150295, 190469, -341916, -402147, 134971, 197173, -166183, 36161, -133473, -266902, -168728, 215246, 21055, 140963, -25866, 2235, -180315, -190119, -64666, 309125, 58296, 184199, 28625, -130336, -230192, -321968, -132806, -113477, -13487, -313440, 85160, -20936, -265720, 85429, 105747, -56154, -279085, 29487, -227008, -232497, -67636]
9822D24901b58692a28326M4368A21559J49288j05799a80324O1726j33180f9335
9811a26109D9349g8089l6642F0480a74896K1905K451A56430m2582a04838d6982
9799b64555j47189a25569e7397q5963E0646M138J03388f8391D54870B6275f9556
9787B304b41148K8082b937D10891b26906g4205F0471g3236k41296J11036O308
9776a97188A53574f4224F4177c7747j10254M5477i406k15326l60972a87588K2617
9765a64971B6219J13603A5490c8589p7868A21577L8690p0377d0952j9932j33541
9754a94425j21348R0499A86607b60756C8620c10720c5206k77124B12346a48600
9743b07782h3338n3880M4870l2152A15733e53877I6920O4031k4439j4282b24848
$$ y = [424901, -258692, -128326, -83958, 121559, 270847, 165048, -180324, -118598, -251778, -69335, -126109, 49349, -78089, -114731, 60480, -174896, -152991, -150540, 156430, 113848, -104838, -46982, -264555, -411744, -125569, -57397, -143360, 50646, 54784, 158172, -68391, 454870, 26275, -69556, 2304, -241148, -213066, -2937, 410891, -226906, -74205, 60471, -73236, -314532, -203496, -197188, 153574, -64224, 64177, -37747, -148001, -102524, -9406, -224732, -585704, -187588, -164971, 26219, 139822, 15490, -38589, -116457, 121577, 160267, 89890, -40952, -60884, -194425, -315773, -225274, 186607, -260756, 38620, -310720, -35206, -312330, 212346, -148600, -207782, -83338, -137218, -92348, -124500, 115733, -553877, 96920, 160951, 136512, 122230, -224848]
9731c3352J5625r7360B7080b27101H5280C4370e3982F0391i5084C29344A23053
9719A42886h6526H0677c9529r737J0417j6252E0859N6496a82611D006J84959c04620
9706F7309b73236A21148b0213F1060B2471a55122B7527K41041a03267M7916k35031
9695b90382i1208J8762l15899e4842j37140g6845C6963b29926O9292j45671A00619
9683c3923j69965e8150A63187b04929P0760N8805m7002g659I4450L16438i7104
9671I7066L5732a32125n8496Q0420A30190c19777j84229a30720M9691A24615n8725
9660F5890a17302e5961j68210F0429a40287E6351a32982A31077b889l0980p0043
9649a03912B19246a94486A94201B9799J0266a36162j0349d8867B37705o0197i6376
$$ y = [-33352, -17727, -115087, 27080, -227101, 85280, 34370, -53982, 60391, -95084, 329344, 123053, 142886, -86526, 80677, -39529, -49266, -38849, -55101, 50859, 107355, -182611, 4006, 188965, -304620, 67309, -273236, 121148, -20213, 61060, 22471, -155122, 27527, 268568, -103267, -55351, -290382, -91208, -72446, -388345, -54842, -191982, -76845, 36963, -229926, -160634, -306305, 100619, -33923, -203888, -58150, 163187, -204929, -134169, -75364, -122366, -7659, 94450, 410888, -97104, 97066, 132798, -132125, -190621, -110201, 130190, -319777, -504006, -130720, -81029, 124615, 65890, -117302, -55961, -224171, 60429, -140287, 56351, -132982, 131077, -2889, -33869, -103912, 219246, -194486, 194201, 29799, 40065, -136162, -146511, -48867, 237705, 177508, -96376]
9637a13799m43652H1369P2044q971g2231K5304m1846B691J45771K1846j8435J16189
9625B68062F8592B4534c22066M3776d7255j89105c7995G8069B0894h0046D53441
9613A82106c95234c9939A23586c94585i5504M7102B31167D9021h3929k04197N9025
9602b29101J07184a0049I0379A5509a62971r8207D0188C712f9192G3464c0136
9590D5944p790b01973A55309J02003c31479B8536c7732B61281q9734b71286B67031
9578A52833m257D4632J33045a53749d5571C24818c13322q1763L4965J45138f7372
9566a82992L7587a4421L820a305l68742N455H133b42299F4337b34114Q1049m2491
9554a95556F2730a47283C4011f4031b347l9383o97m6783H2626a21683q5614D5309
$$ y = [-113799, -557451, 81369, 153413, 144442, -72231, -46927, -88773, 2691, 148462, 170308, 151873, 268062, 68592, 24534, -322066, -278290, -47255, -236360, -37995, 78069, 20894, -80046, 453441, 182106, -395234, -39939, 123586, -394585, -95504, -48402, 231167, 49021, -83929, -288126, -229101, -121917, -10049, 90379, 15509, -162971, -261178, 40188, 3712, -69192, 73464, -30136, 45944, 38154, -201973, 155309, 257312, -331479, 28536, -37732, 261281, 171547, -271286, 267031, 152833, 148576, 44632, 177677, -153749, -45571, 324818, -313322, -395085, -360120, -214982, -67372, -182992, -145405, -14421, -10601, -1305, -370047, -364592, 8133, -242299, 64337, -234114, -153065, -195556, 62730, -147283, 34011, -64031, -2347, -41730, -42427, -89210, 82626, -121683, -207297, 45309]
9541a34825D917e2679j30041Q1981b9612R371k2980j47421B3025Q2452a73481
9529a52635B29115B8118d29028A37061d17423C7541c17560A07942c89785a78961
9518b54827e2354E5457K1812a08040A32000b25204Q4898j52828A4169J19871a88657
9506A38312a65879L2814j01499B20708G1774a83935Q593I3894a32497H0636d9545
9494A16031D2456i8824A74829E4525K03970o9029c43248A45406a77108A02455
9483e0974r2892O1085E0515a72427j06696j45590J63214r8436r2954B26041a21632
9471e7043G5850h5405k12992a30436k2017n6829M7868n8544C3675L35206A62363
9459A62224c01584O2541D40565b81373a30681d8213j24819k26773M3175c6498
$$ y = [-134825, 4917, -52679, -182720, -100739, -29612, -20241, -43221, -190642, 23025, 105477, -173481, -152635, 229115, 28118, -429028, 137061, -417423, 37541, -317560, 107942, -389785, -178961, -254827, -52354, 55457, 77269, -108040, 132000, -225204, -140306, -293134, 14169, 134040, -188657, 138312, -165879, -133065, -234564, 220708, 71774, -183935, -175342, 93894, -132497, 80636, -49545, 116031, 42456, -98824, 174829, 54525, 258495, 189466, -343248, 145406, -177108, 102455, -50974, -143866, -82781, 50515, -172427, -279123, -424713, -261499, -359935, -452889, 226041, -121632, -57043, 75850, -85405, -298397, -130436, -152453, -209282, -161414, -219958, 33675, 368881, 162363, 162224, -301584, -239043, 440565, -281373, -130681, -48213, -173032, -399805, -356630, -36498]
9448a58605D8397P6350c3462k98761a54497f5194k83442d8055C4831b8228q3898
9437a12126L5003c2818k87085G0726L1559j2348m862b804A22335A0062b9438B03129
9424a13898E1290a62586D9661h0221G3526a272k16586M9094B02992E2262b70382
9412g7025b9094j9868B13156B4388f0230j33780H1215B8525e5413A87706b86058
9400B20831l9594a87218l3811c2512B7869a78919k23025a21356p2790a6923F163
9388C0905f7959k50749A37121a78361k03403L7746I1188Q7699c85426A46084g6988
9376C4681o45b18284A46265C7548K22483F9623a05585K9098A27407l1905J28773
9365B24275b2668C4710b92034J9345i4990F0086g9557M232j84428B16848P7107
$$ y = [-158605, 48397, 124747, -33462, -332223, -154497, -65194, -348636, -48055, 34831, -28228, -112126, -77123, -32818, -319903, 70726, 102285, 89937, 85075, -2804, 122335, 10062, -29438, 203129, -113898, 51290, -162586, 49661, -80221, 73526, -1272, -217858, -168764, 202992, 52262, -270382, -77025, -29094, -48962, 213156, 24388, -60230, -194010, 81215, 28525, -55413, 187706, -286058, 220831, 181237, -187218, -221029, -32512, 27869, -178919, -401944, -121356, -194146, -16923, 6163, 30905, -67959, -318708, 137121, -178361, -381764, -344018, 91188, 178887, -385426, 146084, -76988, 34681, 34036, -218284, 146265, 37548, 260031, 69623, -105585, -76487, 127407, 95502, 224275, -22668, 34710, -292034, -272689, -94990, 60086, -79557, -75325, -259753, 216848, 293955]
9354B93955g5145F0014c34062A26486f4977j2037B18289D256M8057b4065k48716
9343b72781C784a60304G9701a69383B92070j14383i4606B01136g1142l7382D015
9331h763j11023q2841d1620l51230A85660p358P6185i9860c8931j7897l5175A25848
9318A90364c56828J31631B20027d1690B49761a38492B78706a48593N34A79406
9307A498b03216N3878B04381a30844E2364c05835J2337f9125q1346c0745B46235
9295e0702I9362h8356A95N0757a97580j92496a4739j1829p63B46546a77658c4239
9282a09116D6635K5900d4167a1766j97005Q6639M6369j72472l8407E40882H253
9270a75104K9625i229m0073A50244a46287j19249D4866d05453A00409j5006b08230
$$ y = [293955, -75145, 60014, -334062, 126486, -64977, -77014, 218289, 4256, 52313, -24065, -272781, 3784, -160304, 79701, -169383, 292070, 177687, -94606, 201136, -71142, -108524, 4015, -8763, -119786, -202627, -41620, -392850, 185660, 178302, 254487, -99860, -38931, -56828, -92003, 125848, 190364, -356828, -225197, 220027, -41690, 249761, -138492, 278706, -148593, -148059, 179406, 1498, -203216, -149338, 204381, -130844, 52364, -305835, -293498, -69125, -150471, -30745, 246235, -50702, 99362, -88356, 195, 50952, -197580, -390076, -14739, -26568, -27331, 246546, -177658, -34239, -109116, 46635, 72535, -44167, -11766, -208771, -122132, -75763, -248235, -286642, 540882, 8253, -175104, -145479, -9229, -49302, 150244, -146287, -265536, 44866, -405453, 100409, 85403, -208230]
9258B2525R9457A9076L67213b13778E3010b96238b0441A4996J44048b83282A91262
9246B01035b53450P5933A97198D2828K33241H0227C5212P2137a2565F7141a42608
9234a6244k12426h3127E5719c3935j08432m2254h5211q6030j20667b6258k051
9223b8309k61312A8868L9085i4517k47845R7505p7406H1127l2887P1940a1233
9211c25108D2538c34511E0490k0753b40699f8071l20930A28405C12J97521L1598
9200B29431i5534C6473M1239A5664K73604j26560b5985r4010E688J01314a31917
9188A1511b61847H1281h9791A2578a63747Q0186B78631b1447o0822K7735o7980
9177a22514B14624i1655B84903c7072C83606b06360Q6116e1811B4786a29907k0020
$$ y = [22525, 121982, 19076, 386289, -213778, 53010, -296238, -20441, 14996, 159044, -283282, 191262, 201035, -253450, -177517, 197198, 42828, 276069, 80227, 35212, 107349, -12565, 67141, -142608, -16244, -228670, -83127, 55719, -33935, -142367, -184621, -85211, -171241, -291908, -26258, -28309, -289621, 18868, 57953, -94517, -342362, -244857, -322263, 81127, 48240, 120180, -11233, -325108, 42538, -334511, 50490, 29737, -240699, -68071, -389001, 128405, 312, 197833, 229431, -95534, 36473, 77712, 15664, 289268, 162708, -25985, -119995, 5688, 107002, -131917, 11511, -261847, 81281, -89791, 12578, -163747, -83561, 278631, -21447, -82269, -54534, -122514, 214624, -91655, 284903, -37072, 383606, -206360, -120244, -51811, 24786, -129907, -149927]
9166a49927B2676J30487e5446m38773I5975c33493D8004c174j62184j21528k9243
9155c16129f2609C7915a10903d3524B36671e9032A55727a01248B02994a51302
9144f3272j57469a07240M8797m9262P589D8405a22650I0995a53463m2467K531
9133a93399f1837j13630f3585G4328M6757E9123J04232J09996i2409n6493C3392
9121c8498k56049h1682a6265B11209a21307j28780h788k58842j12726J3535J21774
9110b45047C16745a09290L9410a3720H0229a98059n3029h3288A64670d1547o9182
9099a10729N0844I6011e0152j47942c0105l6793m00871E8030a75340M4847k9377
9088a59870H7567M5872m0624a4454l2261A72210a05798r3681g817A0230a4746
$$ y = [-149927, 22676, 153163, -55446, -494219, 95975, -333493, 48004, -3174, -165358, -286886, -316129, -62609, 37915, -110903, -43524, 236671, -59032, 155727, -101248, 202994, -151302, -63272, -220741, -107240, -58443, -107705, -100116, 48405, -122650, 90995, -153463, -195930, -193399, -61837, -175467, -63585, 74328, 121085, 59123, 163355, 273351, -92409, -148902, 33392, -38498, -294547, -81682, -16265, 211209, -121307, -250087, -8788, -267630, -380356, -366821, -245047, 316745, -109290, -69880, -13720, 80229, -198059, -251088, -83288, 164670, -41547, -110729, -59885, 96011, -50152, -198094, -30105, -66898, -467769, 58030, -175340, -130493, -159870, 87567, 133439, 92815, -14454, -46715, 172210, -105798, -199479, -7817, 10230, -14746]
9076a6057I4312l6380R0167a50475K9894k00928B52038c99373a15452A12769L7889
9065A50658J42877A44188A0192a68218k2936M0588E2019h3414m89938b54293l16000
9054e70293a28082A85819D0727a34430e7581A11889c3808J3363n0626k93688n5336
9043d20095a39198J4493G6295a0298k6420C48163j68324e9208A31259b7159A6212
9031f5676I6181j4890b19669P6940k09710G5228a30781k18608B91012J00724H2581
9019a4673H8301a96660d129r0372l26915f8975c1550H0884J89742j18502n3515
9008I8609a30616A98295r9115K9775J81399g6076l10430C18804G2415B2250d26789
8996A71223b46832I2374b8752B11946c52690a47761b5635k7900E6618f3657j65700
$$ y = [-16057, 94312, 57932, 148099, -150475, -120581, -321509, 252038, -399373, -115452, 112769, 150658, 293535, 144188, 10192, -168218, -191154, -150566, 52019, -83414, -573352, -254293, -570293, -128082, 185819, 40727, -134430, -57581, 111889, -33808, -20445, -71071, -364759, -420095, -139198, -124705, 76295, -10298, -36718, 348163, 179839, -59208, 131259, -27159, 16212, -65676, 96181, 81291, -219669, -142729, -352439, 75228, -130781, -349389, 291012, 391736, 82581, -14673, 88301, -196660, -4129, -94501, -421416, -68975, -31550, 80884, 270626, 152124, 98609, -130616, 198295, 99180, 128955, 310354, -76076, -386506, 318804, 72415, 22250, -426789, 171223, -246832, 92374, -28752, 211946, -352690, -147761, -25635, -53535, 56618, -63657, -229357]
8985b29357K3218A00145L7832C2203b3167j15503A11080a69105J5354j69279a06333
8973D2458c6641j8049D3977e7757G5538k1730M1655a80603j88000M6362a40385
8961a51595G7941a04727B07892b54223D9840P1888a62353D5484h886k970m11145
8950d23001C7901M2450c23748h9215n5485L6855A81589b68352G6138c46476A45549
8938A25952a75549d0007m7039A17283b11937A70330g93H290c446j31080B5470
8926D9073m244a56228H9972K71293N19304O58280E49046A25425l80L0835a7166
8914b3785k4619j43511I3778a16864k0238B9938b7894F6350i0897F109J11060
8903A17169a10554a155H4453k2176e0942j03410d3132j07424B75186G4555O8450
$$ y = [-229357, -206139, 100145, 137977, 32203, -23167, -138670, 111080, -169105, -153751, -323030, -106333, 42458, -36641, -54690, 43977, -57757, 75538, 53808, 95463, -180603, -368603, -322241, -140385, -151595, 77941, -104727, 207892, -254223, 49840, 121728, -162353, 45484, -8886, -11856, -423001, 37901, 80351, -323748, -89215, -144700, -107845, 181589, -268352, 76138, -346476, 145549, 125952, -175549, -40007, -87046, 117283, -211937, 170330, -793, 8290, -3446, -134526, 25470, 49073, 44829, -156228, 89972, 361265, 880569, 1538849, 549046, 125425, 125045, 155880, -17166, -23785, -48404, -191915, 93778, -116864, -137102, 29938, -27894, 66350, -90897, 6109, 117169, -110554, -1155, 84453, 62277, -50942, -154352, -43132, -150556, 275186, 74555, 143005]
8892A43005J36440K4467E309a77234A73675f8307j70623r9945J37025h3713j09925
8881a93638D2582O4166O3487a94666i4933H7383a96221i2846o4454j96911N7521
8870b96690a09471B29468J4441j17210c07329Q0344m1446h4052r9708J7218d9910
8858c43881B26971g63j53378g6143o6725c9381A3041K73655f9196k3237C63457
$$ y = [143005, 279445, 303912, 5309, -177234, 173675, -68307, -238930, -338875, -201850, -83713, -193638, 42582, 106748, 170235, -194666, -94933, 87383, -196221, -92846, -157300, -354211, -296690, -109471, 229468, 243909, 126699, -307329, -226985, -268431, -84052, -183760, -166542, -49910, -343881, 226971, -763, -154141, -76143, -142868, -39381, 13041, 286696, -69196, -92433, 363457]
$$ [...]
##END NTUPLES=NMR SPECTRUM
##END=
