##TITLE=AC1442_CALAH13251_8011712_7W0FoOyd05
##JCAMPDX= 6.0         $$ Bruker NMR JCAMP-DX V2.0
##DATA TYPE= NMR SPECTRUM
##DATA CLASS= NTUPLES
##ORIGIN= BRUKER
##OWNER= Administrator
$$ 1.72 TOPSPIN		Version 2.1
$$ 2013-07-05 20:44:27.870 -0700  Administrator@X
$$ Compression mode = diff/dup
##.OBSERVE FREQUENCY= 400.02188249412
##.OBSERVE NUCLEUS= ^1H
##.ACQUISITION MODE= SIMULTANEOUS (DQD)
##.ACQUISITION SCHEME= undefined
##.AVERAGES= 64
##.DIGITISER RES= 22
##SPECTROMETER/DATA SYSTEM= spect
##.PULSE SEQUENCE= noesygpps1d.comp
##.SOLVENT NAME= COFFEE_meoh
##.SHIFT REFERENCE= INTERNAL, COFFEE_meoh, 1, 14.961
##AUDIT TRAIL= $$ (NUMBER, WHEN, WHO, WHERE, PROCESS, VERSION, WHAT)
$$ ##TITLE= Audit trail, TOPSPIN		Version 2.1
$$ ##JCAMPDX= 5.01
$$ ##ORIGIN= Bruker BioSpin GmbH
$$ ##OWNER= Administrator
$$ $$ E:\/data/COFFEE/nmr/AC1442_CALAH13251_8011712_7W0FoOyd05/12/pdata/1/auditp.txt
$$ ##AUDIT TRAIL=  $$ (NUMBER, WHEN, WHO, WHERE, PROCESS, VERSION, WHAT)
(   1,<2013-07-05 20:44:22.370 -0700>,<Administrator>,<X>,<go>,<TOPSPIN 2.1>,
      <created by zg
	started at 2013-07-05 20:32:52.541 -0700,
	POWCHK enabled, PULCHK disabled,
       configuration hash MD5:
       C8 4E 4E 5D D3 5C D8 9E 9F 52 82 E0 59 8A DE 15
       data hash MD5: 64K
       B3 9B C9 B1 65 A7 6F 6A B4 0E 7E 4C BE CC 9F CB>)
(   2,<2013-07-05 20:44:25.510 -0700>,<Administrator>,<X>,<proc1d>,<TOPSPIN 2.1>,
      <Start of raw data processing
       efp LB = 0.3 FT_mod = 6 PKNL = 1 PHC0 = 0 PHC1 = 0 SI = 128K 
       data hash MD5: 128K
       A2 18 DC E0 64 A3 11 B5 68 83 A1 22 EF 2F 55 F2>)
(   3,<2013-07-05 20:44:26.557 -0700>,<Administrator>,<X>,<proc1d>,<TOPSPIN 2.1>,
      <pk PHC0 = -82.57324 PHC1 = 0 
       data hash MD5: 128K
       49 0C A6 50 AC B2 57 7C 3E DF 07 61 6C 06 B9 60>)
(   4,<2013-07-05 20:44:27.245 -0700>,<Administrator>,<X>,<proc1d>,<TOPSPIN 2.1>,
      <abs ABSG = 1 
       data hash MD5: 128K
       DC 5C 61 C3 5D A2 35 59 6F 43 4E A9 20 9C F5 54>)
(   5,<2013-07-05 20:44:27.370 -0700>,<Administrator>,<X>,<proc1d>,<TOPSPIN 2.1>,
      <abs ABSG = 2 
       data hash MD5: 128K
       49 A0 F6 A9 82 B2 F0 2D DD A6 90 B8 7B 1B C3 EA>)
(   6,<2013-07-05 20:44:27.463 -0700>,<Administrator>,<X>,<proc1d>,<TOPSPIN 2.1>,
      <abs ABSG = 3 
       data hash MD5: 128K
       77 1D FF 97 1D 9B 0E 81 EE 4C F7 04 01 19 CB F8>)
(   7,<2013-07-05 20:44:27.557 -0700>,<Administrator>,<X>,<proc1d>,<TOPSPIN 2.1>,
      <abs ABSG = 4 
       data hash MD5: 128K
       BB 28 CB 30 B1 5F 0D 96 E5 66 2B 40 DE 13 D5 89>)
(   8,<2013-07-05 20:44:27.666 -0700>,<Administrator>,<X>,<proc1d>,<TOPSPIN 2.1>,
      <abs ABSG = 5 
       data hash MD5: 128K
       F8 51 5A A9 9D 20 5F 76 9E 17 46 A8 79 2C E3 1F>)
$$ ##END=
$$ 
$$ $$ hash MD5
$$ $$ F5 DF 84 BF D9 2F 46 9E 9D CD 65 05 64 E6 1E 3C
##$RELAX= 
##$RELAX= 
##$RELAX= 
##$RELAX= 
##$RELAX= 
##$RELAX= 
##$RELAX= 
##$RELAX= 
$$ Bruker specific parameters
$$ --------------------------
##$DU= <E:\>
##$EXPNO= 12
$$ [...]
150 150 150 150 150 150 150 150
##$TP07= 0
##$TPNAME0= <>
##$TPNAME1= <>
##$TPNAME2= <>
##$TPNAME3= <>
##$TPNAME4= <>
##$TPNAME5= <>
##$TPNAME6= <>
##$TPNAME7= <>
##$TPOAL= (0..7)
0.5 0.5 0.5 0.5 0.5 0.5 0.5 0.5
##$TPOFFS= (0..7)
0 0 0 0 0 0 0 0
##$TUNHIN= 0
##$TUNHOUT= 0
##$TUNXOUT= 0
##$USERA1= <user>
##$USERA2= <user>
##$USERA3= <user>
##$USERA4= <user>
##$USERA5= <user>
##$V9= 5
##$VALIST= <valist>
##$VCLIST= <CCCCCCCCCCCCCCC>
##$VD= 0
##$VDLIST= <DDDDDDDDDDDDDDD>
##$VPLIST= <PPPPPPPPPPPPPPP>
##$VTLIST= <TTTTTTTTTTTTTTT>
##$WBST= 1024
##$WBSW= 4
##$XGAIN= (0..3)
0 0 0 0
##$XL= 0
##$YL= 0
##$YMAX_a= 5978912
##$YMIN_a= -12074324
##$ZGOPTNS= <>
##$ZL1= 120
##$ZL2= 120
##$ZL3= 120
##$ZL4= 120
##$ABSF1= 14.961
##$ABSF2= -5.597181
##$ABSG= 5
##$ABSL= 3
##$ALPHA= 0
##$AQORDER= 0
##$ASSFAC= 0
##$ASSFACI= 0
##$ASSFACX= 0
##$ASSWID= 0
##$AUNMP= <proc_prof1d_extract.lims>
##$AXLEFT= 0
##$AXNAME= <>
##$AXNUC= <1H>
##$AXRIGHT= 0
##$AXTYPE= 0
##$AXUNIT= <>
##$AZFE= 0.1
##$AZFW= 0.1
##$BCFW= 0
##$BC_mod= 0
##$BYTORDP= 0
##$COROFFS= 0
##$CY= 15
##$DATMOD= 1
##$DC= 0
##$DFILT= <>
##$DTYPP= 0
##$F1P= 0
##$F2P= 0
##$FCOR= 0.5
##$FTSIZE= 131072
##$FT_mod= 6
##$GAMMA= 0
##$GB= 0
##$INTBC= 1
##$INTSCL= 1
##$ISEN= 128
##$LB= 0.3
##$LEV0= 0
##$LPBIN= 0
##$MAXI= 10000
##$MC2= 0
##$MEAN= 0
##$ME_mod= 0
##$MI= 0
##$NCOEF= 0
##$NC_proc= -2
##$NLEV= 6
##$NOISF1= 0
##$NOISF2= 0
##$NSP= 0
##$NTH_PI= 0
##$NZP= 0
##$OFFSET= 14.961
##$PC= 1
##$PHC0= -82.57324
##$PHC1= 0
##$PH_mod= 1
##$PKNL= yes
##$PPARMOD= 0
##$PPDIAG= 0
##$PPIPTYP= 0
##$PPMPNUM= 2147483647
##$PPRESOL= 1
##$PSCAL= 4
##$PSIGN= 0
##$PYNMP= <proc.py>
##$REVERSE= no
##$SF= 400.020009636734
##$SI= 131072
##$SIGF1= 0
##$SIGF2= 0
##$SINO= 400
##$SIOLD= 131072
##$SPECTYP= <>
##$SREGLST= <1H.CDCl3>
##$SSB= 0
##$STSI= 131072
##$STSR= 0
##$SW_p= 8223.68421052631
##$SYMM= 0
##$S_DEV= 0
##$TDeff= 65536
##$TDoff= 0
##$TI= <>
##$TILT= no
##$TM1= 0
##$TM2= 0
##$TOPLEV= 0
##$USERP1= <user>
##$USERP2= <user>
##$USERP3= <user>
##$USERP4= <user>
##$USERP5= <user>
##$WDW= 1
##$XDIM= 131072
##$YMAX_p= 421046237
##$YMIN_p= -12999
##$CURPLOT= <Network HP LaserJet P1505>
##$CURPRIN= <$Network HP LaserJet P1505>
##$DFORMAT= <normdp>
##$LAYOUT= <+/1D_H.xwp>
##$LFORMAT= <normlp>
##$PFORMAT= <normpl>
##$SURQMSG= 1
$$ End of Bruker specific parameters
$$ ---------------------------------
##NTUPLES= NMR SPECTRUM
##VAR_NAME=  FREQUENCY,     SPECTRUM/REAL,   SPECTRUM/IMAG
##SYMBOL=    X,             R,               I
##VAR_TYPE=  INDEPENDENT,   DEPENDENT,       DEPENDENT
##VAR_FORM=  AFFN,          ASDF,            ASDF
##VAR_DIM=   131072,        131072,          131072
##UNITS=     HZ,            ARBITRARY UNITS, ARBITRARY UNITS
##FACTOR=    0.0627417313425164, 1,          1
##FIRST=     8223.62146879497, 1223,         -54462
##LAST=      0,             3119,            -54163
##MIN=       0,             -12999,          0
##MAX=       8223.62146879497, 421046237,    0
$$ Real data points
##PAGE= N=1
##DATA TABLE= (X++(R..R)), XYDATA
$$ [...]
$$ plain form
63914 2952088 2719988 2502088 2300161 2115686 1949398 1800721 1668071 1549920 1445410
63905 1445410 1353965 1274634 1205926 1146107 1093546 1046883 1005042 967112 932383 900574 871755
63894 871755 845679 821371 797758 774590 752270 730861 709914 689448 670365 653435 638298
63883 638298 624020 610348 597957 587636 579731 574288 571196 570142 570764 573009 577047 582845 590069
63870 590069 598462 608069 618992 631115 644134 657658 671211 684335 696771 708421 719041 728128
63858 728128 735301 740720 744986 748521 751076 751886 750261 746043 739560 731348 721918 711577 700187 687180
63844 687180 672130 655420 638169 621337 604980 588385 570815 552064 532521 512832 493454
63833 493454 474452 455752 437583 420535 405143 391503 379316 368203 358009 348899 341072 334264
$$ packed form
63914B952088k32100k17900k01927j84475j66288j48677j32650j18151j04510
63905A445410r1445p9331o8708n9819n2561m6663m1841l7930l4729l1809k8819
63894H71755k6076k4308k3613k3168k2320k1409k0947k0466j9083j6930j5137
63883F38298j4278j3672j2391j0321p905n443l092j054O22K245M038N798P224
63870E90069Q393R607J0923J2123J3019J3524J3553J3124J2436J1650J0620R087
63858G28128P173N419M266L535K555Q10j625m218o483q212r430j0341j1390j3007
63844F87180j5050j6710j7251j6832j6357j6595j7570j8751j9543j9689j9378
63833D93454j9002j8700j8169j7048j5392j3640j2187j1113j0194r110p827o808
$$ plain form
63821 334264 327688 320749 313716 307387 302176 297890 294331 291608 289740 288414 287320 286413 285687 284997 284228
63806 284228 283261 281700 279098 275664 272305 269690 267637 265596 263291 260667 257738 254866 252644 251090
63792 251090 249402 246975 244242 242017 240437 239143 238037 237235 236564 235836 235320 235275 235268 234696 233788 233271 233164
63775 233164 232822 232175 231950 232426 232797 232182 230655 228940 227624 227020 227248 228042 228826 229345 229917 230849 231967
63758 231967 232961 233798 234491 234823 234607 233936 232960 231745 230613 230235 230956 232257 233283 233785 234279 235369 237186
63741 237186 239438 241796 244239 247013 250202 253382 255953 257741 258991 259822 260131 260114 260409 261498 263351
63726 263351 265796 268842 272411 276229 280271 284875 290033 295010 299121 302468 305365 307407 307858 306860 305483
63711 305483 304477 303597 302344 300843 299584 298670 297739 296530 295210 294093 293272 292643 292296 292692 294273 296893
$$ packed form
63821C34264o576o939p033o329n211m286l559k723j868j326j094r07p26o90p69
63806B84228r67j561k602l434l359k615k053k041k305k624k929k872k222j554
63792B51090j688k427k733k225j580j294j106q02o71p28n16m5pn72r08n17j07
63775B33164l42o47k25M76L71o15j527j715j316o04K28P94P84N19N72R32J118
63758B31967R94Q37O93L32k16o71r76j215j132l78P21J301J026N02M94J090J817
63741B37186K252K358K443K774L189L180K571J788J250Q31L09j7K95J089J853
63726B63351K445L046L569L818M042M604N158M977M111L347K897K042M51r98j377
63711C05483j006q80j253j501j259r14r31j209j320j117q21o29l47L96J581K620
$$ plain form
63695 296893 299873 302806 306040 310129 314926 319561 323282 325989 327977 329470 330553 331300 331773 331979 331895
63680 331895 331459 330552 329242 328071 327794 328588 329735 330327 330188 329826 329626 329480 329203 328823 328267 327184 325523
63663 325523 323959 323183 322808 321607 318973 315651 312741 310449 308205 305595 302634 299381 295907 292619 290036
63648 290036 288128 286325 284391 282878 282521 283410 284953 286463 287638 288711 290254 292665 295728 298890 302012
63633 302012 305609 310253 315995 322498 329485 336850 344567 352652 361070 369585 378001 386691 396556 408188
63619 408188 421359 435646 451336 469327 490227 513936 540060 568363 598700 630670 663380
63608 663380 695495 725584 752637 776230 796101 811723 822547 828580 830462 828963 824681 818282
63596 818282 810709 802861 795089 787089 778277 768124 756122 741670 724283 704066 681860 658769
$$ packed form
63695B96893K980K933L234M089M797M635L721K707J988J493J083P47M73K06q4
63680C31895m36r07j310j171k77P94J147N92j39l62k00j46k77l80n56j083j661
63663C25523j564p76l75j201k634l322k910k292k244k610k961l253l474l288k583
63648B90036j908j803j934j513l57Q89J543J510J175J073J543K411L063L162L122
63633C02012L597M644N742O503O987P365P717Q085Q418Q515Q416Q690R865J1632
63619D08188J3171J4287J5690J7991K0900K3709K6124K8303L0337L1970L2710
63608F63380L2115L0089K7053K3593J9871J5622J0824O033J882j499m282o399
63596H18282p573p848p772q000q812j0153j2002j4452j7387k0217k2206k3091
$$ plain form
63584 658769 635622 612991 591526 571830 553987 537627 522635 509461 498512 489638 482620 477850
63572 477850 475931 476594 478565 480737 483108 486324 490650 495829 501841 509218 518373 528883 539857 550951
63558 550951 562675 575621 589882 605582 623618 645193 670559 698790 729097 761765 797237
63547 797237 834453 870657 902878 929276 949156 962321 968862 969387 965025 957089 946772 935114
63535 935114 923057 911399 900586 890488 880350 869099 855822 840027 821501 800116 775953
63524 775953 749532 721666 692958 663666 634300 606098 580411 557453 536066 515067 494649
63513 494649 476135 460548 447741 436843 427056 417941 409361 401400 394193 387690 381786 376713 372984
63500 372984 370672 368981 366876 364104 361349 359400 358379 357850 357411 356950 356447 355873 355449 355709 356938 358595
$$ packed form
63584F58769k3147k2631k1465j9696j7843j6360j4992j3174j0949q874p018m770
63572D77850j919O63J971K172K371L216M326N179O012P377R155J0510J0974J1094
63558E50951J1724J2946J4261J5700J8036K1575K5366K8231L0307L2668L5472
63547G97237L7216L6204L2221K6398J9880J3165O541N25m362p936j0317j1658
63535I35114j2057j1658j0813j0098j0138j1251j3277j5795j8526k1385k4163
63524G75953k6421k7866k8708k9292k9366k8202k5687k2958k1387k0999k0418
63513D94649j8514j5587j2807j0898r787r115q580p961p207o503n904n073l729
63500C72984k312j691k105k772k755j949j021n29m39m61n03n74m24K60J229J657
$$ plain form
63484 358595 359756 360268 361051 363003 365922 368913 371558 374185 377111 380135 382769 384560 385146 384418 382670
63469 382670 380292 377327 373701 369808 366356 363643 361461 359675 358291 356863 354673 351822 349532 348918
63455 348918 349958 352024 354839 358354 362218 366108 370342 375499 381606 388280 395563 404072 414306 426290
63441 426290 439900 455178 472270 491354 512564 535667 559857 584109 607604 629577 649068
63430 649068 665354 678584 689618 699375 708750 719027 731697 747717 767306 790503 817431 847861
63418 847861 880915 915466 950466 984683 1016363 1043547 1064682 1078876 1085820 1085838 1080090 1070511 1059185
63405 1059185 1047536 1036028 1024630 1013345 1001893 988936 972247 950193 922997 892306 859815
63394 859815 826584 793411 761154 730496 701731 674906 650012 627025 606009 587148 570531
$$ packed form
63484C58595J161N12P83J952K919K991K645K627K926L024K634J791N86p28j748
63469C82670k378k965l626l893l452k713k182j786j384j428k190k851k290o14
63455C48918J040K066K815L515L864L890M234N157O107O674P283Q509J0234J1984
63441D26290J3610J5278J7092J9084K1210K3103K4190K4252K3495K1973J9491
63430F49068J6286J3230J1034R757R375J0277J2670J6020J9589K3197K6928L0430
63418H47861L3054L4551L5000L4217L1680K7184K1135J4194O944J8n748r579j1326
63405A059185j1649j1508j1398j1285j1452j2957j6689k2054k7196l0691l2491
63394H59815l3231l3173l2257l0658k8765k6825k4894k2987k1016j8861j6617
$$ plain form
63383 570531 555972 543307 532769 524827 519635 516885 516224 517569 521025 526639 534204 543163 552878 563223
63369 563223 574786 588238 603614 620482 638717 658771 681187 706156 733500 762895 794120
63358 794120 827221 862196 898221 933378 965546 993447 1016584 1034420 1046229 1051757 1051581 1046760
63346 1046760 1038497 1028086 1016665 1004780 992374 979177 964819 948680 930106 908860 885073
63335 885073 858847 830345 800329 770104 740728 712618 686026 661559 639977 621696 606653
63324 606653 594546 585132 578264 573454 569318 563847 555682 544899 532286 518201 502755 486678 471173
63311 471173 456958 444181 433116 424112 416775 410198 404212 399583 396673 394762 393097 391780 391089 390679
63297 390679 390049 389187 388074 386151 383017 379265 375866 372990 370098 366950 363822 360818 357627 354027 350213
$$ packed form
63383E70531j4559j2665j0538p942n192k750o61J345L456N614P565Q959R715J0345
63369E63223J1563J3452J5376J6868J8235K0054K2416K4969K7344K9395L1225
63358G94120L3101L4975L6025L5157L2168K7901K3137J7836J1809N528j76m821
63346A046760q263j0411j1421j1885j2406j3197j4358j6139j8574k1246k3787
63335H85073k6226k8502l0016l0225k9376k8110k6592k4467k1582j8281j5043
63324F06653j2107r414o868m810m136n471q165j0783j2613j4085j5446j6077j5505
63311D71173j4215j2777j1065r004p337o577n986m629k910j911j665j317o91m10
63297C90679o30q62j113j923l134l752l399k876k892l148l128l004l191l600l814
$$ plain form
63282 350213 346614 343644 341546 340160 338935 337409 335586 333725 332038 330763 330151 330124 330318 330707 331723
63267 331723 333417 335090 336259 337489 339636 342657 345806 348618 351020 352877 354294 356106 359139 363062
63253 363062 366813 370137 373816 378374 383505 389007 395340 402829 411034 419442 428235 437996 449073 461566
63239 461566 475431 490274 505571 521518 539158 559190 581036 603590 626489 650077 674439
63228 674439 699202 724153 749331 774423 798649 821548 843548 865551 888123 911214 934440
63217 934440 957437 980069 1002410 1024440 1045620 1064775 1080488 1091714 1098110 1099825 1097018 1089594
63205 1089594 1077449 1060828 1040358 1016784 990854 963342 934895 905873 876689 848406 822558
63194 822558 800020 780362 762751 747278 734828 725696 719019 713903 710577 709917 712113 716436 722271
$$ packed form
63282C50213l599k970k098j386j225j526j823j861j687j275o12k7J94L89J016
63267C31723J694J673J169J230K147L021L149K812K402J857J417J812L033L923
63253C63062L751L324L679M558N131N502O333P489Q205Q408Q793R761J1077J2493
63239D61566J3865J4843J5297J5947J7640K0032K1846K2554K2899K3588K4362
63228F74439K4763K4951K5178K5092K4226K2899K2000K2003K2572K3091K3226
63217I34440K2997K2632K2341K2030K1180J9155J5713J1226O396J715k807p424
63205A089594j2145j6621k0470k3574k5930k7512k8447k9022k9184k8283k5848
63194H22558k2538j9658j7611j5473j2450r132o677n116l326o60K196M323N835
$$ plain form
63181 722271 729786 739328 750615 762897 775654 788788 802276 815980 829772 843442 856475 868298
63169 868298 878887 888795 898354 907042 913809 917831 918782 916579 911175 902565 890775 875941 858530
63156 858530 839344 819033 797687 775201 751977 728998 707148 686723 667593 649568 632554
63145 632554 616616 602047 589175 578006 568273 559849 552809 546926 541503 536103 531271 528056 526835
63132 526835 526961 527623 528648 530328 532832 536137 540269 545213 550674 556316 562211 568661 575472 581828 587124
63117 587124 591599 595828 599825 603081 605352 606932 608132 608970 609539 610282 611524 612939 613800 613733 613033 612279
63101 612279 611775 611307 610324 608396 605631 602585 599732 597194 595036 593533 592863 592700 592510 592256 592513 593820
63085 593820 596178 599265 602811 606579 610250 613668 617089 620867 624923 628851 632627 636877 642236 648713
$$ packed form
63181G22271P515R542J1287J2282J2757J3134J3488J3704J3792J3670J3033J1823
63169H68298J0589R908R559Q688O767M022R51k203n404q610j1790j4834j7411
63156H58530j9186k0311k1346k2486k3224k2979k1850k0425j9130j8025j7014
63145F32554j5938j4569j2872j1169r733q424p040n883n423n400m832l215j221
63132E26835J26O62J025J680K504L305M132M944N461N642N895O450O811O356N296
63117E87124M475M229L997L256K271J580J200Q38N69P43J242J415Q61o7p00p54
63101F12279n04m68r83j928k765l046k853k538k158j503o70j63j90k54K57J307
63085E93820K358L087L546L768L671L418L421L778M056L928L776M250N359O477
$$ plain form
63071 648713 655949 663880 672708 682338 692418 703044 714918 728483 743373 759166 776370 796068
63059 796068 818692 843736 870777 900264 933061 969593 1009709 1053166 1099958 1150192 1203674
63048 1203674 1259558 1316527 1373584 1430635 1488033 1545642 1602763 1658948 1714342 1769124 1823126
63037 1823126 1876232 1928628 1980335 2030937 2080082 2127743 2173415 2215404 2251496 2280123 2300365
63026 2300365 2311057 2310628 2298006 2273311 2237618 2192420 2139254 2079389 2013713 1943279 1870048 1796738
63014 1796738 1725702 1658126 1594348 1534705 1479955 1431089 1388876 1353465 1324377 1301024 1283322
63003 1283322 1271658 1266204 1266410 1271281 1280063 1292477 1308213 1326326 1345469 1364969 1385404 1407655
62991 1407655 1431378 1454963 1477115 1497903 1517871 1536835 1554183 1569817 1583809 1595237 1602290
$$ packed form
63071F48713P236P931Q828R630J0080J0626J1874J3565J4890J5793J7204J9698
63059G96068K2624K5044K7041K9487L2797L6532M0116M3457M6792N0234N3482
63048A203674N5884N6969N7057N7051N7398N7609N7121N6185N5394N4782N4002
63037A823126N3106N2396N1707N0602M9145M7661M5672M1989L6092K8627K0242
63026B300365J0692m29j2622k4695l5693m5198n3166n9865o5676p0434p3231p3310
63014A796738p1036o7576o3778n9643n4750m8866m2213l5411k9088k3353j7702
63003A283322j1664n454K06M871Q782J2414J5736J8113J9143J9500K0435K2251
62991A407655K3723K3585K2152K0788J9968J8964J7348J5634J3992J1428P053
$$ plain form
62980 1602290 1603707 1599447 1589773 1574439 1553112 1525981 1493524 1456207 1414903 1371256 1327029 1283199
62968 1283199 1239999 1197601 1156293 1116193 1077355 1040273 1005815 974471 945882 919226 893898
62957 893898 869674 846485 824296 803171 783170 764083 745445 726947 708785 691469 675338
62946 675338 660413 646662 634156 622862 612483 602640 593137 584051 575684 568436 562417 557138 551865
62933 551865 546456 541516 537578 534498 531916 529873 528492 527388 526028 524489 523307 522611 522044 521509 521303
62918 521303 521280 520473 518011 514128 509917 506224 502978 499493 495339 490958 487379 485169 483825 482422 480624
62903 480624 478643 476486 474005 471693 470565 470835 471341 470799 469220 467626 466752 466524 466526 466425 466001 465258 464563
62886 464563 464401 464914 465836 466815 467680 468493 469439 470517 471309 471315 470666 470139 470248 470626 470609 470091 469408 468619 467446
$$ packed form
62980A602290J417m260r674j5334k1327k7131l2457l7317m1304m3647m4227m3830
62968A283199m3200m2398m1308m0100l8838l7082l4458l1344k8589k6656k5328
62957H93898k4224k3189k2189k1125k0001j9087j8638j8498j8162j7316j6131
62946F75338j4925j3751j2506j1294j0379r843r503r086q367p248o019n279n273
62933E51865n409m940l938l080k582k043j381j104j360j539j182o96n67n35k06
62918E21303k3q07k462l883m211l693l246l485m154m381l579k210j344j403j798
62903D80624j981k157k481k312j128K70N06n42j579j594q74k28Kj01m24p43o95
62886D64563j62N13R22R79Q65Q13R46J078P92Oo49n27J09L78j7n18o83p89j173
$$ plain form
62867 467446 465831 464080 462431 460835 459264 457909 456995 456637 456910 457851 459301 460923 462443 463760 464792
62852 464792 465399 465504 465219 464807 464546 464564 464724 464747 464504 464067 463451 462530 461384 460479 460191 460211 459759 458402 456449
62833 456449 454547 453147 452456 452580 453474 454784 455938 456503 456517 456510 457124 458639 460859 463454 466341 469664 473470
62816 473470 477518 481424 484969 488343 492115 496873 502782 509493 516487 523425 530206 536831 543347 549821
62802 549821 556361 563225 570920 579916 590181 601166 612424 624093 636677 650540 665844 682870
62790 682870 702187 724562 750770 781360 816486 856102 900493 950444 1006675 1069202 1137413
62779 1137413 1210637 1288420 1370406 1456244 1545526 1637451 1730467 1822372 1910721 1993013 2066722
62768 2066722 2129612 2180144 2217340 2240279 2248050 2240351 2217845 2181778 2133434 2074159 2005666 1929998
$$ packed form
62867D67446j615j751j649j596j571j355r14l58K73R41J450J622J520J317J032
62852D64792O07J05k85m12k61J8J60K3k43m37o16r21j146r05k88K0m52j357j953
62833D56449j902j400o91J24Q94J310J154N65J4pO14J515K220K595K887L323L806
62816D73470M048L906L545L374L772M758N909O711O994O938O781O625O516O474
62802E49821O540O864P695Q996J0265J0985J1258J1669J2584J3863J5304J7026
62790F82870J9317K2375K6208L0590L5126L9616M4391M9951N6231O2527O8211
62779A137413P3224P7783Q1986Q5838Q9282R1925R3016R1905Q8349Q2292P3709
62768B066722O2890N0532L7196K2939P771p699k2506l6067m8344n9275o8493p5668
$$ plain form
62756 1929998 1849160 1764926 1678864 1592328 1506415 1422136 1340713 1263546 1191688 1125302 1063771
62745 1063771 1006422 953179 904495 860686 821442 786068 754121 725614 700529 678376 658499
62734 658499 640720 625277 611972 599833 588079 577246 568705 562911 558650 554308 549526 545223 542284
62721 542284 540736 540009 539520 539019 538873 540038 543372 548842 555712 563548 572673 583623 596621 611737
62707 611737 629192 649242 672018 697578 725873 756578 789374 824518 862801 904732 950111
62696 950111 998524 1049723 1103169 1157678 1212018 1265541 1317750 1367383 1412438 1451024 1481851
62685 1481851 1504062 1517035 1520427 1514109 1498102 1472810 1439259 1398879 1353072 1303141 1250480 1196494
62673 1196494 1142392 1089125 1037400 987573 939702 893899 850496 809785 771920 737263 706329
$$ packed form
62756A929998q0838q4234q6062q6536q5913q4279q1423p7167p1858o6386o1531
62745A063771n7349n3243m8684m3809l9244l5374l1947k8507k5085k2153j9877
62734F58499j7779j5443j3305j2139j1754j0833q541n794m261m342m782m303k939
62721E42284j548p27m89n01j46J165L334N470O870P836R125J0950J2998J5116
62707F11737J7455K0050K2776K5560K8295L0705L2796L5144L8283M1931M5379
62696I50111M8413N1199N3446N4509N4340N3523N2209M9633M5055L8586L0827
62685A481851K2211J2973L392o318j6007k5292l3551m0380m5807m9931n2661n3986
62673A196494n4102n3267n1725m9827m7871m5803m3403m0711l7865l4657l0934
$$ plain form
62662 706329 678949 653925 630088 607533 587266 569848 554957 542102 531012 521217 511902 502490
62650 502490 493017 483866 475428 468004 461623 455957 450810 446633 443956 442378 440827 438983 437690 437584
62636 437584 437965 437610 436182 434211 432050 429607 427024 424898 423588 422766 421897 420891 420058 419619 419571 419980
62620 419980 421167 423434 426658 430365 434231 438381 443063 448173 453282 458067 462586 467154 472161 477954
62606 477954 484738 492635 502017 513661 528245 545676 565232 586490 609929 636528 666937 701088
62594 701088 738375 778069 819598 862555 906477 950736 994646 1037398 1077716 1113799 1143949
62583 1143949 1167128 1182724 1190108 1189006 1180117 1164738 1143685 1117110 1085412 1049796 1011779 972669
62571 972669 933645 895680 859033 823270 788190 754368 722594 693240 666507 642740 621973
$$ packed form
62662G06329k7380k5024k3837k2555k0267j7418j4891j2855j1090r795r315r412
62650E02490r473r151q438p424o381n666n147m177k677j578j551j844j293j06
62636D37584L81l55j428j971k161k443k583k126j310q22q69j006q33m39m8M09
62620D19980J187K267L224L707L866M150M682N110N109M785M519M568N007N793
62606D77954O784P897R382J1644J4584J7431J9556K1258K3439K6599L0409L4151
62594G01088L7287L9694M1529M2957M3922M4259M3910M2752M0318L6083L0150
62583A143949K3179J5596P384j102q889j5379k1053k6575l1698l5616l8017l9110
62571I72669l9024l7965l6647l5763l5080l3822l1774k9354k6733k3767k0767
$$ plain form
62560 621973 603555 586775 571567 558148 546297 535617 526215 518471 512217 506796 501904 497716 494168
62547 494168 490774 487406 484636 482926 481921 480917 479749 478879 478771 479493 480700 481717 481838 480937 479758
62532 479758 479206 479365 479614 479833 481107 484849 491377 499724 508755 518088 527903 538421 549987 563327
62518 563327 579195 597731 618522 641269 666015 692741 721188 751270 783235 817140 852389
62507 852389 887987 923042 956770 988267 1016626 1041275 1061957 1078456 1090530 1098191 1101964 1102913
62495 1102913 1102434 1101938 1102693 1105974 1113156 1125258 1142410 1164172 1190477 1221893 1258861 1301183 1348419
62482 1348419 1400068 1454740 1509602 1561398 1607864 1647661 1679286 1701012 1712023 1712786 1703896 1684980
62470 1684980 1655106 1614029 1562829 1503635 1438968 1371109 1301702 1231856 1162585 1095092 1030745
$$ packed form
62560F21973j8418j6780j5208j3419j1851j0680r402p744o254n421m892m188l548
62547D94168l394l368k770j710j005j004j168q70j08P22J207J017J21r01j179
62532D79758n52J59K49K19J274L742O528Q347R031R333R815J0518J1566J3340
62518E63327J5868J8536K0791K2747K4746K6726K8447L0082L1965L3905L5249
62507H52389L5598L5055L3728L1497K8359K4649K0682J6499J2074P661L773R49
62495A102913m79m96P55L281P182J2102J7152K1762K6305L1416L6968M2322M7236
62482A348419N1649N4672N4862N1796M6466L9797L1625K1726J1011P63q890j8916
62470A684980k9874m1077n1200n9194o4667o7859o9407o9846o9271o7493o4347
$$ plain form
62459 1030745 970935 916738 868408 825302 786727 752806 724073 700309 680329 663050 648237
62448 648237 636049 626426 619238 614495 611946 610867 610710 611664 614118 617796 621909 625979 630048 634169
62434 634169 638134 641652 644295 645297 643895 640045 634466 627879 620424 611891 602220 591753 581275 571805
62420 571805 563977 557480 551393 545149 538865 532689 526331 519606 513014 507318 502702 498768 495275 492357
62406 492357 489951 487480 484456 481245 478874 478032 478435 479265 480148 481465 483694 486618 489484 491837 493898
62391 493898 496003 498015 499577 500816 502431 505055 508710 512909 517118 521084 524974 529279 534494 540787
62377 540787 548014 556074 565057 574975 585516 596210 606822 617526 628761 641048 654950 671073
62365 671073 689951 711861 736817 764891 796605 832860 874261 920554 970796 1024043 1079622
$$ packed form
62459A030745n9810n4197m8330m3106l8575l3921k8733k3764j9980j7279j4813
62448F48237j2188r623p188m743k549j079j57R54K454L678M113M070M069M121
62434F34169L965L518K643J002j402l850n579o587p455q533r671j0467j0478r470
62420E71805p828o497o087o244o284o176o358o725o592n696m616l934l493k918
62406D92357k406k471l024l211k371q42M03Q30Q83J317K229K924K866K353K061
62391D93898K105K012J562J239J615K624L655M199M209L966L890M305N215O293
62377E40787P227Q060Q983R918J0541J0694J0612J0704J1235J2287J3902J6123
62365F71073J8878K1910K4956K8074L1714L6255M1401M6293N0242N3247N5579
$$ plain form
62354 1079622 1136750 1194140 1250098 1302851 1350706 1392138 1425947 1451436 1468516 1477769 1480299 1477082
62342 1477082 1468244 1453271 1432145 1405950 1376055 1343034 1306950 1268554 1229556 1191568 1155258
62331 1155258 1120693 1088018 1057408 1028732 1001725 976350 952636 930266 908696 887600 866889
62320 866889 846329 825582 804625 783701 762710 741128 718858 696889 676661 658848 643093
62309 643093 628902 616363 605860 597394 590469 584539 579350 574868 571047 567716 564648 561718 559031
62296 559031 556903 555708 555674 556677 558198 559637 560906 562678 565826 570559 576237 582006 587404 592444 597485
62281 597485 603055 609395 615988 621985 627386 633320 640714 649088 657331 665374 674325 684950 696912 709757
62267 709757 723988 740628 760088 781922 805553 831025 859206 891407 928512 970352 1016193
$$ packed form
62354A079622N7128N7390N5958N2753M7855M1432L3809K5489J7080R253K530l217
62342A477082q838j4973k1126k6195k9895l3021l6084l8396l8998l7988l6310
62331A155258l4565l2675l0610k8676k7007k5375k3714k2370k1570k1096k0711
62320H66889k0560k0747k0957k0924k0991k1582k2270k1969k0228j7813j5755
62309F43093j4191j2539j0503q466o925n930n189m482l821l331l068k930k687
62296E59031k128j195l4J003J521J439J269J772L148M733N678N769N398N040N041
62281E97485N570O340O593N997N401N934P394Q374Q243Q043Q951J0625J1962J2845
62267G09757J4231J6640J9460K1834K3631K5472K8181L2201L7105M1840M5841
$$ plain form
62256 1016193 1065824 1119556 1176872 1235603 1292912 1346775 1396139 1440059 1477341 1506931 1528233
62245 1528233 1541177 1546278 1544368 1535820 1520240 1497312 1467674 1432415 1392067 1346871 1297972 1247548
62233 1247548 1197551 1148911 1102088 1057750 1016504 978456 943488 911788 883774 859615 838947
62222 838947 820955 804733 789849 776593 765423 756117 747791 739811 732270 725491 719449 713947 709009
62209 709009 704809 701332 698378 695811 693755 692634 692932 694669 697166 699685 702315 705815 710578 716210
62195 716210 722241 728690 735601 742492 748783 754508 760207 766276 772836 780138 788675 798711 809805 820883
62181 820883 830908 839613 847534 855160 862244 868380 874141 880974 889740 899998 911150 923801 939446
62168 939446 959119 982896 1010458 1041486 1075427 1111345 1148125 1184583 1219365 1250960 1277880
$$ packed form
62256A016193M9631N3732N7316N8731N7309N3863M9364M3920L7282K9590K1302
62245A528233J2944N101j910q548j5580k2928k9638l5259m0348m5196m8899n0424
62233A247548m9997m8640m6823m4338m1246l8048l4968l1700k8014k4159k0668
62222H38947j7992j6222j4884j3256j1170r306q326p980p541o779o042n502m938
62209G09009m200l477k954k567k056j121K98J737K497K519K630L500M763N632
62195G16210O031O449O911O891O291N725N699O069O560P302Q537J0036J1094J1078
62181H20883J0025Q705P921P626P084O136N761O833Q766J0258J1152J2651J5645
62168I39446J9673K3777K7562L1028L3941L5918L6780L6458L4782L1595K6920
$$ plain form
62157 1277880 1298763 1312620 1319336 1319840 1315372 1306502 1293075 1275044 1253066 1228175 1200995 1171385
62145 1171385 1138932 1103960 1068089 1033532 1001661 972463 945490 920889 899098 879933 862711
62134 862711 847330 834534 824727 816833 808768 799113 788176 777382 767782 759305 751475 744523 739402
62121 739402 736717 736046 736552 737910 740328 743797 747648 750804 752347 752012 750288 747924 745198 741806 737566
62106 737566 732815 727853 722369 715868 708441 700597 692458 683732 674535 665799 658650 653666 650876 650149
62092 650149 651386 654441 659049 664819 671256 677838 684103 689727 694780 699987 706440 714699 724265 734217
62078 734217 744315 755205 767644 781896 797892 815608 835033 855936 877924 900778 924698
62067 924698 950118 977216 1005648 1034832 1064389 1093968 1122678 1149118 1172127 1191181 1205856
$$ packed form
62157A277880K0883J3857O716N04m468q870j3427j8031k1978k4891k7180k9610
62145A171385l2453l4972l5871l4557l1871k9198k6973k4601k1791j9165j7222
62134H62711j5381j2796r807p894q065r655j0937j0794r600q477p830o952n121
62121G39402k685o71N06J358K418L469L851L156J543l35j724k364k726l392m240
62106G37566m751m962n484o501p427p844q139q726r197q736p149m984k790p27
62092F50149J237L055M608N770O437O582O265N624N053N207O453Q259R566R952
62078G34217J0098J0890J2439J4252J5996J7716J9425K0903K1988K2854K3920
62067I24698K5420K7098K8432K9184K9557K9579K8710K6440K3009J9054J4675
$$ plain form
62056 1205856 1215383 1219100 1217004 1209469 1196753 1179253 1157925 1133823 1107232 1077829 1045632 1011296
62044 1011296 975474 938462 900644 862846 826066 791054 758262 727861 699717 673543 649143
62033 649143 626416 605347 586195 569462 555211 542616 530735 519579 509802 501385 493394 485196
62021 485196 477197 470064 463882 458508 454115 450704 447494 443563 439043 435067 432534 431440 431495 432798 435457
62006 435457 438894 442069 444505 446784 449838 453965 458811 464098 469872 475912 481389 485454 487951 489226
61992 489226 489461 488619 486878 484618 481909 478373 473652 467791 461118 453963 446550 438999 431472 424425 418513
61977 418513 413945 410088 406007 401300 396152 390923 386121 382525 380603 379816 379052 377774 376246 374732 373189
61962 373189 371735 370687 369933 368992 367985 367754 368645 369851 370551 371053 372154 373887 375725 377761 380860 385641
$$ packed form
62056A205856R527L717k096p535j2716j7500k1328k4102k6591k9403l2197l4336
62044A011296l5822l7012l7818l7798l6780l5012l2792l0401k8144k6174k4400
62033F49143k2727k1069j9152j6733j4251j2595j1881j1156r777q417p991q198
62021D85196p999p133o182n374m393l411l210l931m520l976k533j094N5J303K659
62006D35457L437L175K436K279L054M127M846N287N774O040N477M065K497J275
61992D89226K35q42j741k260k709l536m721n861o673p155p413p551p527p047n912
61977D18513m568l857m081m707n148n229m802l596j922p87p64j278j528j514j543
61962C73189j454j048p54r41j007k31Q91J206P00N02J101J733J838K036L099M781
$$ plain form
61946 385641 391959 399437 407877 416971 426178 435269 444763 455450 467502 480231 492810 505122 517732
61933 517732 531069 544787 558093 570475 581848 592110 600974 608203 613598 616685 616903 614354 610103
61920 610103 605485 601308 597711 594466 591222 587842 584781 582910 582841 584666 588460 594603 603301 614064
61906 614064 625898 637815 649049 659122 667948 675570 681639 685432 686557 685259 681907 676652 669819
61893 669819 662092 653946 645378 636550 628155 620647 613661 606862 600836 596258 592462 587835 581638 574634
61879 574634 567772 561062 554031 546615 539171 531994 525250 519180 514040 509891 506591 503927 501791 500349
61865 500349 500025 501152 503704 507517 512618 519037 526449 534460 543248 553527 565762 579794 595316
61852 595316 612364 631059 651138 672042 693438 715415 738059 760847 782534 801804 818027
$$ packed form
61946C85641O318P478Q440R094R207R091R494J0687J2052J2729J2579J2312J2610
61933E17732J3337J3718J3306J2382J1373J0262Q864P229N395L087K18k549m251
61920F10103m618m177l597l245l244l380l061j871o9J825L794O143Q698J0763
61906F14064J1834J1917J1234J0073Q826P622O069L793J125j298l352n255o833
61893F69819p727q146q568q828q395p508o986o799o026m578l796m627o197p004
61879E74634o862o710p031p416p444p177o744o070n140m149l300k664k136j442
61865E00349l24J127K552L813N101O419P412Q011Q788J0279J2235J4032J5522
61852E95316J7048J8695K0079K0904K1396K1977K2644K2788K1687J9270J6223
$$ plain form
61841 818027 831325 841888 849520 853963 855333 854003 850347 844974 838953 833333 828485 824288 820908 819002
61827 819002 819224 821938 827377 835525 845625 856189 865766 873591 879401 882889 883494 880613 874023 864244
61813 864244 852428 839585 825886 810900 794438 776840 758540 739870 721331 703593 686959
61802 686959 671219 656290 642576 630376 619230 608312 597353 586824 577276 568799 561149 554169
61790 554169 547991 542890 538881 535442 531769 527481 522970 518958 515843 513562 511832 510212 508142 505381
61776 505381 502410 500065 498674 497835 497035 496101 494936 493368 491624 490550 490760 491793 492712 493511 495224 498510
61760 498510 502781 507147 511581 516531 521756 526253 529294 530961 531740 532106 532435 532693 532087 529644 525317
61745 525317 520129 515051 510262 505646 501358 497501 493798 490109 486892 484602 482931 481184 479255 477660
$$ packed form
61841H18027J3298J0563P632M443J370j330l656n373o021n620m848m197l380j906
61827H19002K22K714N439Q148J0100J0564R577P825N810L488O05k881o590r779
61813H64244j1816j2843j3699j4986j6462j7598j8300j8670j8539j7738j6634
61802F86959j5740j4929j3714j2200j1146j0918j0959j0529r548q477p650o980
61790E54169o178n101m009l439l673m288m511m012l115k281j730j620k070k761
61776E05381k971k345j391q39q00r34j165j568j744j074K10J033R19P99J713L286
61760D98510M271M366M434M950N225M497L041J667P79L66L29K58o06k443m327
61745E25317n188n078m789m616m288l857l703l689l217k290j671j747j929j595
$$ plain form
61731 477660 476719 476190 475738 475314 474987 474709 474338 473741 472890 472007 471502 471581 472069 472779 473842 475416 477262 478948
61713 478948 480245 480998 480766 479120 476247 472878 469635 466762 464400 462593 460919 458550 454975 450500 445928
61698 445928 441914 438640 435877 433251 430515 427662 424760 421818 418902 416233 413991 412086 410278 408395
61684 408395 406254 403619 400492 397309 394586 392477 390854 389585 388460 387117 385449 383884 382852 382122
61670 382122 381131 379892 379080 379201 380022 380880 381289 381323 381676 383187 385935 389007 391558 393901 396964 400816
61654 400816 404397 406723 407665 407556 406742 405853 405778 406892 408640 410247 411565 412948 414684 416923 419977 424234
61638 424234 429686 435692 441271 445676 448731 450522 450797 449045 445427 441183 437566 434624 431598 428238
61624 428238 424908 421580 417732 413484 409883 407589 406011 404196 401985 399790 397823 396184 395202 394963 394727
$$ packed form
61731D77660r41n29m52m24l27k78l71n97q51q83n05P9M88P10J063J574J846J686
61713D78948J297P53k32j646k873l369l243k873k362j807j674k369l575m475m572
61698D45928m014l274k763k626k736k853k902k942k916k669k242j905j808j883
61684D08395k141k635l127l183k723k109j623j269j125j343j668j565j032p30
61670C82122r91j239q12J21Q21Q58M09L4L53J511K748L072K551K343L063L852
61654D00816L581K326R42j09q14q89p5J114J748J607J318J383J736K239L054M257
61638D24234N452O006N579M405L055J791K75j752l618m244l617k942l026l360
61624D28238l330l328l848m248l601k294j578j815k211k195j967j639r82k39k36
$$ plain form
61609 394727 393440 390793 387427 384191 381467 379019 376223 372677 368819 365653 363539 361588 358597 354365
61595 354365 349770 345849 343151 341704 341058 340533 339749 338868 338041 336927 335148 332959 330977 329378 327844
61580 327844 326245 324866 323918 323218 322499 321795 321385 321486 321982 322363 322048 320934 319580 318743 318867 320045 322168
61563 322168 324894 327667 330068 332005 333436 334220 334450 334642 335203 335942 336472 336876 337588 338753 340051 341047
61547 341047 341425 341078 340356 340061 340758 342198 343774 345375 347270 349286 350760 351454 351992 353137 354966 356968
61531 356968 358614 359638 360010 359960 359902 360152 360747 361604 362719 364068 365370 366064 365572 363636 360542 357016 353827
61514 353827 351397 349740 348665 348015 347797 348098 348789 349382 349386 348872 348422 348467 348945 349661 350574 351547 352258 352776 353848
61495 353848 356110 359207 362093 364060 365054 365213 364719 364049 363780 363955 364069 363867 363794 364507 366209 368573 371049
$$ packed form
61609C94727j287k647l366l236k724k448k796l546l858l166k114j951k991m232
61595C54365m595l921k698j447o46n25p84q81q27j114j779k189j982j599j534
61580C27844j599j379r48p00p19p04m10J01M96L81l15j114j354q37J24J178K123
61563C22168K726K773K401J937J431P84K30J92N61P39N30M04P12J165J298R96
61547C41047L78l47p22k95O97J440J576J601J895K016J474O94N38J145J829K002
61531C56968J646J024L72n0n8K50N95Q57J115J349J302O94m92j936l094l526l189
61514C53827k430j657j075o50k18L01O91N93Mn14m50M5M78P16R13R73P11N18J072
61495C53848K262L097K886J967R94J59m94o70k69J75J14k02p3P13J702K364K476
$$ plain form
61478 371049 373083 374303 374703 374605 374383 374340 374728 375652 376888 378014 378776 379199 379464 379869 380787 382289 383829
61461 383829 384701 384800 384590 384300 383646 382523 381490 381162 381427 381658 381585 381552 381926 382609 383261 383798 384507 385745 387607
61442 387607 389891 392305 394669 397004 399520 402454 405777 409061 411879 414400 417272 420717 424001 426190
61428 426190 427296 428294 430020 432363 434631 436402 437899 439689 442096 444815 447136 448669 449748 450876
61414 450876 451972 452537 452439 452048 451520 450480 448672 446509 444582 442844 440692 437765 434349 431004 428049
61399 428049 425477 423156 420978 418863 416740 414551 412323 410172 408214 406493 405048 403979 403356 403127 403243
61384 403243 403772 404733 405863 406759 407229 407344 407229 407098 407438 408777 411085 413639 415677 417070 418233 419588
61368 419588 421260 423147 425057 426805 428338 429800 431403 433248 435290 437466 439899 442978 447096 452164
$$ packed form
61478C71049K034J220M00r8k22m3L88R24J236J126P62M23K65M05R18J502J540
61461C83829Q72R9k10k90o54j123j033l28K65K31p3l3L74O83O52N37P09J238J862
61442C87607K284K414K364K335K516K934L323L284K818K521K872L445L284K189
61428D26190J106R98J726K343K268J771J497J790K407K719K321J533J079J128
61414D50876J096N65r8l91n28j040j808k163j927j738k152k927l416l345k955
61399D28049k572k321k178k115k123k189k228k151j958j721j445j069o23k29J16
61384D03243N29R61J130Q96M70J15j15j31L40J339K308K554K038J393J163J355
61368D19588J672J887J910J748J533J462J603J845K042K176K433L079M118N068
$$ plain form
61354 452164 457513 462564 467508 472995 479144 485291 490878 496116 501451 506755 511539 515735 519696 523451
61340 523451 526560 528883 530955 533199 535181 536128 536033 535687 535572 535204 533782 531097 527541 523537 519398 515612
61324 515612 512806 511317 511005 511453 512103 512349 511981 511681 512671 515573 519943 525133 531262 538922 548185 558396
61308 558396 568993 580133 592369 605875 620070 633914 646538 657587 666878 673860 677820 678798
61296 678798 677830 675915 672991 668389 662041 654637 646676 638048 628731 619303 610427 602151 594090 586016
61282 586016 578008 570244 562978 556698 551947 548885 547095 545918 545023 544656 545270 546908 549095 551409 553963
61267 553963 557106 560872 565048 569608 574681 580133 585624 591133 597007 603363 609795 615747 620796 624521
61253 624521 626618 627438 627996 629010 630179 630715 630342 629456 628536 627808 627372 627213 627137 627005 627038 627534 628259 628435
$$ packed form
61354D52164N349N051M944N487O149O147N587N238N335N304M784M196L961L755
61340E23451L109K323K072K244J982R47r5l46j15l68j422k685l556m004m139l786
61324E15612k806j489l12M48O50K46l68l00R90K902M370N190O129P660R263J0211
61308E58396J0597J1140J2236J3506J4195J3844J2624J1049R291O982L960R78
61296F78798r68j915k924m602o348p404p961q628r317r428q876q276q061q074
61282E86016q008p764p266o280m751l062j790j177q95l67O14J638K187K314K554
61267E53963L143L766M176M560N073N452N491N509N874O356O432N952N049L725
61253F24521K097Q20N58J014J169N36l73q86r20p28m36j59p6j32L3M96P25J76
$$ plain form
61235 628435 627477 625580 623473 621765 620711 620499 621486 623989 627854 632491 637452 642813 648761 654969 660817
61220 660817 666318 672335 679558 687572 695290 702111 708340 714594 721195 728100 735002 741417 746945 751602
61206 751602 755716 759525 763148 766972 771711 777864 785375 794056 804085 815772 828981 843212 858216
61193 858216 874063 890414 906032 919416 929885 937852 944147 949299 953350 956034 957022 956273 954281
61180 954281 951790 949168 946175 942385 937625 931938 925483 918678 912130 906059 899944 893077 885414 877544
61166 877544 869938 862609 855510 848866 842988 838022 833978 830785 828321 826683 826482 828535 833125 839893
61152 839893 848540 859314 872500 887659 903619 919119 933331 945985 957283 967716 977862 988334
61140 988334 999766 1012539 1026501 1041313 1057137 1074527 1093443 1112863 1131852 1150671 1170296
$$ packed form
61235F28435r58j897k107j708j054k12R87K503L865M637M961N361N948O208N848
61220F60817N501O017P223Q014P718O821O229O254O601O905O902O415N528M657
61206G51602M114L809L623L824M739O153P511Q681J0029J1687J3209J4231J5004
61193H58216J5847J6351J5618J3384J0469P967O295N152M051K684R88p49j992
61180I54281k491k622k993l790m760n687o455o805o548o071o115o867p663p870
61166H77544p606p329p099o644n878m966m044l193k464j638k01K053M590O768
61152H39893Q647J0774J3186J5159J5960J5500J4212J2654J1298J0433J0146J0472
61140I88334J1432J2773J3962J4812J5824J7390J8916J9420J8989J8819J9625
$$ plain form
61129 1170296 1191051 1212244 1233042 1253118 1272425 1290966 1308956 1326718 1344098 1360398 1375157
61118 1375157 1388670 1401320 1412770 1422271 1429674 1435610 1440696 1445014 1448423 1450906 1452356 1452404 1450826 1447887
61104 1447887 1443870 1438340 1430220 1418665 1403654 1385714 1365380 1342963 1318601 1292364 1264507 1235689
61092 1235689 1206720 1177910 1148875 1119188 1089085 1059388 1030845 1003713 977860 953096 929575
61081 929575 907965 889026 872757 858164 844176 830604 817926 806388 795851 786349 778135 771066
61069 771066 764607 758648 753726 750057 746925 743638 740684 739197 739400 740358 741362 742865 745664 749695 754154
61054 754154 758570 763258 768820 775652 784006 794128 806143 819933 835207 851565 868535 885877
61042 885877 903935 923362 944349 966433 989254 1013069 1038265 1064798 1092606 1122195 1154145
$$ packed form
61129A170296K0755K1193K0798K0076J9307J8541J7990J7762J7380J6300J4759
61118A375157J3513J2650J1450R501P403N936N086M318L409K483J450M8j578k939
61104A447887m017n530q120j1555j5011j7940k0334k2417k4362k6237k7857k8818
61092A235689k8969k8810k9035k9687l0103k9697k8543k7132k5853k4764k3521
61081I29575k1610j8939j6269j4593j3988j3572j2678j1538j0537r502q214p069
61069G71066o459n959m922l669l132l287k954j487K03R58J004J503K799M031M459
61054G54154M416M688N562O832Q354J0122J2015J3790J5274J6358J6970J7342
61042H85877J8058J9427K0987K2084K2821K3815K5196K6533K7808K9589L1950
$$ plain form
61031 1154145 1188266 1223933 1261066 1299956 1340196 1380834 1421776 1464066 1508515 1555133 1604526
61020 1604526 1658750 1719894 1788586 1864924 1950111 2046048 2153930 2274716 2411016 2567724
61010 2567724 2751406 2970712 3237610 3567298 3977164 4486793 5117700 5889881 6817771
61001 6817771 7911818 9184047 10645633 12289376 14067576 15884128 17608457 19103786
60993 19103786 20259927 21025228 21428943 21577880 21618022 21675244 21806751 21986127 22119861
60984 22119861 22078956 21735488 21002220 19866572 18399430 16727775 14986700 13282013 11680681
60975 11680681 10220336 8919776 7783539 6804779 5969768 5262105 4664909 4161965 3738665
60966 3738665 3382090 3080443 2823090 2601234 2408015 2238044 2087403 1953918 1836475
$$ packed form
61031A154145L4121L5667L7133L8890M0240M0638M0942M2290M4449M6618M9393
61020A604526N4224O1144O8692P6338Q5187R5937J07882J20786J36300J56708
61010B567724J83682K19306K66898L29688M09866N09629O30907P72181R27890
61001F817771J094047J272229J461586J643743J778200J816552J724329J495329
60993A9103786J156141P65301M03715J48937M0142N7222J31507J79376J33734
60984B2119861m0905l43468p33268j135648j467142j671655j741075j704687j601332
60975A1680681j460345j300560j136237r78760q35011p07663n97196n02944m23300
60966C738665l56575l01647k57353k21856j93219j69971j50641j33485j17443
$$ plain form
60957 1836475 1733672 1643472 1564117 1494698 1434580 1382683 1337517 1297515 1261196 1227344 1195203
60946 1195203 1164332 1134303 1104838 1076156 1048712 1022543 997220 972484 948480 925225 902324
60935 902324 879521 857280 836480 817558 800087 783182 766320 749749 734059 719347 705106
60924 705106 691048 677682 665705 655026 644892 634932 625594 617434 610360 603706 596870 589739 582696
60911 582696 576304 570910 566528 563084 560575 558839 557427 556033 554859 554244 554044 553721 552899 551454 549233
60896 549233 546185 542753 539629 536981 534351 531397 528354 525601 523160 520857 518664 516597 514457 511948
60882 511948 509002 505852 502819 500067 497523 495011 492481 490038 487721 485439 483307 481804 481330 481700 482424
60867 482424 483406 485049 487660 491044 494699 498167 501245 504090 507049 510090 512492 513522 513418 513270 513780
$$ packed form
60957A836475j02803r0200p9355o9419o0118n1897m5166m0002l6319l3852l2141
60946A195203l0871l0029k9465k8682k7444k6169k5323k4736k4004k3255k2901
60935I02324k2803k2241k0800j8922j7471j6905j6862j6571j5690j4712j4241
60924G05106j4058j3366j1977j0679j0134r960r338q160p074o654o836p131p043
60911E82696o392n394m382l444k509j736j412j394j174o15k00l23q22j445k221
60896E49233l048l432l124k648k630k954l043k753k441k303k193k067k140k509
60882E11948k946l150l033k752k544k512k530k443k317k282k132j503m74L70P24
60867D82424R82J643K611L384L655L468L078K845K959L041K402J030j04j48N10
$$ plain form
60852 513780 514537 514703 514037 512930 511678 510152 508173 505914 503701 501482 498619 494320 488277 480830 472597
60837 472597 464153 456009 448541 441703 435097 428539 422355 416885 411997 407446 403400 400152 397482 394911
60823 394911 392518 390969 390577 390800 390841 390413 389725 388989 388182 387212 386155 385253 384613 383906 382646 380948 379633
60806 379633 379238 379234 378768 378011 378150 379997 383132 386496 389308 391249 392255 392495 392308 391896 391244 390382 389523
60789 389523 388817 388178 387426 386434 385123 383486 381586 379372 376630 373402 370331 368148 366835 365652 363990
60774 363990 361886 359707 357765 356263 355232 354393 353402 352324 351637 351776 352863 354681 356601 357777 357969
60759 357969 358068 359238 361511 363798 365240 365936 366325 366603 366993 367945 369646 371766 373925 376019 377969 379693
60743 379693 381577 384357 388138 391903 394389 395131 394474 392963 391081 389207 387403 385470 383365 381367 379744
$$ packed form
60852E13780P57J66o66j107j252j526j979k259k213k219k863m299o043p447q233
60837D72597q444q144p468o838o606o558o184n470m888m551m046l248k670k571
60823C94911k393j549l92K23M1m28o88p36q07r70j057r02o40p07j260j698j315
60806C79633l95mm66p57J39J847L135L364K812J941J006K40j87m12o52q62q59
60789C89523p06o39p52r92j311j637j900k214k742l228l071k183j313j183j662
60774C63990k104k179j942j502j031q39r91j078o87J39J087J818J920J176J92
60759C57969R9J170K273K287J442O96L89K78L90R52J701K120K159K094J950J724
60743C79693J884K780L781L765K486P42o57j511j882j874j804j933k105j998j623
$$ plain form
60728 379744 378575 378007 378232 379084 380069 380913 381636 382042 381780 381075 380653 380613 380070 378350 375905 373582 371605
60711 371605 369827 368343 367210 366015 364399 362559 360662 358277 355158 352107 350172 349262 348410 347195 346008
60696 346008 345031 343904 342541 341389 340672 340108 339647 339791 340800 342105 342978 343424 344026 345180 346880 349148
60680 349148 352249 356358 361137 365805 369745 373033 376269 379841 383478 386593 388859 390365 391371 392036
60666 392036 392210 391453 389551 387054 384881 383296 381768 380066 378875 378900 379901 381193 382629 384384 386212
60651 386212 387721 389177 391205 393722 395980 397649 399099 400457 401132 400585 398975 396804 394459 392335 390849
60636 390849 389914 388804 386920 384445 382035 380177 379081 378831 379261 379857 380110 379875 379248 378302 377173 376221
60620 376221 375795 375894 376208 376423 376381 376107 375857 376020 376743 377642 378108 377980 377786 378192 379241 380333 381007 381542 382550
$$ packed form
60728C79744j169n68K25Q52R85Q44P23M06k62p05m22m0n43j720k445k323j977
60711C71605j778j484j133j195j616j840j897k385l119l051j935r10q52j215j187
60696C46008r77j127j363j152p17n64m61J44J009J305Q73M46O02J154J700K268
60680C49148L101M109M779M668L940L288L236L572L637L115K266J506J006O65
60666C92036J74p57j902k497k173j585j528j702j191K5J001J292J436J755J828
60651C86212J509J456K028K517K258J669J450J358O75n47j610k171k345k124j486
60636C90849r35j110j884k475k410j858j096k50M30N96K53k35o27r46j129r52
60620C76221m26R9L14K15m2k74k50J63P23Q99M66j28j94M06J049J092O74N35J008
$$ plain form
60601 382550 384130 385747 386963 387840 388551 389049 389372 389817 390440 390742 390376 389904 390249 391523 392932 393879 394630
60584 394630 395809 397593 399539 400892 401064 400143 398981 398495 398904 399987 401906 405198 409902 415381 421264
60569 421264 428026 436191 445400 454800 464102 473669 483561 493044 501265 508039 513615 517820 519906 519389
60555 519389 516769 513139 509240 505198 501087 497303 494283 492268 491504 492287 494536 497648 501125 505123 510155
60540 510155 516583 524649 534580 546268 559211 573299 589192 607298 626738 646057 664687 682771
60528 682771 699654 713568 723052 727923 728691 725880 720298 713109 705051 696097 686303 676404 667026 657851
60514 657851 648294 638685 630119 623290 618086 614277 612032 611692 613463 617467 623853 632804 644640 659891
60500 659891 679056 702168 728740 758231 790487 825605 863242 902105 940380 976865 1011542
$$ packed form
60601C82550J580J617J216Q77P11M98L23M45O23L02l66m72L45J274J409R47P51
60584C94630J179J784J946J353J72r21j162m86M09J083J919L292M704N479N883
60569D21264O762Q165R209R400R302R567R892R483Q221O774N576M205K086n17
60555E19389k620l630l899m042m111l784l020k015p64P83K249L112L477L998N032
60540E10155O428Q066R931J1688J2943J4088J5893J8106J9440J9319J8630J8084
60528F82771J6883J3914R484M871P68k811n582p189q058q954r794r899r378r175
60514F57851r557r609q566o829n204l809k245l40J771M004O386Q951J1836J5251
60500F59891J9165K3112K6572K9491L2256L5118L7637L8863L8275L6485L4677
$$ plain form
60489 1011542 1044783 1076242 1104967 1130418 1152662 1171386 1185319 1193093 1194275 1189141 1177643 1159053
60477 1159053 1132604 1098324 1057412 1011965 964221 915870 868079 821999 778801 739209 703429
60466 703429 671686 644271 620841 600251 581561 564785 550172 537266 525336 514349 504666 495969
60454 495969 487449 479146 472135 466957 462592 457664 452255 447828 445442 444634 444064 442774 440649 438084 435589
60439 435589 433558 432049 430767 429512 428611 428639 429580 430586 430755 429957 428628 427063 425298 423536 422180 421403
60423 421403 421103 421304 422118 423231 423983 424280 424900 426495 428669 430562 432073 433933 436708 440244 444073 447789
60407 447789 450922 452930 453672 453688 453753 454213 454858 455337 455569 455771 456180 456859 457806 459212 461375 464330 467770
60390 467770 471496 475687 480459 485318 489463 492644 495411 498405 501634 504591 506936 508903 511053 513775
$$ packed form
60489A011542L3241L1459K8725K5451K2244J8724J3933P774J182n134j1498j8590
60477A159053k6449l4280m0912m5447m7744m8351m7791m6080m3198l9592l5780
60466G03429l1743k7415k3430k0590j8690j6776j4613j2906j1930j0987r683q697
60454D95969q520q303p011n178m365m928n409m427k386q08n70j290k125k565k495
60439D35589k031j509j282j255r01K8R41J006J69p98j329j565j765j762j356p77
60423D21403l00K01Q14J113P52K97O20J595K174J893J511J860K775L536L829L716
60407D47789L133K008P42J6O5M60O45M79K32K02M09O79R47J406K163K955L440
60390D67770L726M191M772M859M145L181K767K994L229K957K345J967K150K722
$$ plain form
60376 513775 517053 520626 524192 527349 529546 530528 530872 531719 533661 536129 538178 539681 541371 543839 546968
60361 546968 550408 554196 558711 564285 571056 579051 588190 598244 608857 619564 629766 638795 646073
60348 646073 651227 654131 654985 654219 652062 648228 642349 634741 626501 618649 611460 604790 598707 593458 588940
60333 588940 584672 580348 576056 571853 567439 562521 557350 552575 548621 545437 542888 541137 540487 541038 542688
60318 542688 545380 549153 553960 559679 566390 574467 584143 594956 605708 615082 622356 627612 631421 634439
60304 634439 637253 640370 644083 648317 652698 656813 660245 662305 662022 658701 652485 644160 634475 623890
60290 623890 612923 602357 592823 584400 576857 570149 564478 559876 555982 552258 548324 544072 539575 534945
60276 534945 530297 525849 522008 519106 516889 514434 510889 506330 501650 497603 494169 490942 487833 485046
$$ packed form
60376E13775L278L573L566L157K197R82L44Q47J942K468K049J503J690K468L129
60361E46968L440L788M515N574O771P995R139J0054J0613J0707J0202R029P278
60348F46073N154K904Q54p66k157l834n879p608q240p852p189o670o083n249m518
60333E88940m268m324m292m203m414m918n171m775l954l184k549j751o50N51J650
60318E42688K692L773M807N719O711Q077R676J0813J0752R374P274N256L809L018
60304F34439K814L117L713M234M381M115L432K060k83l321o216q325r685j0585
60290F23890j0967j0566r534q423p543o708n671m602l894l724l934m252m497m630
60276E34945m648m448l841k902k217k455l545m559m680m047l434l227l109k787
$$ plain form
60262 485046 482590 480164 477657 475475 474219 474137 475001 476398 478073 480059 482589 485814 489550 493407 497195
60247 497195 501058 505025 508600 511047 512051 511934 511228 510239 509013 507518 505766 503864 501951 500096 498389
60232 498389 497212 497128 498222 499812 501325 503247 506553 511172 515761 519305 522244 525571 529449 533476 537908
60217 537908 543755 551503 560381 569099 577020 584496 592328 601055 610586 620402 629998 639033 647188 654348
60203 654348 661028 668067 675575 682656 688646 694040 699538 704612 707923 708982 708477 707013 704525 701112
60189 701112 697462 693918 689796 684234 677321 669976 663041 656867 651411 646327 641184 635912 630883 626366
60175 626366 622217 618242 614508 611024 607494 603750 600142 597159 594911 593263 592214 591733 591434 590836 589892
60160 589892 588951 588244 587640 586932 586142 585544 585464 586052 587206 588773 590674 592691 594302 595178 595829 597292 600020
$$ packed form
60262D85046k456k426k507k182j256q2Q64J397J675J986K530L225L736L857L788
60247D97195L863L967L575K447J004j17p06r89j226j495j752j902j913j855j707
60232D98389j177q4J094J590J513J922L306M619M589L544K939L327L878M027M432
60217E37908N847P748Q878Q718P921P476P832Q727R531R816R596R035Q155P160
60203F54348O680P039P508P081N990N394N498N074L311J059n05j464k488l413
60189G01112l650l544m122n562o913p345o935o174n456n084n143n272n029m517
60175F26366m149l975l734l484l530l744l608k983k248j648j049m81k99n98r44
60160E89892r41p07o04p08p90n98q0N88J154J567J901K017J611Q76O51J463K728
$$ plain form
60143 600020 603466 606880 610106 613456 617260 621886 627733 634841 642737 650962 659455 668168 676671 684524
60129 684524 691735 698441 704400 709164 712539 714578 715386 715393 715516 716503 718169 719726 720842 721933 723391 724982
60113 724982 726177 726879 727555 728604 729674 729761 728202 725465 722627 720113 717376 713852 709693 705296 700679
60098 700679 695731 690673 685824 681272 677166 673958 671928 670778 670165 670251 671145 672140 672199 671096 669502 668061
60082 668061 666973 666401 666541 667184 667754 667907 667705 667099 665695 663154 659476 654790 649158 642691 635657 628405
60066 628405 621225 614174 606920 599095 591067 583940 578341 573573 568578 563435 559145 556105 553681 551377
60052 551377 549599 548987 549669 551534 554695 559272 565009 571399 577936 584190 590009 595764 602010 608723 615268
60037 615268 621143 626281 630457 633009 633580 632749 631504 630256 628572 625669 621033 614850 607917 600786 592940
$$ packed form
60143F00020L446L414L226L350L804M626N847P108P896Q225Q493Q713Q503P853
60129F84524P211O706N959M764L375K039Q08PJ23R87J666J557J116J091J458J591
60113G24982J195P02O76J049J070Q7j559k737k838k514k737l524m159m397m617
60098G00679m948n058m849m552m106l208k030j150o13Q6Q94R95N9j103j594j441
60082F68061j088n72J40O43N70J53k02o06j404k541l678m686n632o467p034p252
60066F28405p180p051p254p825q028p127n599m768m995n143m290l040k424k304
60052E51377j778o12O82J865L161M577N737O390O537O254N819N755O246O713O545
60037F15268N875N138M176K552N71q31j245j248j684k903m636o183o933p131p846
$$ plain form
60022 592940 583376 572247 561206 551695 543446 535351 527340 520476 515323 511131 506932 502806 499611 497843
60008 497843 497104 496520 495340 493252 490473 487639 485406 484053 483442 483333 483580 483998 484267 484226 484183 484676 485860
59991 485860 487418 489196 491634 495230 499780 504437 508492 511815 514605 517014 518978 520139 519949 518165
59977 518165 515254 512045 508983 506061 503400 501427 500337 499798 499413 499141 499051 499011 499022 499626 501599 505238 510162
59960 510162 515823 521956 528487 535115 541170 545984 549398 551699 552965 552760 550829 547881 545179 543298
59946 543298 541760 539995 538050 536123 533984 531421 528835 526721 524787 522362 519712 518224 518975 521648
59932 521648 525225 529255 533838 538667 542831 545712 547445 548236 547723 545552 542261 538972 536168 533355 530091
59917 530091 526930 524994 524908 526463 529092 532278 535630 538939 542305 546061 550534 555893 562019 568376 574130
$$ packed form
60022E92940r564j1129j1041r511q249q095q011o864n153m192m199m126l195j768
60008D97843p39n84j180k088k779k834k233j353o11j09K47M18K69m1m3M93J184
59991D85860J558J778K438L596M550M657M055L323K790K409J964J161j90j784
59977E18165k911l209l062k922k661j973j090n39l85k72r0m0J1O04J973L639M924
59960E10162N661O133O531O628O055M814L414K301J266k05j931k948k702j881
59946E43298j538j765j945j927k139k563k586k114j934k425k650j488P51K673
59932E21648L577M030M583M829M164K881J733P91n13k171l291l289k804k813l264
59917E30091l161j936q6J555K629L186L352L309L366L756M473N359O126O357N754
$$ plain form
59902 574130 578635 581799 583887 585176 585905 586310 586425 586017 585014 583837 583049 582881 583402 584883 587458 590581
59886 590581 593426 595900 598712 602334 606488 610875 615871 621979 628891 635535 640956 644889 647623 649664
59872 649664 651477 653177 654359 654421 653202 651196 649078 647169 645462 644014 642998 642300 641435 640126 638751
59857 638751 637826 637234 636440 635503 635283 636447 638779 641747 645285 649574 654438 659441 664304 668787 672414
59842 672414 674863 676429 677657 678725 679658 680922 683153 686350 689888 693277 696335 698707 699849 699633 698460
59827 698460 696655 694203 691068 687290 682665 676894 670161 663177 656515 650294 644528 639285 634438 629778
59813 629778 625473 621944 619202 616784 614408 612136 609824 607093 604079 601561 599970 598793 597341 595587
59799 595587 593874 592239 590544 588913 587541 586212 584445 582081 579562 577700 577213 578193 579874 581175 581586
$$ packed form
59902E74130M505L164K088J289P29M05J15m08j003j177p88j68N21J481K575L123
59886E90581K845K474K812L622M154M387M996O108O912O644N421L933K734K041
59872F49664J813J700J182O2j219k006k118j909j707j448j016o98q65j309j375
59857F38751r25n92p94r37k20J164K332K968L538M289M864N003M863M483L627
59842F72414K449J566J228J068R33J264K231L197L538L389L058K372J142k16j173
59827F98460j805k452l135l778m625n771o733o984o662o221n766n243m847m660
59813F29778m305l529k742k418k376k272k312k731l014k518j591j177j452j754
59799E95587j713j635j695j631j372j329j767k364k519j862m87R80J681J301M11
$$ plain form
59784 581586 581341 580777 579948 578996 578404 578593 579527 580896 582448 584091 585927 588199 590826 593089 594280 594653
59768 594653 595130 596058 596990 597823 599284 601905 605268 608767 612508 616852 621591 626227 630729 635509 640938
59753 640938 647301 654850 663384 672068 680118 687470 694446 701178 707768 714665 722319 730592 738843 746404
59739 746404 752810 757947 762230 766220 769744 771939 772505 772361 772533 772917 772738 771798 770588 769480 768469 767464
59723 767464 766300 764673 762593 760613 759062 757389 754848 751509 748026 744671 741294 737976 734981 732204
59709 732204 729337 726573 724557 723699 723924 724956 726367 727598 728533 729826 732151 735388 739101 743354 748247
59694 748247 753009 756597 759150 761810 764997 767772 769143 769165 768492 767580 766689 765999 765318 764199 762607 760977
59678 760977 759360 757046 753389 748542 743134 737651 732461 727911 723937 719915 715356 710643 706774 704409
$$ packed form
59784E81586k45n64q29r52n92J89R34J369J552J643J836K272K627K263J191L73
59768E94653M77R28R32Q33J461K621L363L499L741M344M739M636M502M780N429
59753F40938O363P549Q534Q684Q050P352O976O732O590O897P654Q273Q251P561
59739G46404O406N137M283L990L524K195N66j44J72L84j79r40j210j108j011j005
59723G67464j164j627k080j980j551j673k541l339l483l355l377l318k995k777
59709G32204k867k764k016q58K25J032J411J231R35J293K325L237L713M253M893
59694G48247M762L588K553K660L187K775J371K2o73r12q91o90o81j119j592j630
59678G60977j617k314l657m847n408n483n190m550l974m022m559m713l869k365
$$ plain form
59664 704409 703276 702360 700691 698166 695723 694455 694591 695551 696891 698723 701171 703923 706535 708830 710826
59649 710826 712544 714008 715076 715144 713373 709413 703660 696715 688881 680303 671232 661994 652923 644517 637321
59634 637321 631545 626971 623305 620268 617288 613577 608870 603833 599394 595753 592231 587993 582752 576856
59620 576856 570862 565079 559475 553956 548580 543440 538524 533914 530001 527314 526190 526716 528674 531356
59606 531356 533810 535713 537719 540410 543223 545063 545837 546565 547902 549367 550291 550877 551863 553615 556024
59591 556024 558904 562036 564984 567232 568519 568912 568671 568098 567343 566317 564972 563584 562444 561275 559375
59576 559375 556411 552788 549233 546436 545009 545170 546287 547299 547837 548413 549274 549688 548840 546926 544835 543139
59560 543139 541943 541388 541559 542080 542466 542916 544109 546093 547984 549028 549538 550404 552028 554182 556742 560035
$$ packed form
59664G04409j133r16j669k525k443j268J36R60J340J832K448K752K612K295J996
59649G10826J718J464J068O8j771l960n753o945p834q578r071r238r071q406p196
59634F37321n776m574l666l037k980l711m707n037m439l641l522m238n241n896
59620E76856n994n783n604n519n376n140m916m610l913k687j124N26J958K682
59606E31356K454J903K006K691K813J840P74P28J337J465R24N86R86J752K409
59591E56024K880L132K948K248J287L93k41n73p55j026j345j388j140j169j900
59576E59375k964l623l555k797j427J61J117J012N38N76Q61M14q48j914k091j696
59560E43139j196n55J71N21L86M50J193J984J891J044N10Q66J624K154K560L293
$$ plain form
59544 560035 564378 569732 576049 583738 593444 605492 619746 635751 652469 667855 679308 685024 684905
59531 684905 680185 672598 664027 656310 650632 647064 645030 644139 644364 645621 647550 649609 651174 651814 651733
59516 651733 651542 651169 649380 645073 638764 632097 626025 620233 614203 607921 601389 594387 587138 580522 575119
59501 575119 570586 566384 562686 560018 558404 557346 556461 555715 555138 554708 554491 554724 555722 557668 560263 562699
59485 562699 564366 565669 567679 570810 574310 577354 580212 583867 588768 594382 599898 604975 609748 614396
59471 614396 618830 622785 626141 629014 631421 633054 633703 633884 634639 636582 639376 642213 644627 646819 649500
59456 649500 653464 659046 665910 673454 681252 688901 695788 701572 706764 712119 717424 721524 723711 724465
59442 724465 724606 724336 723404 721629 718924 715332 711499 708564 707058 706272 705258 704153 703969 705260 707609
$$ packed form
59544E60035M343N354O317P689R706J2048J4254J6005J6718J5386J1453N716j19
59531F84905m720p587q571p717n678l568k034q91K25J257J929K059J565O40q1
59516F51733j91l73j789m307o309o667o072n792o030o282o532p002p249o616n403
59501E75119m533m202l698k668j614j058q85p46n77m30k17K33R98J946K595K436
59485E62699J667J303K010L131L500L044K858L655M901N614N516N077M773M648
59471F14396M434L955L356K873K407J633O49J81P55J943K794K837K414K192K681
59456F49500L964N582O864P544P798P649O887N784N192N355N305M100K187P54
59442G24465J41k70r32j775k705l592l833k935j506p86j014j105j84J291K349
$$ plain form
59427 707609 710445 713938 718915 726112 735594 746868 759552 773905 790498 809439 830249 852660
59415 852660 877150 904332 933875 964100 992462 1016289 1033328 1042117 1042374 1035381 1023961 1011495
59403 1011495 1000412 991637 985556 982893 983906 986995 988947 986673 978316 963165 941766 916353 890088
59390 890088 865119 841843 820195 800863 784716 771803 761581 753664 747782 743475 740368 738409
59378 738409 737421 736866 736530 736940 738553 740906 743134 745018 746960 749217 751718 754443 757472 760729 764036
59363 764036 767307 770457 773415 776462 780158 784583 789082 793178 797375 802587 809126 816715 825112 834185
59349 834185 843604 853048 862638 872773 883658 895202 907060 918460 928359 936183 942183 946718 949563
59336 949563 950241 948511 944124 936576 925751 912442 897698 882008 865640 849312 833802 819199
$$ packed form
59427G07609K836L493M977P197R482J1274J2684J4353J6593J8941K0810K2411
59415H52660K4490K7182K9543L0225K8362K3827J7039Q789K57o993j1420j2466
59403A011495j1083q775o081k663J013L089J952k274q357j5151k1399k5413k6265
59390H90088k4969k3276k1648j9332j6147j2913j0222p917n882m307l107j959
59378G38409r88n55l36M10J613K353K228J884J942K257K501K725L029L257L307
59363G64036L271L150K958L047L696M425M499M096M197N212O539P589Q397R073
59349H34185R419R444R590J0135J0885J1544J1858J1400R899P824O000M535K845
59336I49563O78j730m387p548j0825j3309j4744j5690j6368j6328j5510j4603
$$ plain form
59324 819199 805216 791987 779907 768895 758508 748618 739386 730802 722855 715910 710253 705482 700977
59311 700977 696760 693222 690296 687772 686265 686973 690368 695852 702712 710745 719980 730460 742272 754926
59297 754926 766607 774798 777919 775926 769475 759397 747121 734631 723429 713959 706208 700335 696428
59284 696428 694224 693439 694017 695920 699092 703760 710239 718268 727051 736143 745826 756505 768331 781556
59270 781556 796526 812885 829365 844887 859466 873616 887221 899473 909671 917647 923575 927674
59258 927674 929975 930196 928082 924032 918953 913205 906070 896810 885958 874990 864774 854955 844971 835121
59244 835121 826242 818635 811828 805458 799917 795805 792954 790393 787392 784171 781417 779406 777833 776295
59230 776295 774596 772674 770459 767730 763982 758699 752000 744813 738085 731991 726201 720648 715604 711162
$$ packed form
59324H19199j3983j3229j2080j1012j0387r890r232q584p947o945n657m771m505
59311G00977m217l538k926k524j507P08L395N484O860Q033R235J0480J1812J2654
59297G54926J1681Q191L121j993o451j0078j2276j2490j1202r470p751n873l907
59284F96428k204p85N78J903L172M668O479Q029Q783R092R683J0679J1826J3225
59270G81556J4970J6359J6480J5522J4579J4150J3605J2252J0198P976N928M099
59258I27674K301K21k114m050n079n748p135r260j0852j0968j0216r819r984r850
59244H35121q879p607o807o370n541m112k851k561l001l221k754k011j573j538
59230G76295j699j922k215k729l748n283o699p187o728o094n790n553n044m442
$$ plain form
59216 711162 707154 703524 700335 697436 694523 691490 688377 685087 681595 678333 675765 673614 671050 667764
59202 667764 664298 661203 658393 655540 652583 649561 646301 642659 638845 635234 632042 629314 627055 625231
59188 625231 623836 623053 623099 623791 624543 624956 625230 625856 627039 628496 629679 630199 630224 630488 631710 633877 636284
59171 636284 638229 639524 640416 641351 642877 645430 648982 653027 656987 660583 663783 666487 668260 668401 666471
59156 666471 662829 658369 653510 647793 640839 633338 626477 620558 614885 609067 603705 599440 595875 591994
59142 591994 587436 582845 578880 575302 571353 566954 563086 560662 559290 557717 555481 553495 552751 553127 553919
59127 553919 555021 556911 559809 563535 567994 573164 578776 584605 591038 598764 607923 617948 628143 638028
59113 638028 647403 656623 666525 677398 688260 697848 706081 713741 720914 726816 731172 734683 737810 739999
$$ packed form
59216G11162m008l630l189k899k913l033l113l290l492l262k568k151k564l286
59202F67764l466l095k810k853k957l022l260l642l814l611l192k728k259j824
59188F25231j395p83M6O92P52M13K74O26J183J457J183N20K5K64J222K167K407
59171F36284J945J295Q92R35J526K553L552M045L960L596L200K704J773J41j930
59156F66471l642m460m859n717o954p501o861n919n673n818n362m265l565l881
59142E91994m558m591l965l578l949m399l868k424j372j573k236j986p44L76P92
59127E53919J102J890K898L726M459N170N612N829O433P726R159J0025J0195R885
59113F38028R375R220R902J0873J0862R588Q233P660P173N902M356L511L127K189
$$ plain form
59099 739999 740500 739268 736715 733278 729550 726104 722809 718985 714634 710876 708675 707697 706849 705408 703113
59084 703113 699763 695419 690723 686345 682271 677989 673188 667885 662142 656058 649950 644219 639099 634695
59070 634695 631056 628047 625372 622925 620867 619208 617580 615586 613108 610190 606916 603587 600692 598491
59056 598491 596858 595595 594615 593715 592553 591038 589485 588282 587677 587894 589043 590839 592777 594620 596349
59041 596349 597691 598286 598314 598288 598128 597223 595681 594709 595265 596962 598835 600678 603076 606579 611483 618085
59025 618085 626571 636777 648504 661823 676639 692154 707216 721096 733540 744199 752396 757501
59013 757501 759359 758389 755347 750840 745005 737851 729914 722236 715629 710315 706331 703817 702706 702602 703224
58998 703224 704646 706943 709937 713439 717277 720877 723375 724457 724744 725026 725499 725938 726155 726045 725619 725241
$$ packed form
59099G39999N01j232k553l437l728l446l295l824m351l758k201r78q48j441k295
59084G03113l350m344m696m378m074m282m801n303n743o084o108n731n120m404
59070F34695l639l009k675k447k058j659j628j994k478k918l274l329k895k201
59056E98491j633j263r80r00j162j515j553j203o05K17J149J796J938J843J729
59041E96349J342N95K8k6j60r05j542r72N56J697J873J843K398L503M904O602
59025F18085Q486J0206J1727J3319J4816J5515J5062J3880J2444J0659Q197N105
59013G57501J858r70l042m507n835p154p937p678o607n314l984k514j111j04O22
58998G03224J422K297K994L502L838L600K498J082K87K82M73M39K17j10m26l78
$$ plain form
58982 725241 725335 725710 725849 726146 728077 732595 739046 746332 754422 763875 774433 785203 796045 807666
58968 807666 820211 832670 844041 854445 864653 874845 884260 891980 897783 902175 905689 908272 909369
58955 909369 908459 905274 899649 891537 881180 868964 855181 840302 825302 811061 797448 783741
58943 783741 770103 757833 747841 739776 733074 727958 724617 722145 719358 716291 713963 712908 712750 713083
58929 713083 713893 715122 716574 718300 720401 722342 723112 722270 720362 718089 715526 712358 708538 704435 700533
58914 700533 697240 694887 693749 693967 695386 697512 699950 702998 707559 714205 722559 731880 742025 753451
58900 753451 766302 779928 793419 806360 818898 831256 843477 855719 868549 882519 897398
58889 897398 912266 926670 941320 957127 973774 989830 1004184 1016715 1027597 1036641 1043552 1048260
$$ packed form
58982G25241R4L75J39K97J931M518O451P286Q090R453J0558J0770J0842J1621
58968H07666J2545J2459J1371J0404J0208J0192R415P720N803M392L514K583J097
58955I09369r10l185n625q112j0357j2216j3783j4879j5000j4241j3613j3707
58943G83741j3638j2270r992q065o702n116l341k472k787l067k328j055j58L33
58929G13083Q10J229J452J726K101J941P70q42j908k273k563l168l820m103l902
58914G00533l293k353j138K18J419K126K438L048M561O646Q354R321J0145J1426
58900G53451J2851J3626J3491J2941J2538J2358J2221J2242J2830J3970J4879
58889H97398J4868J4404J4650J5807J6647J6056J4354J2531J0882R044O911M708
$$ plain form
58877 1048260 1050753 1051030 1049290 1045729 1040114 1032151 1022394 1012200 1002670 994123 986585 980021 974000 967982
58863 967982 962158 957174 952817 947865 941597 934513 927181 919352 910806 902056 893444 884353 874134 863169
58849 863169 852243 841615 831441 822329 814468 806780 798013 788260 778498 768993 759069 748209 736488
58836 736488 724204 711888 700432 690424 681576 673499 666702 662007 659281 657608 656523 656299 657182 659142
58822 659142 662211 666316 670827 674986 678696 682321 685908 689232 692322 695263 697680 699162 700030 700980 702076
58807 702076 702690 702284 700671 697761 693691 689013 684126 678772 672727 666568 661002 655767 650079 643921 638005
58792 638005 632602 627357 622185 617489 613500 610238 608161 607945 609519 612038 615021 618828 623839 629759
58778 629759 635890 641709 647080 652266 657658 663068 667390 669373 668621 665550 660687 654515 647743 641098
$$ packed form
58877A048260K493K77j740l561n615p963r757j0194r530q547p538o564o021o018
58863I67982n824m984m357m952o268p084p332p829q546q750q612r091j0219j0965
58849H63169j0926j0628j0174r112p861p688q767r753r762r505r924j0860j1721
58836G36488j2284j2316j1456j0008q848q077o797m695k726j673j085k24Q83J960
58822F59142L069M105M511M159L710L625L587L324L090K941K417J482Q68R50J096
58807G02076O14m06j613k910m070m678m887n354o045o159n566n235n688o158n916
58792F38005n403n245n172m696l989l262k077k16J574K519K983L807N011N920
58778F29759O131N819N371N186N392N410M322J983p52l071m863o172o772o645
$$ plain form
58764 641098 634918 629232 624015 619110 614403 610403 607959 606965 606138 604774 603833 604394 605912 607143 608012
58749 608012 609272 610916 612379 613824 615676 617242 617440 616827 617274 619517 622538 625598 629350 634500 640673
58734 640673 647138 653560 659628 665022 670153 675997 682764 689631 695996 701937 707277 711436 714770 718862
58720 718862 724791 732019 739603 747628 756664 766536 776423 785780 794643 803264 811690 819297 824635 826326
58706 826326 824231 819267 812131 802935 791919 779413 764960 747604 727555 706625 686559 667684
58694 667684 649633 632475 616640 602435 590189 580181 571910 564084 555893 547834 540833 535066 530076
58681 530076 525562 521586 518252 515515 513087 510573 508006 506179 505911 507088 509044 511765 515936 521853
58667 521853 529133 537514 547017 557264 567500 577493 587474 597052 605030 610499 613252 613051 609563 603338
$$ packed form
58764F41098o180n686n217m905m707m000k444r94q27j364r41N61J518J231Q69
58749F08012J260J644J463J445J852J566J98o13M47K243L021L060L752N150O173
58734F40673O465O422O068N394N131N844O767O867O365N941N340M159L334M092
58720G18862N929P228P584Q025R036R872R887R357Q863Q621Q426P607N338J691
58706H26326k095m964p136r196j1016j2506j4453j7356k0049k0930k0066j8875
58694F67684j8051j7158j5835j4205j2246j0008q271p826q191q059p001n767m990
58681E30076m514l976l334k737k428k514k567j827k68J177J956K721M171N917
58667E21853P280Q381R503J0247J0236R993R981R578P978N469K753k01l488o225
$$ plain form
58653 603338 595829 588026 579873 571324 563001 555409 548369 541663 535447 529665 523916 518321 513738 510739
58639 510739 509068 508374 508649 509651 510754 511700 512692 513518 513546 512906 512694 513575 515062 516454 517554 518173 518038
58622 518038 517684 518305 520171 522171 523477 524638 526462 528929 531855 535598 540256 545099 549532 553808 558087
58607 558087 561691 564134 566124 568693 572002 575658 579453 583054 585702 586983 587318 587070 585957 583936 581916
58592 581916 580799 580530 580809 582056 584867 589145 594573 601395 609973 619906 630216 640138 649414 658262
58578 658262 667242 676554 685336 692531 698596 705302 713528 722465 731461 741407 753624 768511 785991
58565 785991 806186 828864 853376 879876 909358 941516 973817 1003796 1031111 1056100 1077535
58554 1077535 1093387 1103113 1107754 1108350 1105569 1100419 1093991 1086748 1078921 1071095 1063453 1055051 1044854 1032944
$$ packed form
58653F03338p509p803q153q549q323p592p040o706o216n782n749n595m583k999
58639E10739j671o94K75J002J103R46R92Q26K8o40k12Q81J487J392J100O19j35
58622E18038l54O21J866K000J306J161J824K467K926L743M658M843M433M276M279
58607E58087L604K443J990K569L309L656L795L601K648J281L35k48j113k021k020
58592E81916j117k69K79J247K811M278N428O822Q578R933J0310R922R276Q848
58578F58262Q980R312Q782P195O065O706Q226Q937Q996R946J2217J4887J7480
58565G85991K0195K2678K4512K6500K9482L2158L2301K9979K7315K4989K1435
58554A077535J5852R726M641N96k781n150o428p243p827p826p642q402j0197j1910
$$ plain form
58540 1032944 1019680 1004360 985881 964270 940519 915467 889906 865202 842528 821745 802117
58529 802117 783792 767569 753576 741225 730221 720645 712308 704880 698401 692838 687580 682209 677337
58516 677337 673739 671120 668700 666563 665335 664853 664236 663164 662108 661328 660467 659125 657219 654855 652368
58501 652368 650318 649030 648371 648195 648516 648998 649052 648830 649308 650929 653097 655531 659057 664297 670666 677588
58485 677588 685726 695947 707992 721237 735937 752578 770718 789584 809027 828798 847588 863930
58473 863930 877422 887997 894777 896815 894300 887982 878194 865667 852469 840732 830972 822766 816408
58460 816408 812632 811443 812568 816484 823660 833341 844368 856572 870042 883633 895617 905292 912583
58447 912583 916613 916163 911188 902588 890948 876886 862070 848365 836176 824944 814881 806845 800913
$$ packed form
58540A032944j3264j5320j8479k1611k3751k5052k5561k4704k2674k0783j9628
58529H02117j8325j6223j3993j2351j1004r576q337p428o479n563n258n371m872
58516F77337l598k619k420k137j228m82o17j072j056p80q61j342j906k364k487
58501F52368k050j288o59j76L21M82N4k22M78J621K168K434L526N240O369O922
58485F77588Q138J0221J2045J3245J4700J6641J8140J8866J9443J9771J8790J6342
58473H63930J3492J0575O780K038k515o318r788j2527j3198j1737r760q206o358
58460H16408l776j189J125L916P176R681J1027J2204J3470J3591J1984R675P291
58447I12583M030m50m975q600j1640j4062j4816j3705j2189j1232j0063q036n932
$$ plain form
58434 800913 796485 793546 792478 792784 793331 793781 794848 797457 802445 810373 820502 830634 839161 846574
58420 846574 853785 859872 863000 862801 860242 855798 849464 842032 834585 826972 818305 808678 799060 789954
58406 789954 781540 774537 769415 765265 761005 757134 754813 753797 752947 752243 752569 753998 755958 758650 762569
58391 762569 767082 771097 774719 778682 782747 786339 790103 794974 800273 804631 808240 812329 816896 820879
58377 820879 824109 827203 830075 832505 835576 840508 846589 852303 857895 864703 872662 880785 889513 900110
58363 900110 912213 924486 937185 951454 966479 980133 992240 1004317 1016118 1025351 1031115 1034907
58351 1034907 1037915 1039938 1041308 1043184 1045430 1046692 1047161 1048878 1052772 1057752 1063210 1070149 1079238 1089978
58337 1089978 1102286 1116771 1132922 1149046 1164498 1180095 1196094 1211764 1226965 1242039 1256003
$$ packed form
58434H00913m428k939j068L06N47M50J067K609M988P928J0129J0132Q527P413
58420H46574P211O087L128j99k559m444o334p432p447p613q667r627r618r106
58406G89954q414p003n122m150m260l871k321j016q50p04L26J429J960K692L919
58391G62569M513M015L622L963M065L592L764M871N299M358L609M089M567L983
58377H20879L230L094K872K430L071M932O081N714N592O808P959Q123Q728J0597
58363I00110J2103J2273J2699J4269J5025J3654J2107J2077J1801R233N764L792
58351A034907L008K023J370J876K246J262M69J717L894M980N458O939R089J0740
58337A089978J2308J4485J6151J6124J5452J5597J5999J5670J5201J5074J3964
$$ plain form
58326 1256003 1267099 1275221 1281722 1286887 1289920 1291329 1292864 1294998 1296877 1298665 1301441 1304968 1308256 1312213
58312 1312213 1318887 1328103 1337739 1347366 1358545 1371507 1384654 1397632 1411744 1427054 1442190 1457340
58300 1457340 1474269 1492956 1511313 1528496 1545477 1562300 1578244 1594808 1614787 1637841 1660594
58289 1660594 1681622 1702718 1724849 1746809 1768541 1791778 1816470 1840413 1863386 1887924 1915116
58278 1915116 1943416 1972344 2003317 2036088 2068614 2101398 2137629 2177975 2219641 2261585 2306038
58267 2306038 2353615 2401806 2449882 2500563 2555054 2611129 2667853 2727438 2790505 2854265 2917408
58256 2917408 2982091 3049054 3115665 3180940 3247718 3317698 3389126 3461554 3537939 3619793 3705211
58245 3705211 3793762 3888192 3989275 4094427 4203516 4320277 4445818 4576718 4711983 4855695
$$ packed form
58326A256003J1096Q122O501N165L033J409J535K134J879J788K776L527L288L957
58312A312213O674R216R636R627J1179J2962J3147J2978J4112J5310J5136J5150
58300A457340J6929J8687J8357J7183J6981J6823J5944J6564J9979K3054K2753
58289A660594K1028K1096K2131K1960K1732K3237K4692K3943K2973K4538K7192
58278A915116K8300K8928L0973L2771L2526L2784L6231M0346M1666M1944M4453
58267B306038M7577M8191M8076N0681N4491N6075N6724N9585O3067O3760O3143
58256B917408O4683O6963O6611O5275O6778O9980P1428P2428P6385Q1854Q5418
58245C705211Q8551R4430J01083J05152J09089J16761J25541J30900J35265J43712
$$ plain form
58235 4855695 5010379 5174267 5347636 5534801 5736917 5950132 6174166 6415304 6677415
58226 6677415 6957774 7255518 7576083 7923119 8294411 8690509 9119060 9585897 10090485
58217 10090485 10635144 11229784 11882611 12595861 13376141 14238917 15197405 16258224 17434206
58208 17434206 18749906 20228698 21888215 23756564 25879882 28308036 31091631 34306058
58200 34306058 38066133 42513846 47820788 54225745 62059158 71724600 83678630 98422648
58192 98422648 116444136 138107497 163620470 193109118 226580676 263568819 302639175
58185 302639175 341185894 375720448 402493009 418250552 421046237 410872082 389690146
58178 389690146 360702363 327297195 292318985 257875275 225417798 195830404 169513894
$$ packed form
58235D855695J54684J63888J73369J87165K02116K13215K24034K41138K62111
58226F677415K80359K97744L20565L47036L71292L96098M28551M66837N04588
58217A0090485N44659N94640O52827P13250P80280Q62776R58488J060819J175982
58208A7434206J315700J478792J659517J868349K123318K428154K783595L214427
58200C4306058L760075M447713N306942O404957P833413R665442J1954030J4744018
58192I8422648J8021488K1663361K5512973K9488648L3471558L6988143L9070356
58185C02639175L8546719L4534554K6772561J5757543K795685j0174155k1181936
58178C89690146k8987783l3405168l4978210l4443710l2457477k9587394k6316510
$$ plain form
58171 169513894 146524147 126710212 109791351 95408664 83193288 72817190 63994139
58164 63994139 56467456 50020657 44486122 39726624 35617013 32051177 28950201 26248849
58156 26248849 23882497 21795455 19949914 18315566 16858940 15551171 14376499 13323577
58148 13323577 12375799 11517729 10742746 10045998 9416543 8843622 8323883 7855127 7428987
58139 7428987 7036419 6674461 6341150 6029581 5733573 5454088 5193815 4950103 4718919
58130 4718919 4501043 4298413 4108632 3928678 3760122 3605230 3461491 3325044 3196178
58121 3196178 3076594 2964533 2857320 2755748 2661528 2573149 2488371 2408069 2333744 2263921
58111 2263921 2196676 2133076 2074581 2019633 1966146 1914746 1866337 1819198 1771717 1725344 1681737
$$ packed form
58171A69513894k2989747j9813935j6918861j4382687j2215376j0376098q823051
58164F3994139p526683o446799n534535m759498m109611l565836l100976k701352
58156B6248849k366352k087042j845541j634348j456626j307769j174672j052922
58148A3323577r47778q58070p74983o96748o29455n72921n19739m68756m26140
58139G428987l92568l61958l33311l11569k96008k79485k60273k43712k31184
58130D718919k17876k02630j89781j79954j68556j54892j43739j36447j28866
58121C196178j19584j12061j07213j01572r4220q8379q4778q0302p4325o9823
58111B263921o7245o3600n8495n4948n3487n1400m8409m7139m7481m6373m3607
$$ plain form
58100 1681737 1639663 1597730 1557388 1520068 1484058 1447434 1411521 1378310 1347004 1316273 1287403
58089 1287403 1261930 1238486 1215212 1193067 1173570 1155428 1136572 1117535 1099688 1082030 1062814
58078 1062814 1042579 1022634 1002340 980879 959901 941407 924543 907398 890412 875156 861194
58067 861194 847130 833495 821729 811347 800760 789893 779624 769697 759525 749950 741886 734262
58055 734262 725458 715684 705920 695861 685057 674761 666353 659092 651616 644467 638909 634376 629398
58042 629398 624010 619020 613838 607288 599717 592303 585081 577608 570633 565096 560262 554769 548645 542517
58028 542517 535770 527417 518033 508984 500512 492199 484449 477770 471499 464908 458685 453740 449546 445272
58014 445272 441431 438676 436113 432645 428937 426163 423878 421102 418485 417336 417261 416812 415857 415430 415781 416350
$$ packed form
58100A681737m2074m1933m0342l7320l6010l6624l5913l3211l1306l0731k8870
58089A287403k5473k3444k3274k2145j9497j8142j8856j9037j7847j7658j9216
58078A062814k0235j9945k0294k1461k0978j8494j6864j7145j6986j5256j3962
58067H61194j4064j3635j1766j0382j0587j0867j0269r927j0172r575q064p624
58055G34262q804r774r764j0059j0804j0296q408p261p476p149n558m533m978
58042F29398n388m990n182o550p571p414p222p473o975n537m834n493o124o128
58028E42517o747q353r384r049q472q313p750o679o271o591o223m945m194m274
58014D45272l841k755k563l468l708k774k285k776k617j149p5m49r55m27L51N69
$$ plain form
57998 416350 417084 418156 418964 418969 418829 419276 419681 419264 418719 419013 419461 418745 416974 415120 413316 411423 410229
57981 410229 410208 410020 408132 405137 402579 400416 397685 394811 393067 392344 391534 390588 390156 389669 387864 384868
57965 384868 381934 379499 377324 375942 375999 376601 376293 375327 375032 375371 375101 373927 372472 370483 367237 363539
57949 363539 361124 360134 359228 358169 358235 359898 362148 364346 366943 370136 373584 377716 383577 391124 399224
57934 399224 407497 416519 426039 434686 441700 447329 451235 452144 449502 444103 436733 427584 417230 406820
57920 406820 396915 387318 378151 369815 361847 353290 344400 336614 330653 326030 322578 320896 320894 321401 321731
57905 321731 322373 323611 324560 324181 322379 319739 316971 314790 313450 312284 310507 308413 306908 306121 305582
57890 305582 305466 306331 307767 308732 309181 309996 311282 312192 312470 312686 312770 311888 310071 308515 307823 307256 306123
$$ packed form
57998D16350P34J072Q08Nj40M47M05m17n45K94M48p16j771j854j804j893j194
57981D10229k1j88j888k995k558k163k731k874j744p23q10r46m32m87j805k996
57965C84868k934k435k175j382N7O02l08r66k95L39k70j174j455j989l246l698
57949C63539k415r90r06j059O6J663K250K198K597L193L448M132N861P547Q100
57934C99224Q273R022R520Q647P014N629L906R09k642n399p370r149j0354j0410
57920D06820r905r597r167q336p968q557q890p786n961m623l452j682kN07L30
57905C21731O42J238R49l79j802k640k768k181j340j166j777k094j505p87n39
57890C05582j16Q65J436R65M49Q15J286R10K78K16Q4q82j817j556o92n67j133
$$ plain form
57873 306123 304621 302933 300824 298595 297245 297179 297852 299057 301438 305314 310120 315443 321504 328199 334742
57858 334742 340793 347047 354192 362062 370062 377602 384004 388957 393191 397715 402243 405422 406677 406681 405953
57843 405953 404359 402136 400017 397943 394915 390575 385666 380621 375030 369040 363905 360480 358243 356354
57829 356354 354600 352838 350807 349078 348938 350572 352495 353505 354106 355273 356948 358641 360453 362539 364359
57814 364359 365379 365821 365965 365402 363657 360875 357315 352945 348122 343809 340468 337534 334598 332199 330699
57799 330699 329317 327172 324556 322266 320266 317879 314823 311351 307885 305098 303720 303554 303264 301851 299851
57784 299851 298454 298040 298301 299203 300940 303317 305945 308785 311913 315030 317745 320008 321782 322630 322102
57769 322102 320236 317327 313577 309285 304850 300258 295089 289390 283944 279271 274993 270642 266469 262956
$$ packed form
57873C06123j502j688k109k229j350o6O73J205K381L876M806N323O061O695O543
57858C34742O051O254P145P870Q000P540O402M953M234M524M528L179J255Mp28
57843D05953j594k223k119k074l028m340m909n045n591n990n135l425k237j889
57829C56354j754j762k031j729j40J634J923J010O01J167J675J693J812K086J820
57814C64359J020M42J44n63j745k782l560m370m823m313l341k934k936k399j500
57799C30699j382k145k616k290k000k387l056l472l466k787j378j66k90j413k000
57784B99851j397m14K61R02J737K377K628K840L128L117K715K263J774Q48n28
57769C22102j866k909l750m292m435m592n169n699n446m673m278m351m173l513
$$ plain form
57755 262956 260136 257956 256661 256227 255940 255183 254233 253730 253856 254545 255963 258112 260369 262130 263649 265666
57739 265666 268478 271838 275542 279612 284050 288641 292864 296023 297959 299713 302792 307508 312643 316967
57725 316967 320382 323316 325899 328211 330503 332565 333618 333491 333204 333706 334636 335015 334555 333530 331941 329583
57709 329583 326571 323089 319036 314560 310462 307380 304956 302470 299882 297552 295394 293120 291042 289811
57695 289811 289444 289208 288376 286711 284463 282357 281258 281378 282055 282672 283410 284754 286869 289975 294667 301112
57679 301112 308416 315676 323418 333289 346597 363805 385159 410982 441442 476665 517029 562822
57667 562822 613601 667949 723168 774641 816112 841803 848667 836729 808132 766663 717379 665161
57655 665161 613185 563219 516996 476260 441534 411888 386259 364364 346185 331273 318918
$$ packed form
57755B62956k820k180j295m34k87p57r50n03J26O89J418K149K257J761J519K017
57739B65666K812L360L704M070M438M591M223L159J936J754L079M716N135M324
57725C16967L415K934K583K312K292K062J053j27k87N02R30L79m60j025j589k358
57709C29583l012l482m053m476m098l082k424k486k588k330k158k274k078j231
57695B89811l67k36q32j665k248k106j099J20O77O17P38J344K115L106M692O445
57679C01112P304P260P742R871J3308J7208K1354K5823L0460L5223M0364M5793
57667E62822N0779N4348N5219N1473M1471K5691O864j1938k8597m1469m9284n2218
57655F65161n1976m9966m6223m0736l4726k9646k5629k1895j8179j4912j2355
$$ plain form
57644 318918 308612 300082 293170 287712 283218 278806 273911 269068 265491 263699 262886 261750 259711 257241
57630 257241 255205 253916 252757 250799 247798 244385 241251 238610 236571 235359 234695 233550 231251 228473
57616 228473 226424 225258 224039 222225 220409 219437 219326 219319 218659 217188 215366 213822 212829 212278 212120 212428 212827
57599 212827 212391 210581 208017 205806 204333 203185 202034 201008 200197 199328 198034 196167 193875 191596 189860
57584 189860 188828 188150 187476 186916 186715 186705 186370 185319 183416 180742 177700 174979 173005 171587 170307 169053
57568 169053 167943 167011 166178 165268 163837 161452 158460 156035 154967 154756 154343 153443 152673 152546 152794 152659 151635
57551 151635 150124 149399 150449 152735 154681 155578 156294 157728 159484 160721 161558 162713 164305 165945 167607
57536 167607 169479 171145 171751 170891 168792 165905 162879 160453 158708 156849 154525 152755 152631 153620 154384
$$ packed form
57644C18918j0306q530o912n458m494m412m895m843l577j792q13j136k039k470
57630B57241k036j289j159j958l001l413l134k641k039j212o64j145k299k778
57616B28473k049j166j219j814j816r72j11po60j471j822j544r93n51j58L08L99
57599B12827m36j810k564k211j473j148j151j026q11q69j294j867k292k279j736
57584A89860j032o78o74n60k01j0l35j051j903k674l042k721j974j418j280j254
57568A69053j110r32q33r10j431k385k992k425j068k11m13r00p70j27K48j35j024
57551A51635j511p25J050K286J946Q97P16J434J756J237Q37J155J592J640J662
57536A67607J872J666O06q60k099k887l026k426j745j859k324j770j24R89P64
$$ plain form
57521 154384 154948 156651 159956 163641 166489 168625 170772 173161 175710 178530 181678 184899 187964 190883
57507 190883 193588 195830 197554 198886 199702 199706 199015 198062 196772 194474 190907 186840 183390 181051 179470 177876
57491 177876 175704 173112 170908 169590 168638 167185 165191 163359 162048 160978 159980 159294 159029 159022 159344 160241
57475 160241 161349 161600 160264 157664 154665 151894 149591 147724 146066 144492 143352 143212 144233 146100 148402
57460 148402 150601 151861 151663 150592 149828 149773 149829 149545 149222 149270 149716 150567 151881 153177 153511 152582 151217 150358
57442 150358 150081 149982 150017 150456 151315 152238 152824 152874 152544 152298 152421 152616 152498 152378 152944 154133 155071 155371 155803
57423 155803 157236 159454 161407 162250 161863 160761 159846 159869 160811 162027 163072 164022 164984 165914 167080 169012
57407 169012 171561 173564 173970 172951 171545 170534 170022 169781 169554 169256 169183 169832 171248 172745 173534 173467 173026
$$ packed form
57521A54384N64J703L305L685K848K136K147K389K549K820L148L221L065K919
57507A90883K705K242J724J332Q16Mo91r53j290k298l567m067l450k339j581j594
57491A77876k172k592k204j318r52j453j994j832j311j070r98o86k65pL22Q97
57475A60241J108K51j336k600k999k771k303j867j658j574j140j40J021J867K302
57460A48402K199J260j98j071p64n5N6k84l23M8M46Q51J314J296L34r29j365q59
57442A50358k77r9L5M39Q59R23N86N0l30k46J23J95j18j20N66J189R38L00M32
57423A55803J433K218J953Q43l87j102r15K3R42J216J045R50R62R30J166J932
57407A69012K549K003M06j019j406j011n12k41k27k98p3O49J416J497P89o7m41
$$ plain form
57390 173026 172795 173053 173664 174274 174816 175796 177770 180530 183227 185271 186715 187784 188553 189134 189643 189850 189423
57373 189423 188574 187899 187458 186676 185389 184332 184292 185293 186861 188497 189626 189723 188899 187922 187347 187054 186812
57356 186812 186649 186447 185902 185311 185669 187504 190180 192816 195200 197312 198726 199255 199550 200215 200828 200685 200103
57339 200103 199998 200510 201002 201307 201943 202995 203764 203824 203736 204250 205306 206252 206737 206991 207303 207554 207401 206792 206152
57320 206152 205915 205989 205922 205563 205238 205240 205562 206237 207507 209312 210968 211703 211362 210409 209503 209230 209927 211477 213479
57301 213479 215767 218403 221040 222839 223367 223209 223307 224053 225343 227071 229085 230987 232485 233785 235274
57286 235274 237044 238965 240899 242487 243170 242902 242510 242834 243814 244817 245502 245800 245468 244369 243022 242143
57270 242143 241688 240918 239384 237328 235230 233516 232686 233075 234399 236017 237723 239870 242626 245586 248266
$$ packed form
57390A73026k31K58O11O10N42R80J974K760K697K044J444J069P69N81N09K07m27
57373A89423q49o75m41p82j287j057m0J001J568J636J129R7q24r77n75k93k42
57356A86812j63k02n45n91L58J835K676K636K384K112J414N29K95O65O13j43n82
57339B00103j05N12M92L05O36J052P69O0q8N14J056R46M85K54L12K51j53o09o40
57320B06152k37P4o7l59l25KL22O75J270J805J656P35l41r53r06k73O97J550K002
57301B13479K288K636K637J799N28j58R8P46J290J728K014J902J498J300J489
57286B35274J770J921J934J588O83k68l92L24R80J003O85K98l32j099j347q79
57270B42143m55p70j534k056k098j714q30L89J324J618J706K147K756K960K680
$$ plain form
57255 248266 250602 252853 255325 258352 262257 267111 272613 278219 283296 287314 290180 292407 294715 297459
57241 297459 300528 303703 306885 310115 313539 317274 321075 324303 326545 328204 330234 333319 337449 342139
57227 342139 346920 351713 356866 362640 368589 373841 378222 382664 388152 394593 401201 407587 413879 420062
57213 420062 425888 431437 437134 443178 449489 456229 463822 472380 481595 491276 501511 512125 522521
57200 522521 532344 541965 552051 562955 574706 587243 600317 613437 626250 638843 651494 664321
57188 664321 677456 691296 706100 721403 736321 750639 765185 780795 797230 813569 829544
57177 829544 845969 863781 883121 903572 924818 946700 968896 991002 1012855 1034503 1056059
57166 1056059 1077841 1100338 1123624 1147027 1169860 1192286 1214977 1238228 1262078 1287074 1313964
$$ packed form
57255B48266K336K251K472L027L905M854N502N606N077M018K866K227K308K744
57241B97459L069L175L182L230L424L735L801L228K242J659K030L085M130M690
57227C42139M781M793N153N774N949N252M381M442N488O441O608O386O292O183
57213D20062N826N549N697O044O311O740P593Q558R215R681J0235J0614J0396
57200E22521R823R621J0086J0904J1751J2537J3074J3120J2813J2593J2651J2827
57188F64321J3135J3840J4804J5303J4918J4318J4546J5610J6435J6339J5975
57177H29544J6425J7812J9340K0451K1246K1882K2196K2106K1853K1648K1556
57166A056059K1782K2497K3286K3403K2833K2426K2691K3251K3850K4996K6890
$$ plain form
57155 1313964 1342506 1371390 1399669 1427641 1456105 1485316 1514984 1544708 1574069 1602760 1630984
57144 1630984 1659361 1688250 1717548 1747282 1777895 1809750 1842812 1876947 1912014 1947554 1983049
57133 1983049 2018722 2055475 2093832 2133564 2174547 2217197 2261692 2307436 2353693 2400134 2446422
57122 2446422 2492030 2536895 2581793 2627793 2676111 2728782 2788639 2857994 2937938 3029227 3133100
57111 3133100 3250725 3382567 3528829 3690026 3867042 4061725 4278163 4522931 4804001
57102 4804001 5130319 5512627 5963825 6498710 7135112 7895954 8808992 9903967 11210517
57093 11210517 12757333 14568968 16659952 19030744 21667640 24544611 27627753 30883849
57085 30883849 34286533 37813383 41445939 45190779 49102964 53254838 57628623 62006286
$$ packed form
57155A313964K8542K8884K8279K7972K8464K9211K9668K9724K9361K8691K8224
57144A630984K8377K8889K9298K9734L0613L1855L3062L4135L5067L5540L5495
57133A983049L5673L6753L8357L9732M0983M2650M4495M5744M6257M6441M6288
57122B446422M5608M4865M4898M6000M8318N2671N9857O9355P9944R1289J03873
57111C133100J17625J31842J46262J61197J77016J94683K16438K44768K81070
57102D804001L26318L82308M51198N34885O36402P60842R13038J094975J306550
57093A1210517J546816J811635K090984K370792K636896K876971L083142L256096
57085C0883849L402684L526850L632556L744840L912185M151874M373785M377663
$$ plain form
57077 62006286 65968207 69026970 70802520 71123588 70024606 67686645 64373452 60377334
57069 60377334 55974604 51396653 46820927 42375209 38146196 34189028 30536264 27203633
57061 27203633 24192801 21494641 19093707 16970914 15103775 13467248 12036245 10787262
57053 10787262 9697840 8746086 7911749 7177451 6528727 5953524 5441871 4985359 4576563
57044 4576563 4209083 3877921 3579266 3309885 3067030 2848613 2652882 2477943 2321972
57035 2321972 2183703 2062311 1956979 1866857 1791171 1729093 1679728 1642288 1615624 1597157 1582739
57024 1582739 1567797 1548136 1519785 1479571 1426944 1364601 1296445 1225356 1153341 1082665 1015464
57013 1015464 952652 894188 840151 790753 745788 704982 668541 636530 608085 582076 558186
$$ packed form
57077F2006286L961921L058763J775550L21068j098982k337961l313193l996118
57069F0377334m402730m577951m575726m445718m229013l957168l652764l332631
57061B7203633l010832k698160k400934k122793j867139j636527j431003j248983
57053A0787262j089422r51754q34337p34298o48724n75203n11653m56512m08796
57044D576563l67480l31162k98655k69381k42855k18417j95731j74939j55971
57035B321972j38269j21392j05332r0122p5686o2078m9365l7440k6664j8467j4418
57024A582739j4942j9661k8351m0214n2627o2343o8156p1089p2015p0676o7201
57013A015464o2812n8464n4037m9398m4965m0806l6441l2011k8445k6009k3890
$$ plain form
57002 558186 536544 516757 498191 480792 464667 449326 434374 420631 409426 400940 394265 388923
56990 388923 385218 383212 382512 383178 385865 390853 397699 405937 415272 424971 433782 440478 443927 442826 436349
56975 436349 425168 411098 395752 380190 365569 352968 342427 333189 325206 319552 317049 317300 319458
56962 319458 323298 329250 337937 349874 364982 382112 399486 415659 429427 438943 442001 437749 427520
56949 427520 413595 397648 380561 363028 345764 329456 314852 302612 292916 285636 281004 279681
56937 279681 282100 288208 297975 311627 329278 350849 376347 405361 435828 463911 485569 498106
56925 498106 500290 491955 474266 449935 422339 394144 366751 340727 316463 294579 275762 260090
56913 260090 246655 234337 222968 213208 205204 198042 190880 184018 178397 174429 171830 170248 169561 169652
$$ packed form
57002E58186k1642j9787j8566j7399j6125j5341j4952j3743j1205q486o675n342
56990C88923l705k006p00O66K687M988O846Q238R335R699Q811O696L449j101o477
56975D36349j1181j4070j5346j5562j4621j2601j0541r238p983n654k503K51K158
56962C19458L840N952Q687J1937J5108J7130J7374J6173J3768R516L058m252j0229
56949D27520j3925j5947j7087j7533j7264j6308j4604j2240r696p280m632j323
56937B79681K419O108R767J3652J7651K1571K5498K9014L0467K8083K1658J2537
56925D98106K184q335j7689k4331k7596k8195k7393k6024k4264k1884j8817j5672
56913B60090j3435j2318j1369r760q004p162p162o862n621l968k599j582o87R1
$$ plain form
56899 169652 170267 171158 172220 173635 175935 179627 184642 190518 197398 206510 219226 235810 255415 277110
56885 277110 300352 324257 346805 365297 377773 383871 384229 379347 369499 355726 340244 325422
56873 325422 312606 302287 295019 291589 292446 297562 306964 321051 340476 366069 398725 438856 485903
56860 485903 538582 595263 653441 708922 756296 790565 808390 808497 792047 762709 725393 684344
56848 684344 642688 603432 569697 543404 524592 512755 508460 513174 528094 553825 590870 639681
56836 639681 700273 772188 854605 945618 1040925 1133191 1212914 1270518 1298940 1295759 1263731 1209313
56824 1209313 1140206 1063431 984666 908306 837642 774948 721630 678527 646061 624118 612114
56813 612114 609734 617778 637744 670231 714047 767060 827194 891761 955977 1012854 1054782 1075388
$$ packed form
56899A69652O15Q91J062J415K300L692N015N876O880R112J2716J6584J9605K1695
56885B77110K3242K3905K2548J8492J2476O098L58m882r848j3773j5482j4822
56873C25422j2816j0319p268l430Q57N116R402J4087J9425K5593L2656M0131M7047
56860D85903N2679N6681N8178N5481M7374L4269J7825J07j6450k9338l7316m1049
56848F84344m1656l9256l3735k6293j8812j1837m295M714J4920K5731L7045M8811
56836F39681O0592P1915Q2417R1013R5307R2266P9723N7604K8422l181l2028n4418
56824A209313o9107p6775p8765p6360p0664o2694n3318m3103l2466k1943j2004
56813F12114k380Q044J9966L2487M3816N3013O0134O4567O4216N6877M1928K0606
$$ plain form
56801 1075388 1071065 1042287 993848 932961 866422 799241 735018 676229 623916 578052 538722
56790 538722 506478 481541 463503 452180 448009 451263 461534 478366 501652 530678 563121 595487
56778 595487 624185 645861 657353 656315 642219 616600 582438 543243 502169 461342 421870 384471
56766 384471 349922 318906 291762 268463 248562 231210 215691 202025 190634 181386 173501 166405
56754 166405 160126 154686 149730 145001 140622 136664 132974 129667 127222 125719 124503 122961 121242 119878
56740 119878 119096 118763 118629 118375 117807 117152 116811 116767 116752 116932 117602 118197 117624 115885 114343 113855 113699 113059 112559
56721 112559 113230 114721 115731 115864 115951 116715 118130 120005 122348 125034 127744 130308 132619 134314 135124 135451
56705 135451 136098 137407 139051 140535 141523 141828 141602 141424 141793 142640 143681 144985 146739 148627 149961 150355
$$ packed form
56801A075388m323k8778m8439o0887o6539o7181o4223n8789n2313m5864l9330
56790E38722l2244k4937j8038j1323m171L254J0271J6832K3286K9026L2443L2366
56778E95487K8698K1676J1492j038j4096k5619l4162l9195m1074m0827l9472l7399
56766C84471l4549l1016k7144k3299j9901j7352j5519j3666j1391r248p885p096
56754A66405o279n440m956m729m379l958l690l307k445j503j216j542j719j364
56740A19878p82l33j34k54n68o55l41m4j5J80O70N95n73j739j542m88j56o40n00
56721A12559O71J491J010J33Q7P64J415J875K343K686K710K564K311J695Q10L27
56705A35451O47J309J644J484R88L05k26j78L69Q47J041J304J754J888J334L94
$$ plain form
56689 150355 149959 149204 148674 148937 150087 151577 152859 153981 155220 156523 157679 158673 159339 159047 157419 155128
56673 155128 153286 152229 151496 150906 150930 151899 153427 154767 155378 155117 154209 153105 152155 151464 151072 150999 150943 150473
56655 150473 149807 149850 150969 152275 152799 152848 153351 154253 154610 154139 153591 153435 153099 151833 149706 147400 145563
56638 145563 144631 144822 145869 147004 147461 146952 145735 144456 143820 144080 144831 145525 146045 146465 146526 145884 144842
56621 144842 144290 144735 145729 146356 146079 145133 144294 144198 144711 145062 144712 143823 142775 141672 140639 140097 140191 140321
56603 140321 139870 139131 138910 139440 140327 141438 143119 145517 148233 150660 152283 152745 152114 151054 150317 150134
56587 150134 150346 150837 151363 151386 150702 149962 149969 150717 151739 153035 154773 156372 156925 156559 156446 157292 158655 159935
56569 159935 161265 163148 165860 169472 173928 178925 184221 190146 197295 205635 214481 223394 232367 240968
$$ packed form
56689A50355l96p55n30K63J150J490J282J122J239J303J156R94O66k92j628k291
56673A55128j842j057p33n90K4R69J528J340O11k61r08j104r50o91l92p3n6m70
56655A50473o66M3J119J306N24M9N03R02L57m71n48j56l36j266k127k306j837
56638A45563r32J91J047J135M57n09j217j279o36K60P51O94N20M20O1o42j042
56621A44842n52M45R94O27k77r46q39r6N13L51l50q89j048j103j033n42R4J30
56603A40321m51p39k21N30Q87J111J681K398K716K427J623M62o31j060p37j83
56587A50134K12M91N26K3o84p40PP48J022J296J738J599N53l66j13Q46J363J280
56569A59935J330J883K712L612M456M997N296N925P149Q340Q846Q913Q973Q601
$$ plain form
56555 240968 248000 252419 254161 253852 252145 249530 246335 242655 238547 234384 230740 227949 226054 225007
56541 225007 224425 223404 221260 218418 215904 213991 212024 209553 206843 204110 201123 197856 194926 192993
56527 192993 192145 192082 192453 192887 193205 193744 194988 196731 198089 198425 197838 196710 195323 193984 192927 191937 190513
56510 190513 188541 186411 184502 183019 182175 181957 181823 181273 180597 180384 180500 180390 180217 180673 181712 182570 183082
56493 183082 183913 185248 186396 187015 187610 188431 188974 189066 189356 190149 190788 190889 191160 192157 193174 193284 192752 192473
56475 192473 192637 192871 193173 193725 194194 194163 193981 194344 195198 195825 195837 195443 194887 194231 193644 193337 193298 193478 194093 195313
56455 195313 196780 197834 198150 197929 197633 197687 198192 198765 198975 199009 199489 200556 201741 202876 204360 206149 207303
56438 207303 207158 206379 206150 206729 207462 207816 207775 207457 206974 206528 206231 205935 205562 205331 205331 205222 204698 203990 203590 203788
$$ packed form
56555B40968P032M419J742l09j707k615l195l680m108m163l644k791j895j047
56541B25007n82j021k144k842k514j913j967k471k710k733k987l267k930j933
56527A92993q48o3L71M34L18N39J244J743J358L36n87j128j387j339j057r90j424
56510A90513j972k130j909j483q44k18j34n50o76k13J16j10j73M56J039Q58N12
56493A83082Q31J335J148O19N95Q21N43R2K90P93O39J01K71R97J017J10n32k79
56475A92473J64K34L02N52M69l1j82L63Q54O27J2l94n56o56n87l07l9J80O15J220
56455A95313J467J054L16k21k96N4N05N73K10L4M80J067J185J135J484J789J154
56438B07303j45p79k29N79P33L54m1l18m83m46k97k96l73k31%j09n24p08m00J98
$$ plain form
56418 203788 204679 206207 207844 208695 208367 207466 206930 207117 207767 208421 208605 208010 206801 205449 204133 202751 201517
56401 201517 200875 200714 200419 200000 200277 201583 203119 204121 204872 205949 207269 208584 210192 212351 214585 216391
56385 216391 218064 220048 221957 223129 223768 224605 225686 226281 225958 225087 224380 224409 225454 227331 229465 231375
56369 231375 232955 234145 234804 235107 235510 236116 236662 237362 238897 241174 243058 243938 244716 246469 248881 250900
56353 250900 252278 253562 255041 256591 258177 259751 260999 261822 262682 263914 265219 266339 267572 269058 270378
56338 270378 271493 273225 275926 278577 280184 281254 282830 284847 286701 288651 291269 294033 295904 296998
56324 296998 298352 300343 302560 304958 307798 310586 312375 313064 313339 313505 313501 313834 315190 317170 318705 319684
56308 319684 321005 322991 325026 326823 328871 331432 334288 337669 342336 348335 354709 360769 366782 373060
$$ packed form
56418B03788Q91J528J637Q51l28r01n36J87O50O54J84n95j209j352j316j382j234
56401B01517o42j61k95m19K77J306J536J002P51J077J320J315J608K159K234J806
56385B16391J673J984J909J172O39Q37J081N95l23q71p07K9J045J877K134J910
56369B31375J580J190O59L03M03O06N46P00J535K277J884Q80P78J753K412K019
56353B50900J378J284J479J550J586J574J248Q23Q60J232J305J120J233J486J320
56338B70378J115J732K701K651J607J070J576K017J854J950K618K764J871J094
56324B96998J354J991K217K398K840K788J789O89K75J66mL33J356J980J535R79
56308C19684J321J986K035J797K048K561K856L381M667N999O374O060O013O278
$$ plain form
56294 373060 379217 384724 389603 394241 399028 404264 409957 415739 421427 427511 434568 442469 450812 459767
56280 459767 469692 480293 491099 502439 514932 528270 541605 554991 569303 584860 601263 618583
56268 618583 637537 658385 680711 704471 730313 758702 789656 823500 861124 903414 951132
56257 951132 1005217 1066449 1135019 1211294 1296690 1392745 1499570 1616292 1742650 1878841 2023976
56246 2023976 2176079 2333588 2495340 2658910 2820326 2975752 3122198 3256340 3374037
56237 3374037 3471617 3546749 3597809 3623436 3623171 3597713 3548425 3477453 3388252 3284764 3169799
56226 3169799 3045093 2912914 2776338 2637871 2499104 2361984 2229070 2102072 1981201
56217 1981201 1866360 1757932 1656125 1560646 1471422 1388781 1312693 1242688 1178545 1120051 1066185
$$ packed form
56294C73060O157N507M879M638M787N236N693N782N688O084P057P901Q343Q955
56280D59767R925J0601J0806J1340J2493J3338J3335J3386J4312J5557J6403J7320
56268F18583J8954K0848K2326K3760K5842K8389L0954L3844L7624M2290M7718
56257I51132N4085O1232O8570P6275Q5396R6055J06825J16722J26358J36191J45135
56246B023976J52103J57509J61752J63570J61416J55426J46446J34142J17697
56237C374037R7580P5132N1060K5627k65k5458m9288p0972q9201j03488j14965
56226C169799j24706j32179j36576j38467j38767j37120j32914j26998j20871
56217A981201j14841j08428j01807r5479q9224q2641p6088p0005o4143n8494n3866
$$ plain form
56206 1066185 1015771 968933 926585 888498 853313 820583 791198 765481 742449 721354 702430
56195 702430 685653 670224 655845 643098 632080 622036 612826 605166 598877 592465 585257 578424 573068
56182 573068 568758 564870 561874 560255 559361 558431 557704 557574 557754 558193 559680 562565 565898 568841 571983 576256
56166 576256 581478 586927 592574 598804 605586 612759 620492 628775 637125 645378 654146 664140 675733 689368
56152 689368 705414 723433 742853 764679 791197 823641 861641 905425 956868 1017508 1087050
56141 1087050 1164717 1250416 1343231 1440034 1536901 1631033 1720377 1802608 1875817 1939610 1994690
56130 1994690 2042118 2083525 2120762 2154265 2182452 2203383 2216194 2220644 2216656 2205005 2187106 2163274
56118 2163274 2132180 2092413 2043153 1983028 1910525 1826830 1736637 1644862 1553891 1464980 1380523
$$ packed form
56206A066185n0414m6838m2348l8087l5185l2730k9385k5717k3032k1095j8924
56195G02430j6777j5429j4379j2747j1018j0044r210p660o289o412p208o833n356
56182E73068m310l888k996j619q94r30p27j30J80M39J487K885L333K943L142M273
56166E76256N222N449N647O230O782P173P733Q283Q350Q253Q768R994J1593J3635
56152F89368J6046J8019J9420K1826K6518L2444L8000M3784N1443O0640O9542
56141A087050P7667Q5699R2815R6803R6867R4132Q9344Q2231P3209O3793N5080
56130A994690M7428M1407L7237L3503K8187K0931J2811M450l988j1651j7899k3832
56118B163274l1094l9767m9260o0125p2503q3695r0193r1775r0971q8911q4457
$$ plain form
56107 1380523 1303241 1234301 1173649 1121128 1076091 1037146 1003589 976108 955029 938977 926179
56096 926179 915876 907574 900420 894361 890428 888743 887753 886550 886303 888123 891205 894505 898577 904151
56082 904151 910394 916215 921997 928540 935622 943011 951445 961223 971308 981236 992275 1005237 1018906
56069 1018906 1032184 1045988 1061182 1076540 1090806 1105099 1121091 1138230 1154908 1170985 1187104
56058 1187104 1202873 1217868 1233113 1249478 1265822 1280739 1294880 1309575 1324538 1338994 1353701
56047 1353701 1369688 1386249 1402307 1418566 1436310 1455392 1475335 1497009 1521090 1546262 1571070
56036 1571070 1596267 1623291 1651845 1680988 1711169 1743168 1776558 1811069 1847725 1886705 1926060
56025 1926060 1964603 2003943 2045528 2088096 2130526 2174694 2222658 2273396 2325291 2379494 2437708
$$ packed form
56107A380523p7282o8940o0652n2521m5037l8945l3557k7481k1079j6052j2798
56096I26179j0303q302p154o059l933j685r90j203k47J820L082L300M072N574
56082I04151O243N821N782O543P082P389Q434R778J0085R928J1039J2962J3669
56069A018906J3278J3804J5194J5358J4266J4293J5992J7139J6678J6077J6119
56058A187104J5769J4995J5245J6365J6344J4917J4141J4695J4963J4456J4707
56047A353701J5987J6561J6058J6259J7744J9082J9943K1674K4081K5172K4808
56036A571070K5197K7024K8554K9143L0181L1999L3390L4511L6656L8980L9355
56025A926060L8543L9340M1585M2568M2430M4168M7964N0738N1895N4203N8214
$$ plain form
56014 2437708 2498908 2561476 2626414 2695204 2766719 2839612 2915512 2996497 3081645 3169397 3260886
56003 3260886 3357534 3458016 3561217 3669479 3785202 3907129 4033790 4167350 4309907 4459564
55993 4459564 4614889 4779678 4958175 5149097 5349847 5563049 5793096 6039810 6301754
55984 6301754 6582300 6885921 7212020 7559331 7932958 8339954 8781675 9258092 9775851
55975 9775851 10344002 10965686 11642768 12384969 13205783 14113886 15118556 16239291 17500123
55966 17500123 18919882 20520194 22338965 24425291 26829186 29613104 32871183 36727268
55958 36727268 41328575 46868601 53619625 61932498 72215329 84920060 100503208 119330521
55950 119330521 141611982 167458805 196933239 229825347 265146835 300725492 333299845
$$ packed form
56014B437708O1200O2568O4938O8790P1515P2893P5900Q0985Q5148Q7752R1489
56003C260886R6648J00482J03201J08262J15723J21927J26661J33560J42557J49657
55993D459564J55325J64789J78497J90922K00750K13202K30047K46714K61944
55984F301754K80546L03621L26099L47311L73627M06996M41721M76417N17759
55975I775851N68151O21684O77082P42201Q20814R08103J004670J120735J260832
55966A7500123J419759J600312J818771K086326K403895K783918L258079L856085
55958C6727268M601307N540026O751024Q312873J0282831J2704731J5583148J8827313
55950A19330521K2281461K5846823K9474434L2892108L5321488L5578657L2574353
$$ plain form
55943 333299845 359139535 374925589 378621876 370090603 351142469 324871202 294596322
55936 294596322 263041409 232097267 202983069 176439134 152823139 132191489 114404835
55929 114404835 99209800 86286269 75297935 65943077 57968319 51152872 45304732
55922 45304732 40270909 35931661 32181329 28924781 26087614 23613610 21450745 19549573
55914 19549573 17872598 16392780 15082656 13914209 12867752 11930873 11089176 10326705
55906 10326705 9634110 9007368 8439008 7918635 7441127 7006155 6610025 6245397 5908552
55897 5908552 5599593 5315758 5051471 4804893 4577786 4368926 4173797 3990717 3821340
55888 3821340 3665193 3519414 3383732 3259973 3146540 3038866 2935394 2837898 2745742 2655122
$$ packed form
55943C33299845K5839690J5786054L696287q531273j8948134k6271267l0274880
55936B94596322l1554913l0944142k9114198k6543935k3615995k0631650j7786654
55929A14404835j5195035j2923531j0988334r354858p974758o815447n848140
55922D5304732n033823m339248l750332l256548k837167k474004k162865j901172
55914A9549573j676975j479818j310124j168447j046457r36879q41697p62471
55906A0326705o92595o26742n68360n20373m77508m34972l96130l64628l36845
55897E908552l08959k83835k64287k46578k27107k08860j95129j83080j69377
55888C821340j56147j45779j35682j23759j13433j07674j03472r7496r2156r0620
$$ plain form
55878 2655122 2564469 2475755 2390008 2306105 2224385 2146999 2074113 2003789 1935873 1872140 1812526
55867 1812526 1755244 1700621 1650809 1605593 1562498 1521075 1483036 1448002 1413239 1378017 1344171
55856 1344171 1311912 1279143 1245620 1213871 1185008 1157202 1129287 1102440 1077240 1052232 1026532
55845 1026532 1001006 975975 950526 924923 900952 879076 857793 836490 816394 798113 780817
55834 780817 764498 750414 738613 727466 716322 706236 697516 689009 680459 673112 667225 661245 654154
55821 654154 646477 638410 629200 619048 609434 600908 592583 584259 576893 570482 563759 556617 550688 546851
55807 546851 544289 542696 543304 546936 552926 560582 569798 579678 588559 596029 603019 609355 613242 613764 611877
55792 611877 608339 602722 595160 586944 578536 569051 558586 549025 541507 534916 527875 520494 513304 506395
$$ packed form
55878B655122r0653q8714q5747q3903q1720p7386p2886p0324o7916o3733n9614
55867A812526n7282n4623m9812m5216m3095m1423l8039l5034l4763l5222l3846
55856A344171l2259l2769l3523l1749k8863k7806k7915k6847k5200k5008k5700
55845A026532k5526k5031k5449k5603k3971k1876k1283k1303k0096j8281j7296
55834G80817j6319j4084j1801j1147j1144j0086q720q507q550p347n887n980p091
55821F54154p677q067r210j0152r614q526q325q324p366o411o723p142n929l837
55807E46851k562j593O08L632N990P656R216R880Q881P470O990O336L887N22j887
55792F11877l538n617p562q216q408r485j0465r561p518o591p041p381p190o909
$$ plain form
55778 506395 500706 498434 500955 507778 518334 533023 551455 571336 590187 606492 618132 621688
55766 621688 615098 599836 579127 555159 529284 503424 479505 458160 439256 422985 409292 397124
55754 397124 385450 374434 364571 355430 346343 337699 330461 324784 320037 315857 312418 309937 308572 308529
55740 308529 309804 311934 314152 315511 314962 312041 307478 302445 297265 291633 285902 280975 276924 272936
55726 272936 268769 264990 261635 258000 254126 251105 249407 248174 246741 245672 245731 247012 249689 254444 261378
55711 261378 269390 277193 284034 289103 291472 291272 289841 288068 285624 282254 278525 274549 269225 261785
55697 261785 253114 244618 236644 228946 221852 216031 211637 208475 206419 205068 203648 201900 200499 200167
55683 200167 201009 203051 206515 211034 215476 219197 222679 226406 229904 232470 234054 234854 234828 234154 233412 232765
$$ packed form
55778E06395n689k272K521O823J0556J4689J8432J9881J8851J6305J1640L556
55766F21688o590j5262k0709k3968k5875k5860k3919k1345j8904j6271j3693j2168
55754C97124j1674j1016r863r141r087q644p238n677m747m180l439k481j365m3
55740C08529J275K130K218J359n49k921m563n033n180n632n731m927m051l988
55726B72936m167l779l355l635l874l021j698j233j433j069N9J281K677M755O934
55711B61378Q012P803O841N069K369k00j431j773k444l370l729l976n324p440
55697B61785q671q496p974p698p094n821m394l162k056j351j420j748j401l32
55683B00167Q42K042L464M519M442L721L482L727L498K566J584Q00k6o74p42o47
$$ plain form
55667 232765 231672 229887 227981 226473 225344 224793 225460 227309 229275 230634 231885 233699 235906 238075 240211
55652 240211 242352 244424 246927 250587 254744 257315 257114 255058 252308 248549 243149 236767 230509 224431
55638 224431 218065 211530 204938 197619 189292 181267 175073 170476 166245 162359 159959 159361 159485 159247 158397
55623 158397 156984 155076 153109 151689 150884 150214 149264 147878 146051 144138 142758 141974 140988 139199 137060
55608 137060 135249 133589 131566 129466 128110 127815 128322 129356 130514 131003 130316 128888 127481 126252 125092
55593 125092 124348 124383 124824 125016 124862 124554 123898 122746 121643 121211 121270 121342 121532 122055 122377 121904 121203 121376 122476
55574 122476 123654 124746 126538 129357 132556 135616 138759 142093 144995 146833 147768 148414 149054 149440 149079
55559 149079 147593 145079 142129 139265 136422 133283 129952 126881 124273 122018 120204 119158 118928 119066 119024
$$ packed form
55667B32765j093j785j906j508j129n51O67J849J966J359J251J814K207K169K136
55652B40211K141K072K503L660M157K571k01k056k750l759n400o382o258o078
55638B24431o366o535o592p319q327q025o194m597m231l886k400n98J24k38q50
55623A58397j413j908j967j420q05o70r50j386j827j913j380p84r86j789k139
55608A37060j811j660k023k100j356k95N07J034J158M89o87j428j407j229j160
55593A25092p44L5M41J92j54l08o56j152j103m32N9P2J90N23L22m73p01J73J100
55574A22476J178J092J792K819L199L060L143L334K902J838R35O46O40L86l61
55559A49079j486k514k950k864k843l139l331l071k608k255j814j046k30J38m2
$$ plain form
55544 119024 118597 118015 117773 118248 119322 120515 121554 122583 123769 125086 126580 128322 129912 130556 129990 128824
55528 128824 127675 126477 125020 123581 122462 121350 119661 117204 114158 110832 107777 105582 104137 102640
55514 102640 100705 98833 97379 95890 94035 92368 91357 90456 89088 87886 87892 88986 90217 91307 92706
55499 92706 94387 95719 96542 97397 98602 99912 101113 102236 103147 103549 103447 103135 102852 102862 103529 104725 105531
55482 105531 105260 104483 104297 104922 105770 106549 107334 107788 107406 106461 105723 105186 104044 102021 99833 98152 96905
55465 96905 95803 94784 93743 92576 91654 91618 92471 93482 94182 94796 95492 95873 95542 94700 93865 93382 93403 93951
55447 93951 94748 95302 95346 95012 94548 94138 93965 94132 94504 94910 95478 96407 97466 97968 97250 95113 92068 89362
55429 89362 88315 89189 90970 92559 93767 94758 95211 94860 94416 94991 96648 98356 99308 99622 99769 100057 100735
$$ packed form
55544A19024m27n82k42M75J074J193J039J029J186J317J494J742J590O44n66j166
55528A28824j149j198j457j439j119j112j689k457l046l326l055k195j445j497
55514A02640j935j872j454j489j855j667j011r01j368j202OJ094J231J090J399
55499I2706J681J332Q23Q55J205J310J201J123R11M02j02l12k83J0O67J196Q06
55482A05531k71p77j86O25Q48P79P85M54l82r45p38n37j142k023k188j681j247
55465I6905j102j019j041j167r22l6Q53J011P00O14O96L81l31q42q35m83K1N48
55447I3951P97N54M4l34m64m10j73J67L72M06N68R29J059N02p18k137l045k706
55429H9362j047Q74J781J589J208R91M53l51m44N75J657J708R52L14J47K88O78
$$ plain form
55412 100735 101947 103484 104954 106200 107199 107801 108021 108270 108707 108696 107596 105758 104021 102474 100627 98556
55396 98556 96952 96074 95558 95267 95481 96168 96863 97332 97609 97405 96326 94702 93378 92585 91879 91245 91369 92564
55378 92564 94305 96078 97889 99592 100517 100217 99064 97742 96660 95992 95748 95592 95104 94355 93699 92973 91637
55361 91637 89786 88253 87515 87231 87038 87060 87305 87361 87051 86781 86867 87111 87366 87905 88901 90031 90882 91242 90854
55342 90854 89543 87830 86706 86489 86553 86452 86503 86949 87346 87367 87426 87860 88128 87574 86471 85600 85144 84750 84361
55323 84361 84278 84511 84717 84757 84861 85279 86128 87528 89468 91499 92841 92910 91743 90001 88531 87722 87275 86783
55305 86783 86426 86687 87467 88062 88124 88095 88422 88879 89008 88783 88496 88346 88471 89044 89969 90759 91085 91220 91614 92215
55285 92215 92549 92348 91803 91232 90738 90229 89688 89326 89343 89508 89241 88353 87463 87300 87803 88298 88439 88448 88579 88905
$$ packed form
55412A00735J212J537J470J246R99O02K20K49M37j1j100j838j737j547j847k071
55396I8556j604q78n16k91K14O87O95M69K77k04j079j624j324p93p06o34J24J195
55378I2564J741J773J811J703R25l00j153j322j082o68k44j56m88p49o56p26j336
55361I1637j851j533p38k84j93K2K45N6l10k70Q6K44K55N39R96J130Q51L60l88
55342I0854j311j713j124k17O4j01N1M46L97K1N9M34K68n54j103q71m56l94l89
55323H4361q3K33K06M0J04M18Q49J400J940K031J342O9j167j742j470q09m47m92
55305H6783l57K61P80N95O2k9L27M57J29k25k87j50J25N73R25P90L26J35L94O01
55285I2215L34k01n45n71m94n09n41l62J7J65k67q88q90j63N03M95J41RJ31L26
$$ plain form
55265 88905 89619 90894 92356 93211 93075 92267 91292 90506 90221 90502 90818 90538 89857 89596 90022 90585 90977 91612
55247 91612 92657 93325 92658 90674 88324 86723 86581 87860 89579 90405 89814 88506 87528 87297 87567 87886 87906
55230 87906 87675 87695 88335 89190 89574 89528 89689 90173 90429 90337 90514 91229 91841 91758 91203 90649 90216 90013 90266 90655
55210 90655 90307 89092 88159 88506 89662 90496 90728 90837 90941 90694 90107 89676 89698 89957 90052 89739 89071 88418 88140
55191 88140 88147 88154 88351 89216 90504 91153 90595 89502 88892 89107 89991 91281 92406 92679 92270 92237 93069 94030 94501
55172 94501 94954 95801 96303 95804 95212 95882 97579 98935 99570 100325 101471 102146 101831 101203 101087 101452 101827 101975
55154 101975 101785 101099 99983 98797 97755 96763 95753 94838 94140 93787 93971 94624 95192 95199 94906 94910 95226 95281 94794
55135 94794 94086 93560 93303 93175 92900 92185 91146 90496 90856 92059 93507 94919 96175 96781 96243 94921 93762
$$ packed form
55265H8905P14J275J462Q55j36q08r75p86k85K81L16k80o81k61M26N63L92O35
55247I1612J045O68o67j984k350j601j42J279J719Q26n91j308r78k31K70L19K0
55230H7906k31K0O40Q55L84m6J61M84K56r2J77P15O12q3n55n54m33k03K53L89
55210I0655l48j215r33L47J156Q34K32J09J04k47n87m31K2K59R5l13o68o53k78
55191H8140PPJ97Q65J288O49n58j093o10K15Q84J290J125K73m09l3Q32R61M71
55172I4501M53Q47N02m99n92O70J697J356O35P55J146O75l15o28j16L65L75J48
55154A01975j90o86j116j186j042r92j010r15o98l53J84O53N68Pk93ML16N5m87
55135I4794p08n26k57j28k75p15j039o50L60J203J448J412J256O06n38j322j159
$$ plain form
55118 93762 93190 92880 92601 92606 93065 93782 94669 95961 97671 99274 100203 100430 100377 100369 100228 99423 97790 96188 96003
55099 96003 97689 100177 102117 103230 103950 104353 104276 104150 104618 105402 105507 104741 104103 104386 105242 106044 106949 108468
55081 108468 110409 111902 112363 112024 111551 111467 111970 113058 114620 116327 117602 118014 117743 117393 117237 116915 116008
55064 116008 114535 112723 110689 108659 107025 105874 104838 103774 103136 103265 103787 104206 104560 104981 105154 104931
55048 104931 104894 105494 106035 105457 103828 102195 101284 101211 102106 103894 105667 106402 106289 106338 106748 106791 106286 105942 106016
55029 106016 105871 105215 104628 104450 104219 103728 103608 104255 105045 105259 104965 104410 103390 101919 100760 100503 100736 100855
55011 100855 101081 101877 102932 103605 103966 104536 105286 105726 105819 106032 106520 106945 107072 106991 106792 106561 106685 107580 109075
54992 109075 110453 111196 111330 111063 110482 109709 109053 108780 108833 108872 108599 108109 107896 108339 109216 110005 110655 111631 113009
$$ packed form
55118I3762n72l10k79NM59P17Q87J292J710J603R29K27n3qj41q05j633j602j85
55099I6003J686K488J940J113P20M03p7j26M68P84J05p66o38K83Q56Q02R05J519
55081A08468J941J493M61l39m73q4N03J088J562J707J275M12k71l50j56l22r07
55064A16008j473j812k034k030j634j151j036j064o38J29N22M19L54M21J73k23
55048A04931l7O00N41n78j629j633r11p3Q95J788J773P35j13M9M10M3n05l44P4
55029A06016j45o56n87j78k31m91j20O47P90K14k94n55j020j471j159k57K33J19
55011A00855K26P96J055O73L61N70P50M40R3K13M88M25J27q1j99k31J24Q95J495
54992A09075J378P43J34k67n81p73o56k73N3L9k73m90k13M43Q77P89O50R76J378
$$ plain form
54973 113009 114051 114093 113518 113357 114114 115507 117207 119217 121370 122979 123424 122891 122211 121923 121779 121282 120533
54956 120533 120175 120530 121134 121409 121427 121629 122005 122068 121624 121034 120629 120344 120116 120192 120721 121350 121575 121309 120833 120341
54936 120341 119811 119316 119211 119912 121475 123401 125000 126081 127166 128865 131184 133751 136571 140180 144982
54921 144982 150732 156666 161900 165817 168486 170689 173198 175915 177961 178495 177145 173849 168869 162991
54907 162991 157146 151652 146259 140952 136216 132443 129649 127898 127380 127823 128372 128420 128177 128104 128247 128411 128594
54890 128594 128841 129024 129119 129449 130346 131777 133522 135486 137699 140358 143979 149069 155322 161577 166911 171447
54874 171447 175750 179778 182829 184307 184122 182526 179863 176378 172029 166603 160269 153866 148482 144755
54860 144755 142579 141234 139776 137655 135127 132880 131257 130133 129419 129092 128627 127134 124398 121310 118928
$$ packed form
54973A13009J042M2n75j61P57J393J700K010K153J609M45n33o80k88j44m97p49
54956A20533l58L55O04K75J8K02L76O3m44n90m05k85k28P6N29O29K25k66m76m92
54936A20341n30m95j05P01J563J926J599J081J085J699K319K567K820L609M802
54921A44982N750N934N234L917K669K203K509K717K046N34j350l296m980n878
54907A62991n845n494n393n307m736l773k794j751n18M43N49M8k43p3J43J64J83
54890A28594K47J83R5L30Q97J431J745J964K213K659L621N090O253O255N334M536
54874A71447M303M028L051J478j85j596k663l485m349n426o334o403n384l727
54860A44755k176j345j458k121k528k247j623j124p14l27m65j493k736l088k382
$$ plain form
54845 118928 117498 116729 116494 116773 117235 117315 116652 115253 113534 112272 112052 112513 112636 112030 111423 111526 112039 112217
54827 112217 111893 111347 110637 109762 109127 109217 109977 111073 112489 114298 116038 116963 116817 115918 114634 113245 112150
54810 112150 111670 111728 112109 112849 113919 114829 115084 114884 114802 114942 115020 115182 115949 117296 118410 118581 117952 117208 116918
54791 116918 117294 118240 119417 120467 121274 121904 122358 122628 122826 123037 123152 123149 123355 124078 125174 126375 127885 130159
54773 130159 133208 136611 140170 144059 148320 152757 157425 162723 168809 175237 181290 186399 190196 192523
54759 192523 193510 193382 192111 189535 185785 181261 176143 170367 164219 158533 154030 150649 147734 144749 141692
54744 141692 139013 137298 136859 137466 138435 139044 138891 137967 136591 135219 134208 133755 134070 135400 137695 140432
54728 140432 143029 145400 147923 150976 154748 159359 164811 170758 176572 181636 185505 187813 188251 186676
$$ packed form
54845A18928j430p69k35K79M62Q0o63j399j719j262k20M61J23o06o07J03N13J78
54827A12217l24n46p10q75o35R0P60J096J416J809J740R25j46q99j284j389j095
54810A12150m80N8L81P40J070R10K55k00q2J40P8J62P67J347J114J71o29p44k90
54791A16918L76R46J177J050Q07O30M54K70J98K11J15lK06P23J096J201J510K274
54773A30159L049L403L559L889M261M437M668N298O086O428O053N109L797K327
54759A92523R87j28j271k576l750m524n118n776o148n686m503l381k915k985l057
54744A41692k679j715m39O07R69O09j53r24j376j372j011m53L15J330K295K737
54728A40432K597K371K523L053L772M611N452N947N814N064L869K308M38j575
$$ plain form
54714 186676 183256 178619 173798 169660 166196 162649 158553 154294 150447 147023 143818 141067 139150 137882
54700 137882 136685 135327 133891 132211 130021 127681 126070 125566 125605 125419 124839 124281 124286 125111 126392 127194 126871
54683 126871 125849 125133 125066 125122 124881 124497 124053 123242 122103 121441 121928 123170 124122 124213 123683 123065 122693 122570 122384
54664 122384 121827 121121 120981 121785 123056 124030 124466 124537 124254 123539 122704 122305 122441 122652 122559 122234 121845 121361 120852
54645 120852 120729 121327 122389 123249 123531 123430 123347 123470 123779 124225 124706 124972 124766 124080 123211 122539 122304 122471 122699
54626 122699 122514 121783 121013 120936 121679 122526 122622 121771 120442 119245 118542 118345 118367 118236 117914 117780 118154 118856 119451
54607 119451 119827 120303 121163 122326 123494 124444 125080 125338 125147 124574 123967 123784 124111 124425 124112 123187 122268 121811
54589 121811 121714 121692 121664 121657 121708 122066 123069 124567 125830 126322 126257 126114 125977 125676 125213 124730 124372 124502 125546 127191
$$ packed form
54714A86676l420m637m821m138l464l547m096m259l847l424l205k751j917j268
54700A37882j197j358j436j680k190k340j611n04L9j86n80n58NQ25J281Q02l23
54683A26871j022p16o7N6k41l84m44q11j139o62M87J242R52R1n30o18l72j23j86
54664A22384n57p06j40Q04J271R74M36P1k83p15q35l99J36K11r3l25l89m84n09
54645A20852j23N98J062Q60K82j01q3J23L09M46M81K66k06o86q69o72k35J67K28
54626A22699j85p31p70p7P43Q47R6q51j329j197p03j97K2j31l22j34L74P02N95
54607A19451L76M76Q60J163J168R50O36K58j91n73o07j83L27L14l13r25r19m57
54589A21811r7k2k8pN1L58J003J498J263M92o5j43j37l01m63m83l58J30J044J645
$$ plain form
54569 127191 128236 127883 126811 126360 126949 127961 128854 129546 129825 129302 128082 126879 126252 126195 126479 126892 127171
54552 127171 127234 127475 128324 129589 130714 131622 132708 134109 135620 137192 138793 139854 139709 138640 137631 136985
54536 136985 136137 134984 134378 134841 135741 136295 136587 136934 136985 136255 135043 134048 133451 133022 132773 132846 133006 132921 132749
54517 132749 132833 132939 132417 131096 129548 128428 127955 128041 128610 129657 131122 132708 133855 134117 133633 132991 132606
54500 132606 132541 132861 133581 134148 133708 132228 130720 129908 129337 128379 127470 127467 128256 128922 129149 129553 130634 132227
54482 132227 134034 135939 137533 138099 137422 136204 135368 135270 135824 136993 138757 140792 142549 143716 144504 145490
54466 145490 147121 149239 151093 151915 151524 150341 148903 147553 146452 145645 145035 144421 143614 142527 141262 140164
54450 140164 139589 139512 139487 139146 138563 138027 137675 137538 137701 138183 138800 139358 139789 139955 139570 138620 137657 137350 137823
$$ packed form
54569A27191J045l53j072m51N89J012Q93O92K79n23j220j203o27n7K84M13K79
54552A27171O3K41Q49J265J125R08J086J401J511J572J601J061j45j069j009o46
54536A36985q48j153o06M63R00N54K92L47N1p30j212r95n97m29k49P3J60q5j72
54517A32749Q4J06n22j321j548j120m73Q6N69J047J465J586J147K62m84o42l85
54500A32606o5L20P20N67m40j480j508q12n71r58r09lP89O66K27M04J081J593
54482A32227J807J905J594N66o77j218q36r8N54J169J764K035J757J167P88R86
54466A45490J631K118J854Q22l91j183j438j350j101q07o10o14q07j087j265j098
54450A40164n75p7k5l41n83n36l52j37J63M82O17N58M31J66l85r50r63l07M73
$$ plain form
54431 137823 138650 139330 139600 139584 139867 141057 142928 144349 144545 144133 144391 145707 147315 148389 148747 148590 148156
54414 148156 147742 147512 147234 146719 146432 147001 148080 148493 147801 146966 146988 147571 147767 147466 147427 148053 148951 149751 150685
54395 150685 152015 153361 154041 153949 153755 154222 155501 157141 158596 159599 160134 160320 160387 160566 160843 160916 160619 160294
54377 160294 160575 161786 163750 166132 168739 171463 174119 176500 178464 179972 181117 182116 183087 183824 183923 183168
54361 183168 181663 179647 177339 174957 172653 170387 168102 166083 164943 165076 166225 167618 168417 168067 166540
54346 166540 164515 163111 163082 164114 165045 164866 163517 161715 160129 158855 157709 156815 156585 157124 157919 158349
54330 158349 158259 157830 157092 155978 154733 153825 153379 153063 152653 152343 152311 152273 151744 150545 148853 146989 145383 144512
54312 144512 144473 144717 144542 143865 143258 143234 143779 144608 145525 146423 147158 147566 147508 146841 145663 144664 144828 146403 148378
$$ packed form
54431A37823Q27O80K70j6K83J190J871J421J96m12K58J316J608J074L58j57m34
54414A48156m14k30k78n15k87N69J079M13o92q35K2N83J96l01l9O26Q98Q00R34
54395A50685J330J346O80r2j94M67J279J640J455J003N35J86O7J79K77P3k97l25
54377A60294K81J211J964K382K607K724K656K381J964J508J145R99R71P37R9p55
54361A83168j505k016k308k382k304k266k285k019j140J33J149J393P99l50j527
54346A66540k025j404k9J032R31j79j349j802j586j274j146q94k30N39P95M30
54330A58349r0m29p38j114j245r08m46l16m10l10l2l8n29j199j692j864j606q71
54312A44512l9K44j75o77o07k4N45Q29R17Q98P35M08n8o67j178r99J64J575J975
$$ plain form
54293 148378 149490 149679 150080 151517 153564 155317 156556 157643 158606 158988 158586 157805 157171 156929 157150 157785 158399
54276 158399 158357 157618 156998 157260 158172 158866 158907 158590 158327 158213 158209 158345 158648 159178 160163 161717 163372 164286 164149
54257 164149 163618 163646 164615 166256 168123 169813 170954 171354 171137 170454 169188 167274 165291 164233 164507 165453
54241 165453 166101 166191 166180 166370 166446 165922 164746 163277 161859 160583 159379 158161 156856 155443 154043 152946
54225 152946 152524 153038 154404 156155 157750 158940 159750 160090 159704 158664 157618 157230 157431 157589 157362 157006 156767
54208 156767 156341 155231 153473 151731 150732 150726 151430 152327 153022 153380 153432 153248 152962 152842 153100 153631 154136 154530 155049
54189 155049 155825 156539 156666 156044 155169 154949 156082 158440 161000 162581 162791 162203 161629 161439 161599 162008 162577
54172 162577 163176 163706 164136 164325 163985 163008 161673 160342 159074 157769 156534 155590 154862 153974 152779 151657
$$ packed form
54293A48378J112J89M01J437K047J753J239J087R63L82m02p81o34k42K21O35O14
54276A58399m2p39o20K62R12O94M1l17k63j14mJ36L03N30R85J554J655R14j37
54257A64149n31K8R69J641J867J690J141M00k17o83j266j914j983j058K74R46
54241A65453O48R0j1J90P6n24j176j469j418j276j204j218j305j413j400j097
54225A52946m22N14J366J751J595J190Q10L40l86j040j046l88K01J58k27l56k39
54208A56767m26j110j758j742r99oP04Q97O95L58N2j84k86j20K58N31N05L94N19
54189A55049P76P14J27o22q75k20J133K358K560J581K10n88n74j90J60M09N69
54172A62577N99N30M30J89l40r77j335j331j268j305j235r44p28q88j195j122
$$ plain form
54156 151657 151142 151343 151904 152473 153019 153658 154360 155016 155724 156711 157928 159018 159850 160770 162085 163543 164742
54139 164742 165792 167070 168498 169690 170802 172526 175051 177636 179524 180740 181614 182027 181644 180578 179357
54124 179357 178471 178283 179123 181008 183439 185855 188124 190284 192044 192955 192921 192211 191173 190202 189707 189615 189162
54107 189162 187623 185149 182446 179910 177559 175580 174252 173363 172341 170974 169503 168029 166485 165253
54093 165253 165102 166248 167967 169427 170416 171013 171057 170366 169173 167964 167075 166739 167231 168607 170413 171988
54077 171988 173038 173727 174307 174865 175382 175855 176350 176998 177902 179000 180040 180719 180898 180736 180695 181258 182442 183663
54059 183663 184296 184305 184168 184253 184492 184597 184351 183794 183348 183650 184975 186939 189083 191564 194788 198495 201865
54042 201865 204632 207486 211122 215446 219999 224647 229392 233949 238055 242006 246364 251204 256069 260604
$$ packed form
54156A51657n15K01N61N69N46O39P02O56P08R87J217J090Q32R20J315J458J199
54139A64742J050J278J428J192J112J724K525K585J888J216Q74M13l83j066j221
54124A79357q86j88Q40J885K431K416K269K160J760R11l4p10j038r71m95r2m53
54107A89162j539k474k703k536k351j979j328q89j022j367j471j474j544j232
54093A65253j51J146J719J460R89N97M4o91j193j209q89l36M92J376J806J575
54077A71988J050O89N80N58N17M73M95O48R04J098J040O79J79j62m1N63J184J221
54059A83663O33Rj37Q5K39J05k46n57m46L02J325J964K144K481L224L707L370
54042B01865K767K854L636M324M553M648M745M557M106L951M358M840M865M535
$$ plain form
54028 260604 264862 268916 272579 275626 278082 280108 281682 282593 282777 282576 282447 282324 281483 279323 276219 273215
54012 273215 270811 268455 265444 261910 258529 255534 252527 249284 246232 243921 242297 240769 238920 236927
53998 236927 235314 234432 234284 234757 235891 237892 240922 244878 249418 254302 259772 266407 274242 282022 287711
53983 287711 289910 288554 284204 277198 267943 257624 247879 239707 233157 228035 224323 221771 219638 217279
53969 217279 214765 212667 211377 210794 210503 210092 209380 208478 207593 206812 206231 206183 206967 208278 209255 209341 208928 208972
53951 208972 210141 212421 215369 218559 221774 224903 227700 229820 231240 232507 234361 237191 241049 245903
53937 245903 251410 256595 260398 262689 264300 265962 267703 269394 271266 273535 276008 278538 281508 285374
53923 285374 289986 294752 299379 304041 308979 314264 319852 325527 330910 335890 340982 346911 353756 360754
$$ packed form
54028B60604M258M054L663L047K456K026J574R11J84k01j29j23q41k160l104l004
54012B73215k404k356l011l534l381k995l007l243l052k311j624j528j849j993
53998B36927j613q82j48M73J134K001L030L956M540M884N470O635P835P780N689
53983B87711K199j356m350p006r255j0319r745q172o550n122l712k552k133k359
53969B17279k514k098j290n83k91m11p12r02q85p81n81m8P84J311R77Q6m13M4
53951B08972J169K280K948L190L215L129K797K120J420J267J854K830L858M854
53937B45903N507N185L803K291J611J662J741J691J872K269K473K530K970L866
53923B85374M612M766M627M662M938N285N588N675N383M980N092N929O845O998
$$ plain form
53909 360754 367002 372127 376247 379480 381671 382579 382226 381037 379533 377957 376243 374335 372344 370372 368285
53894 368285 365666 361946 356684 349977 342530 335118 328065 321450 315501 310260 305032 298924 292146 286033
53880 286033 281421 277599 273348 268525 263988 260294 257127 253913 250441 246852 243415 240304 237395 234347
53866 234347 231116 228159 225839 223908 221917 219912 218248 216955 215791 214794 214183 213731 212832 211286 209520
53851 209520 207875 206180 204239 202344 200976 200304 200233 200724 201727 202960 204007 204607 204780 204778 204990 205685 206657
53834 206657 207298 207220 206657 206099 205732 205534 205715 206573 207825 208635 208630 208524 209278 210880 212465 213517 214304 215093
53816 215093 215694 216119 216927 218386 219903 221024 222506 225405 229375 232963 235586 238108 241302 244951 248953
53801 248953 254102 260784 267693 272976 276304 278910 281894 285450 289540 294183 298855 302468 304446 305321
$$ packed form
53909C60754O248N125M120L233K191R08l53j189j504j576j714j908j991j972k087
53894C68285k619l720n262o707p447p412p053o615n949n241n228o108o778o113
53880B86033m612l822m251m823m537l694l167l214l472l589l437l111k909l048
53866B34347l231k957k320j931j991k005j664j293j164r97o11m52q99j546j766
53851B09520j645j695j941j895j368o72p1M91J003J233J047O00J73kK12O95R72
53834B06657O41p8n63n58l67j98J81Q58J252Q10nj06P54J602J585J052P87P89
53816B15093O01M25Q08J459J517J121J482K899L970L588K623K522L194L649M002
53801B48953N149O682O909N283L328K606K984L556M090M643M672L613J978Q75
$$ plain form
53787 305321 306006 306855 307651 308087 307926 306919 304862 301720 297663 293096 288609 284680 281353 278333 275263
53772 275263 271811 267700 263039 258508 254786 251796 248820 245418 241900 238848 236469 234535 232748 231056
53758 231056 229694 228847 228216 227087 225082 222678 220670 219309 218345 217734 217765 218429 219180 219511 219433 219202 218880
53741 218880 218355 217590 216720 216027 215834 216245 216971 217626 218125 218547 218753 218581 218436 219110 220767 222507 223304 223146
53723 223146 222896 223247 224197 225487 227149 229337 231824 233950 235249 236004 237039 238931 241610 244690 247882
53708 247882 250958 253681 256099 258669 261731 264993 267941 270592 273409 276586 279897 283234 286771 290440
53694 290440 293742 296332 298430 300428 302358 303982 305138 305779 305852 305393 304609 303735 302859 301947 300926 299740
53678 299740 298500 297552 297124 296923 296423 295631 295234 295819 297197 298637 299532 299709 299358 298845 298428 298028 297491 297043
$$ packed form
53787C05321O85Q49P96M36j61j007k057l142m057m567m487l929l327l020l070
53772B75263l452m111m661m531l722k990k976l402l518l052k379j934j787j692
53758B31056j362q47o31j129k005k404k008j361r64o11L1O64P51L31p8k31l22
53741B18880n25p65q70o93j93M11P26O55M99M22K06j72j45O74J657J740P97j58
53723B23146k50L51R50J290J662K188K487K126J299P55J035J892K679L080L192
53708B47882L076K723K418K570L062L262K948K651K817L177L311L337L537L669
53694B90440L302K590K098J998J930J624J156O41P3m59p84q74q76r12j021j186
53678B99740j240r48m28k01n00p92l97N85J378J440Q95J77l51n13m17m00n37m48
$$ plain form
53660 297043 297146 297800 298407 298524 298349 298233 298193 298303 299083 300845 302873 303981 303900 303543 303843 304920 306520 308648
53642 308648 311332 314169 316629 318641 320500 322302 323806 324776 325128 324811 323930 323038 322924 323963 325911 328363
53626 328363 331013 333420 335033 335831 336545 337829 339547 341348 343514 346544 350126 353386 356121 358950 362132
53611 362132 365113 367580 370061 372978 375927 378506 381119 384118 386868 388614 389814 391487 393590 395219
53597 395219 396277 397629 399376 400307 399646 398386 398134 399269 400873 401886 401695 400061 397329 394506 392486
53582 392486 391192 389903 388286 386674 385412 384378 383158 381443 379242 376918 374961 373579 372610 371937 371704
53567 371704 371879 371903 371188 369859 368627 368006 368002 368539 369702 371370 372919 373623 373325 372526 371855 371602 371786 372449
53549 372449 373625 375040 376132 376574 376664 377074 378299 380422 383190 386081 388525 390511 392849 396453 401337
$$ packed form
53660B97043J03O54O07J17j75j16m0J10P80J762K028J108q1l57L00J077J600K128
53642C08648K684K837K460K012J859J802J504R70L52l17q81q92j14J039J948K452
53626C28363K650K407J613P98P14J284J718J801K166L030L582L260K735K829L182
53611C62132K981K467K481K917K949K579K613K999K750J746J200J673K103J629
53597C95219J058J352J747R31o61j260k52J135J604J013j91j634k732k823k020
53582C92486j294j289j617j612j262j034j220j715k201k324j957j382r69o73k33
53567C71704J75K4p15j329j232o21mN37J163J668J549P04k98p99o71k53J84O63
53549C72449J176J415J092M42R0M10J225K123K768K891K444J986K338L604M884
$$ plain form
53534 401337 406721 412069 417569 423535 429970 436967 444991 454269 464210 473969 483468 493455 504546 516585
53520 516585 529003 541585 554712 568906 584226 600223 616577 633685 652324 672730 694292
53509 694292 716312 738770 762123 786466 811185 835452 858867 881553 903698 925179 945781
53498 945781 965721 985588 1005577 1025142 1043783 1061904 1080325 1099087 1117369 1134661 1151357
53487 1151357 1168017 1184618 1200910 1217038 1233414 1250230 1267414 1284783 1302054 1318916 1335254
53476 1335254 1350978 1365556 1378222 1388833 1397946 1405694 1411211 1413720 1413671 1412109 1409228 1404287 1396744
53463 1396744 1386774 1374783 1361154 1346567 1331849 1317276 1302446 1286963 1270868 1254265 1237038
53452 1237038 1219168 1200944 1182585 1163978 1145062 1126238 1108066 1090689 1073856 1057473 1041872
$$ packed form
53534D01337N384N348N500N966O435O997Q024R278R941R759R499R987J1091J2039
53520E16585J2418J2582J3127J4194J5320J5997J6354J7108J8639K0406K1562
53509F94292K2020K2458K3353K4343K4719K4267K3415K2686K2145K1481K0602
53498I45781J9940J9867J9989J9565J8641J8121J8421J8762J8282J7292J6696
53487A151357J6660J6601J6292J6128J6376J6816J7184J7369J7271J6862J6338
53476A335254J5724J4578J2666J0611R113P748N517K509m9j562k881m941p543
53463A396744r970j1991j3629j4587j4718j4573j4830j5483j6095j6603j7227
53452A237038j7870j8224j8359j8607j8916j8824j8172j7377j6833j6383j5601
$$ plain form
53441 1041872 1027479 1014385 1002381 991373 981650 973733 968010 964498 962802 962232 962127 962295 963145 965197
53427 965197 968552 972990 978468 985181 993180 1002327 1012664 1024407 1037500 1051660 1067014 1084199 1103490
53414 1103490 1124289 1145835 1168003 1190943 1214395 1237981 1261982 1287235 1314372 1343599 1375051
53403 1375051 1408704 1444014 1480294 1517638 1556988 1599084 1643752 1690332 1738399 1787833 1838520
53392 1838520 1890240 1942644 1995215 2047537 2099684 2152042 2204542 2256343 2306561 2355060 2402214
53381 2402214 2448015 2491774 2532681 2570333 2604564 2635076 2661535 2683937 2702577 2717509 2728194
53370 2728194 2733787 2733638 2727482 2715315 2697323 2673767 2644711 2610087 2570378 2527103 2482044 2435942
53358 2435942 2388328 2338730 2287527 2235558 2183509 2132023 2081860 2033397 1986329 1940307 1895610
$$ packed form
53441A041872j4393j3094j2004j1008r723p917n723l512j696n70j05J68Q50K052
53427I65197L355M438N478O713P999R147J0337J1743J3093J4160J5354J7185J9291
53414A103490K0799K1546K2168K2940K3452K3586K4001K5253K7137K9227L1452
53403A375051L3653L5310L6280L7344L9350M2096M4668M6580M8067M9434N0687
53392A838520N1720N2404N2571N2322N2147N2358N2500N1801N0218M8499M7154
53381B402214M5801M3759M0907L7652L4231L0512K6459K2402J8640J4932J0685
53370B728194N593j49o156j2167j7992k3556k9056l4624l9709m3275m5059m6102
53358B435942m7614m9598n1203n1969n2049n1486n0163m8463m7068m6022m4697
$$ plain form
53347 1895610 1852780 1811859 1772476 1734370 1697306 1660740 1624237 1588232 1553813 1521691 1491750
53336 1491750 1463590 1437097 1412417 1389752 1369249 1350852 1334317 1319569 1306855 1296209 1286898
53325 1286898 1277752 1267905 1256861 1244220 1230020 1215252 1201295 1188681 1176929 1165650 1155227 1146237
53313 1146237 1138766 1132526 1127189 1122445 1118207 1115000 1113628 1114168 1115711 1117436 1119568 1122975 1128205 1135306
53299 1135306 1144302 1155329 1168407 1183387 1200055 1218122 1237294 1257593 1279386 1302805 1327289
53288 1327289 1351919 1376119 1399797 1422954 1445392 1466731 1486556 1504574 1520722 1534947 1546848
53277 1546848 1555819 1561719 1565072 1566352 1565336 1561489 1554785 1545685 1534450 1520908 1504990 1487117 1467836
53264 1467836 1447296 1425167 1401050 1374965 1347595 1319960 1292668 1265554 1238255 1210970 1184208
$$ packed form
53347A895610m2830m0921l9383l8106l7064l6566l6503l6005l4419l2122k9941
53336A491750k8160k6493k4680k2665k0503j8397j6535j4748j2714j0646r311
53325A286898r146r847j1044j2641j4200j4768j3957j2614j1752j1279j0423q990
53313A146237p471o240n337m744m238l207j372N40J543J725K132L407N230P101
53299A135306Q996J1027J3078J4980J6668J8067J9172K0299K1793K3419K4484
53288A327289K4630K4200K3678K3157K2438K1339J9825J8018J6148J4225J1901
53277A546848Q971N900L353J280j016l847o704r100j1235j3542j5918j7873j9281
53264A467836k0540k2129k4117k6085k7370k7635k7292k7114k7299k7285k6762
$$ plain form
53253 1184208 1157844 1130997 1103187 1075213 1048407 1023299 999482 976494 954150 931998 909300
53242 909300 885965 862939 841156 820547 800624 781572 763994 747772 732173 717170 703717
53231 703717 692326 682243 672604 663703 656305 650123 643937 637098 630061 623262 616244 608245 599168 589544
53217 589544 579784 569770 559045 547204 534172 520305 506275 492842 480661 470085 460931 452553
53205 452553 444331 436120 428111 420433 413047 405845 398557 390754 382297 373732 365899 359087 352821 346390
53191 346390 339310 331428 323037 315016 308392 303537 299963 296974 294237 291642 288954 285882 282425 278952
53177 278952 275942 273628 271795 269945 267785 265552 263755 262634 261962 261326 260471 259439 258507 257902 257479 256850
53161 256850 255939 255134 254745 254551 254138 253386 252309 250786 248945 247494 247086 247432 247651 247413 247135 247044 246722 245803
$$ packed form
53253A184208k6364k6847k7810k7974k6806k5108k3817k2988k2344k2152k2698
53242I09300k3335k3026k1783k0609j9923j9052j7578j6222j5599j5003j3453
53231G03717j1391j0083r639q901p398o182o186o839p037o799p018p999r077r624
53217E89544r760j0014j0725j1841j3032j3867j4030j3433j2181j0576r154q378
53205D52553q222q211q009p678p386p202p288p803q457q565p833o812o266o431
53191C46390p080p882q391q021o624m855l574k989k737k595k688l072l457l473
53177B78952l010k314j833j850k160k233j797j121o72o36q55j032r32o05m23o29
53161B56850r11q05l89j94m13p52j077j523j841j451m08L46K19k38k78r1l22r19
$$ plain form
53143 245803 244626 243891 244016 244982 246498 248084 249261 249822 249830 249432 248868 248516 248605 248982 249509 250465 252076 253886
53125 253886 255225 256210 257607 259690 261920 263842 265547 267159 268622 270258 272668 275670 278012 278707 278103
53110 278103 277195 276406 275562 274581 273527 272273 270699 269105 267989 267554 267646 267937 267874 266822 264584 261572 258293
53093 258293 255039 252277 250673 250238 249951 248861 247261 246140 245730 245271 244090 242328 240592 239410 239047
53078 239047 239408 240014 240370 240372 240193 239880 239336 238558 237598 236426 235135 234169 234008 234620 235450 235913 235771 235171 234489
53059 234489 233985 233472 232600 231535 231019 231445 232307 232904 233293 234075 235453 237009 238216 238742 238393 237246 235818
53042 235818 234735 234234 234245 234853 236229 238118 239750 240448 240225 239755 239760 240351 240916 240815 240135 239490 239184 239026
53024 239026 238956 239199 239647 239834 239846 240483 241986 243369 243783 243781 244335 245164 245212 244445 243955 244310 244921 245204 245267 245233
$$ packed form
53143B45803j177p35J25R66J516J586J177N61Ql98n64l52Q9L77N27R56J611J810
53125B53886J339R85J397K083K230J922J705J612J463J636K410L002K342O95o04
53110B78103r08p89q44r81j054j254j574j594j116m35R2K91o3j052k238l012l279
53093B58293l254k762j604m35k87j090j600j121m10m59j181j762j736j182l63
53078B39047L61O06L56Kj79l13n44p78r60j172j291r66j61O12Q30M63j42o00o82
53059B34489n04n13q72j065n16M26Q62N97L89P82J378J556J207N26l49j147j428
53042B35818j083n01J1O08J376J889J632O98k23m70NN91N65j01o80o45l06j58
53024B39026p0K43M48J87J2O37J503J383M14kN54Q29M8p67m90L55O11K83O3l4
$$ plain form
53004 245233 244887 244431 244662 245863 247168 247651 247476 247455 247913 248590 249264 249903 250383 250580 250695 251101 251884 252835
52986 252835 253804 254858 256101 257549 259129 260704 262088 263094 263533 263205 262051 260381 258855 258172 258708
52971 258708 260282 262155 263505 264174 264866 266356 268574 270749 272332 273451 274508 275649 276643 277013 276304
52956 276304 274530 272328 270456 269134 268064 266924 265596 264092 262630 261639 261284 261103 260488 259413 258312
52941 258312 257419 256706 256233 256002 255665 255046 254780 255591 257014 257756 257427 256885 256611 255838 253956 251865 250990 251527
52923 251527 252511 253186 253423 253029 251672 249644 247961 247427 247950 248903 249772 250391 250881 251538 252490 253432 253860 253684
52905 253684 253369 253432 253932 254531 254882 254859 254432 253478 251913 250130 249056 249428 250939 252453 253184 253376 253683 254272
52887 254272 254874 255378 255861 256163 255984 255533 255628 256869 258885 260713 261879 262906 264628 267150 269681 271404
$$ packed form
53004B45233l46m56K31J201J305M83j75k1M58O77O74O39M80J97J15M06P83R51
52986B52835R69J054J243J448J580J575J384J006M39l28j154j670j526o83N36
52971B58708J574J873J350O69O92J490K218K175J583J119J057J141R94L70p09
52956B76304j774k202j872j322j070j140j328j504j462r91l55j81o15j075j101
52941B58312q93p13m73k31l37o19k66Q11J423P42l29n42k74p73j882k091q75N37
52923B51527R84O75K37l94j357k028j683n34N23R53Q69O19M90O57R52R42M28j76
52905B53684l15O3N00N99L51k3m27r54j565j783j074L72J511J514P31J92L07N89
52887B54272O02N04M83L02j79m51R5J241K016J828J166J027J722K522K531J723
$$ plain form
52871 271404 272256 272766 273340 274008 274704 275387 275865 275908 275705 275848 276579 277254 276868 274982 271952 268383 264668 261038
52853 261038 257731 254905 252443 250014 247412 244853 242877 241900 241819 242081 242092 241578 240679 239766 239071 238457 237696
52836 237696 236972 236774 237096 237162 236372 235250 234886 235570 236598 237392 238124 239003 239570 239198 237930 236408 235160
52819 235160 234322 233907 233974 234547 235553 236872 238371 239888 241163 241748 241195 239634 238036 237473 238011 238679 238578
52802 238578 237600 236017 233957 231628 229625 228538 228370 228586 228566 227909 226622 225286 224723 225189 226115 226860 227456
52785 227456 228270 229308 230287 231178 232141 233002 233301 232919 232241 231616 231003 230320 229795 229725 230024 230245 230034 229429 228709
52766 228709 228122 227840 228006 228586 229184 229361 229273 229718 231212 233218 234689 235234 235408 235940 237142 238984 241212
52749 241212 243306 244871 246200 248001 250419 252777 254471 255609 256550 257365 258036 258775 259771 260962 262294
$$ packed form
52871B71404Q52N10N74O68O96O83M78M3k03J43P31O75l86j886l030l569l715l630
52853B61038l307k826k462k429k602k559j976r77q1K62J1n14q99r13o95o14p61
52836B37696p24j98L22O6p90j122l64O84J028P94P32Q79N67l72j268j522j248
52819B35160q38m15O7N73J006J319J499J517J275N85n53j561j598n63N38O68j01
52802B38578r78j583k060k329k003j087j68K16k0o57j287j336n63M66R26P45N96
52785B27456Q14J038R79Q91R63Q61K99l82o78o25o13o83n25p0K99K21k11o05p20
52766B28709n87k82J66N80N98J77q8M45J494K006J471N45J74N32J202J842K228
52749B41212K094J565J329J801K418K358J694J138R41Q15O71P39R96J191J332
$$ plain form
52734 262294 263761 264996 265372 264844 264143 263723 263112 261812 260303 259452 259308 259147 258390 256877 254633 252072
52718 252072 250153 249498 249528 249197 248425 248068 248584 249600 250758 252103 253427 254076 253772 253045 252540 252348 252249 252134
52700 252134 251937 251597 251318 251458 251948 252216 251823 250828 249426 247771 246286 245580 245763 246308 246794 247304 247840 247989
52682 247989 247689 247722 248813 250504 251576 251455 250636 249864 249446 249365 249507 249593 249233 248378 247555 247489 248470 250070 251475
52663 251475 252219 252684 253770 255915 258579 260838 262381 263709 265406 267471 269352 270442 270511 269813 268884 268157
52647 268157 267688 267202 266384 265162 263811 262779 262315 262223 262070 261672 261295 261289 261698 262303 262992 263935 265397 267404
52629 267404 269655 271790 273722 275561 277166 278007 277758 276827 275907 274998 273370 270674 267618 265222 263731
52614 263731 262756 262239 262641 264108 265889 266918 266801 266021 265325 265061 265061 264994 264760 264580 264733 265205 265655 265718 265377
$$ packed form
52734B62294J467J235L76n28p01m20o11j300j509q51j44j61p57j513k244k561
52718B52072j919o55L0l31p72l57N16J016J158J345J324O49l04p27n05j92r9j15
52700B52134j97l40k79J40M90K68l93r95j402j655j485p06J83N45M86N10N36J49
52682B47989l00L3J091J691J072j21q19p72m18q1J42Q6l60q55q23o6R81J600J405
52663B51475P44M65J086K145K664K259J543J328J697K065J881J090O9o98r29p27
52647B68157m69m86q18j222j351j032m64r2j53l98l77oM09O05O89R43J462K007
52629B67404K251K135J932J839J605Q41k49r31r20r09j628k696l056k396j491
52614B63731r75n17M02J467J781J029j17p80o96k64%o7k34j80J53M72M50O3l41
$$ plain form
52595 265377 265006 265069 265770 266915 268105 269003 269407 269132 268066 266496 265266 265269 266566 268204 269130 269246 269293 269687
52577 269687 269838 268910 266991 265086 263991 263613 263503 263593 264033 264600 264719 264096 263022 262052 261585 261753 262419 263203
52559 263203 263721 263891 263901 263862 263695 263349 262885 262255 261312 260214 259571 259863 260767 261356 261000 259884 258693 257981
52541 257981 257956 258593 259651 260613 260899 260364 259534 259181 259597 260342 260743 260575 260192 260125 260651 261722 263142 264694
52523 264694 266171 267385 268233 268797 269410 270529 272372 274579 276338 277119 277367 278294 280777 284517 288465 291950
52507 291950 295053 297894 300086 301167 301176 300371 298677 295972 292755 289876 287605 285530 283437 281670 280372
52492 280372 279071 277415 275771 274573 273578 272350 271106 270353 269973 269478 269125 269898 272116 274722 276366 276754
52476 276754 276547 276346 276308 276611 277689 279720 282120 283878 284498 284531 285019 286455 288534 290915 293841 297663
$$ packed form
52595B65377l71O3P01J145J190Q98M04k75j066j570j230LJ297J638R26J16M7L94
52577B69687J51r28j919j905j095l78j10R0M40N67J19o23j074r70m67J68O66P84
52559B63203N18J70J0l9j67l46m64o30r43j098o43K92R04N89l56j116j191p12
52541B57981k5O37J058R62K86n35q30l53M16P45M01j68l83o7N26J071J420J552
52523B64694J477J214Q48N64O13J119J843K207J759P81K48R27K483L740L948L485
52507B91950L103K841K192J081Rq05j694k705l217k879k271k075k093j767j298
52492B80372j301j656j644j198r95j228j244p53l80m95l53P73K218K606J644L88
52476B76754k07k01l8L03J078K031K400J758O20L3M88J436K079K381K926L822
$$ plain form
52460 297663 301973 305647 307731 307978 306634 304120 301016 297927 295146 292615 290280 288208 286283 284114
52446 284114 281552 279052 277218 276023 274835 273238 271558 270367 269638 268773 267488 266336 266060 266667 267526
52431 267526 268214 268769 269131 269024 268600 268579 269306 270220 270740 271166 272045 273071 273503 273490 274067 275796 278241 280993
52413 280993 284405 288926 294329 300061 306005 312509 319951 328493 337893 347227 355062 360248 362424 361749
52399 361749 358521 353247 346738 339823 333150 327317 322720 319088 315617 311892 308266 305097 302140 299201
52385 299201 296922 296161 296739 297499 297611 297306 297253 297780 298972 301071 304368 308738 313588 318322 322788 327225
52369 327225 331795 336194 339866 342595 344728 346689 348392 349354 349314 348564 347610 346699 345808 344961 344304 343798 343110
52352 343110 342134 341454 341823 343141 344457 345267 346227 348127 350623 352741 354352 356296 359057 362206 365339
$$ packed form
52460B97663M310L674K084K47j344k514l104l089k781k531k335k072j925k169
52446B84114k562k500j834j195j188j597j680j191p29q65j285j152k76O07Q59
52431B67526O88N55L62j07m24k1P27R14N20M26Q79J026M32j3N77J729K445K752
52413B80993L412M521N403N732N944O504P442Q542R400R334P835N186K176o75
52399C61749l228n274o509o915o673n833m597l632l471l725l626l169k957k939
52385B99201k279p61N78P60J12l05n3N27J192K099L297M370M850M734M466M437
52369C27225M570M399L672K729K133J961J703R62m0p50r54r11q91q47o57n06o88
52352C43110r76o80L69J318J316Q10R60J900K496K118J611J944K761L149L133
$$ plain form
52337 365339 368752 372865 377596 382743 388517 395252 402957 411454 420658 430473 440835 452010 464395
52324 464395 477859 491877 506508 522452 539694 556892 572797 587613 602231 616760 630820
52313 630820 644842 659944 676552 694060 711834 729722 747555 765038 782310 799867 817710
52302 817710 835210 851987 868312 884312 899398 912811 924327 934068 941959 947740 951307 952852
52290 952852 952706 951091 947913 942932 936418 929383 922720 916310 909510 902417 895980 890893 887094 884405
52276 884405 882912 882470 882567 883066 884466 887115 890741 895097 900418 906781 913645 920605 928098 936711 946273
52261 946273 956328 967108 979226 992646 1006756 1021325 1036555 1052133 1067090 1080817 1093583
52250 1093583 1105709 1116747 1125834 1132457 1136503 1137906 1136699 1133218 1127878 1120783 1111822 1101183 1089503
$$ packed form
52337C65339L413M113M731N147N774O735P705Q497R204R815J0362J1175J2385
52324D64395J3464J4018J4631J5944J7242J7198J5905J4816J4618J4529J4060
52313F30820J4022J5102J6608J7508J7774J7888J7833J7483J7272J7557J7843
52302H17710J7500J6777J6325J6000J5086J3413J1516R741P891N781L567J545
52290I52852j46j615l178m981o514p035o663o410o800p093o437n087l799k689
52276H84405j493m42R7M99J400K649L626M356N321O363O864O960P493Q613R562
52261I46273J0055J0780J2118J3420J4110J4569J5230J5578J4957J3727J2766
52250A093583J2126J1038R087O623M046J403j207l481n340p095q961j0639j1680
$$ plain form
52237 1089503 1077420 1065078 1052178 1038450 1023960 1008991 993825 978816 964514 951333 939065
52226 939065 927081 915184 903894 893657 884220 875256 867275 861165 856869 853238 849417 845827 843480
52213 843480 842791 843419 844877 846777 848721 850470 852206 854309 856886 859778 862930 866389 869982 873438 876946
52198 876946 881228 886752 893034 898949 903744 907663 911620 916322 921614 926558 930130 931895 932082 931120 929148
52183 929148 925963 921366 915549 909132 902702 896354 889853 883282 877209 871954 867065 861952 856876 852718
52169 852718 849794 847485 845213 843225 842143 842257 843646 846518 850832 855852 860626 864757 868320 871217
52155 871217 873178 874301 875028 875586 875936 876266 876978 878110 879251 880132 880788 881105 880825 880201 880052 880834 882171
52138 882171 883638 885497 888165 891428 894787 898351 902831 908769 916183 924857 934695 945958 959468 976203
$$ packed form
52237A089503j2083j2342j2900j3728j4490j4969j5166j5009j4302j3181j2268
52226I39065j1984j1897j1290j0237r437q964p981o110m296l631l821l590k347
52213H43480o89O28J458J900J944J749J736K103K577K892L152L459L593L456L508
52198H76946M282N524O282N915M795L919L957M702N292M944L572J765J87r62j972
52183I29148l185m597n817o417o430o348o501o571o073n255m889n113n076m158
52169H52718k924k309k272j988j082J14J389K872M314N020M774M131L563K897
52155H71217J961J123P27N58L50L30P12J132J141Q81O56L17k80o24j49P82J337
52138H82171J467J859K668L263L359L564M480N938P414Q674R838J1263J3510J6735
$$ plain form
52124 976203 996211 1018146 1040418 1062636 1085475 1109411 1134297 1160012 1186641 1213827 1240655
52113 1240655 1266506 1291455 1315535 1338070 1358210 1375767 1391262 1405371 1418573 1430967 1442093
52102 1442093 1451216 1458061 1462991 1466202 1467180 1465425 1461358 1455818 1448783 1439254 1426583 1411330 1394548
52089 1394548 1376644 1357415 1336966 1316145 1296043 1277388 1260481 1245446 1232281 1220726 1210291
52078 1210291 1200570 1191552 1183672 1177587 1173832 1172552 1173443 1175994 1179875 1185129 1192014 1200655 1210807 1221925
52064 1221925 1233495 1245468 1258394 1272924 1289072 1306099 1323253 1340422 1357697 1374461 1389364
52053 1389364 1401441 1410888 1418447 1424245 1427621 1428003 1425477 1420369 1412699 1402455 1390167 1376758 1362751
52040 1362751 1347980 1332221 1315740 1299012 1282282 1265765 1249989 1235343 1221333 1206844 1191331
$$ packed form
52124I76203K0008K1935K2272K2218K2839K3936K4886K5715K6629K7186K6828
52113A240655K5851K4949K4080K2535K0140J7557J5495J4109J3202J2394J1126
52102A442093R123O845M930L211R78j755m067n540p035r529j2671j5253j6782
52089A394548j7904j9229k0449k0821k0102j8655j6907j5035j3165j1555j0435
52078A210291r721r018p880o085l755j280Q91K551L881N254O885Q641J0152J1118
52064A221925J1570J1973J2926J4530J6148J7027J7154J7169J7275J6764J4903
52053A389364J2077R447P559N798L376L82k526n108p670j0244j2288j3409j4007
52040A362751j4771j5759j6481j6728j6730j6517j5776j4646j4010j4489j5513
$$ [...]
##END NTUPLES=NMR SPECTRUM
##END=
