##TITLE=AC1449_MFUAH13258_8011668_1sLsY1adv6
##JCAMPDX= 6.0         $$ Bruker NMR JCAMP-DX V2.0
##DATA TYPE= NMR SPECTRUM
##DATA CLASS= NTUPLES
##ORIGIN= BRUKER
##OWNER= Administrator
$$ 1.72 TOPSPIN		Version 2.1
$$ 2013-07-05 16:45:53.312 -0700  Administrator@X
$$ Compression mode = diff/dup
##.OBSERVE FREQUENCY= 400.02188249412
##.OBSERVE NUCLEUS= ^1H
##.ACQUISITION MODE= SIMULTANEOUS (DQD)
##.ACQUISITION SCHEME= undefined
##.AVERAGES= 8
##.DIGITISER RES= 22
##SPECTROMETER/DATA SYSTEM= spect
##.PULSE SEQUENCE= zg30
##.SOLVENT NAME= COFFEE_meoh
##.SHIFT REFERENCE= INTERNAL, COFFEE_meoh, 1, 14.98509
##AUDIT TRAIL= $$ (NUMBER, WHEN, WHO, WHERE, PROCESS, VERSION, WHAT)
$$ ##TITLE= Audit trail, TOPSPIN		Version 2.1
$$ ##JCAMPDX= 5.01
$$ ##ORIGIN= Bruker BioSpin GmbH
$$ ##OWNER= Administrator
$$ $$ E:\/data/COFFEE/nmr/AC1449_MFUAH13258_8011668_1sLsY1adv6/10/pdata/1/auditp.txt
$$ ##AUDIT TRAIL=  $$ (NUMBER, WHEN, WHO, WHERE, PROCESS, VERSION, WHAT)
(   1,<2013-07-05 16:45:46.109 -0700>,<Administrator>,<X>,<go>,<TOPSPIN 2.1>,
      <created by zg
	started at 2013-07-05 16:44:40.281 -0700,
	POWCHK enabled, PULCHK disabled,
       configuration hash MD5:
       C8 4E 4E 5D D3 5C D8 9E 9F 52 82 E0 59 8A DE 15
       data hash MD5: 64K
       F6 58 A6 1A A3 1C 22 07 FF 21 AF 5F 8B 8D 85 FD>)
(   2,<2013-07-05 16:45:49.203 -0700>,<Administrator>,<X>,<proc1d>,<TOPSPIN 2.1>,
      <Start of raw data processing
       efp LB = 0 FT_mod = 6 PKNL = 1 PHC0 = 0 PHC1 = 0 SI = 32K 
       data hash MD5: 32K
       76 D3 F7 38 9B 1B F2 1B 31 78 E6 F3 3E 01 3C 71>)
(   3,<2013-07-05 16:45:49.547 -0700>,<Administrator>,<X>,<proc1d>,<TOPSPIN 2.1>,
      <pk PHC0 = 95.01526 PHC1 = 0 
       data hash MD5: 32K
       31 87 B1 7A 3D 7D 11 4F 2D BD BD 69 99 B4 14 A6>)
(   4,<2013-07-05 16:45:49.844 -0700>,<Administrator>,<X>,<proc1d>,<TOPSPIN 2.1>,
      <abs ABSG = 1 
       data hash MD5: 32K
       26 19 BE 6B 4D 4E B6 0E 6B D4 D4 AE C7 B6 23 45>)
(   5,<2013-07-05 16:45:49.984 -0700>,<Administrator>,<X>,<proc1d>,<TOPSPIN 2.1>,
      <abs ABSG = 2 
       data hash MD5: 32K
       E0 C3 D8 CE 96 A9 BB 43 91 CA 4F D7 31 5B B8 B4>)
(   6,<2013-07-05 16:45:50.109 -0700>,<Administrator>,<X>,<proc1d>,<TOPSPIN 2.1>,
      <abs ABSG = 3 
       data hash MD5: 32K
       A0 8D 4C 09 5C 23 26 7D ED 14 53 AE 27 98 C3 D8>)
(   7,<2013-07-05 16:45:50.187 -0700>,<Administrator>,<X>,<proc1d>,<TOPSPIN 2.1>,
      <abs ABSG = 4 
       data hash MD5: 32K
       3E A1 F7 02 E5 91 3D F7 7D 95 04 66 C1 2A 6E 05>)
(   8,<2013-07-05 16:45:50.234 -0700>,<Administrator>,<X>,<proc1d>,<TOPSPIN 2.1>,
      <abs ABSG = 5 
       data hash MD5: 32K
       72 18 DA FC 56 D5 75 B9 F6 3C B9 E3 8A 99 DA 4B>)
$$ ##END=
$$ 
$$ $$ hash MD5
$$ $$ F0 17 4E 18 B5 AD DD 2F DF 48 B7 8D 8B B0 34 C1
##$RELAX= 
##$RELAX= 
##$RELAX= 
##$RELAX= 
##$RELAX= 
##$RELAX= 
##$RELAX= 
$$ Bruker specific parameters
$$ --------------------------
##$DU= <E:\>
##$EXPNO= 10
##$NAME= <AC1449_MFUAH13258_8011668_1sLsY1adv6>
$$ [...]
##$TP= (0..7)
150 150 150 150 150 150 150 150
##$TP07= 0
##$TPNAME0= <>
##$TPNAME1= <>
##$TPNAME2= <>
##$TPNAME3= <>
##$TPNAME4= <>
##$TPNAME5= <>
##$TPNAME6= <>
##$TPNAME7= <>
##$TPOAL= (0..7)
0.5 0.5 0.5 0.5 0.5 0.5 0.5 0.5
##$TPOFFS= (0..7)
0 0 0 0 0 0 0 0
##$TUNHIN= 0
##$TUNHOUT= 0
##$TUNXOUT= 0
##$USERA1= <user>
##$USERA2= <user>
##$USERA3= <user>
##$USERA4= <user>
##$USERA5= <user>
##$V9= 5
##$VALIST= <valist>
##$VCLIST= <CCCCCCCCCCCCCCC>
##$VD= 0
##$VDLIST= <DDDDDDDDDDDDDDD>
##$VPLIST= <PPPPPPPPPPPPPPP>
##$VTLIST= <TTTTTTTTTTTTTTT>
##$WBST= 1024
##$WBSW= 4
##$XGAIN= (0..3)
0 0 0 0
##$XL= 0
##$YL= 0
##$YMAX_a= 639057
##$YMIN_a= -542063
##$ZGOPTNS= <>
##$ZL1= 120
##$ZL2= 120
##$ZL3= 120
##$ZL4= 120
##$ABSF1= 14.98509
##$ABSF2= -5.573092
##$ABSG= 5
##$ABSL= 3
##$ALPHA= 0
##$AQORDER= 0
##$ASSFAC= 0
##$ASSFACI= 0
##$ASSFACX= 0
##$ASSWID= 0
##$AUNMP= <proc_prof1d_extract_pilot.lims>
##$AXLEFT= 0
##$AXNAME= <>
##$AXNUC= <1H>
##$AXRIGHT= 0
##$AXTYPE= 0
##$AXUNIT= <>
##$AZFE= 0.1
##$AZFW= 0.1
##$BCFW= 0
##$BC_mod= 0
##$BYTORDP= 0
##$COROFFS= 0
##$CY= 15
##$DATMOD= 1
##$DC= 0
##$DFILT= <>
##$DTYPP= 0
##$F1P= 0
##$F2P= 0
##$FCOR= 0.5
##$FTSIZE= 32768
##$FT_mod= 6
##$GAMMA= 0
##$GB= 0
##$INTBC= 1
##$INTSCL= 1
##$ISEN= 128
##$LB= 0
##$LEV0= 0
##$LPBIN= 0
##$MAXI= 10000
##$MC2= 0
##$MEAN= 0
##$ME_mod= 0
##$MI= 0
##$NCOEF= 0
##$NC_proc= -8
##$NLEV= 6
##$NOISF1= 0
##$NOISF2= 0
##$NSP= 0
##$NTH_PI= 0
##$NZP= 0
##$OFFSET= 14.98509
##$PC= 1
##$PHC0= 95.01526
##$PHC1= 0
##$PH_mod= 1
##$PKNL= yes
##$PPARMOD= 0
##$PPDIAG= 0
##$PPIPTYP= 0
##$PPMPNUM= 2147483647
##$PPRESOL= 1
##$PSCAL= 4
##$PSIGN= 0
##$PYNMP= <proc.py>
##$REVERSE= no
##$SF= 400.02
##$SI= 32768
##$SIGF1= 0
##$SIGF2= 0
##$SINO= 400
##$SIOLD= 32768
##$SPECTYP= <>
##$SREGLST= <1H.CDCl3>
##$SSB= 0
##$STSI= 32768
##$STSR= 0
##$SW_p= 8223.68421052631
##$SYMM= 0
##$S_DEV= 0
##$TDeff= 65536
##$TDoff= 0
##$TI= <>
##$TILT= no
##$TM1= 0
##$TM2= 0
##$TOPLEV= 0
##$USERP1= <user>
##$USERP2= <user>
##$USERP3= <user>
##$USERP4= <user>
##$USERP5= <user>
##$WDW= 1
##$XDIM= 32768
##$YMAX_p= 466894249
##$YMIN_p= -690782
##$CURPLOT= <Network HP LaserJet P1505>
##$CURPRIN= <$Network HP LaserJet P1505>
##$DFORMAT= <normdp>
##$LAYOUT= <+/1D_H.xwp>
##$LFORMAT= <normlp>
##$PFORMAT= <normpl>
##$SURQMSG= 1
$$ End of Bruker specific parameters
$$ ---------------------------------
##NTUPLES= NMR SPECTRUM
##VAR_NAME=  FREQUENCY,     SPECTRUM/REAL,   SPECTRUM/IMAG
##SYMBOL=    X,             R,               I
##VAR_TYPE=  INDEPENDENT,   DEPENDENT,       DEPENDENT
##VAR_FORM=  AFFN,          ASDF,            ASDF
##VAR_DIM=   32768,         32768,           32768
##UNITS=     HZ,            ARBITRARY UNITS, ARBITRARY UNITS
##FACTOR=    0.250966925370066, 1,           1
##FIRST=     8223.43324360094, 17175,        83718
##LAST=      0,             -89710,          22663
##MIN=       0,             -690782,         0
##MAX=       8223.43324360094, 466894249,    0
$$ Real data points
##PAGE= N=1
##DATA TABLE= (X++(R..R)), XYDATA
$$ [...]
19549A66500A3214J31170a13858p9958g3575A54093M1139b30732a02985B18164
$$ 166500 13214 144384 -113858 -193816 -73575 154093 195232 -230732 -102985 218164
19538D0723d7569B04188E5315K42726h2317l43038A15731b60238d528k22916f7629
$$ 40723 -47569 204188 55315 298041 -82317 -425355 115731 -260238 -4528 -227444 -67629
19526I8760k214E39a51654n9806A65551c13078B28501h9736c0059q1733b0219
$$ 98760 96546 539 -151654 -211460 165551 -313078 228501 -89736 -30059 -111792 -20219
19514a03769J8171I169d56816a83689q2879D5689a04458B3849a15741q4144Q1633
$$ -103769 -85598 9169 -456816 -183689 -266568 45689 -104458 23849 -115741 -199885 -118252
19503a18252q3752a643m6658k93630h6872b1736A47694k4679d8189l18409E5344
$$ -118252 -202004 -1643 -48301 -341931 -86872 -21736 147694 123015 -48189 -366598 55344
19491c15832f3834k3561B04104h9012j97589R3738F5653M6159g2607q3981J8114
$$ -315832 -63834 -87395 204104 -89012 -286601 -192863 65653 111812 -72607 -156588 -138474
19480a38474j9999c652j75537A2954c71402a2996A33541n5674M6942C8371a36708
$$ -138474 -158473 -3652 -179189 12954 -371402 -12996 133541 77867 124809 38371 -136708
19468b19883c9296I9358q509h1205p3004E319a43256A4715b78497Q0840j09285
$$ -219883 -39296 99358 90849 -81205 -154209 5319 -143256 14715 -278497 -197657 -306942
19457c06942A08023a15422e3396B40216D6052j0801K23954H653g9694C648N8240
$$ -306942 108023 -115422 -53396 240216 46052 35251 259205 8653 -79694 3648 61888
19446F1888R283j5699c17003A8009b84932J37262c3446A0975O0392g4917A4466
$$ 61888 71171 55472 -317003 18009 -284932 -147670 -33446 10975 71367 -74917 14466
19434b4361m108I7471D6058h0836b0529j73334P5870A64293b14753B3244h5549
$$ -24361 -28469 97471 46058 -80836 -20529 -193863 -117993 164293 -214753 23244 -85549
19422B39668E9929K4154A5610a43519d515j06660d5225A13884e3849R43H0770
$$ 239668 59929 84083 15610 -143519 -4515 -111175 -45225 113884 -53849 -52906 80770
19410b93164E7572a17742D0361a90961C07105a05606A21093b1743A94773a37411
$$ -293164 57572 -117742 40361 -190961 307105 -105606 121093 -21743 194773 -137411
19399b7808j11537O0090k00536M4165o4923H3248d981B66604F1397a61012D6467
$$ -27808 -139345 -79255 -279791 -235626 -300549 83248 -4981 266604 61397 -161012 46467
19387I1807a14863D5855g6478C39367d9082k68058J58348j70040a31972G6798
$$ 91807 -114863 45855 -76478 339367 -49082 -317140 -158792 -328832 -131972 76798
19376c502k11855J9648C50065f6221j00207k309E6532O6102h7437J9132j64938
$$ -3502 -215357 -195709 350065 -66221 -166428 -168737 56532 122634 -87437 -68305 -233243
19365b33243e0327C39202b11734m336B3684i0857A02639b15576J04921I778R4726
$$ -233243 -50327 339202 -211734 -216070 23684 -90857 102639 -215576 -110655 9778 104504
19354A04504j3660l0523O5960d00843a21454b1206A93505i1491l32878E6281c6802
$$ 104504 90844 60321 126281 -400843 -121454 -21206 193505 -91491 -424369 56281 -36802
19342E703g2955m9339N7045L1715I9290b54424K2342B4312J07766A1477b063o2881
$$ 5703 -72955 -122294 -65249 -33534 99290 -254424 -232082 24312 132078 11477 -2063 -64944
19330f4944l68938d6703A30037a76251n6156A02262l9617K01614j16050d51218
$$ -64944 -433882 -46703 130037 -176251 -232407 102262 62645 264259 148209 -451218
19319g5691g566A03404b99112A10320R7330A02592a94140e690I8760e2878k04361
$$ -75691 -7566 103404 -299112 110320 207650 102592 -194140 -5690 98760 -52878 -257239
19308b57239j1833B56467n5425b65105E61528B63152H168O4216K44832a15818
$$ -257239 -269072 256467 201042 -265105 561528 263152 8168 72384 317216 -115818
19297A32383f6088H761d0584J9076k18829J05510B6271b81514c0183j88677j20836
$$ 132383 -66088 8761 -40584 -21508 -240337 -134827 26271 -281514 -30183 -218860 -339696
19286c39696A37463a52465k7494O084A00768a68916j8619O4529k02014f3236k09635
$$ -339696 137463 -152465 -179959 -173875 100768 -168916 -187535 -123006 -325020 -63236 -272871
19275b72871I0941n346b00908F2207J17614b190A33344a12295j74388i947B40223
$$ -272871 90941 85595 -200908 62207 179821 -2190 133344 -112295 -286683 -9947 240223
19263a75438p6836Q9432D4030d2343k1389k54401A24135f2308B80620a06480j43969
$$ -175438 -252274 -162842 44030 -42343 -63732 -318133 124135 -62308 280620 -106480 -250449
19252b50449j15176a49358J7292B1042L88778b19682c3826m7709B2106c38327
$$ -250449 -365625 -149358 -132066 21042 409820 -219682 -33826 -81535 22106 -338327
19241d17l07778a00276Q597j94942A61J22161a36050b7260j8622A03860a36836
$$ -417 -308195 -100276 -91679 -286621 161 122322 -136050 -27260 -45882 103860 -136836
19229e3168k03286B7394J4985a82310A8126K9892a3896B30737c4695k02047a12144
$$ -53168 -256454 27394 42379 -182310 18126 48018 -13896 230737 -34695 -236742 -112144
19217i4650d7227j85921D037K41980n1784B6497e57712b23666L0955A02220c72872
$$ -94650 -47227 -233148 4037 246017 194233 26497 -557712 -223666 -192711 102220 -372872
19205D8396b11070n1602B6665b7652k03882C8909b93703B3711P3201c6947p2504
$$ 48396 -211070 -262672 26665 -27652 -231534 38909 -293703 23711 96912 -36947 -109451
19194a09451D4189a378j5617q344A47398f5717F7708A8722c96382F7870c63053
$$ -109451 44189 -1378 -16995 -25339 147398 -65717 67708 18722 -396382 67870 -363053
19182b7861l9499B28607A04559a44041N7983A49532a34536F1977J54970Q9717
$$ -27861 -67360 228607 104559 -144041 -86058 149532 -134536 61977 216947 306664
19172C06664a01731k88150a0287j6237F5712a93436B26562b17584A02145d297
$$ 306664 -101731 -389881 -10287 -26524 65712 -193436 226562 -217584 102145 -4297
19161h9735c4638A11678h1852l25102a13864r0905O1808n1294B75402i0735k44323
$$ -89735 -34638 111678 -81852 -406954 -113864 -204769 -142961 -194255 275402 -90735 -335058
19150c35058A97843a1870A49820K11360c18328f4250A64640a78716A34899b64981
$$ -335058 197843 -11870 149820 361180 -318328 -64250 164640 -178716 134899 -264981
19139A67593E515g4839A84042a17027K3741J0434A0149b5892N969k6632j04300
$$ 167593 5515 -74839 184042 -117027 -93286 -82852 10149 -25892 -19923 -46555 -150855
19128a50855l2847j58128A04315J90148a53598A68814O5482b91848p8467J48103
$$ -150855 -183702 -341830 104315 294463 -153598 168814 234296 -291848 -370315 -222212
19118b22212O1237j30470a37285B57590c86962g8348l7356C80185b64409J31951
$$ -222212 -160975 -291445 -137285 257590 -386962 -78348 -115704 380185 -264409 -132458
19108a32458b847k13240H0662b07753f6916n9018F2469a58863F2174e5657l98557
$$ -132458 -2847 -216087 80662 -207753 -66916 -125934 62469 -158863 62174 -55657 -454214
19097d54214J38509d6532A8958b41324h6284k33318R9699A05592a68445I170c38649
$$ -454214 -315705 -46532 18958 -241324 -86284 -319602 -219903 105592 -168445 9170 -338649
19085G8793P3714p4968b6791k95667a18740c4145C36198a07281L9695c825o1827
$$ 78793 152507 77539 -26791 -322458 -118740 -34145 336198 -107281 -67586 -3825 -65652
19074f5652e765B05823n8045d4974j11689n8676j03666D641b32598a05136A25285
$$ -65652 -5765 205823 147778 -44974 -156663 -215339 -319005 4641 -232598 -105136 125285
19062a67032a7313j64426j7938R6976F981O9472J3180P1689c12569H0801i0149
$$ -167032 -17313 -181739 -199677 -102701 6981 76453 89633 161322 -312569 80801 -90149
19050a96163D597K80826b32972m259N210g8990A32388m3459e7616j18798d7937
$$ -196163 4597 285423 -232972 -237231 -232021 -78990 132388 88929 -57616 -176414 -47937
19038a00276C4832a267l615D28693d7331A77921M0886a65689C5334a78836M6208
$$ -100276 34832 -1267 -4882 428693 -47331 177921 218807 -165689 35334 -178836 -132628
19027a32628A59533L3166J5565B0908a68019B08708H5131R4500g6039F3297K21828
$$ -132628 159533 192699 208264 20908 -168019 208708 85131 179631 -76039 63297 285125
19016B85125f725A13896g0534j12388c0537k57223A19574n7302c19427A17714
$$ 285125 -6725 113896 -70534 -182922 -30537 -287760 119574 62272 -319427 117714
19005A25148a20236j04442k694R4572f922A12280D423e18693b21339D7808a20662
$$ 125148 -120236 -224678 -227372 -132800 -6922 112280 4423 -518693 -221339 47808 -120662
18993B28834C9494a16917E3251e6826A11956a3676B76117a79928M8502j33341
$$ 228834 39494 -116917 53251 -56826 111956 -13676 276117 -179928 -131426 -264767
18983b64767k56290b0443A34495J6508g3257l89631b06723O1721D5188Q3590h0612
$$ -264767 -521057 -20443 134495 151003 -73257 -462888 -206723 -145002 45188 128778 -80612
18971b73791J32408K1705A39481C2191J52405h1482m6998k0839a5651D9491J34556
$$ -273791 -141383 -119678 139481 32191 184596 -81482 -128480 -149319 -15651 49491 184047
18960A84047d7620A0408J29958b69852c6302G1538i3847I8870o490p626a97445
$$ 184047 -47620 10408 140366 -269852 -36302 71538 -93847 98870 92380 84754 -197445
18948A63617b13228a904k6450l8484A15311c0634G102b25635J3615D6601A3559
$$ 163617 -213228 -1904 -28354 -66838 115311 -30634 7102 -225635 -212020 46601 13559
18936c09055B87094b7179o687o8116r6229K2066k351q6845h4719j31958A52170
$$ -309055 287094 -27179 -33866 -101982 -198211 -176145 -178496 -265341 -84719 -216677 152170
18924A51274c26475A14636b49076a08974B15967F1863a0656B3089J20556G0158
$$ 151274 -326475 114636 -249076 -108974 215967 61863 -10656 23089 143645 70158
18913d12056a64381L974D5422b09614C60489d08527a49160g3040A6515K4039K93034
$$ -412056 -164381 -160407 45422 -209614 360489 -408527 -149160 -73040 16515 40554 333588
18902C33588a6998j43037k5135j64266F3341k5843b19718J02461A84451r619e4387
$$ 333588 -16998 -160035 -185170 -349436 63341 37498 -219718 -117257 184451 174832 -54387
18890A48747c830H7069m2123L2699a63381A20942J67949c77782a43675k2098B15692
$$ 148747 -3830 87069 44946 77645 -163381 120942 288891 -377782 -143675 -165773 215692
18878c7702k2418A8855K11177b5377F0926b68729I6575L2217d6895C92901b44971
$$ -37702 -60120 18855 230032 -25377 60926 -268729 96575 128792 -46895 392901 -244971
18866a65723n2966E7966O6380d5326j88384O5698N3815L4017B16072m3167h3373
$$ -165723 -218689 57966 124346 -45326 -233710 -168012 -114197 -80180 216072 172905 -83373
18854A27847F2962c00398E0299A1137J71543J85295e4688E2192J49804b72835
$$ 127847 62962 -300398 50299 11137 182680 367975 -54688 52192 201996 -272835
18843g0704a2047p0135l18062G9772b05951i7071C14644j22839o7819b88887g2996
$$ -70704 -12047 -82182 -400244 79772 -205951 -97071 314644 191805 123986 -288887 -72996
18831a39817A90119c97057d2621A83550c95646a07726q1606A71734a80757I872
$$ -139817 190119 -397057 -42621 183550 -395646 -107726 -189332 171734 -180757 9872
18820c1400A44540D3770B946J93538a528C65412a02508b0650C12090f4898C85582
$$ -31400 144540 43770 2946 196484 -1528 365412 -102508 -20650 312090 -64898 385582
18808F6226K27109j18721e2745D8921b52377A2626b44115J21129m2026H5308C8792
$$ 66226 293335 174614 -52745 48921 -252377 12626 -244115 -122986 -165012 85308 38792
18796a77222e0544j12579N818j56034A24523P7822p1077a59847n9993A19923a98560
$$ -177222 -50544 -163123 -157305 -313339 124523 202345 131268 -159847 -219840 119923 -198560
18784b64961N7443c0347m0993k45680B80077a48238B586a3395D1673b0190A18824
$$ -264961 -207518 -30347 -71340 -317020 280077 -148238 2586 -13395 41673 -20190 118824
18772I9118h0781j6592l9220C2862c20633a12786j38597E3273a23852A08741L9165
$$ 99118 -80781 -97373 -136593 32862 -320633 -112786 -251383 53273 -123852 108741 147906
18761A47906b08028N4517k3189J4322a4704o1341c0750C8354a53829j77464L7203
$$ 147906 -208028 -153511 -176700 -162378 -14704 -76045 -30750 38354 -153829 -331293 -294090
18750b94090i2994j01817m2534B22681c76051d1570A62926g4511j77467B02160
$$ -294090 -92994 -194811 -237345 222681 -376051 -41570 162926 -74511 -251978 202160
18739c42995J36693F1278F657d6881K2726G2870d2033j70670f6218H221a1870
$$ -342995 -206302 61278 6657 -46881 -24155 72870 -42033 -212703 -66218 8221 -11870
18727I300J02963O017b1240p4222M0228m8279r7259c4267A07949P6090f2430J8737
$$ 9300 112263 118280 -21240 -95462 -55234 -103513 -200772 -34267 107949 184039 -62430 -43693
18715d3693j44483A43994h5810j45262f3981m8144L950e0300B79451c37795R5016
$$ -43693 -188176 143994 -85810 -231072 -63981 -112125 -108175 -50300 279451 -337795 -242779
18704b42779Q4829J5244j11980a14582k059A57240E9951e05791a64252J1737m40344
$$ -242779 -157950 -142706 -254686 -114582 -116641 157240 59951 -505791 -164252 -152515 -592859
18693e92859a07086j1252K8138j25083A96845D3772j8853M4161b98535M9631A9129
$$ -592859 -107086 -118338 -90200 -215283 196845 43772 24919 69080 -298535 -248904 19129
18681b08096C29597a33526B15368E9996J7491j6231a94585Q864j77089J48322
$$ -208096 329597 -133526 215368 59996 77487 61256 -194585 -185721 -362810 -214488
18671b14488d3670l8679j97020C5798c00152A19060a28820A07873b90605H7098
$$ -214488 -43670 -82349 -279369 35798 -300152 119060 -128820 107873 -290605 87098
18660B53506b05372F5370J98153p8411H729J20940a10378b4568A96126q6123a97416
$$ 253506 -205372 65370 263523 185112 8729 129669 -110378 -24568 196126 110003 -197416
18648G14373C8973R453h8380H9439a12907H8163O852d88415a09569a3851k08212
$$ 714373 38973 48426 -88380 89439 -112907 88163 95015 -488415 -109569 -13851 -222063
18637b22063C5390a342k24256a01449q5082l5937P6927A5198c05621D52271G5228
$$ -222063 35390 -1342 -225598 -101449 -186531 -222468 -145541 15198 -305621 452271 75228
18625c28817C54897d52949d8709j33305C927e2962A39625M6296D0858P7012a13452
$$ -328817 354897 -452949 -48709 -182014 3927 -52962 139625 185921 40858 117870 -113452
18613B5714f7833o5755p5789b2585A38886k1405a11470a8284H4887b73487B038
$$ 25714 -67833 -133588 -209377 -22585 138886 117481 -111470 -18284 84887 -273487 2038
18601e53197a4855A58158b29746B59805d25461a07401o9217g9614a1680p8927
$$ -553197 -14855 158158 -229746 259805 -425461 -107401 -176618 -79614 -11680 -90607
18591i0607j34026B57320a1085j03772o9753K6663c4760A2728a91211B41907c3237
$$ -90607 -224633 257320 -11085 -114857 -184610 -157947 -34760 12728 -191211 241907 -33237
18579B1826g5222j88901C2231b30500J9840l6585A30678k7095c82515F4712d5492
$$ 21826 -75222 -264123 32231 -230500 -210660 -247245 130678 103583 -382515 64712 -45492
18567A36858f3652C5191Q0291B991J714a40005L9573A61593b57900c7199k21525
$$ 136858 -63652 35191 115482 2991 4705 -140005 -100432 161593 -257900 -37199 -258724
18556b58724b0813G2426b30165i9860H2734f4454r0231F2078M6796A176J60620
$$ -258724 -20813 72426 -230165 -99860 82734 -64454 -154685 62078 108874 1176 161796
18545A61796b04475A83589h7310R748k52113J42898o5974q2679B5320d6530a0089
$$ 161796 -204475 183589 -87310 -77562 -329675 -186777 -252751 -335430 25320 -46530 -10089
18533a5264G1609b49218c4142m18063A46338b7700G44J70376c85778f0768p8737
$$ -15264 71609 -249218 -34142 -452205 146338 -27700 744 171120 -385778 -60768 -139505
18522a39505d0164j2203k68333a11273d7836B94762d31031E4067K55998a66374
$$ -139505 -40164 -52367 -320700 -111273 -47836 294762 -431031 54067 310065 -166374
18511H7168a29525E6221P4755a21294F7205J5454c42991n4702c6985l85953B90178
$$ 87168 -129525 56221 130976 -121294 67205 82659 -342991 -397693 -36985 -422938 290178
18499A40024a1251D2545a27412B39720f2436A1991O1462E556b11139h5098k08193
$$ 140024 -11251 42545 -127412 239720 -62436 11991 73453 5556 -211139 -85098 -293291
18488b93291R3294C32056b06155a4365A44582o8933g304A09336k7323c12963a01823
$$ -293291 -199997 332056 -206155 -14365 144582 75649 -7304 109336 82013 -312963 -101823
18476A4332e13712a11757B2521c86572i7635j71147l7828D26987a11680A58118
$$ 14332 -513712 -111757 22521 -386572 -97635 -268782 -306610 426987 -111680 158118
18465H3720d03172a8007E0441a72658B62099I0881a50536p8796K4386C5796c4988
$$ 83720 -403172 -18007 50441 -172658 262099 90881 -150536 -229332 -204946 35796 -34988
18453B23785f3100h737B90593c64658J14282a12978j54627g5483D6984a27549
$$ 223785 -63100 -8737 290593 -364658 -250376 -112978 -267605 -75483 46984 -127549
18442a82855A14947c27061C2941M9644c13389D4835Q7690J19005G2683a40137
$$ -182855 114947 -327061 32941 82585 -313389 44835 132525 251530 72683 -140137
18431a17143A33180i4614H4883a91147q8715d1909E369b71483C57617a59333d3062
$$ -117143 133180 -94614 84883 -191147 -279862 -41909 5369 -271483 357617 -159333 -43062
18419c90957E4368a72189B20264f6864m4325q4034h5770k29111a49954f6904J787
$$ -390957 54368 -172189 220264 -66864 -111189 -195223 -85770 -314881 -149954 -66904 -65117
18408f5117B29299h2300D2072J86180a88927R1207J3879k374A5067Q4907J3892
$$ -65117 229299 -82300 42072 228252 -188927 -97720 -83841 -86215 15067 99974 113866
18397A13866a44306b5128A32496b87845e191k29006R7415j13556a03522A16669
$$ 113866 -144306 -25128 132496 -287845 -5191 -234197 -136782 -250338 -103522 116669
18386a72188A16a04596B66856h2820p2325A79939a57500K1595L7500B539a90747
$$ -172188 116 -104596 266856 -82820 -155145 179939 -157500 -135905 -98405 2539 -190747
18374f3915C06321i1774g615k749A76599k2775n4756m8026i5666B3779J68502
$$ -63915 306321 -91774 -7615 -10364 176599 153824 99068 51042 -95666 23779 192281
18363A92281b99343B57511a53863j05474A99681r5241b94481r199a05963n4364
$$ 192281 -299343 257511 -153863 -259337 199681 104440 -294481 -303680 -105963 -160327
18353a60327k57119D5336c47748A86710a03198j22765E630P3902A9325K8610b23056
$$ -160327 -417446 45336 -347748 186710 -103198 -225963 5630 79532 19325 47935 -223056
18341g5357k1966q194G897K01876H8242c31075E7362e9992l40336C30117d19361
$$ -75357 -97323 -105517 7897 209773 88242 -331075 57362 -59992 -400328 330117 -419361
18329b41754R4973j30199C3600J84395b79565i4822A27696d31658B91653a592
$$ -241754 -146781 -276980 33600 217995 -279565 -94822 127696 -431658 291653 -1592
18318a67446A44392e2607J6363n3926j44476e6728j85006A44479c32772r3017
$$ -167446 144392 -52607 -36244 -90170 -234646 -56728 -241734 144479 -332772 -425789
18308d25789a25238n7330j0150A8705J91571C3058a79492D3388G644b10537c1451
$$ -425789 -125238 -182568 -192718 18705 210276 33058 -179492 43388 7644 -210537 -31451
18296F4157b66510R9556A91727B8004e7161l12701f6422B35289k823b32909M1170
$$ 64157 -266510 -166954 191727 28004 -57161 -369862 -66422 235289 232466 -232909 -191739
18285a91739O1024A1813b46377F2181d36465J70342A87472E1769M5527a35592
$$ -191739 -130715 11813 -246377 62181 -436465 -266123 187472 51769 97296 -135592
18274h5246j55738P8072O0081A07391p884b10377q0659C0834a49222B64542g9732
$$ -85246 -240984 -162912 -102831 107391 99507 -210377 -291036 30834 -149222 264542 -79732
18262A13587c05600B2804J56316i1918a9124q6593N2848n693C60306e17140a6914
$$ 113587 -305600 22804 179120 -91918 -19124 -105717 -52869 -58562 360306 -517140 -16914
18250a68542g3108j04781b4893l25422L2403g6987j5693F4899e3526A63515j7127
$$ -168542 -73108 -177889 -24893 -350315 -317912 -76987 -92680 64899 -53526 163515 146388
18239A46388b03521A77728e00205b0075D29466g5237l0014k68147B56044c0890
$$ 146388 -203521 177728 -500205 -20075 429466 -75237 -105251 -373398 256044 -30890
18228a28482H7804i3643B53292c2284m4667D2346J5010J35303B6918f4672b7543
$$ -128482 87804 -93643 253292 -32284 -76951 42346 57356 192659 26918 -64672 -27543
18216I9884a59526M3172A31224c56272J60595b8208A74558a65925h2263D1376
$$ 99884 -159526 -116354 131224 -356272 -195677 -28208 174558 -165925 -82263 41376
18205B2327K198a45910M9696D6790c6029F4171b40524A57979j7243r43a7700F8435
$$ 22327 24525 -145910 -96214 46790 -36029 64171 -240524 157979 140736 139793 -17700 68435
18192a16243r8479p153i4404A12403g568q3768E4229g0584j50155J4111g5631
$$ -116243 -214722 -221875 -94404 112403 -7568 -91336 54229 -70584 -220739 -206628 -75631
18180A60024i1108B17114n9239b6799M083A18738d84170f5886r6122j46165A30749
$$ 160024 -91108 217114 157875 -26799 -22716 118738 -484170 -65886 -162008 -308173 130749
18168c0375k28780G780J22087f5863A23059l4744g5045G7307a68808A28303A0297
$$ -30375 -259155 7780 129867 -65863 123059 88315 -75045 77307 -168808 128303 10297
18156a88720F5615J44593b0700k02412A46028i8312j27504A3860l469b35217A80684
$$ -188720 65615 210208 -20700 -223112 146028 -98312 -225816 13860 10391 -235217 180684
18144A31686a58154j04232B65048a48210I703J90718J53497D0964J68712b62324
$$ 131686 -158154 -262386 265048 -148210 9703 200421 353918 40964 209676 -262324
18133a4329k26649F904b00365a3538k73052J16429H3364A3925b4114j89154g0270
$$ -14329 -240978 6904 -200365 -13538 -286590 -170161 83364 13925 -24114 -213268 -70270
18121A88368b75958A32720b66999N1246B69261I5900b08835A67582F5199Q0827
$$ 188368 -275958 132720 -266999 -215753 269261 95900 -208835 167582 65199 146026
18111A46026o9407K71370f1428k37889B08983b05702H4525a46511B2889a91334
$$ 146026 76619 347989 -61428 -299317 208983 -205702 84525 -146511 22889 -191334
18100b70746N1148C7644N5463A6265d5591p9628j54971B11630b13878A11217a24329
$$ -270746 -219598 37644 93107 16265 -45591 -125219 -280190 211630 -213878 111217 -124329
18088A86413n0763N2145c02687C3944K5255c7177j3084A61818b16863C3040a59000
$$ 186413 135650 187795 -302687 33944 59199 -37177 -50261 161818 -216863 33040 -159000
18076A6576K15919A06903I952J39580a20354r6967j24290a09324G4186J00559
$$ 16576 232495 106903 9952 149532 -120354 -217321 -341611 -109324 74186 174745
18066A74745J05542c5810j2934n6466a5306M929B34042b51886B00398g9950o790
$$ 174745 280287 -35810 -48744 -105210 -15306 -10377 234042 -251886 200398 -79950 -86740
18055h6740B34478a03169d6323A15834G70K76986a02799o7732D86667g1799C07393
$$ -86740 234478 -103169 -46323 115834 770 277756 -102799 -170531 486667 -71799 307393
18043c27143O9647M821R6660A1712a87055D6472d24665J46134a4871H2532c3034
$$ -327143 -257496 -252675 -156015 11712 -187055 46472 -424665 -278531 -14871 82532 -33034
18031c70941A92410n7820a44542c0433l11364J10630A48376o5629K5671B8123
$$ -370941 192410 134590 -144542 -30433 -341797 -231167 148376 82747 108418 28123
18020g8778j2120L2899b0751j82381O879H9546J302h9560F6302b03843e9602b8724
$$ -78778 -90898 -57999 -20751 -203132 -196253 89546 90848 -89560 66302 -203843 -59602 -28724
18007E1579a00155k86869A48631I412L6112a57764m6980N9543F472a34378A84781
$$ 51579 -100155 -387024 148631 9412 45524 -157764 -204744 -145201 6472 -134378 184781
17995a4203j8087J4065A11587a29706F3008a48625k0505E1116L17667e9644j46057
$$ -14203 -32290 -18225 111587 -129706 63008 -148625 -169130 51116 368783 -59644 -205701
17984b05701B1470g6447j4272k10678k5404Q526h8903p7617J747B16150a72302
$$ -205701 21470 -76447 -90719 -301397 -326801 -318275 -88903 -166520 -164773 216150 -172302
17972D9394b83370I7333d96516b08129E919d319l75016a00369H351J46832J10605
$$ 49394 -283370 97333 -496516 -208129 5919 -4319 -379335 -100369 8351 155183 265788
17961B65788d21814I0128a81298G7008a29356l2330A47045N8339g9282I5725N664
$$ 265788 -421814 90128 -181298 77008 -129356 -161686 147045 205384 -79282 95725 101389
17950A01389a61507B17988e1974j67515B8328b37915a0510j75992l21396a60814
$$ 101389 -161507 217988 -51974 -219489 28328 -237915 -10510 -186502 -507898 -160814
17939C9145b54113A26988J8264b60788C11012G1894c8512A00187b516k4194j12209
$$ 39145 -254113 126988 145252 -260788 311012 71894 -38512 100187 -2516 -26710 -138919
17928a38919A09054b53564A13570b0651k23942n6515c4470I7127f0345b9079A16349
$$ -138919 109054 -253564 113570 -20651 -244593 -301108 -34470 97127 -60345 -29079 116349
17916D6071J99614E5658K65455A46780a98076f844k3927B9685b0718r0184k2496
$$ 46071 245685 55658 321113 146780 -198076 -6844 -30771 29685 -20718 -110902 -133398
17905a33398M4152n5867E9305j5202b91258A77368q7681R8147b76145l2448J27621
$$ -133398 -89246 -145113 59305 44103 -291258 177368 89687 187834 -276145 -308593 -180972
17894a80972j1990B08802l0591h2848j1300l19541a41976j69113B71423a03993
$$ -180972 -192962 208802 178211 -82848 -94148 -413689 -141976 -311089 271423 -103993
17883A38336B4831K07511a61256j6914j02828j69559e2673I8110J01534b38602
$$ 138336 24831 232342 -161256 -178170 -280998 -450557 -52673 98110 199644 -238602
17872A24759h365j94700Q3368k56488J21816F4408J49943C4144K00607a15466
$$ 124759 -8365 -203065 -119697 -376185 -254369 64408 214351 34144 234751 -115466
17861a49310l5129r2531C2425a83394b5289n1503C98289q326e8507j01834A970
$$ -149310 -184439 -276970 32425 -183394 -25289 -76792 398289 389963 -58507 -160341 1970
17849a49864J6390A46334b02565c7008B12141e4515p54a0930G3962j1500J4847
$$ -149864 -133474 146334 -202565 -37008 212141 -54515 -55269 -10930 73962 62462 77309
17838G7309Q6565a85390b8798k92559i7319L5402A0579K04479b80094F2242L4969
$$ 77309 163874 -185390 -28798 -321357 -97319 -61917 10579 215058 -280094 62242 97211
17827I7211B925e914A57875P8306E8840P1500J8590a59124H506K12740B2678J29753
$$ 97211 2925 -5914 157875 236181 58840 130340 148930 -159124 8506 221246 22678 152431
17815A52431d9659k24665C9698d72761e5327j99132C1237a89355L6441d7476B0323
$$ 152431 -49659 -274324 39698 -472761 -55327 -254459 31237 -189355 -152914 -47476 20323
17803E7920a33554B93053I5426j1475D0054h987B23703E3716a94860B2684J34286
$$ 57920 -133554 293053 95426 83951 40054 -8987 223703 53716 -194860 22684 156970
17792A56970M9813a77128B83107I7661e2392k01476A64170L98329c33543a65563
$$ 156970 206783 -177128 283107 97661 -52392 -253868 164170 562499 -333543 -165563
17781a62293A80902a64491A05439L3561a18389d3018r7344B14513H9642a15432
$$ -162293 180902 -164491 105439 139000 -118389 -43018 -140362 214513 89642 -115432
17770C7273K05555G3237C0355d5629K2246A79867a14834A80424c8994A01257J6607
$$ 37273 242828 73237 30355 -45629 -23383 179867 -114834 180424 -38994 101257 117864
17759A17864C2440f0503k6392A08428a85504A91500J50467A13153c01328A64380
$$ 117864 32440 -60503 -86895 108428 -185504 191500 341967 113153 -301328 164380
17748B66174d4666j22687j71922B77333d5648I297Q073a9718p5851p6394F0602
$$ 266174 -44666 -167353 -339275 277333 -45648 9297 17370 -19718 -95569 -171963 60602
17736A68742M7064c1668A09232a83955C5291N7907a9529j79196C07042A28899
$$ 168742 215806 -31668 109232 -183955 35291 93198 -19529 -198725 307042 128899
17725b16634g4998m2142a7950l26145a59629A14590b21550A23517a07613C33966
$$ -216634 -74998 -117140 -17950 -344095 -159629 114590 -221550 123517 -107613 333966
17714C4275K28757j1791a06343D016J72524d7566m07903B43302a03296A38399
$$ 34275 263032 251241 -106343 4016 176540 -47566 -455469 243302 -103296 138399
17703b19596D3421a13598j53119f0999B47683b9075j83391A13987m6417a62874
$$ -219596 43421 -113598 -266717 -60999 247683 -29075 -212466 113987 67570 -162874
17692B51071a9000j08760A88329b48260j7723L4035i9314r220A46557m8936k7423
$$ 251071 -19000 -127760 188329 -248260 -265983 -231948 -99314 -108534 146557 97621 70198
17681G0198a09464J990o541b4101j76410q0139h6010E8691J95872j06528d7448
$$ 70198 -109464 -107474 -114015 -24101 -200511 -280650 -86010 58691 254563 148035 -47448
17669B69858a06218j5656A40717B3330P4964f3213b1440j77740f0904A52191Q6199
$$ 269858 -106218 -121874 140717 23330 98294 -63213 -21440 -199180 -60904 152191 238390
17658B38390n8437a77446D9895h7537j73911a10272A9031J60565G8951a55640
$$ 238390 179953 -177446 49895 -87537 -261448 -110272 19031 179596 78951 -155640
17647a56994A43483K00086F6618b762A42121j7258a67075m147C2247b63133A5205
$$ -156994 143483 343569 66618 -2762 142121 124863 -167075 -171222 32247 -263133 15205
17635f9139j77131E4688Q7837k7681L5168D7334R8494a28654B45614J47387d2943
$$ -69139 -246270 54688 142525 114844 150012 47334 145828 -128654 245614 393001 -42943
17623H2271C3456g8433C40977b5019A92137n3527b403B19599a7634G6578J82710
$$ 82271 33456 -78433 340977 -25019 192137 138610 -2403 219599 -17634 76578 259288
17612B59288G5746B5615P6401b13759G2687e5258j9611L5023B6105b9894A15282
$$ 259288 75746 25615 102016 -213759 72687 -55258 -74869 -39846 26105 -29894 115282
17600A35620P5836j03033a45337A55707a03651J2849o2678H1927C6499b34054
$$ 135620 211456 108423 -145337 155707 -103651 -90802 -153480 81927 36499 -234054
17589B0627d3739j30358A9583a60737D6844R1382l2174P7296G5837b00011H7186
$$ 20627 -43739 -174097 19583 -160737 46844 138226 106052 183348 75837 -200011 87186
17577a70041f7358J2464A04014d8241J106k29123D3540H40K92163d0656j92138
$$ -170041 -67358 -54894 104014 -48241 -47135 -276258 43540 840 293003 -40656 -232794
17566b32794A23775a26464B04813F6861c6800A66186n4544J89711H2058d5375
$$ -232794 123775 -126464 204813 66861 -36800 166186 111642 301353 82058 -45375
17555B19375J20490K01359C8368a1955B85217c15305A80034K41240C8403J54618
$$ 219375 339865 541224 38368 -11955 285217 -315305 180034 421274 38403 193021
17545A93021a38928C0127J04398K77657j57648a95411A57184R1780J10186o1112
$$ 193021 -138928 30127 134525 412182 254534 -195411 157184 248964 359150 298038
17535B98038j02606j1912h8078G3043C3025f4657r7540I8910N9956h0342A02574
$$ 298038 195432 183520 -88078 73043 33025 -64657 -162197 98910 158866 -80342 102574
17523a42502F1081K4096L14298D5573e2634A1799M3969L94101J12868A14265a44559
$$ -142502 61081 85177 399475 45573 -52634 11799 55768 449869 562737 114265 -144559
17511d51048J99005B90897K5481a81263p6460J19972A90179b34057a6585D31642
$$ -451048 -252043 290897 316378 -181263 -257723 -137751 190179 -234057 -16585 431642
17500A44982a8727l3642A5350K86720p8071I5978b38578A54355N0733M9995A11050
$$ 144982 -18727 -52369 15350 302070 223999 95978 -238578 154355 205088 255083 111050
17488C45859A30756b4426A2069K7391r244J83981d7815A44301c0400A20088K03708
$$ 345859 130756 -24426 12069 39460 30216 214197 -47815 144301 -30400 120088 323796
17477C23796B5259d06024C6161b46711B01751a14904A34300J5979J85625a10570
$$ 323796 25259 -406024 36161 -246711 201751 -114904 134300 150279 335904 -110570
17466C38774A40348b63911B67491a24483A28378D3001N449K29773C1809J64419
$$ 338774 140348 -263911 267491 -124483 128378 43001 48450 278223 31809 196228
17456A96228H5469J48020q5874K53334L2032j62602O6451J21151J68306i158B61499
$$ 196228 85469 233489 147615 400949 432981 270379 336830 457981 626287 -9158 261499
17444A78615b29313N8004B65934G1329a07855A17816K55632j81996L5160D7100
$$ 178615 -229313 -171309 265934 71329 -107855 117816 373448 191452 226612 47100
17433B96698B2794L97940e7458B75104q3756b05134C92783j73282J16601F500
$$ 296698 22794 420734 -57458 275104 191348 -205134 392783 219501 336102 6500
17422A93014K77526A67147p5086O6038a81470D04060A12209L38416d1887r5790
$$ 193014 470540 167147 92061 158099 -181470 404060 112209 450625 -41887 -137677
17412a37677A62451b530E3976a9507B51831Q9691A57431Q0550G3494a33042G2079
$$ -137677 162451 -2530 53976 -19507 251831 341522 157431 237981 73494 -133042 72079
17400A64299B0648f5123k89963A54482j2381J68080H369a13304n3360E2156j3610
$$ 164299 20648 -65123 -355086 154482 142101 310181 8369 -113304 -166664 52156 38546
17389C8546a0757A09048m9758J5148g3289C03912j4081j41671J9729n7319P2294
$$ 38546 -10757 109048 59290 74438 -73289 303912 289831 148160 167889 110570 182864
17378A82864D8638a07147D10190G6061a55765C94256l1253A51197M557L557K17091
$$ 182864 48638 -107147 410190 76061 -155765 394256 363003 151197 155754 159311 376402
17367C76402j03486C9979J29453B7122L05437E9230Q0827J02434a4902n4820F2218
$$ 376402 272916 39979 169432 27122 332559 59230 140057 242491 -14902 -69722 62218
17355B30040J21139j42272B5695N8277j4694A4891f9441A6215J00993m9477J53917
$$ 230040 351179 208907 25695 83972 69278 14891 -69441 16215 117208 67731 221648
17344B21648l7415j3676D7806a22657B89317E7454J31222R8087k4454j13294r327
$$ 221648 184233 170557 47806 -122657 289317 57454 188676 286763 262309 149015 139688
17333A39688J1185a30906A65003a8147A8572R675J10860l505N0816K04738j77880
$$ 139688 150873 -130906 165003 -18147 18572 28247 139107 135602 186418 391156 213276
17322B13276P7377b3659q985i286A31956j3794Q0516q8654b04834D28711k06811
$$ 213276 290653 -23659 -32644 -9286 131956 118162 198678 110024 -204834 428711 221900
17311B21900m2313D5470k144O7988K29224p0865J08851A34089a17081F5629J98496
$$ 221900 179587 45470 43326 111314 340538 269673 378524 134089 -117081 65629 264125
17300B64125p3318k3773a01207j00850B80570a72270D1146j8170K14011o354A3053
$$ 264125 190807 167034 -101207 -202057 280570 -172270 41146 22976 236987 230633 13053
17288A72390n3774l0135k1158f6545B4445K24864r7178J00959k8942f7112B08992
$$ 172390 118616 88481 67323 -66545 24445 249309 152131 253090 224148 -67112 208992
17276A11571K22120k9725a27834A1200l087K39653l1332M2227a07363E9577J08731
$$ 111571 333691 303966 -127834 11200 8113 247766 216434 258661 -107363 59577 168308
17265A68308o5892J90861k3224A26327R6080a21445B5427J78778n262M2435j10813
$$ 168308 102416 293277 270053 126327 222407 -121445 25427 204205 198943 241378 130565
17254A30565J45745B2646O7291e0141A16705K3031Q9172J99524a64752B82725
$$ 130565 276310 22646 89937 -50141 116705 139736 228908 428432 -164752 282725
17243d7436B48351j06895J7296N6383K1201c159B07965k8705L0972k3866K5508
$$ -47436 248351 141456 158752 215135 236336 -3159 207965 179260 210232 186366 211874
17232B11874K13919B03689j9485d70A45419J02145e9467p8110B7628L54819L7136
$$ 211874 425793 203689 184204 -470 145419 247564 -59467 -137577 27628 382447 419583
17221D19583A32287J78216K10099B19325n2586J5813J71175F5744L7863L2548
$$ 419583 132287 310503 520602 219325 166739 182552 353727 65744 103607 136155
17211A36155K64603j44548p8083j4267P1742d472A93826G6540N8159M1984g659
$$ 136155 400758 256210 178127 163860 235602 -4472 193826 76540 134699 176683 -7659
17199F870O8335C7337K28819j19024J32511J87854A49776C204M73109F7154J98275
$$ 6870 75205 37337 266156 147132 279643 467497 149776 3204 476313 67154 265429
17188B65429A855J34915L91030A01312J56015A11654L8894g1971G1311L49525
$$ 265429 1855 136770 527800 101312 257327 111654 150548 -71971 71311 420836
17178D20836A38536L95034j49456A40666K7915k7141K36165j65333P5934P882
$$ 420836 138536 533570 384114 140666 168581 141440 377605 212272 288206 296088
17168B96088k5187K46074A83610K2663J42224m5361a0288k5457B25249L68167
$$ 296088 270901 516975 183610 206273 348497 303136 -10288 -35745 225249 593416
17158E93416d6815C53918O7785M2214B13247O2205J0421G5062L95273j30473A64069
$$ 593416 -46815 353918 421703 463917 213247 275452 285873 75062 470335 339862 164069
17146D43310A84676j2680J181K71163G5377L60342n7000K40007j22636j60691
$$ 443310 184676 171996 173177 444340 75377 435719 378719 618726 496090 335399
17136C35399A938M84330F3624J58169L00008j38491o1242J29156A65294J64967
$$ 335399 1938 486268 63624 221793 521801 383310 322068 451224 165294 330261
17126C30261H4302K43252J63004l4789B04645K96486A32156K89271M808M3139
$$ 330261 84302 327554 490558 455769 204645 501131 132156 421427 426235 469374
17116D69374B0806J73469C1977O49945A03776L45899K70575k91383j50596J72350
$$ 469374 20806 194275 31977 681922 103776 449675 720250 428867 278271 450621
17106D50621J85628k52945g6797A87162L032G7785N24494j81735k04184P6672
$$ 450621 636249 383304 -76797 187162 190194 77785 602279 420544 216360 293032
17096B93032q3103K55697L8946A89235R0254l5301k4169L47276A91308K15404
$$ 293032 209929 465626 504572 189235 279489 244188 220019 567295 191308 406712
17086D06712o9046J79851k00544N8347p160A73208N32519C13099L07530p4899
$$ 406712 337666 517517 316973 375320 368160 173208 705727 313099 620629 545730
17076E45730B68080O3203J70600J81262l15455j33907H7655M91159k14832K27094
$$ 545730 268080 331283 501883 683145 367690 233783 87655 578814 363982 591076
17066E91076k09263N5817J2871K07366B38670L84899j40550J52717L4942l7617
$$ 591076 381813 437630 450501 657867 238670 623569 483019 635736 670678 633061
17056F33061j87099r1757J26532j78363L48492k5551k55872J85930J80977J17769
$$ 633061 445962 354205 480737 302374 650866 625315 369443 555373 736350 854119
17046H54119j60705k55347R2955A55196L60510M5005m1167j19640L2587M13182
$$ 854119 693414 438067 531022 155196 515706 560711 519544 399904 432491 845673
17036H45673j75831j50597J37311n8294k16296L93444j740r4996j41721J18516
$$ 845673 669842 519245 656556 598262 381966 775410 773670 678674 536953 655469
17026F55469k88778L09546J13003j59616p6107J84634l1609k27887J73299m6066
$$ 655469 366691 676237 789240 629624 553517 738151 706542 478655 651954 605888
17016F05888J49113j95147K7014o8741j4992J57121P423L2926l38866L51216j55299
$$ 605888 755001 559854 586868 518127 503135 660256 667679 700605 361739 712955 557656
17005E57656L82494k06193r8332N2255j18895R4924Q4517r6546l6365m7557r411
$$ 557656 940150 733957 635625 687880 568985 663909 748426 651880 615515 567958 558547
16994E58547J80054m5534l0939R2492J29564j9758R1790K37845k82947D14868
$$ 558547 738601 693067 662128 754620 884184 864426 956216 1194061 911114 414868
16983I01416K13642m32056J75529l57511J31531N07919E02746L03840K8020K51767
$$ 901416 1115058 683002 858531 501020 632551 1140470 502746 806586 834606 1086373
16973A086373k86668K70693n31924M12353N6420j85998K0716J19186J25601j68690
$$ 1086373 799705 1070398 538474 950827 1007247 821249 841965 961151 1086752 918062
16963I18062j92676K56265m28008L51020R031J49523j48398R4225j41833j7324
$$ 918062 725386 981651 553643 904663 913694 1063217 914819 1009044 867211 849887
16953H49887K59601q1976j41199N543K21419J1588o4398J8938J85923j66097j95980
$$ 849887 1109488 1027512 886313 891856 1113275 1124863 1060465 1079403 1265326 1099229 903249
16942I03249J79626R4006l4068K64636j30121k1230k56097J91323J02855k21647
$$ 903249 1082875 1176881 1142813 1407449 1277328 1256098 1000001 1191324 1294179 1072532
16932A072532M97823k43874j42253O7362L26823l82197J45804Q7682J94997j28255
$$ 1072532 1570355 1326481 1184228 1251590 1578413 1196216 1342020 1429702 1624699 1496444
16922A496444j13923k2114L03688k71674L9747k47363M24261j48312K10293j43114
$$ 1496444 1382521 1360407 1664095 1392421 1432168 1184805 1609066 1460754 1671047 1527933
16912A527933J79301j01814J16255j99989R4164j10199L51368k29094m2161j27327
$$ 1527933 1707234 1605420 1721675 1521686 1615850 1505651 1857019 1627925 1585764 1458437
16902A458437K2182L76450k10524K64938j15182k1101J7141P1385K466k72526
$$ 1458437 1480619 1857069 1646545 1911483 1796301 1775200 1792341 1863726 1866192 1593666
16892A593666P37455l44631L4439N7818q947o7188L18429l93197J8874J04134
$$ 1593666 2331121 1986490 2020929 2078747 2069800 2002612 2321041 1927844 1946718 2050852
16882B050852J69485N465k61749L49503R7679k34744P2699J53411K29865k25931
$$ 2050852 2220337 2225802 1964053 2313556 2411235 2176491 2249190 2402601 2632466 2406535
16872B406535J16526O186N4784J85582m79418L81135k04207N73359k14751m6084
$$ 2406535 2523061 2529247 2584031 2769613 2290195 2671330 2467123 3040482 2825731 2779647
16862B779647K10356M2557j37533M17471k63959k00652K26933L96907l23279K67823
$$ 2779647 2990003 3032560 2895027 3312498 3048539 2847887 3074820 3471727 3148448 3416271
16852C416271l39287K3041J82528J76190M0583Q069o4751J09713K7404M55604
$$ 3416271 3076984 3100025 3282553 3458743 3499326 3507395 3442644 3552357 3579761 4035365
16842D035365K42627k09140m8572r6287k21999M56258J63290K94990l6437L2873
$$ 4035365 4277992 4068852 4020280 3923993 3701994 4158252 4321542 4616532 4580095 4612968
16832D612968l699n19385O25985k2815N1062K14129j17804L21628l17940L00938
$$ 4612968 4609269 4089884 4715869 4693054 4744116 4958245 4840441 5162069 4844129 5145067
16822E145067j3040M04226O795L08096P299J60684k9089L86868l20459N31948
$$ 5145067 5132027 5536253 5543048 5851144 5858443 6019127 5990038 6376906 6056447 6588395
16812F588395L6454j72132J25317L98313k95590N07606L12489l0161M94534J30292
$$ 6588395 6624849 6452717 6578034 6976347 6680757 7188363 7500852 7470691 7965225 8095517
16802H095517J59337N7010P2978K45234j72015P37559J64658l26447N50279L03662
$$ 8095517 8254854 8311864 8384842 8630076 8458061 9195620 9360278 9033831 9584110 9887772
16792I887772J88900M65077J43075J96806M41791J55778J54336L66072L00396
$$ 9887772 10076672 10541749 10684824 10881630 11323421 11479199 11633535 11999607 12300003
16783A2300003N51632N45409K41890M62923K64211N71185N76601L08734L98203
$$ 12300003 12851635 13397044 13638934 14101857 14366068 14937253 15513854 15822588 16220791
16774A6220791P26113L614R83924L82937O95405Q18524O50429M04948R20003R05241
$$ 16220791 16946904 16950518 17934442 18317379 19012784 19831308 20481737 20886685 21806688 22711929
16764B2711929P95836N89280J203836Q22890J024227J025431J216686J123037
$$ 22711929 23507765 24097045 25300881 26123771 27147998 28173429 29390115 30513152
16756C0513152J670056J078605J273113J811476J429212J827825J600609K007610
$$ 30513152 32183208 33261813 34534926 36346402 37775614 39603439 41204048 43211658
16748D3211658K021522K366675K647634K311798K728900K632926L088061L099878
$$ 43211658 45233180 47599855 50247489 52559287 55288187 57921113 61009174 64109052
16740F4109052L491173L895185L911661L784161M198173M521028M740786N505996
$$ 64109052 67600225 71495410 75407071 79191232 83389405 87910433 92651219 98157215
16732I8157215N441033N479677N721581O264113N895825O117995O213218O076626
$$ 98157215 103598248 109077925 114799506 121063619 126959444 133077439 139290657 145367283
16724A45367283O026223N418020N170984M739766L603849L157152J987577R54138
$$ 145367283 151393506 156811526 161982510 166722276 170326125 173483277 175470854 176424992
16716A76424992M72552p34033j842078k732054l414665m780610m471866n378874
$$ 176424992 176897544 176163511 174321433 171589379 168174714 163394104 158922238 153543364
16708A53543364n914545o210126o130072o012557o336524n696940o335577n499864
$$ 153543364 147628819 141418693 135288621 129276064 122939540 117242600 110907023 105407159
16700A05407159n579869n409381m948671m619911m795020m223947l938378l388490
$$ 105407159 99827290 94417909 89469238 84849327 80054307 75830360 71891982 68503492
16692F8503492l778205l259238l111881l169858k687482k235776k832343j816699
$$ 68503492 64725287 61466049 58354168 55184310 52496828 50261052 47428709 45612010
16684D5612010k363206j696939k381457j692438j231313j987282j324318q42584
$$ 45612010 43248804 41551865 39170408 37477970 36246657 34259375 32935057 32092473
16676C2092473k065929j024812j155255r89148j020239r72715r58395j023549
$$ 32092473 30026544 29001732 27846477 26857329 25837090 24864375 23905980 22882431
16668B2882431o15769j148524n26239r32814n39294n88961r35597m53435l58962
$$ 22882431 22266662 21118138 20591899 19659085 19119791 18530830 17595233 17141798 16782836
16659A6782836p29786o25893n70218k48259k67257p48332m758p42936j49499j78239
$$ 16782836 16053050 15427157 14856939 14608680 14341423 13593091 13588333 12845397 12695898 12517659
16649A2517659o96934j4414m48637o19346j7420j53964k15333m18578m28195l07190
$$ 12517659 11820725 11806311 11357674 10738328 10720908 10566944 10351611 9933033 9504838 9197648
16639I197648Q607k11430o95726L04901m95943J5977k6428l66418n47838K10819
$$ 9197648 9206255 8994825 8299099 8604000 8108057 8124034 8097606 7731188 7183350 7394169
16629G394169j81396j62385p4196l43925r6340l34413k06322J36868K40026p23674
$$ 7394169 7212773 7050388 6976192 6632267 6535927 6201514 5995192 6132060 6372086 5648412
16619E648412l47484M51104k27882Q8818l21705l25133M54616n09910n8760l82835
$$ 5648412 5300928 5752032 5524150 5612968 5291263 4966130 5420746 4910836 4852076 4469241
16609D469241K28090m8083l6916O3765j36200k89378j220p4193P5717j77643Q0403
$$ 4469241 4697331 4649248 4612332 4676097 4539897 4250519 4249299 4175106 4250823 4073180 4153583
16598D153583n6075l67393M57955n01732J28249j9456o21250J87933L96979m26142
$$ 4153583 4097508 3730115 4188070 3686338 3814587 3795131 3173881 3361814 3758793 3332651
16588C332651j53413K19016m03446j75117O6362M948J63270j21677J93274k33223
$$ 3332651 3179238 3398254 2994808 2819691 2886053 2891001 3054271 2932594 3125868 2892645
16578B892645j98660k58701L76121R2174k7241m00341L20240p3082k5788p495
$$ 2892645 2693985 2435284 2811405 2903579 2876338 2475997 2796237 2723155 2697367 2689872
16568B689872k71956L13626l68403j19034J28499j12787M2680n3940J23304k35253
$$ 2689872 2417916 2731542 2363139 2244105 2372604 2259817 2302497 2248557 2371861 2136608
16558B136608r5330r4614K36198K11903m72868M6440J46140m38268K06925K05595
$$ 2136608 2041278 1946664 2182862 2394765 1921897 1968337 2114477 1676209 1883134 2088729
16548B088729j01626j93574M28490j81106M391l64794j04324K36326k33556K63658
$$ 2088729 1987103 1793529 2222019 2040913 2045304 1680510 1576186 1812512 1578956 1842614
16538A842614l65662L07818k29892j14075L22757N0445m11357K87160k02479J5292
$$ 1842614 1476952 1784770 1554878 1440803 1763560 1814005 1402648 1689808 1487329 1502621
16528A502621n3521O6659k35262n8657M20093m60570p3509L06009P8205o9304
$$ 1502621 1449100 1515759 1280497 1221840 1641933 1181363 1107854 1413863 1492068 1422764
16518A422764r9683M7009M9319j3392k03090K59392k66130j48165M08225j66301
$$ 1422764 1323081 1370090 1419409 1406017 1202927 1462319 1196189 1048024 1456249 1289948
16508A289948r0940j36607L26887l00555p2333M21981k19799J53372r2279o1195
$$ 1289948 1199008 1062401 1389288 1088733 1016400 1438381 1218582 1371954 1279675 1218480
16498A218480j55386K08867P5670l09100N911k03566O89281m66137k15127J03698
$$ 1218480 1063094 1271961 1347631 1038531 1044442 840876 1530157 1064020 848893 952591
16488I52591n9080j17907q534J14446l73612O87274n04919L44674r3776J0137
$$ 952591 893511 775604 767070 881516 507904 1195178 690259 1034933 941157 951294
16478I51294k1256k08777L71438j46578J31120j09436j19533K14957k97656K27031
$$ 951294 930038 721261 1092699 946121 1077241 967805 848272 1063229 765573 992604
16468I92604P2809m57100J13543K50739K09118m84118J14797j21155J76802l89548
$$ 992604 1065413 608313 721856 972595 1181713 697595 812392 691237 868039 478491
16458D78491J59186q9070K14490C67247N42938j32375O8771k6512n5167q7091
$$ 478491 637677 548607 763097 367247 910185 777810 846581 820069 764902 677811
16448F77811L76286l95154J35412l91915L66697j23644o7975k4201M4647j29066
$$ 677811 1054097 658943 794355 402440 769137 645493 577518 553317 597964 468898
16438D68898r2991K25518P4727L28993D59751M1842j20475N14297J15567l00673
$$ 468898 375907 601425 676152 1005145 459751 501593 381118 895415 1010982 710309
16428G10309k4541L998R0933O1717O0171C30498J32244K37464j6594m534m4481
$$ 710309 685768 689766 780699 842416 902587 330498 462742 700206 683612 679078 634597
16417F34597j27963l3307J02540J15207B65160L67775j67112J50959P8437C04978
$$ 634597 506634 473327 575867 691074 265160 632935 465823 616782 695219 304978
16406A35285L77950J17344B16280M51361A41985J6693K69316k3572K22183m7164
$$ 135285 513235 630579 216280 667641 141985 158678 427994 404422 626605 579441
16396E79441n5261q7149j14033J91971B16427L11967k51712J49916K1316l3073
$$ 579441 524180 437031 322998 514969 216427 528394 276682 426598 447914 414841
16386D14841j11595L74916B64512L60259Q2097p8557k27513A97360J44707j2568
$$ 414841 303246 678162 264512 624771 706868 628311 400798 197360 342067 329499
16376C29499R2998B00891K70570j56023K06553D605N01026N3987r9708j93725
$$ 329499 422497 200891 471461 315438 521991 4605 505631 559618 459910 266185
16366B66185L77568j75732j9424A45886M25312k53709L7956R824r1699M63511
$$ 266185 643753 468021 448597 145886 571198 317489 355445 365269 273570 737081
16356G37081B42131E0436M41028A29863J97578A42855D3467K10306M8714P8783
$$ 737081 242131 50436 491464 129863 327441 142855 43467 253773 302487 381270
16346C81270j77875K81711k06901r4456J50674r7786J61829j46134K20042j18219
$$ 381270 203395 485106 278205 183749 334423 236637 398466 252332 472374 354155
16336C54155j9044F2618K43259G3994K9408M08716k09617A4988L71809j08848
$$ 354155 335111 62618 305877 73994 103402 512118 302501 14988 386797 277949
16326B77949H1480L86361j84895J37710i1550B31591p5058k7171J92142A37473
$$ 277949 81480 467841 282946 420656 -91550 231591 156533 129362 321504 137473
16315C45640G1168K73384l1082o6446J50319m6148j48558K78565A20273M56344
$$ 345640 71168 344552 313470 247024 397343 351195 202637 481202 120273 576617
16305E76617A15109K56186A66689B6407K47038Q1695A71119P6435j18295K96862
$$ 576617 115109 371295 166689 26407 273445 355140 171119 247554 129259 426121
16295D26121k12179i343C19214A07497O6791J75320j4810a86984A42565J40323
$$ 426121 213942 -9343 319214 107497 174288 349608 334798 -186984 142565 282888
16285B82888R5462K0875j83724M70012D1659M15706E5077J32968L10020B24460
$$ 282888 378350 399225 215501 685513 41659 457365 55077 188045 498065 224460
16274B15388L4130j04767a0248C17063j49591G4125N8000b3233q097C30008R220
$$ 215388 249518 144751 -10248 317063 167472 74125 132125 -23233 -31330 330008 339228
16263C39228A2878O0362K57156j53380m5346D5732J58439I4904a74740J7795A30121
$$ 339228 12878 73240 330396 177016 131670 45732 204171 94904 -174740 -156945 130121
16251A34477J0497B6421J54035K09453b4263A67488P5718j05877L53817k35851
$$ 134477 144974 26421 180456 389909 -24263 167488 243206 137329 491146 255295
16241B55295P8425A27663k9117J43982j10330J53522O8880l5320c26152A95688
$$ 255295 333720 127663 98546 242528 132198 285720 354600 319280 -326152 195688
16230B89404c00366b1790B57255c5401k1283E46496A20707L6007J3412g0094A16661
$$ 289404 -300366 -21790 257255 -35401 -56684 546496 120707 156714 170126 -70094 116661
16218a15643A9850K04022M0739P4028F9232P4612B6040a18976B20003e24k90275
$$ -115643 19850 223872 264611 338639 69232 143844 26040 -118976 220003 -524 -290799
16207b90799a37864I6690L82433j50751a78028H5739B0160J13105Q3888g378B59615
$$ -290799 -137864 96690 479123 328372 -178028 85739 20160 133265 217153 -7378 259615
16195C87282O7822b2301B53869K7828j21225K51473k05743K1367L6932j11489
$$ 387282 455104 -22301 253869 281697 160472 411945 206202 227569 264501 153012
16185A53012R5281e7617E30682j9629D54b02724B22858c0643j30151M0756B86617
$$ 153012 248293 -57617 530682 511053 454 -202724 222858 -30643 -160794 -120038 286617
16173B82900b37494D95b89257J20398d3017J3869n470H5903M02859E0862N5790
$$ 282900 -237494 495 -289257 -168859 -43017 -29148 -34618 85903 488762 50862 106652
16162A06652C1630e1102F6328B7293e65j02238j51161I0856D3815b62742d5538
$$ 106652 31630 -51102 66328 27293 -565 -102803 -253964 90856 43815 -262742 -45538
16150B13710b43894A57203o4214c0256B08429A02731K91151g8994B66034a00425
$$ 213710 -243894 157203 92989 -30256 208429 102731 393882 -78994 266034 -100425
16139A35874D0410J03874b60086h668k02822g74l4816C92136A87005a12062A67250
$$ 135874 40410 144284 -260086 -8668 -211490 -774 -35590 392136 187005 -112062 167250
16127d7F6109a28306A30933N1264J39332j37770b77722A42502c079I6357a88471
$$ -47 66109 -128306 130933 182197 321529 183759 -277722 142502 -3079 96357 -188471
16115c784r530A90830M459o6655c23791d5958a379j07518B15283c0089B02933
$$ -3784 -13314 190830 195289 128634 -323791 -45958 -1379 -108897 215283 -30089 202933
16103E5548b34831B53295G4594J61785i5024B48041c26249J6718B27380n6822
$$ 55548 -234831 253295 74594 236379 -95024 248041 -326249 -309531 227380 170558
16093A70558k6288m3685L8719f0167j97386K3350I3557e2686D5589K9976P1813
$$ 170558 144270 100585 139304 -60167 -257553 -234203 93557 -52686 45589 75565 147378
16082A47378n1270h9167C45629f2338J5382E1720J66488a68582A79527H4841b3735
$$ 147378 96108 -89167 345629 -62338 -46956 51720 218208 -168582 179527 84841 -23735
16070B92501b65583P0197f9913B53894I6216J6785b4073C99598G255J72816a10674
$$ 292501 -265583 -195386 -69913 253894 96216 113001 -24073 399598 7255 180071 -110674
16058b93257J28120G4378J16396K61362p1437a1319H8674a91257I9818a27949
$$ -293257 -165137 74378 190774 452136 380699 -11319 88674 -191257 99818 -127949
16047G5618R8605d36552a33851d1010D9779M2656J0309a62115C14083c69580H1468
$$ 75618 174223 -436552 -133851 -41010 49779 92435 102744 -162115 314083 -369580 81468
16035B29812G0415B7215c0472C38543a7295n1523B02072n3707a1002r8871L9844
$$ 229812 70415 27215 -30472 338543 -17295 -68818 202072 148365 -11002 -109873 -70029
16024g0029p5185F6990L7293D3796a29404J946B35152r3622a45371j23903a25963
$$ -70029 -145214 66990 104283 43796 -129404 -127458 235152 141530 -145371 -269274 -125963
16012b9500o770p5006m13053f1303k7551B01596a46855E2862c26012c7357J0960
$$ -29500 -36270 -111276 -524329 -61303 -88854 201596 -146855 52862 -326012 -37357 -26397
16001b6397C39457A10044a0396A41490k74a67984M4320a1289k17939o6213H9049
$$ -26397 339457 110044 -10396 141490 141216 -167984 -123664 -11289 -229228 -295441 89049
15989A4152J89332I3004l7757N8981j6260g194C91393p0498j4998J0561D1389
$$ 14152 203484 93004 55247 114228 97968 -7194 391393 320895 305897 316458 41389
15977C28139a11514A76111H3123d8778H1891j2125i9533B16521b83119N1497f7178
$$ 328139 -111514 176111 83123 -48778 81891 69766 -99533 216521 -283119 -231622 -67178
15965F2281K9584g3677D91543H8853b2877A65780B1699h0127K1064a5989j2231
$$ 62281 91865 -73677 491543 88853 -22877 165780 21699 -80127 -59063 -15989 -28220
15954b8220l2135C82673f9076k93335B6851c93505e0574k3784e115k83284I0014
$$ -28220 -60355 382673 -69076 -362411 26851 -393505 -50574 -74358 -5115 -288399 90014
15942C02985F5762f600j43147L681p8243B0039a65787n5009J0232f5520B88043
$$ 302985 65762 -6600 -149747 -146066 -224309 20039 -165787 -220796 -210564 -65520 288043
15930A05618B0738i9199j30676Q3597j44737o9361g5709G205d17181E7618i9325
$$ 105618 20738 -99199 -229875 -146278 -291015 -360376 -75709 7205 -417181 57618 -99325
15918A83198f8355j00194M809A11744b00297j44564a47833q3849f7010b8961E105
$$ 183198 -68355 -168549 -163740 111744 -200297 -344861 -147833 -231682 -67010 -28961 5105
15906I8033K7985f5874j75741B57369b51887i929A1183f36730b05373k1800B44819
$$ 98033 126018 -65874 -241615 257369 -251887 -9929 11183 -636730 -205373 -227173 244819
15894h0515c1194o4753H8278J832J83650b33653a1010j47183A32297a30549G7071
$$ -80515 -31194 -95947 88278 90110 273760 -233653 -11010 -158193 132297 -130549 77071
15882A11611J6565b81095a26334c5162B50787f425l13279a00804b6091k39917
$$ 111611 128176 -281095 -126334 -35162 250787 -6425 -319704 -100804 -26091 -266008
15872b66008C29524A48644J3218c37704b6667F8407b98278j8718D7250b49934
$$ -266008 329524 148644 161862 -337704 -26667 68407 -298278 -316996 47250 -249934
15861A13158P2855g5783k93626g0235C20596h8498D3422Q3915K06899C5800i4566
$$ 113158 186013 -75783 -369409 -70235 320596 -88498 43422 127337 334236 35800 -94566
15849a08609A38505c9622J1910l6555A6161J04367c75448G5348h2597j22232M358
$$ -108609 138505 -39622 -27712 -64267 16161 120528 -375448 75348 -82597 -204829 -200471
15838b00471B11978C9669N4345g8440L4992C7382r876c17854O1058D8753b36271
$$ -200471 211978 39669 94014 -78440 -43448 37382 27506 -317854 -256796 48753 -236271
15826A08279c11581B15348b19113A09406j186p386Q3876a1299j1215I6654k4775
$$ 108279 -311581 215348 -219113 109406 108220 100834 184710 -11299 -22514 96654 71879
15815G1879k0780f3526B28680a97121j63254f3346A21409b21268h0460r0255k3107
$$ 71879 51099 -63526 228680 -197121 -360375 -63346 121409 -221268 -80460 -170715 -193822
15804a93822P6990a2822C0763J91847f8962B6246g5810n2631c6767o5648j26477
$$ -193822 -116832 -12822 30763 222610 -68962 26246 -75810 -128441 -36767 -102415 -228892
15793b28892B18015b46257A79692g573J401q7796H7376a5861k4497r6913J3708
$$ -228892 218015 -246257 179692 -7573 -6172 -93968 87376 -15861 -40358 -137271 -123563
15782a23563A82131D642c1881G3315a32497b3742j4317E4737j8570M2553l1244
$$ -123563 182131 4642 -31881 73315 -132497 -23742 -38059 54737 36167 78720 47476
15771D7476l361b42226O9857r4069B25282F2904b51936A90104m34a20421A76929
$$ 47476 44115 -242226 -172369 -266438 225282 62904 -251936 190104 189670 -120421 176929
15759B4622J75434A7402K69313A17242N2164F3507a7410k14584L8349r6480C99282
$$ 24622 200056 17402 286715 117242 169406 63507 -17410 -231994 -193645 -290125 399282
15747B16973b5245B22998o6093J27145k6790G9778a02388d8021p5682E9984b34520
$$ 216973 -25245 222998 156905 284050 257260 79778 -102388 -48021 -123703 59984 -234520
15735B59588b98370e989o6535A3163O3246a20247P639A18427a07151n466D16664
$$ 259588 -298370 -5989 -72524 13163 76409 -120247 -112608 118427 -107151 -112617 416664
15723a3497o7657A09581J7322J2936a84429F9124a34433j68124B2362a921A90206
$$ -13497 -81154 109581 126903 139839 -184429 69124 -134433 -302557 22362 -1921 190206
15711a62322C7142c257o8473b9635o6571b1117C194O1461k1018K59322b9925l0301
$$ -162322 37142 -3257 -71730 -29635 -96206 -21117 3194 64655 43637 302959 -29925 -60226
15699f0226p2970q6819f1878A427a76120q5319e4687O559q6208A43935e7185B52827
$$ -60226 -133196 -220015 -61878 1427 -176120 -261439 -54687 -48128 -134336 143935 -57185 252827
15686C186L6951B932P6588b39487J9557R3701A55614a66639k42263A49693J07441
$$ 3186 40137 2932 79520 -239487 -219930 -126229 155614 -166639 -408902 149693 257134
15675B57134c13710A94923b33502R7155C5851f4647j03509K1878r3691f9194G454
$$ 257134 -313710 194923 -233502 -136347 35851 -64647 -168156 -146278 -239969 -69194 7454
15663A97900N8085d3298A66259e0479k37609j17524D752Q6418a51658E45613A9665
$$ 197900 255985 -43298 166259 -50479 -288088 -405612 4752 91170 -151658 545613 19665
15651b44490Q4586N058B2316b48221H7971k2615K92164a78458j29992J30494j71018
$$ -244490 -159904 -154846 22316 -248221 87971 65356 357520 -178458 -308450 -177956 -348974
15640c48974e3182l5752j39244a09426A59085a70713h2019j39644A32791D6616
$$ -348974 -53182 -88934 -228178 -109426 159085 -170713 -82019 -221663 132791 46616
15629G6886b48973L4905B01085I8145J4627i4120F644J5742f8374a5190l1802
$$ 76886 -248973 -214068 201085 98145 112772 -94120 6644 22386 -68374 -15190 -46992
15618d6992A30983L963J65074a60575A4588N4144K22034D0285K59525a15050B86411
$$ -46992 130983 134946 300020 -160575 14588 68732 290766 40285 299810 -115050 286411
15606b88570J10711k704G3692b98738A41313l1086a60569A65455g4567k10229
$$ -288570 -177859 -180563 73692 -298738 141313 110227 -160569 165455 -74567 -284796
15596b84796B68096a59407j6835B35639h5404B9221a90890B03690a19864B3679
$$ -284796 268096 -159407 -176242 235639 -85404 29221 -190890 203690 -119864 23679
15585I2129a97620A41909o0834b11767a1367r3197D6987K39660a12381m5291M3669
$$ 92129 -197620 141909 81075 -211767 -11367 -104564 46987 286647 -112381 -157672 -114003
15574a14003C3351d14854d8890j31347C9530a32742e1010b3246q2507K5747j0860
$$ -114003 33351 -414854 -48890 -180237 39530 -132742 -51010 -23246 -105753 -80006 -90866
15563i0866F705h2227C5334J02389b33297I9589K16192j13458F231J25767a8244
$$ -90866 6705 -82227 35334 137723 -233297 99589 315781 202323 6231 131998 -18244
15551g3232P260B70761a22465l8618H1492a41184e740j93628b6866j01850A83966
$$ -73232 -65972 270761 -122465 -161083 81492 -141184 -5740 -199368 -26866 -128716 183966
15539A57014K6571c06847C20492a45591D1281a33532A04803a92204E7363M4994
$$ 157014 183585 -306847 320492 -145591 41281 -133532 104803 -192204 57363 102357
15529A02357Q6745n2791A8411a90474B47185q5151b75612O9358N7981E5336J22379
$$ 102357 189102 136311 18411 -190474 247185 162034 -275612 -206254 -148273 55336 177715
15518A77715c07359a11048K2947D881a36999a2571o8167A69237B8586a87048e0568
$$ 177715 -307359 -111048 -88101 4881 -136999 -12571 -80738 169237 28586 -187048 -50568
15506f0353A92732r1228J41789J5145c0093m60193A49602a38120C972a8974A60989
$$ -60353 192732 101504 243293 258438 -30093 -490286 149602 -138120 3972 -18974 160989
15494D0490h7959j93443a7309j78327b7527j39271h0307c9967p8998k30251a254
$$ 40490 -87959 -281402 -17309 -195636 -27527 -166798 -80307 -39967 -118965 -349216 -1254
15482a75079M2141r1709j08672a26156j958J5885D0033A4880b89387N4598B8864
$$ -175079 -132938 -224647 -333319 -126156 -128114 -112229 40033 14880 -289387 -234789 28864
15470A70647a42011E5622J64630a19288j51840A36170A539J57108G8249N2549
$$ 170647 -142011 55622 220252 -119288 -271128 136170 1539 158647 78249 130798
15460A30798J03798G4730J01992n7666b67670B58381a8101o7297k44633A26274
$$ 130798 234596 74730 176722 119056 -267670 258381 -18101 -85398 -330031 126274
15449B23021g536D1734a09760c223k77503g4882A00008N6556f1269k9520J9750
$$ 223021 -7536 41734 -109760 -3223 -280726 -74882 100008 156564 -61269 -90789 -71039
15438g1039A0023c94247a22944l786b4650A19817J61550j35595c2580k02596a17125
$$ -71039 10023 -394247 -122944 -126730 -24650 119817 281367 145772 -32580 -235176 -117125
15426g9518B86538a9528l89193A75601a15866j2993C8279K56538A24149a63596
$$ -79518 286538 -19528 -408721 175601 -115866 -128859 38279 294817 124149 -163596
15415a95563O0195n2363A98613e9680H43a4451A03441L1647a10289M2383A55850
$$ -195563 -135368 -187731 198613 -59680 843 -14451 103441 135088 -110289 -67906 155850
15403A3586K80981d2930k71285a29704j05412N3077n5323c7926B8270J76646a83916
$$ 13586 294567 -42930 -314215 -129704 -235116 -182039 -237362 -37926 28270 204916 -183916
15391B17993F1674a49233b5375F106c07568A22499a06849k0392G8421g9941A98023
$$ 217993 61674 -149233 -25375 6106 -307568 122499 -106849 -127241 78421 -79941 198023
15379c90866A77135m3825P7946f0442B62451A27361b191A35315a58308C02865
$$ -390866 177135 133310 211256 -60442 262451 127361 -2191 135315 -158308 302865
15368a2651c903A02268m0086f9308B0040a33101D4373L3721B2432L08947A22629
$$ -12651 -3903 102268 62182 -69308 20040 -133101 44373 78094 22432 331379 122629
15356A56926e510j49130A71111N33b34378B07343q8101b95109B4384b92087h3137
$$ 156926 -5510 -154640 171111 171644 -234378 207343 119242 -295109 24384 -292087 -83137
15344c07485D7537b2143j32257r0605E5970K25619h8148M3831A58931c13202M637
$$ -307485 47537 -22143 -154400 -245005 55970 281589 -88148 -44317 158931 -313202 -308565
15333c08565B8754L4429J1172a44741A73533i4232B50091C2731f1566D06983b76552
$$ -308565 28754 63183 74355 -144741 173533 -94232 250091 32731 -61566 406983 -276552
15321H2252i001A7365M9528a09101A75448a17933L0355j11892b4740q2277C49854
$$ 82252 -9001 17365 66893 -109101 175448 -117933 -87578 -199470 -24740 -107017 349854
15309F207M609J86179L2116a16736F9174a00209I8382a8777l17620B07321a06086
$$ 6207 10816 196995 229111 -116736 69174 -100209 98382 -18777 -336397 207321 -106086
15297a20435B0440J74906J78408a6179l192A29240D131P0956l4358e0628a4838
$$ -120435 20440 195346 373754 -16179 -19371 129240 4131 75087 40729 -50628 -14838
15285e0182k857A53460a38439A69351F8566A482b0007D7529R6836a11093H9344
$$ -50182 -53039 153460 -138439 169351 68566 1482 -20007 47529 144365 -111093 89344
15273a85147D0637e8615B135i9633A60462e242k08124f0180A54403d925l7578
$$ -185147 40637 -58615 2135 -99633 160462 -5242 -213366 -60180 154403 -4925 -42503
15262d2503J8608j54455B71200q9677h0394A81675E6682a52374A74724F5617M4663
$$ -42503 -23895 -178350 271200 181523 -80394 181675 56682 -152374 174724 65617 110280
15251A10280M67218j53481Q36489l7030m04020M52804n48019C55538j59760r5509
$$ 110280 577498 424017 1260506 1223476 819456 1272260 724241 355538 195778 100269
15241A00269M11849a35344E586L4245d0277l1946K5632j24499B19786f8881p766
$$ 100269 512118 -135344 5586 39831 -40277 -72223 -46591 -171090 219786 -68881 -76647
15230g6647B20176o0113J89937K2480G4321b16260d1795k36755B58270F0646b3556
$$ -76647 220176 160063 350000 372480 74321 -216260 -41795 -278550 258270 60646 -23556
15218G7286C5853a88011d7135C27185P0559b14671g0327C9005a64119E5059J63229
$$ 77286 35853 -188011 -47135 327185 397744 -214671 -70327 39005 -164119 55059 218288
15207B18288a25452A34419D6068L21955b64548B1274N1837b1037C68954A57778
$$ 218288 -125452 134419 46068 368023 -264548 21274 73111 -21037 368954 157778
15196A93580i9262r396C6592K512P8222D7960a21141B57979k6849F1701B9485
$$ 193580 -99262 -108658 36592 39104 117326 47960 -121141 257979 231130 61701 29485
15184i6891B72220F0361g6781G5459a32870j7581A22701b8087o8721n3313f6156
$$ -96891 272220 60361 -76781 75459 -132870 -150451 122701 -28087 -96808 -150121 -66156
15172I8667K70936A15370J65307g9793D4340b7747A89584L9465a31270C48875
$$ 98667 369603 115370 280677 -79793 44340 -27747 189584 229049 -131270 348875
15161C95675A35693J35000E9527K07231N2977c54867C649a18568E4466h3597A67903
$$ 395675 135693 270693 59527 266758 319735 -354867 3649 -118568 54466 -83597 167903
15149d2066l9980B94540K3195r9123m7703a40386A12994n2239p390k4632a35610
$$ -42066 -82046 294540 317735 218612 170909 -140386 112994 60755 53365 28733 -135610
15137a25715l00403a0278j0662q1596C4132O7277B378L9068K29553j2639J6436
$$ -125715 -426118 -10278 -20940 -102536 34132 101409 2378 41446 270999 258360 274796
15126B74796b54246A50999L8935B4324J6564R0324J34478k7340J86182A47152
$$ 274796 -254246 150999 189934 24324 40888 131212 265690 238350 424532 147152
15115A02693J06504m1166g7767A90945J20177a2175r464A10470h943A09590j3172
$$ 102693 209197 168031 -77767 190945 311122 -12175 -21639 110470 -8943 109590 96418
15104I6418A5492K94476A04252K07694j25286m1440a10991M1796j27025B60313
$$ 96418 15492 309968 104252 311946 186660 145220 -110991 -69195 -196220 260313
15093D4299a18411H2371J34495q4563a26667I7883N1370E1579K59572A15493a34539
$$ 44299 -118411 82371 216866 132303 -126667 97883 149253 51579 311151 115493 -134539
15081A32045g4738C35104a41928n1915h8229K5215B76715j23648K6370n2097Q4756
$$ 132045 -74738 335104 -141928 -193843 -88229 -63014 276715 153067 179437 127340 212096
15070B12096A1268K16671a30313A12995J05991r0012a59277d2523o3755M4181
$$ 212096 11268 227939 -130313 112995 218986 128974 -159277 -42523 -106278 -62097
15060f2097A59002c328D9710L04289I2864m5055J9446N1307K41918A30815D8591
$$ -62097 159002 -3328 49710 353999 92864 47809 67255 118562 360480 130815 48591
15048B06488n2647a7277B76234o7480m3392G9083k9755R3629l2937J99413I2431
$$ 206488 153841 -17277 276234 208754 165362 79083 49328 142957 110020 309433 92431
15036A61263p8962a85758D41385A0613h3663C65470j37157L835j12011J31868
$$ 161263 82301 -185758 441385 10613 -83663 365470 228313 232148 120137 252005
15026B52005j23642a33755A06854J34553G0457K21021R1597m3944A36945p865
$$ 252005 128363 -133755 106854 241407 70457 291478 383075 339131 136945 129080
15016A29080l8035R717P1014m9687m4870Q07702a56268f1357A15176k4299D2598
$$ 129080 91045 100762 171776 122089 77219 884921 -156268 -61357 115176 90877 42598
15004B70950j09533a1853B45795K88115B05959J01333K195c2159q6511A87189
$$ 270950 161417 -11853 245795 533910 205959 307292 309487 -32159 -118670 187189
14993C77980P6430g855D45510A07959J70482K5959a92999C0034J64712K19642
$$ 377980 454410 -7855 445510 107959 278441 304400 -192999 30034 194746 414388
14983D14388F6756J69121a4111A27876R8037M1676A22377m063J25934M6398q122
$$ 414388 66756 235877 -14111 127876 225913 267589 122377 118314 244248 290646 282524
14972B82524j12179L63015j67240j2176j10835j14023Q4279O3392A11424l1113
$$ 282524 170345 533360 366120 353944 243109 129086 213365 276757 111424 80311
14962H0311L89179j85252L8279A57008l9104j598l8194Q6860a8083P448A4790
$$ 80311 469490 284238 322517 157008 117904 116306 78112 164972 -18083 -10635 14790
14950D45181A60583K92461j73097n3906Q4427A01156a121C59810o09M1423j03328
$$ 445181 160583 453044 279947 226041 310468 101156 -1121 359810 359201 400624 297296
14939B97296A9936J72431P4613A32610b2602A91638L1853J63546k8003b493D35195
$$ 297296 19936 192367 266980 132610 -22602 191638 223491 387037 359034 -2493 435195
14927A66629J21421H8347J33904r8927b34161E12377A69410J07916j16630c7788
$$ 166629 288050 88347 222251 123324 -234161 512377 169410 277326 160696 -37788
14916A89613J55378E8126J99063A15413O010c6760B24366l8640J07852J75385
$$ 189613 344991 58126 257189 115413 121423 -36760 224366 185726 293578 468963
14906D68963A39505J91668G4419J01720P9625O682m2643L014q9778J54723O2434
$$ 468963 139505 331173 74419 176139 255764 262446 219803 222817 133039 287762 350196
14895C50196A51439K46290a5965L92C19235n5223j07893E1617J40992R4740J8850
$$ 350196 151439 397729 -15965 -15573 319235 264012 156119 51617 192609 287349 306199
14884C06199j28136k6908p5112P2624M19790J09381A06803M31940A78959G8287
$$ 306199 178063 151155 76043 148667 568457 677838 106803 538743 178959 78287
14873F4803J72449K37025k1572O3966r3407L6685A20831L36617A06187J46816
$$ 64803 237252 474277 452705 516671 423264 459949 120831 457448 106187 253003
14863B53003k2898Q9802K8310J60155j86073l3587p7738I6943J53032k2148J11809
$$ 253003 230105 319907 348217 508372 322299 288712 210974 96943 249975 227827 339636
14852C39636m4391K5950C709L34584J87070C8558K40908n6941L05124B57900J83126
$$ 339636 295245 321195 3709 338293 525363 38558 279466 222525 527649 257900 441026
14841D41026J76890q0200J23425R4078B21123N7168K92696k78091K55294J45248
$$ 441026 617916 537716 661141 755219 221123 278291 570987 292896 548190 693438
14831F93438j11926j09225K7341k4737j34414K9746q8772m9753J99988o3486o2612
$$ 693438 581512 472287 499628 474891 340477 370223 281451 231698 431686 368200 305588
14820C05588M96536k78402k5866k13335J88336R5946K623k21821j41271M11171
$$ 305588 802124 523722 497856 284521 472857 568803 571426 349605 208334 619505
14810F19505j31701o419k08925L72735k08716J25794P6831C04471K0871q1674
$$ 619505 487804 481385 272460 645195 436479 562273 639104 304471 325342 243668
14800B43668l5704M06910N8958k80040j16739J34863J3807l2595L21621A24234
$$ 243668 207964 614874 673832 393792 277053 411916 425723 393128 714749 124234
14789I1407K69857R9606n4396J28215J69941k88509K5407K1575K63781M9644k96252
$$ 91407 361264 460870 406474 534689 704630 416121 441528 463103 726884 776528 480276
14778D80276K3873K65251j84237M9486r5486l5687K25224q5860j13603j29643
$$ 480276 504149 769400 585163 634649 539163 503476 728700 642840 529237 399594
14768C99594M2445j50591J51571K71767C52484J23508o0693J17382J36854O57
$$ 399594 442039 291448 443019 714786 352484 475992 415299 532681 669535 670192
14758F70192k09991L48399j41724J24064j96574j47090N77957j57840D02914L83819
$$ 670192 460201 808600 666876 790940 594366 447276 1025233 867393 402914 786733
14748G86733l49407n2600K20381J34475B31242J63143K86620j17099n3582R4257
$$ 786733 437326 384726 605107 739582 231242 394385 681005 563906 510324 604581
14738F04581k26471L59765R2574j49058J03320k3952k74238K02054j74557J14744
$$ 604581 378110 737875 830449 681391 784711 760759 486521 688575 514018 628762
14728F28762J18039L5834L5561j60874J09417N7356k39298M01322m68393L26757
$$ 628762 746801 782635 818196 657322 766739 824095 584797 986119 517726 844483
14718H44483M1363M2894j52172L5585k8331J58187B15413K05809J72591K83580
$$ 844483 885846 928740 776568 812153 783822 942009 215413 421222 593813 877393
14708H77393D18496K16459q7922M59895m22548n9616N76033l87166j05328r3912
$$ 877393 418496 634955 547033 1006928 584380 524764 1100797 713631 608303 514391
14698E14391N83343k2854k18457l08999J17243L36744m18278M68638o1328j11707
$$ 514391 1097734 1074880 856423 547424 664667 1001411 583133 1051771 990443 878736
14688H78736k85356l3447N26980k20313r5015L35417l6739j64886n1476J44492
$$ 878736 593380 559933 1086913 866600 771585 1107002 1070263 905377 853901 998393
14678I98393j23034J26900j62228R6960J6616l36138J27711K08445j33258R5728
$$ 998393 875359 1002259 840031 936991 953607 617469 745180 953625 820367 916095
14668I16095j96616K90624P0559r2823n9187J62764J71126E34459O42044k15698
$$ 916095 719479 1010103 1080662 987839 928652 1091416 1262542 534459 1176503 960805
14658I60805J49578k52655J76569m3221N0751k93766K92294J25490k42837m2621
$$ 960805 1110383 857728 1034297 991076 1041827 748061 1040355 1165845 923008 880387
14648H80387J61592K9504m7702k89640M32187j33803M55429n08904J87030l44909
$$ 880387 1041979 1071483 1023781 734141 1166328 1032525 1487954 979050 1166080 821171
14638H21171N05042j01988K7109j26827n8421K20911R9546n50472L96265J8223
$$ 821171 1326213 1224225 1251334 1124507 1066086 1286997 1386543 836071 1232336 1250559
14628A250559k781J7528J00146o63657M38448M72557J9289k82444K52561k04401
$$ 1250559 1247778 1265306 1365452 701795 1140243 1612800 1632089 1349645 1602206 1397805
14618A397805k7774J49451k72514J25031o7370J35296P4346k08414j3687l0997
$$ 1397805 1370031 1519482 1246968 1371999 1304629 1439925 1514271 1305857 1292170 1261173
14608A261173K97765J69356m57453q691l2524K99178j80581L29203k68545J8759
$$ 1261173 1558938 1728294 1270841 1262150 1229626 1528804 1348223 1677426 1408881 1427640
14598A427640j79232L04971K79390P4030k81430l99536L39638p15k37609M96143
$$ 1427640 1248408 1553379 1832769 1906799 1625369 1225833 1565471 1564756 1327147 1823290
14588A823290j03727J06989k34005j35946J90807P3630J32641j36137J88944j85719
$$ 1823290 1719563 1826552 1592547 1456601 1647408 1721038 1853679 1717542 1906486 1720767
14578A720767L12342R1055j82977J29067j26951Q7814J95633l96460K4751M13380
$$ 1720767 2033109 2124164 1941187 2070254 1943303 2031117 2226750 1830290 1855041 2268421
14568B268421m6990K56436j03767J04488k2024k71569K94718J36519J89432l04134
$$ 2268421 2221431 2477867 2374100 2478588 2456564 2184995 2479713 2616232 2805664 2501530
14558B501530M57434R3479j44619K3251L06645K44294N40640Q30213J47884K127723
$$ 2501530 2958964 3052443 2907824 2931075 3237720 3482014 4022654 4852867 5000751 7128474
14548G128474M090140R542849K2142920K036080B0096019H870552m247709j398651
$$ 7128474 11218614 20761463 42904383 44940463 20096019 8870552 4622843 3224192
14540C224192p96230k99943l89079L02462l3183j34597j22466J46621L30005R999
$$ 3224192 2427962 2128019 1738940 2041402 2008219 1873622 1751156 1897777 2227782 2237781
14530B237781j94833J39501m30091M32410J50958k06533J02550M25055m06208
$$ 2237781 2042948 2182449 1752358 2184768 2335726 2129193 2231743 2656798 2250590
14521B250590L4605m1459M10464l61666Q2575J07658o9338J43466m6546k8201
$$ 2250590 2285195 2243736 2654200 2292534 2375109 2482767 2413429 2556895 2510349 2482148
14511B482148J32629n1966K99576m5374k58548K8233L07213q1977j60183M45812
$$ 2482148 2614777 2562811 2862387 2817013 2558465 2586698 2893911 2811934 2651751 3097563
14501C097563m6911k9440J94809p0824m9079K1239J3892l267J0996P1621j03299
$$ 3097563 3050652 3021212 3216021 3145197 3096118 3117357 3131249 3127982 3138978 3210599 3107300
14490C107300K65152p8955Q4204L08868j89363J27705j9789l07276M82248K9110
$$ 3107300 3372452 3293497 3377701 3686569 3497206 3624911 3605122 3297846 3780094 3809204
14480C809204l02332R4163J31389M9606M39145l10582j24052K40149o8516m2940
$$ 3809204 3506872 3601035 3732424 3782030 4221175 3910593 3786541 4026690 3958174 3915234
14470C915234N24519n48281M73106m92989J93377N42703j57216J30916j98918
$$ 3915234 4439753 3891472 4364578 3871589 4064966 4607669 4450453 4581369 4382451
14461D382451K55556l19583L12659Q9779N6831J65679j68493J92514q7753M26669
$$ 4382451 4638007 4318424 4631083 4720862 4777693 4943372 4774879 4967393 4879640 5306309
14451E306309j90423l25922N69537M9812j79572N86019k81498n5436L00618p1795
$$ 5306309 5115886 4789964 5359501 5409313 5229741 5815760 5534262 5478826 5779444 5707649
14441E707649K17216l06695L51940J59844k4135q2137K21890Q5479K6336M96794
$$ 5707649 5924865 5618170 5970110 6129954 6105819 6023682 6245572 6331051 6357387 6854181
14431F854181k06994J45266P9012l633J64026m7734k0792M02633K4518R9359m4618
$$ 6854181 6647187 6792453 6871465 6867832 7031858 6984124 6963332 7365965 7390483 7489842 7445224
14420G445224L04200J78401K10498p8275L82994n9801j48709M66330R1960j34127
$$ 7445224 7749424 7927825 8138323 8060048 8443042 8383241 8234532 8700862 8792822 8658695
14410H658695N64649k95026J76380K89342J52416Q9742m7721N32394J31836j60335
$$ 8658695 9223344 8928318 9104698 9394040 9546456 9636198 9588477 10120871 10252707 10092372
14400A0092372K61748J65281O8762N10576k91599M46990L22793k40149O59145
$$ 10092372 10354120 10519401 10588163 11098739 10807140 11254130 11576923 11336774 11995919
14391A1995919o4331M05155J7717M18405j85585K43687O32043l7909o2135O13136
$$ 11995919 11931588 12336743 12354460 12772865 12587280 12830967 13463010 13425101 13362966 13976102
14381A3976102M18548r5928K43785N63285N69990J9206J51177L24160K63600L17624
$$ 13976102 14394650 14298722 14542507 15105792 15675782 15694988 15846165 16170325 16433925 16751549
14371A6751549N00275K37088M80232K94060O0258Q03115N16841J62997L33359
$$ 16751549 17251824 17488912 17969144 18263204 18323462 19126577 19643418 19806415 20139774
14362B0139774N03874O78236L70574N16492K27332P01199M32921P96216L99992
$$ 20139774 20643648 21321884 21692458 22208950 22436282 23137481 23570402 24366618 24766610
14353B4766610P71361J07307P12108Q11290L32233J247958L87591M70441J326954
$$ 24766610 25537971 25645278 26357386 27168676 27500909 28748867 29136458 29606899 30933853
14344C0933853N72221J005350O73452J189086P31872R40035Q18753J257310J070517
$$ 30933853 31506074 32511424 33184876 34373962 35105834 36045869 36864622 38121932 39192449
14335C9192449J027663J410613J032659J307102J273876J516039J556267J439804
$$ 39192449 40220112 41630725 42663384 43970486 45244362 46760401 48316668 49756472
14327D9756472J694982J580019K032128J728182J636381K457953J763990K512743
$$ 49756472 51451454 53031473 55063601 56791783 58428164 60886117 62650107 65162850
14319F5162850K150074K506028K764314K538814L081823K973981L472904L350337
$$ 65162850 67312924 69818952 72583266 75122080 78203903 81177884 84650788 88001125
14311H8001125L369198L876540L867584M266149M635448M832890M916861N553586
$$ 88001125 91370323 95246863 99114447 103380596 108016044 112848934 117765795 123319381
14303A23319381N548279O159722O658135O841798P019329P823013P954074Q754712
$$ 123319381 128867660 135027382 141685517 148527315 155546644 163369657 171323731 180078443
14295A80078443R287830R707050J0495758J1009233J1240367J1868509J2934929
$$ 180078443 189366273 199073323 209569081 220578314 231818681 243687190 256622119
14288B56622119J3547005J3699578J4287481J4627298J5095559J5502985J5594073
$$ 256622119 270169124 283868702 298156183 312783481 327879040 343382025 358976098
14281C58976098J5506381J5243639J4594094J3964520J2948047J1618998J0228576
$$ 358976098 374482479 389726118 404320212 418284732 431232779 442851777 453080353
14274D53080353P749476M991048J073372j010384j499241m677644m880603n620056
$$ 453080353 460829829 465820877 466894249 465883865 464384624 459706980 454826377 449206321
14266D49206321p686166q812779j1018379j2753312j3713421j4868424j5771953
$$ 449206321 441520155 432707376 421688997 408935685 395222264 380353840 364581887
14259C64581887j5699439j6141554j5879285j4630172j4486871j4411809j3433530
$$ 364581887 348882448 332740894 316861609 302231437 287744566 273332757 259899227
14252B59899227j3036430j2555286j1572025j1083563j0691181r694282r637691
$$ 259899227 246862797 234307511 222735486 211651923 200960742 191266460 181628769
14245A81628769q864274p784134p763722p519638o882194o782214o208758n443954
$$ 181628769 172764495 164980361 157216639 149697001 142814807 136032593 129823835 124379881
14237A24379881n271740n347925m824267m837343m595490l477842l550663l510989
$$ 124379881 119108141 113760216 108935949 104098606 99503116 96025274 92474611 88963622
14229H8963622l785497l210028l407888k915617k717477k847682k509452k328965
$$ 88963622 85178125 81968097 78560209 75644592 72927115 70079433 67569981 65241016
14221F5241016k258262j988325j781838k182042k129674j924484j397822j416615
$$ 65241016 62982754 60994429 59212591 57030549 54900875 52976391 51578569 50161954
14213E0161954j289443j898557j461650j120269j434045j202895m82212j211280
$$ 50161954 48872511 46973954 45512304 44392035 42957990 41755095 41272883 40061603
14205D0061603j165470j336092r89576j328484o90754r20319o38306j190297j115126
$$ 40061603 38896133 37560041 36570465 35241981 34551227 33630908 32992602 31802305 30687179
14196C0687179l83973q55854n34999o38959p89267n60358o87074q68905l55096
$$ 30687179 30303206 29447352 28912353 28273394 27484127 26923769 26236695 25367790 25012694
14187B5012694o12097p79175n47215o47745k11588k43790o41447n52963k03616
$$ 25012694 24400597 23621422 23074207 22426462 22214874 21971084 21329637 20776674 20573058
14178B0573058n21747o82973k68522m03329l83448n96005k17528J59848r77659
$$ 20573058 20051311 19368338 19099816 18696487 18313039 17717034 17499506 17659354 16681695
14169A6681695k18610j53004n43074k85182K17970n79042j93301l84417j37907
$$ 16681695 16463085 16310081 15767007 15481825 15699795 15120753 14927452 14543035 14405128
14160A4405128r9535m56406l27328p3292k34749m01110K18223n19706j21727j87559
$$ 14405128 14305593 13849187 13521859 13448567 13213818 12812708 13030931 12511225 12389498 12201939
14150A2201939j78588m57933k9751J38571o20536J52008j89878m07819l24886
$$ 12201939 12023351 11565418 11535667 11674238 11053702 11205710 11015832 10608013 10283127
14141A0283127k52237L57895q5342l70255j92470p4251o56271J03353J72160J41502
$$ 10283127 10030890 10388785 10303443 9933188 9740718 9666467 9010196 9113549 9285709 9427211
14131I427211k88867k51841j15603j38168k73296q5617K04786n21334J79430k29428
$$ 9427211 9138344 8886503 8770900 8632732 8359436 8273819 8478605 7957271 8136701 7907273
14121G907273J20318l33729q6116j56805q8577j01229m7353j8014k42265n3651
$$ 7907273 8027591 7693862 7607746 7450941 7362364 7261135 7213782 7195768 6953503 6899852
14111F899852k71847K89865m01072J98761l27338J07018r1399m8726k00713k8385
$$ 6899852 6628005 6917870 6516798 6715559 6388221 6495239 6403840 6355114 6154401 6126016
14101F126016Q9222j53049k16162O3440k64086J171J13984j11371J54902k20073
$$ 6126016 6215238 6062189 5846027 5909467 5645381 5646552 5760536 5649165 5804067 5583994
14091E583994j13856J55094l25381k20570o341K21042l80810K21760j90430j21843
$$ 5583994 5470138 5625232 5299851 5079281 5072940 5293982 4913172 5134932 4944502 4822659
14081D822659n1209L91832n59095N56047m35764k46902J52899k79151m4412K61385
$$ 4822659 4771450 5163282 4604187 5160234 4724470 4477568 4630467 4351316 4306904 4568289
14071D568289N7009l14216j0153k33559J94380k7973p8574R1168J37663k85960
$$ 4568289 4625298 4311082 4300929 4067370 4261750 4233777 4155203 4246371 4384034 4098074
14061D098074q5840Q2501P8597j37641j47532R3279K4541j52012q9920J8566n3927
$$ 4098074 4012234 4094735 4173332 4035691 3888159 3981438 4005979 3853967 3764047 3782613 3728686
14050C728686p0560n9835m11155L35079p532k59408Q2621k05632J49065L1695
$$ 3728686 3658126 3598291 3187136 3522215 3514683 3255275 3337896 3132264 3281329 3313024
14040C313024J28005q3796k94046L23961m71207M01128n55312L98636K04995k93798
$$ 3313024 3441029 3357233 3063187 3387148 2915941 3317069 2761757 3160393 3365388 3071590
14030C071590N991j63493J28717k22965j11378J5809r7105J29420l1539J40063
$$ 3071590 3077581 2914088 3042805 2819840 2708462 2724271 2627166 2756586 2725047 2865110
14020B865110j81018J54205Q74r2778j93504L0652J72587k81721k15632K26489
$$ 2865110 2684092 2838297 2839171 2746393 2552889 2583541 2756128 2474407 2258775 2485264
14010B485264J03816M810l59228p098N19456l77335J38253k18430k46534M41448
$$ 2485264 2589080 2593890 2234662 2227564 2747020 2369685 2507938 2289508 2042974 2484422
14000B484422m47064k92714L70309J13912l38007L70814k91923K65097l7241k0880
$$ 2484422 2037358 1744644 2114953 2228865 1890858 2261672 1969749 2234846 2197605 2176725
13990B176725J69196P12054K620778O650660K1164276J3123708k1320601j1718434
$$ 2176725 2345921 3057975 5678753 12329413 33493689 46617397 25296796 13578362
13982A3578362m819116k450565j511758l91731o63534l89105j45216m65643R0523
$$ 13578362 8759246 6308681 4796923 4405192 3741658 3352553 3207337 2741694 2832217
13973B832217m00952L69877p1750l65095J63768K2235j00154k85510J93674n4681
$$ 2832217 2431265 2801142 2729392 2364297 2528065 2550300 2450146 2164636 2358310 2303629
13963B303629k19577N22312o97100L78848j42339Q1639J62036m64141J77002m98915
$$ 2303629 2084052 2606364 1909264 2288112 2145773 2227412 2389448 1925307 2102309 1603394
13953A603394J49226L67222l02782K38820J45192p10081K97411K90733n48799
$$ 1603394 1752620 2119842 1817060 2055880 2201072 1490991 1788402 2079135 1530336
13944A530336J35643J94689J25182J29896k82992K64402m51628N6132N3975j38783
$$ 1530336 1665979 1860668 1985850 2115746 1832754 2097156 1645528 1701660 1755635 1616852
13934A616852j4962J55403k87787M44186k5037j76512J4165M5363k30130J09523
$$ 1616852 1601890 1757293 1469506 1913692 1888655 1712143 1726308 1771671 1541541 1651064
13924A651064M9628r4298k1072k84253K71529l1794J94455L460n28461l5090L4208
$$ 1651064 1700692 1606394 1585322 1301069 1572598 1540804 1735259 1738719 1210258 1175168 1209376
13913A209376K45966K69702r249k35574k31361M67646r7193k22815K19722P1454
$$ 1209376 1455342 1725044 1715795 1480221 1248860 1716506 1619313 1396498 1616220 1687674
13903A687674Q9578m29762J7993j66976J19603r3030j04259L71578k80665L3905
$$ 1687674 1777252 1347490 1365483 1198507 1318110 1225080 1120821 1492399 1211734 1245639
13893A245639Q6806k9529j17480J76907l15902K06334M1903J92754m26537J62527
$$ 1245639 1332445 1302916 1185436 1362343 1046441 1252775 1294678 1487432 1060895 1223422
13883A223422J01333P5431k77227l0674R6805L597J9069j66015L65895l3377j75820
$$ 1223422 1324755 1400186 1122959 1092285 1189090 1192687 1211756 1045741 1411636 1378259 1202439
13872A202439J4550l73101k2405K68341L24339n23071L33298l5985L02113l84457
$$ 1202439 1216989 843888 821483 1089824 1414163 891092 1224390 1188405 1490518 1106061
13862A106061J40294J12497q0333q5391R301P4402q4769l8239R4377l03849j82246
$$ 1106061 1246355 1358852 1278519 1193128 1202429 1276831 1192062 1153823 1248200 944351 762105
13851G62105J2303M38830j07629k08289K28027J59082k58912j18294M2549J44707
$$ 762105 774408 1213238 1105609 897320 1125347 1284429 1025517 907223 949772 1094479
13841A094479k43051L20446k25474K58880j81335k04096N4847P2123j58902J74173
$$ 1094479 851428 1171874 946400 1205280 1023945 819849 874696 946819 787917 962090
13831I62090J38674j74817p0260K50730J58842k76712j86151j44508M12177j36830
$$ 962090 1100764 925947 855687 1106417 1265259 988547 802396 657888 1070065 933235
13821I33235k52148L66572K22901l40895j69079l4297M29047n12610J16594J93331
$$ 933235 681087 1047659 1270560 929665 760586 726289 1155336 642726 759320 952651
13811I52651k39491J18739p5991K48435j38752j06541p5988M6984o6183O82413
$$ 952651 713160 831899 755908 1004343 865591 759050 683062 730046 663863 1346276
13801A346276o48733J28485M1941K6971J64644k48845o8092n3811R1269j89636
$$ 1346276 697543 826028 867969 894940 1059584 810739 742647 688836 780105 590469
13791E90469K57242j32328K56658k51121L02522l72640l5822k1420P6769J30590
$$ 590469 847711 715383 972041 720920 1023442 650802 614980 593560 670329 800919
13781H00919k28273j41537L42591L574j5977j23894L74166m9363C99324O17166
$$ 800919 572646 431109 773700 777274 761297 637403 1011569 962206 399324 1016490
13771A016490l73226n3550N05931n28531K24848j97398k85208L17565k04331N35507
$$ 1016490 643264 589714 1095645 567114 791962 594564 309356 626921 422590 958097
13761I58097k53128O0274k41357K60935k54528M86601k41499n6955j9501M3499
$$ 958097 704969 765243 523886 784821 530293 1016894 775395 718440 698939 742438
13751G42438K27695D00940K80342M0834J25455j87707n6762K00457j24268N0367
$$ 742438 970133 400940 681282 722116 847571 659864 603102 803559 679291 729658
13741G29658n5271J07658k79476P0102k67046M31119j33621B93086N40837j76668
$$ 729658 674387 782045 502569 572671 305625 736744 603123 293086 833923 657255
13731F57255B60732K40909K53071C50954K81205q8340K62314k68985J46356P0551
$$ 657255 260732 501641 754712 350954 632159 543819 806133 537148 683504 754055
13721G54055o5710O7375l62592J25300O8236J71299l15163q0203J69171M6536
$$ 754055 688345 755720 393128 518428 586664 757963 442800 362597 531768 578304
13711E78304j79277J00026r6953K93356j41487J78586B72017L59763k49721j6907
$$ 578304 399027 499053 402100 695456 553969 732555 272017 631780 382059 365152
13701C65152N2024o6602K45516K8258I1358P55282k39479k72084L32751l02372
$$ 365152 417176 350574 596090 624348 91358 846640 607161 335077 667828 365456
13691C65456Q3218L09553C52300q5672K06574j24130o2899L22506B08530K84217
$$ 365456 448674 758227 352300 266628 473202 349072 286173 608679 208530 492747
13681D92747L55L54522A82063J79815n1795K72859J24336l36792q5211K63984
$$ 492747 493102 847624 182063 361878 310083 582942 707278 370486 285275 549259
13671E49259r6491J33803k00370J60867M8735m8454q3046M8562j20873l4718K00834
$$ 549259 452768 586571 386201 547068 595803 547349 464303 512865 391992 357274 558108
13660E58108K4892j31029D8105L48698j36553J85485M06180C29566J90371B17378
$$ 558108 583000 451971 48105 396803 260250 445735 851915 329566 519937 217378
13649F91090l07407J68412j705K44981C77724j36470J13147L40637A79308R8679
$$ 691090 383683 552095 550390 795371 377724 241254 354401 695038 179308 277987
13639B77987K58285I6706l850L59828K50616k24765k9330K13171C01437N7160
$$ 277987 536272 96706 92856 452684 703300 478535 449205 662376 301437 358597
13629C58597J66907k5473p2839O3077A34803K81828J74933B53186K37040N5550
$$ 358597 525504 500031 427192 490269 134803 416631 591564 253186 490226 545776
13619E45776j71246J42731A82721P0846M1793L08274k25472j07164J31315K84836
$$ 545776 374530 517261 182721 253567 295360 603634 378162 270998 402313 687149
13609F87149l34359M8568P610J12535K9800P2609p4172K6919A92675K55248N4052
$$ 687149 352790 401358 408968 521503 551303 623912 549740 576659 192675 447923 501975
13598E01975k2382j78360j28920J70150A54179K49934C1322P4165J49001Q7379
$$ 501975 479593 301233 172313 342463 154179 404113 31322 105487 254488 341867
13588C41867j43670J90704E9369L83590j47091J61940k27723J78658n1546A46777
$$ 341867 198197 388901 59369 442959 295868 457808 230085 408743 357197 146777
13577B48032E8318J9968L67290l8617K8322J29446B82248j4475A2170O39233l20098
$$ 248032 58318 78286 445576 406959 435281 564727 282248 267773 12170 651403 331305
13566C31305K7515J00569j11714R9596N8461A83940J01479K24400k22469Q4193
$$ 331305 358820 459389 347675 447271 505732 183940 285419 509819 287350 371543
13556C71543K86750k18847j08564J01131B03720J34060g950k165A18868N58837
$$ 371543 658293 439446 330882 432013 203720 337780 -7950 -10115 118868 677705
13546F77705l09246n9132J18997j95554H0823K52667J18158O8736J26107k50819
$$ 677705 368459 309327 428324 232770 80823 333490 451648 520384 646491 395672
13536C95672j36472K7020R1522r9282R3335F2760M46803k52035P1123k1669O1093
$$ 395672 259200 286220 377742 278460 371795 62760 509563 257528 328651 306982 368075
13525C68075o7835J31744m7573b6512B36997K98564q5336j42399Q2596j21820
$$ 368075 300240 431984 384411 -26512 236997 535561 450225 307826 390422 268602
13515B68602K05365j85592h3697C62808G6351M64868A70576L85897B09108F4248
$$ 268602 473967 288375 -83697 362808 76351 541219 170576 556473 209108 64248
13504A50845N7532R0275K2531k1491N8426r6525n9262R6656K15798k40737J08988
$$ 150845 208377 298652 321183 299692 358118 261593 202331 298987 514785 274048 383036
13493C83036b1096B05573J02333J15406N2903j18747J19135j69884K9318G7738
$$ 383036 -21096 205573 307906 423312 476215 357468 476603 306719 336037 77738
13482D73956i681B78193A20328g3015E30035B25747N2907L52550A03501K24030
$$ 473956 -9681 278193 120328 -73015 530035 225747 278654 631204 103501 327531
13472C27531j05978L6016p9402j9828j5746o8650N09432A76946e5354r5237B79912
$$ 327531 221553 257569 178167 158339 142593 73943 583375 176946 -55354 -150591 279912
13460B81168a12758A65120L65722f1529E0249K94222q302k2017K7498m3688j32212
$$ 281168 -112758 165120 530842 -61529 50249 344471 336169 314152 341650 297962 165750
13449A65750O777J45042J7022p8382j23451N9602J40048A57278n7878M02957k26687
$$ 165750 172527 317569 334591 256209 132758 192360 332408 157278 99400 502357 275670
13438B75670i7925B11195J53032H6061K21099M7366a15996C41267A64058l1382
$$ 275670 -97925 211195 364227 86061 307160 354526 -115996 341267 164058 132676
13428A32676b23625A18702K46614M1875r8221b6325D8578K70048r8096M3798N1769
$$ 132676 -223625 118702 365316 407191 308970 -26325 48578 318626 220530 264328 316097
13417C16097j37473L88725A66774K0477k5258n4248D8752K01560m463K09828A62673
$$ 316097 178624 567349 166774 187251 161993 107745 48752 250312 245849 455677 162673
13405B57654o158j8717K6657j29480k0814K72782q3007m9103r1170G8439L40299
$$ 257654 251496 232779 259436 129956 109142 381924 298917 249814 158644 78439 418738
13394D18738j84405K04268j58015j34189k8552L2745Q7702a53629B77165p2942
$$ 418738 234333 438601 280586 146397 117845 150590 238292 -153629 277165 204223
13384B04223K4322R7203M6334A71187Q658b2442A15069K3882i0033C10332J43530
$$ 204223 228545 325748 372082 171187 179845 -22442 115069 138951 -90033 310332 453862
13373D53862A49694F0628K4664R0520J24675f2550A98489l3910J80647A50899
$$ 453862 149694 60628 85292 175812 300487 -62550 198489 164579 345226 150899
13362D40477p6407i8401d4308A09417O7868O8470n2632j0253Q9190j10031c4665
$$ 440477 364070 -98401 -44308 109417 177285 245755 193123 182870 272060 162029 -34665
13350D76728f5328B17452i9578A27621o0465L64012N5106A53113K16730j14244
$$ 476728 -65328 217452 -99578 127621 67156 431168 486274 153113 369843 255599
13340B55599j04493Q3758J42817j51370j08942R5641Q9628g6921b0027H2342O14503
$$ 255599 151106 234864 377681 226311 117369 213010 302638 -76921 -20027 82342 696845
13329F96845k14838k04348J32903A39997P4645d6361B55091J10926A47657K08526
$$ 696845 482007 277659 410562 139997 214642 -46361 255091 366017 147657 356183
13319C56183p3061N3088H2901J76082a22094B05785O3308j00356l6570J01571
$$ 356183 283122 336210 82901 258983 -122094 205785 269093 168737 132167 233738
13309B33738j02532M85390q4105H9224m1267K59153Q1477H273L12671H7785J21832
$$ 233738 131206 616596 532491 89224 47957 307110 388587 8273 320944 87785 209617
13298B09617p2643n4170b83957B38234r2760K09559H7773J09520K75930j75792
$$ 209617 136974 82804 -283957 238234 145474 355033 87773 197293 473223 297431
13288B97431L5278D5474k0848P8062J16602C2020L61012a81287B04538h7573F5340
$$ 297431 332709 45474 24626 102688 219290 32020 393032 -181287 204538 -87573 65340
13276a3137A53687D4934J20963m0810J69649j15032H4143e2315k67707A8172l580
$$ -13137 153687 44934 165897 125087 294736 179704 84143 -52315 -320022 18172 14592
13265A4592b145A5114K82923j36727K38663J45000A1647J0159M74293A22334K10012
$$ 14592 -2145 15114 298037 161310 399973 544973 11647 21806 496099 122334 332346
13254C32346r6613B6286M09285j95138m9867D4337i1658A2441c6077n1590p6514
$$ 332346 235733 26286 435571 240433 190566 44337 -91658 12441 -36077 -87667 -164181
13243a64181B16767n8663J23968j2455E1630K26275L8574A44303a10755k73997
$$ -164181 216767 158104 282072 269617 51630 277905 316479 144303 -110755 -384752
13233c84752A32639J00958h8570C48843A4641J70539K6409I2098a65794P7016
$$ -384752 132639 233597 -88570 348843 14641 185180 211589 92098 -165794 -88778
13223h8778E4555k5611K42870A03291O9344G7790J22051m0945g0145B4662e7871
$$ -88778 54555 28944 271814 103291 172635 77790 199841 158896 -70145 24662 -57871
13211b61367A01081K56308I1308J83450L249k1015A16202a61035C33477e3927
$$ -261367 101081 357389 91308 274758 278007 256992 116202 -161035 333477 -53927
13200A75932Q404n1468l0771h3812c4417e408l48135A20214Q4587q766J3342J11015
$$ 175932 184336 132868 102097 -83812 -34417 -5408 -353543 120214 204801 196035 209377 320392
13188C20392d8786A44321J93487b83448e864r8077A64278B3385J27132k51l7765
$$ 320392 -48786 144321 337808 -283448 -5864 -103941 164278 23385 150517 150266 112501
13177A12501K50628b36354C21989a49757C39763j31691a2683A18763K78277F9040
$$ 112501 363129 -236354 321989 -149757 339763 208072 -12683 118763 397040 69040
13166A05082a3222F6810b13578L5809G0011K1886K5975d8370D06955i9069a1910
$$ 105082 -13222 66810 -213578 -177769 70011 91897 117872 -48370 406955 -99069 -11910
13154A89986e7100A93286a07866M8147B74422A14141K11318r1408a23542A32696
$$ 189986 -57100 193286 -107866 -59719 274422 114141 325459 234051 -123542 132696
13143F4113K4613L16765A64019P9301A3186L8099J34930d4317B72614J104E2984
$$ 64113 88726 405491 164019 243320 13186 51285 186215 -44317 272614 273718 52984
13131g6104A93771q434Q8459a83182C13112i5494A37411D7787j1350K35629A7544
$$ -76104 193771 185337 273796 -183182 313112 -95494 137411 47787 36437 272066 17544
13119A07488h4746j40206C86681b44565D7604c14458B63794j15416A6741K22397
$$ 107488 -84746 -224952 386681 -244565 47604 -314458 263794 148378 16741 239138
13109B39138D2304i0193B29365F7740J68654A17786g7659n8710D35069A40076
$$ 239138 42304 -90193 229365 67740 236394 117786 -77659 -136369 435069 140076
13098F2641K29790A10272a05068D1599M79846I938J25669F4103L0187b20528A07940
$$ 62641 292431 110272 -105068 41599 521445 9938 135607 64103 94290 -220528 107940
13086B14931j07373Q6339b226j35614e7459A47721J91600E379g1851F0995a08063
$$ 214931 107558 193897 -2226 -137840 -57459 147721 339321 5379 -71851 60995 -108063
13074B17497a2803B7033J56243a22633D0811Q5715a69697D6091a3416A24039J47851
$$ 217497 -12803 27033 183276 -122633 40811 126526 -169697 46091 -13416 124039 271890
13063B71890J24585j51523j19175n6150A7364J89412g2004A40689P0349m1352
$$ 271890 396475 244952 125777 69627 17364 206776 -72004 140689 211038 169686
13053A69686o9702B3859b28330C08665K6944f8929B22736P9976j14846J46163
$$ 169686 99984 23859 -228330 308665 335609 -68929 222736 302712 187866 334029
13043C34029h952j39120C43612J5407k4C0232d3337A31694J65091P1189A75848
$$ 334029 -8952 -148072 343612 359019 358995 30232 -43337 131694 296785 367974 175848
13031e9844B85551n9275A09607R4699M3562P2046k5394m6635q5400a09308A15887
$$ -59844 285551 226276 109607 204306 247868 319914 294520 247885 162485 -109308 115887
13019f0759G3158E18K52805a07086o4074C45023m0599d0918g85q6060A61214N4260
$$ -60759 73158 518 253323 -107086 -171160 345023 304424 -40918 -785 -86845 161214 215474
13007B15474K51735B19399K93620A99325L0270j9036K7233G3451O6162c5321A87699
$$ 215474 467209 219399 513019 199325 229595 210559 237792 73451 139613 -35321 187699
12995B23362A09157c4560A34761R779l6592d1718A66752n5018n3892J09452c01254
$$ 223362 109157 -34560 134761 144540 107948 -41718 166752 111734 57842 167294 -301254
12983B09223c1049C39196b63899I5083K52459F330d6335A46895a48308C72947
$$ 209223 -31049 339196 -263899 95083 347542 6330 -46335 146895 -148308 372947
12972A50470k9921K99950a4035m2621F9344e1430A19579l8557L6702c7432A13516
$$ 150470 120549 420499 -14035 -56656 69344 -51430 119579 81022 117724 -37432 113516
12960i0498d4571B59088h2967A6696L4946a26674A22529b79178A51266q600a87117
$$ -90498 -44571 259088 -82967 16696 51642 -126674 122529 -279178 151266 142666 -187117
12948B20114d9900B08136q9971i3809r90G7122l6641d51784A7995J28501A2664
$$ 220114 -49900 208136 118165 -93809 -94799 77122 40481 -451784 17995 146496 12664
12936C3859P2156P995i2045C68095A52476J30351b68934J28486A0265N39569c7473
$$ 33859 106015 114010 -92045 368095 152476 282827 -268934 -140448 10265 549834 -37473
12924A09181a9010q8372I8846c041A8989J4714d54243B35123a70675E499j219
$$ 109181 -19010 -107382 98846 -3041 18989 33703 -454243 235123 -170675 5499 4280
12913D280c9337C3405K83228A40600F317J50256a73221a4920A9585i6759a9328
$$ 4280 -39337 33405 316633 140600 6317 156573 -173221 -14920 19585 -96759 -19328
12901b63650A72632A3916J47469B142M4656K49743p1602b10685A09690K41925
$$ -263650 172632 13916 161385 2142 46798 296541 224939 -210685 109690 351615
12891C51615a1327B29529o5733R9751I9410j9014i1760n0190A68937l7191a40315
$$ 351615 -11327 229529 163796 263547 99410 80396 -91760 -141950 168937 131746 -140315
12879a31067A14112n6101a36645i121k03904c0108k17755k0069C9221L00368p0110
$$ -131067 114112 58011 -136645 -9121 -213025 -30108 -247863 -267932 39221 339589 269479
12868B69479O1480F9511R0651D3164J20453C4090a90475A92227a27289j99171
$$ 269479 330959 69511 160162 43164 163617 34090 -190475 192227 -127289 -326460
12858c26460A55335o6933p635b47008A89324e479A24761A9636b34734A33759d73770
$$ -326460 155335 88402 80767 -247008 189324 -5479 124761 19636 -234734 133759 -473770
12846b15856j47974H3797d6824F3434f6252C106K27066i2786m8381H4690J36852
$$ -215856 -363830 83797 -46824 63434 -66252 3106 230172 -92786 -141167 84690 221542
12835B21542c4302E1023b4143A63560L9322a48831A22139n2835g0435D379K52153
$$ 221542 -34302 51023 -24143 163560 202882 -148831 122139 69304 -70435 4379 256532
12824B56532f9679f505A9958b4768C80114j45053I3821J94750j26693d3674A30908
$$ 256532 -69679 -6505 19958 -24768 380114 235061 93821 288571 161878 -43674 130908
12812I0930A9649a57226A69467B6456K5396J806e0737j9646k6990B5994a11063
$$ 90930 19649 -157226 169467 26456 51852 53658 -50737 -70383 -97373 25994 -111063
12800a8307j06405j0523G0460J36232K3561a4322B90388j03707E6773B2601L9880
$$ -18307 -124712 -135235 70460 206692 230253 -14322 290388 186681 56773 22601 62481
12789F2481b17814B17154j06003J1238a71896A82078f8398k2324D7257c62582
$$ 62481 -217814 217154 111151 122389 -171896 182078 -68398 -90722 47257 -362582
12778C304K60772a81104C97482i5684B81043j39661c1464q941A04288j962L8007
$$ 3304 264076 -181104 397482 -95684 281043 141382 -31464 -40405 104288 102326 140333
12767A40333l1324O7667a85464e8910F8429d05732A41017L2120L5764D0032G090
$$ 140333 109009 176676 -185464 -58910 68429 -405732 141017 173137 208901 40032 7090
12755h8922F644a4351G5489i2953A08876h1754A14267a16452A5911K68506H1717
$$ -88922 6644 -14351 75489 -92953 108876 -81754 114267 -116452 15911 284417 81717
12743G3003J02401a31766E5958J06025D0086L1465C2644a63495H8786J45565j8755
$$ 73003 175404 -131766 55958 161983 40086 71551 32644 -163495 88786 234351 215596
12732B15596j7449a52279L7223j45107A9460J3291J2886f0121A67244M7176r4152
$$ 215596 198147 -152279 -115056 -260163 19460 32751 45637 -60121 167244 214420 120268
12721A20268B4772J58084a99844j8282A48118h9890A2494P4484C1307K82095k9117
$$ 120268 24772 182856 -199844 -218126 148118 -89890 12494 86978 31307 313402 284285
12710B84285G1842E050L62037p0814H6661K25611A22491J80387H9120K72890a65550
$$ 284285 71842 5050 367087 296273 86661 312272 122491 302878 89120 362010 -165550
12698b2286B22275k6806p2029J79851j33559A5906d5078j0496a0403j00640j12380
$$ -22286 222275 195469 123440 303291 169732 15906 -45078 -55574 -10403 -111043 -223423
12687b23423a5672q8512I000L40736j11464n2442D2970h8597B70878q8291b33500
$$ -223423 -15672 -104184 9000 349736 238272 185830 42970 -88597 270878 182587 -233500
12675C98834j22077b3474A01484a34750B0784b9795B22318G0198J57558K09355
$$ 398834 276757 -23474 101484 -134750 20784 -29795 222318 70198 227756 437111
12665D37111B4938a19345B64073a2974D9590A081J85206D3315J39920C0340J68269
$$ 437111 24938 -119345 264073 -12974 49590 1081 186287 43315 183235 30340 198609
12654A98609J47923o9496b3905A26139J9438b3123B45223q0319J42346A26247
$$ 198609 346532 277036 -23905 126139 145577 -23123 245223 164904 307250 126247
12643A17483g9781H0090J15140a6723B12299p4133E5924J707a84998B9547J77710
$$ 117483 -79781 80090 195230 -16723 212299 138166 55924 57631 -184998 29547 207257
12632B07257f5423G0598M8996a06702A98328k1679p7641N7436J909a972q2837
$$ 207257 -65423 70598 119594 -106702 198328 176649 99008 156444 158353 -1972 -84809
12621h4809E5962d7260A0988J20732D5434d1758G7118J86207a2186B55236F6926
$$ -84809 55962 -47260 10988 131720 45434 -41758 77118 263325 -12186 255236 66926
12609D1920K7056d1133E227a24176B2295d86330A08642a45530C20206g6848E15434
$$ 41920 68976 -41133 5227 -124176 22295 -486330 108642 -145530 320206 -76848 515434
12597A83174B5926M10722A87720F4957c12932a03288A8207J88323f6637j75947
$$ 183174 25926 436648 187720 64957 -312932 -103288 18207 206530 -66637 -242584
12587b42584B04762L4413a52781d412C9040a31923a3579k5455J9453o9662n7800
$$ -242584 204762 239175 -152781 -4412 39040 -131923 -13579 -39034 -19581 -89243 -147043
12576a47043D91778A10158b97140H0357J67018A0325d0201j1125j38841B82525
$$ -147043 491778 110158 -297140 80357 247375 10325 -40201 -51326 -190167 282525
12565B52335r4183g1998j61437I2435Q3484J30336H884L68166j53640K17664A33592
$$ 252335 158152 -71998 -233435 92435 175919 306255 8884 377050 223410 441074 133592
12553b61417A19781j5749P3009g1882A37398b2223H9978J54547G973J00036d0304
$$ -261417 119781 104032 177041 -71882 137398 -22223 89978 244525 7973 108009 -40304
12541a63457D4585K63118c333B21879o8421m9153a22985b5817D60429C0350D375
$$ -163457 44585 307703 -3333 221879 153458 104305 -122985 -25817 460429 30350 4375
12529a78613O5909p5724j00930H2703L8065f5022A30694o1800e0932q3439j07100
$$ -178613 -112704 -188428 -289358 82703 120768 -65022 130694 68894 -50932 -134371 -241471
12518b41471i6929B92908j32893D9300P4836O0482q5912a22246A37004R2916f165
$$ -241471 -96929 292908 160015 49300 124136 184618 98706 -122246 137004 229920 -6165
12506A79671a12955H655M3670Q3729a38215B2577R6817h4169d199B66a25068l8105
$$ 179671 -112955 8655 52325 136054 -138215 22577 119394 -84169 -4199 266 -125068 -163173
12494a63173k1278B85298c4464j15415e0355j78704A50319o5261b03592P7336
$$ -163173 -184451 285298 -34464 -149879 -50355 -229059 150319 85058 -203592 -126256
12484a26256K8884j22521C54548c23694B82999q8390b17585i5783B51625b5084
$$ -126256 -97372 -219893 354548 -323694 282999 194609 -217585 -95783 251625 -25084
12473A18795A2713c8944k17189a10422j04803A40175J44246c1056A77925a475
$$ 118795 12713 -38944 -256133 -110422 -215225 140175 284421 -31056 177925 -1475
12462B01722a0820q8358r6608A82282h672C550O3221a68869c2809m511a7468I9617
$$ 201722 -10820 -99178 -195786 182282 -8672 3550 66771 -168869 -32809 -37320 -17468 99617
12449c34739a09120A52609J03414b96976g4145B42494c34696d30j59554n098G9025
$$ -334739 -109120 152609 256023 -296976 -74145 242494 -334696 -430 -159984 -165082 79025
12437B331L26436I1586D2675c47645B21863j4393i1750F3444a52641E0682J40186
$$ 2331 328767 91586 42675 -347645 221863 207470 -91750 63444 -152641 50682 190868
12426A90868h2267B4231O1047J92784H1653a45525A47134B4769h8097k81212J35592
$$ 190868 -82267 24231 85278 278062 81653 -145525 147134 24769 -88097 -369309 -233717
12415b33717E38737b04775C05650b37751j37228I3447g269A443O2408G278J2809
$$ -233717 538737 -204775 305650 -237751 -374979 93447 -7269 1443 63851 7278 20087
12404B0087a13101B81655g7761J6250E0456J87038F8744b56613A64207F7356b9415
$$ 20087 -113101 281655 -77761 -61511 50456 237494 68744 -256613 164207 67356 -29415
12392A97214m874C8207a4039j81456I5144A1542Q1064J1141J20120j2709a90724
$$ 197214 192340 38207 -14039 -195495 95144 11542 92606 103747 223867 211158 -190724
12380i6955n4114C04816A43457b06524G9035a16933M0737G4189L91830H3732j5368
$$ -96955 -151069 304816 143457 -206524 79035 -116933 -76196 74189 466019 83732 68364
12369F8364a81564c9428l6654D38852b19661n9568A43624Q4981f2650b8891n69803
$$ 68364 -181564 -39428 -76082 438852 -219661 -279229 143624 228605 -62650 -28891 -598694
12358e98694A85309a24004K7502B82332A21388D3011M04833i5871C27723D1925
$$ -598694 185309 -124004 -96502 282332 121388 43011 447844 -95871 327723 41925
12347b16033a0456o4544l7542d2041A8077b27016L1762g3385H6962i387F6811
$$ -216033 -10456 -75000 -112542 -42041 18077 -227016 -195254 -73385 86962 -9387 66811
12335G6900K19400F1491G408J17735C2310R6217b18166d4567A7216h62C41886
$$ 76900 296300 61491 7408 125143 32310 128527 -218166 -44567 17216 -862 341886
12323f893B9256P3104d1878n326j47274b1794j30637b0220D42217A63018i1438
$$ -6893 29256 102360 -41878 -47204 -194478 -21794 -152431 -20220 442217 163018 -91438
12311A38175C9438b31758A20790A5442a14757e2652A07717k7716i3821r427p4662
$$ 138175 39438 -231758 120790 15442 -114757 -52652 107717 80001 -93821 -103248 -177910
12300a77910b3195C06878D5700L1686l7710K14139i845B08608h2978j46940D30167
$$ -177910 -23195 306878 45700 77386 39676 253815 -9845 208608 -82978 -229918 430167
12288B7384L13645m9085B5313b07969C82764A14736c50008e5775a8210D2187j7853
$$ 27384 341029 291944 25313 -207969 382764 114736 -350008 -55775 -18210 42187 24334
12277B4334h3182A700J57153Q9770q6635c62218e2276C12919p2706b1204j9451
$$ 24334 -83182 1700 158853 248623 161988 -362218 -52276 312919 240213 -21204 -40655
12266d0655A68362n3824h9095l2559B6908K24607E8531J28342H4663R5511J14030
$$ -40655 168362 114538 -89095 -121654 26908 251515 58531 186873 84663 180174 294204
12255B94204e4057b4366j38872A49818A3333a07834B78029A35292C1958Q335J90336
$$ 294204 -54057 -24366 -163238 149818 13333 -107834 278029 135292 31958 40293 230629
12244B30629M9669q5189D1862Q8672K28218b59253B15485i5671c0422H4674Q9396
$$ 230629 280298 195109 41862 130534 358752 -259253 215485 -95671 -30422 84674 174070
12233A74070a88445A64492e2432B32058H1989h8136A71184p4471J35478j3759
$$ 174070 -188445 164492 -52432 232058 81989 -88136 171184 96713 232191 218432
12223B18432K91124A24582l6674H319K31851K51661a08728C1824j5505K37671
$$ 218432 509556 124582 87908 8319 240170 491831 -108728 31824 16319 253990
12213B53990l4467l5315i8460B5880B558N8008J57011E3814d11267F14103k60525
$$ 253990 219523 184208 -98460 25880 2558 60566 217577 53814 -411267 614103 353578
12202C53578A36450C2899J02291b924A25695b4236m1275A15395K74949C9025J42692
$$ 353578 136450 32899 135190 -2924 125695 -24236 -65511 115395 390344 39025 181717
12191A81717K00565A25217l1860M9800D0241J714a96426C1083a65165C21271j29014
$$ 181717 382282 125217 93357 143157 40241 41955 -196426 31083 -165165 321271 192257
12180A92257N8918A3665b51043B03977m6345a49197D076J37993N131M20871B24790
$$ 192257 251175 13665 -251043 203977 157632 -149197 4076 142069 147200 568071 224790
12168a02153D5937a82743A25773K8740O5481Q0217j23432g0429B01895a10701
$$ -102153 45937 -182743 125773 154513 219994 300211 176779 -70429 201895 -110701
12157A47296L11790A51119k9130f7964j98946C29722F4201J92807G4741l1185
$$ 147296 459086 151119 121989 -67964 -266910 329722 64201 257008 74741 43556
12147D3556a09154H2509l8047c0974j54908D27482i9158B76509I408d6201j22835
$$ 43556 -109154 82509 44462 -30974 -185882 427482 -99158 276509 9408 -46201 -169036
12136a69036C38430B4752d4511K767o9223B98086a8182F2451J46291L5650B9210
$$ -169036 338430 24752 -44511 -41744 -110967 298086 -18182 62451 208742 244392 29210
12124a80753K3882A69385J66393G941K52410N3137a77324A92501a87081C01233
$$ -180753 -156871 169385 335778 7941 260351 313488 -177324 192501 -187081 301233
12113C07846a00229c9097A5122O7599d1083l6216A50297J97126h8130D417K49249
$$ 307846 -100229 -39097 15122 82721 -41083 -77299 150297 347423 -88130 4417 253666
12102B53666K3253a69329H0797N1353E8852h4396A63969a56434A30998K4098l4999
$$ 253666 276919 -169329 80797 132150 58852 -84396 163969 -156434 130998 155096 120097
12091A20097J74832c30230g1464A61809e7571A68973g2316A70541H1304d0970
$$ 120097 294929 -330230 -71464 161809 -57571 168973 -72316 170541 81304 -40970
12080E7170r252c48124A54045c2188B0667i714m060F21161J322540k72644C88176
$$ 57170 47918 -348124 154045 -32188 20667 -9714 -13774 621161 1943701 1671057 388176
12068C92271k6709c3935j13875P3593B54826j02326c2303a720A93002o7106K64400
$$ 392271 365562 -33935 -147810 -74217 254826 152500 -32303 -1720 193002 125896 390296
12057C90296a49060B01277a35045j48715A92507c93594J29913C0204k797b60571
$$ 390296 -149060 201277 -135045 -283760 192507 -393594 -263681 30204 27407 -260571
12046B50608F2341a52454K2043l8357A16116j2651b31171B2424a4067B71624a02194
$$ 250608 62341 -152454 -130411 -168768 116116 103465 -231171 22424 -14067 271624 -102194
12034D4171O143a1705j0891B04983E7890b00834A07248c6871j75728a2891k06039
$$ 44171 50314 -11705 -22596 204983 57890 -200834 107248 -36871 -212599 -12891 -218930
12023b18930C15408C0661L4209c02691E395f900k9387A68555a36284A17400a30228
$$ -218930 315408 30661 64870 -302691 5395 -6900 -36287 168555 -136284 117400 -130228
12011A36720c16251A8204J13005b25451h5955j25387j43024R8379C21399i3217
$$ 136720 -316251 18204 131209 -225451 -85955 -211342 -354366 -255987 321399 -93217
12000A13020a41429p2406G5504P1674R3230b04802j54079C34065c46348a64019
$$ 113020 -141429 -213835 75504 147178 240408 -204802 -358881 334065 -346348 -164019
11989a40032A09729M4913b72931o2350a21718A0955J27392O279m3919b7618F5327
$$ -140032 109729 154642 -272931 -335281 -121718 10955 138347 144626 100707 -27618 65327
11977a03311c6403m671B737M034c15105J55687a746j04236a2577k24575A34013
$$ -103311 -36403 -41074 2737 6771 -315105 -159418 -1746 -105982 -12577 -237152 134013
11965b8461D8446b38598A21773e3693H9771J986g1739B91117A08105b743C4238
$$ -28461 48446 -238598 121773 -53693 89771 91757 -71739 291117 108105 -2743 34238
11953A2649c52854g2239q5471A5589M2517J20027f6621J7412m9763r9444c073
$$ 12649 -352854 -72239 -157710 15589 58106 178133 -66621 -49209 -98972 -198416 -3073
11941I0749h9434B30096a83490j05532I1233c75547m1392c6659B73220a12934
$$ 90749 -89434 230096 -183490 -289022 91233 -375547 -416939 -36659 273220 -112934
11930a67074B62966b37074J4651a6934q7995B63304f2381k09553b1013n4384b9240
$$ -167074 262966 -237074 -222423 -16934 -104929 263304 -62381 -271934 -21013 -75397 -29240
11918i1424B40990c8313D24330f0238C5725a74265B46309j11714j6744a60762
$$ -91424 240990 -38313 424330 -60238 35725 -174265 246309 134595 117851 -160762
11907a82100M9424A35582h5661C1058J15054R1886a00878M9333d746G4683M0213
$$ -182100 -132676 135582 -85661 31058 146112 237998 -100878 -51545 -4746 74683 114896
11896A14896b4839A99410F6219o963J16252b11570p656k15118C99151A30948a44889
$$ 114896 -24839 199410 66219 59256 175508 -211570 -219226 -434344 399151 130948 -144889
11884f5031D5752R0252D9165d85123K28794A54592R2830b2692j66582K630k6599
$$ -65031 45752 136004 49165 -485123 -256329 154592 247422 -22692 -189274 -186644 -213243
11873b13243a6967A55588B8478b35565f1998j77094G9621m85i8689o6928d9775
$$ -213243 -16967 155588 28478 -235565 -61998 -239092 79621 79136 -98689 -165617 -49775
11861a16046B78275a49936I6485a77269F048a51913A5309c02658j10341B29925
$$ -116046 278275 -149936 96485 -177269 6048 -151913 15309 -302658 -412999 229925
11850b57515D7763P874a63677K9022B21386L1686a13327j76835a20014M0302b8696
$$ -257515 47763 55637 -163677 -134655 221386 253072 -113327 -290162 -120014 -79712 -28696
11838h7858j9103l0489L4437A09692d7989A35304b41002L7389j15555d0026j49780
$$ -87858 -106961 -137450 -103013 109692 -47989 135304 -241002 -203613 -319168 -40026 -189806
11827a89806l1573H8627i337p5095B9793A861d4745l90718a27046E6852g8461
$$ -189806 -221379 88627 -9337 -84432 29793 1861 -44745 -435463 -127046 56852 -78461
11815C7737a13735l8950r245C3962L8103h831k37551A86638b22318B75250A25304
$$ 37737 -113735 -152685 -161930 33962 72065 -8831 -246382 186638 -222318 275250 125304
11803A58841p90b74542A03683a53560I2709d5062n8231B44648g4967c1617J1998
$$ 158841 158051 -274542 103683 -153560 92709 -45062 -103293 244648 -74967 -31617 -19619
11792a9619k312l33151A03350D644a2913l5810C97581E6602a2748j02969q4741
$$ -19619 -21931 -355082 103350 4644 -12913 -48723 397581 56602 -12748 -115717 -200458
11781b00458C97598j07527b74504L9418J05991f4067a3734A30414c59975C1339
$$ -200458 397598 290071 -274504 -235086 -129095 -64067 -13734 130414 -359975 31339
11770d0753p1256A16991b9862k66131I8764C5302a28056E7013J7174g929k12661
$$ -40753 -112009 116991 -29862 -295993 98764 35302 -128056 57013 74187 -7929 -220590
11759b20590C41931D2200e3196a7116k41547D1608c68935A95947K710K0794a48677
$$ -220590 341931 42200 -53196 -17116 -258663 41608 -368935 195947 198657 219451 -148677
11747C05182a33703c5198I0208J30520e06685A44424h1937k30301A11228g7608
$$ 305182 -133703 -35198 90208 220728 -506685 144424 -81937 -312238 111228 -77608
11736b8073j01319B00668E7098g7265B31961a0025H946a98818K8438c9809j46503
$$ -28073 -129392 200668 57098 -77265 231961 -10025 8946 -198818 -170380 -39809 -186312
11725a86312B70140l1505D628a7466n3116I8412f2055C36231j44036b63448A71657
$$ -186312 270140 238635 4628 -17466 -70582 98412 -62055 336231 192195 -263448 171657
11713B25032d5564I0992N9143j8826l721e6129j90902I3978k4210a84548B36607
$$ 225032 -45564 90992 150135 131309 127588 -56129 -247031 93978 69768 -184548 236607
11701b75917C03575A602e2562m9905a5242k3619j55122d7769l1892C00384c27298
$$ -275917 303575 1602 -52562 -102467 -15242 -38861 -193983 -47769 -79661 300384 -327298
11689B46755d0053A19807J83919J3153a30077b2230F9969M1597f8050A17166a24947
$$ 246755 -40053 119807 303726 316879 -130077 -22230 69969 111566 -68050 117166 -124947
11677f421C6110K82772A49993n6184a1336j3545j80768k45060a03820A64953J83814
$$ -6421 36110 318882 149993 93809 -11336 -24881 -205649 -450709 -103820 164953 348767
11666C48767C7407J4897j4644J28768b45101d1333m3516l0081j68156H4913e4103
$$ 348767 37407 52304 37660 166428 -245101 -41333 -84849 -114930 -283086 84913 -54103
11654A21566K57474C5216D829Q153J07178E4136c23501E51481j48682j71977c66740
$$ 121566 379040 35216 4829 12982 120160 54136 -323501 551481 402799 230822 -366740
11642C20J04922D0828a30141B165c6142a2248A04787J69199d13469O49a63912
$$ 320 105242 40828 -130141 2165 -36142 -12248 104787 273986 -413469 -412820 -163912
11630B27433B2465i3712A28145a12060C36600j04283b25329B04555m461g6110
$$ 227433 22465 -93712 128145 -112060 336600 232317 -225329 204555 200094 -76110
11619e9552B46201b42541c4307B11469n1742c2807G4151J50581Q0565R0163g2371
$$ -59552 246201 -242541 -34307 211469 159727 -32807 74151 224732 305297 395460 -72371
11607b18031A03310b1945A57350a36062A72950c5398c142D9308e2643I8951K05996
$$ -218031 103310 -21945 157350 -136062 172950 -35398 -3142 49308 -52643 98951 304947
11596C04947m0324A2351b51138I1301K3677J46005g6582p2937A41428N4565b84917
$$ 304947 264623 12351 -251138 91301 114978 260983 -76582 -149519 141428 195993 -284917
11584A15151N1705p056J82441A59774c6462A37081R5556P2109I3026C3943J09966
$$ 115151 166856 159800 342241 159774 -36462 137081 232637 304746 93026 33943 143909
11573A43909h9427B30747N5442a28085H3922C7062b87102B53018b33907B74692
$$ 143909 -89427 230747 286189 -128085 83922 37062 -287102 253018 -233907 274692
11562i1273H4580Q7885l1195K09203j7318a55426B27450b22465M300A12269b34374
$$ -91273 84580 172465 141270 350473 333155 -155426 227450 -222465 -218165 112269 -234374
11550F198c09692A93306b91585A84797J2450f4165l6396B74621F4653a30721A51812
$$ 6198 -309692 193306 -291585 184797 197247 -64165 -100561 274621 64653 -130721 151812
11538b18000c8109a6957H0140b01700E8895a9257A03272k614K79008d8986B57334
$$ -218000 -38109 -16957 80140 -201700 58895 -19257 103272 100658 379666 -48986 257334
11526a3794B38806c14759F4723A1869M9631f398D9868P130K07942b0115A05126
$$ -13794 238806 -314759 64723 11869 61500 -6398 49868 56998 264940 -20115 105126
11514A7300a39850k5856B75283J03738J22721k21545f39k1590I5134K46407j04775
$$ 17300 -139850 -165706 275283 379021 501742 280197 -639 -22229 95134 341541 236766
11503B36766J6990H5875b7564r3250A20317c09557F4986g8209L2992B77127q534
$$ 236766 253756 85875 -27564 -120814 120317 -309557 64986 -78209 -45217 277127 268593
11492B68593D770K43216q4544p7362a42043D47146a95105A87410G1572L57721
$$ 268593 4770 247986 163442 86080 -142043 447146 -195105 187410 71572 429293
11482D29293R2896A79311J19522A34654f3236B57034k3757N5297j42825a8996
$$ 429293 522189 179311 298833 134654 -63236 257034 233277 288574 145749 -18996
11471C85711j31325L03910A62430n672J03446r2512o8914K62759g5892H3835f4290
$$ 385711 254386 558296 162430 156758 260204 167692 98778 361537 -75892 83835 -64290
11459B95817m1955J7211h2582A87435O91A0930J76445M4059E3254E513e3244I4752
$$ 295817 253862 271073 -82582 187435 188126 10930 187375 231434 53254 5513 -53244 94752
11446a2306F7752k932A693M85229c22695J48590D6538a63782A63480c13499b5673
$$ -12306 67752 64820 1693 486922 -322695 -174105 46538 -163782 163480 -313499 -25673
11434A64808h1888A28138a82368c3293H8357l8189a59728N5483A83420a22005
$$ 164808 -81888 128138 -182368 -33293 88357 50168 -159728 -104245 183420 -122005
11423b9207D0121c2254o6643L3908E5452a60877F4097C007L07832h2926j22746
$$ -29207 40121 -32254 -98897 -64989 55452 -160877 64097 3007 310839 -82926 -205672
11412b05672A16327C8611b26235A76486B601L55098c2651H076K7200a98291K214
$$ -205672 116327 38611 -226235 176486 2601 357699 -32651 8076 35276 -198291 -196077
11401a96077K5668f671j97337B72673B0439N4665a97741E2517L46457A28735l7608
$$ -196077 -170409 -6671 -204008 272673 20439 75104 -197741 52517 398974 128735 91127
11390I1127b07194j49468a63311a6003B50221b27830A26862a65717D50635B20838
$$ 91127 -207194 -356662 -163311 -16003 250221 -227830 126862 -165717 450635 220838
11379c527A7043B118h9076a4744O905A52490O8999b00781A44007c4158F6552a6113
$$ -3527 17043 2118 -89076 -14744 -7839 152490 221489 -200781 144007 -34158 66552 -16113
11366a21768A7090a05032H6527a94001n9733K9555b3939l80746G3532L77965A07481
$$ -121768 17090 -105032 86527 -194001 -253734 -224179 -23939 -404685 73532 451497 107481
11354B15671d25747A48901C6022a1795A99614k4327e9895D6482J57193m8527F9674
$$ 215671 -425747 148901 36022 -11795 199614 175287 -59895 46482 203675 155148 69674
11342D44477A20275a76836r101E7724a85825F7925N2072d5140C57288A40656h1436
$$ 444477 120275 -176836 -185937 57724 -185825 67925 119997 -45140 357288 140656 -81436
11330b077A14865a34534K4938n8193k9409b5416B21142f6023C1948b78264A56238
$$ -2077 114865 -134534 -109596 -167789 -197198 -25416 221142 -66023 31948 -278264 156238
11318G8951c4691H3748C4906b11235A39776K92396a21322A35574a72429M982c1460
$$ 78951 -34691 83748 34906 -211235 139776 432172 -121322 135574 -172429 -167447 -31460
11306A15394K7708N725d48607a53108k32041E8877N4384a27302L4611a1937k55328
$$ 115394 143102 148827 -448607 -153108 -385149 58877 113261 -127302 -92691 -11937 -267265
11295b67265P6674A869b81120a34386l8312j63533a08852j25115A65517a60371
$$ -267265 -190591 1869 -281120 -134386 -172698 -336231 -108852 -233967 165517 -160371
11284a69270e1692j77059k2117A43770c8582k53010A57054J77617A39209b76950
$$ -169270 -51692 -228751 -250868 143770 -38582 -291592 157054 334671 139209 -276950
11273F9017a88334C5660e3184B6072c3312d617A00911f0799C8500N9177J08911
$$ 69017 -188334 35660 -53184 26072 -33312 -4617 100911 -60799 38500 97677 206588
11262B06588F321f9808m397D9115J10415J62624A8458K18706H6031a13861C4818
$$ 206588 6321 -69808 -74205 49115 159530 322154 18458 237164 86031 -113861 34818
11250b87143C1878b14264j16789J38906C54815b51073D9177b42221N3081j8031
$$ -287143 31878 -214264 -331053 -192147 354815 -251073 49177 -242221 -189140 -207171
11240b07171A47207J07247a46065N1652c8522o6902A49401d1216k28647J29609
$$ -207171 147207 254454 -146065 -94413 -38522 -105424 149401 -41216 -269863 -140254
11230a40254I1794J48970A06472D7332a1837B17018a03210L9949B09759b65597
$$ -140254 91794 240764 106472 47332 -11837 217018 -103210 -63261 209759 -265597
11219f5553K2398G8030c5298m35295e4926j34688j90665B59286q5539p3229R7427
$$ -65553 -43155 78030 -35298 -470593 -54926 -189614 -380279 259286 173747 100518 197945
11208A97945d1796I5990Q553a79116m5505O5930H02L64K19446b36663i247H8533
$$ 197945 -41796 95990 104543 -179116 -224621 -158691 802 1166 220612 -236663 -9247 88533
11195c98135J83068A6196b6408H8813i4606j64318q7681A5221f1365A74630m6215
$$ -398135 -215067 16196 -26408 88813 -94606 -258924 -346605 15221 -61365 174630 128415
11184A28415b29050B91145A20360h0064J8368B45200I7174J75123p0800b27285
$$ 128415 -229050 291145 120360 -80064 -61696 245200 97174 272297 201497 -227285
11173B8508A0049a03899j757D4459a16393a107B3991a97037g4259k82b8613j12476
$$ 28508 10049 -103899 -105656 44459 -116393 -1107 23991 -197037 -74259 -74541 -28613 -141089
11161a41089p6943G3142M06672A31652c99017J11382b9015j2145A27593b4652
$$ -141089 -218032 73142 479814 131652 -399017 -287635 -29015 -41160 127593 -24652
11150a05471M2239j06510r8948d1915E24023e4682a6318l39524a14317d4775l987
$$ -105471 -63232 -169742 -268690 -41915 524023 -54682 -16318 -355842 -114317 -44775 -48762
11139d8762E7135K6015f7803j18253c4840j86552h300A18983a50406A04018a21103
$$ -48762 57135 83150 -67803 -186056 -34840 -221392 -8300 118983 -150406 104018 -121103
11127b73220D35893A01539J75468k3494d814D78011g3821C06189c51824a29317
$$ -273220 435893 101539 277007 253513 -4814 478011 -73821 306189 -351824 -129317
11116a9096C669e4181B02227K30063a80303A43124B3442b33504i1876m7794L4460
$$ -19096 3669 -54181 202227 432290 -180303 143124 23442 -233504 -91876 -139670 -105210
11105a05210A88288b05797F8497a13309b6000j37798E218L56464j76416c8797
$$ -105210 188288 -205797 68497 -113309 -26000 -163798 5218 361682 185266 -38797
11094a46370B15838D0574J07500K59543j59134a10783B48680q0933k5696N4620
$$ -146370 215838 40574 148074 407617 248483 -110783 248680 167747 142051 196671
11084A96671a27619C07801j32699A5533D172J78697O484O593R4003b0650B73634
$$ 196671 -127619 307801 175102 15533 4172 182869 189353 195946 289949 -20650 273634
11072C35902j47340N0674K04264j08670m439k2784N6351r3277K61863q6890Q2272
$$ 335902 188562 239236 443500 334830 330391 307607 363958 270681 532544 445654 527926
11061E27926r3401j3706Q7932J10637k68199J51006j95883M93797N8343l35628
$$ 527926 434525 420819 508751 619388 351189 502195 306312 800109 858452 522824
11051E22824k3639Q1839L35645C20129M81761j18666J1774J50001l49406L62360
$$ 522824 499185 581024 916669 320129 801890 683224 694998 844999 495593 857953
11041H57953n2830j68021J30446k943l56759O05022E03302k3230J22730j92442
$$ 857953 805123 637102 767548 764605 407846 1012868 503302 480072 602802 410360
11031D10360J35543q7058K79791J30337l12236J98549r5841K19425k94006M1069
$$ 410360 545903 458845 738636 868973 556737 755286 659445 878870 584864 625933
11021F25933j21159K2619J26734j16371K42257j81528J9576N27984D17519P3661
$$ 625933 504774 527393 654127 537756 780013 598485 618061 1146045 417519 491180
11011D91180Q8350k0561l6834J80349k61727L57749j88170k85085K00800L48936
$$ 491180 579530 558969 522135 702484 440757 798506 610336 325251 526051 874987
11001H74987C90506K40768Q4485C45085L16193j44141j8676L18746C73143M81055
$$ 874987 390506 631274 715759 345085 661278 517137 498461 817207 373143 854198
10991H54198l20128L39543k74791L56145k00012k8058M80675r2204l30731N56774
$$ 854198 534070 873613 598822 954967 754955 726897 1207572 1115368 784637 1341411
10981A341411k07431o5336R6990K14809L98880K8857J38527N38773l19985M54814
$$ 1341411 1133980 1068644 1165634 1380443 1779323 1808180 1946707 2485480 2165495 2620309
10971B620309J85230j98179m7571K02598l22145k70123P8531k68121k10825m39712
$$ 2620309 2805539 2607360 2559789 2762387 2440242 2170119 2248650 1980529 1769704 1329992
10961A329992L50124K09206k42963M4015J00614l27564M36560o60784J36291k59089
$$ 1329992 1680116 1889322 1646359 1690374 1790988 1463424 1899984 1239200 1375491 1116402
10951A116402l30424l3762o1886k08924j394j8221J15090B23091M40097B30274
$$ 1116402 785978 752216 690330 481406 480012 461791 576881 223091 663188 230274
10940A38435O7567O2049e4300A42972d2490B04887p2725q138K4950a72801F3572
$$ 138435 206002 268051 -54300 142972 -42490 204887 132162 124024 148974 -172801 63572
10928b188B4526N8322J20077J56643I6664a917r6821E6937g1181j85034E9674
$$ -2188 24526 82848 202925 359568 96664 -1917 -98738 56937 -71181 -256215 59674
10916a35819J3649b9199j31084A71236a36611F8544J00175c3324n1143B09758
$$ -135819 -122170 -29199 -160283 171236 -136611 68544 168719 -33324 -84467 209758
10905A65637b3318A21395b13677a03745r6874h4521A58264i9889B7795f969A15204
$$ 165637 -23318 121395 -213677 -103745 -200619 -84521 158264 -99889 27795 -6969 115204
10893A12871a66637B03264K92026a48352q5400J1840m9369d2835M841q9463h443
$$ 112871 -166637 203264 495290 -148352 -233752 -221912 -271281 -42835 -37994 -127457 -8443
10881g9368j33859f543k02979A58339D5798h5242b3571j76020A24100a90508C17247
$$ -79368 -213227 -6543 -209522 158339 45798 -85242 -23571 -199591 124100 -190508 317247
10869a23782K0111j29328e5438A97449b04030D1974e24537g7793k54718h8468
$$ -123782 -103671 -232999 -55438 197449 -204030 41974 -524537 -77793 -332511 -88468
10858b15029f3997j00673A5502E732O676a14175F3823K77902g1933D98365d64855
$$ -215029 -63997 -164670 15502 5732 12408 -114175 63823 341725 -71933 498365 -464855
10846i864E5236b99677B85147H7077j8594d3239H6645L37055A58081o188b24447
$$ -9864 55236 -299677 285147 87077 68483 -43239 86645 423700 158081 151893 -224447
10834B29267A13810R5787i2526B23756G5378K2449b32668A73925a2200C19160
$$ 229267 113810 209597 -92526 223756 75378 97827 -232668 173925 -12200 319160
10823B16866J876c8043C33941b80071i3407k44204P4061R8721A5541L3670L0491
$$ 216866 218742 -38043 333941 -280071 -93407 -337611 -263550 -164829 15541 49211 79702
10812G9702c11467C3929e60763d3518F9103A2623b33117k5757b1803A08163J27564
$$ 79702 -311467 33929 -560763 -43518 69103 12623 -233117 -258874 -21803 108163 235727
10801B35727O5692b75609b5874A46538a23775I1924b22627G7326i5056B743K41631
$$ 235727 301419 -275609 -25874 146538 -123775 91924 -222627 77326 -95056 2743 244374
10790B44374I4130a76379B9519b20440F6733j8203c2379I002P7588J11884e0494
$$ 244374 94130 -176379 29519 -220440 66733 48530 -32379 9002 86590 198474 -50494
10778g3592j47236k2785a8746M940k47394A48029b49187A26899b54723C6795c31809
$$ -73592 -220828 -243613 -18746 -13806 -261200 148029 -249187 126899 -254723 36795 -331809
10766a94792l54563a61905e6792C8521a00161B0422a19287A01066m5025e5807
$$ -194792 -549355 -161905 -56792 38521 -100161 20422 -119287 101066 56041 -55807
10755a69705e5031a9073B82785B7412K85510j4944O6830A1469D259g1960D0447
$$ -169705 -55031 -19073 282785 27412 312922 297978 364808 11469 4259 -71960 40447
10743a16795D6513b63538o1161a24650E2414d32126c3186A22992J31859r4172
$$ -116795 46513 -263538 -324699 -124650 52414 -432126 -33186 122992 254851 160679
10733A60679J9338l2893Q4536i7735B52028A25658J01304D5927J44557l4451A2040
$$ 160679 180017 147124 231660 -97735 252028 125658 226962 45927 190484 156033 12040
10721d8634j82966j25535H0310J27364h2707B13436D8073a16527a5327F1673a30561
$$ -48634 -231600 -357135 80310 207674 -82707 213436 48073 -116527 -15327 61673 -130561
10709e75B47957c50047J53256G1298L0047a5404m9249a4264E0415g9488A9273
$$ -575 247957 -350047 -196791 71298 101345 -15404 -64653 -14264 50415 -79488 19273
10697H8778K2384a57493c5228A3100c3581A56181a50656n1417H9248N790C9694
$$ 88778 111162 -157493 -35228 13100 -33581 156181 -150656 -202073 89248 95038 39694
10685b31578h5193M0177k9439a2560j8332r1181i133k86045a29913q3506A41669
$$ -231578 -85193 -45016 -74455 -12560 -30892 -122073 -9133 -295178 -129913 -213419 141669
10673b04612g710H0272A8510a54345A33662a75920A81638g1567B27591a36274
$$ -204612 -7710 80272 18510 -154345 133662 -175920 181638 -71567 227591 -136274
10662E7554B3919a62878M5189B79256a37468d2151l4223k24693f517l50958A1210
$$ 57554 23919 -162878 -117689 279256 -137468 -42151 -76374 -301067 -6517 -357475 11210
10650B04237c03374B57301g4837k5774C4427b37101A33877d3922n4201l13693
$$ 204237 -303374 257301 -74837 -100611 34427 -237101 133877 -43922 -98123 -411816
10640d11816I2369N2222m6781k1645a67444f4010A43620a31257B14467b46906
$$ -411816 92369 144591 97810 76165 -167444 -64010 143620 -131257 214467 -246906
10629D1359K84583a83384Q6766c4916j88068d6109k80373J51317e9386i46B18966
$$ 41359 325942 -183384 -96618 -34916 -222984 -46109 -326482 -175165 -59386 -946 218966
10617A23840b15518C045a14823B01722F6609b10368R7921A8664b46602G2058c06657
$$ 123840 -215518 3045 -114823 201722 66609 -210368 -112447 18664 -246602 72058 -306657
10605A68881H195g2074j09857j37622h314n5222p9468k8341e2979L087k7918L6702
$$ 168881 8195 -72074 -181931 -319553 -8314 -63536 -143004 -171345 -52979 -49892 -77810 -41108
10593d1108C4927a57419G2345b18898E0430a61551C5515J38059f14E498a65216
$$ -41108 34927 -157419 72345 -218898 50430 -161551 35515 173574 -614 5498 -165216
10581b37398b8174j61275o4506d8877J4368H8292b9624j08064j65237A11406b36958
$$ -237398 -28174 -189449 -253955 -48877 -34509 88292 -29624 -137688 -302925 111406 -236958
10569c5925p6262a9048A86214E7599Q1333b3996A305e8223I2985e9872i810n9528
$$ -35925 -112187 -19048 186214 57599 138932 -23996 1305 -58223 92985 -59872 -9810 -69338
10557f9338K7928r9252I5067c16183g9339B42329c59191a17822Q033D8432Q31
$$ -69338 -41410 -140662 95067 -316183 -79339 242329 -359191 -117822 -109789 48432 49263
10546D9263b9236k36217J22445g463I6431a47513A52018a0842A03470f9575F7501
$$ 49263 -29236 -265453 -143008 -7463 96431 -147513 152018 -10842 103470 -69575 67501
10534B10511A7256L13467A50476F0819b59870A51723a78801A47723o6222Q5614
$$ 210511 17256 330723 150476 60819 -259870 151723 -178801 147723 81501 167115
10524A67115b4847l99532A93774a5788j67313J856M8263C3227K17557c2783j94883
$$ 167115 -24847 -424379 193774 -15788 -183101 -181245 -132982 33227 250784 -32783 -227666
10513b27666H662J63844b21628H307a95527f9903c3460L374C0216N2188a55960
$$ -227666 8662 172506 -221628 8307 -195527 -69903 -33460 -30086 30216 82404 -155960
10501A9425a25884C5837L3789Q1547c16462D7912b96632J6784e8213I5417d2148
$$ 19425 -125884 35837 69626 151173 -316462 47912 -296632 -279848 -58213 95417 -42148
10489F8801J6340c42323a28305H5983C9733b89637H3522L96469J0253O8361A08544
$$ 68801 85141 -342323 -128305 85983 39733 -289637 83522 479991 490244 558605 108544
10477C09226G6967e755D3411N9625b94178A40295n5191a19220d7127B4633h519
$$ 309226 76967 -5755 43411 103036 -294178 140295 85104 -119220 -47127 24633 -8519
10465a7031j61380A11774c52784a22178D36861h3586p8858e7031C25654b90630
$$ -17031 -178411 111774 -352784 -122178 436861 -83586 -162444 -57031 325654 -290630
10454B80645b18068g6030B72237b74463f0722I7327j5917K9957f8875C06081f1415
$$ 280645 -218068 -76030 272237 -274463 -60722 97327 81410 111367 -68875 306081 -61415
10442B25847a71976j25883A60540b309j80003g382A13652b28750o9579B6942b14722
$$ 225847 -171976 -297859 160540 -2309 -182312 -7382 113652 -228750 -298329 26942 -214722
10430D14652h2256l18932B68607a37186A78853o4354b1184G2090K1914d6300C91487
$$ 414652 -82256 -401188 268607 -137186 178853 114499 -21184 72090 94004 -46300 391487
10418A49574C7116K60977i2260A44938b5048H4088c4719k16997d2968j9012A39611
$$ 149574 37116 298093 -92260 144938 -25048 84088 -34719 -251716 -42968 -61980 139611
10406B81040A00972R8561J47528R471h1525j0781A21986a03296C76410a67943
$$ 281040 100972 199533 347061 356532 -81525 -92306 121986 -103296 376410 -167943
10395a10457D17785a06729C24331a7549B06636e5057j5266c3547B92632A41184
$$ -110457 417785 -106729 324331 -17549 206636 -55057 -70323 -33547 292632 141184
10384G8044J60090J28234j20690b4635A19590J04397a03595C50505A32450a0676
$$ 78044 238134 366368 245678 -24635 119590 223987 -103595 350505 132450 -10676
10373C28310A7171a7212C02494E9678K85263A44600L83210M4570B41010p6657
$$ 328310 17171 -17212 302494 59678 344941 144600 527810 572380 241010 164353
10363A64353J50463r1331F0740B9583J45327l6357H117a3857B27157R1280j18113
$$ 164353 314816 223485 60740 29583 174910 138553 8117 -13857 227157 318437 200324
10352B00324J24022N003J20611j94943J75317a72922C11604b7724A37214K7104
$$ 200324 324346 329349 449960 255017 430334 -172922 311604 -27724 137214 164318
10342A64318J04007J15139J06172j80486J1936I9496J72794K27787d25725B85767
$$ 164318 268325 383464 489636 309150 321086 99496 272290 500077 -425725 285767
10331a33171e2164A92592o1787H869a18555H9728a04609I6889P1285j657Q0598
$$ -133171 -52164 192592 130805 8869 -118555 89728 -104609 96889 168174 166517 247115
10320B47115b80834A60637F2583a13664A40340R8938a03761A46836Q50A7542a11152
$$ 247115 -280834 160637 62583 -113664 140340 239278 -103761 146836 147686 17542 -111152
10308a39218e9332j56354A44857p1328p263b16473J4942d9711F6154a89232h0477
$$ -139218 -59332 -215686 144857 73529 66266 -216473 -201531 -49711 66154 -189232 -80477
10296E6344J66257a8509j70338Q0236B56013b62394A25174i6003A9021J97796
$$ 56344 222601 -18509 -188847 -108611 256013 -262394 125174 -96003 19021 216817
10286B16817A2665f4608l4345j1013H5025J27548a14534H9101D3903a59697g4781
$$ 216817 12665 -64608 -98953 -109966 85025 212573 -114534 89101 43903 -159697 -74781
10274C31314a33555d4724j42065A37022j0020F1346J02303a61464H3857J20944
$$ 331314 -133555 -44724 -186789 137022 127002 61346 163649 -161464 83857 204801
10264B04801a50311F2257b9963C55740r4418J46136m5264K1036n3732k5166b30095
$$ 204801 -150311 62257 -29963 355740 261322 407458 362194 383230 329498 304332 -230095
10252B81266a43380O9555A6193f7518F1978g9492A12134Q1224b34661g35B34908
$$ 281266 -143380 -73825 16193 -67518 61978 -79492 112134 193358 -234661 -735 234908
10240b87437e8109B59563a62123f9347A02385f5026I0094K565P3286a66030k9327
$$ -287437 -58109 259563 -162123 -69347 102385 -65026 90094 92659 165945 -166030 -195357
10229a95357N164M9714c7198k57079g8198D3228J12047P0898a64906B0748e2885
$$ -195357 -190193 -140479 -37198 -294277 -78198 43228 155275 226173 -164906 20748 -52885
10217d87637a38227k94024J17578a33986j22662O3474F8397a88163A2615J09622
$$ -487637 -138227 -432251 -314673 -133986 -256648 -193174 68397 -188163 12615 122237
10207A22237C2548b23031B10441b2725k18768b7281k49367A39193A4404a9110
$$ 122237 32548 -223031 210441 -22725 -241493 -27281 -276648 139193 14404 -19110
10196A8244E451b57237D6610a9911k51354B5530f6671H3842c03983J33187c1333
$$ 18244 5451 -257237 46610 -19911 -271265 25530 -66671 83842 -303983 -170796 -31333
10184g060j79154J7571B47517a58234F6303A8704a18364d3323n3584J2909L8057
$$ -7060 -186214 -168643 247517 -158234 66303 18704 -118364 -43323 -96907 -83998 -45941
10173d5941G6728i8097k64918a6589F1682b17034P3982B03466a64217m7234Q9462
$$ -45941 76728 -98097 -363015 -16589 61682 -217034 -143052 203466 -164217 -211451 -121989
10162a21989L5386B729a39125K7405A0209c22113D4777f7175c643m9424j75227
$$ -121989 -86603 2729 -139125 -111720 10209 -322113 44777 -67175 -3643 -53067 -228294
10151b28294n736d028I2560e0637L792e807C18151b6836o2884A70079g4264A2565
$$ -228294 -234030 -4028 92560 -50637 -46845 -5807 318151 -26836 -89720 170079 -74264 12565
10138h2676j25983C8117c05218c4961j31462b858H6852b43978A26950g0674l83086
$$ -82676 -208659 38117 -305218 -34961 -166423 -2858 86852 -243978 126950 -70674 -453760
10127d53760C78392c13989b5313m0357l21413J79221O1225C83801b05832k65301
$$ -453760 378392 -313989 -25313 -65670 -387083 -207862 -146637 383801 -205832 -471133
10117d71133a67922l8028g9942A48217e2854C06906C5317M7954B5120a11179A60272
$$ -471133 -167922 -205950 -79942 148217 -52854 306906 35317 83271 25120 -111179 160272
10105A12277c02891G1862i9927j86958d7947B97307d1614k5705m503B84435A23094
$$ 112277 -302891 71862 -99927 -286885 -47947 297307 -41614 -67319 -71822 284435 123094
10093C3521a28126A631M2788b29049B5994e9765j75579a01245k77240B17173f738
$$ 33521 -128126 1631 44419 -229049 25994 -59765 -235344 -101245 -378485 217173 -6738
10081g5399k39498b6363j71653P5677B22294i9744B1657b70700J3823e518A00697
$$ -75399 -314897 -26363 -198016 -122339 222294 -99744 21657 -270700 -256877 -5518 100697
10069c3974j43871O0038A58264N928H0645J36242d29380A1563M9660l746a9291
$$ -33974 -177845 -117807 158264 164192 80645 216887 -429380 11563 61223 57477 -19291
10057B52467c49465J58509Q7830l8158P0118p4619A06438m2346h9910A05105J1125
$$ 252467 -349465 -190956 -103126 -141284 -71166 -145785 106438 64092 -89910 105105 116230
10046A16230L2856a8668A26080g9497L7203k23035J17902c8441B10183b77366
$$ 116230 149086 -18668 126080 -79497 -42294 -265329 -147427 -38441 210183 -277366
10035A71182E597h0573o1476k35795J72075L5118k19409M2944h8326j26505A89093
$$ 171182 5597 -80573 -142049 -377844 -205769 -170651 -390060 -347116 -88326 -214831 189093
10023c11323a55571j35846A44130b06746g801k40436l2993I2849a5048D04113
$$ -311323 -155571 -291417 144130 -206746 -7801 -248237 -281230 92849 -15048 404113
10012b159B3324h9928E5117k421g8851j27666Q9289j1326B29354C3353a21755
$$ -2159 23324 -89928 55117 52696 -78851 -206517 -117228 -128554 229354 33353 -121755
10000H9506J92337r9826n7980a09923F2464L5065d03775A71466a88969I6995c347
$$ 89506 281843 182017 124037 -109923 62464 97529 -403775 171466 -188969 96995 -3347
9988A19391a1351j12487J3306A6818c6975A86235C6760b85690a41818M3132K1177
$$ 119391 -11351 -123838 -110532 16818 -36975 186235 36760 -285690 -141818 -98686 -77509
9977g7509k89066e6017I5421b50594h6231A23599a72439I7462a90022H0154h4457
$$ -77509 -366575 -56017 95421 -250594 -86231 123599 -172439 97462 -190022 80154 -84457
9965a06330A16134d82602A4370D109N3331e1397j6972A76728b65691A41536c09003
$$ -106330 116134 -482602 14370 4109 57440 -51397 -68369 176728 -265691 141536 -309003
9953g4223j68442n0075N0398a19940d8712r7662B1366b9741j1422k8255n6041
$$ -74223 -242665 -292740 -242342 -119940 -48712 -146374 21366 -29741 -41163 -69418 -125459
9942a25459k8168l5201h35A58811d9212B29839a55441j74728a46810B01941a2259
$$ -125459 -153627 -188828 -835 158811 -49212 229839 -155441 -330169 -146810 201941 -12259
9930i5616I8323b71306b2417A91983f576B70832c8200B4537f8295k47687J02347
$$ -95616 98323 -271306 -22417 191983 -6576 270832 -38200 24537 -68295 -315982 -213635
9919b13635j18553a16987r4399e8058n2350A05690a40036j20642f2171A46771
$$ -213635 -332188 -116987 -211386 -58058 -110408 105690 -140036 -260678 -62171 146771
9908c01244b4390j21392M6269j36170a7703k80453h8890l3991K6204k91817i059
$$ -301244 -24390 -145782 -99513 -235683 -17703 -298156 -88890 -122881 -96677 -388494 -9059
9896a95828I7067k2505a86185e2153j22834M0414L4137A26653e4190j04687f2699
$$ -195828 97067 74562 -186185 -52153 -174987 -134573 -100436 126653 -54190 -158877 -62699
9884F0520e5521j85525E8024c6572p986j90257b6662j87268G9868c1427j51505
$$ 60520 -55521 -241046 58024 -36572 -44558 -234815 -26662 -213930 79868 -31427 -182932
9873a82932Q8283k09498a8084A59109N3072a40865l5900j7429A81299g9006n1310
$$ -182932 -94649 -304147 -18084 159109 212181 -140865 -176765 -194194 181299 -79006 -130316
9862a30316N958A28654g0707B0746K0058J7806a97957A54178C0914a74159O8502
$$ -130316 -124358 128654 -70707 20746 40804 58610 -197957 154178 30914 -174159 -105657
9851a05657G8266a0298a03I5933g9209K9194m7433E1365f6140A88811b61093P9661
$$ -105657 78266 -10298 -103 95933 -79209 -50015 -97448 51365 -66140 188811 -261093 -181432
9839a81432j17184F9318a023j33908H6225c02757P4307B92112f4206M787m5404
$$ -181432 -298616 69318 -1023 -134931 86225 -302757 -228450 292112 -64206 -59419 -104823
9828a04823b6096B09124e0773j23617e4080C02833j49232d38411h0511o4015k818
$$ -104823 -26096 209124 -50773 -174390 -54080 302833 153601 -438411 -80511 -144526 -147344
9817a47344A55368b30748A29039a54825L1652E6735a79881A53828C6989J10113
$$ -147344 155368 -230748 129039 -154825 -123173 56735 -179881 153828 36989 147102
9807A47102K42207d22653J87097k15358A23480a67409l0730E6567L0045c09217
$$ 147102 389309 -422653 -235556 -450914 123480 -167409 -198139 56567 86612 -309217
9796a78774n8333i1438j42753J15050K7060j20656c5979j23362A54390c49210
$$ -178774 -237107 -91438 -234191 -119141 -92081 -212737 -35979 -159341 154390 -349210
9785a5487j23395A670a68170B6810b96738N2985A39689a02901j42964a6140j77289
$$ -15487 -138882 1670 -168170 26810 -296738 -243753 139689 -102901 -245865 -16140 -193429
9774a93429o9859E5098b25061e4016C043b54062e8576B36280k4431A00702i4028
$$ -193429 -263288 55098 -225061 -54016 3043 -254062 -58576 236280 211849 100702 -94028
9762c2216D9220b54757A55336a09674A79963D2237K1460R7206c15145C23936b08138
$$ -32216 49220 -254757 155336 -109674 179963 42237 63697 160903 -315145 323936 -208138
9750a13336a6079q787r6491H840b53580f5341B45746l1304I10c40984M5908e8532
$$ -113336 -16079 -24866 -121357 8840 -253580 -65341 245746 214442 910 -340984 -295076 -58532
9737b23312A76453R0885c0053j8793D4472k0248b88634c8502B19025a4373l94918
$$ -223312 176453 267338 -30053 -48846 44472 24224 -288634 -38502 219025 -14373 -409291
9726d09291J01272a1625L842j93607B6659a57687f1859k62846A1790L4899a3421
$$ -409291 -308019 -11625 -7783 -201390 26659 -157687 -61859 -324705 11790 46689 -13421
9714d37587e4245C52696g5965k5480r9878G6577A8886d1227i751a400H8880h8263
$$ -437587 -54245 352696 -75965 -101445 -201323 76577 18886 -41227 -9751 -1400 88880 -88263
9701H554c7702A29294g3052C0669l875c33955A38551d8037p6211A44182b00200
$$ 8554 -37702 129294 -73052 30669 26794 -333955 138551 -48037 -124248 144182 -200200
9689b23047A79544N0721a72180D2166a38162H1006a58522B8963J53014a39070
$$ -223047 179544 230265 -172180 42166 -138162 81006 -158522 28963 181977 -139070
9678B66138a75126p1470l08735e7197J6252k52023g2335J6317I7654g3647A12820
$$ 266138 -175126 -246596 -555331 -57197 -40945 -292968 -72335 -56018 97654 -73647 112820
9666D489c5788I434K71384a41000f4628l35397J40985A68953m4335c06416F2256
$$ 4489 -35788 9434 280818 -141000 -64628 -400025 -259040 168953 124618 -306416 62256
9654h0618I0866C0021L2276g6633F3632G891i4556C5519g0565k1724a964j30337
$$ -80618 90866 30021 62297 -76633 63632 7891 -94556 35519 -70565 -92289 -1964 -132301
9642a32301p9626R2307j63394A02548J45570a64376B4352Q8296a34850r1384O312
$$ -132301 -211927 -119620 -283014 102548 248118 -164376 24352 112648 -134850 -226234 -219922
9631b19922k1934a19094A70180k5401P3154G6178a95881A05184f3853l1269a1974
$$ -219922 -241856 -119094 170180 144779 217933 76178 -195881 105184 -63853 -95122 -11974
9619d3749A65128a52586d665o3950I570P339J4321j0441J1804R5586E6221b55577
$$ -43749 165128 -152586 -4665 -68615 9570 16909 31230 20789 32593 128179 56221 -255577
9606C30628a03300B44981b22996f0434I3881a44583A24393e28476A30798a78879
$$ 330628 -103300 244981 -222996 -60434 93881 -144583 124393 -528476 130798 -178879
9595A42420a6101k833A75166a50339n1644A13615A86a1935n1597j6168B551N0129
$$ 142420 -16101 -18934 175166 -150339 -201983 113615 186 -11935 -63532 -79700 2551 52680
9583E2680a34803C1006g6059K7256A73594k7772b69713a0918k15084B04464E1599
$$ 52680 -134803 31006 -76059 -48803 173594 145822 -269713 -10918 -226002 204464 51599
9571f9154C87955b54270i3099D03O5169A6769a87092H6920l5235g4806A9809a17053
$$ -69154 387955 -254270 -93099 403 65572 16769 -187092 86920 51685 -74806 19809 -117053
9558C9141c54026G2684a01377b5874j65935A14375B780d63307Q0334J00420B69656
$$ 39141 -354026 72684 -101377 -25874 -191809 114375 2780 -463307 -382973 -282553 269656
9546A92373k1034b18910b4766A34741b13211j2260b2382B28787b8801k6165A60534
$$ 192373 171339 -218910 -24766 134741 -213211 -225471 -22382 228787 -28801 -54966 160534
9534G9157f003j89560n0328B21462b34253C9757b05401N8888k49718J92728A961
$$ 79157 -6003 -195563 -245891 221462 -234253 39757 -205401 -146513 -396231 -203503 1961
9522E5433d08690B66270c22704f4328C02854C9037a89082F9335I014b87588H3330
$$ 55433 -408690 266270 -322704 -64328 302854 39037 -189082 69335 9014 -287588 83330
9510b01998N0383j36452e9112j40978C9894r709a31741E966J30129b31880B12116
$$ -201998 -151615 -288067 -59112 -200090 39894 30185 -131741 5966 136095 -231880 212116
9498A2625h8056J6244J1889A50852b37723F2783d3308A75985M1389b25450g4687
$$ 12625 -88056 -71812 -59923 150852 -237723 62783 -43308 175985 217374 -225450 -74687
9486B27840F6634g78r0773q8762I8762L8070c5142j07201j47126P0303h3857H5687
$$ 227840 66634 -778 -91551 -180313 98762 136832 -35142 -142343 -289469 -219166 -83857 85687
9473c14087B60407b54897F0093a40627O3190F8749b89828d3634k81684I8776A5129
$$ -314087 260407 -254897 60093 -140627 -77437 68749 -289828 -43634 -325318 98776 15129
9461A15752J42745m3809J06450G414K7774i6310l0864A48645b76191c0335m08423
$$ 115752 258497 214688 321138 7414 35188 -96310 -127174 148645 -276191 -30335 -438758
9450d38758i0646a9454j20643K1507B31276E692a19991c490C5937L2531R0515
$$ -438758 -90646 -19454 -140097 -118590 231276 5692 -119991 -3490 35937 68468 158983
9439A58983D2232P8668b9688A47319b78208L0696a04855j08933r1438C8108b65750
$$ 158983 42232 120900 -29688 147319 -278208 -247512 -104855 -213788 -305226 38108 -265750
9427d8051l43241g2445C6902b94863i2240B8137b07797h7475G9248J20865a84012
$$ -48051 -391292 -72445 36902 -294863 -92240 28137 -207797 -87475 79248 200113 -184012
9415a17484C946a89805B00952i6394j27397M2646F0330J1747A2939a24541D22556
$$ -117484 3946 -189805 200952 -96394 -223791 -181145 60330 72077 12939 -124541 422556
9403b84828j14741J88190L4504k60199K16086j6559G5910a50853j08866L0212
$$ -284828 -399569 -211379 -176875 -437074 -220988 -237547 75910 -150853 -259719 -229507
9393b29507A8593b82746D6157J23327b76743J14257H7810a86987O8100p1689B34072
$$ -229507 18593 -282746 46157 169484 -276743 -162486 87810 -186987 -118887 -190576 234072
9381C1846J59169e4592l5952P783A46783b3361j7651j28818e9600j77213D1937
$$ 31846 191015 -54592 -90544 -82761 146783 -23361 -41012 -169830 -59600 -236813 41937
9369b89113A47640c0151A85056b5667o5603j64819h2965k14851j1143i502j14081
$$ -289113 147640 -30151 185056 -25667 -91270 -256089 -82965 -297816 -308959 -9502 -123583
9358a23583B41157A4032K98314a09207j10948i1694A59624a4046e103j82805A96630
$$ -123583 241157 14032 312346 -109207 -220155 -91694 159624 -14046 -5103 -187908 196630
9346A06120d3185C6460a43339B79490D4636J4226a75968B52864d96003B3772a65080
$$ 106120 -43185 36460 -143339 279490 44636 58862 -175968 252864 -496003 23772 -165080
9334A99181a4411l8885l4148A6946E07a38593c519j02338q5194m128B4837a46005
$$ 199181 -14411 -53296 -87444 16946 507 -138593 -3519 -105857 -191051 -195179 24837 -146005
9321b2221A7640c10514f018q1143k55053A68334m3538e28880c5605j30246A28601
$$ -22221 17640 -310514 -6018 -87161 -342214 168334 124796 -528880 -35605 -165851 128601
9309A6260a52654b1130G4589a81958g7616k24405a29928A85480b04407A90541
$$ 16260 -152654 -21130 74589 -181958 -77616 -302021 -129928 185480 -204407 190541
9298I1436J33414b93339a23028n9355j04823a37443F8719c27529J44080G1241
$$ 91436 224850 -293339 -123028 -182383 -287206 -137443 68719 -327529 -183449 71241
9287F7218a67379B45393H1919a9455k84227a33614C466Q2257i6505A07111N1656
$$ 67218 -167379 245393 81919 -19455 -303682 -133614 3466 85723 -96505 107111 158767
9276A58767f6899E4425K93911e0527G7334i9861j06500F4458a35272m5862e4875
$$ 158767 -66899 54425 348336 -50527 77334 -99861 -206361 64458 -135272 -181134 -54875
9264b06982C45176b33387B86711c27141J07934i9988C6151b5324k60320g1205
$$ -206982 345176 -233387 286711 -327141 -219207 -99988 36151 -25324 -285644 -71205
9253a37435B07609A03186a63891F7307J56954d4743n5637A32352E7249c85652
$$ -137435 207609 103186 -163891 67307 224261 -44743 -100380 132352 57249 -385652
9242b60119A34890c6860G9298J32761a09054G1368e326G2853g905l42430p0797
$$ -260119 134890 -36860 79298 212059 -109054 71368 -5326 72853 -7905 -350335 -421132
9231d21132a17603j54254h8053M3694B11726I6503h0558n5j26570G467P9768b83562
$$ -421132 -117603 -271857 -88053 -44359 211726 96503 -80558 -80613 -207183 7467 87235 -283562
9218a32328A10101E3817a82491n3269C26318c63466L0703B56571b23247B9995
$$ -132328 110101 53817 -182491 -235760 326318 -363466 -332763 256571 -223247 29995
9207b11525i5637L9155H4519k885P4731b340A65461a5756C964M6820a48148D1715
$$ -211525 -95637 -56482 84519 81634 156365 -2340 165461 -15756 3964 50784 -148148 41715
9194B50510l9082r0052d8302A35444c13971j4606o1641b1336k59270J12458B68177
$$ 250510 211428 121376 -48302 135444 -313971 -328577 -390218 -21336 -280606 -168148 268177
9182a3971A68291h3425L456j75292a4923k79838l4677D3332a99647d758j75130
$$ -13971 168291 -83425 -79969 -255261 -14923 -294761 -329438 43332 -199647 -4758 -179888
9171a79888n0788B4721a70283I9778D2791J3185c14599A45531a17794b3522r877
$$ -179888 -230676 24721 -170283 99778 42791 55976 -314599 145531 -117794 -23522 -33399
9160c3399P822o5038J0952l08855a68821C716a70864D0696J32932b21029B1367
$$ -33399 -25577 -90615 -79663 -388518 -168821 3716 -170864 40696 173628 -221029 21367
9148a02048K027k51645a22607M2892F3724j3419L1198j4078e3553b0461j77704
$$ -102048 -100021 -351666 -122607 -79715 63724 50305 81503 67425 -53553 -20461 -198165
9137a98165c6971q4936l9560N6198a3643p2865j99391i1077k58348I0473N0098
$$ -198165 -36971 -121907 -161467 -105269 -13643 -86508 -285899 -91077 -349425 90473 140571
9126A40571a0359D5943i6484B45320C7425J72797a88355c7228A7195J02819K0230
$$ 140571 -10359 45943 -96484 245320 37425 210222 -188355 -37228 17195 120014 140244
9115A40244c3380l37043P5271m405A09195J2681f7634j05250j9805r9065G3159
$$ 140244 -33380 -370423 -295152 -299557 109195 121876 -67634 -172884 -192689 -291754 73159
9103c04018D1574b18582c8570D7548f8481m09842A15165a43863i378k7304l41829
$$ -304018 41574 -218582 -38570 47548 -68481 -478323 115165 -143863 -9378 -36682 -378511
9092c78511J09707a5575l60905C7660P3130a30623O3972A30135b86300f3121A47934
$$ -378511 -268804 -15575 -376480 37660 110790 -130623 -66651 130135 -286300 -63121 147934
9080A24050a87614n5801a10126k07414g0102j84985g5753B0873h2807F7421i5493
$$ 124050 -187614 -243415 -110126 -317540 -70102 -255087 -75753 20873 -82807 67421 -95493
9068c62765h8389j1420n5642F2898j8214A1961b04951I5717k9480d51755G0307
$$ -362765 -88389 -99809 -155451 62898 44684 11961 -204951 95717 66237 -451755 70307
9056f1513B34475j07368a64496b2565k3112r3784F047a99296A84586p53d79641
$$ -61513 234475 127107 -164496 -22565 -45677 -139461 6047 -199296 184586 183833 -479641
9044A17026i2940k5498k8316D4680d51966C64509C6937n101c47675a0881I5064
$$ 117026 -92940 -118438 -146754 44680 -451966 364509 36937 31836 -347675 -10881 95064
9032E8718J25503F0070a19439J3334q6631A33786e6424b6183k57210B54813a49450
$$ 58718 184221 60070 -119439 -106105 -192736 133786 -56424 -26183 -283393 254813 -149450
9020a96554Q2844A60386a86700a7300k60092a21316j43462C22595b42147A07297
$$ -196554 -113710 160386 -186700 -17300 -277392 -121316 -264778 322595 -242147 107297
9009b3715O125l5827F8075f076j16498e5795k0382K2163C81750B1831a46439a6900
$$ -23715 -17590 -53417 68075 -6076 -122574 -55795 -76177 -54014 381750 21831 -146439 -16900
8996E3742b45398I498f4970k17439G5038N7113E9166i9534D84158A20153a34755
$$ 53742 -245398 9498 -64970 -282409 75038 132151 59166 -99534 484158 120153 -134755
8984c19919B6007M2212a89486B81284j36641c58420l2711a62138k7789g6821A01824
$$ -319919 26007 68219 -189486 281284 144643 -358420 -391131 -162138 -189927 -76821 101824
8972a51006A17688a14863q5492c4450D0689a03320l7102G1873k2930b54380l0093
$$ -151006 117688 -114863 -200355 -34450 40689 -103320 -140422 71873 48943 -254380 -284473
8961b84473N9826B13483G7667l4936d30594C6404b45125J02222A52302B5069P0912
$$ -284473 -224647 213483 77667 42731 -430594 36404 -245125 -142903 152302 25069 95981
8950I5981J45052b46059N0140A23457J20744A12013c9189l51008g3229G8868j5121
$$ 95981 241033 -246059 -195919 123457 244201 112013 -39189 -390197 -73229 78868 63747
8939F3747f5686A23795c2201o8015k7585n5415H7724D1174j2566l052d30506c2890
$$ 63747 -65686 123795 -32201 -100216 -127801 -183216 87724 41174 28608 25556 -430506 -32890
8926g6086A50352b1743D42151r2646J208384j72931B89996R6444A53517k8891
$$ -76086 150352 -21743 442151 349505 1557889 1384958 289996 386440 153517 124626
8916A24626K56628r5263e95676H2372a08546A36318F4817A0738g1172m441m4357
$$ 124626 381254 285991 -595676 82372 -108546 136318 64817 10738 -71172 -75613 -119970
8905a19970C9360O0855b54747d9168k30966f0025k03249A55312c61872e1756A09579
$$ -119970 39360 100215 -254747 -49168 -280134 -60025 -263274 155312 -361872 -51756 109579
8893e6372j124k29997J02638e3386k02457j59319F9846b41571a19876F9870M056
$$ -56372 -57496 -287493 -184855 -53386 -255843 -415162 69846 -241571 -119876 69870 73926
8882G3926b2583H4547a19782I5569f7385A10205b2936A7782c92850C42505E7514
$$ 73926 -22583 84547 -119782 95569 -67385 110205 -22936 17782 -392850 342505 57514
8870d2051l20731B22995b51132P3311F8082d0984k5485F2877A4614a06270C4403
$$ -42051 -362782 222995 -251132 -177821 68082 -40984 -66469 62877 14614 -106270 34403
$$ [...]
##END NTUPLES=NMR SPECTRUM
##END=
