##TITLE=AC1450_MFUAH13259_8011800_iYNr6XPksR
##JCAMPDX= 6.0         $$ Bruker NMR JCAMP-DX V2.0
##DATA TYPE= NMR SPECTRUM
##DATA CLASS= NTUPLES
##ORIGIN= BRUKER
##OWNER= Administrator
$$ 1.72 TOPSPIN		Version 2.1
$$ 2013-07-05 18:54:23.831 -0700  Administrator@X
$$ Compression mode = diff/dup
##.OBSERVE FREQUENCY= 400.02188249412
##.OBSERVE NUCLEUS= ^1H
##.ACQUISITION MODE= SIMULTANEOUS (DQD)
##.ACQUISITION SCHEME= undefined
##.AVERAGES= 8
##.DIGITISER RES= 22
##SPECTROMETER/DATA SYSTEM= spect
##.PULSE SEQUENCE= zg30
##.SOLVENT NAME= COFFEE_meoh
##.SHIFT REFERENCE= INTERNAL, COFFEE_meoh, 1, 14.98509
##AUDIT TRAIL= $$ (NUMBER, WHEN, WHO, WHERE, PROCESS, VERSION, WHAT)
$$ ##TITLE= Audit trail, TOPSPIN		Version 2.1
$$ ##JCAMPDX= 5.01
$$ ##ORIGIN= Bruker BioSpin GmbH
$$ ##OWNER= Administrator
$$ $$ E:\/data/COFFEE/nmr/AC1450_MFUAH13259_8011800_iYNr6XPksR/10/pdata/1/auditp.txt
$$ ##AUDIT TRAIL=  $$ (NUMBER, WHEN, WHO, WHERE, PROCESS, VERSION, WHAT)
(   1,<2013-07-05 18:54:16.519 -0700>,<Administrator>,<X>,<go>,<TOPSPIN 2.1>,
      <created by zg
	started at 2013-07-05 18:53:10.566 -0700,
	POWCHK enabled, PULCHK disabled,
       configuration hash MD5:
       C8 4E 4E 5D D3 5C D8 9E 9F 52 82 E0 59 8A DE 15
       data hash MD5: 64K
       86 FA BB A9 D5 3C 85 1D E9 55 C7 41 00 52 F8 16>)
(   2,<2013-07-05 18:54:19.566 -0700>,<Administrator>,<X>,<proc1d>,<TOPSPIN 2.1>,
      <Start of raw data processing
       efp LB = 0 FT_mod = 6 PKNL = 1 PHC0 = 0 PHC1 = 0 SI = 32K 
       data hash MD5: 32K
       7D 12 62 07 00 01 FB 3D 44 C5 91 7B E6 E1 CD B1>)
(   3,<2013-07-05 18:54:19.941 -0700>,<Administrator>,<X>,<proc1d>,<TOPSPIN 2.1>,
      <pk PHC0 = 94.96033 PHC1 = 0 
       data hash MD5: 32K
       D4 B5 E3 67 85 A9 5D 9A D5 7A 9E CD 03 85 B9 C7>)
(   4,<2013-07-05 18:54:20.081 -0700>,<Administrator>,<X>,<proc1d>,<TOPSPIN 2.1>,
      <abs ABSG = 1 
       data hash MD5: 32K
       C9 A3 6D EE B5 62 66 AF 23 C7 D6 4F C7 EF A2 C2>)
(   5,<2013-07-05 18:54:20.347 -0700>,<Administrator>,<X>,<proc1d>,<TOPSPIN 2.1>,
      <abs ABSG = 2 
       data hash MD5: 32K
       65 B2 EB F0 CB 85 B3 85 F1 00 2E C9 C8 E3 D7 72>)
(   6,<2013-07-05 18:54:20.503 -0700>,<Administrator>,<X>,<proc1d>,<TOPSPIN 2.1>,
      <abs ABSG = 3 
       data hash MD5: 32K
       7F F0 FF 7F 8E 66 39 B3 99 46 56 D0 BD 3C 85 EA>)
(   7,<2013-07-05 18:54:20.581 -0700>,<Administrator>,<X>,<proc1d>,<TOPSPIN 2.1>,
      <abs ABSG = 4 
       data hash MD5: 32K
       34 D8 DE E4 B2 79 91 88 D9 10 89 66 93 04 AA 9A>)
(   8,<2013-07-05 18:54:20.644 -0700>,<Administrator>,<X>,<proc1d>,<TOPSPIN 2.1>,
      <abs ABSG = 5 
       data hash MD5: 32K
       E1 43 A8 13 43 BD 57 1E 44 B3 E5 46 8B 6C 00 A9>)
$$ ##END=
$$ 
$$ $$ hash MD5
$$ $$ 3A 77 26 81 2D 78 13 4F 6D 34 7B F9 45 0C 9D DD
##$RELAX= 
##$RELAX= 
##$RELAX= 
##$RELAX= 
##$RELAX= 
##$RELAX= 
##$RELAX= 
$$ Bruker specific parameters
$$ --------------------------
##$DU= <E:\>
##$EXPNO= 10
##$NAME= <AC1450_MFUAH13259_8011800_iYNr6XPksR>
$$ [...]
##$TP= (0..7)
150 150 150 150 150 150 150 150
##$TP07= 0
##$TPNAME0= <>
##$TPNAME1= <>
##$TPNAME2= <>
##$TPNAME3= <>
##$TPNAME4= <>
##$TPNAME5= <>
##$TPNAME6= <>
##$TPNAME7= <>
##$TPOAL= (0..7)
0.5 0.5 0.5 0.5 0.5 0.5 0.5 0.5
##$TPOFFS= (0..7)
0 0 0 0 0 0 0 0
##$TUNHIN= 0
##$TUNHOUT= 0
##$TUNXOUT= 0
##$USERA1= <user>
##$USERA2= <user>
##$USERA3= <user>
##$USERA4= <user>
##$USERA5= <user>
##$V9= 5
##$VALIST= <valist>
##$VCLIST= <CCCCCCCCCCCCCCC>
##$VD= 0
##$VDLIST= <DDDDDDDDDDDDDDD>
##$VPLIST= <PPPPPPPPPPPPPPP>
##$VTLIST= <TTTTTTTTTTTTTTT>
##$WBST= 1024
##$WBSW= 4
##$XGAIN= (0..3)
0 0 0 0
##$XL= 0
##$YL= 0
##$YMAX_a= 593638
##$YMIN_a= -505311
##$ZGOPTNS= <>
##$ZL1= 120
##$ZL2= 120
##$ZL3= 120
##$ZL4= 120
##$ABSF1= 14.98509
##$ABSF2= -5.573092
##$ABSG= 5
##$ABSL= 3
##$ALPHA= 0
##$AQORDER= 0
##$ASSFAC= 0
##$ASSFACI= 0
##$ASSFACX= 0
##$ASSWID= 0
##$AUNMP= <proc_prof1d_extract_pilot.lims>
##$AXLEFT= 0
##$AXNAME= <>
##$AXNUC= <1H>
##$AXRIGHT= 0
##$AXTYPE= 0
##$AXUNIT= <>
##$AZFE= 0.1
##$AZFW= 0.1
##$BCFW= 0
##$BC_mod= 0
##$BYTORDP= 0
##$COROFFS= 0
##$CY= 15
##$DATMOD= 1
##$DC= 0
##$DFILT= <>
##$DTYPP= 0
##$F1P= 0
##$F2P= 0
##$FCOR= 0.5
##$FTSIZE= 32768
##$FT_mod= 6
##$GAMMA= 0
##$GB= 0
##$INTBC= 1
##$INTSCL= 1
##$ISEN= 128
##$LB= 0
##$LEV0= 0
##$LPBIN= 0
##$MAXI= 10000
##$MC2= 0
##$MEAN= 0
##$ME_mod= 0
##$MI= 0
##$NCOEF= 0
##$NC_proc= -8
##$NLEV= 6
##$NOISF1= 0
##$NOISF2= 0
##$NSP= 0
##$NTH_PI= 0
##$NZP= 0
##$OFFSET= 14.98509
##$PC= 1
##$PHC0= 94.96033
##$PHC1= 0
##$PH_mod= 1
##$PKNL= yes
##$PPARMOD= 0
##$PPDIAG= 0
##$PPIPTYP= 0
##$PPMPNUM= 2147483647
##$PPRESOL= 1
##$PSCAL= 4
##$PSIGN= 0
##$PYNMP= <proc.py>
##$REVERSE= no
##$SF= 400.02
##$SI= 32768
##$SIGF1= 0
##$SIGF2= 0
##$SINO= 400
##$SIOLD= 32768
##$SPECTYP= <>
##$SREGLST= <1H.CDCl3>
##$SSB= 0
##$STSI= 32768
##$STSR= 0
##$SW_p= 8223.68421052631
##$SYMM= 0
##$S_DEV= 0
##$TDeff= 65536
##$TDoff= 0
##$TI= <>
##$TILT= no
##$TM1= 0
##$TM2= 0
##$TOPLEV= 0
##$USERP1= <user>
##$USERP2= <user>
##$USERP3= <user>
##$USERP4= <user>
##$USERP5= <user>
##$WDW= 1
##$XDIM= 32768
##$YMAX_p= 466977522
##$YMIN_p= -778561
##$CURPLOT= <Network HP LaserJet P1505>
##$CURPRIN= <$Network HP LaserJet P1505>
##$DFORMAT= <normdp>
##$LAYOUT= <+/1D_H.xwp>
##$LFORMAT= <normlp>
##$PFORMAT= <normpl>
##$SURQMSG= 1
$$ End of Bruker specific parameters
$$ ---------------------------------
##NTUPLES= NMR SPECTRUM
##VAR_NAME=  FREQUENCY,     SPECTRUM/REAL,   SPECTRUM/IMAG
##SYMBOL=    X,             R,               I
##VAR_TYPE=  INDEPENDENT,   DEPENDENT,       DEPENDENT
##VAR_FORM=  AFFN,          ASDF,            ASDF
##VAR_DIM=   32768,         32768,           32768
##UNITS=     HZ,            ARBITRARY UNITS, ARBITRARY UNITS
##FACTOR=    0.250966925370066, 1,           1
##FIRST=     8223.43324360094, -36413,       46831
##LAST=      0,             -26933,          75617
##MIN=       0,             -778561,         0
##MAX=       8223.43324360094, 466977522,    0
$$ Real data points
##PAGE= N=1
##DATA TABLE= (X++(R..R)), XYDATA
$$ [...]
$$ plain form
19532 -392158 -50937 103716 -142549 200018 61247 186523 90659 264496 -134722 131021
19521 -77732 -243033 55804 -35314 -90945 -2559 76509 -7992 -181943 -134403 -104919 -240957
19510 -240957 -222574 -163345 -43247 -166631 -142293 -144870 -1515 -180527 -159647 -31456 -138670
19499 -138670 9953 203857 211147 -52086 -244266 -100503 -166341 206056 56387 199072 -93195
19487 -71692 203352 -66907 -84553 -170016 -149135 -330348 254942 44000 -9387 -52285 -255743
19476 -255743 126928 -51671 4459 -93046 -70248 159892 233269 -12385 -355531 -92670 -221970
19465 -221970 -78170 -297611 -38855 -181208 -65531 -73822 92383 -102351 38017 217775 -249232
19453 423280 -109129 -70675 94217 144471 -325901 208698 -137331 -234894 2076 -119042 314311
$$ packed form
19532c92158e0937A03716a42549B00018F1247J25276I0659J73837a34722A31021
19521g7732j65301E5804c5314n5631b559G6509g992j73951M7540K9484j36038
19510b40957J8383N9229d3247j23384K4338k577a515j79012K0880c1456j07214
19499a38670I953J93904P290e2086j92180a00503o5838B06056E6387J42685i3195
19487g1692B03352f6907j7646q5463K0881j81213B54942D4000i387m2898k03458
19476b55743A26928e1671D459i3046K2798A59892P3377a2385l43146i2670j29300
19465b21970g8170k19441c8855j42353f5531q291I2383a02351C8017J79758b49232
19453D23280a09129L8454I4217N0254c25901B08698a37331r7563B076a19042C14311
$$ plain form
19441 -136693 32506 -420496 -219622 -268538 -92167 43210 -275147 29784 -49430 -12702 -120624
19430 -120624 111167 -4097 113798 -219140 -346282 -108378 -55271 91231 -362111 63719
19419 199550 184229 35000 -464310 -98815 112650 -183265 91992 -152627 189731 227354
19409 227354 -13694 70687 -263677 189813 -206341 193480 153138 375243 -1983 -108124
19399 -108124 -132738 -39631 -20255 -202844 440411 -27510 -354126 -25032 85258 201582 -56034
19387 -524573 -373152 -298100 -283127 41871 -176704 -56848 -62222 105804 -294416 -310057 -94580
19375 -192778 145217 -87172 -127000 -149750 292877 155815 -112516 107940 -4943 14121 -432970
19363 -121629 75838 265309 -261242 37343 119475 -110979 -36758 91192 113124 -219122 -319271
$$ packed form
19441a36693C2506d20496K00874m8916i2167D3210b75147B9784d9430a2702j07922
19430a20624A11167d097A13798b19140j27142a08378N3107I1231c62111F3719
19419A99550j5321C5000d64310i8815A12650a83265I1992a52627A89731L7623
19409B27354a3694G0687b63677A89813b06341A93480m0342K22105a983j06141
19399a08124k4614c9631J9376j82589D40411b7510l26616b5032H5258J16324e6034
19387e24573J51421P5052J4973D1871a76704e6848n374A05804b94416j5641i4580
19375a92778A45217h7172l9828k2750B92877j37062a12516A07940d943A4121d32970
19363a21629G5838J89471b61242C7343Q2132a10979c6758I1192K1932b19122j00149
$$ plain form
19352 -319271 -161446 -22695 -136626 83432 -260343 50068 165782 -281050 21518 -237179
19341 -138764 -231747 -102129 -302334 -222813 -173299 21018 -269629 -169435 -341775 39387
19330 161415 161524 -46985 70207 -237762 -259913 -187877 93481 29061 -108124 -74374 -300554
19319 -300554 -256914 -145568 -24758 -200657 41371 -227683 35446 102104 -92495 136589 76056
19308 76056 -144681 -112620 -271545 -6819 -137348 -266986 452005 118684 66584 76278 -115229
19296 157430 -52625 -246214 189713 25902 -18020 -90275 -196946 195027 -258849 -81038
19285 84613 8978 9515 -216950 38795 5877 -140637 198241 138971 -208616 -73425 -493764
19274 -493764 -340759 -45023 105224 -22525 245998 -322605 -312236 163689 135452 -124478
$$ packed form
19352c19271J57825b2695j13931H3432b60343E0068J15714b81050B1518b37179
19341a38764r2983a02129k00205P9521M9514B1018b69629J00194j72340C9387
19330A61415J09d6985G0207b37762k2151P2036I3481B9061a08124L3750k26180
19319c00554M3640J11346b4758j75899D1371b27683C5446O6658i2495A36589o0533
19308G6056a44681L2061j58925f819j30529j29638D52005A18684n2100R694a15229
19296A57430e2625j93589A89713B5902a8020p2255j06671A95027b58849h1038
19285H4613H978N37b16950C8795E877a40637A98241n9270b08616g3425m20339
19274d93764J53005d5023A05224b2525B45998c22605J0369A63689k8237a24478
$$ plain form
19263 88122 -62557 -129541 -1108 -396432 -213002 56349 68024 -126267 181793 -273714 -25541
19251 3372 -99451 -79480 -211257 -130777 -77789 -100649 -68682 -268565 83030 -265477 -299709
19240 -299709 76470 23985 185922 -180509 -374663 417859 149777 -359508 189817 53973
19229 -99803 -22852 -123289 151672 8356 151581 182647 -129693 -45471 -209852 -123029 -79901
19218 -79901 -84733 -203786 -283998 99521 25126 -147920 -183121 143432 -147434 -202804 -245992
19207 -245992 42941 -224547 163523 -73181 -153099 -341309 139237 -31914 110012 -84686
19196 -335371 94978 51030 58405 -1154 272888 -701 77937 227093 -170601 -290339 174468
19184 13250 92509 19826 -38035 -113125 -424306 -146943 75624 -205918 -11147 280242 103030
$$ packed form
19263H8122f2557o6984a108l95324J83430E6349J1675a26267A81793b73714b5541
19251C372i9451J9971j31777Q0480N2988k2860L1967j99883H3030b65477l4232
19240b99709G6470B3985J61937a80509j94154D17859A49777c59508A89817E3973
19229i9803b2852j00437A51672H356J43225L1066a29693d5471j64381Q6823M3128
19218g9901m832j19053q0212I9521B5126a47920l5201A43432a47434n5370m3188
19207b45992D2941b24547A63523g3181p9918j88210A39237c1914A10012h4686
19196c35371I4978m3948P375a154B72888g01G7937J49156a70601j19738A74468
19184A3250P9259A9826c8035p5090l11181a46943G5624b05918a1147B80242A03030
$$ plain form
19172 -316803 -33837 243192 -77820 -158197 11377 -46673 160931 85362 -58429 82667 232254
19161 232254 -224187 -73589 -301347 124018 82559 -283968 -71733 -68463 19329 28763 114248
19150 114248 100538 -324781 -267345 -19118 -38429 -14859 48787 -150886 -140739 -54351 -94993
19139 -94993 -219754 -166001 58548 124763 -177235 92425 80755 23214 15535 310634 -97627
19127 -147124 76711 -285539 -510120 415046 59481 -240851 258684 315274 -282984 -124130
19116 -101066 226080 -265182 89817 137134 -276719 -214095 153437 -4105 219678 45216 430001
19105 430001 192437 -49401 36375 24004 71102 -132913 -127541 134826 -200845 -281451 -404980
19094 -404980 -425907 -105497 -235830 11801 -161730 -88897 -8325 -44576 163618 -99678 -61506
$$ packed form
19172c16803c3837B43192g7820q0377A1377d6673A60931p5569e8429H2667J49587
19161B32254b24187g3589k27758A24018m1459b83968g1733L270A9329R434Q5485
19150A14248j3710c24781N7436a9118j9311a4859D8787a50886J0147e4351m0642
19139i4993j24761N3753E8548O6215a77235I2425j1670B3214p679K95099i7627
19127a47124G6711b85539k24581D15046E9481b40851B58684N6590b82984a24130
19116a01066B26080b65182H9817M7317b76719O2624A53437d105B19678D5216L84785
19105D30001A92437d9401C6375j2371M7098a32913N372A34826b00845q0606j23529
19094d04980k0927a05497j30333A1801a61730P2833h325l6251A63618i9678L8172
$$ plain form
19083 -61506 43559 -64970 82719 -261311 108334 -196766 -194937 309599 167456 -353972 26001
19071 -142273 -86888 107094 -184279 -204407 -452478 -275875 -97792 -68394 -52331 22447 74822
19060 74822 -353833 127611 321936 16094 10187 -33691 -119033 -153867 37813 -241411 140681
19048 -141333 -23783 -114614 -82222 -95848 192347 -15756 143093 -279914 -96128 -41061 25291
19036 -194321 -168838 139971 17051 -20108 -307865 116835 231284 39204 245456 -92312
19025 68339 -132239 395164 -165485 124070 -156829 160515 240427 212402 -34732 -222275
19015 -222275 -66604 130795 -220931 -345744 19499 -270028 -235165 9568 152823 -158696
19004 113496 -416305 -126422 212991 -163819 154914 -311019 262910 -229585 -218342 468014
$$ packed form
19083f1506D3559f4970H2719b61311A08334a96766J829C09599j42143c53972B6001
19071a42273N5385A07094a84279k0128k48071J76603i7792K9398J6063B2447N2375
19060G4822c53833A27611J94325A6094n907c3691q5342l4834C7813b41411A40681
19048a41333b3783r0831L2392j3626A92347a5756A43093b79914i6128d1061B5291
19036a94321K5483A39971A7051b0108k87757A16835J14449C9204K06252i2312
19025F8339a32239C95164a65485A24070a56829A60515P9912k8025c4732j87543
19015b22275f6604A30795b20931j24813A9499b70028L4863I568J43255a58696
19004A13496d16305a26422B12991a63819A54914c11019B62910b29585J1243D68014
$$ plain form
18993 -146903 169331 -279602 99030 -163265 39741 -90877 -167133 -40334 -80802 -107046 116978
18981 -144119 102605 -31612 -233756 119849 110570 97148 -401747 15521 -65831 130241 -36318
18969 -722287 -509020 -132244 226489 258172 -85400 -64381 -297417 -122145 85226 -165794
18958 -72191 135682 224857 -27739 262101 22891 46859 -180914 -334469 -16486 63713 131796
18947 131796 -228526 155760 -347783 -115727 37363 -198330 174673 92202 54194 148274
18937 148274 100073 -125350 -257756 -91617 200221 -160060 352035 -128737 31314 -315539
18926 456 -286135 -193056 203390 -12922 15366 -45376 -106573 -1521 -140322 -306472 -296092
18915 -296092 -45645 55625 267323 149701 180981 -152573 -120727 70798 -117528 -208248 35595
$$ packed form
18993a46903A69331b79602I9030a63265C9741i0877p6256d0334m0468k6244A16978
18981a44119A02605c1612k02144A19849r279j3422d01747A5521f5831A30241c6318
18969g22287K13267a32244B26489L1683h5400K1019k33036a22145H5226a65794
18958g2191A35682Q9175b7739B62101B2891K3968a80914j53555a6486F3713O8083
18947A31796b28526A55760c47783a15727C7363a98330A74673q2471l8008R4080
18937A48274m8201a25350j32406i1617B00221a60060C52035a28737C1314c15539
18926D56b86135R3079B03390a2922A5366d5376o1197a521j38801j66150J0380
18915b96092d5645E5625K11698j17622L1280a52573L1846G0798a17528r0720C5595
$$ plain form
18903 62126 -269237 -336265 -54455 -202561 -20333 -170315 -129577 90083 -82854 329841 -489730
18891 59945 -128989 12613 -40385 87912 -187198 -20077 110002 311901 -42534 168142 -257045
18879 -199111 -285929 -173990 86294 -105760 -70823 -390407 -192632 245307 -149603 7040
18868 58417 -249348 -138965 -283110 -231182 -230703 53616 21891 -76828 277519 -120196 -157161
18857 -157161 -77889 52751 99322 -250450 393945 78202 -18783 -109305 -28589 -302796 -187138
18846 -187138 195101 -201115 -46568 -34133 326696 80796 -120580 -186701 -272332 -12171 -171425
18835 -171425 -1826 -86492 -44797 -6706 36017 -58550 -127769 -95347 144852 -119007 -4240 -142671
18823 -142671 20350 216474 -177425 520044 -94563 66171 -17151 -5099 -53194 -69820 28491
$$ packed form
18903F2126b69237o7028e4455j48106b0333j49982M0738I0083h2854C29841d89730
18891E9945a28989A2613d0385H7912a87198b0077A10002K01899d2534A68142b57045
18879a99111q6818J11939H6294a05760L4937l19584a92632B45307a49603G040
18868E8417b49348J10383j44145N1928M79E3616B1891g6828B77519a20196l6965
18857a57161g7889E2751M6571b50450C93945G8202a8783r0522b8589k74207J15658
18846a87138A95101b01115d6568J2435C26696H0796a20580o6121q5631a2171j59254
18835a71425a826q4666M1695f706C6017e8550o9219L2422A44852a19007d240j38431
18823a42671B0350J96124a77425E20044i4563F6171a7151e099m8095j6626B8491
$$ plain form
18811 201738 149893 -5395 141792 -382122 -109191 75780 -188043 27623 -253817 -58308 57381
18799 -32536 -234263 58944 -84063 55810 6428 -90134 7450 -85923 70005 -359448 73572 -35202
18786 -45294 -68263 308254 -50209 236193 461 -411601 -331126 83990 13455 148477 125846
18775 125846 -127966 85912 -30645 -122718 -22657 -218991 -106974 79964 -211813 26304 -170801
18763 -191497 382139 102478 -72921 -124118 -80233 -123510 -223577 -16245 -152757 -198075 -71983
18751 -326173 155359 -181810 -535203 -4288 -315172 48338 78473 -228233 -371471 -48509
18740 42490 151815 41517 -269286 31651 107345 -78538 32054 11330 -86657 270093 -221832
18728 192200 63837 35370 -214878 -168462 122577 -364968 28328 -73600 206683 181239 -143448
$$ packed form
18811B01738n1845e395A41792c82122a09191G5780a88043B7623b53817e8308E7381
18799c2536k01727E8944h4063E5810F428i0134G450h5923G0005c59448G3572c5202
18786d5294k2969C08254e0209B36193D61d11601Q0475H3990A3455J35022k2631
18775A25846a27966H5912c0645r2073b2657j96334a06974G9964b11813B6304a70801
18763a91497C82139A02478g2921n1197M3885m3277j00067a6245j36512m5318g1983
18751c26173A55359a81810l53393d288l10884D8338L0135b28233j43238d8509
18740D2490J09325D1517b69286C1651P5694g8538C2054A1330h6657B70093b21832
18728A92200F3837k8467b14878M6416A22577c64968B8328g3600B06683k5444a43448
$$ plain form
18716 -185511 198347 -373778 -175492 -128550 105637 111247 99577 -228339 -297846 -124406
18705 -1224 -154287 -38774 -60371 162800 -16712 -275685 -29694 -16722 -280232 101611 36065
18693 77599 -39706 -88704 -353144 43001 -152503 -50294 9077 -113373 -68634 -363825 192811
18681 34846 84056 -82083 -9908 53746 -86045 -246947 -302336 -214132 40119 -420460 75897
18669 -258081 -103564 174487 146995 119574 3057 -11207 240558 -26997 -102462 -129502 -43958
18657 -19466 10915 -318594 -72971 -17415 -68812 165746 51633 105869 167081 -7641 -126609
18646 -126609 -64214 93259 -24643 -161511 24492 -39414 -67456 -96694 -140864 -121960 187121
18634 -20644 -44808 273392 175663 -70951 -273717 -70060 -179357 -120052 -1297 -307294 -31473
$$ packed form
18716a85511A98347c73778a75492M6942A05637N610j1670b28339o9507a24406
18705a224j53063c8774k1597A62800a6712k58973b9694J2972k63510A01611C6065
18693G7599c9706m8998k64440D3001a52503e0294I077a13373M4739k95191A92811
18681C4846M9210h2083i908E3746h6045j60902n5389Q8204D0119d20460G5897
18669b58081a03564A74487k7492k7421C057a1207B40558b6997p5465k7040d3958
18657a9466A0915c18594g2971a7415n1397A65746E1633N4236O1212g641j18968
18646a26609O2395I3259b4643j36868B4492c9414k8042k9238m4170J8904A87121
18634b0644k4164B73392r7729g0951k02766g0060j09297N9305a297l05997c1473
$$ plain form
18622 149458 -140834 64019 51068 187517 -410119 -302481 -483161 28095 68790 42622
18612 42622 -154132 100513 174590 150155 -137640 -58983 -22750 -208479 129109 -144754
18601 103780 -14669 124923 48419 281832 168142 -215354 -146812 116097 34325 37939 8542
18589 -54186 -132044 -36092 47411 -203289 274535 -26769 -114405 -50361 -148288 -82517 173720
18577 64719 114487 167329 -109839 -55158 152023 -118899 -46516 -115222 277933 70072 236996
18566 236996 -149427 171272 -10008 -216596 -22428 87886 -31116 -4785 -175667 89430 -33748
18554 -185467 38538 -77015 89105 -131695 -47072 -74063 45513 -199126 -153386 -479096 -50122
18542 17274 -58727 -363098 -41530 -168404 -301581 -78269 228061 -30157 -318700 368349
$$ packed form
18622A49458a40834F4019j2951J36449d10119J07638j80680B8095M0695k6168
18612D2622a54132A00513P4077k4435a37640e8983b2750j85729A29109a44754
18601A03780a4669A24923D8419K33413j13690b15354O8542A16097C4325L614H542
18589e4186p7858c6092D7411b03289B74535b6769q7636e0361r7927O5771A73720
18577F4719M9768N2842a09839N4681A52023a18899d6516o8706B77933G0072J66924
18566B36996a49427A71272a0008k06588b2428H7886c1116d785j70882H9430c3748
18554a85467C8538g7015H9105a31695d7072k6991D5513a99126M5740l25710e0122
18542A7274e8727l04371d1530j26874j33177g8269B28061c0157k88543C68349
$$ plain form
18531 39008 221191 -69284 -37311 41296 -121090 -154429 4191 140238 -187013 -128039 285084
18519 -245500 93396 -48893 171247 -54090 182889 -19397 -350724 95270 -263985 79864 72400
18508 72400 -135771 38217 -319775 45476 -87808 -119001 -98606 -71415 -73100 100942 -33463
18496 -275106 -49828 126148 -121034 179324 -26531 25284 -31663 10228 19021 171914 -60252
18484 33159 -297868 -212059 122458 -421514 229767 -348220 -179001 -115389 106047 58828
18474 58828 -285236 -211240 -223531 235876 -144748 -166403 -259185 143050 103885 -48478 40706
18462 99043 151868 -275042 83265 169694 98544 -75792 -506031 -70326 40011 -104513 -216584
18451 -216584 -182173 -195722 -121601 18514 104074 141065 -293887 -119325 33796 -293917 248978
$$ packed form
18531C9008J82183f9284L1973D1296a21090l3339D191J36047a87013N8974B85084
18519b45500I3396d8893A71247e4090A82889a9397l31327I5270b63985G9864p464
18508G2400a35771C8217c19775D5476h7808l1193K0395K7191j685A00942c3463
18496b75106d9828A26148a21034A79324b6531B5284c1663A0228Q793J52893f0252
18484C3159b97868Q5809A22458d21514B29767c48220J69219O3612A06047m7219
18474E8828b85236P3996j2291B35876a44748k1655r2782A43050l9165d8478D0706
18462I9043N2825b75042H3265Q6429p1150g5792m30239g0326D0011a04513j12071
18451b16584L4411j3549P4121A8514Q5560L6991b93887a19325C3796b93917B48978
$$ plain form
18439 159871 108969 -82970 -145656 13026 -38521 44237 -155237 -157492 14325 38974 -28479
18427 -146717 343031 -242216 -52010 -47845 -113190 -357993 -285618 -44708 109591 10483 38062
18416 38062 -181733 -5284 44687 -363561 -146643 -224103 335784 65554 -192825 285951 2471
18404 280658 -6837 88923 70730 270452 -16224 -265925 211435 -58902 -237210 31234 -189046
18392 -7388 218518 -19868 277264 950 -203441 -54234 197220 -214560 -267 -51481 44291 73464
18380 73464 -133036 51485 -35833 141366 -19993 -26732 77267 -395260 -96994 -381113 293680
18368 111216 -141208 -154475 -137421 -124411 -297584 14126 -283232 82203 -32802 16016 159184
18357 159184 322428 -123972 -219960 -116213 -10413 -65254 -212304 184093 -99829 -63144
$$ packed form
18439A59871n0902h2970o2686A3026c8521D4237a55237k255A4325K4649b8479
18427a46717C43031b42216e2010M165o5345k44803P2375d4708A09591A0483K7579
18416C8062a81733e284D4687c63561a46643p7460C35784F5554a92825B85951B471
18404B80658f837H8923j8193J99722a6224k49701B11435e8902j78308C1234a89046
18392g388B18518a9868B77264I50b03441e4234A97220b14560b67n1214D4291K9173
18380G3464a33036E1485c5833A41366a9993o739G7267c95260i6994k84119B93680
18368A11216a41208j3267J7054J3010j73173A4126b83232H2203c2802A6016J43168
18357A59184J63244a23972r5988J03747a0413n4841j47050A84093i9829L6685
$$ plain form
18347 -63144 -211488 -339050 65337 -214259 101317 343138 -128318 -202905 403 121851 178965
18336 178965 -344930 -222136 104352 200462 -94419 -12519 -326355 -217102 271481 -319523
18325 92679 156754 324636 54475 184074 58129 -30791 -414433 19864 -1196 -296029 12053
18313 -60404 -309630 87384 48660 -400310 -72969 94684 8768 -193080 42993 -1156 -214860
18302 -214860 -81712 126342 17853 -282775 -119504 -105238 -18694 -152844 -125387 -44553 81392
18290 69448 93906 -149855 -7022 -21142 -69802 -322873 -194097 15716 -167987 -135486 -274424
18279 -274424 -179759 -77702 6873 -213327 -66481 -13538 -154908 -112108 286954 282362 -147074
18267 -160907 -76699 28826 -165838 91125 -193439 16574 -16670 -90072 55632 77250 -73047
$$ packed form
18347f3144j48344j27562F5337b14259A01317K41821a28318p4587D03J21448N7114
18336A78965c44930J22794A04352R6110i4419a2519l13836J09253B71481c19523
18325I2679O4075J67882E4475J29599E8129c0791l83642A9864a196k94833A2053
18313f0404k49226H7384l8724d00310g2969I4684H768a93080D2993a156k13704
18302b14860h1712A26342A7853b82775a19504J4266a8694j34150K7457d4553H1392
18290F9448K4458a49855g022j4120m8660k53071J28776A5716a67987L2501j38938
18279b74424R4665g7702F873b13327f6481a3538j41370M2800B86954m592a47074
18267a60907g6699B8826a65838I1125a93439A6574a6670p3402E5632K1618g3047
$$ plain form
18255 67824 275370 77503 -78045 -218313 -47523 452769 -240468 164296 -78330 -6427 -335115
18244 -335115 101244 -260182 169351 117843 118919 -198951 -168401 113729 -202248 73982
18233 -150756 -120658 73832 -33914 -95692 -338181 -89019 -132138 488800 -273120 49819 -167704
18221 -20994 122726 35612 -10886 -308002 -47987 -417017 -68788 -200240 92011 -122234 -113377
18210 -113377 126689 -149539 123283 -27356 -129073 170968 7032 152215 -41378 -180776
18200 -180776 -133837 318389 -12198 132003 61310 -182288 103775 92888 -236694 -91612
18189 -1826 393108 88518 -43267 -87866 22506 -241094 -41055 -28051 160467 -64705 -222420
18178 -222420 -200933 58230 194972 25104 194502 45964 188427 -20686 -137711 147234
$$ packed form
18255F7824K07546G7503g8045j40268d7523D52769b40468A64296g8330f427l28688
18244c35115A01244b60182A69351n1508J076a98951L0550A13729b02248G3982
18233a50756L0098G3832c3914o1778k42489h9019m3119D88800b73120D9819a67704
18221b0994A22726C5612a0886k97116d7987l69030f8788j31452I2011a22234Q857
18210a13377A26689a49539A23283b7356j01717A70968G032J45183d1378j39398
18200a80776M6939C18389a2198A32003F1310a82288A03775j0887b36694i1612
18189a826C93108H8518d3267m4599B2506b41094d1055J3004A60467f4705j57715
18178b22420K1487E8230J36742B5104J69398D5964J42463b0686j17025A47234
$$ plain form
18167 53885 -120352 -123743 132424 -132703 -214355 -144304 129081 -47434 -86760 438500 -141998
18155 -12658 -233954 53726 -175628 -141722 -318285 -123478 75903 40052 71415 25223 -393870
18143 472475 -135097 -266503 -98749 -64508 -2709 -3033 -152623 -105830 74092 -106039 74768
18131 73813 -117002 -354113 90084 9701 78487 302458 -121649 102280 -119666 134577
18120 -85450 119503 -149081 -27563 47453 80536 -189989 -36167 -67940 -217576 -38821 17832
18108 -275164 -392492 -104744 -45345 -254301 -24446 -108544 52298 3340 232561 119966 11374
18096 -48116 -17863 -74459 -316285 200547 49058 -227016 -223498 200321 129294 -134796 -67544
18085 -67544 103357 -120179 -35440 110067 -131198 -282506 -644622 55873 -34798 -227677
$$ packed form
18167E3885a20352l391A32424a32703q1652P0051A29081d7434l9326D38500a41998
18155a2658k21296E3726a75628L3906j76563a23478G5903l5851L1363B5223c93870
18143D72475a35097j31406i8749L4241b709l24j49590M6793G4092a06039G4768
18131G3813a17002k37111I0084I701O8786K23971a21649A02280a19666A34577
18120h5450A19503a49081b7563D7453L3083a89989c6167l1773j49636c8821A7832
18108b75164j17328a04744d5345k08956b4446q4098E2298C340K29221j12595A1374
18096d8116a7863n6596k41826B00547D9058b27016L518B00321p1027a34796O7252
18085f7544A03357a20179c5440A10067a31198j51308l62116E5873c4798j92879
$$ plain form
18075 -227677 57436 10892 -220090 2590 -97340 127202 29018 84367 -206555 -8324 -220600
18064 -220600 -44669 122380 -78808 54554 -125204 -239647 65391 13861 169563 -242744
18053 177289 62458 -47756 -85855 -591001 -72148 -157587 17123 210054 -109794 22456 -201059
18041 101182 6497 197940 -162903 156089 88967 14925 170707 145796 190051 -79302 -347519
18030 -347519 23971 1584 -306421 -170159 98973 -188409 103925 -143395 -131627 208686
18019 -241294 -139489 -108056 57422 5361 -112790 -138632 48241 -20255 -250917 214636 -161682
18007 113500 -189007 204321 319701 94902 370682 106429 66791 -21925 239677 214786
17997 214786 -46205 106693 -75232 -207407 187330 -334308 140497 -100387 -83138 163505
$$ packed form
18075b27677E7436A0892b20090B590i7340A27202B9018N5349b06555h324k12276
18064b20600d4669A22380g8808E4554a25204j14443F5391A3861J55702b42744
18053A77289F2458d7756l8099n05146g2148q5439A7123J92931a09794B2456b01059
18041A01182F497J91443a62903A56089o7122A4925J55782k4911M4255g9302k68217
18030c47519B3971A584c06421J36262I8973a88409A03925a43395J1768B08686
18019b41294J01805L1433E7422E361a12790k5842D8241b0255k30662B14636a61682
18007A13500a89007B04321J15380I4902K75780A06429l9638b1925B39677k4891
17997B14786d6205A06693g5232j32175A87330c34308A40497a00387J7249A63505
$$ plain form
17986 -14807 371607 -95738 -139205 -86907 -182886 -129245 -3649 -17079 -156106 -61867 -212953
17975 -212953 106534 -70473 -12355 -162595 87163 82375 -65013 -108854 -492675 -1394 -126762
17964 -126762 15768 -184034 -328883 171252 133611 85389 -201512 -167514 -119485 36818 104557
17953 104557 272618 257969 -122970 -143941 -132013 -34279 -75331 412731 -265179 -10346 -300491
17942 -300491 203967 9570 13253 126290 150332 -82682 -338926 -126683 -16565 54765 -111447
17930 -52233 116454 -14905 223444 -30794 -7608 46870 156831 -141928 -143392 308648 37922
17918 -272899 191598 447394 -47185 144946 -327464 1500 -180859 -14619 65217 79442 88711
17907 88711 -173624 -363786 163677 -124423 72950 25870 -40702 -59940 -263331 -66299 -21344
$$ packed form
17986a4807C71607i5738m3467N2298r5979N3641c649j3430j39027f1867j51086
17975b12953A06534g0473a2355j50240H7163m788f5013m3841l83821a394j25368
17964a26762A5768a84034j44849A71252l7641m8222b01512L3998M8029C6818O7739
17953A04557J68061j4649a22970k0971J1928c4279m1052D12731b65179a0346k90145
17942c00491B03967I570L683J13037K4042h2682k56244a26683a6565E4765a11447
17930e2233A16454a4905B23444c0794g608D6870J09961a41928j464C08648C7922
17918b72899A91598K55796d7185A44946c27464A500a80859a4619F5217J4225R269
17907H8711a73624j90162A63677a24423G2950B5870d0702j9238k03391f6299b1344
$$ plain form
17895 101994 -230734 137260 -71270 283295 -15013 -33475 133030 135987 -245847 -266766 -166546
17884 -166546 -46190 -21370 -3935 230272 154183 -61702 -215645 -19673 19500 -29886 179932
17872 390707 -273840 165250 -46485 58473 133303 -39601 -80870 78851 -5663 12602 19088
17861 19088 223314 -257043 245 -86518 22201 -85880 -55490 -13878 101574 -89261 -151865
17850 -151865 -50554 -51901 328167 -40324 -176861 207227 -306791 -25551 -152632 -492886
17840 -492886 -5427 26201 193598 104400 26451 -66251 -67268 207691 -285337 -60288 -230863
17829 -230863 128891 144342 230241 245938 90611 -46588 -49137 -369527 -420292 158582 -118354
17817 -166251 32966 -76175 -395743 -153561 86491 -17413 258094 280173 285962 -164219 282490
$$ packed form
17895A01994b30734A37260g1270B83295a5013j8462A33030K957b45847k0919J00220
17884a66546d6190b1370c935B30272p6089f1702j53943a9673A9500b9886A79932
17872C90707b73840A65250d6485E8473P4830c9601m1269G8851e663A2602O486
17861A9088K04226b57043B45h6518B2201h5880L0390a3878A01574h9261o2604
17850a51865e0554j347C28167d0324j36537B07227c06791b5551j27081l40254
17840d92886e427B6201J67397q9198B6451f6251j017B07691b85337f0288j70575
17829b30863A28891J5451Q5899J5697I0611d6588k549l20390n0765A58582a18354
17817a66251C2966g6175l19568a53561H6491a7413B58094K2079N789a64219B82490
$$ plain form
17805 -75736 -269971 -301812 -207559 195296 16521 135199 170842 23046 -352544 -92891 17675
17793 168269 153412 -202652 -137860 293185 48689 -49347 -78363 -79498 233251 -117321 -382627
17782 -382627 -144533 -35098 36402 58978 101685 -200829 -99537 73448 324877 117994 279429
17771 279429 294632 -35061 -124855 -40899 -50936 -56550 165446 -197524 -157588 192503 -96862
17759 67213 52509 -66787 98502 -94478 -93684 -130190 265747 224571 94469 132966 365085 -204973
17746 -41037 -244788 113433 4770 213815 -211677 275194 -3139 112798 210985 -508443 31870
17734 -63259 -98870 -42868 22181 -89646 65556 -47526 -173430 -129511 121422 -183482 -79520
17722 55543 79468 191554 -101674 330796 -55667 -169360 -45245 -64122 27888 404068 -113343
$$ packed form
17805g5736j94235l1841R4253A95296A6521J18678L5643B3046c52544i2891A7675
17793A68269j4857b02652O4792B93185D8689d9347k9016j135B33251a17321k65306
17782c82627a44533c5098C6402K2576M2707b00829i9537G3448K51429A17994J61435
17771B79429J5203c5061q9794d0899j0037n614A65446a97524L9936A92503i6862
17759F7213j4704f6787I8502i4478P94l6506B65747m1176I4469L8497K32119b04973
17746d1037k03751A13433D770K09045b11677B75194c139A12798R8187e08443C1870
17734f3259l5611d2868B2181h9646F5556d7526j25904M3919A21422a83482g9520
17722E5543K3925J12086a01674C30796e5667j13693d5245j8877B7888L76180a13343
$$ plain form
17710 -217313 -46074 22978 138778 -122850 93528 84536 37419 -85918 21524 -74017 -279779
17699 -279779 30023 172954 55416 -36898 -14348 179534 -175271 227886 -75040 105147
17688 216909 302322 56817 78140 38048 -9947 125120 -102185 -21459 -113318 -353041 -7238
17676 117758 73848 41689 121992 215120 184853 -267411 -70214 -40747 73889 -235366 262616
17664 125784 175435 138338 96735 119206 35968 -351938 -53545 99697 -32087 74439 110751
17653 110751 138142 40675 12480 480909 -81986 88461 -51282 139102 -179400 271497 88633
17641 68653 97960 18065 -150739 89065 -135254 -175316 183859 292127 -127767 -189477 -205858
17630 -205858 -55230 116534 -148252 -298655 224958 22679 243776 67794 -180545 118569
$$ packed form
17710b17313d6074B2978J15800a22850I3528q992C7419h5918B1524g4017k05762
17699b79779C0023J42931E5416c6898a4348A79534a75271B27886g5040A05147
17688B16909Q5413E6817K1323C8048i947A25120a02185b1459r1859k39723g238
17676A17758m3910l2159Q0303R3128l0267b67411g0214K9467G3889b35366B62616
17664A25784M9651l7097m1603K2471C5968c51938e3545I9697c2087G4439L6312
17653A10751K7391D0675A2480M68429h1986H8461e1282A39102a79400B71497H8633
17641F8653K9307A8065a50739H9065a35254m0062A83859J08268a27767o1710j6381
17630b05858e5230A16534a48252j50403B24958B2679K21097F7794a80545A18569
$$ plain form
17619 123225 408411 -38610 33474 36730 -74076 219359 -61325 -7296 -32618 -104489 -87338
17608 -87338 -245899 175984 -4036 60589 -159666 -78682 -172218 -127585 296033 149684 61914
17596 206514 -203604 -130785 66652 -46630 -62172 9725 -218518 -6825 97449 84594 25105
17584 263201 -17011 -71380 177370 7908 -65048 34359 -75259 -55417 197421 -132605 14660
17572 354701 -129970 -77671 -55496 174901 -89283 -71990 -23758 -214971 6599 -68819 76652
17560 140850 305450 -80617 10458 155431 163547 31078 -27380 190276 -136470 -12238 130933
17548 204816 -447506 145644 100844 508193 -206979 209507 171845 -41470 115447 3472
17537 298856 -191847 22014 -81259 88903 133830 -11401 254952 -107415 40607 -166026 -237337
$$ packed form
17619A23225K85186c8610C3474L256g4076B19359f1325g296k5322p1871J7151
17608h7338j58561A75984d036F0589a59666g8682r3536M4633B96033j46349F1914
17596B06514b03604P2819F6652d6630j5542I725b18518f825I7449j2855B5105
17584B63201a7011n4369A77370G908f5048C4359g5259J9842A97421a32605A4660
17572C54701a29970N2299K2175A74901h9283J7293b3758j91213F599f8819G6652
17560A40850J64600h0617A0458J44973Q116C1078b7380A90276a36470a2238A30933
17548B04816d47506A45644m4800M07349b06979B09507l7662d1470A15447C472
17537B98856a91847B2014h1259H8903M4927a1401B54952a07415D0607a66026p1311
$$ plain form
17526 -237337 206166 -106041 -106859 35467 139049 -116930 -137478 111226 174445 -74129 -176225
17515 -176225 -3266 91898 -308696 -354380 13450 -160662 -16841 269521 400766 144659 73651
17504 73651 -406743 31984 -126086 212114 -88412 -12423 -54568 212611 -96371 453573 111708
17492 263950 -122270 -153716 -5277 94139 102369 -74389 262508 127022 36616 58796 215822
17481 215822 -95049 203910 -38518 171347 282674 167123 17421 191583 240982 -124955
17470 -4166 351716 -54720 497316 -8226 229999 -117044 315977 -63492 147804 158927 -52457
17458 -90093 -3783 -75248 -112489 460261 133465 233205 225295 155535 -34288 656439 262832
17446 503512 146263 92723 237060 -3859 63058 173069 318752 116312 197533 243917 214496
$$ packed form
17526b37337B06166a06041q18C5467J03582a16930k0548A11226O3219g4129j02096
17515a76225c266I1898c08696m5684A3450a60662a6841B69521J31245A44659p1008
17504G3651d06743C1984a26086B12114h8412a2423m2145B12611i6371D53573A11708
17492B63950a22270l1446e277I4139Q230g4389B62508A27022C6616K2180J57026
17481B15822i5049B03910c8518A71347J11327j15551A7421J74162M9399a24955
17470d166C51716e4720D97316h226B29999a17044C15977f3492A47804J1123e2457
17458i0093c783p1465l7241D60261A33465R9740p910o9760c4288F56439B62832
17446E03512A46263n3540J44337c859F3058J10011J45683A16312Q1221M6384k9421
$$ plain form
17435 214496 3209 122114 301554 446559 295350 278274 142494 63971 -67732 279095
17424 246223 104078 314782 6178 -201485 362232 133381 123030 80240 294529 140999
17413 309441 192115 1370 -55854 225564 324702 52513 211832 133206 32771 -89292 315097
17401 247373 -77066 424551 89764 57434 -146075 -2605 36540 63705 50012 303292 216106
17390 216106 525019 -87598 206756 256551 -21111 184428 64597 -41791 62754 421068 -30437
17378 61139 -133882 75525 -89649 -185780 74264 -15178 349191 -74670 212290 177445 112818
17367 112818 198231 318185 43059 -103934 -54447 -104 181796 90677 330076 49262 56945
17356 56945 -44686 318920 38440 108634 252077 85520 89594 98497 -159834 168179 413425
$$ packed form
17435B14496C209J18905J79440J45005j51209j7076j35780F3971f7732B79095
17424B46223A04078K10704F178b01485C62232A33381j0351m2790K14289A40999
17413C09441j17326A370e5854B25564R9138E2513J59319p8626C2771h9292C15097
17401B47373g7066D24551H9764l2330a46075b605C6540K7165j3693K53280q7186
17390B16106L08913h7598B06756M9795b1111A84428F4597d1791F2754L58314c0437
17378F1139a33882G5525h9649r6131G4264a5178C49191g4670B12290l4845o4627
17367A12818Q5413J19954D3059a03934M9487a04A81796I0677K39399D9262P683
17356E6945d4686C18920C8440P0194J43443H5520M074Q903a59834A68179K45246
$$ plain form
17345 413425 208000 8322 80243 -17823 454665 338719 -23329 118318 207977 90543 141117
17334 141117 231248 26425 -72439 205424 287218 -108836 55049 -141197 -135204 234598 -17844
17322 54365 147286 -17126 279051 -77926 467855 -208421 -5688 25822 -218715 366538 440893
17311 440893 -202867 -63819 392578 178479 14524 327939 55914 107315 -23489 261298
17300 142036 379256 -15408 226128 504989 263819 211713 301066 33868 189722 308671
17290 308671 162498 -34564 -50055 252669 136133 -120263 149764 295491 19884 471913
17280 471913 84946 246200 181700 253650 138713 66556 -3174 -100867 469110 286420 1731
17268 318352 150938 244744 71066 139517 164405 93808 123725 198983 184529 189236 352279
$$ packed form
17345D13425k05425H322P1921a7823D54665j15946b3329A18318Q9659I0543N0574
17334A41117R0131B6425g2439B05424Q1794a08836E5049a41197N993B34598a7844
17322E4365R2921a7126B79051g7926D67855b08421e688B5822b18715C66538P4355
17311D40893b02867f3819C92578A78479A4524L13415E5914N1401b3489B61298
17300A42036K37220a5408B26128K78861k41170n2106Q9353C3868J55854J18949
17290C08671j46173c4564j5491B52669j16536a20263A49764J45727A9884M52029
17280D71913H4946J61254o4500P1950j14937F6556c174r7693D69110j82690A731
17268C18352A50938R3806G1066O8451K4888p0597K9917P5258j4454M707J63043
$$ plain form
17257 352279 126710 21545 389750 328856 19972 261959 400968 -5898 210261 331591
17247 331591 161384 161125 67089 175088 208489 222669 186131 -288019 207929 91790 206782
17236 206782 228470 211752 101716 549291 66946 21524 225332 149595 87307 -241507 293896
17224 -225782 301699 366065 -308733 276627 178732 253992 217245 178909 276085 238957 450617
17213 450617 468359 139192 -231010 109014 326497 -55161 100257 163050 365759 571069
17203 571069 295451 -10454 339722 177951 61194 346113 -26600 73822 -18527 144746
17192 -33568 160558 360061 401139 378650 241940 163268 199521 325201 167885 374159
17182 374159 220502 197683 280426 354818 70921 -1309 153484 322417 71931 112053 -165824
$$ packed form
17257C52279A26710B1545L68205o0894A9972K41987J39009e898B10261J21330
17247C31591A61384k59F7089J07999L3401J4180l6538b88019B07929I1790J14992
17236B06782K1688j6718A01716M47575F6946B1524K03808p5737o2288b41507B93896
17224b25782C01699O4366c08733B76627r7895P5260l6747l8336R7176l7128K11660
17213D50617J7742A39192b31010A09014K17483e5161A00257O2793K02709K05310
17203E71069k75618a0454C39722j61771F1194K84919b6600G3822a8527A44746
17192c3568A60558J99503M1078k2489j36710p8672L6253J25680j57316K06274
17182C74159j53657k2819Q2743P4392G0921a309A53484J68933G1931M0122a65824
$$ plain form
17170 40841 248930 387438 253385 231133 141852 45243 12411 626995 222982 163409 2357
17158 288565 131382 296282 469677 54015 -71745 201034 191567 543426 200020 187691
17148 187691 217824 -60091 492909 246244 264250 76568 475205 598395 90163 134145 62858
17136 415762 300174 114677 264760 285567 107169 253274 365595 332061 838461 -6763
17125 204418 168651 288447 555334 179119 624642 270288 416204 179606 274514 337213
17115 337213 492553 106227 385114 385744 199446 434988 134232 251587 122064 389959
17105 389959 413098 470238 407226 261660 322353 596369 169236 271459 516057 173536
17094 285679 425574 195384 491147 477798 582898 156672 319880 323123 392551 228968
$$ packed form
17170D0841K08089J38508j34053k2252q9281D5243A2411O14584B22982n9573B357
17158B88565A31382J64900J73395E4015g1745B01034r467L51859B00020j2329
17148A87691L0133f0091D92909B46244J8006G6568L98637J23190I0163M3982F2858
17136D15762j15588A14677J50083K0807A07169J46105J12321l3534N06400f763
17125B04418l5767J19796K66887A79119M45523B70288J45916A79606R4908O2699
17115C37213J55340A06227K78887O30j86298K35542A34232J17355A22064K67895
17105C89959K3139N7140o3012j45566O0693K74016A69236J02223K44598A73536
17094B85679J39895A95384K95763j3349J05100A56672J63208L243O9428j63583
$$ plain form
17084 228968 395622 416873 397666 312900 235868 347170 225488 412523 342228 724291
17074 724291 430986 609482 333875 667436 525866 454225 478438 293833 545989 417748
17064 417748 216157 427442 497953 358049 217825 330262 415194 624960 446768 657285
17054 657285 364585 645101 592788 460141 690897 695668 389054 490459 652350 477300
17044 477300 314247 670395 520392 350378 643716 299391 877237 212824 706770 385507
17034 385507 844100 459497 438702 825106 608261 549727 577161 571045 599711 382982 297231
17023 297231 484414 920485 652112 642578 507963 597054 586978 767674 526535 394754
17013 394754 455421 327608 610463 623717 520067 789318 481681 792045 754398 542331
$$ packed form
17084B28968J66654K1251j9207q4766p7032J11302j21682J87035p0295L82063
17074G24291k93305J78496k75607L33561j41570p1641K4213j84605K52156j28241
17064D17748k01591K11285P0511j39904j40224J12437Q4932K09766j78192K10517
17054F57285k92700K80516n2313j32647K30756M771l06614J01405J61891j75050
17044D77300j63053L56148j50003j70014K93338B99391N77846B12824M93946l21263
17034C85507M58593l84603k0795L86404k16845n8534K7434o116K8666k16729q5751
17023B97231J87183M36071k68373r534j34615Q9091j0076J80696k41139j31781
17013C94754O0667j27813K82855J3254j03650K69251l07637L10364l7647k12067
$$ plain form
17003 542331 661121 689606 563732 486034 649483 843588 693716 435539 954634 804043
16993 804043 956851 721908 784638 792970 966367 760679 1037693 427948 1091247 1194053
16983 1194053 554651 759119 586325 609261 751202 676914 1019450 666514 747154 882168
16973 882168 959444 427540 991130 680431 839391 889119 699318 959357 897155 881943
16963 881943 996001 1131701 699860 1075221 740446 563036 1067827 1139540 797265 582291
16953 582291 921563 773084 946778 951823 1102944 857507 954089 1021523 1149816 1003996
16943 1003996 1260721 1097988 1134892 950154 1047580 1061983 1024875 1262297 1145228 1175570
16933 1175570 1507672 1174013 1358632 1280447 1303655 1210349 1046589 1414389 1234274 1002687
$$ packed form
17003E42331J18790K8485j25874p7698J63449J94105j49872k58177N19095j50591
16993H04043J52808k34943O2730Q332J73397k05688K77014D27948O63299J02806
16983A194053E54651K04468j72794K2936J41941p4288L42536l52936Q0640J35014
16973H82168P7276D27540N63590l10699J58960M9728j89801K60039o2202j5212
16963H81943J14058J35700m31841L75361l34775j77410N04791P1713l42275k14974
16953E82291L39272j48479J73694N045J51121k45437R6582O7434J28293j45820
16943A003996K56725j62733L6904j84738R7426J4403l7108K37422j17069L0342
16933A175570L32102l33659J84619p8185K3208r3306j63760L67800j80115k31587
$$ plain form
16923 1002687 1534355 1353522 1263129 1442365 1320666 1100253 1301644 1286475 1538525 1613887
16913 1613887 1481003 1597403 1655159 1405272 1424631 1341012 1477053 1394607 1450343 1628847
16903 1628847 1501591 1526220 1549537 1504863 1970848 1553131 1668019 1442847 1791094 2039193
16893 2039193 1662426 1798553 1870921 2175994 1949045 1694509 2031655 1605772 2180751 1815761
16883 1815761 1953279 1932519 2104295 2122148 2022212 2215850 2235698 2165991 2050756 2401660
16873 2401660 2495652 2230024 2283870 2262628 2369471 2659682 2363373 2599453 2718979 2614508
16863 2614508 2845752 2634126 2523081 2729571 2818744 2616890 2542905 2785746 3099095 3030011
16853 3030011 3175670 3339002 2951655 3296397 3245359 3236034 3378872 3257152 3040951 3673965
$$ packed form
16923A002687N31668j80833r0393J79236j21699k20413K01391j5169K52050P5362
16913A613887j32884J16400N7756k49887J9359q3619J36041q2446N5736J78504
16903A628847j27256K4629K3317m4674M65985m17717J14888k25172L48247K48099
16893B039193l76767J36127P2368L05073k26949k54536L37146m25883N74979l64990
16883A815761J37518k0760J71776J7853r9936J93638J9848o9707j15235L50904
16873B401660R3992k65628N3846k1242J06843K90211k96309K36080J19526j04471
16863B614508K31244k11626j11045K06490Q9173k01854p3985K42841L13349o9084
16853C030011J45659J63332l87347L44742n1038r325J42838j21720k16201O33014
$$ plain form
16843 3673965 3701725 3593478 3242922 3879989 3685471 3784830 4071681 3862245 3989923 3645680
16833 3645680 4440495 4217206 4321691 4253298 4452875 4334231 4485807 4555881 4457809 4914873
16823 4914873 4841429 4991083 5222084 5508011 5441893 5363273 5595882 5477628 5676819 5783511
16813 5783511 6057738 6041396 6343232 6282340 6915218 6763040 6977170 6844012 6915770 7408566
16803 7408566 7294191 7735618 7714520 7985090 8378895 8270217 8575544 8703071 8858686 8969781
16793 8969781 9466133 9584075 9572221 10006242 10679682 10712132 11100585 11055935 11457760 12042132
16783 12042132 11877507 12644479 13035616 13249929 13400329 14399005 14524904 15392208 15667598
16774 15667598 16400788 16761584 17012488 17813301 18586099 19051890 19917396 20732405 21238893
$$ packed form
16843C673965K7760j08247l50556O37067j94518R9359K86851k09436J27678l44243
16833C645680P94815k23289J04485o8393J99577j18644J51576P0074r8072M57064
16823D914873p3444J49654K31001K85927o6118p8620K32609j18254J99191J06692
16813E783511K74227j6342L01836o0892O32878j52178K14130j33158P1758M92796
16803G408566j14375M41427k1098K70570L93805j08678L05327J27527J55615J11095
16793H969781M96352J17942j1854M34021O73440L2450L88453m4650M01825N84372
16783A2042132j64625P66972L91137K14313J50400R98676J25899Q67304K75390
16774A5667598P33190L60796K50904Q00813P72798M65791Q65506Q15009N06488
$$ plain form
16765 21238893 21954678 22779752 23878787 24486766 25839818 26223742 27573969 28626263 29693238
16756 29693238 31349922 32656793 33886281 35955003 37455203 39009314 40857735 42704443
16748 42704443 44787735 47344253 49499636 51977207 54795612 57278194 60537241 63921317
16740 63921317 67453295 71310966 74983784 79305965 83559225 88465301 93602215 98075967
16732 98075967 104066331 109484760 115434286 121634027 127497759 133117744 138681616 144391752
16724 144391752 149957743 154464043 158864505 162213445 164753858 166458604 167395813 167363762
16716 167363762 166148094 163933322 160970004 157531344 153027554 147908834 142556232 137072950
16708 137072950 131204151 124861759 119243454 113394438 107507775 101677644 96600861 91134064
$$ packed form
16765B1238893P15785Q25074J099035O07979J353052L83924J350227J052294J066975
16756B9693238J656684J306871J229488K068722J500200J554111J848421J846708
16748D2704443K083292K556518K155383K477571K818405K482582L259047L384076
16740F3921317L531978L857671L672818M322181M253260M906076N136914M473752
16732I8075967N990364N418429N949526O199741N863732N619985N563872N710136
16724A44391752N565991M506300M400462L348940K540413J704746R37209l2051
16716A67363762j215668k214772k963318l438660m503790n118720n352602n483282
16708A37072950n868799o342392n618305n849016n886663n830131n076783n466797
$$ plain form
16700 91134064 86485034 81761938 77291719 73095738 69126522 65331558 61854425 58895648
16692 58895648 55761745 52893772 50235403 47378130 45151605 42966972 40855693 39238086
16684 39238086 37332001 35790945 33930016 32573819 30837194 29656771 28461880 27295819
16676 27295819 26370961 25315412 24269179 23168340 22494491 21413105 20811831 20105413 19141248
16667 19141248 18627821 17581311 17137108 16722931 16123855 15463446 15227258 14983108 14208966
16658 14208966 13611684 13201267 13005361 12570128 12066478 11864493 11374653 11114499 10685136
16649 10685136 10733542 10428907 9740066 9852621 9587759 9120338 8776709 8708330 8654418 8298122
16639 8298122 8042097 8140393 7514408 7387252 7631849 7101448 7029886 6658485 6351486 6535961
$$ packed form
16700I1134064m649030m723096m470219m195981l969216l794964l477133k958777
16692E8895648l133903k867973k658369k857273k226525k184633k111279j617607
16684C9238086j906085j541056j860929j356197j736625j180423j194891j166061
16676B7295819r24858j055549j046233j100839o73849j081386o01274p06418r64165
16667A9141248n13427j046510m44203m14177n99076o60409k36188k44150p74142
16658A4208966n97282m10417j95906m35233n03650k01985m89840k60154m29363
16649A0685136M8406l04635o88841J12555k64862m67421l43629o8379n3912l56296
16639H298122k56025R8296o25985j27156K44597n30401p1562l71401l06999J84475
$$ plain form
16629 6535961 6334693 6191328 6157020 5678793 5850937 5863996 5663884 5317542 5240087 5479207
16619 5479207 5038208 5051286 4912471 4997341 4757714 4908587 4355240 4501351 4584586 4272248
16609 4272248 4613264 3999216 4149280 4140719 3850973 3850091 3929011 3480426 3522329 3393597 3488310
16598 3488310 3698266 3798286 3386720 3378276 3290837 3379816 3257045 3001734 3039724 2849155
16588 2849155 2938918 2822317 3023794 2765286 2682788 2724847 2727653 2518949 2765732 2488544
16578 2488544 2364100 2528689 2319404 2458654 2624581 2147052 2238033 2240263 2398034 2109232
16568 2109232 2315282 2331646 2299006 2221529 2145926 1952487 2195249 2435312 2006642 2192583
16558 2192583 2066023 2024450 1956184 1732858 1758605 1734691 1841870 1780864 1769344 1995751
$$ packed form
16629F535961k01268j43365l4308m78227J72144J3059k00112l46342p7455K39120
16619E479207m40999J3078j38815Q4870k39627J50873n53347J46111Q3235l12338
16609D272248L41016o14048J50064q561k89746q82P8920m48585M1903j28732R4713
16598C488310K09956J00020m11566q444q7439Q8979j22771k55311L7990j90569
16588B849155Q9763j16601K01477k58508q2498M2059K806k08704K46783k77188
16578B488544j24444J64589k09285J39250J65927m77529R0981K230J57771k88802
16568B109232K06050J6364l2640p7477p5603j93439K42762K40063m28670J85941
16558B192583j26560m1573o8266k23326K5747k3914J07179o1006j1520K26407
$$ plain form
16548 1995751 1492013 1716524 1434590 1292130 1765656 1782968 1370416 1773131 1710603 1809828
16538 1809828 1517824 1619646 1505924 1247227 1311200 1313464 1498838 1276249 1390715 1677106
16528 1677106 1112265 1280033 1494743 1451336 1211809 1336034 1120067 1740571 1290176 1198138
16518 1198138 1037259 1031934 976893 1197931 1125045 1267172 1180276 927396 1282578 845378
16508 845378 937235 1145656 927909 1086643 829027 1037485 796477 939290 892491 996616
16498 996616 1051264 909231 900630 1110881 921737 1169521 790620 623078 1059268 1135895
16488 1135895 1200632 1197954 904897 898046 848723 933966 992114 726291 901075 387067 532919
16477 532919 928966 713186 535944 708689 636049 746182 829209 577851 570331 1003452
$$ packed form
16548A995751n03738K24511k81934j42460M73526J7312m12552M02715o2528R9225
16538A809828k92004J01822j13722k58697O3973K264J85374k22589J14466K86391
16528A677106n64841J67768K14710m3407k39527J24225k15967O20504m50395r2038
16518A198138j60879n325n5041K21038p2886J42127q6896k52880L55182m37200
16508H45378R1857K08421k17747J58734k57616K08458k41008J42813m6799J04125
16498I96616N4648j42033q601K10251j89144K47784l78901j67542M36190P6627
16488A135895O4737k678k93057o851m9323Q5243N8148k65823J74784C87067J45852
16477E32919L96047k15780j77242J72745p2640J10133Q3027k51358p520M33121
$$ plain form
16467 1003452 510416 891477 501703 749389 313553 480997 453980 921445 969298 622122
16457 622122 704299 477286 109582 634737 747022 405494 1050969 422543 449774 632906
16447 632906 600210 453453 524433 471883 611108 721377 678836 431450 412858 655972
16437 655972 223351 504742 777919 481882 732199 312402 434909 643877 636641 837706
16427 837706 545790 303447 566708 702394 99828 358605 389036 563695 513435 477953
16417 477953 447413 343167 606441 338377 482459 337197 370350 187206 500034 524150
16407 524150 550687 423468 130534 281280 404805 -8786 497014 413860 543269 753309
16397 753309 315848 585584 376697 496295 704740 725150 438941 360560 393136 182235
$$ packed form
16467A003452m93036L81061l89774K47686C13553J67444k7017M67465M7853l47176
16457F22122Q2177k27013A09582N25155J12285l41528O45475D22543K7231J83132
16447F32906l2696j46757P0980n2550J39225J10269m2541k47386j8592K43114
16437F55972B23351K81391K73177k96037K50317C12402J22507K08968p236K01065
16427H37706k91916k42343K63261J35686I9828K58777L0431J74659n0260l5482
16417D77953l0540j04246K63274k68064J44082j45262L3153j83144L12828K4116
16407E24150K6537j27219A30534J50746J23525h786D97014q3154J29409K10040
16397G53309C15848K69736k08887J19598K08445K0410k86209p8381L2576A82235
$$ plain form
16386 299834 304780 414802 489578 338297 491603 365972 395406 517809 483139 286358
16376 286358 496581 -50231 258354 98871 387430 142029 552280 157853 220461 497230
16366 497230 387402 560418 376007 138914 379908 423788 226478 173354 20270 195736
16356 195736 399736 145370 331336 337266 150969 113087 14534 218927 263687 394273
16346 394273 209487 329818 181889 188249 395316 122892 266350 460971 270801 347883
16336 347883 226847 295425 134768 388416 566299 345058 31720 221777 77243 313281
16326 313281 296198 419903 310794 404297 112527 224817 24426 358318 223695 401076
16316 401076 186924 158437 275966 646542 513114 472117 64753 157703 319803 576506
$$ packed form
16386B99834M946J10022P4776j51281J53306j25631K9434J22403l4670j96781
16376B86358K10223e0231B58354I8871K88559A42029M10251A57853O2608K76769
16366D97230j09828J73016j84411A38914K40994M3880j97310n3124B0270J75466
16356A95736K04000A45370J85966N930A50969l7882A4534K04393M4760J30586
16346C94273j84786J20331j47929O360K07067A22892J43458J94621j90170P7082
16336C47883j21036O8578A34768K53648J77883k21241C1720J90057G7243K36038
16326C13281j7083J23705j09109R3503A12527J12290B4426L33892j34623J77381
16316D01076A86924k8487J17529L70576j33428m0997F4753R2950J62100K56703
$$ plain form
16306 576506 230300 229312 257145 242596 6536 165428 -70588 -12732 225211 178174 96662
16295 96662 -25344 86681 -36209 178295 411187 97831 68615 60383 -73207 236569 314226
16284 314226 184759 73028 162346 199092 87776 355973 8572 403087 209424 196883 45781
16272 -98451 -240722 31865 98119 -104659 -57724 166257 7005 -70500 22545 -588 230142
16260 477788 -119399 50461 -55479 7318 20828 123165 57544 -90516 323431 417671 12661
16248 -103227 269912 438802 39177 29955 2277 -26549 95515 156851 2106 3434 45857 73343
16236 73343 54434 -327180 237255 249381 243559 227291 32314 221068 324602 31046 -134235
16224 57491 244072 85277 -237973 193429 254842 53248 240539 142614 -50115 100079 183703
$$ packed form
16306E76506B30300r88K7833j4549F536J58892g0588a2732B25211m7037q1512
16295I6662b5344H6681c6209A78295K32892I7831k9216q232g3207B36569P7657
16284C14226j29467G3028Q9318L6746H7776K68197H572L94515j93663j2541D5781
16272i8451j42271C1865O6254a04659M6935A66257G005g0500B2545e88B30142
16260D77788a19399E0461e5479G318J3510J02337E7544i0516C23431R4240A2661
16248a03227B69912J68890C9177r222B277b6549I5515O1336B106J328M2423K7486
16236G3343j8909c27180B37255J2126n822j6268C2314J88754J03534C1046a34235
16224E7491J86581H5277b37973A93429O1413E3248J87291r7925e0115A00079Q3624
$$ plain form
16213 183703 422591 456313 -792 57829 347188 174694 29625 306690 210164 177002 368425
16202 368425 181219 163881 194262 183319 169392 66433 138569 -3703 128829 -29690 177135
16190 -152076 -14628 -116268 166046 130585 252947 -14222 114403 -67811 134068 122015
16180 122015 231881 -206729 83402 229295 -2026 -297817 -195258 -294946 114850 116668 374209
16169 374209 53524 233024 37967 -36055 -192062 206575 202579 -204519 -9416 -155305 205696
16157 -129020 114411 22825 229350 207166 166305 -326094 343445 -320630 80809 125887
16147 125887 99833 140929 74936 108718 207394 -28015 -41215 -208638 137645 -171477 -117587
16136 -117587 165817 222729 194958 -62704 189477 -84239 168929 5722 -117748 -16519 -157970
$$ packed form
16213A83703K38888L3722g92E7829K89359j72494B9625K77065r6526l3162J91423
16202C68425A81219j7338L0381j0943j3927F6433P2136c703A28829b9690A77135
16190a52076a4628j01640A66046l5461J22362a4222A14403f7811A34068j2053
16180A22015J09866b06729H3402J45893b026k95791J02559r9688A14850J818K57541
16169C74209E3524J79500C7967c6055j56007B06575l996b04519i416j45889B05696
16157a29020A14411B2825K06525k2184m0861c26094C43445c20630H0809M5078
16147A25887k6054M1096o5993L3782R8676b8015j3200j67423A37645a71477N3890
16136a17587A65817N6912k7771f2704A89477h4239A68929E722a17748a6519j41451
$$ plain form
16125 -157970 -216767 59163 -107675 107020 -168656 89269 -17588 -243646 209500 -36829
16114 -116735 442332 -135007 193686 -76552 30233 -41804 147778 135203 -222510 163197
16103 -84949 351909 -65078 -94428 316852 19274 295371 52271 238295 201904 -247396 114070
16091 120412 130158 51980 -223292 -191564 -29970 123865 -13191 -78762 -138214 48978 -94606
16079 14 24364 -92438 121273 23033 -87179 -553114 -126513 -130059 -127468 -231425 -52525 -121126
16067 -121126 103952 47222 -30725 -140883 -109933 195218 139237 -118167 -60310 251904
16056 214163 -182629 -202831 -26031 -255230 -184976 -147996 -9076 133174 203029 63391 124270
16045 124270 -110879 -225931 399827 20408 -121172 8973 -219190 122116 118264 22320 -137349
$$ packed form
16125a57970n8797E9163a07675A07020a68656H9269a7588k26058B09500c6829
16114a16735D42332a35007A93686g6552C0233d1804A47778j2575b22510A63197
16103h4949C51909f5078k9350C16852A9274K76097E2271J86024l6391b47396A14070
16091A20412R746E1980b23292L1728b9970A23865a3191o5571n9452D8978i4606
16079A4K4350i2438A21273B3033h7179m65935a26513l546K591j03957e2525o8601
16067a21126A03952D7222c0725j10158L0950A95218n5981a18167N7857B51904
16056B14163a82629k0202b6031k29199P0254L6980i076A33174O9855F3391O0879
16045A24270a10879j15052C99827B0408a21172H973b19190A22116l852B2320a37349
$$ plain form
16033 139028 -65517 86649 -95808 -29850 -213133 132976 -98064 -157078 -184450 82526 -204314
16021 103951 31407 -77116 -182044 58697 -45605 247941 -176154 56977 134123 34331 -268274
16009 -96982 -111376 112425 -149951 2645 101540 -136348 8232 -368399 -113602 44985 -128071
15997 -171012 -132426 -15928 144686 132195 106702 -270709 164318 -8928 120725 -92365 321126
15985 132980 216147 35309 299605 183535 231890 63081 84358 327807 51904 465894 145776
15973 -191797 132443 237568 -87340 65681 92062 -73422 -149335 64772 171016 17291 262482
15962 262482 -288104 283298 151102 -70860 249547 -128133 74108 8845 -233369 43289
15951 128701 94115 14536 -12534 -181000 368991 -123824 -35545 46730 -325448 19417 1340
$$ packed form
16033A39028f5517H6649i5808b9850j83283A32976i8064n9014k7372H2526b04314
16021A03951C1407g7116j04928E8697d5605B47941a76154E6977P7146C4331b68274
16009i6982j4394A12425a49951B645R8895a36348H232c68399a13602D4985a28071
15997a71012L8586a5928A44686j2491k5493b70709A64318h928A20725i2365C21126
15985A32980Q3167C5309K64296j16070M8355F3081K1277K43449E1904M13990A45776
15973a91797A32443J05125h7340F5681K6381g3422p5913F4772J06244A7291K45191
15962B62482b88104B83298j32196g0860B49547a28133G4108H845b33369D3289
15951A28701l4586A4536a2534j68466C68991a23824c5545D6730c25448A9417A340
$$ plain form
15939 -171285 206910 12063 -256228 -204877 -326092 -108459 -23424 -19811 105303 -291793
15928 -375289 -363043 80813 -94028 117611 -47552 -31585 127798 -215729 -106033 -302057
15918 -302057 -204493 -35853 -159009 142176 -11595 -136280 164346 -190112 -276900 -266255
15908 -266255 97307 -423328 -107191 171483 -103628 -292753 -79832 6617 106550 189417 -22722
15896 -61616 -91073 129850 19125 -269056 138301 -202864 79188 -147377 -77709 164568
15885 289975 45487 158304 -256296 -289049 -149240 -111419 80709 -29349 -140833 -213160 -228373
15874 -228373 47304 115069 -62778 -9872 -76113 -139534 60797 110473 -6318 -71047 5938 125251
15862 125251 -77964 -118517 411983 -161131 -86387 -88540 166017 8091 98867 -123246 -66347
$$ packed form
15939a71285B06910A2063b56228N1351j21215a08459b3424L613A05303b91793
15928c75289J2246H0813i4028A17611d7552J5967A27798b15729a06033j96024
15918c02057R7564c5853j23156A42176a1595j24685A64346a90112q6788J0645
15908b66255I7307d23328a07191A71483a03628j89125g9832F617R9933Q2867b2722
15896f1616k9457A29850A9125b69056A38301b02864G9188a47377O9668A64568
15885B89975D5487J12817b56296l2753J39809L7821H0709b9349j11484p2327j5213
15874b28373D7304O7765f2778i872o6241o3421F0797M9676f318o4729E938J19313
15862A25251g7964m0553D11983a61131P4744k153A66017H091R0776a23246N6899
$$ plain form
15851 -66347 -33828 173741 83928 -309493 -17508 125676 -105651 19124 -29708 241399 -120415
15839 25929 -73455 87894 216742 -211862 44028 -178481 84397 -9500 -83390 52649 -304639
15827 -103834 234713 -111766 -117761 -198095 24918 -133863 -118355 -140508 -156419 -185945 -59307
15815 99583 -52752 13892 -34560 133658 -3004 -80321 -220513 -107884 -76895 90833 120733
15804 120733 103295 229131 -306704 -227799 322790 -96317 109860 186075 125887 134193 -175693
15792 -55392 117184 -121434 -316617 -77868 89325 -369624 25336 -196048 -104869 -117304 -4764
15780 -123673 -124455 -140102 -259682 29762 -464490 -139363 -38402 -103169 -42756 -218665 -96982
15768 -90479 32068 -148711 173077 77655 40118 -184708 -155099 22033 163816 -29554 124233
$$ packed form
15851f6347L2519A73741H3928c09493a7508A25676a05651A9124b9708B41399a20415
15839B5929g3455H7894J28848b11862D4028a78481H4397i500p3890E2649c04639
15827a03834B34713a11766n995q0334B4918a33863J5508k2153j5911k9526e9307
15815I9583e2752A3892c4560A33658c004p7317j40192a07884L0989I0833K9900
15804A20733j7438J25836c06704P8905C22790i6317A09860P6215o0188Q306a75693
15792e5392A17184a21434j95183g7868H9325c69624B5336a96048R1179j2435d764
15780a23673p82j5647j19580B9762d64490a39363c8402o4767d2756j75909i6982
15768i0479C2068a48711A73077G7655l7537a84708K9609B2033J41783b9554A24233
$$ plain form
15756 56816 -134726 147399 -27134 -21957 27475 349439 -283140 -78142 268350 -72314 -17760
15744 114472 107714 285250 -31700 214353 -152392 510819 140807 174657 -22487 -253697
15734 -253697 -107072 -139799 -135916 -96575 -261442 355999 -235459 -81991 -217745 32276 -50316
15722 -43198 -81629 111716 526096 -106509 -351091 104257 -264416 -208689 -60094 39383
15711 -70132 209811 -95027 54262 -286191 -188052 -290365 264650 -163905 -334933 80201
15700 -95060 -90746 335630 210660 -167478 -93349 -75415 -65871 -381016 501919 78524 122702
15689 122702 -19893 -231571 -143794 -145233 374270 -221788 37522 2762 -5501 -150902 -241306
15678 -241306 -49865 -179932 43405 189569 -31302 -62025 -28010 95289 57009 -208202 288193
$$ packed form
15756E6816a34726A47399b7134N177B7475L21964b83140g8142B68350g2314a7760
15744A14472o758J77536c1700B14353a52392E10819A40807L3850b2487k31210
15734b53697a07072l2727L883L9341j64867C55999b35459h1991j35754C2276e0316
15722d3198l8431A11716M14380a06509k44582A04257b64416N5727f0094C9383
15711g0132B09811i5027E4262b86191R8139j02313B64650a63905j71028H0201
15700i5060M314C35630j24970a67478P4129J7934R544l15145E01919G8524M4178
15689A22702a9893k11678Q7777j439C74270b21788C7522B762e501j45401r0404
15678b41306d9865j30067D3405J46164c1302l0723b8010I5289l8280b08202B88193
$$ plain form
15666 301663 154439 -234683 -193071 149 69257 162031 129658 19635 -175919 -449527 -45961
15654 -84101 -378687 -47436 158098 -143160 -76233 194077 -115871 -120465 144405 -225334
15643 9963 145245 -43289 -98184 -80020 -110980 -191561 -15760 51816 -72846 -222093 -180876
15632 -180876 18199 425583 -175201 -32146 257180 -259929 -56479 40006 -24190 25913 -105739
15620 -122206 58729 97291 23254 53504 44065 -83611 -20857 40356 52144 399643 22543
15608 238902 9520 -172372 195701 50970 247896 191401 -292160 -2408 107011 -18371 -221884
15597 -221884 232257 164559 -57543 8462 450141 -31653 191203 -218162 61198 200025 -111811
15585 -66825 97135 -31740 -262825 107490 78205 -176195 205284 -54953 -278777 227074
$$ packed form
15666C01663j47224b34683M1612A49O9108R2774l2373A9635a75919k73608d5961
15654h4101k94586d7436A58098a43160O6927A94077a15871m594A44405b25334
15643I963J35282d3289n4895J8164l0960q0581a5760E1816g2846j49247M1217
15632a80876A8199M07384a75201c2146B57180b59929e6479D0006b4190B5913a05739
15620a22206E8729L8562B3254L0250r439h3611b0857D0356J1788L47499B2543
15608B38902I520a72372A95701E0970J96926n6495b92160b408A07011a8371k03513
15597b21884B32257o7698e7543H462M41679c1653A91203b18162F1198J38827a11811
15585f6825I7135c1740k31085A07490k9285a76195B05284e4953k23824B27074
$$ plain form
15574 294978 105786 -62765 35416 -6960 328133 -141844 -253574 72668 -114296 135214
15563 -123542 -185352 309454 27213 34061 13610 -8733 -144197 -431370 50012 177792 -147833
15551 48432 135030 272927 325714 252584 -167219 -63368 -144073 -118261 50766 174993 -118981
15539 -79258 -115549 368195 -90128 123084 -53418 174734 -56160 41483 -356065 189443 39300
15527 330407 32508 -234525 -61543 -137372 9565 -129880 -148549 86371 -230966 150480 286528
15516 286528 -34737 13577 42267 -254533 -221951 371275 -233917 450061 -56970 -244036
15506 -244036 -350550 7742 178729 -295104 -64277 2547 -125524 -229416 -178005 -180300 -129821
15495 -129821 36129 57108 82612 -103637 -13692 -317987 113191 154505 198217 -67179 -43431
$$ packed form
15574B94978A05786f2765C5416f960C28133a41844j11730G2668a14296A35214
15563a23542o1810C09454B7213O848A3610h733j35464k87173E0012J27780a47833
15551D8432Q6598J37897N2787p3130a67219f3368q0705K5812E0766J24227a18981
15539g9258l6291C68195i0128A23084e3418A74734e6160D1483c56065A89443C9300
15527C30407C2508b34525f1543p5829I565a29880j8669H6371b30966A50480J36048
15516B86528c4737A3577K8690b54533L2582C71275b33917D50061e6970j87066
15506b44036j06514G742J70987b95104f4277B547a25524j03892N1411k295N0479
15495a29821C6129K0979K5504a03637a3692l04295A13191M1314M3712f7179K3748
$$ plain form
15484 -43431 82660 -114927 39679 -263056 -105043 -366046 79883 273448 -85957 -383157
15474 -383157 128014 -376038 6163 1628 46204 30160 8818 -201295 -146301 -122728 -186842
15463 -186842 -148754 -426189 70635 200305 -32443 -98294 266617 -54476 7884 64846 163114
15452 163114 -222033 338443 1612 -252897 -210033 251739 -5812 -154724 -148583 174965 -69722
15440 112751 -271680 258115 330009 61209 21522 -8741 232066 28923 5285 12535 91033
15429 91033 -121325 -65539 -171438 6068 -129484 90295 128071 55550 -453290 -392215 -124175
15417 94109 179926 -110521 -3910 -19973 -133372 14155 -74461 -84628 -114746 166084 47497
15405 -176856 181898 269221 83086 -20689 -193504 -180383 75441 -295656 233688 -278219
$$ packed form
15484d3431H2660a14927C9679b63056a05043k61003G9883J93565h5957k97200
15474c83157A28014c76038F163A628M4576j6044H818b01295N4994K3573o4114
15463a86842L8088k77435G0635J29670c2443o5851B66617e4476G884N6962R8268
15452A63114b22033C38443A612b52897M2864B51739e812j48912O141A74965f9722
15440A12751b71680B58115P1894F1209B1522h741B32066B8923E285P250P8498
15429I1033a21325N5786j05899F068a29484I0295L7776E5550d53290O1075a24175
15417I4109Q5817a10521c910j6063j13399A4155g4461j0167l0118A66084D7497
15405a76856A81898Q7323H3086b0689j72815J3121G5441b95656B33688b78219
$$ plain form
15394 273971 -170627 -143695 -101113 -408239 -49883 -82418 107756 -186648 -418370 -68117
15383 -6258 -12621 -123320 -263915 -174829 -109719 329696 267584 -121541 59690 -203256 -168055
15372 -168055 146773 -121216 -14665 -221837 -200291 164525 -84873 -231526 -181485 219681
15361 -460309 -98299 350887 240439 -205272 60801 22111 -223914 90898 -120379 -85313
15351 -85313 65018 -78125 -62067 307283 -123240 310028 73955 31747 147752 -11952 23096
15339 -189045 93651 -101522 320772 -260635 92044 -210387 367356 103595 -281844 308973
15328 67173 126529 -124319 213088 104047 127132 203 184491 10191 -370047 413098 -63285
15316 50207 -146048 -261121 -122553 -147026 -174014 -263799 149399 168978 -176112 407046
$$ packed form
15394B73971a70627K6932M2582l07126d9883l2535A07756a86648k31722f8117
15383f258o363j10699j40595Q9086O5110C29696o2112a21541E9690b03256L5201
15372a68055A46773a21216a4665k07172K1546A64525h4873j46653N0041B19681
15361d60309i8299C50887j10448b05272F0801B2111b23914I0898a20379L5066
15351h5313F5018g8125J6058C07283a23240C10028G3955C1747J16005a1952B3096
15339a89045I3651a01522C20772b60635I2044b10387C67356A03595b81844C08973
15328F7173N9356a24319B13088A04047K3085B03J84288A0191c70047D13098f3285
15316E0207a46048j15073a22553k4473k6988q9785A49399J9579a76112D07046
$$ plain form
15305 66100 -23659 48216 -86032 -122413 -80039 180072 14908 25993 95356 313710 95350
15293 -24291 402736 -73026 -375694 280334 82984 -25902 44613 247417 -102783 -156450 -132034
15282 -132034 30723 -117999 97112 -121689 477812 233312 -163603 190676 195968 70136
15271 139929 -38462 234380 -59762 49817 25654 133395 449256 -116813 24800 331590
15261 331590 -108327 238210 -131327 -76002 192734 53529 361918 -328790 38872 131922
15251 131922 169003 168905 587917 1130890 1189262 1577393 1009889 263769 146496 -24551 28575
15239 302708 68807 16513 365867 249871 87887 121981 -58309 207755 -41951 -9974 -118857
15228 -118857 -100162 77679 64535 -42057 264288 32189 -183378 260454 -105988 248288
$$ packed form
15305F6100b3659D8216h6032l6381M2374A80072A4908J1085O9363K18354I5350
15293b4291D02736g3026l02668B80334H2984b5902D4613K02804a02783n3667K4416
15282a32034C0723a17999I7112a21689D77812B33312a63603A90676N292G0136
15271A39929c8462B34380e9762D9817k4163J07741L15861a16813B4800L06790
15261C31590a08327B38210a31327N5325A92734E3529L08389c28790C8872R3050
15251A31922L7081r8M19012N42973N8372L88131n67504B63769j17273b4551B8575
15239C02708F8807A6513L49354j15996H7887L4094e8309B07755d1951i974j08883
15228a18857J8695G7679j3144d2057B64288C2189a83378B60454a05988B48288
$$ plain form
15217 3428 -53441 -31044 -160895 173669 -153886 191543 101953 59969 30080 -255974 -22307
15205 74663 -2774 -129941 220530 -8596 -78692 403605 81722 45146 85584 -24784 67488
15193 50771 122079 -122511 57918 209416 -119478 19232 148416 319969 -158603 -72825
15182 54278 6091 209214 79535 -142530 301231 157090 -135955 242520 -25984 196006
15171 145104 -33667 -174639 42599 208168 -190814 -10721 -92902 233325 241575 -3523 396596
15159 112043 -120557 -14676 247363 266332 -12457 172508 165970 212533 73119 -102492 -41219
15147 -7258 107181 49435 82857 453744 38723 -262133 278299 337627 -76525 358724 -68593
15135 -55662 113385 -194564 271588 -316591 78386 18541 90450 -75916 161351 -31502 372963
$$ packed form
15217C428e3441K2397j29851A73669a53886A91543q9590m1984k9889b55974b2307
15205G4663b774j27167B20530h596p0096D03605H1722l6576M0438b4784F7488
15193E0771P1308a22511E7918J51498a19478A9232J29184J71553a58603g2825
15182E4278F091K03123G9535a42530C01231j44141a35955B42520b5984A96006
15171A45104c3667j40972D2599J65569a90814a0721q2181B33325Q250c523C96596
15159A12043a20557a4676B47363J8969a2457A72508o538M6563G3119a02492d1219
15147g258A07181D9435L3422L70887C8723b62133B78299N9328g6525C58724f8593
15135e5662A13385a94564B71588c16591G8386A8541P1909g5916A61351c1502C72963
$$ plain form
15123 41892 484477 288060 -68827 192304 215187 17786 119467 8760 145775 6807 68998
15112 68998 206650 -114985 -48456 -198793 33315 325073 96351 212334 -130735 -88189
15102 -88189 -41891 -125238 -68195 235155 60604 215059 190145 22124 559630 -39295 288301
15090 26004 -138688 107300 -270243 -135054 -275898 7242 72288 74613 132620 -114121 -205982
15079 -205982 232601 244948 105919 -39394 76750 333433 -143867 26522 407867 265732
15069 265732 154307 36759 80473 41597 -14884 99883 128340 321154 -45508 226531 279918
15058 279918 -204185 -152395 -20101 -21793 -36795 284530 222570 -36224 141032 153569 -84731
15046 269246 35591 -40341 192754 -14428 223235 132197 -28538 200989 403290 159483
$$ packed form
15123D1892M42585j96417f8827A92304K2883A7786J01681H760J37015F807O2191
15112F8998J37652a14985d8456j50337C3315K91758I6351J15983a30735M2546
15102h8189d1891q3347N7043B35155F0604J54455k4914B2124N37506c9295B88301
15090B6004a38688A07300b70243a35054j40844G242O5046K325N8007a14121r1861
15079b05982B32601J2347A05919c9394G6750K56683a43867B6522L81345j42135
15069B65732j11425C6759M3714l8876a4884I9883K8457J92814d5508B26531N3387
15058B79918b04185N1790b0101j692j5002B84530o1960c6224A41032J2537h4731
15046B69246C5591d0341A92754a4428B23235r1038b8538B00989K02301A59483
$$ plain form
15035 163161 13520 59761 -71599 62004 87189 248810 178002 -33682 160362 -177901 106815
15023 179993 376735 209054 216558 167190 159801 235351 29778 87265 55422 209479 -16843
15011 88264 358488 135456 18492 -2576 418159 287752 401211 158480 385403 114148
15000 228865 302243 119996 342485 53738 46412 -31810 348487 120777 76417 20834 -89148
14988 401131 311103 180236 133401 476554 196803 144707 416454 -96017 343122 239568
14978 239568 176767 510277 -110996 137208 93319 178974 341178 314472 260760 341200 266215
14967 266215 124500 176616 169122 -28032 -84846 -70663 423499 220126 250222 323611 307943
14956 307943 36217 455675 168990 331588 270597 337069 248071 212895 171503 152025 535856
$$ packed form
15035A63161A3520M6241g1599F2004K5185J61621p0808c3682A60362a77901A06815
15023A79993J96742j67681P504m9368p389P5550B9778N7487l1843J54057a6843
15011H8264K70224A35456A8492b576D18159j30407J13459A58480K26923A14148
15000B28865P3378A19996K22489E3738p326c1810C48487A20777m4360B0834h9148
14988D01131r0028j30867m6835L43153A96803n2096K71747i6017C43122j03554
14978B39568o2801L33510a10996A37208m3889Q5655J62204k6706n3712Q0440p4985
14967B66215A24500N2116p494b8032n6814J4183D23499k03373L0096P3389j5668
14956C07943C6217M19458A68990J62598o0991O6472q8998l5176m1392j9478L83831
$$ plain form
14945 535856 147401 81759 376178 185426 68538 242906 10612 10736 178484 489512 202205
14933 -135434 240603 64820 200737 129732 24253 34766 81958 523976 183517 396256
14923 396256 299892 564246 401715 406691 296980 686480 144801 317663 190061 -155683
14912 379591 284400 207959 -103783 613341 442529 -53378 79703 456274 306647 358885
14902 358885 550219 208045 179997 340908 138807 204945 139314 -190566 267105 164672
14892 164672 418726 179773 142298 180087 228338 279303 125397 583737 262821 378109
14882 378109 626703 230150 102442 181206 316437 369329 364437 573852 310616 207913
14872 207913 322007 384778 376591 295799 214981 578214 401319 467276 779451 570566 13316
$$ packed form
14945E35856A47401o5642K94419A85426F8538J74368A0612J24J67748L11028B02205
14933a35434B40603F4820J35917p1005B4253J0513M7192M42018A83517K12739
14923C96256r6364K64354j62531M976j09711L89500A44801J72862j27602a55683
14912C79591r5191p6441a03783F13341j70812e3378G9703L76571j49627N2238
14902C58885J91334B08045k8048J60911A38807O6138o5631a90566B67105j02433
14892A64672K54054A79773l7475L7789M8251N0965A25397M58340B62821J15288
14882C78109K48594B30150A02442P8764J35231N2892m892K09415k63236j02703
14872B07913J14094O2771q187q0792q0818L63233j76895O5957L12175k08885A3316
$$ plain form
14860 382985 219144 213949 514155 689302 446354 407391 223687 413590 207117 158853
14850 158853 254464 491429 235638 113320 460704 630927 348194 88520 164071 138897
14840 138897 275157 219537 298972 829849 519213 343845 113864 185957 352256 494952
14830 494952 247806 581681 551360 250986 84340 497865 282453 101001 214009 483024
14820 483024 465024 406108 4619 598685 295104 442717 313173 -94746 376713 377450 378811
14809 378811 500513 192179 385253 479887 77141 413633 731543 336911 209815 536104
14799 536104 458761 151452 668133 -43252 214392 383626 170294 201063 -41192 504177
14788 752552 322247 464852 493419 538477 278786 514366 510957 918103 342741 672274
$$ packed form
14860C82985j63841n195L00206J75147k42948l8963j83704J89903k06473m8264
14850A58853R5611K36965B35638A13320L47384J70223k82733H8520P5551k5174
14840A38897J36260n5620P9435N30877l10636j75368A13864P2093J66299J42696
14830D94952k47146L33875l0321B50986H4340M13525k15412A01001J13008K69015
14820D83024j8000n8916D619N94066B95104J47613j29544i4746C76713P37J361
14809C78811J21702A92179J93074R4634G7141L36492L17910C36911j27096L26289
14799E36104p7343A51452N16681d3252B14392J69234A70294L0769d1192E04177
14788G52552C22247J42605K8567M5058k59691K35580l409M07146C42741L29533
$$ plain form
14778 672274 556247 503890 653329 586524 425696 195127 614029 409930 438157 507286
14768 507286 57542 421916 261401 721068 714472 644105 633268 616495 613566 488148 920508
14757 920508 511598 444603 598098 699974 479573 568914 554094 213271 307218 720970
14747 720970 405660 915736 491472 929308 618110 22125 498921 357753 586241 640831
14737 640831 661025 358833 807724 497833 891867 653545 817502 820242 567849 629486
14727 629486 738161 614066 725221 563929 475705 948565 850598 1065164 633844 293034
14716 341056 533744 578683 699727 655921 409368 628487 774879 378929 663860 629997
14706 629997 825095 917526 671479 761933 681464 755930 813702 497802 838381 654074
$$ packed form
14778F72274j16027n2357J49439o6805j60828A95127M18902k04099K8227O9129
14768E07286E7542L64374j60515M59667o596p0367j0837j6773k929j25418M32360
14757I20508m08910o6995J53495J01876k20401Q9341j4820B13271R3947M13752
14747G20970l15310N10076m24264M37836l11198B2125M76796j41168K28488N4590
14737F40831K0194l02192M48891l09891L94034k38322J63957K740k52393O1637
14727F29486J08675j24095J11155j61292q8224M72860r7967K14566m31320B93034
14716C41056J92688M4939J21044m3806k46553K19119J46392C78929K84931l3863
14706F29997J95098R2431k46047R0454q0469P4466N7772l15900L40579j84307
$$ plain form
14696 654074 1114309 676901 817626 727804 794492 585438 723769 641844 569957 431601
14686 431601 547116 903906 796762 526717 582956 1005204 779027 828897 964793 614656
14676 614656 912943 873776 618972 822300 868920 676223 576091 655639 958200 866660
14666 866660 1044279 1136098 661173 1025793 540428 790707 918914 817409 722246 752745
14656 752745 761373 1088316 1051787 659500 782567 886033 860306 920703 914525 1140040 945223
14645 945223 845726 1316951 987042 967992 870064 964237 1323629 1048136 1119880 965612
14635 965612 1061590 1366864 935176 1342368 1144888 1100678 1217730 1060844 753233 1156762
14625 1156762 824122 996588 1288304 1021626 1103066 1135279 1168276 961418 1284641 1353187
$$ packed form
14696F54074M60235m37408J40725q9822O6688k09054J38331q1925p1887j38356
14686D31601J15515L56790j07144k70045N6239M22248k26177M9870J35896l50137
14676F14656K98287l9167k54804K03328M6620j92697j00132P9548L02561r1540
14666H66660J77619R1819m74925L64620m85365K50279J28207j01505r5163L0499
14656G52745Q628L26943l6529l92287J23067J03466k5727O0397o178K25515j94817
14645I45223r9497M71225l29909j9050r7928R4173L59392k75493P1744j54268
14635I65612R5978L05274m31688M07192j97480m4210J17052j56886l07611M03529
14625A156762l32640J72466K91716k66678Q1440L2213L2997k06858L23223O8546
$$ plain form
14615 1353187 1651329 1011785 1302721 1407718 1231107 1310822 1125144 1235575 1154683 1273532
14605 1273532 1566805 1120707 1494266 1345861 1238583 1462514 1312281 1182469 1328938
14596 1328938 1197448 1367262 1438339 1325271 1461203 1499780 1550481 1404467 1496222 1529215
14586 1529215 1534786 1739214 1592057 1519713 1840159 1452638 1548643 1527969 1482234 1808242
14576 1808242 1817395 1765004 1618441 1969998 1984112 1894474 1854229 1905266 2052270 1725621 2047563
14565 2047563 1944918 2250456 1928275 2046869 1949582 2013459 1977158 2696466 2554837 2856138
14555 2856138 2706918 2888432 2772019 3624591 4205912 4524003 5939678 9743083 19259294
14546 19259294 40244605 41288135 21110709 9137863 4171211 2550271 1719883 1745195
$$ packed form
14615A353187K98142o39544K90936J04997j76611P9715j85678J10431q0892J18849
14605A273532K93273m46098L73559j48405j07278K23931j50233j29812J46469
14596A328938j31490J69814P1077j13068J35932L8577N0701j46014R1755L2993
14586A529215N571K04428j47157p2344L20446l87521R6005k0674m5735L26008
14576A808242R153n2391j46563L51557J4114q9638m0245N1037J47004l26649L21942
14565B047563j02645L05538l22181J18594r7287O3877l6301P19308j41629L01301
14555B856138j49220J81514j16413Q52572N81321L18091J415675L803405R516211
14546A9259294K0985311J043530k0177426I137863D171211j620940q30388K5312
$$ plain form
14538 1745195 1740676 1654284 1439110 1832832 1776892 1832121 1842889 1797693 1987701 2012475 1855817
14527 1855817 2019270 1978663 1910746 2229510 2183473 2008569 2083496 2002531 2124457 2008210
14517 2008210 2070850 2063382 2022744 2502146 2077579 2073542 1879815 2239609 2449054 2409226 2496043
14506 2496043 2367818 2372812 2390922 2548100 2681490 2720431 2412921 2964042 2517540 2731277
14496 2731277 2597472 2660047 2546592 2887586 3012185 2999618 2921101 2896091 2975186 2944394
14486 2944394 3084040 3245806 3385894 3030640 3056859 3249574 3076429 3432417 3422857 3296048
14476 3296048 3506778 3280865 3177945 3552010 3495214 3641461 3524923 3851084 3771064 3704280
14466 3704280 4027828 3680482 3869384 3875663 3887820 4006834 4115785 3859386 4098625 4147041
$$ packed form
14538A745195m519q6392k15174L93722n5940N5229J0768m5196J90008K4774j56658
14527A855817J63453m0607o7917L18764m6037j74904P4927q0965J21926j16247
14517B008210O2640p468m0638M79402m24567m037j93727L59794K09445l9828Q6817
14506B496043j28225M994J8110J57178J33390L8941l07510N51121m46502K13737
14496B731277j33805O2575j13455L40994J24599j2567p8517k5010P9095l0792
14486B944394J39646J61766J40088l55254K6219J92715j73145L55988r560j26809
14476C296048K10730k25913j02920L74065n6796J46247j16538L26161q0020o6784
14466C704280L23548l47346J88902O279J2157J19014J08951k56399K39239M8416
$$ plain form
14456 4147041 4375627 4394128 4607994 4507696 4557163 4488843 4543246 4574681 4758132 4562761
14446 4562761 4734428 5040100 4890559 4828005 4834445 4990085 5121981 5184449 5121165 5350418
14436 5350418 5236875 5390031 5902963 5527675 5597153 5693286 5936096 5801738 5908100 5898453
14426 5898453 6181740 5805880 6287166 6031387 6404205 6662615 6734839 6648311 6859333 6896743
14416 6896743 7016251 7258434 7280874 7549485 7507288 7625538 7595539 7733979 7905310 7867959
14406 7867959 8461317 8257167 8605480 8808572 8670821 9142091 9204617 8677718 9339892 9810450
14396 9810450 9632141 9599816 9685863 9848894 9992394 10426883 10424421 10795156 11154595 11200110
14386 11200110 11243536 11252007 11742709 11894088 12003460 12526096 12763255 12669972 13037037 13271709
$$ packed form
14456D147041K28586J8501K13866j00298M9467o8320N4403L1435J83451j95371
14446D562761J71667L05672j49541o2554O440J55640J31896O2468o3284K29253
14436E350418j13543J53156N12932l75288O9478R6133K42810j34358J06362r647
14426E898453K83287l75860M81286k55779L72818K58410P2224q6528K11022L7410
14416F896743J19508K42183K2440K68611m2197J18250k9999J38440J71331l7351
14406G867959N93358k04150L48313K03092j37751M71270O2526n26899O62174M70558
14396I810450j78309l2325Q6047J63031J43500M34489k462L70735L59439M5515
14386A1200110M3426Q471M90702J51379J09372N22636K37159r3283L67065K34672
$$ plain form
14376 13271709 13734669 13655305 14322488 14220307 14395469 14918740 15083844 15536603 15844392
14367 15844392 16069386 16221700 16985693 17397754 17244453 18010201 18213995 18916341 19140367
14358 19140367 19513710 20036630 20396151 20889948 21583539 21977685 22325158 23091854 23569290
14349 23569290 24260753 24762630 25449066 26003552 26727344 27453710 27824757 28849024 29912547
14340 29912547 30910179 31591402 32451379 33162657 34195316 35390762 36375752 37681551 38577199
14331 38577199 39392172 41040410 42148556 43672953 45245464 46769645 47955636 49698112
14323 49698112 51558626 53630266 55385342 57414399 59119090 61506411 63891565 66200746
14315 66200746 68920240 71593795 74878301 77756240 80974534 84401334 87538587 92104689
$$ packed form
14376A3271709M62960p9364O67183j02181J75162N23271J65104M52759L07789
14367A5844392K24994J52314P63993M12061j53301P65748K03794P02346K24026
14358A9140367L73343N22920L59521M93797O93591L94146L47473P66696M77436
14349B3569290O91463N01877O86436N54486P23792P26366L71047J024267J063523
14340B9912547R97632O81223Q59977P11278J032659J195446R84990J305799Q95648
14331C8577199Q14973J648238J108146J524397J572511J524181J185991J742476
14323D9698112J860514K071640J755076K029057J704691K387321K385154K309181
14315F6200746K719494K673555L284506K877939L218294L426800L137253M566102
$$ plain form
14307 92104689 96045234 100431078 105295236 109975289 115107272 120770757 126937144 132975919
14299 132975919 139768828 146755994 154774111 163073193 171972280 181336652 191042752 201406793
14291 201406793 213247196 224837318 237154407 250489662 264342075 279219025 294605136
14284 294605136 310535888 327039527 343424691 360044308 376844550 392969324 408923458
14277 408923458 423655941 437132275 448694157 458216668 464946190 466977522 464594625
14270 464594625 461344375 456108494 451316250 448086485 442071268 431671123 417981485 402958467
14262 402958467 386256200 369408697 352589434 335515905 318504106 302369168 286333332
14255 286333332 272143986 257575458 243972781 230749624 218408970 206822131 195751445
$$ packed form
14307I2104689L940545M385844M864158M680053N131983N663485O166387O038775
14299A32975919O792909O987166Q018117Q299082Q899087R364372R706100J0364041
14291B01406793J1840403J1590122J2317089J3335255J3852413J4876950J5386111
14284B94605136J5930752J6503639J6385164J6619617J6800242J6124774J5954134
14277D08923458J4732483J3476334J1561882R522511O729522K031332k382897
14270D64594625l250250n235881m792244l229765o015217j0400145j3689638j5023018
14262D02958467j6702267j6847503j6819263j7073529j7011799j6134938j6035836
14255B86333332j4189346j4568528j3602677j3223157j2340654j1586839j1070686
$$ plain form
14248 195751445 185286674 175609126 166370546 158134331 150485910 142858123 135851764 128912373
14240 128912373 122883245 116920977 111918452 106698839 101745142 97207440 93121167 89245617
14232 89245617 85564308 82469784 78569034 75569936 72422997 69506523 66628761 64432076
14224 64432076 61775114 59708767 57460146 55578567 53606245 51672297 49831127 48117636
14216 48117636 46443396 44912576 43870312 42643867 41201115 39784664 38789911 37242936
14208 37242936 36634463 36470360 34826889 33649671 32572982 31802789 30669092 30228041 29606362
14199 29606362 28749073 27806133 26834761 26065853 25971138 25292954 24374005 23935872 23774397
14190 23774397 22777216 22414333 21781796 21222030 20970122 20195686 19983705 19179770 19046958
$$ packed form
14248A95751445j0464771r677548r238580q236215p648421p627787p006359o939391
14240A28912373o029128n962268n002525n219613m953697m537702m086273l875550
14232H9245617l681309l094524l900750k999098l146939k916474k877762k196685
14224F4432076k656962k066347k248621j881579j972322j933948j841170j713491
14216D8117636j674240j530820j042264j226445j442752j416451r94753j546975
14208C7242936o08473j64103j643471j177218j076689p70193j133697m41051o21679
14199B9606362q57289r42940r71372p68908r4715o78184r18949m38133j61475
14190B3774397r97181l62883o32537n59766k51908p74436k11981q03935j32812
$$ plain form
14181 19046958 18625387 18221909 17808300 17424426 17456506 16736836 16312206 16125713 15660752
14172 15660752 15323895 14980285 14941333 14694303 14364130 14060953 13621534 13261528 12913495
14163 12913495 12999137 12666458 12334661 11885681 12197948 11953267 11653054 11292065 11141457
14154 11141457 11116437 11002641 10968259 10610974 10424878 10265246 9999778 9741060 9811414 9786102
14144 9786102 9493800 9204033 8875432 8889135 9008410 8911510 8806170 8338510 8021254 7735996
14134 7735996 7855340 8183787 7792730 8137325 7667148 7476680 7530128 7168731 7365182 6967750
14124 6967750 6752048 6787446 7071651 6626083 6662288 6558139 6502992 6150922 6325776 6161933
14114 6161933 6195797 6116348 6074882 5784846 6026019 6013413 5702583 5612480 5604216 5806845 5139401
$$ packed form
14181A9046958m21571m03478m13609l83874L2080p19670m24630j86493m64961
14172A5660752l36857l43610l8952k47030l30173l03177m39419l60006l48033
14163A2913495Q5642l32679l31797m48980L12267k44681l00213l60989j50608
14154A1141457k5020j13796l4382l57285j86096j59632k65468k58718P0354k5312
14144I786102k92302k89767l28601J3703J19275r6900j05340m67660l17256k85258
14134G735996J19344L28447l91057L44595m70177j90468N3448l61397J96451l97432
14124F967750k15702L5398K84205m45568L6205j04149n5147l52070J74854j63843
14114F161933L3864p9449m1466k90036K41173j2606l10830r0103q264K02629o67444
$$ plain form
14103 5139401 5391601 5507857 5204439 5175976 5091300 5319069 5052471 4960407 4836395 4579475
14093 4579475 4932657 4628468 4519205 4705389 4311392 4423399 4447985 4391237 4389731 4074877
14083 4074877 4134648 4262306 4313818 4036296 4151338 4183583 4202488 4063274 3932693 4064810
14073 4064810 3739261 3531797 3658104 3851342 3426654 3495198 3942815 3881283 3761913 3492597
14063 3492597 3454223 3684834 3578723 3372229 3609599 3430124 3572015 3354982 3272548 3182196
14053 3182196 3442623 3132357 3086013 3068708 2988462 3244348 2732662 2851681 2968321 2743719
14043 2743719 2522879 2771310 2828741 2704620 2741517 2431710 2610591 2600651 2347206 2371199
14033 2371199 2619600 2704460 2280456 2804883 2637938 2417674 2682694 2309255 2208045 2158495
$$ packed form
14103E139401K52200J16256l03418k8463q4676K27769k66598r2064j24012k56920
14093D579475L53182l04189j09263J86184l93997J12007K4586n6748j506l14854
14083D074877N9771J27658N1512k77522J15042L2245J8905j39214j30581J32117
14073D064810l25549k07464J26307J93238m24688O8544M47617o1532j19370k69316
14063C492597l8374K30611j06111k06494K37370j79475J41891k17033q2434r0352
14053C182196K60427l10266m6344j7305q0246K55886n11686J19019J16640k24602
14043B743719k20840K48431N7431j24121L6897l09807J78881r940k53445K3993
14033B371199K48401Q4860m24004N24427j66945k20264K65020l73439j01210m9550
$$ plain form
14023 2158495 2193070 2458611 2327420 2564185 2412518 2238961 2176557 2063153 1960626 2169334
14013 2169334 2237026 2344751 2205759 2008082 2391258 1759946 1948899 1835535 1828994 1709515
14003 1709515 2038451 1760220 1810278 1807934 2060862 1927750 1803426 1734409 1936099 1987941
13993 1987941 1788565 1650275 1786964 2209201 2751149 4776129 12167950 32188393 42060835
13984 42060835 24799911 13254402 7737459 5291819 4119264 3291333 2896578 3099131
13976 3099131 2605628 2840555 2853332 1983636 2189908 2261413 2200945 2053250 2244151 2190507
13966 2190507 1862447 1821347 2137200 1940769 1936696 1805159 1704217 1559362 1382002 1681105
13956 1681105 1850125 1814985 1837470 1958728 1565160 1329132 1499051 1627351 1515576 1539986
$$ packed form
14023B158495L4575K65541j31191K36765j51667j73557o2404j13404j02527K08708
14013B169334O7692J07725j38992j97677L83176o31312J88953j13364o541j19479
14003A709515L28936k78231N0058k344K52928j33112j24324o9017K01690N1842
13993A987941j99376j38290J36689M22237N41948K024980P391821K0020443R872442
13984D2060835j7260924j1545509n516943k445640j172555q27931l94755K02553
13976C099131m93503K34927J2777q69696K06272P1505o0468j47695J90901n3644
13966B190507l28060m1100L15853j96431m073j31537j00942j44855j77360K99103
13956A681105J69020l5140K2485J21258l93568k36028J69919J28300j11775K4410
$$ plain form
13946 1539986 1183310 1376781 1388521 1385330 1358909 1641126 1560177 1342595 1227252 1699534
13936 1699534 1574342 1018362 1137827 1490641 1360224 1337221 1398088 1111756 1298572 1529057
13926 1529057 1461059 1393494 1295712 1407559 1310294 1152630 1409667 1134722 1441458 1368231
13916 1368231 1423536 1435416 1537391 1034392 1239488 1151879 1022021 942127 919042 900159
13906 900159 1195120 1053622 1065791 1436722 958580 1203667 1249779 1382547 1001088 1401084
13896 1401084 1258898 1094640 1181336 1151951 1218612 1303262 885593 917274 997336 1035437 1103699
13885 1103699 948459 976628 1040469 954648 1061701 1290454 854031 1144048 1032674 1173156
13875 1173156 789695 812062 916488 870348 825488 938932 1311193 1142682 1011874 1053804
$$ packed form
13946A539986l56676J93471J1740l191k6421K82217q0949k17582j15343M72282
13936A699534j25192n55980J19465L52814j30417k3003O0867k86332J86816K30485
13926A529057o7998o7565r7782J11847r7265j57664K57037k74945L06736p3227
13916A368231N5305J1880J01975n02999K05096q7609j29858p9894k3085j8883
13906I00159K94961j41498J2169L70931m78142K45087M6112J32768l81459L99996
13896A401084j42186j64258Q6696k9385O6661Q4650m17669L1681Q0062L8101O8262
13885A103699j55240K8169O3841q5821J07053K28753m36423K90017j11374J40482
13875A173156l83461K2367J04426m6140m4860J13444L72261j68511j30808M1930
$$ plain form
13865 1053804 883478 615235 967863 911481 802528 993990 883616 930079 791612 888325
13855 888325 928201 768322 1002532 934069 796252 735459 995695 601870 339559 1092383
13845 1092383 1070989 423756 796328 933135 612673 784978 1015091 700984 756872 889455
13835 889455 1069852 877808 933923 1255754 802621 855211 648433 989587 665529 857752
13825 857752 598068 395403 536166 843424 549999 442345 749432 678312 847036 864657
13815 864657 692155 869953 273354 727471 655271 563928 690708 479575 746400 578298
13805 578298 691038 751179 563062 961077 638441 418909 583850 782235 524473 585190
13795 585190 748500 740261 638466 579260 372125 602303 897174 621339 595294 698420
$$ packed form
13865A053804j70326k68243L52628n6382j08953J91462j10374M6463j38467R6713
13855H88325L9876j59879K34210o8463j37817o0793K60236l93825k62311P52824
13845A092383k1394D23756L72572J36807l20462J72305K30113l14107N5888J32583
13835H89455J80397j92044N6115L21831m53133N2590k06778L41154l24058J92223
13825H57752k59684k02665J40763L07258k93425j07654L07087p1120J68724J7621
13815H64657j72502J77798B73354M54117p2200r1343J26780k11133K66825j68102
13805E78298J12740O0141j88117L98015l22636k19532J64941J98385k57762O0717
13795E85190J63310q239j01795n9206k07135K30178K94871k75835k6045J03126
$$ plain form
13785 698420 766581 619896 356143 772083 1025542 723123 743066 311788 786903 649555
13775 649555 434522 764742 581785 843795 428910 463175 528773 394392 454983 1077865
13765 1077865 511730 862384 218793 662376 751982 648698 221275 421079 590884 726931
13755 726931 616515 523755 477937 788880 692223 772798 445310 206255 357404 383584
13745 383584 379293 523015 454230 428386 315783 671761 447128 525327 348779 547246
13735 547246 379793 540384 399111 392504 164051 596177 447989 519095 668699 810547
13725 810547 887609 181005 425383 603367 347271 693456 218158 340906 568310 245228
13714 411600 460139 382024 427224 728789 442138 42464 582119 93344 312628 261602 375756
$$ packed form
13785F98420O8161j46685k63753M15940K53459l02419J9943C11788M75115j37348
13775F49555k15033L30220j82957K62010m14885L4265O5598j34381O0591O22882
13765A077865E11730L50654B18793M43583Q9606j03284B21275J99804J69805J36047
13755G26931j10416r2760m5818L10943r6657Q0575l27488B06255J51149K6180
13745C83584m291J43722o8785k5844j12603L55978k24633P8199j76548J98467
13735E47246j67453J60591j41273o607A64051M32126j48188P1106J49604J41848
13725H10547P7062A81005K44378J77984k56096L46185B18158J22748K27404B45228
13714D11600M8539p8115M5200L01565k86651D2464N39655I3344K19284n1026J14154
$$ plain form
13703 375756 586651 524684 395254 940450 405491 556592 503357 475391 588925 350760
13693 350760 307924 299461 648350 246909 502373 393368 302460 658964 193253 461179
13683 461179 438596 435177 446951 457322 304479 530925 -58240 268459 70840 167658 429774
13672 429774 532314 156221 404179 226513 466815 125679 400457 731286 336814 211014
13662 211014 422924 592097 376171 206921 648276 375020 324643 402886 452091 238535
13652 238535 350159 423493 466302 287880 651666 462892 293160 313691 425696 399892
13642 399892 370750 576050 440067 351354 305847 600146 575464 842492 341778 681580
13632 681580 200828 316260 187089 427965 448526 10420 -120113 413692 312276 393089
$$ packed form
13703C75756K10895o1967j29430N45196D05491J51101n3235k7966J13534k38165
13693C50760m2836q463L48889B46909K55464j09005r0908L56504A93253K67926
13683D61179k2583l419J1774J0371j52843K26446e8240B68459G0840R6818K62116
13672D29774J02540A56221K47958j77666K40302A25679K74778L30829C36814j25800
13662B11014K11910J69173k15926j69250M41355k73256n0377P8243M9205k13556
13652B38535J11624P3334M2809j78422L63786j88774j69732K0531J12005k5804
13642C99892k9142K05300j35983q8713m5507K94299k4682K67028C41778L39802
13632F81580B00828J15432j29171K40876K0561A0420a20113D13692j01416Q0813
$$ plain form
13622 393089 307862 411601 524739 293064 352748 397456 326183 162375 68175 203659
13612 203659 524423 228534 639325 517682 263981 326313 517252 209109 359866 324537
13602 324537 243703 392849 62552 318616 103691 483778 201357 330227 480093 207779
13591 104134 443815 -33701 592213 411601 307770 423692 62603 203968 313803 -50745
13580 244378 210019 -112230 -75686 245325 -99352 146116 299787 106342 369737 170662
13569 55767 236101 201193 591075 358798 333393 268828 201348 370131 224510 189402 329664
13558 329664 626470 266498 391584 116626 352706 110281 346059 343715 317416 300635
13548 300635 19209 176720 267963 315234 107399 773876 357296 56892 -96656 -2471 96383
$$ packed form
13622C93089q5227J03739J13138k31675N9684M4708p1273A62375F8175J35484
13612B03659L20764B28534M10791j21643k53701O2332J90939B09109J50757l5329
13602C24537q0834J49146F2552K56064A03691L80087B01357J28870J49866B07779
13591A04134L39681c3701E92213j80612j03831J15922F2603J41365J09835e0745
13580B44378l4359a12230L6544B45325i9352A46116J53671A06342K63395A70662
13569E5767J80334l4908L89882k32277k5405o4565o7480J68783j45621l5108J40262
13558C29664K96806B66498J25086A16626K36080A10281K35778k344k6299j6781
13548C00635A9209J57511R1243M7271A07399O66477C57296E6892i6656b471I6383
$$ plain form
13536 78162 171794 518840 172570 -126320 317121 -58475 153042 261116 564446 203319
13525 283669 -4502 245463 133243 504838 336584 425824 52841 343869 314453 -87572 242032
13513 152699 362775 102085 281660 212493 145627 358802 453515 251399 515581 -148975
13502 172532 283344 155852 425742 189831 181705 189056 177711 274388 347036 294245 -46344
13490 143825 530370 324891 127789 215064 74351 342274 208032 455865 -4490 66085
13479 141417 370032 195795 311960 120439 174977 316147 88416 370173 178773 261602
13469 261602 336048 -73730 254590 333619 28555 310675 443826 265461 -11715 268471
13458 405758 158791 -103482 39902 256142 440323 353172 405391 199649 54508 391657
$$ packed form
13536G8162R3632L47046A72570a26320C17121e8475A53042J08074L03330B03319
13525B83669d502B45463j12220L71595j68254Q9240E2841K91028k9416h7572B42032
13513A52699K10076A02085J79575o9167o6866K13175R4713k02116K64182a48975
13502A72532J10812j27492K69890A89831q126P351j1345R6677P2648n2791d6344
13490A43825L86545k05479A27789Q7275G4351K67923j34242K47833d490F6085
13479A41417K28615j74237J16165A20439N4538J41170H8416K81757A78773Q2829
13469B61602P4446g3730B54590P9029B8555K82120J33151j78365a1715B68471
13458D05758A58791a03482C9902K16240J84181q7151N2219A99649E4508L37149
$$ plain form
13448 391657 472702 310157 238283 -7422 242685 106539 134107 223636 115835 66910 288849
13437 288849 -64002 -44290 286212 252770 36648 71236 204515 275491 -164203 456001 166260
13425 279207 319480 322347 374133 303444 170707 10914 109620 64354 128903 145981 -4049 32339
13412 336391 191405 301852 318126 -64581 253644 578261 327690 334186 72539 112493 218252
13401 218252 349085 295530 314625 19381 173198 158311 253195 8162 -3997 190671 200080
13390 200080 188233 271711 49819 50155 255522 137127 -58139 367831 9137 54333 57062 322862
13378 322862 -39198 -44785 204784 282639 123586 -43758 294317 315147 339513 -122520 222827
13366 132555 270753 -94967 518373 399548 -12881 -51692 18968 120193 114744 44505 263581
$$ packed form
13448C91657Q1045j62545p1874g422B42685A06539K7568Q9529j07801m8925K21939
13437B88849f4002J9712B86212l3442C6648L4588J33279P0976a64203D56001A66260
13425B79207M0273K867N1786p0689j32737A0914R8706m5266O4549J7078d049C2339
13412C36391j44986J10447J6274f4581B53644L24617k50571O496G2539L9954J05759
13401B18252J30833n3555J9095A9381J53817j4887R4884H162c997A90671R409
13390B00080j1847Q3478D9819L36K05367j18395e8139C67831I137M5196K729K65800
13378C22862c9198n587B04784P7855A23586d3758B94317K0830K4366a22520B22827
13366A32555J38198i4967E18373j18825a2881l8811A8968J01225n449D4505K19076
$$ plain form
13355 263581 41401 138684 65823 269820 415553 326819 -233213 186128 223156 82036 -13512
13343 386320 56750 438992 429613 391676 -1718 327478 42237 335088 280163 312558 173360
13332 173360 6493 351430 30190 -42460 432627 -42019 134177 358180 510744 -18767 232477
13320 -148903 105210 351843 -60525 337283 214363 -14868 286221 87211 -189979 118788
13309 142655 137925 150886 309070 195609 366676 219312 30587 161485 40846 175894
13299 175894 34140 111509 -135785 1596 115251 184713 -56434 343773 -5656 45265 -99112
13287 140126 -177787 123969 299730 202902 290282 237005 -88157 150287 -90876 191612
13276 225747 77486 219910 118287 60028 96135 -11327 375835 139838 180555 358380
$$ packed form
13355B63581D1401R7283F5823K03997J45733q8734b33213A86128L7028H2036a3512
13343C86320E6750L82242r379l7937a718C27478D2237K92851n4925L2395j39198
13332A73360F493L44937C0190d2460D32627d2019A34177K24003J52564a8767B32477
13320a48903A05210K46633f0525C37283j22920a4868B86221H7211a89979A18788
13309A42655m730J2961J58184j13461J71067j47364C0587J30898D0846J35048
13299A75894C4140P7369a35785A596J13655O9462e6434C43773e656D5265i9112
13287A40126a77787A23969J75761r6828Q7380n3277h8157A50287i0876A91612
13276B25747G7486J42424j01623n8259L6107a1327C75835A39838M0717J77825
$$ plain form
13266 358380 -230879 191561 218031 47246 -4482 111511 221618 391547 -234879 -175992
13256 -175992 -45310 93490 226496 358948 205858 -185264 -151475 193334 169973 364328
13246 364328 -126738 206963 -143965 378459 -86926 -5587 292382 230975 -366303 -223504
13236 -223504 81292 77402 359982 160585 276843 232055 264503 100788 287912 205357 112292
13225 112292 35655 -31852 231812 143323 228490 21948 18965 -129914 -172875 -42200 -157585
13214 -157585 -59937 98583 119717 -18915 97204 126958 143054 -2351 164616 493938 -157990
13202 273855 77935 94356 294158 114271 -756 -199306 360041 141569 28078 -93491 202634
13190 -16425 -95433 78615 38775 316089 892 227894 80659 -115224 -37985 -180289 17990
$$ packed form
13266C58380b30879A91561K6470D7246d482A11511J10107J69929b34879N8887
13256a75992d5310I3490J33006J32452j53090a85264L3789A93334k3361J94355
13246C64328a26738B06963a43965C78459h6926e587B92382o1407c66303J42799
13236b23504H1292l890K82580A60585J16258m4788L2448A00788J87124q2555r3065
13225A12292C5655c1852B31812q8489Q5167B1948k983a29914m2961d2200j15385
13214a57585e9937I8583K1134a8915I7204K9754J6096b351A64616L29322a57990
13202B73855G7935J6421J99802A14271g56j98550C60041A41569B8078i3491B02634
13190a6425p9008G8615C8775K77314H92K27002H0659a15224c7985j42304A7990
$$ plain form
13178 244139 44573 210751 167261 275647 343367 -208823 31360 133164 -70859 22275 -56111
13166 187561 -48046 397286 -6647 50248 -5689 137204 -171631 10272 -86330 132790 30504
13154 -44211 131874 -8102 -65231 311818 -198254 228501 80983 31611 56465 329105 228228
13143 228228 83590 -85724 215556 -10845 58478 86464 186611 -5632 -122057 -45004 46847
13131 191806 60563 34455 -193178 -217717 14624 169428 197184 -40722 -111159 401525 -365501
13119 360417 23118 259690 -69665 7956 179437 46508 67764 -37551 -91450 195793 -166620
13107 36757 -70603 309409 153509 -58158 221561 149037 -213206 220460 -47165 53345 -55756
13095 24927 -47879 365091 -104865 -62988 -315270 67338 246041 151403 249434 361062 -18275
$$ packed form
13178B44139D4573J66178m3490J08386O7720b08823C1360J01804g0859B2275e6111
13166A87561d8046C97286f647E0248e689A37204a71631A0272h6330A32790C0504
13154d4211A31874h102n7129C11818a98254B28501H0983C1611K4854K72640j00877
13143B28228H3590h5724B15556a0845E8478K7986J00147e632j16425d5004D6847
13131A91806F0563k6108a93178k4539A4624J54804K7756d0722p0437D01525c65501
13119C60417B3118K36572f9665G956J71481D6508K1256c7551n3899A95793a66620
13107C6757g0603C09409A53509e8158B21561p2524b13206B20460d7165E3345e5756
13095B4927d7879C65091a04865M1877k52282F7338J78703r4638R8031J11628a8275
$$ plain form
13083 -67315 220064 -125661 260822 13846 211234 -98245 -75384 23784 -96765 -91130 358620
13071 81752 -70564 -51064 201013 21256 178562 103271 -107345 -20741 -142172 247295 -132669
13059 60736 148353 -124547 72099 332563 -64853 269576 62186 191407 -205009 -68084 -116136
13048 -116136 130002 80949 86948 -163185 -64094 24966 247048 30108 355763 9153 16927
13037 16927 194019 132690 -89867 356857 185917 136724 331016 422116 -41536 104436 57502
13026 57502 176268 264230 -1032 -2327 -115877 125096 123358 28304 129476 -1544 183972
13014 93354 140062 193697 -569 153306 123977 53280 -360531 65139 187137 -73818 69689
13002 216286 171829 387324 -128556 176280 7004 192583 98368 82270 -97753 109694 -49802
$$ packed form
13083f7315B20064a25661B60822A3846J97388i8245K2861B3784i6765N635C58620
13071H1752g0564J9500B01013B1256J57306p5291a07345b0741j21431B47295a32669
13059F0736Q7617a24547G2099K60464f4853B69576F2186J29221b05009f8084m8052
13048a16136A30002m9053N999a63185f4094B4966K22082C0108L25655I153P774
13037A6927J77092o1329h9867C56857j70940m9193J94292R1100d1536A04436m6934
13026E7502J18766Q7962a032j295j13550A25096j738B8304J01172a544A83972
13014I3354M6708N3635e69A53306k9329E3280c60531F5139J21998g3818F9689
13002B16286m4457K15495a28556A76280G004J85579r4215j6098i7753A09694d9802
$$ plain form
12990 -279409 -46065 143944 123861 -139087 258497 312090 55118 117645 49061 176776 56027
12978 -245580 -4708 297786 267138 -97250 23398 143331 196474 304185 224866 91955 39132
12966 -275485 51864 118782 -10009 -3277 467096 61261 158337 65533 90922 55385 -9794 280744
12953 -176905 284597 106891 158570 -189174 -132006 166226 144241 -243223 4782 -28195 106746
12941 100286 81622 -170467 -155354 -53455 -262227 108294 266698 -114024 5969 -23653 52815
12929 260070 79575 -33203 10969 206115 19276 -314950 42638 65051 -88231 -55929 -99959
12918 -99959 145506 53132 56562 -313054 41654 -296914 63078 -101792 -125997 48039 89832
12907 89832 74617 131916 141391 37030 319362 -134681 -231920 -150135 190660 -17228 72146
$$ packed form
12990b79409d6065A43944k0083a39087B58497N3593E5118O2527D9061J27715E6027
12978b45580d708B97786l0648i7250B3398J19933N3143J07711p9319I1955C9132
12966b75485E1864O6918a0009c277D67096F1261R7076F5533K5389l5537i794B80744
12953a76905B84597A06891N1679a89174N7168A66226k1985b43223D782b8195A06746
12941A00286j8664a70467J5113e3455k08772A08294J58404a14024E969b3653E2815
12929B60070G9575c3203A0969J95146A9276c14950D2638K2413h8231L2302m4030
12918i9959A45506E3132L430c13054D1654b96914F3078a01792k4205D8039M1793
12907H9832j5215N7299R475C7030K82332a34681r7239Q1785A90660a7228G2146
$$ plain form
12895 -97032 -104086 -163044 122880 -309342 235216 -187809 22487 -101958 140415 266468
12885 266468 66487 165884 -185993 237180 218934 -41700 -125254 -49684 50589 193098 117173
12874 117173 149455 168958 -18490 -232399 -2093 -260398 -112372 2003 -108057 -188996 119361
12862 50640 -71006 98217 300996 24088 -117910 -160780 131669 -34261 -180543 -38451 331351
12850 129843 -35592 36171 255948 -62928 -143337 -256038 -237929 -78079 -21518 107373 211845
12839 211845 -24146 164699 219935 34965 -200588 71649 -396038 119647 -3573 -29756 184111
12827 94223 -15670 -207623 159139 347695 236795 46000 -264303 173896 -70623 -290335
12817 -290335 178739 -196472 118414 -365706 237044 -282800 -74747 64531 38565 -106671
$$ packed form
12895i7032p054n8958A22880c09342B35216a87809B2487a01958A40415J26053
12885B66468F6487R9397a85993B37180j8246d1700q3554d9684E0589J42509p5925
12874A17173L2282J9503a8490k13909b093k58305a12372B003a08057q0939A19361
12862E0640g1006I8217K02779B4088a17910m2870A31669c4261j46282c8451C31351
12850A29843c5592C6171K19777f2928q0409j12701J8109g8079b1518A07373J04472
12839B11845b4146A64699N5236C4965b00588G1649c96038A19647c573k6183A84111
12827I4223a5670j91953A59139J88556j10900D6000b64303A73896g0623k19712
12817b90335A78739a96472A18414c65706B37044b82800g4747F4531k5966a06671
$$ plain form
12806 -28269 280215 19461 -84997 -63305 -72341 -150723 -121884 -219731 372928 248145 171843
12795 171843 -90226 4458 -43248 59580 32364 -4869 245356 254429 -203013 123875 44987
12783 122345 -126124 1830 42396 -208269 96809 -855 129242 -14390 414743 93059 12013
12771 -68692 5910 -177203 35268 -130804 -15040 -186278 187262 -75806 -75899 47073 23515 -148344
12758 73700 131864 -309318 -182370 -180721 -246516 -141666 198282 159486 278967 -75958 -121586
12747 -121586 213343 2680 -365754 337500 358054 -106595 -39073 309487 -109447 366690
12736 95809 36931 352669 48834 498673 -244179 100365 132533 -181558 -136809 171884
12725 229471 -95970 194042 -367852 108231 372639 60683 -137068 14091 -273674 385760
$$ packed form
12806b8269B80215A9461h4997K1692r036p8382K8839r7847C72928j24783p6302
12795A71843i0226D458d3248E9580k7216d869B45356R073b03013A23875D4987
12783A22345a26124A830M0566b08269I6809h55A29242a4390D14743I3059A2013
12771f8692E910a77203C5268a30804a5040j71238A87262g5806r3D7073B3515a48344
12758G3700N8164c09318J26948J649o5795J04850A98282l8796J19481g5958m5628
12747a21586B13343B680c65754C37500K0554a06595c9073C09487a09447C66690
12736I5809C6931L15738D8834M49839b44179A00365L2168a81558M4749A71884
12725B29471i5970A94042c67852A08231K64408F0683a37068A4091b73674C85760
$$ plain form
12714 -7859 -248653 87965 224224 180559 210264 13769 -41799 -96556 310161 232635 73917
12702 124920 -27119 111275 52238 376475 -53611 95993 -61598 26873 214268 -81718 37832
12690 -53623 11310 215636 178119 -16740 305724 83647 350362 24956 53595 197884 136412
12679 136412 95306 71963 3765 190112 119440 -54335 -9145 64625 -303610 -77659 -397 -94324
12667 -94324 88776 315131 26961 289631 -290849 -18620 -159018 53036 41190 51503 290220
12656 290220 -8882 -124121 333335 106543 112262 -53435 347848 238983 80866 -52370 -164879
12645 -164879 24026 -28861 32631 -167574 -45698 -30758 -312517 118317 107477 100019 -116432
12633 68179 83748 25041 72054 234176 136583 334471 145179 -36263 -105541 230633 372042
$$ packed form
12714g859k40794H7965J36259m3665K9705A3769d1799n4757C10161p7526G3917
12702A24920b7119A11275E2238L24237e3611I5993f1598B6873J87395h1718C7832
12690e3623A1310K04326l7517a6740C05724H3647K66715B4956K8639J44289o1472
12679A36412m1106k3343C765J86347p0672e4335i145F4625c03610g7659c97r3927
12667i4324H8776K26355B6961K62670b90849a8620j40398E3036j1846J0313K38717
12656B90220h882j15239C33335A06543N719e3435C47848j08865H0866e2370j12509
12645a64879B4026b8861C2631a67574d5698J4940k81759A18317j0840p458a16432
12633F8179J5569B5041M7013J62122r7593J97888A45179c6263o9278B30633J41409
$$ plain form
12622 372042 124772 108919 43036 294579 172127 86268 331868 241414 175998 -86959 392687
12610 -131072 108820 -10324 -33611 172143 9872 250924 310337 208667 -99645 39307 -12965
12598 307346 301766 112024 -256447 147500 184354 236844 242588 -162075 56938 29821 -49052
12586 71996 196687 -129268 -69273 -170801 -339491 -51526 -97689 -365875 38558 -9393 80927
12574 16603 4659 -67605 -197198 -214577 -296009 -34611 -255321 -164945 96794 83098 -205318
12562 44416 -127969 -1767 -209867 147893 78681 29958 -119422 8747 66503 154043 -176514
12550 68403 -352001 -207902 -110570 78161 -28231 -295115 -24708 168103 198771 84783 171103
12539 171103 103000 -49308 240235 25029 -251878 247027 36779 31039 108821 207863 -394368
$$ packed form
12622C72042A24772j5853D3036K51543j22452q5859K45600r0454o5416h6959C92687
12610a31072A08820a0324k3287A72143I872K41052N9413j01670i9645C9307a2965
12598C07346n580A12024b56447A47500L6854N2490N744a62075E6938k7117d9052
12586G1996J24691a29268N9995j01528j68690e1526m6163k68186C8558i393H0927
12574A6603D659f7605j29593j7379q1432c4611k20710R0376I6794j3696b05318
12562D4416a27969a767k08100A47893o9212B9958a19422H747N7756Q7540a76514
12550F8403c52001J44099R7332G8161b8231k66884b4708A68103L0668H4783Q6320
12539A71103o8103d9308B40235B5029b51878B47027C6779n740P7782R9042c94368
$$ plain form
12527 -16047 -300318 -13432 35990 -131005 200760 -133115 -76521 114468 5656 146873 21802
12515 -225383 -56398 244241 353793 151980 49313 68720 -8401 120427 250579 -20289 -192264
12504 -192264 -160176 -322603 -153035 271126 343439 262818 72202 -34101 122486 344606
12494 344606 -253868 60057 154505 108704 -99762 36832 40236 -217630 283469 -254098 -35235
12482 -92986 -84121 211646 -140594 25503 -32569 177713 -262605 106243 165774 -96492 -25880
12470 324973 -169727 258546 103195 216 9631 -103612 -70422 -14395 -232828 -176907 -111970
12459 -111970 -222139 92426 -11043 38371 -82287 77334 22950 -180183 -26180 102773 -116953
12447 -36726 -364557 -10427 421650 89387 -65650 -19456 -257451 -244929 -597477 52139 -82579
$$ packed form
12527a6047k84271a3432C5990a31005B00760a33115N6594A14468E656J41217B1802
12515b25383e6398B44241J09552A51980D9313J9407h401A20427J30152b0289j71975
12504a92264L2088j62427a53035B71126P2313q0621G2202c4101A22486K22120
12494C44606b53868F0057R4448m5801i9762C6832L404b17630B83469b54098c5235
12482i2986Q865B11646a40594B5503c2569A77713b62605A06243N9531i6492b5880
12470C24973a69727B58546A03195B16R415a03612L3190a4395k18433N5921O4937
12459a11970j10169I2426a1043C8371h2287G7334B2950a80183b6180A02773a16953
12447c6726l27831a0427D21650H9387f5650a9456k37995J2522l52548E2139h2579
$$ plain form
12435 -121669 199448 94976 -82600 -135436 -245874 -409894 -22418 18241 59940 -6202 32371
12423 60523 376364 -16397 363554 -45023 512872 217998 61472 -205700 -172950 26706 43671
12412 43671 -122323 -38225 -65969 -14320 74430 -101137 22787 186369 204107 -172314 211987
12400 41628 -228826 -56795 -214180 71533 87677 16250 300048 -259049 -248743 120651 -56718
12388 -158643 143693 142652 -36724 -315146 133248 286594 -283040 -119979 -87967 -49610
12378 -49610 92386 12052 -21645 -262183 38688 -1908 76666 270480 -97783 8803 -200332
12366 -103369 30398 -432823 -264612 -68157 27618 -107103 -246287 -75889 -214726 67456
12355 187339 35751 114184 212192 63933 -28143 185165 106172 -17731 -88110 -89181 -224880
$$ packed form
12435a21669A99448I4976h2600n2836j10438j64020b2418A8241M1699f202C2371
12423F0523L15841a6397C63554d5023E12872B17998F1472b05700L2750B6706J6965
12412D3671a22323c8225k7744a4320G4430a01137B2787J63582J7738a72314B11987
12400D1628b28826e6795j57385G1533J6144A6250K83798b59049J0306A20651e6718
12388a58643A43693j041c6724k78422A33248J53346b83040a19979L2012L8357
12378d9610I2386A2052b1645k40538C8688a908G6666J93814i7783H803b00332
12366a03369C0398d32823J68211f8157B7618a07103j39184g5889j38837F7456
12355A87339C5751P8433R8008F3933b8143A85165p8993a7731p0379j071j35699
$$ plain form
12344 -224880 251452 58322 114394 137418 -167320 -75798 177839 -203694 -229534 10733 -114081
12332 -62879 -89739 75088 289630 89069 3254 -154994 -12414 151156 115544 319662 -96981
12320 -45417 40888 -5081 -103296 -154190 -215721 -56833 173385 34403 298776 187100 35684
12308 278019 106737 284073 71916 54112 -31630 -76113 308739 -386524 51938 44141 101762
12297 101762 262593 250178 -107245 -42519 244065 193896 59189 -119509 -206276 83334 315217
12286 315217 412370 -180163 5830 -204535 -194295 -69669 252646 -27258 133541 180235 125356
12275 125356 123074 7680 132884 78507 100157 97335 242677 97180 179046 46684 -80111 30249
12262 -117984 263414 243937 261753 59993 95920 232030 -48495 73771 166356 232611 215021
$$ packed form
12344b24880B51452E8322N6072K3024a67320g5798A77839b03694k5840A0733a14081
12332f2879k6860G5088K14542H9069C254a54994a2414A51156l5612K04118i6981
12320d5417D0888e081r8215n0894o1531e6833A73385C4403K64373j11676C5684
12308B78019A06737J77336G1916j7804c1630m4483C08739c86524E1938p797N7621
12297A01762J60831j2415a07245d2519B44065n0169E9189a19509q6767H3334K31883
12286C15217R7153a80163E830b04535J0240f9669B52646b7258A33541M6694n4879
12275A25356k282G680J25204n4377K1650k822J45342I7180Q1866D6684h0111C0249
12262a17984B63414j9477J7816E9993L5927J36110d8495G3771R2585O6255j7590
$$ plain form
12251 215021 389018 321004 235159 173227 84920 50888 -341770 3316 195940 196196 -120262
12239 4452 236968 60149 198654 -296871 205153 58766 146913 221128 188722 355312 -163462
12227 303900 297583 75005 141388 80228 363769 268108 581725 143077 -222170 269465 -140776
12215 51270 329735 -4093 118421 -79627 133256 346689 128260 124839 124498 -130997 14471
12203 260052 147204 246791 -53160 87603 63890 -6235 -5809 541724 201974 279585 327622
12192 327622 -106010 285948 77470 -22119 2092 77123 262761 -42307 376 119960 220879
12181 220879 -26005 303658 297230 386682 120161 123408 106078 46412 217271 -117573 328153
12169 18670 205235 -128039 211067 77801 320399 176894 113224 -325458 277711 282552
$$ packed form
12251B15021J73997o8014q5845o1932H4920l4032c41770C316J92624K56a20262
12239D452K32516F0149J38505b96871B05153E8766Q8147P4215l2406J66590a63462
12227C03900o317G5005O6383o1160K83541r5661L13617A43077b22170B69465a40776
12215E1270K78465d093A18421g9627A33256K13433A28260l421l41a30997A4471
12203B60052j12848R9587e3160H7603k3713f235M26E41724B01974P7611M8037
12192C27622a06010B85948G7470b2119B092P5031J85638d2307C76J19584J00919
12181B20879b6005C03658o428Q9452A20161L247j7330D6412J70859a17573C28153
12169A8670J86565a28039B11067G7801K42598j43505o3670c25458B77711M841
$$ plain form
12159 282552 190952 -321692 422438 -81434 -23309 116633 -6165 -265095 -95203 -105100 -180906
12148 -180906 340841 19703 -38879 41158 70005 76386 -931 71627 -101457 -56828 89241 -317955
12135 167210 379060 92703 -5383 -247326 96814 241652 359790 -61126 56881 -60551 -178034
12124 -178034 5113 -114704 -258784 29906 135686 -305851 179014 -49478 116614 272727
12114 272727 222005 30989 17685 -189838 74716 76969 -50565 -151373 62225 129420 8463
12102 -271634 55386 335768 -226255 -112194 -206891 18762 64378 -78074 -123156 -143296 112981
12090 39066 71844 -82262 289265 -85111 -73398 -228972 -102917 122748 294586 -185683
12079 227956 353615 1234408 1598666 875755 166872 -81459 -282215 132922 220247 123879
$$ packed form
12159B82552r1600c21692D22438h1434b3309A16633f165k58930i5203r897p5806
12148a80906C40841A9703c8879D1158K8847O381i31G1627a01457M4629H9241c17955
12135A67210K11850I2703e383k41943I6814J44838J18138f1126E6881f0551j17483
12124a78034E113a14704j44080B9906J05780c05851A79014d9478A16614J56113
12114B72727n0722C0989j3304a89838G4716K253e0565j00808F2225O7195H463
12102b71634E5386K80382b26255a12194r4697A8762M5616g8074m5082k0140A12981
12090C9066L2778h2262B89265h5111J1713j55574a02917A22748J71838a85683
12079B27956J25659Q80793L64258p22911A66872h1459k00756A32922Q7325r6368
$$ plain form
12069 123879 41979 66924 258307 37932 173233 99423 -86309 -28622 -36446 129865 68897
12058 68897 -379600 190913 12252 49330 -22602 184198 40386 -100154 -151537 105315 -68799
12046 348481 -267401 -32749 236365 104129 63784 118154 -244505 177155 27635 110799
12036 110799 86520 38239 -20866 -166780 244217 157934 -69540 -143633 78549 -198121 -49503
12024 -256168 -130683 7946 260781 -54114 -122565 -37339 12858 199366 136199 -99661 120927
12012 70855 34201 50220 -135211 59625 -52630 -116719 -77078 -124546 -204550 -69714 -35310
12001 -35310 -58694 -76337 43731 114606 -182639 203248 33562 141938 46706 -74225 65107
11989 -35561 -233286 158261 -433900 -229217 248954 1587 255961 -102209 297438 131422
$$ packed form
12069A23879D1979K4945J91383C7932J35301p3810h6309b8622p824A29865o0968
12058F8897c79600A90913A2252L7078b2602A84198D0386a00154n1383A05315f8799
12046C48481b67401c2749B36365A04129m0345N4370b44505A77155B7635Q3164
12036A10799k4279C8239b0866j45914B44217q6283f9540p4093G8549a98121d9503
12024b56168J25485G946K52835e4114o8451c7339A2858J86508o3167i9661A20927
12012G0855C4201J6019a35211E9625e2630o4089L9641m7468q0004f9714L4404
12001c5310k3384j7643D3731P0875a82639B03248C3562J08376D6706g4225F5107
11989c5561j97725A58261d33900K04683B48954A587K54374a02209B97438A31422
$$ plain form
11978 -54028 -37770 19366 -212461 -132724 325290 -74381 -244784 308359 130105 22023 103316
11967 103316 -93403 91509 -416962 -96460 378027 -340756 -64456 -140327 -26509 16100 392172
11956 392172 54102 587272 -206397 -170645 52281 67871 -145001 -184983 -184121 3828 294090
11945 294090 -524454 -126958 180865 -173067 -416933 35750 20886 -121481 -68348 -180720
11935 -180720 -26771 17466 -179738 239013 -154408 -149102 21380 62358 211151 -171596 228851
11923 -29572 74951 -446189 -124954 100520 64914 -126729 -165903 23142 -227446 -30291 196741
11911 -101510 -175426 63580 301555 -261 385023 -42574 21476 145266 77305 -33633 203835
11899 156897 -179140 233558 -191472 228613 133480 -37151 -263692 -177109 -103609 83398
$$ packed form
11978e4028J6258A9366b12461P9737C25290g4381j70403C08359A30105B2023Q1293
11967A03316i3403I1509d16962i6460C78027c40756f4456p5871b6509A6100L76072
11956C92172E4102N33170b06397L5752E2281J5590a45001l9982Q62C828K90262
11945B94090e24454a26958A80865a73067k43866C5750j4864a21481N3133j12372
11935a80720b6771A7466a79738B39013a54408N306B1380M0978J48793a71596B28851
11923b9572G4951d46189a24954A00520l5606a26729l9174B3142b27446c0291A96741
11911a01510p3916F3580K37975b61C85023d2574B1476J23790o7961c3633B03835
11899A56897a79140B33558a91472B28613r5133c7151k26541Q6583P3500H3398
$$ plain form
11888 -129890 121 -176658 -84197 -162674 82491 -113743 -288960 -183572 -67908 40451 -43092
11876 -222247 -35844 -225013 -282 -365718 114086 -4982 -76547 -101775 114298 83476 9810
11864 -38106 -114115 -226056 -26461 185586 148199 80664 -120244 -1420 5038 -93804 -274638
11853 -274638 228314 -411488 182821 178120 224023 -111046 -69648 430710 -202270 180799
11842 104872 -246818 -52100 187306 164142 -36601 -70760 -28131 -42915 -349794 -157067 -266420
11831 -266420 -381980 -55691 -143008 126220 -40720 134175 64983 164927 -128562 -128213 -160738
11820 -160738 163785 -269974 99549 135818 181082 16301 155398 -88889 -87131 -399030 -1887
11808 80669 -25322 -188254 146504 -81532 -38922 256641 85416 159550 69342 28059 51138
$$ packed form
11888a29890A21a76658h4197p8477H2491a13743j75217J05388f7908D0451d3092
11876b22247c5844j89169b82l65436A14086d982p1565k5228A14298l0822I810
11864c8106p6009j11941b6461A85586l7387o7535a20244a420E038i3804j80834
11853b74638B28314d11488A82821m701M5903a11046M1398D30710b02270A80799
11842A04872b46818e2100A87306k3164c6601l4159b8131j4784l06879a57067j09353
11831b66420j15560e5691q7317A26220d0720A34175F4983R9944a28562L49l2525
11820a60738A63785b69974I9549L6269M5264A6301J39097h8889J758l11899a887
11808H0669b5322j62932A46504h1532c8922B56641H5416P4134F9342B8059K3079
$$ plain form
11797 51138 -317764 48724 -222419 -257279 -33177 153478 265516 322961 86430 117796 23259
11785 -40589 -129213 -300455 96764 13483 -112377 -172649 -344779 -23006 59956 -134386 -45332
11773 -378733 -278685 -81159 -184187 42547 127631 30744 -134909 -113323 -133169 145731 18757
11761 -9538 -69781 -88518 -190334 -61296 137770 145136 123346 41736 -125374 -238407 62814
11749 -152789 -32407 -268150 245635 18823 -257500 -42316 102017 -67564 123205 -58700
11738 -169864 334701 -12525 -66886 54352 -101694 111687 21231 -116579 327121 11057
11727 26690 150104 -68109 -76024 205311 -70008 138960 269411 81801 -175914 -58143 -203090
11716 -203090 376155 -114682 24176 -230725 -119862 111167 158036 196928 123404 76527
$$ packed form
11797E1138c17764D8724b22419l4860c3177A53478J12038N7445H6430L1366B3259
11785d0589q8624j71242I6764A3483a12377o0272j72130b3006E9956a34386d5332
11773c78733J00048h1159j03028D2547Q5084C0744a34909K1586j9846A45731A8757
11761i538o0243j8737j01816f1296A37770P366k1790D1736a25374j13033F2814
11749a52789c2407k35743B45635A8823b57500d2316A02017f7564A23205e8700
11738a69864C34701a2525n4361E4352a01694A11687B1231a16579C27121A1057
11727B6690J23414f8109p915B05311g0008A38960J30451H1801a75914e8143j44947
11716b03090C76155a14682B4176b30725J10863A11167M6869L8892p3524m6877
$$ plain form
11706 76527 150590 105838 246370 -162723 223143 -13589 -307220 168523 44529 -101420
11695 -194536 -6135 192384 -29458 290339 204749 179415 -37776 -64449 -104199 42901 375362
11684 375362 -105641 -85932 1748 200329 -16751 -52039 31944 108558 -74551 198432 -16011
11672 53973 -3250 43223 -145383 280155 97508 -110182 285375 148616 346905 12402 -83260
11660 82168 488811 140404 -96747 -137372 539962 75559 -206612 -87876 -99268 460958 -54138
11648 -26354 -67113 72416 110703 294367 -57172 275 206691 39811 -21157 18735 -198859
11636 -185286 215368 -308863 -298313 216633 8081 153568 269425 158015 -64810 -26905
11625 -20600 278127 -180387 303980 -23453 -40650 184328 -265250 -172290 -96089 -31535 -78515
$$ packed form
11706G6527P4063m4752J40532a62723B23143a3589k93631A68523D4529a01420
11695a94536f135A92384b9458B90339q5590k5334c7776k6673l9750D2901L32461
11684C75362a05641J9709A748J98581a6751l5288C1944P6614g4551A98432a6011
11672E3973c250D3223a45383B80155I7508a10182B85375j36759J98289A2402h3260
11660H2168M06643A40404i6747m0625E39962G5559b06612h7876j1392D60958e4138
11648b6354m0759G2416L8287J83664e7172B75K06416C9811b1157A8735a98859
11636a85286B15368c08863J0550B16633H081J45487J15857j11410f4810b6905
11625b0600B78127a80387C03980b3453j7197A84328b65250R2960P6201c1535m6980
$$ plain form
11614 -78515 -262847 120839 -217116 -69378 129082 127207 324026 -152536 337203 -60840
11603 -79195 -130488 119114 6292 -56292 -117737 -136492 444489 24081 -51195 -103406 -62776
11592 -62776 -183642 19636 88259 -29947 -36818 -16647 160360 -221008 239877 278012 167892
11581 167892 38603 -64144 -435614 -11482 18076 -22980 177960 30376 -270597 216693 142540
11570 142540 29343 103073 -217630 98443 140994 191066 -27420 107417 -143548 -224693 -108863
11558 353767 49402 -29588 -139592 62694 374652 351253 257023 -1109 -211764 -268044 73687
11546 -150538 116661 78112 -157900 -132731 275344 -121935 -67254 318714 -69571 10390
11535 118551 261132 -293898 -27294 71843 204227 198742 148230 -174149 131134 -52271 164164
$$ packed form
11614g8515j84332A20839b17116f9378A29082j875J96819a52536C37203f0840
11603g9195n1293A19114F292e6292o1445j8755D44489B4081e1195n2211M0630
11592f2776j20866A9636O8623b9947o871a6647A60360b21008B39877L8135j10120
11581A67892C8603f4144l71470a1482A8076b2980A77960C0376b70597B16693p4153
11570A42540B9343P3730b17630I8443M2551N0072b7420A07417a43548q1145a08863
11558C53767D9402b9588j10004F2694L11958k3399r4230a109k10655n6280G3687
11546a50538A16661l8549a57900K5169B75344a21935N4681C18714f9571A0390
11535A18551J42581b93898b7294G1843J32384n485n0512a74149A31134e2271A64164
$$ plain form
11523 185873 145075 -305368 138827 115943 141724 -10651 214349 -60276 390986 116938
11512 252227 -69202 -48772 137486 -243704 46257 -59136 287390 75469 191721 -105679
11501 34423 117779 -71404 -27513 33953 -135754 -82004 -208726 -192704 61570 4336 45896
11490 45896 509569 265923 323877 11826 228199 -20683 99906 194125 -65016 149915 196897
11479 196897 131268 -156699 132399 415968 263158 157626 -196962 -70938 -54903 96311
11468 254443 400992 124615 294941 -111331 117000 -397078 140140 -107907 117979 -216712
11457 106411 276636 342004 26522 250087 188415 24734 131959 -61334 -35352 325488 -202969
11445 305108 306194 -144683 54426 71928 -16480 40341 350011 62409 273868 197103 46382
$$ packed form
11523A85873m0798c05368A38827k2884K5781a0651B14349f0276C90986A16938
11512B52227f9202K0430A37486b43704D6257e9136B87390G5469J16252a05679
11501C4423Q3356g1404b7513C3953a35754N3750j26722J6022F1570D336M1560
11490D5896M63673k43646N7954A1826K16373b0683I9906R4219f5016A49915M6982
11479A96897o5629a56699A32399K83569j52810j05532a96962g0938J6035I6311
11468B54443J46549A24615J70326a11331A17000c97078A40140a07907A17979b16712
11457A06411J70225O5368B6522K23565o1672B4734J07225f1334K5982C25488b02969
11445C05108J086a44683E4426J7502a6480D0341L09670F2409K11459p6765D6382
$$ plain form
11433 -42322 50741 -434727 -134479 -96614 125586 179879 94546 97659 -47906 -123205 29056
11421 16431 95624 147593 312435 14694 126094 88051 -16038 58031 -136051 -193488 -149513
11410 -149513 160089 355100 4691 -168846 -97712 -6438 -336072 118146 -31279 -36019 100656
11398 77573 -89494 41582 -53535 -41131 -270484 173241 274561 36547 -117812 -105672 21166
11386 202850 6140 187821 -215356 272803 -43479 95531 364058 -31692 -235317 86685 -222333
11374 -287952 16186 -92374 -445145 242025 -90942 -4859 -10249 11668 165701 71072 -245232
11362 -33578 -330590 107291 -55910 -165788 -50043 -161725 84998 -97357 -74400 182364 337336
11351 337336 -52825 -85442 401928 8290 377861 172987 130547 12751 -138685 -269525 282282
$$ packed form
11433d2322E0741d34727a34479L7865A25586N4293q5333L113d7906p5299B9056
11421A6431P9193N1969J64842A4694J11400l8043a6038E8031a36051n7437M3975
11410a49513A60089J95011D691a68846P1134f438l29634A18146c1279m740A00656
11398G7573h9494D1582e3535J2404k29353A73241J01320C6547a17812J2140B1166
11386B02850F140J81681b15356B72803d3479I5531K68527c1692k03625H6685b22333
11374b87952A6186i2374l52771B42025i0942d859n390A1668J54033G1072b45232
11362c3578k97012A07291e5910j09878e0043j11682H4998i7357K2957A82364J54972
11351C37336e2825l2617D01928H290L69571A72987m2440A2751a38685j30840B82282
$$ plain form
11339 -284243 375268 249959 154133 -271718 61275 140535 -133521 -110336 190814 -222182
11328 -24097 268058 -215935 -75777 -25176 -87323 215759 -139401 -261776 103708 250798
11318 250798 22702 41176 82905 88339 -16705 -200729 23765 26615 441170 160589 -320616
11306 -73289 77458 -65551 -188776 195637 -83774 -208130 25323 62714 30760 101206 145206
11295 145206 -90320 -84469 -150821 26286 -141845 -224788 -201998 250321 180840 82159 -265089
11283 71780 -55924 -208981 -49928 -278544 -315488 78264 -217233 -224128 -297051 -19725 -42861
11272 -42861 -19460 294079 -152707 -76083 45831 -88520 15227 -120148 5169 -201571 -468663
11261 -468663 -249425 -97929 144851 -124003 384309 -21435 15622 218477 37487 171319
$$ packed form
11339b84243C75268j25309r5826b71718F1275P9260a33521K3185A90814b22182
11328b4097B68058b15935g5777b5176o2147B15759a39401j22375A03708J47090
11318B50798B2702J8474M1729N434a6705j84024B3765K850M14555A60589c20616
11306g3289G7458f5551j23225A95637h3774j24356B5323L7391C0760P0446M4000
11295A45206i0320N851o6352B6286a41845q2943K2790B50321o9481H2159b65089
11283G1780e5924j53057d9928k28616l6944G8264b17233o895p2923a9725k3136
11272d2861a9460B94079a52707g6083D5831h8520A5227a20148E169b01571k67092
11261d68663K19238i7929A44851a24003C84309b1435A5622K02855C7487J33832
$$ plain form
11251 171319 31455 -1757 -131061 -289527 -135097 26570 -482231 -75833 -285724 87505 245440
11240 245440 6340 -355538 288780 -232049 -143069 37733 118099 -157252 -7520 -217750 -36147
11228 -118074 -152826 130121 -164 445073 -217624 -123445 123789 69154 -41740 -92506 -156382
11217 -156382 37302 -30052 -31223 61610 20474 99486 -26522 -215179 63691 77677 90971
11206 90971 -10173 -306089 -131065 186667 -251573 -62329 -310778 13808 -96616 -169331 -22430
11194 502548 224761 -541581 18769 227469 35758 68926 4573 -16006 131536 -166019 -62571
11182 160768 -21258 -273290 -98643 -5306 113661 -103026 -422677 37376 -242100 -144017 -315551
11171 -315551 -171761 232888 228973 81277 -5012 -27103 -108927 -24958 -62815 143815 156007
$$ packed form
11251A71319C1455a757j29304j58466a35097B6570d82231g5833k09891H7505J57935
11240B45440F340c55538B88780b32049Q8980C7733Q0366a57252g520k10230c6147
11228a18074l4752A30121a64D45073b17624R4179A23789n4635d1740n0766o3876
11217a56382C7302c0052j171F1610B0474P9012b6522j88657F3691J3986J3294
11206I0971a0173k95916a31065A86667b51573f2329k48449A3808i6616p2715b2430
11194E02548B24761e41581A8769K08700C5758L3168D573a6006A31536a66019f2571
11182A60768b1258k52032i8643e306A13661a03026l19651C7376b42100R8083j71534
11171c15551J43790B32888l915H1277e012k2091q1824b4958l7857A43815J2192
$$ plain form
11160 156007 72201 20899 -184374 3446 -117554 19021 -163739 -19882 195138 -221015 -39849
11148 -284788 4279 -18727 -287310 -237316 320354 -191490 -85250 -116125 185446 61830 -23079
11136 119670 -75817 34254 -12047 264815 74689 525150 47132 9036 33424 -206340 95352
11124 192753 -125088 461872 447438 -169455 121651 102832 -119151 -93379 175445 202379
11114 202379 76019 -43746 -62725 315692 217400 -24730 -15916 155791 201348 332610 199088
11103 199088 -130323 342974 259992 41600 118208 128908 257639 91198 232978 154481 346425
11092 346425 100279 -260786 16602 317949 8974 -216119 -112012 -15027 201960 -31923
11081 -84706 263457 330758 -6846 315955 111218 350772 273216 331777 606352 221407 250301
$$ packed form
11160A56007G2201B0899a84374C446a17554A9021a63739a9882A95138b21015c9849
11148b84788D279a8727k68583M9994C20354a91490h5250l0875A85446F1830b3079
11136A19670g5817C4254a2047B64815G4689M50461D7132I036K4388b06340I5352
11124A92753a25088D61872j4434a69455A21651j8819a19151K5772A75445K6934
11114B02379G6019d3746j8979C15692r8292b4730Q814A55791M5557J31262j33522
11103A99088a30323C42974q2982D1600P6608J0700J28731I1198J41780p8497J91944
11092C46425A00279b60786A6602L01347H974b16119J04107a5027B01960c1923
11081h4706B63457O7301f846C15955A11218K39554p7556N8561K74575B21407K8894
$$ plain form
11070 250301 483282 221311 216020 271382 513795 336119 534492 600458 409910 105987
11059 449830 177679 436924 157294 396519 57585 75995 502921 560503 447268 643628
11049 643628 691937 922928 558455 405670 539929 345480 277990 700320 678375 838491
11039 838491 936430 803954 507709 683451 644362 640970 703183 646104 259044 617770 1101021
11028 1101021 716216 596784 1019707 549569 554333 766347 526338 561168 538154 588967
11018 588967 430617 595590 451450 514726 380148 533439 248407 415861 486896 287684
11008 287684 519328 474310 638615 348103 296761 369119 416884 279151 516828 615023
10998 615023 322526 517657 461557 492056 707531 836976 330628 733201 785493 260952
$$ packed form
11070B50301K32981B21311n291N5362K42413j77676J98373O5966j90548A05987
11059D49830A77679K59245A57294K39225E7585J8410M26926N7582j13235J96360
11049F43628M8309K30991l64473j52785J34259j94449o7490M22330k1945J60116
11039H38491R7939j32476k96245J75742l9089l392O2213n7079B59044L58726M83251
11028A101021l84805j19432M22923m70138M764K12014k40009L4830k3014N0813
11018E88967j58350J64973j44140O3276j34578J53291B48407J67454P1035j99212
11008B87684K31644m5018J64305k90512n1342P2358M7765j37733K37677R8195
10998F15023k92497J95131n6100L0499K15475J29445C30628M02573N2292B60952
$$ plain form
10987 532996 659389 1042797 710451 1025346 734374 958588 711757 963218 1194945 898536
10977 898536 1376388 1434905 1750786 2021051 2434877 2598948 2569193 2483849 2128219 2261230
10967 2261230 2236307 1809277 1739926 1534631 1620270 1649602 1594295 1657876 1870365 1653998
10957 1653998 1999982 1775846 1469328 1156750 1368556 950069 643628 922938 727832
10948 727832 230758 555086 399207 -37300 -65 -245921 120769 73436 48817 -126373 140581
10936 245534 -230275 365830 12612 425475 190746 161844 116377 298278 217781 -130861
10925 185695 219982 79083 -206730 -201219 -136420 137625 -65169 -62100 112189 -286785 -170404
10914 -170404 243720 -149300 -200977 -119999 126639 -356098 -372145 24365 -67040 305428
$$ packed form
10987E32996J26393L83408l32346L14895k90972K24214k46831K51461K31727k96409
10977H98536M77852N8517L15881K70265M13826J64071k9755q5344l55630J33011
10967B261230k4923m27030o9351k05295Q5639K9332n5307O3581K12489k16367
10957A653998L45984k24136l06518l12578K11806m18487l06441K79310j95106
10948G27832B30758L24328j55879c7300f5k45856A20769m7333k4619a26373A40581
10936B45534b30275C65830A2612M12863A90746k8902m5467J81901q0497a30861
10925A85695L4287G9083b06730N511O4799A37625f5169L069A12189b86785J16381
10914a70404B43720a49300n1677Q0978A26639c56098j6047B4365f7040C05428
$$ plain form
10903 152584 -14641 -133654 -360630 2164 -132852 -83104 -15584 -64506 -157020 -127840 -61922
10891 127458 396559 -210347 -36666 191935 94144 -29361 128335 -44949 170041 -152277
10880 55025 -280519 23202 -37447 -40543 38103 -340714 271004 10107 94164 159167 -243910
10868 -81303 -103543 -87812 -60069 -375055 -77484 263105 67046 -143639 -215626 -19228 -44510
10857 -44510 -190253 74211 267655 110532 39683 -109833 51898 -37806 -2437 -246128 25694
10845 246093 -108029 -54370 45610 388804 -658 -138185 37162 -71460 -65989 118137 121201
10834 121201 54819 -85519 131868 154377 -221193 63869 7454 -128080 -329964 -304453 138848
10822 21283 -43593 -219377 -87614 45544 -138772 -166347 -170167 -155329 -59863 -299930 66608
$$ packed form
10903A52584a4641j19013k26976B164a32852M9748a5584m8922r2514K9180f1922
10891A27458K69101b10347c6666A91935I4144b9361A28335d4949A70041a52277
10880E5025b80519B3202c7447l096C8103c40714B71004A0107Q4057O5003b43910
10868h1303k2240J5731K7743l14986g7484B63105F7046a43639p1987a9228k5282
10857d4510j45743G4211J93444A10532C9683a09833E1898c7806b437k43691B5694
10845B46093a08029N3659D5610L43194f58j37527C7162g1460N471A18137L064
10834A21201E4819h5519A31868K2509b21193F3869G454a28080k01884K5511A38848
10822B1283d3593j75784h7614D5544a38772k7575l820J4838e9863k40067F6608
$$ plain form
10810 -1676 -111389 -165836 96960 -178835 -155423 216107 -242844 381416 -112853 71476 -38528
10798 -207203 77283 196685 -37954 -62870 -406276 210792 -132529 -16176 -47070 -118130 -136784
10787 -136784 -184463 -13098 -62621 -367097 -106039 -187595 -320620 214871 -61528 -19103 101121
10775 23161 -150464 -349407 222926 -118630 -205725 -246161 -302490 -185412 62915 113820 -126095
10763 112813 -17902 -251658 -416429 -294584 117673 130864 173385 -86068 -230503 37348
10752 -161080 -118053 -153607 -109228 132914 184267 -146963 -156076 -309537 192205 237088 -219477
10740 185369 78208 -161159 19207 17148 271884 -137701 55207 -123648 98349 238338 161456
10729 161456 -202260 31860 -310520 -257626 -114354 -27760 -244648 199307 104516 37620
$$ packed form
10810a676j09713n4447I6960a78835K3412B16107b42844C81416a12853G1476c8528
10798b07203G7283J19402c7954k4916l43406B10792a32529a6176l0894p1060j8654
10787a36784m7679a3098m9523l04476a06039q1556j33025B14871f1528a9103A01121
10775B3161a50464j98943B22926a18630q7095m0436n6329J17078F2915N0905a26095
10763A12813a7902k33756j64771J21845A17673J3191M2521h6068j44435C7348
10752a61080M3027l5554M4379A32914N1353a46963r113j53461A92205M4883b19477
10740A85369G8208a61159A9207k059K54736a37701E5207a23648I8349J39989p6882
10729A61456b02260C1860c10520N2894a14354b7760k16888A99307r4791C7620
$$ plain form
10718 -241915 -224717 -112825 108665 56300 99752 -45214 -97395 79601 -115054 -17487 188642
10706 -70441 219243 -147908 -82969 -248626 -195695 92658 -208786 -122167 32504 -185874 -174084
10695 -174084 176700 294633 -45427 -180805 -167435 180345 -54359 -79327 55202 66515 162715
10684 162715 123057 -137204 -34833 -7813 91930 65773 347574 84006 233374 129488 -16783
10672 93755 -6607 163161 3258 79349 57074 490023 -261293 145964 177422 -323073 -105023
10660 -86770 -130143 -116872 7184 39802 -236817 268812 -102153 -308238 180656 432749 71202
10648 -161817 -408741 -155777 29089 -192367 -1590 -257696 62406 183265 -94537 -136725 -392446
10637 -392446 -317588 138641 23303 -160494 -37678 51264 118636 -31024 -256693 5225 76184
$$ packed form
10718b41915J7198J11892A08665n2365M3452d5214n2181G9601a15054a7487A88642
10706g0441B19243a47908O4939j65657N2931I2658b08786Q6619C2504a85874J1790
10695a74084A76700J17933d5427j35378J3370A80345e4359k4968E5202J1313R6200
10684A62715l9658a37204c4833g813I1930k6157K81801H4006J49368j03886a6783
10672I3755f607A63161C258P6091k2275M32949b61293A45964L1458c23073a05023
10660h6770m3373J3271G184L2618b36817B68812a02153k06085A80656K52093G1202
10648a61817k46924a55777B9089a92367a590k56106F2406J20859i4537m2188k55721
10637c92446P4858A38641B3303a60494c7678E1264O7372c1024k25669E225P0959
$$ plain form
10626 76184 79222 -28052 -118594 -70843 -86316 -140939 -116140 -175260 8185 -335536 -201075 290694
10613 -126161 -161392 128128 301369 31493 -46999 -35839 -284322 -112142 91130 1657 -336503
10601 -465440 -93663 203845 -243061 -151463 -46088 -159031 443788 -9694 -192095 -194053 -255281
10590 -255281 70495 -161009 -214486 1801 -33757 38961 238523 -195721 -34417 -44436 -363293
10579 -363293 18833 -155316 -231564 -137724 -42834 126209 25159 90972 -81986 -128516 -176438
10568 -176438 -51064 -45272 -30810 -359657 175321 498474 -128498 16044 162576 -155748
10557 -273272 49325 -147787 -43819 22548 -159428 256343 -219577 -37880 219117 147435
10547 147435 -72161 207680 101555 30048 -118724 49268 -208197 -356306 -36876 177472
$$ packed form
10626G6184L038b8052r0542M7751j5473n4623K4799n9120H185c35536J34461B90694
10613a26161l5231A28128J73241C1493d6999J1160k48483a12142I1130A657c36503
10601d65440i3663B03845b43061R1598d6088j12943D43788i694j82401j958o1228
10590b55281G0495a61009n3477A801c3757C8961J99562a95721c4417j0019l18857
10579c63293A8833a55316p6248R3840d2834A26209B5159O5813h1986m6530m7922
10568a76438e1064N792J4462l28847A75321L23153a28498A6044J46532a55748
10557b73272D9325a47787d3819B2548a59428B56343b19577c7880B19117p1682
10547A47435g2161B07680A01555C0048a18724D9268b08197j48109c6876A77472
$$ plain form
10536 260736 202705 -206202 22855 -17416 -275529 -186825 -125923 238492 97558 -124376 55378
10524 34687 -145 -132144 -46452 -206362 -29629 155846 -1843 154241 -155421 -68275 106769
10512 -77235 214734 106646 -22164 75088 -68026 -330766 -15536 13094 -467672 206652 -119976
10500 -111960 -67497 -262780 -49168 -157291 -137097 -107765 -135979 -234284 -35749 -124895 216718
10488 80504 27739 252438 56537 -2565 102939 95470 157929 417724 98478 412452 278535
10477 278535 327281 -201934 -120912 -138536 25162 146595 -103468 -189496 -8020 -123945 111150
10465 150512 -160003 -158309 -189754 27582 100664 82570 -269868 183705 157676 -78726 -44677
10454 -44677 -159453 -46051 -272123 215469 -2964 57138 46151 112476 150458 2637 -112296
$$ packed form
10536B60736n8031b06202B2855a7416k58113Q8704O0902B38492I7558a24376E5378
10524C4687a45j31999d6452j59910b9629A55846a843A54241a55421f8275A06769
10512g7235B14734A06646b2164G5088f8026k62740a5536A3094d67672B06652a19976
10500a11960M4463j95283d9168j08123K0194K9332k8214r8305c5749q9146B16718
10488H0504B7739K24699E6537b565A02939p469O2459K59795I8478L13974j33917
10477B78535M8746b01934Q1022j7624B5162J21433a03468q6028h020j15925A11150
10465A50512a60003J694l1445B7582P3082j8094b69868A83705k6029g8726L4049
10454d4677j14776d6051k26072B15469b964E7138j0987O6325L7982B637a12296
$$ plain form
10442 -193533 -57208 164275 -18855 43667 157720 -293475 -203670 17815 -344741 -266599 52770
10430 -211559 -37553 -54376 178905 453256 93464 -93655 -116671 36174 -244065 1570 -68204
10418 -15899 78027 -312323 60034 344248 -198671 -267609 89737 59635 -205259 -104541 40457
10406 -87796 142801 -195498 -133012 -266479 93793 -207789 -14815 -512745 -9344 -43774 -219616
10395 -219616 -6928 -150380 216641 -146205 279868 109771 124870 227082 287800 64647
10384 185258 -163442 149540 37388 214981 504083 204389 215405 -118457 -63435 160651
10373 -12916 -109341 385715 142741 128134 88851 69703 353397 433389 219031 189641 181553
10362 181553 220845 105241 239367 234927 -122932 76511 -44921 -13835 174315 177337 345396
$$ packed form
10442a93533e7208A64275a8855D3667J14053b93475Q9805A7815c44741P8142E2770
10430b11559c7553j6823A78905K74351I3464i3655k3016C6174b44065A570f8204
10418a5899G8027c12323F0034K84214a98671o8938H9737l0102b05259J00718D0457
10406h7796A42801a95498O2486j33467I3793b07789a4815m97930i344l4430j75842
10395b19616f928j43452B16641a46205B79868A09771J5099J02212O0718F4647
10384A85258a63442A49540C7388J77593K89102B04389J1016a18457N5022A60651
10373a2916r6425C85715A42741j4607l9283j9148K83694P9992k14358k9390q088
10362A81553L9292A05241J34126m440a22932G6511d4921a3835A74315L022J68059
$$ plain form
10351 345396 843987 952554 199801 175904 530998 391392 256228 236650 407246 427844
10341 427844 517031 364819 306326 296733 -16937 -294457 289135 437070 97640 -118304 63273
10329 311275 -126738 52768 -236251 8527 -190093 262577 380034 158079 -110115 148699
10318 132229 -128365 -42336 122172 125675 145780 127925 2882 125272 -242883 -173684 92581
10306 -16887 124382 -95919 53828 182774 175729 -147824 -215783 -44345 120086 -73820 431537
10294 -144237 -63817 -148155 -37558 -98158 -316263 997 63576 159390 199249 246077 -106192
10282 -31042 126186 -166734 121806 -128 -51120 3635 -26026 -40372 -103593 -11692 -314116
10271 -314116 90687 311710 -28795 -100539 38012 161115 -155448 -95730 13522 304610 386205
$$ packed form
10351C45396M98591J08567A99801k3897L55094j39606j35164j9578J70596K0598
10341D27844Q9187j52212n8493r593a6937k77520B89135J47935I7640a18304F3273
10329C11275a26738E2768b36251H527a90093B62577J17457A58079a10115A48699
10318A32229a28365d2336A22172L503K0105j7855B882J22390b42883O9199I2581
10306a6887A24382i5919E3828J28946p045a47824o7959d4345A20086g3820D31537
10294a44237f3817q4338c7558o0600k18105I97O2579R5814L9859M6828a06192
10282c1042A26186a66734A21806a28n0992C635b6026j4346o3221a1692l02424
10271c14116I0687K21023b8795p1744C8012J23103a55448N9718A3522K91088Q1595
$$ plain form
10260 386205 263233 390417 516070 412638 328427 -47110 135415 157628 17057 11862 -82175
10248 -51918 -72572 -205334 -320170 -52226 -229426 -120366 -176477 -115680 13126 -246430 -162762
10237 -162762 -240789 199210 -9478 134096 -120702 -66224 -604 -317638 224979 -62989 -90716
10226 -90716 -200260 -106317 41411 100649 91586 -196016 208005 13486 -64658 -64868 -27909 -69164
10214 -69164 11160 -62915 -153726 58843 110441 -126480 304297 -340110 -129975 122872 135502
10203 135502 -270455 -91410 -153244 72958 -98230 67030 -189012 -117989 -144727 -239195 -327910
10192 -327910 151769 -120723 -132583 78855 258184 207428 304977 -85524 -171900 197570 -21845
10180 -73989 52540 -89923 -115449 -312618 99743 -329908 -293497 -27740 -16628 -32895 -47220
$$ packed form
10260C86205j22972J27184J25653j03432q4211d7110A35415K2213A7057n195h2175
10248e1918k0654j32762j14836e2226j77200J09060n6111O0797A3126b46430Q3668
10237a62762p8027A99210i478A34096a20702N4478f04l17034B24979f2989k7727
10226i0716j09544R3943D1411N9238r063a96016B08005A3486f4658k10b7909m1255
10214f9164A1160f2915r0811E8843N1598a26480C04297c40110a29975A22872J2630
10203A35502b70455i1410o1834G2958i8230F7030a89012P1023k6738r4468q8715
10192c27910A51769a20723j1860G8855J79329n0756R7549h5524q6376A97570b1845
10180g3989E2540h9923k5526j97169I9743c29908L6411b7740J1112j6267j4325
$$ plain form
10169 -47220 -130016 -305641 -273531 230541 150476 -64310 -184099 -195708 -20998 1405 65435
10158 65435 -180764 60432 -117218 -6867 -39162 289425 -73483 14333 -305270 140325 -170065
10146 -44277 239677 -25762 -319839 83407 -105701 -126927 -421701 -214077 -50146 25510 95716
10135 95716 -111743 40607 -86299 -214889 -175032 -2827 -205237 -221829 184859 -405881 -133793
10123 -307048 -136649 29846 -121033 -175049 -37827 -46949 18211 -161427 79095 -33639 119946
10111 81409 -48770 -77693 126113 -119663 161400 -98866 -16158 -17411 -291652 -156704 -89714
10100 -89714 258539 -262053 -92161 -156005 199252 -175536 -250352 -126281 -280960 107732
10089 -73296 -286882 -144798 260359 -111156 187243 -32760 80696 17626 164505 -404728
$$ packed form
10169d7220q2796j75625L2110B30541q0065f4310j19789j1609b0998A405O4030
10158F5435a80764F0432a17218f867l2295B89425g3483A4333c05270A40325a70065
10146d4277B39677b5762k94077H3407a05701k1226k94774K07624e0146B5510P0206
10135I5716a11743D0607h6299j28590L9857b827k02410j6592A84859d05881a33793
10123c07048a36649B9846a21033n4016c7827r122A8211a61427G9095c3639A19946
10111H1409d8770k8923A26113a19663A61400i8866a6158j253k74241J34948O6990
10100h9714B58539b62053i2161o3844A99252a75536p4816J24071j54679A07732
10089g3296k13586J42084B60359a11156A87243c2760H0696A7626J46879d04728
$$ plain form
10078 -201734 -25759 25345 229158 -29693 -111864 -46294 -170128 177692 -280040 -38880 -234925
10067 -234925 164940 -263945 435064 -254808 4507 35431 105339 91290 -200401 226144
10056 -143603 -192562 151409 55516 61912 97246 -204594 -144233 -118837 -75236 -288790 -80337
10044 -226545 152618 -58965 51682 84818 -185104 -51288 36238 -37616 -144393 45618 -21752
10032 13196 -102290 -106582 286913 28915 -110050 2347 81200 208632 8388 203428 -54221
10020 -94488 -191456 128156 39760 264271 -304509 -69761 63190 14048 -282430 74461 -298980
10008 -235107 -287181 -274194 -234508 30265 -261361 -253174 116032 203104 -40868 190167 -11645
9996 163259 131055 -46162 222005 91156 5071 -330632 -253234 99822 -156277 -334524 -178987
$$ packed form
10078b01734b5759B5345K03813b9693q2171d6294j23834A77692b80040c8880j96045
10067b34925A64940b63945D35064b54808D507L0924O9908j4049b00401B26144
10056a43603m8959A51409E5516O396L5334b04594O0361K5396M3601k13554h0337
10044b26545A52618e8965E1682L3136a85104e1288C6238c7616j06777D5618b1752
10032A3196a02290m292B86913B8915a10050B347P8853J27432H388J95040e4221
10020i4488r6968A28156C9760K24511c04509f9761F3190A4048b82430G4461b98980
10008b35107n2074J2987L9686C0265b61361Q187A16032Q7072d0868A90167a1645
9996A63259l2204d6162B22005I1156E071c30632P7398I9822a56277j78247J55537
$$ plain form
9985 -178987 -331558 -26176 144390 -127115 -150640 290155 -235167 80428 -8001 23965 123539
9974 123539 -179439 235585 152172 113810 76217 210653 -167229 213856 309542 -12259 39718
9962 -182695 -359735 -60789 -81313 -103121 -64783 14882 180343 30566 -283719 -192448 18092
9950 -369221 -143466 254107 -149815 -73116 160968 132761 -28635 59937 -184918 191875
9939 97106 -225672 -62621 -243602 48325 -14019 247564 50199 -176208 -107018 -85296 101113
9927 231139 232228 -201550 -208099 -321998 -252500 255614 -129823 191277 -23030 -171076 57608
9915 78872 202101 -224228 -3957 -257930 -90372 -14266 17181 -73824 -161500 -64065 75150
9903 -224938 -199471 -438136 -9097 -19166 -41554 4216 -32853 -108433 -76228 -270398 -224726 216662
$$ packed form
9985a78987j52571b6176A44390a27115k3525B90155b35167H0428h001B3965R9574
9974A23539a79439B35585q3413l8362l7593J34436a67229B13856R5686a2259C9718
9962a82695j77040f0789k0524k1808L8338A4882J65461C0566b83719R1271A8092
9950c69221a43466B54107a49815g3116A60968k8207b8635E9937a84918A91875
9939I7106b25672f2621j80981D8325a4019B47564E0199a76208O9190K1722A01113
9927B31139J089b01550o549j13899O9498B55614a29823A91277b3030j48046E7608
9915G8872J23229b24228c957k53973i0372a4266A7181g3824q7676f4065G5150
9903b24938K5467k38665i097j0069k2388D216c2853p5580L2205j94170M5672B16662
$$ plain form
9890 -195859 -124939 34686 -13009 80273 -553142 -342592 -304898 -220441 57616 -209148 87462
9878 342473 212189 -208928 -242953 85687 -103409 -54486 48958 -92264 117632 -468177 -288014
9867 -288014 228771 -65865 156207 91780 28485 -448821 -256319 -18952 -5451 -316012 -70599
9855 141437 131555 -11387 189383 -236586 80764 -122501 -240028 236850 -338831 -407178 71006
9843 17481 -134058 -327084 50208 75658 -34860 -59153 256993 -297689 -116999 118338 -460782
9831 -124954 89349 -362283 -82386 -167333 -5223 102933 -191483 130549 -598115 -160319 -318920
9820 -318920 -132345 -36735 96660 -542423 105508 148976 -80875 -9503 131359 -460094 -351682
9809 -351682 -263588 -156428 149917 39238 -127520 63550 -42274 -397147 -333674 204131 -80436
$$ packed form
9890a95859P0920C4686a3009H0273e53142K10550L7694Q4457E7616b09148H7462
9878C42473j30284b08928l4025H5687a03409M8923D8958i2264A17632d68177J80163
9867b88014B28771f5865A56207o4427B8485d48821J92502a8952e451l10561g0599
9855A41437r882a1387A89383b36586H0764a22501j17527B36850c38831o8347G1006
9843A7481a34058j93026E0208K5450c4860k4293B56993b97689a16999A18338d60782
9831a24954H9349c62283h2386q4947e223A02933a91483A30549e98115a60319j58601
9820c18920a32345c6735I6660e42423A05508M3468h0875i503A31359d60094J08412
9809c51682Q8094J07160A49917C9238a27520F3550d2274l54873O3473B04131h0436
$$ plain form
9797 -35131 5639 9191 109994 83593 27116 59730 -192419 -505602 67194 -47612 -207239
9786 -207239 37007 202047 -60514 -103826 164120 -219965 -43306 -226314 48986 -123143 178369
9774 -59750 2061 72968 5610 -84307 113830 -249105 33061 -248307 -55528 -84017 151117
9762 329873 -129590 -84934 -115249 74766 -232668 202653 133104 -28080 -126909 169612 137665
9751 137665 221543 73423 -279470 -101200 291381 -10352 -129207 -85041 95060 328275 -111267
9739 -6275 -182962 86171 -256539 -209555 -301794 -121072 -38454 123984 397606 -246404 163003
9727 -98590 -177172 133376 59004 -232200 2055 -320318 -205708 -66958 82739 24632 41055
9716 41055 -83549 -310930 -21354 -76859 -9073 17785 149876 -173756 277107 -162624 -152670
$$ packed form
9797c5131E639L552J00803k6401B7116L2614a92419l13183F7194d7612j59627
9786b07239C7007J65040f0514m3312A64120b19965d3306j83008D8986a23143A78369
9774e9750B061P0907E610h4307A13830b49105C3061b48307e5528k8489A51117
9762C29873a29590M4656l0315G4766b32668B02653o9549b8080r8829A69612l1947
9751A37665Q3878G3423b79470a01200B91381a0352j18855M4166I5060K33215a11267
9739f275j76687H6171b56539M6984r2239a21072c8454A23984K73622b46404A63003
9727i8590p8582A33376E9004b32200B055c20318J14610f6958H2739B4632J6423
9716D1055h3549k27381b1354n5505i073A7785J32091a73756B77107a62624R954
$$ plain form
9705 -152670 -179389 -26914 -151915 50939 93928 -321920 -337536 -148394 211233 -55653 -158099
9694 -158099 129083 -98305 -370701 -203970 -101900 276887 -72934 -29509 41816 -21906 -125263
9683 -125263 11149 -91271 -185173 321600 -142182 77371 -23017 -308163 29750 12921 -201879
9671 -134846 285092 96839 462815 -22869 -1923 106728 -44998 -85547 129382 -221273 74301
9659 149532 -89907 43102 -278952 303425 -36365 -104203 88093 74974 -133100 -294878 135702
9647 76554 190120 191614 -400298 47569 275297 49617 -62470 -132728 22275 -67836 16351
9635 -101122 150527 -195709 -114215 -25707 -199440 72113 32312 -373188 -357099 -129048 -236635
9624 -236635 -348185 -208150 -94863 198862 -247973 -187762 123062 265575 -139812 -32930
$$ packed form
9705a52670k6719b6914j25001E0939M2989c21920j5616a48394B11233e5653j02446
9694a58099A29083i8305k72396J66731a01900B76887g2934b9509D1816b1906j03357
9683a25263A1149i1271r3902C21600a42182G7371b3017k85146B9750A2921b01879
9671a34846B85092I6839L65976b2869a923A06728d4998m0549A29382b21273G4301
9659A49532h9907D3102b78952C03425c6365o7838H8093j3119a33100j61778A35702
9647G6554J13566J494d00298D7569K27728D9617f2470p0258B2275f7836A6351
9635a01122A50527a95709Q1494b5707j73733G2113C2312c73188J6089a29048j07587
9624b36635j11550J40035i4863A98862b47973O0211A23062J42513a39812c2930
$$ plain form
9613 -1065 328978 -157187 24089 -125503 -12952 -263948 -278383 -76484 17795 -157197 14351
9601 -211415 -177051 168498 -577179 -27479 -48678 -190813 -65794 -368744 -143739 -130038 -326939
9590 -326939 920 -405371 -25185 9615 -278202 17726 -275958 -149720 96780 -144250 5257
9578 8686 -467629 15639 -220019 -69074 174294 296130 -90608 -52542 -202415 94006 -116981
9566 -159380 261670 79130 -311396 -51780 113068 119355 128529 17177 -12951 225248 -140940
9554 -32447 177608 107707 -548 -10324 -193159 -220301 -34776 -27791 64420 -439 268501 -178321
9541 20108 -100977 -159170 -291848 -238855 -257276 127029 -291947 -80597 -1662 36359 141484
9530 141484 -29343 14798 170353 50446 -212047 38813 -121639 -6466 -354454 132824 -198694
$$ packed form
9613a065C28978a57187B4089a25503a2952k50996j4435g6484A7795a57197A4351
9601b11415L4364A68498e77179b7479k1199j42135f5794l02950a43739J3701j96901
9590c26939I20d05371b5185I615b78202A7726b75958J26238I6780a44250E257
9578H686d67629A5639b20019f9074A74294J21836i0608L8066j49873I4006a16981
9566a59380B61670G9130c11396e1780A13068O287R174A7177a2951B25248a40940
9554c2447A77608o9901e48r776j82835k7142c4776O985F4420d39B68501a78321
9541B0108a00977n8193j32678N2993j8421A27029b91947h0597a662C6359J05125
9530A41484b9343A4798J55555E0446b12047C8813a21639f466l47988A32824a98694
$$ plain form
9518 -145132 -15397 -168980 71777 58129 117390 19638 -145704 67790 -136749 -297849 -77423
9506 129011 291200 4113 300515 -184031 117238 198457 -241789 143230 -254287 -598145
9496 -598145 163170 -135468 -104626 -320067 -125154 -37789 -33734 -229619 236621 67376 -69375
9484 -226925 -156191 4415 -100862 18261 -59395 37354 -15764 -234268 -243887 15556 -43883 -88218
9472 -88218 34885 57008 -58314 -265029 -391360 -69829 103470 76527 171102 54424 172795
9461 172795 -281149 -94655 300360 -242608 -149719 -43463 -258405 -186367 -47147 112290 114422
9450 114422 -37037 -105505 110202 -23325 28528 146839 -197586 -146275 76632 216782 97376
9438 153513 263095 -423865 9625 -332811 263689 176972 35922 -199961 -150641 343620 137702
$$ packed form
9518a45132a5397j53583G1777j3648N9261A9638a45704F7790a36749j61100g7423
9506A29011J62189D113K96402a84031A17238Q1219b41789A43230b54287l43858
9496e98145A63170a35468L0842k15441a25154c7789M055j95885B36621F7376f9375
9484b26925P0734D415a00862A8261e9395C7354a5764k18504r619A5556d3883m4335
9472h8218C4885K2123e8314k06715j26331f9829A03470k6943R4575E4424J18371
9461A72795b81149i4655C00360b42608R2889d3463k14942P2038d7147A12290K132
9450A14422c7037o8468A10202b3325B8528J18311a97586N1311G6632J40150I7376
9438A53513J09582d23865I625c32811B63689q6717C5922a99961M9320C43620A37702
$$ plain form
9426 -141306 -104903 -7344 -198546 -189825 131683 -282452 298610 -96405 3787 -230705 -378293
9415 -378293 -25475 56117 -62075 59583 -92367 -55055 -132202 -31301 -147972 89683 180345
9404 180345 -23960 -49542 -290609 -251331 -15281 -131837 107928 -254557 -121420 -230354
9394 -230354 -296555 -39176 -171559 -264631 -161610 -269211 -197907 -530273 -217648 19894 59837
9383 59837 57653 -211935 -2429 143814 -178910 -10078 -133634 40287 -181521 410808 253911
9372 253911 53405 -272656 -114325 -69090 -44140 131375 -238398 -193951 -57280 158472 -117976
9360 -242572 -231813 160953 -78584 142709 97160 -78575 28294 -19090 -52618 -138342 -24408
9348 -119094 38549 64494 -61042 22370 -234040 17525 96917 177196 -223002 23069 -302716
$$ packed form
9426a41306L6403g344j91202Q721A31683b82452B98610i6405C787b30705j47588
9415c78293b5475E6117f2075E9583i2367L7312p7147c1301j16671H9683R0662
9404A80345b3960k5582k41067L9278a5281j16556A07928b54557a21420j08934
9394b30354o6201c9176j32383r3072J03021j07601P1304l32366b17648A9894L9943
9383E9837k184b11935b429A43814a78910a0078j23556D0287a81521D10808j56897
9372B53911E3405b72656a14325M5235K4950A31375b38398M4447e7280A58472a17976
9360b42572J0759A60953g8584A42709m5549g8575B8294a9090l3528q5724b4408
9348a19094C8549K5945f1042B2370b34040A7525P9392Q0279b23002B3069c02716
$$ plain form
9336 64027 56063 149202 45606 -110941 28504 39230 -343613 -487579 -3635 -239254 -131221
9325 -131221 -114201 -175471 -345949 -56706 -404729 29362 18354 -384415 -43141 -182991 116602
9313 -84379 52624 233658 126153 -95029 27239 -265272 -49224 -269884 27234 151302 -70698
9301 -46859 55282 -52793 131158 -185901 -30928 197010 140608 -220489 97197 190413 -97348
9289 167957 -108123 -40388 -336053 -59107 -91191 85422 -106966 -180639 -382346 -247039 -27110
9277 -225920 225649 -61526 -32135 -209578 -217620 44308 124492 -160935 -141859 82225 -133051
9265 243743 -189961 -173145 126396 124192 219526 -170044 -25153 -76720 -237521 182479 -75744
9253 -205184 -74919 -116623 -267777 183458 -291133 233563 139138 168272 247111 -162147 -102493
$$ packed form
9336F4027p964R3139D5606a10941B8504J0726c43613j43966c635k35619J08033
9325a31221J7020o1270j70478e6706l48023B9362j1008c84415d3141j39850A16602
9313h4379E2624J81034j07505i5029B7239b65272d9224k20660B7234J24068g0698
9301d6859E5282e2793A31158a85901c0928A97010n6402b20489I7197R3216i7348
9289A67957a08123d0388k95665e9107l2084H5422a06966p3673k01707J35307b7110
9277b25920B25649f1526K9391j77443q042D4308Q0184a60935J9076H2225a33051
9265B43743a89961J6816A26396k204R5334a70044b5153n1567j60801A82479g5744
9253b05184g4919m1704j51154A83458b91133B33563r4425K9134P8839a62147N9654
$$ plain form
9242 -102493 97324 -20191 -147786 27208 16916 32340 -23808 355747 240596 -212008 -166840
9231 -166840 -206970 -308481 136731 -112308 -61421 -102017 -149105 168392 33703 -232357 -20704
9219 -132914 -178338 -365360 -102343 172127 1835 -108739 -148215 57063 -449495 -359238 141988
9207 -240227 -237665 213737 -126767 -13040 274454 164965 34476 16654 20141 256162 -328080
9195 -145945 -156092 316078 235068 70715 -16370 -160341 -133788 57794 69660 -313610 -176671
9184 -176671 -70195 34667 -126689 26927 -116123 -280443 -20500 101639 8596 128905 -284380
9172 152504 164796 -77937 -49838 -28777 -244601 -41500 231771 -33421 162100 -109070 -239537
9161 -239537 -127696 -121070 112024 -98644 -131501 -167909 -190800 115905 -91202 -86784 -237727
$$ packed form
9242a02493I7324b0191j27595B7208j0292J5424b3808C55747j15151b12008M5168
9231a66840m0130j01511A36731a12308N0887m0596m7088A68392C3703b32357b0704
9219a32914m5424j87022a02343A72127A835a08739l9476E7063d49495R0257A41988
9207b40227K562B13737a26767a3040B74454j09489C4476A6654L487K36021c28080
9195a45945j0147C16078q1010G0715a6370j43971K6553E7794J1866c13610J36939
9184a76671g0195C4667a26689B6927a16123j64320b0500A01639H596J20309b84380
9172A52504J2292g7937K8099K1061k15824d1500B31771c3421A62100a09070j30467
9161b39537J11841O626A12024i8644l2857l6408k2891A15905i1202M418j50943
$$ plain form
9150 -237727 -261723 -249327 -233068 33194 40539 183628 242654 70717 -287092 246477 67773
9138 -172419 -103797 202349 183902 -231460 130466 -99759 -14333 196791 149569 -204609 -188312
9127 -188312 17234 -44745 -191267 -371920 54783 -249662 -20361 -135787 -32596 81874 24653
9115 -40834 409982 -349166 -92764 -81714 25260 91597 27987 15300 -112092 34570 2864
9103 -139988 -148714 -380934 -81621 -199559 112178 16421 85265 -260408 99769 -262450 21387
9091 99879 -134915 57805 -219653 369815 -31955 241314 135403 -65508 32414 -201672 -191503
9080 -191503 -483988 -79607 107622 -48753 44002 -306524 53149 -25503 -29925 -15002 -169654
9069 -169654 335790 -244173 61866 -192412 -112934 -130282 -160941 41005 -41789 -176759 112886
$$ packed form
9150b37727k3996J2396J6259C3194P345J43089N9026G0717b87092B46477F7773
9138a72419O8622B02349j8447b31460A30466i9759a4333A96791m7222b04609J6297
9127a88312A7234d4745j46522j80653E4783b49662b0361j15426c2596H1874B4653
9115d0834D09982c49166i2764J1050B5260O6337B7987j2687a12092C4570B864
9103a39988q726k32220h1621j17938A12178A6421O8844b60408I9769b62450B1387
9091I9879a34915E7805b19653C69815c1955B41314j05911f5508C2414b01672J0169
9080a91503k92485g9607A07622d8753D4002c06524E3149b5503m422J4923j54652
9069a69654C35790b44173F1866a92412P9478j7348l0659D1005d1789j34970A12886
$$ plain form
9057 41515 -119128 -258869 -379265 -399316 -220776 -48691 -63300 48970 -14462 57964 504197
9046 504197 -432566 258919 -188548 -370692 86018 925 -99423 -141097 36794 -289650 -367800
9035 -367800 214906 201477 48328 -157515 -2500 72244 175221 -26790 -64749 -18188 -53255
9024 -53255 -155525 163412 -170324 -125817 -35943 134469 71449 165434 146055 -52449 -140898
9013 -140898 117156 153131 -34145 -136152 -86096 -362026 -184942 161866 -414912 -166437
9002 -49405 309366 135981 -249021 86246 -384352 17038 -121208 -206599 164336 -75821 -144458
8991 -144458 55550 -139894 -30061 -63206 264802 149903 128636 -88328 -126693 -261204 -4488
8979 -167454 -150642 -49648 156528 172719 -144380 -253051 -14308 71402 366786 18842 -110653
$$ packed form
9057D1515a19128j39741j20396k0051J78540d8691j4609D8970a4462E7964M46233
9046E04197d32566B58919a88548j82144H6018I25i9423m1674C6794b89650p8150
9035c67800B14906j3429D8328a57515b500G2244J02977b6790l7959a8188l5067
9024e3255j02270A63412a70324M4507c5943A34469o3020R3985j9379e2449q8449
9013a40898A17156L5975c4145j02007N0056k75930J77084A61866d14912a66437
9002d9405C09366A35981b49021H6246c84352A7038a21208q5391A64336g5821o8637
8991a44458E5550a39894c0061l3145B64802j14899k1267h8328l8365j34511d488
8979a67454J6812d9648A56528J6191a44380j08671a4308G1402K95384A8842a10653
$$ plain form
8967 -247532 1723 -107824 -257699 92361 210357 195251 69557 235944 285405 -349505 -316757
8956 -316757 27006 -83378 -54214 -366058 -169579 -204020 -278505 342962 48984 -268408 -52837
8944 50447 -108404 117718 92365 144608 -184962 68049 -168036 -339683 -10331 -32670 -33919
8933 -33919 -411137 -132688 -239706 262124 -75050 -182366 -203474 -30352 -345382 -159601
8922 299411 676284 945421 121557 220856 84189 -99199 -260852 96769 -191627 -141246 103819
8910 -202476 -134198 -118705 156406 -294814 185610 -309456 -392840 225108 -200601 351067
8899 218100 -14604 58621 -63676 -61085 101324 -200403 -330581 198538 139624 -205833 -19855
8887 -171967 -242200 -50501 -221570 26694 296229 35186 -90616 -48553 -273588 -35394 51211
$$ packed form
8967b47532A723a07824j49875I2361J17996j5106F9557J66387M9461c49505L2748
8956c16757B7006h3378K9164l11844a69579l4441p4485C42962D8984b68408e2837
8944E0447a08404A17718k5353N2243a84962F8049a68036j71647a0331k2339j249
8933c3919l77218a32688j07018B62124g5050j07316k1108c0352l15030a59601
8922B99411L76873K69137A21557R9299H4189i9199j61653I6769a91627N0381A03819
8910b02476O8278J5493A56406b94814A85610c09456q3384B25108b00601C51067
8899B18100a4604E8621f3676K591A01324b00403j30178A98538n8914b05833a9855
8887a71967p0233e0501j71069B6694K69535C5186i0616M2063k25035c5394E1211
$$ plain form
8875 13845 101925 93461 120507 -357049 -447757 212073 -225088 54921 -380134 -116993 124937
8863 100910 408010 174927 42883 176597 -26925 41077 148810 64652 -192823 -360053
8853 -360053 -149652 65036 -46360 55948 -306067 11524 104738 -120375 81443 -81468 -63416
8842 -63416 -152926 -61052 -311971 34203 300413 53348 -560684 -162132 275399 -6397 -164253
$$ packed form
8875A3845Q8080q464K7046c57049r0708B12073b25088E4921c80134a16993A24937
8863A00910L07100A74927D2883J33714b6925D1077J07733F4652a92823j67230
8853c60053a49652F5036d6360E5948c06067A1524R3214a20375H1443h1468J8052
8842f3416q9510f1052k50919C4203K66210E3348e60684a62132B75399f397j57856
$$ [...]
##END NTUPLES=NMR SPECTRUM
##END=
