##TITLE=AC1450_MFUAH13259_8011800_iYNr6XPksR
##JCAMPDX= 6.0         $$ Bruker NMR JCAMP-DX V2.0
##DATA TYPE= NMR SPECTRUM
##DATA CLASS= NTUPLES
##ORIGIN= BRUKER
##OWNER= Administrator
$$ 1.72 TOPSPIN		Version 2.1
$$ 2013-07-05 19:07:24.505 -0700  Administrator@X
$$ Compression mode = diff/dup
##.OBSERVE FREQUENCY= 400.02188249412
##.OBSERVE NUCLEUS= ^1H
##.ACQUISITION MODE= SIMULTANEOUS (DQD)
##.ACQUISITION SCHEME= undefined
##.AVERAGES= 64
##.DIGITISER RES= 22
##SPECTROMETER/DATA SYSTEM= spect
##.PULSE SEQUENCE= noesygpps1d.comp
##.SOLVENT NAME= COFFEE_meoh
##.SHIFT REFERENCE= INTERNAL, COFFEE_meoh, 1, 14.961
##AUDIT TRAIL= $$ (NUMBER, WHEN, WHO, WHERE, PROCESS, VERSION, WHAT)
$$ ##TITLE= Audit trail, TOPSPIN		Version 2.1
$$ ##JCAMPDX= 5.01
$$ ##ORIGIN= Bruker BioSpin GmbH
$$ ##OWNER= Administrator
$$ $$ E:\/data/COFFEE/nmr/AC1450_MFUAH13259_8011800_iYNr6XPksR/12/pdata/1/auditp.txt
$$ ##AUDIT TRAIL=  $$ (NUMBER, WHEN, WHO, WHERE, PROCESS, VERSION, WHAT)
(   1,<2013-07-05 19:07:19.005 -0700>,<Administrator>,<X>,<go>,<TOPSPIN 2.1>,
      <created by zg
	started at 2013-07-05 18:55:49.736 -0700,
	POWCHK enabled, PULCHK disabled,
       configuration hash MD5:
       C8 4E 4E 5D D3 5C D8 9E 9F 52 82 E0 59 8A DE 15
       data hash MD5: 64K
       C6 66 6B A5 6F 7D B1 E0 83 70 5F 2A 07 1E 82 C0>)
(   2,<2013-07-05 19:07:22.052 -0700>,<Administrator>,<X>,<proc1d>,<TOPSPIN 2.1>,
      <Start of raw data processing
       efp LB = 0.3 FT_mod = 6 PKNL = 1 PHC0 = 0 PHC1 = 0 SI = 128K 
       data hash MD5: 128K
       75 79 69 2B 07 5B 0A BA B4 79 B5 12 39 08 70 4E>)
(   3,<2013-07-05 19:07:23.161 -0700>,<Administrator>,<X>,<proc1d>,<TOPSPIN 2.1>,
      <pk PHC0 = -82.80396 PHC1 = 0 
       data hash MD5: 128K
       CB 08 E7 96 AB 6C B8 C8 42 8C 63 8C AF 19 D9 33>)
(   4,<2013-07-05 19:07:23.661 -0700>,<Administrator>,<X>,<proc1d>,<TOPSPIN 2.1>,
      <abs ABSG = 1 
       data hash MD5: 128K
       D0 74 C4 6C 1F B3 45 9A 98 A0 2C 56 A3 FD 46 84>)
(   5,<2013-07-05 19:07:23.786 -0700>,<Administrator>,<X>,<proc1d>,<TOPSPIN 2.1>,
      <abs ABSG = 2 
       data hash MD5: 128K
       F6 23 85 6C 9A C3 D0 9B C5 A6 28 3D 08 57 5C C7>)
(   6,<2013-07-05 19:07:23.896 -0700>,<Administrator>,<X>,<proc1d>,<TOPSPIN 2.1>,
      <abs ABSG = 3 
       data hash MD5: 128K
       9D 9B B0 2D 9D 3B 64 84 69 F1 8C 3A 6B 7A B5 7A>)
(   7,<2013-07-05 19:07:24.021 -0700>,<Administrator>,<X>,<proc1d>,<TOPSPIN 2.1>,
      <abs ABSG = 4 
       data hash MD5: 128K
       5F 44 80 C3 5D E9 34 1E 91 EC 62 20 89 C9 41 F2>)
(   8,<2013-07-05 19:07:24.099 -0700>,<Administrator>,<X>,<proc1d>,<TOPSPIN 2.1>,
      <abs ABSG = 5 
       data hash MD5: 128K
       EF A4 A2 8B 87 46 75 20 62 1B B8 BF 62 F4 7C 92>)
$$ ##END=
$$ 
$$ $$ hash MD5
$$ $$ 7D 0F E3 A4 33 46 D6 D2 4C AE 70 B8 E8 EA 2F FF
##$RELAX= 
##$RELAX= 
##$RELAX= 
##$RELAX= 
##$RELAX= 
##$RELAX= 
##$RELAX= 
##$RELAX= 
$$ Bruker specific parameters
$$ --------------------------
##$DU= <E:\>
##$EXPNO= 12
$$ [...]
150 150 150 150 150 150 150 150
##$TP07= 0
##$TPNAME0= <>
##$TPNAME1= <>
##$TPNAME2= <>
##$TPNAME3= <>
##$TPNAME4= <>
##$TPNAME5= <>
##$TPNAME6= <>
##$TPNAME7= <>
##$TPOAL= (0..7)
0.5 0.5 0.5 0.5 0.5 0.5 0.5 0.5
##$TPOFFS= (0..7)
0 0 0 0 0 0 0 0
##$TUNHIN= 0
##$TUNHOUT= 0
##$TUNXOUT= 0
##$USERA1= <user>
##$USERA2= <user>
##$USERA3= <user>
##$USERA4= <user>
##$USERA5= <user>
##$V9= 5
##$VALIST= <valist>
##$VCLIST= <CCCCCCCCCCCCCCC>
##$VD= 0
##$VDLIST= <DDDDDDDDDDDDDDD>
##$VPLIST= <PPPPPPPPPPPPPPP>
##$VTLIST= <TTTTTTTTTTTTTTT>
##$WBST= 1024
##$WBSW= 4
##$XGAIN= (0..3)
0 0 0 0
##$XL= 0
##$YL= 0
##$YMAX_a= 5841866
##$YMIN_a= -11367817
##$ZGOPTNS= <>
##$ZL1= 120
##$ZL2= 120
##$ZL3= 120
##$ZL4= 120
##$ABSF1= 14.961
##$ABSF2= -5.597181
##$ABSG= 5
##$ABSL= 3
##$ALPHA= 0
##$AQORDER= 0
##$ASSFAC= 0
##$ASSFACI= 0
##$ASSFACX= 0
##$ASSWID= 0
##$AUNMP= <proc_prof1d_extract.lims>
##$AXLEFT= 0
##$AXNAME= <>
##$AXNUC= <1H>
##$AXRIGHT= 0
##$AXTYPE= 0
##$AXUNIT= <>
##$AZFE= 0.1
##$AZFW= 0.1
##$BCFW= 0
##$BC_mod= 0
##$BYTORDP= 0
##$COROFFS= 0
##$CY= 15
##$DATMOD= 1
##$DC= 0
##$DFILT= <>
##$DTYPP= 0
##$F1P= 0
##$F2P= 0
##$FCOR= 0.5
##$FTSIZE= 131072
##$FT_mod= 6
##$GAMMA= 0
##$GB= 0
##$INTBC= 1
##$INTSCL= 1
##$ISEN= 128
##$LB= 0.3
##$LEV0= 0
##$LPBIN= 0
##$MAXI= 10000
##$MC2= 0
##$MEAN= 0
##$ME_mod= 0
##$MI= 0
##$NCOEF= 0
##$NC_proc= -2
##$NLEV= 6
##$NOISF1= 0
##$NOISF2= 0
##$NSP= 0
##$NTH_PI= 0
##$NZP= 0
##$OFFSET= 14.961
##$PC= 1
##$PHC0= -82.80396
##$PHC1= 0
##$PH_mod= 1
##$PKNL= yes
##$PPARMOD= 0
##$PPDIAG= 0
##$PPIPTYP= 0
##$PPMPNUM= 2147483647
##$PPRESOL= 1
##$PSCAL= 4
##$PSIGN= 0
##$PYNMP= <proc.py>
##$REVERSE= no
##$SF= 400.020009636244
##$SI= 131072
##$SIGF1= 0
##$SIGF2= 0
##$SINO= 400
##$SIOLD= 131072
##$SPECTYP= <>
##$SREGLST= <1H.CDCl3>
##$SSB= 0
##$STSI= 131072
##$STSR= 0
##$SW_p= 8223.68421052631
##$SYMM= 0
##$S_DEV= 0
##$TDeff= 65536
##$TDoff= 0
##$TI= <>
##$TILT= no
##$TM1= 0
##$TM2= 0
##$TOPLEV= 0
##$USERP1= <user>
##$USERP2= <user>
##$USERP3= <user>
##$USERP4= <user>
##$USERP5= <user>
##$WDW= 1
##$XDIM= 131072
##$YMAX_p= 407031175
##$YMIN_p= -12285
##$CURPLOT= <Network HP LaserJet P1505>
##$CURPRIN= <$Network HP LaserJet P1505>
##$DFORMAT= <normdp>
##$LAYOUT= <+/1D_H.xwp>
##$LFORMAT= <normlp>
##$PFORMAT= <normpl>
##$SURQMSG= 1
$$ End of Bruker specific parameters
$$ ---------------------------------
##NTUPLES= NMR SPECTRUM
##VAR_NAME=  FREQUENCY,     SPECTRUM/REAL,   SPECTRUM/IMAG
##SYMBOL=    X,             R,               I
##VAR_TYPE=  INDEPENDENT,   DEPENDENT,       DEPENDENT
##VAR_FORM=  AFFN,          ASDF,            ASDF
##VAR_DIM=   131072,        131072,          131072
##UNITS=     HZ,            ARBITRARY UNITS, ARBITRARY UNITS
##FACTOR=    0.0627417313425164, 1,          1
##FIRST=     8223.62146879497, 3476,         -49847
##LAST=      0,             5047,            -48840
##MIN=       0,             -12285,          0
##MAX=       8223.62146879497, 407031175,    0
$$ Real data points
##PAGE= N=1
##DATA TABLE= (X++(R..R)), XYDATA
$$ [...]
67991 139224 134836 130385 126466 123510 121465 119936 118633 117496 116343 114620 111955 108872 106437 104970
67977 104970 103672 101877 100087 99153 98842 98077 96422 94486 92815 91232 89456 87614 85839 84061 82565
67962 82565 82003 82311 82192 80310 76702 72530 68808 65917 64045 63347 63640 64417 65176 65551 65298 64577 64079
67945 64079 64421 65427 66350 66762 66860 66946 66985 66762 66213 65536 65130 65356 66122 66810 66835 66231 65502 65027 64888 65143
67925 65143 65823 66681 67337 67818 68661 70305 72524 74619 76040 76707 76733 76044 74439 72098 69754 68092 67032
67908 67032 66018 65053 64908 66036 67748 68888 69001 68400 67387 66076 64815 64113 64010 64021 63859 63840 64374
67891 64374 65388 66458 67233 67593 67580 67398 67343 67585 67997 68197 67784 66640 65186 64200 64199 65050 66290 67654
67873 67654 69052 70260 71018 71356 71471 71311 70686 69735 68912 68425 68081 67758 67633 67793 67957 67857 67621 67525 67526
67854 67526 67272 66594 65848 65708 66572 68082 69329 69666 69246 68680 68301 67993 67503 66621 65206 63457 62062
67837 62062 61628 61943 62234 62167 62120 62403 62740 62760 62550 62441 62655 63394 64895 67015 69067 70455 71311 72183 73256
67818 73256 74190 74536 74012 72517 70255 67843 65979 64967 64645 64712 64904 64925 64535 63779 63033 62711 62927 63393
67800 63393 63632 63363 62673 61800 60784 59529 58162 57118 56758 57054 57642 58011 57667 56476 54954 53954 53886
67783 53886 54374 54772 54785 54524 54224 54103 54270 54651 55087 55534 55918 55875 55144 54295 54492 56196 58515 60185 60794
67764 60794 60692 60214 59599 59316 59716 60468 60928 61069 61469 62375 63351 63948 64195 64262 64150 64003 64342 65578 67367
67745 67367 68700 68655 67128 64936 63168 62282 61896 61556 61407 61726 62122 61829 60756 59549 58524 57228 55427
67728 55427 53857 53420 53999 54660 54781 54448 53823 52788 51345 49906 48942 48595 48858 49863 51662 53772 55256
67711 55256 55484 54729 53821 53257 52898 52615 52787 53731 54880 55155 54279 53154 52688 52718 52451 51546 50258 48864
67693 48864 47572 46867 47188 48133 48634 48205 47619 47952 49282 50746 51686 52324 53222 54411 55262 55225 54596 54375
67675 54375 55275 56957 58431 59169 59505 59933 60453 60809 61035 61315 61514 61321 60861 60729 61251 61980 62148 61519
67657 61519 60626 60180 60326 60559 60394 60038 60175 61031 61942 62137 61710 61401 61519 61629 61357 61017 61080 61414 61448 60964
67637 60964 60309 59841 59469 58850 57921 57141 57161 58172 59572 60474 60585 60375 60363 60554 60788 61268 62284 63610
67619 63610 64646 65183 65614 66325 67256 68207 69204 70241 70891 70603 69469 68412 68365 69261 70041 69808 68831 68158
67601 68158 68312 68707 68469 67464 66214 65115 64130 63137 62156 61206 60274 59440 58762 58042 56966 55525 54035
67584 54035 52777 51904 51655 52251 53456 54588 55166 55324 55466 55817 56446 57466 58906 60476 61685 62182 62005
67567 62005 61559 61335 61472 61616 61392 60876 60362 59786 58894 57891 57316 57126 56528 55103 53557 52916 53293 54016
67549 54016 54621 55131 55486 55390 54802 54122 53679 53356 52839 52028 51088 50306 49951 50110 50584 51082 51565 52252 53244
67530 53244 54209 54527 53765 52109 50319 49154 48774 48788 48867 49052 49464 50075 50931 52197 53604 54195 53166 50899
67512 50899 48674 47393 46983 47045 47522 48505 49804 51104 52316 53436 54162 54053 53107 51890 50934 50209 49442
67495 49442 48813 48924 49950 51171 51722 51554 51265 51091 50624 49597 48394 47506 46887 46238 45630 45426 45769 46457
67477 46457 47232 47923 48431 48783 49090 49324 49311 49102 49043 49278 49528 49614 49802 50279 50650 50478 49988 49716 49741 49812 49961
67456 49961 50345 50735 50921 51423 52892 54801 55699 55039 53942 53752 54509 55312 55540 55186 54449 53579 52898 52541
67438 52541 52335 52161 52134 52180 51865 51061 50371 50427 51037 51524 51663 51720 51725 51324 50408 49368 48526 47737 46800 46016 46026
67417 46026 47037 48395 49094 48773 48079 47935 48534 49321 49829 50126 50388 50511 50421 50391 50728 51368 52035 52591 52929
67398 52929 52784 52047 51107 50500 50229 49823 49033 48197 47820 48023 48536 49151 50032 51430 53084 54098 53744 52296
67380 52296 50739 49711 49164 49024 49466 50282 50700 50394 50106 50624 51565 51965 51768 51830 52527 53234 53357 53114 53009
67361 53009 53148 53387 53683 53934 53931 53766 53925 54633 55439 55763 55546 55007 54086 52592 50795 49427 49057 49669 50821
67342 50821 51995 52833 53213 53177 52785 52184 51841 52319 53596 54862 55392 55498 56157 57751 59617 60931 61557
67325 61557 61720 61271 59863 57795 56120 55641 56082 56488 56240 55413 54347 53330 52704 52840 53747 54947 55930
67308 55930 56538 56805 56760 56623 56900 57855 59077 59960 60477 61029 61672 62037 62102 62382 63135 63841 63846 63169 62368 61860
67288 61860 61736 61949 62321 62514 62363 62131 62103 62032 61442 60466 59913 60288 61070 61217 60307 59024 58508 59282 60763
67269 60763 61831 61902 61403 61171 61560 62264 62840 63099 63037 62708 62303 62120 62338 62926 63807 64883 65864 66338 66204
67250 66204 65879 65814 65924 65713 64932 63914 63240 63255 63888 64822 65752 66593 67443 68261 68628 68107 66906 65979 66178
67231 66178 67367 68605 69201 69341 69584 70032 70275 70051 69622 69439 69629 69962 70190 70248 70225 70280 70581 71204 72025
67212 72025 72754 73048 72649 71563 70177 69066 68496 68214 67888 67644 67884 68599 69243 69406 69361 69717 70656 71754
67194 71754 72454 72537 72132 71446 70589 69662 69024 69274 70728 72856 74581 75313 75494 75906 76718 77511 78015 78346
67176 78346 78607 78698 78666 78848 79459 80238 80656 80329 79224 77685 76316 75554 75270 75054 74932 75495 77176 79706
67158 79706 82408 84660 85952 85968 85035 84155 84096 84662 85240 85783 86663 87760 88392 88290 88041 88353 89353 90778
67140 90778 92377 93787 94477 94343 94125 94727 96120 97371 97780 97660 97789 98396 98996 99123 98903 98817 99123 99758
67122 99758 100643 101732 102796 103488 103781 104035 104444 104703 104523 104211 104324 104945 105681 106303 106921 107561 108000 108137
67104 108137 108191 108434 108987 109854 110847 111491 111421 110858 110329 109955 109585 109661 111173 114376 118148 121137 123095 124564
67086 124564 125705 126137 125808 125361 125490 126313 127408 128272 128763 129296 130502 132545 134969 137335 139704 142200
67070 142200 144472 146023 146790 147023 146883 146693 147237 149081 151668 153745 154719 155067 155442 156108 157293 159318
67054 159318 162045 164726 166773 168199 169131 169512 169662 170513 172653 175480 177914 179663 181216 182837 184315
67039 184315 185695 187546 190212 193274 196029 198165 199736 200840 201702 202898 205011 207980 211083 213691
67025 213691 215833 217888 219953 221828 223509 225319 227409 229489 231342 233348 236096 239500 242706 245045
67011 245045 246858 249184 252703 257079 261266 264410 266487 268154 270036 272274 274781 277715 281428 286052
66997 286052 291278 296481 300860 303731 305140 306180 308273 312015 316975 322560 328549 334671 340295 344979
66983 344979 349011 352947 356841 360396 363741 367554 372300 377698 383087 388121 392965 397953 403223 408734
66969 408734 414550 420946 428069 435548 442693 449153 455228 461471 468210 475583 483741 492678 501955 510901
66955 510901 519174 526992 534741 542467 549908 557095 564834 574305 585934 598807 611500 623463 635228
66942 635228 647359 659730 672034 684441 697372 710869 724558 738034 751084 763819 776834
66931 776834 790855 805873 821008 835659 850406 866208 883001 899850 916322 932942 950250
66920 950250 968188 986613 1005674 1025328 1045049 1064513 1084208 1104992 1127337 1151262 1176536
66909 1176536 1202482 1227959 1252169 1275453 1298808 1322739 1347018 1371490 1396472 1422121 1447906
66898 1447906 1473205 1498192 1523707 1550305 1577795 1605738 1633919 1662057 1689438 1715422 1740279
66887 1740279 1764998 1790104 1815067 1839120 1862207 1884793 1907112 1929100 1950716 1971702 1991182
66876 1991182 2008243 2023029 2036667 2049955 2062680 2074335 2084831 2094120 2101701 2107040 2110207 2111722
66864 2111722 2112037 2111462 2110229 2108154 2104497 2098651 2090767 2081346 2070531 2058245 2044774 2030539 2015426
66851 2015426 1998912 1980887 1961784 1941815 1920641 1898002 1874225 1849879 1825201 1800082 1774383
66840 1774383 1748161 1721754 1695718 1670427 1645701 1620972 1595754 1569785 1542972 1515620 1488560
66829 1488560 1462422 1436848 1411033 1385076 1360032 1336389 1313298 1289729 1265714 1241875 1218355
66818 1218355 1194996 1172125 1150278 1129247 1108210 1086851 1065677 1045135 1025023 1004970 985033
66807 985033 965563 946849 929054 912131 895614 878805 861398 843757 826490 809962 794229
66796 794229 779150 764451 750015 736188 723461 711703 700075 687898 675276 662684 650367
66785 650367 638521 627601 617876 608832 599655 590280 581386 573195 564859 555424 545075 534950 525832
66772 525832 517477 509256 501023 493073 485486 477948 470272 462789 456030 450100 444524 438648 432128 425094
66758 425094 417977 411138 404565 398028 391616 385901 381328 377540 373662 369302 364962 361314 358294 355086
66744 355086 350845 345360 339114 332872 327121 321786 316509 311181 306088 301583 297774 294544 291633 288643
66730 288643 285255 281559 277971 274691 271472 268020 264402 260872 257528 254336 251276 248325 245523 243204
66716 243204 241807 241135 240141 237876 234448 230713 227289 224348 222068 220527 219187 217182 214355 211408 208847
66701 208847 206353 203586 201024 199428 198739 198070 196674 194554 192199 190151 188745 187802 186508 184044 180611
66686 180611 177554 176190 176541 177368 177317 175907 173585 171141 169147 167647 166178 164225 161856 159833 158870
66671 158870 158814 158831 158384 157665 156935 155922 154253 152162 150259 148730 147265 145717 144222 142610 140348 137449
66655 137449 134914 133753 133776 133835 133157 132032 131262 131312 132037 132865 133106 132410 131142 130201 130204 130858 131241 130724 129563
66636 129563 128502 127887 127331 126304 124820 123306 121980 120745 119670 119071 118922 118618 117706 116499 115505 114477
66620 114477 112656 110009 107596 106505 106729 107364 107643 107456 107078 106699 106274 105662 104870 104121 103597 103151 102497
66603 102497 101747 101430 101726 101979 101378 100034 98960 98898 99570 100228 100566 100708 100557 99685 97954 95855 94057
66586 94057 92822 92031 91546 91252 90871 90120 89089 88190 87615 87092 86376 85773 85863 86720 87678 88005 87629 87053 86631
66567 86631 86224 85623 85064 85015 85493 85930 85844 85421 85197 85328 85475 85322 84842 84059 82933 81622 80482 79563 78409
66548 78409 76711 74943 73925 73802 73878 73481 72606 71596 70593 69587 68840 68876 70011 71988 74076 75544
66532 75544 76163 76364 76795 77620 78316 78238 77297 75991 74872 74133 73646 73263 73052 73244 73837 74271 73728 71984
66514 71984 69809 68226 67537 67348 67373 67717 68305 68602 68170 67177 66075 65108 64410 64240 64625 65053 65033 64783 64863
66495 64863 65220 65278 64988 65090 66012 67105 67406 66746 65648 64478 63278 62293 62056 62792 64021 64884 64800 63847
66477 63847 62686 62013 61935 61960 61696 61360 61408 61882 62457 62973 63540 64168 64647 64830 64788 64667 64623 64841 65385 66012
66457 66012 66383 66424 66278 65998 65555 65043 64574 64045 63375 62912 63164 64074 64937 65185 64957 64802 65048 65553 65865
66438 65865 65642 65138 65148 66113 67354 67651 66605 64967 63643 62902 62601 62561 62503 62204 61987 62449 63381 63619 62419
66419 62419 60484 59057 58487 58294 58229 58481 59025 59538 59965 60610 61596 62715 63787 64704 65156 64839 64047 63568
66401 63568 63781 64198 64065 63187 62040 61228 60944 60802 60174 58855 57330 56294 55981 56154 56549 57068 57637 58179
66383 58179 58714 59238 59645 59948 60384 60971 61227 60806 60215 60316 61132 61742 61454 60557 59683 58954 58069 56908 55706
66364 55706 54799 54420 54599 55154 55928 57058 58700 60432 61292 60700 59146 57735 57205 57512 58181 58795 59190
66347 59190 59366 59281 58809 58000 57272 57100 57520 58175 58845 59596 60334 60625 60185 59317 58595 58245 58068 57810 57393
66328 57393 56854 56271 55720 55156 54366 53196 51850 50852 50644 51198 52053 52774 53363 54141 55211 56209 56736 56848
66310 56848 56888 56969 56866 56431 55832 55360 55233 55567 56308 57113 57483 57138 56227 55211 54602 54632 55021 55244 55203 55412
66290 55412 56188 56990 57093 56714 56771 57531 58179 57985 57244 56711 56612 56641 56548 56360 56239 56471 57310 58515 59311 59206
66270 59206 58635 58453 58965 59766 60328 60341 59704 58638 57798 57802 58583 59478 60022 60333 60706 61152 61495 61620 61436 60741
66250 60741 59416 57699 56069 54838 54017 53641 53996 55217 56748 57585 57287 56491 56182 56624 57234 57350 56803
66233 56803 55847 54924 54496 54785 55625 56745 58044 59266 59716 58940 57633 57106 57738 58638 59051 59348 60137 61118
66215 61118 61508 61187 60685 60289 59824 59229 58701 58207 57413 56176 54805 53674 52875 52308 51936 51850 52175 52896
66197 52896 53754 54454 55011 55646 56361 56944 57529 58611 60201 61456 61616 60944 60239 59783 59443 59446 60216 61502
66179 61502 62460 62743 62836 63133 63383 63325 63287 63706 64427 64898 64804 64193 63312 62626 62707 63642 64699 65035 64693 64523
66159 64523 65030 65704 65647 64620 63152 61784 60564 59401 58539 58338 58703 59095 59158 59068 59148 59422 59744 60097 60545
66140 60545 61053 61570 62119 62554 62389 61265 59562 58288 58285 59632 61721 63726 65050 65601 65727 65874 66315
66123 66315 67171 68413 69655 70165 69397 67538 65377 63715 62896 62683 62465 61775 60810 60200 60211 60537 61029 62032
66105 62032 63616 65007 65507 65591 66303 67719 68864 69145 69024 69062 69108 68885 68789 69476 70940 72430 73235 73279 72997
66086 72997 72761 72435 71527 69920 68283 67482 67704 68505 69582 70984 72568 73791 74262 74122 73733 73366 73222
66069 73222 73321 73245 72545 71562 71273 71974 72686 72370 71342 70881 71730 73532 75583 77474 78875 79313 78621 77443
66051 77443 76884 77452 78422 78475 77072 75009 73472 72791 72469 72203 72278 72845 73443 73506 73037 72525 72518 73453 75418
66032 75418 77756 79281 79334 78409 77480 77000 76961 77585 79257 81774 84174 85564 85897 85833 85998 86465 86852 86843 86582
66013 86582 86528 86990 88000 89563 91676 93991 95884 97158 98461 100658 103907 107554 110812 113312 115196
65998 115196 116932 118928 121122 123104 124757 126467 128407 129876 129842 128114 125645 123667 122744 122510 122041
65983 122041 120530 117944 115013 112368 109835 106867 103485 100365 98018 96339 95029 94043 93396 92885 92303
65968 92303 91801 91817 92638 94080 95569 96527 96788 96626 96373 96085 95704 95387 95433 95900 96468 96744 96592 96207 96005
65949 96005 96342 97176 98100 98865 99754 101192 103078 104849 106222 107506 109115 111076 113192 115400 117677 119780
65933 119780 121394 122549 123652 125017 126504 127769 128790 129912 131351 132844 134077 135376 137591 141195
65919 141195 145710 150208 154071 157032 158813 159323 159201 159653 161411 164006 166270 167483 167904 168264 168897 169447
65903 169447 169384 168671 167823 167346 167295 167382 167253 166522 164789 161886 158043 153685 149198 144996 141535 138946 136839
65886 136839 134760 132724 130930 129148 126844 123884 120674 117561 114524 111541 108819 106497 104494 102892
65872 102892 102056 102117 102580 102778 102463 101731 100626 99238 97986 97344 97266 97297 97287 97583 98360 99119 99162 98385 97318
65853 97318 96515 96277 96871 98487 100657 102134 101942 100579 99654 100154 101396 102011 101599 101053 101397 102795 104692
65836 104692 106518 108029 109277 110524 112102 114192 116706 119421 122183 125001 128040 131509 135483 139840
65822 139840 144432 149164 153748 157537 159950 161051 161364 161093 159885 157515 154417 151263 148278 145274 142166
65807 142166 139080 136022 132784 129264 125735 122735 120720 119697 119085 118103 116471 114664 113302 112524 112189
65792 112189 112450 113617 115506 117458 119189 121161 123870 127123 130421 133756 137594 142162 147144 152073
65778 152073 156652 160703 164115 166910 169044 170106 169512 167141 163485 159070 154049 148512 142848 137500
65764 137500 132588 128098 124243 121400 119879 119945 121734 124737 127692 129661 131225 134090 139440 147022 155757
65749 155757 164618 172811 179846 185884 191641 197553 203279 208247 212299 215444 217353 217581 216069 213009
65735 213009 208386 202099 194416 185970 177316 168786 160633 153009 145914 139375 133530 128291 123214 118088
65721 118088 113356 109475 106158 102862 99831 97824 96793 95652 93677 91414 89823 89148 89100 89598 90640
65706 90640 91761 92303 92179 91814 91389 90672 89649 88831 88736 89405 90616 92196 93878 95116 95504 95288 95127
65689 95127 95329 95677 96097 97107 99229 102183 105131 107707 110342 113445 116713 119634 122415 125997 131185
65674 131185 138038 146049 154690 163773 173480 184027 195150 206031 215869 224405 231745 237977 243254
65661 243254 247861 251672 253796 253518 251596 249906 249605 250252 250937 251582 252699 254474 256685 259197 261879
65646 261879 264249 265669 265818 264602 261757 257009 250465 242431 232978 222198 210722 199404 188414
65633 188414 177251 165878 155319 146770 140380 135198 130149 124839 119600 115020 111379 108389 105544
65620 105544 102759 100528 99324 98977 98781 98112 96888 95540 94674 94587 94986 95271 95224 95194 95449 95556 94776 93040
65602 93040 91236 90414 90876 92032 92996 93261 93036 93005 93615 94598 95344 95739 96334 97589 99295 100994 102730
65585 102730 105048 108348 112492 117017 121539 126051 131051 137243 144811 153103 161341 169561 178366 187782
65571 187782 196897 204856 211724 217975 223486 227508 229532 229749 228565 226008 221755 215670 208157 199921
65557 199921 191444 182809 174092 165645 157739 150197 142852 136235 131146 127435 123917 119775 115463 111857
65543 111857 109181 107352 106743 107666 109404 110674 111101 111501 112632 114322 115970 117228 117982 118169 117894 117356
65527 117356 116510 115144 113391 111759 110497 109359 108106 106810 105558 104322 103301 102900 103040 102911 101798
65512 101798 99905 98081 96930 96449 96277 96063 95748 95648 96073 96803 97220 97041 96592 96258 96045 95899 96015 96577
65494 96577 97532 98932 101141 104325 107982 111364 114209 116821 119563 122470 125166 127043 127824 128061 128701
65479 128701 129901 130707 130158 128368 126153 124036 122044 120116 118201 116156 114007 112091 110625 109363 108020
65464 108020 106658 105261 103434 101155 99386 99110 99923 100375 99686 98382 97254 96470 95886 95517 95374 95384 95699
65447 95699 96632 98051 99341 100194 101033 102388 104268 106334 108321 110029 111331 112458 113893 115694 117307
65432 117307 118413 119532 121222 122962 123446 122063 119621 117497 116387 115988 115564 114588 113000 111118 109411
65417 109411 108263 107788 107761 107767 107527 107104 106748 106541 106336 106080 106023 106484 107433 108493 109411 110460 112171 114635
65399 114635 117287 119642 122052 125294 129318 132945 135118 136038 136582 136891 136196 134019 130911 127853 125392
65384 125392 123589 122362 121524 120691 119566 118331 117572 117763 118807 120092 121031 121599 122208 123048 123789 124188 124647
65367 124647 125733 127304 128701 129833 131454 134194 137814 141761 146046 151133 157170 163731 170310 176786
65353 176786 183369 190148 196708 202290 206439 209379 211528 212778 212640 211065 208636 205866 202754 199125
65339 199125 194900 189854 183722 176919 170542 165164 160109 154582 149082 144891 142319 140342 138066 135704
65325 135704 133810 132250 130523 128701 127422 126942 126636 125560 123363 120601 118202 116666 115719 114743 113439
65310 113439 112005 110780 109920 109419 109251 109357 109640 110073 110716 111489 112049 112052 111617 111444 112354 114646 117844 121068
65292 121068 123586 125046 125363 124675 123456 122353 121635 120971 120027 119165 119119 119922 120639 120467 119735 119322 119292 118745
65274 118745 117202 115541 115056 115833 116651 116526 115803 115472 115745 115792 114808 112968 111224 110340 110222 110153 109594 108761
65256 108761 108398 109011 110428 112150 113878 115517 116782 117150 116327 114645 112944 112006 111932 111989 111216 109428 107483
65239 107483 106370 106235 106580 107176 108198 109435 110053 109526 108402 107738 107922 108386 108386 107817 107319 107683 109008 110384
65221 110384 110669 109739 108640 108326 108602 108718 108559 108605 108860 108669 107802 107034 107214 108180 109111 109691 110360 111438
65203 111438 112499 112833 112204 110971 109635 108477 107521 106628 105726 105111 105462 107239 110001 112559 113995 114400
65187 114400 114479 114614 114623 114367 114173 114516 115467 116698 117876 118867 119617 120081 120327 120577 121036 121673 122225 122463 122490
65168 122490 122733 123578 124968 126419 127490 128217 129053 130367 132037 133603 134815 135956 137518 139670 142204
65153 142204 145020 148450 152983 158866 166088 174570 184149 194569 205748 218014 231810 247218 263900
65140 263900 281369 298989 315832 330930 343876 355058 365329 375488 385899 396188 405270 411976
65128 411976 415704 416410 414225 409561 403381 396700 389619 381295 371062 359188 346401 333108 319299
65115 319299 304835 289670 274181 259364 246153 234345 222847 211259 200482 191322 183331 175825
65103 175825 169262 164392 160501 155903 150255 145148 141944 140058 137995 135293 132673 130789 129679 129266
65089 129266 129675 130966 132870 134878 136387 136893 136348 135318 134566 134422 134644 134761 134477 133843 133214 132934 132976
65072 132976 133015 132930 132982 133282 133360 132679 131524 130941 131608 132995 133882 133591 132528 131553 131051 130756 130344 129912 129748
65053 129748 129793 129618 128973 128151 127659 127713 128197 128967 129888 130616 130740 130354 130224 130956 132035 132137 130622 128364
65035 128364 126733 125933 124858 122573 119433 116583 114775 114009 113912 114003 113795 113135 112437 112224 112475 112757 112886
65018 112886 112991 112950 112376 111431 111107 112244 114521 116852 118592 119949 121303 122613 123626 124359 125170 126501
65002 126501 128635 131537 134764 137647 139717 141021 142005 143104 144444 145801 146788 147192 147287 147811 149402 151962
64986 151962 154687 156882 158622 160469 162624 164624 165903 166363 166194 165413 163856 161564 158926 156395 154214
64971 154214 152404 150827 149260 147554 145788 144125 142525 140699 138402 135673 132729 129769 126952 124493
64957 124493 122636 121504 120992 120843 120832 120840 120736 120290 119395 118368 117792 117907 118409 119025 120061 121974 124462 126393
64939 126393 126849 126056 125178 125248 126317 127515 127860 127157 126107 125534 125546 125619 125333 124688 123740 122374 120671 119198
64921 119198 118568 118795 119268 119343 118839 118079 117615 117815 118602 119615 120676 121944 123525 125134 126372 127293 128449
64904 128449 130405 133363 137210 141729 146733 152145 157967 164057 170032 175564 180725 185775 190593 194581
64890 194581 197285 198884 199938 200821 201598 202258 202792 203020 202634 201502 199738 197444 194503 190776 186409 181851
64874 181851 177606 174000 171141 169003 167558 166778 166471 166217 165663 164914 164388 164163 163729 162519 160525 158122
64858 158122 155516 152741 150059 147915 146359 144874 142938 140528 137966 135515 133330 131613 130548 130162
64844 130162 130381 131147 132368 133822 135248 136469 137340 137679 137323 136237 134600 132872 131698 131465 131896 132270
64828 132270 132137 131645 131205 131133 131665 132986 134992 137295 139576 141852 144371 147530 151804 157272 163141 168365
64812 168365 172969 178206 184986 192697 199997 206199 211279 215044 217130 217527 216367 213445 208764 203303
64798 203303 198329 193966 189353 184251 179480 175609 172166 168644 165383 162908 161030 159282 157731 156702
64784 156702 156046 155304 154424 153750 153477 153540 153963 154973 156775 159413 162733 166347 169833 173138 176592 180460
64768 180460 184801 189796 195696 202185 208337 213549 218105 222482 226660 230606 234839 239695 244332 247381
64754 247381 248633 249364 250810 252834 254219 253872 251546 247787 243381 238699 233465 227317 220491 213738 207636
64739 207636 202255 197437 193014 188787 184672 180998 178363 177077 176878 177228 177717 178166 178579 179018 179409 179505
64723 179505 179193 178746 178605 179028 180121 182038 184781 187902 190790 193229 195366 197102 197929 197422 195671 193148
64707 193148 190386 187766 185321 182666 179395 175600 171808 168370 165199 162147 159342 157045 155393 154390
64693 154390 153912 153626 153129 152333 151640 151640 152642 154412 156252 157427 157793 158019 159024 161302 164925 169979 176539
64676 176539 184219 192235 200000 207373 214288 220562 226174 231216 235330 237564 237184 234447 230269 225317
64662 225317 219649 213193 206273 199666 194216 190313 187702 185847 184448 183466 182731 181942 181152 180920 181742 183519
64646 183519 185752 188101 190678 193962 198532 204557 211486 218519 225547 233313 242410 252463 262449 271420
64632 271420 278646 283596 286375 287952 289315 290444 290572 289316 286975 283799 279681 274727 269546 264621
64618 264621 259861 255139 250897 247750 245696 244150 242654 241174 239734 238188 236468 234722 233011 231071
64604 231071 228613 225748 222809 219722 215851 210737 204883 199484 195249 191691 187827 183464 179527 177114
64590 177114 176499 177145 178400 179890 181402 182812 184188 185739 187490 189240 190987 193191 196262 199913 203285
64575 203285 205759 207308 208052 207911 206983 205923 205429 205387 204876 203043 199767 195524 190927 186473 182385 178557
64559 178557 174836 171408 168710 166833 165318 163711 162106 160964 160498 160437 160261 159661 158875 158656 159607 161428
64543 161428 163088 163923 164301 164993 166228 167677 169045 170133 170512 169768 168167 166561 165424 164387 162902
64528 162902 161058 159458 158558 158344 158497 158611 158417 158023 157885 158366 159355 160413 161256 162009 163062 164691 166777
64511 166777 168879 170810 173111 176684 181805 187755 193625 199207 204836 210636 216362 221915 227493 233122
64497 233122 238362 242612 245418 246391 245207 242020 237728 233428 229576 225854 221871 217763 214059 211088
64483 211088 208678 206409 204092 201938 200300 199287 198645 197916 196651 194594 191885 189093 186789 184944 182947
64468 182947 180424 177879 176256 175942 176489 177302 178284 179597 181138 182482 183322 183736 184052 184562 185298 186030 186555
64451 186555 187022 187802 188921 189895 190407 190934 192266 194446 196679 198404 199993 202126 204936 208162 211814
64436 211814 216151 221142 226529 232430 239367 247553 256616 266308 277085 289714 304657 322226 343093
64423 343093 368198 398304 433958 475742 524114 579063 640291 707516 779890 854996 929233
64412 929233 999701 1065462 1126590 1182534 1231889 1273388 1306230 1329433 1341652 1342050 1331020 1309817
64400 1309817 1279725 1241650 1196023 1142744 1081567 1013121 939583 864135 789732 718483 651857
64389 651857 590934 536307 488080 446157 410431 380602 355978 335594 318431 303595 290491
64378 290491 278968 269105 260696 253122 245930 239430 234373 230941 228277 225174 221126 216609 212417 208855
64364 208855 205605 202287 199064 196585 195193 194355 193189 191672 190925 191996 194637 197765 200907 204550 208998
64349 208998 213622 217639 221075 224412 227647 230282 231979 232583 231633 228642 224026 219164 215234 212371 210132
64334 210132 208347 207174 206716 206945 207775 209006 210376 211891 213788 215992 217941 219304 220494 222062 223767
64319 223767 224737 224453 223212 221631 220071 218517 216736 214525 212027 209670 207586 205269 202128 198241 194185
64304 194185 190313 186655 183424 180987 179270 177780 176412 175694 175911 176407 176168 174913 173315 172397 172906 174988
64288 174988 178067 181246 184156 187350 191564 196725 201993 206711 210949 215149 219628 224538 229972 235824
64274 235824 241697 247137 251887 255832 258812 260661 261398 261175 260107 258293 256152 254495 254077 255000 256595
64259 256595 257899 258231 257410 255552 252694 248634 243254 237032 230954 225616 220576 214981 208841 203191 198841
64244 198841 195448 192094 188404 184777 181898 180445 180895 183005 185611 187496 188429 188944 189323 189425 189353 189468
64228 189468 189596 189046 187800 187005 187724 189618 191330 191842 191077 189532 187859 186539 185482 184045 181850 179382
64212 179382 177391 175964 174682 173505 172897 173069 173678 174345 174933 175182 174660 173397 172190 171873 172550 173852
64196 173852 175684 178298 181788 186022 191201 198074 207278 218535 230808 243224 255646 268190 280294
64183 280294 290527 297407 300372 299941 297069 292388 285983 277754 267999 257626 247691 238673 230286 222033
64169 222033 213803 205945 199015 193589 189993 187860 186141 184006 181750 180429 180532 181424 182244 182893 183749
64154 183749 184750 185402 185685 186336 187944 190178 192324 194289 196552 199226 201783 203819 205568 207245 208364
64139 208364 208217 206879 205206 203882 202955 202290 201941 201836 201579 200910 200101 199601 199477 199512 199653 200072 200902 202202
64121 202202 204098 206685 209858 213518 217927 223584 230659 238783 247433 256351 265424 274273 282135 288265
64107 288265 292487 295352 297714 300127 302673 305246 307881 310842 314501 319102 324414 329684 334214 338042
64093 338042 341706 345242 347788 348458 347329 345287 343074 340780 338081 334628 330310 325399 320423 315625
64079 315625 310636 304865 298151 290883 283694 277277 272206 268483 265342 261924 258160 254702 252137 250603
64065 250603 249990 249919 249609 248445 246891 246217 247014 248494 249617 250402 251557 253244 255023 256924 259838 264495
64049 264495 270547 277030 283511 290466 298697 308695 320543 334045 348780 364155 379628 394863 409605
64036 409605 423476 435982 446610 454767 459732 461018 458901 454386 448515 441866 434779 427716 421081
64023 421081 414801 408494 402040 395724 389713 383645 376836 368823 359675 349896 340159 331092 323203 316829
64009 316829 311981 308201 304779 301250 297624 294072 290571 287050 283696 280920 279078 278417 279120 281116 283813
63994 283813 286318 288094 289375 290928 293367 296632 300191 303842 308172 313836 320465 326898 332707 338872
63980 338872 346513 355539 365190 375396 386771 399497 413122 427340 442077 456707 470199 482404
63968 482404 494463 507496 521500 535953 550897 566893 584330 603415 624611 648618 676086
63957 676086 707763 744822 788790 841243 903579 976778 1061250 1157411 1266696 1391602 1534324
63946 1534324 1695618 1875091 2071913 2284606 2510690 2747358 2992377 3243597 3497541
63937 3497541 3748904 3991392 4218630 4424569 4603962 4752917 4868789 4949488 4993213 4998829
63927 4998829 4966086 4895451 4788179 4646774 4475176 4278384 4061979 3831747 3593165 3351022
63917 3351022 3109625 2873207 2645688 2430033 2228187 2041662 1871746 1719010 1582986
63908 1582986 1462459 1355898 1261636 1178118 1104230 1039214 982252 932413 888981 851389 818725
63897 818725 789758 763607 739985 718605 698776 679817 661426 643369 625260 607080 589492
63886 589492 573124 557765 542798 528250 514942 503736 495113 489328 486317 485379 485620 486975 490339
63873 490339 496391 504657 514058 524022 534734 546496 559312 572970 587162 601459 615449 628917
63861 628917 641717 653495 663784 672438 679700 685759 690399 693174 693745 691960 687814 681528 673522 664106
63847 664106 653276 641005 627611 613592 599081 583701 567046 549144 530437 511467 492683
63836 492683 474339 456395 438563 420582 402540 385007 368818 354631 342411 331351 320505
63825 320505 309653 299464 290798 283928 278366 273224 267719 261665 255662 250609 246847 243943 241329 238865
63811 238865 236650 234715 233210 232488 232503 232413 231297 229191 226892 224914 223209 221829 221065 220729 219994 218308
63795 218308 216040 213851 211875 209840 207582 205029 202097 199065 196689 195389 194560 193220 191168 188991
63781 188991 187171 185864 185357 185910 187008 187596 187345 187068 187466 188112 188157 187587 187084 186954 186843 186405 185657 184644
63763 184644 183312 181838 180668 180028 179698 179418 179249 179395 179897 180688 181747 183072 184597 186228 187842 189224
63747 189224 190199 190893 191639 192603 193673 194841 196331 198226 200208 201982 203720 205729 207768 209089 209238
63732 209238 208607 208163 208768 210679 213489 216482 219254 222059 225471 229730 234536 239400 244001 248202 251966
63717 251966 255271 257952 259681 260292 260115 259671 259028 257806 255927 253940 252332 250866 248969 246614 244426
63702 244426 242990 242460 242817 244098 246155 248506 250693 252689 254805 257288 260166 263350 266692 269962 272943
63687 272943 275563 277736 279090 279164 278036 276530 275485 274911 274189 273064 271997 271427 271161 270828 270493 270398 270362
63670 270362 270089 269908 270538 272022 273526 274412 274876 275225 275105 273994 272013 269640 266926 263632 259940 256334
63654 256334 252842 249057 244972 241119 237739 234496 231291 228752 227435 227067 227124 227716 229171 230987 232091
63639 232091 232318 232881 234942 238207 241506 244506 248151 253328 259651 265971 271744 277418 283566 290176 297065
63624 297065 304587 313466 323919 335342 346984 358799 371484 385865 402331 420784 440952 462735
63612 462735 486315 511947 539652 569059 599475 630001 659580 687058 711211 730690 744218
63601 744218 751225 752521 750125 746164 741870 737539 733139 728603 723628 717622 710042 700647 689214 675121
63587 675121 657534 636240 612248 587353 562974 539497 516831 495391 476161 459825 446150
63576 446150 434408 424136 415339 408246 403163 400356 399706 400663 402845 406526 412040 418815 425631 431923
63562 431923 438256 445270 452859 460830 469762 480490 493069 507010 522381 539934 560188 583252
63550 583252 609617 640129 674607 711084 746959 780329 809605 832521 846813 852094 850366 844477
63538 844477 836532 827829 819485 812479 807215 803421 800359 796976 792041 784476 773645 759270 741196
63525 741196 719326 693839 665486 635666 605934 577101 548938 521045 493890 468532 445463
63514 445463 424384 405245 388669 374867 362810 351330 340740 332412 326721 322250 317377 311987
63502 311987 307164 303595 300874 298198 295204 292027 288990 286460 284756 283895 283481 283029 282385 281688 280993 280207
63486 280207 279499 279458 280520 282344 284109 285492 287085 289779 293861 298733 303240 306237 307253 306876 306275
63471 306275 306075 305804 304639 302446 299788 297109 294340 291295 288063 284928 282165 280020 278674 278061 277894
63456 277894 277944 278195 278680 279305 279984 280854 282271 284629 288206 293086 299138 306093 313681 321797 330630 340727
63440 340727 352798 367322 384287 403402 424418 447026 470377 492917 512962 529558 542876
63429 542876 553817 563290 571900 580363 590033 602639 619245 639624 662893 688693 717496 749772
63417 749772 785095 822061 858734 893020 922874 946606 963229 972612 975448 973170 967723 961070
63405 961070 954573 948696 943227 937663 931348 923288 912105 896453 875646 849921 820179 787558 753241
63392 753241 718443 684287 651521 620326 590507 562042 535501 511833 491723 475224 462030
63381 462030 451797 444040 438062 433428 430431 429678 431257 434669 439582 446218 454921 465684 478187 491900
63367 491900 506182 520747 536174 553474 573028 594509 617941 644089 673407 705313 738980
63356 738980 774126 810187 845254 876754 902944 923038 936358 942562 942765 939333 934189 927865 920359
63343 920359 912084 903591 894934 885709 875291 862768 847064 827505 804046 776935 746599 714016
63331 714016 680683 647946 616722 587901 562415 540556 521771 505565 492241 482283 475221 469460
63319 469460 463021 454299 442575 428340 413025 397966 383639 370027 357471 346700 338062 331066
63307 331066 324795 318656 312716 307417 303011 299406 296590 294938 294701 295310 295721 295500 295097 294837 294244 292686
63291 292686 290258 287592 285097 282792 280600 278325 275569 272218 268947 266751 265841 265382 264503 263280 262469
63276 262469 262411 262516 262011 260950 260153 260117 260480 260782 261216 262058 262784 262626 261939 262073 263727 266237 268781 271413
63258 271413 274386 277274 279503 281276 283286 285879 289095 293135 298008 303015 307344 311133 315307 320413
63244 320413 326223 332402 338996 346189 354100 362926 372904 384056 396292 409681 424281 439770 455680
63231 455680 472039 489397 508111 527835 547762 567167 585863 604337 623346 643131 663161
63220 663161 682889 702496 722596 743463 764943 786844 808823 829965 849021 865130 877993
63209 877993 887398 892965 894298 891048 882952 870126 853237 833054 810138 785383 760519 737312
63197 737312 716333 697107 679431 663945 651388 641930 635334 631276 629506 630206 634149 641939 653119
63184 653119 666646 682194 700273 721043 743807 767778 792538 817562 842216 866649 891863
63173 891863 918341 945267 971595 997213 1022409 1046738 1069156 1088892 1105531 1118494 1126988 1130204
63161 1130204 1127149 1116710 1098551 1073760 1044103 1010841 974705 936561 897330 857510 817525
63150 817525 778476 741768 707963 676671 647648 621271 597815 576966 558423 542324 528631
63139 528631 516575 505321 494949 486209 479430 474173 469945 466749 464729 463630 462956 462528 462621 463588 465605
63124 465605 468745 473021 478179 483676 489043 494188 499203 503993 508237 511612 513908 515101 515536 515838 516368
63109 516368 516867 517009 517085 517666 518669 519373 519438 519282 519258 519041 518244 517121 516165 515286 513901 511682 508811 505677
63091 505677 502698 500342 498921 498329 498199 498263 498408 498600 498977 499870 501449 503550 506049 509170 513072 517377
63075 517377 521563 525739 530585 536544 543413 550680 557928 565003 572189 580161 589385 599564 610120 621196
63061 621196 633705 648310 664874 683136 703408 726246 751733 779492 809203 840818 874416
63050 874416 910152 948205 988462 1030320 1073141 1116888 1162025 1208687 1256178 1303395 1349613
63039 1349613 1394802 1439433 1484198 1529765 1576440 1623856 1671097 1717163 1761229 1802329 1838988
63028 1838988 1869413 1892118 1906232 1911162 1906225 1890824 1864986 1829660 1786497 1737328 1683707 1626820
63016 1626820 1567889 1508733 1451785 1399320 1352581 1311721 1276572 1247372 1224733 1209129 1200605
63005 1200605 1198991 1204145 1215836 1233522 1256493 1284247 1316466 1352580 1391692 1433150 1476938 1523172
62993 1523172 1571367 1620554 1670056 1719796 1769848 1820054 1870005 1918940 1965532 2008116 2045284
62982 2045284 2075946 2098802 2112174 2114562 2105077 2083263 2049041 2003206 1947611 1884448 1815422 1741767
62970 1741767 1664733 1585865 1507034 1430347 1357575 1289326 1225153 1164798 1108915 1058215 1012409
62959 1012409 970541 931976 896388 863171 831723 802225 775334 751005 728265 706292 685087
62948 685087 664931 645766 627365 609682 592790 576789 561934 548498 536456 525611 515932 507301
62936 507301 499055 490522 482156 475320 470590 466951 463146 459220 456163 454537 454058 454159 454251 453678 452154
62921 452154 450212 448673 447621 446319 444091 440904 437185 433508 430393 427913 425479 422440 418898 415502
62907 415502 412535 409754 407156 405181 403867 402456 400298 397740 395643 394311 393387 392494 391465 390117 388438
62892 388438 386941 386271 386345 386372 385859 385095 384444 383714 382666 381686 381365 381636 381915 382052 382568 383788 385253 386182
62874 386182 386190 385330 383858 382273 381254 381037 380992 380272 378926 377928 377993 378727 379186 379044 378893 379455 380765 382290
62856 382290 383631 384866 386167 387329 387961 388072 388118 388404 388732 388823 388780 388807 388730 388183 387188 386121 385138 384036
62838 384036 382704 381298 379879 378318 376693 375365 374430 373545 372614 372223 372905 374275 375419 375989 376384 376955
62822 376955 377704 378767 380531 382959 385375 387271 388922 390797 392827 394792 397071 400232 403994 407436
62808 407436 410432 414168 419764 426871 434119 440650 446685 452817 459334 466265 473522 480852 488027 495267
62794 495267 503212 512380 522916 534980 549024 565474 584416 605873 630266 658358 690799 727855
62782 727855 769457 815474 866074 921869 983348 1050021 1120380 1192940 1266962 1341800 1415956
62771 1415956 1487284 1553949 1614564 1667414 1710190 1740779 1757999 1761531 1751653 1729251 1695716 1652488
62759 1652488 1600902 1542564 1479460 1413352 1345336 1276314 1207542 1140299 1075250 1012646 953106
62748 953106 897672 847006 800934 758875 720366 685077 652790 623687 598323 576951 559031
62737 559031 543691 530435 519036 508986 499677 491180 484216 479071 475026 471262 467935 465832 465203
62724 465203 465578 466622 468505 471239 474386 477828 482367 488959 497580 507436 518226 530653 545523 562780
62710 562780 581756 602156 624528 649819 678793 711976 749950 793347 842362 896470 954917
62699 954917 1017604 1085251 1158691 1238171 1323340 1413440 1507194 1602699 1697685 1789690 1875798
62688 1875798 1952612 2017131 2067663 2103486 2123705 2126926 2112203 2079936 2031774 1970005 1897160
62677 1897160 1815726 1727946 1636012 1542470 1449932 1360137 1273657 1190831 1112641 1040197 973720
62666 973720 912651 856716 806269 761449 721557 685647 653338 624579 598853 575246 553369
62655 553369 533628 516303 500685 485621 470761 456823 444639 434345 425570 417950 411223 405152
62643 405152 399698 395090 391473 388690 386555 385070 384082 383061 381592 379826 377997 375749 372531 368529
62629 368529 364630 361482 359135 357509 356483 355523 354070 352567 352322 353875 356209 358124 359713 361748 364217
62614 364217 366449 368409 370848 374076 377507 380711 384152 388493 393750 399627 406263 414121 423373 433995
62600 433995 446401 461486 479811 501045 524410 549577 576948 607125 640194 675542 712211
62589 712211 749294 785974 821299 854044 882834 906369 923665 934231 938178 936043 928349 915245
62577 915245 896702 873133 845706 815857 784555 752255 719537 687387 656664 627589 600022
62566 600022 574002 549665 526906 505668 486479 470121 456642 445215 435150 426547 419655 414066
62554 414066 409034 404288 400091 396644 393881 391780 390474 389990 390106 390446 390608 390364 390006 390318 391824 394056
62538 394056 395828 396253 395352 393846 392734 392941 394881 398193 402173 406630 412099 419108 427581 437166 447943
62523 447943 460479 475211 492097 511031 532492 557498 586765 620044 656507 695753 738162
62512 738162 784211 833751 886090 940417 995757 1050740 1103773 1153376 1198075 1236221 1266368
62501 1266368 1287852 1300607 1304533 1299608 1286690 1267729 1244907 1219962 1194408 1169845 1147565 1128190
62489 1128190 1112254 1100966 1095871 1097668 1105761 1119124 1137307 1160282 1187381 1216704 1245708 1272287
62477 1272287 1295076 1312836 1324057 1327568 1323306 1311973 1293886 1268574 1235586 1195271 1148614 1096890
62465 1096890 1041872 985975 931418 879166 829056 780965 735555 693885 656715 624251 596213
62454 596213 571980 550896 532712 517620 505782 496923 490420 485649 482202 479971 479139 479993 482643
62441 482643 486954 492651 499283 506152 512617 518556 524175 529224 532807 534240 533699 531588 527625 521214
62427 521214 512616 503051 493517 484139 474896 466333 458945 452290 445425 438145 431207 425259 420058 414957
62413 414957 409764 404811 400399 396531 393127 390211 387788 385681 383636 381558 379598 377968 376812 376319
62399 376319 376811 378418 380659 382715 384331 386155 388869 392187 395129 397205 398830 400599 402653 404950
62385 404950 407668 410955 414586 418289 422257 426940 432408 438317 444558 451575 459853 469278 479248 489266
62371 489266 499312 509671 520706 532879 546834 563126 581780 602310 624415 648707 676601
62360 676601 709411 747522 790300 836674 885788 937253 990798 1045632 1100102 1151980 1198969
62349 1198969 1238984 1270437 1292812 1306940 1314283 1315711 1311157 1300321 1283254 1260092 1230787 1195601
62337 1195601 1155696 1112909 1068975 1025143 982364 941502 903377 868741 838147 811652 788720
62326 788720 768556 750445 733721 717688 701836 686002 670070 653720 636791 619794 603648
62315 603648 588844 575147 562167 549970 539046 529891 522722 517426 513706 511346 510431 511156 513368
62302 513368 516357 519198 521317 522805 524226 526153 528762 531730 534392 535987 536003 534570 532460 530437 528599
62287 528599 526668 524836 523810 523796 523996 523562 522728 522521 523571 525671 528318 531088 533510 535251 536700 539017
62271 539017 543272 549700 557854 567269 577826 589701 603226 618841 637116 658735 684235 713694
62259 713694 746881 783980 825937 873695 927037 984398 1043683 1102933 1160315 1213977 1262221
62248 1262221 1303689 1337435 1363061 1380755 1390896 1393529 1388424 1375537 1355082 1327189 1291941 1249873
62236 1249873 1202169 1150360 1096154 1041514 988355 937895 890565 846619 806427 770076 737239
62225 737239 707756 681973 660170 641942 626441 612975 601071 590333 580659 572376 565696 560170
62213 560170 555040 549992 545197 540721 536381 532232 528769 526521 525589 525694 526510 527911 530045 533158 537219
62198 537219 541684 545836 549413 552884 557068 562520 569171 576511 584177 592338 601374 611221 621347 631505
62184 631505 642073 653316 664633 675082 684515 693592 702635 711017 717980 723697 729212 735621 743678
62171 743678 754033 767411 784419 805351 830241 858956 891238 926687 964703 1004281 1043911
62160 1043911 1081834 1116516 1146829 1171874 1190924 1203688 1210444 1211650 1207448 1197740 1182673 1162769
62148 1162769 1138568 1110462 1079046 1045292 1010091 973881 937160 901308 868400 839904 815716
62137 815716 794664 775853 759354 745628 734575 725369 717181 709764 703100 696704 689839 682555 675990
62124 675990 671260 668352 666571 665796 666722 669941 675330 682299 690020 697267 702727 705860 707080 706873 705242
62109 705242 702411 699459 697483 696194 693984 689430 682340 673338 663021 651875 640651 630337 621624
62096 621624 614574 608881 604412 601387 600027 600157 601303 603105 605480 608433 611946 616066 620851 626122
62082 626122 631531 637030 643125 650601 660142 672239 687047 704122 722566 741688 761353 781565
62070 781565 802113 822992 844828 868356 893599 919987 947235 975525 1004714 1033776 1061214
62059 1061214 1085759 1106519 1122835 1134364 1141262 1144047 1143179 1138790 1130752 1118935 1103307 1083748
62047 1083748 1059874 1031348 998568 962862 925773 888239 850652 813450 777261 742529 709528
62036 709528 678785 650995 626243 603714 582587 562953 545418 530018 516089 503266 491975
62025 491975 482599 474530 466605 458361 450407 443514 437788 432914 428727 425109 421596 417666 413440 409697
62011 409697 407044 405369 404226 403457 403244 403754 404951 406615 408402 410046 411631 413597 416300 419670 423301
61996 423301 426685 429246 430467 430325 429505 428871 428641 428160 426437 422812 417250 410210 402287 393897 385324
61981 385324 377035 369672 363565 358376 353407 348212 342830 337599 332964 329356 327007 325864 325745 326445 327621
61966 327621 328775 329616 330344 331360 332739 334159 335266 335937 336188 336054 335604 334988 334435 334174 334320 334892 336125
61949 336125 338594 342663 347819 353056 358158 364111 371883 381201 391039 400964 411392 422666 434549
61936 434549 446638 458729 470609 481986 492815 503399 513995 524480 534424 543251 550326 555208
61924 555208 557925 558792 557970 555451 551415 546310 540546 534402 528267 522708 518298 515606 515244 517518 522027
61909 522027 528044 535398 544586 555877 568659 581808 594337 605511 614669 621275 625066 626035 624415
61896 624415 620657 615216 608295 599964 590459 580121 569203 558148 547892 539269 532073 525344 518661
61883 518661 512477 506944 501219 494422 486665 478578 470385 462131 454302 447404 441204 435209 429704 425534
61869 425534 422883 421073 419670 419010 419415 420580 422166 424482 428138 433297 439580 446533 454001 462346 472426
61854 472426 485056 500266 517396 536038 556459 578775 602171 625437 648022 670070 691486
61843 691486 711460 728894 742933 753119 759431 762260 762016 758734 752409 743743 734163 724925 716616
61830 716616 709669 704881 702993 704066 707736 713881 722519 733063 744229 754834 764320 772324 778082
61817 778082 780528 778834 772742 762540 748973 733026 715614 697428 679046 660937 643231 625677
61805 625677 608052 590528 573595 557772 543517 531115 520426 510901 502149 494358 487889 482604
61793 482604 477936 473574 469664 466279 463055 459535 455674 451838 448460 445738 443523 441420 439172 436990
61779 436990 435290 434023 432508 430132 427059 424089 421898 420614 420007 419875 420201 421012 422177 423379 424415
61764 424415 425566 427458 430363 433771 436913 439704 442845 446808 450983 454171 455847 456563 457016 457077 456026
61749 456026 453513 449949 446058 442423 439418 437098 434978 432335 428987 425538 422588 420026 417421 414880
61735 414880 413046 412250 412053 411720 410962 410129 409864 410597 412269 414475 416847 419144 421036 422199 422882 423987
61719 423987 426152 428919 431277 432931 434546 436700 439088 440927 441772 441710 440930 439351 436644 432641 427790
61704 427790 423081 419279 416276 413362 409997 406124 401888 397480 393180 389156 385244 381222 377282 373849
61690 373849 371003 368485 366239 364462 363036 361371 358991 355964 352678 349486 346561 343755 340680 337352
61676 337352 334659 333555 333810 334235 334259 334539 335746 337498 338905 339546 339465 338855 338290 338730 340554 342904 344565
61659 344565 345297 345824 346838 348503 350689 353159 355606 357853 359787 360928 360556 358754 356797 355920 356142
61644 356142 356918 358385 360984 364220 366926 368796 370653 373079 375663 377809 379368 380118 379468 377256 374234
61629 374234 371208 368175 364841 361536 358939 357076 355245 352909 350263 347806 345730 343889 342187 340771
61615 340771 339815 339230 338753 338296 337933 337421 336062 333423 329972 326548 323367 320041 316474 313071 309966 306707
61599 306707 302981 299150 295776 293007 290782 289116 287810 286249 284055 281708 279992 278982 278040 276742
61585 276742 275341 274321 273855 273777 273757 273379 272331 270724 269101 268016 267628 267693 267870 268008 268165 268375 268402 267955
61567 267955 267199 266891 267749 269707 271983 273802 274908 275434 275556 275416 275207 275167 275487 276290 277678 279715 282358
61550 282358 285369 288332 290779 292366 293014 292947 292560 292127 291616 290931 290374 290631 292051 294104 295872 297051
61534 297051 298056 299135 299844 299655 298762 297914 297599 297690 297810 297690 297211 296399 295454 294573 293652 292374 290682 289067
61516 289067 288181 288144 288296 287821 286716 286022 286808 288894 290932 291915 292154 292451 292761 292414 291514 291190 292145 293720
61498 293720 294928 295820 297093 298681 299717 299909 300100 301130 302828 304595 306495 309036 312089 314675 315966
61483 315966 316132 316085 316656 318140 320337 322790 325012 326616 327317 326940 325576 323619 321472 319279 317072 315068
61467 315068 313556 312495 311508 310300 308888 307420 306002 304727 303636 302610 301535 300590 300098 300057 300130 300154
61451 300154 300231 300194 299452 297804 296062 295436 296409 298583 301426 304700 308141 311238 313590 315288 316768 318361
61435 318361 320074 321768 323528 325780 328870 332468 335647 337761 339138 340660 342763 345085 347053 348520
61421 348520 349827 351469 353736 356476 359092 360903 361610 361456 361023 360838 360959 360774 359441 356767 353508 350617
61405 350617 348344 346357 344528 343138 342310 341714 341013 340317 339985 340171 340768 341645 342762 344056 345360 346514
61389 346514 347621 349142 351536 354663 357770 360272 362370 364635 367192 369743 372253 375043 378051 380575
61375 380575 382142 383277 384951 387331 389499 390421 389911 388550 386893 385019 382813 380445 378382 376930 375948
61360 375948 375123 374451 374333 375191 377058 379560 382299 385280 388933 393582 398898 404061 408520 412395 416026
61345 416026 419392 422132 423984 424997 425487 425993 427075 428846 430815 432403 433495 434259 434621 434296 433222
61330 433222 431652 429826 427852 425835 423892 422168 421081 421287 422936 425186 426993 428351 430217 433218
61316 433218 437072 441356 446200 451886 458248 464877 471658 478879 487026 496585 507663 519623 531460
61303 531460 542706 553607 564222 573774 581184 585909 587984 587701 585624 582498 578653 573775 567707 561136
61289 561136 554892 548781 541819 533570 524631 515757 507162 498989 491835 486317 482358 479330 476840 475073
61275 475073 474434 475036 476444 477742 477989 476946 475348 474230 473966 474272 475101 477056 480609 485327 490313 495218
61259 495218 500258 505387 510089 514087 517591 520599 522587 523316 523407 523570 523708 523351 522542 521526 519904 517067
61243 517067 513394 510114 507824 505974 504029 502269 501009 499818 498179 496421 495399 495516 496532 498039
61229 498039 499708 501314 502972 505231 508592 513070 518399 524389 530859 537588 544672 552551 561278 570055
61215 570055 577955 584822 591021 596555 601050 604447 607206 609816 612548 615617 619148 622968 626875 631143
61201 631143 636391 642969 650844 660055 670758 682731 695241 707632 719807 731900 743664 754282
61189 754282 762674 768043 770499 771152 771275 771130 769804 766362 760928 754490 747864 741156 734106 726633 718884
61174 718884 710923 702569 693581 683908 673649 662781 651111 638664 626000 613944 602907 592589
61162 592589 582394 572076 561954 552631 544626 538237 533557 530468 528638 527711 527519 528040 529125 530430
61148 530430 531630 532516 532740 531707 528980 524696 519432 513779 508272 503466 499712 496945 495003 494028 494146
61133 494146 494955 495959 497510 500708 506144 513283 521387 530550 541403 554099 568017 582367 596868
61120 596868 611952 628416 646716 666529 687145 708236 729903 752066 774364 796733 819439
61109 819439 842308 864500 885357 904952 923418 940244 954689 966503 975732 982197 985628 986038
61097 986038 983554 978191 970238 960531 949913 938748 927362 916492 906753 897946 889555 881703 875045
61084 875045 869924 866253 864130 864112 866894 873067 882927 896107 911714 929296 949343 972355 997825
61071 997825 1024831 1053242 1083496 1115391 1147917 1180136 1211388 1240669 1266749 1289052 1307696
61060 1307696 1322532 1332904 1338481 1339624 1336714 1329784 1319033 1305098 1288652 1270358 1251397 1233279
61048 1233279 1216756 1201423 1186771 1173100 1161180 1151550 1144477 1140058 1137960 1137593 1138946 1142804 1149681
61035 1149681 1158979 1169733 1181871 1196243 1213578 1233926 1256978 1282417 1309796 1338419 1367586
61024 1367586 1397024 1427144 1459029 1494234 1534575 1581830 1637212 1700961 1772719 1852551 1941424
61013 1941424 2040858 2153057 2282188 2435228 2621135 2850000 3134066 3489205 3934587 4491831
61003 4491831 5186350 6049243 7115494 8418258 9980990 11802671 13829828 15927535
60995 15927535 17883848 19471189 20539959 21082170 21222768 21155383 21072972 21121440 21366001
60986 21366001 21759949 22138180 22267009 21941165 21070905 19705222 17989022 16096625 14182195
60977 14182195 12357898 10691020 9211231 7922913 6816906 5877593 5086435 4424743
60969 4424743 3875390 3422279 3049355 2741465 2485905 2272255 2091251 1935082 1798645
60960 1798645 1679386 1575522 1484859 1405102 1334523 1272181 1217881 1171748 1133207 1100324 1070555
60949 1070555 1042053 1014004 986087 958234 930807 904385 879292 855645 833615 813244 794144
60938 794144 775795 758065 741099 724917 709395 694392 679626 664871 650679 638345 628491 620110
60926 620110 611632 602573 593434 584483 575642 567297 560085 553910 548183 543062 539396 537198 535243 532655
60912 532655 529964 528009 526585 524945 523120 521870 521465 521217 520220 518134 515171 511605 507469 502618 497044
60897 497044 491022 484861 478659 472475 466599 461258 456133 450616 444643 438843 433772 429435 425717 422762
60883 422762 420502 418177 414850 410394 405612 401383 397923 394876 391845 388690 385549 382812 381082 380882
60869 380882 382199 384438 387026 390000 393771 398403 403477 408648 413907 419200 424235 428915 433505 438077
60855 438077 442218 445642 448660 451627 454381 456722 458983 461448 463531 464332 463833 462804 461644 460053 457797
60840 457797 454988 451556 447207 442050 436584 430908 424654 417937 411556 405934 400515 394686 388700 383193
60826 383193 378280 373643 369133 364799 360599 356553 352919 349786 346671 342934 338478 333729 329106 324803
60812 324803 320974 317781 315276 313362 311801 310264 308667 307489 307416 308423 309625 310278 310594 311197 312175 313181
60796 313181 314252 315895 318324 321084 323653 326145 329127 332832 336732 339989 342283 344043 345813 347604
60782 347604 349064 350068 350790 351298 351546 351709 352028 352186 351335 348963 345412 341355 337235 333396 330248 327893
60766 327893 325954 324183 322913 322525 322719 322783 322372 321672 320944 320286 319684 318953 317775 316096 314357 313028 312082
60749 312082 311223 310474 310207 310760 312288 314769 317794 320534 322251 322719 321921 319689 316095 311862 307786 303941
60733 303941 300060 296506 294140 293215 293141 293442 294199 295300 296026 295944 295742 296606 298942 302139 305406 308423 311231
60716 311231 313956 316756 319810 323154 326499 329297 331168 332364 333656 335510 337471 338693 338994 338936 338819
60701 338819 338131 336310 333602 330715 327948 325149 322364 319933 317915 315889 313537 310989 308445 305831
60687 305831 303142 300864 299567 299170 299053 298970 299444 301008 303392 305855 308137 310591 313460 316462 319230
60672 319230 321718 323904 325495 326279 326512 326479 325872 324125 321359 318518 316368 314772 313110 311129 309127
60657 309127 307477 306284 305461 304971 304949 305601 306955 308783 310879 313366 316526 320323 324233 327536 329583
60642 329583 329914 328470 325795 322692 319562 316314 312941 309802 307201 305101 303450 302373 301680 300663 298967
60627 298967 297411 297296 298886 301097 302787 303893 305131 306931 308925 310296 310497 309808 309216 309593 310909
60612 310909 312359 313161 313059 312220 311097 310335 310303 310570 310298 309350 308549 308616 309312 309996 310569 311375 312559 314062
60594 314062 316058 318778 322001 325221 328248 331108 333462 334792 335271 335705 336336 336370 335172 333370 332144
60579 332144 331757 331536 331208 331498 333175 336033 339214 342265 345521 349550 354599 360640 367724 376061 385738
60564 385738 396430 407442 417989 427412 435183 440872 444166 444924 443193 439231 433557 426962 420419 414883
60550 414883 411002 408872 408108 408287 409302 411270 414166 417827 422299 427948 435204 444340 455527 468787
60536 468787 483807 500051 517275 535687 555307 575311 594222 610608 623346 631494 634513 632838
60524 632838 627808 620769 612371 602840 592597 582147 571525 560378 548847 538034 529268 522983 518602
60511 518602 515371 512976 511330 510270 509763 510254 512555 517476 525601 537167 551937 569520 590106 614634
60497 614634 643824 677257 713802 752625 793141 834198 874171 912074 947890 981606 1012578
60486 1012578 1040110 1063894 1083362 1097214 1104205 1103994 1096616 1081502 1057692 1024969 984357 937825
60474 937825 887919 837331 788070 741042 696746 656062 619768 587639 558817 532975 510401
60463 510401 491023 474178 459469 447060 436877 428153 420114 412621 405876 399992 395081 391221 388021
60450 388021 384639 380675 376686 373493 371278 369627 368167 366753 365237 363407 361151 358553 355868 353407
60436 353407 351228 348970 346337 343775 342221 342077 342801 343662 344445 345238 346056 346970 348147 349404 350104 349853
60420 349853 348966 347962 347078 346679 347551 350069 353354 355988 357446 358269 358998 359673 360348 361341 362722 364067
60404 364067 365031 365810 366821 368185 369728 371287 372881 374671 376772 378951 380656 381640 382454 384005 386639
60389 386639 390023 393834 398052 402557 407008 411327 415725 419972 423229 425122 426500 428508 431202 433788
60375 433788 436027 438515 441439 443973 445480 446711 449048 452755 456622 459337 460594 460787 460233 459156 458131
60360 458131 457997 459270 461896 465659 470604 476931 484556 492932 501424 509818 518289 526810 534755 541306
60346 541306 546120 549262 550582 549573 546009 540329 533219 525124 516454 507909 500158 493365 487346 482068
60332 482068 477570 473578 469570 465274 460788 456302 451971 447993 444436 441061 437660 434550 432418 431695
60318 431695 432355 434189 436944 440336 444446 450034 457903 467858 478702 489297 499215 508356 516515 523524
60304 523524 529395 534192 538176 542027 546287 550417 553052 553422 551900 548838 543664 535712 525412 514018
60290 514018 502553 491596 481707 473305 466271 460250 455311 451790 449606 448178 446965 445678 444017 441643
60276 441643 438397 434306 429502 424425 419854 416247 413187 409959 406586 403743 401691 399873 397746 395526
60262 395526 393784 392620 391560 390152 388474 387067 386476 386806 387701 388719 389638 390385 390877 391156 391573 392608
60246 392608 394494 397103 400045 402757 404594 405106 404292 402577 400616 399047 398152 397612 396799 395514 394320
60231 394320 394072 395270 397851 401253 404528 406836 408208 409648 412180 415905 420154 424348 428503 433114
60217 433114 438739 445502 452837 459993 466841 473833 481090 488149 494886 501999 510013 518270 525569 531486
60203 531486 536465 540956 545196 549607 554593 559850 564465 567819 570058 571684 573063 574226 574814 574331 572756
60188 572756 570667 568396 565407 561055 555620 549975 544560 539384 534702 530812 527283 523380 519261 515880
60174 515880 513528 511344 508583 505575 503046 501155 499617 498231 496880 495428 493961 492760 491776 490567
60160 490567 488999 487584 486796 486480 486211 485908 485778 485983 486660 487979 489875 491966 493909 495609 496935 497544
60144 497544 497237 496320 495420 495085 495545 496611 497829 499077 500988 504385 509251 514622 519539 523673 527062
60129 527062 529811 532170 534369 536227 537397 538135 539265 541224 543662 546189 548882 551785 554535 556952
60115 556952 559453 562402 565430 567912 569740 571193 572342 573076 573510 573902 574282 574465 574311 573743 572655 571073
60099 571073 569300 567770 566882 566972 568176 570269 572958 576345 580670 585601 590300 594293 597717 600515 602064
60084 602064 601903 600325 597903 594904 591424 587445 582419 575467 566505 556682 547192 538132 529009 519798
60070 519798 510944 502792 495566 489426 483939 478051 471276 464481 458784 454129 449748 445565 442147 439559
60056 439559 437274 435169 433687 433005 432854 433204 434343 436229 438526 441377 445397 450697 456613 462521 468270
60041 468270 473692 478413 482432 486174 489672 492295 493647 494165 494455 494542 494143 493198 491644 489106 485386 481001
60025 481001 476718 472579 467829 461800 454584 446841 439208 432005 425314 419169 413544 408250 403055 398046
60011 398046 393708 390454 388225 386739 385862 385390 384747 383485 382034 381333 381588 381920 381455 380293 379136 378389
59995 378389 378039 378117 378838 380324 382455 384959 387556 390122 392831 395979 399581 403258 406605 409411 411444
59980 411444 412322 411830 410229 408018 405538 402947 400410 398005 395531 392710 389657 386965 385169 384176 383333
59965 383333 382070 380402 378766 377500 376678 376427 377029 378451 379990 380789 380700 380405 380653 381626 383033 384484
59949 384484 385710 386692 387740 389214 391018 392526 393192 393114 392803 392509 391962 390825 389272 387988 387592 388087
59933 388087 388987 390004 391413 393660 396754 400368 404476 409513 415679 422274 427934 431557 432875 432263 430239
59918 430239 427334 424247 421757 420250 419487 419109 419203 420042 421309 422096 421903 421301 421234 421963 423046 424142 425289
59901 425289 426439 427220 427399 427248 427232 427506 428002 428959 431067 434814 439703 444371 447758 450075 452350 455133
59885 455133 458060 460793 463809 467877 473048 478558 483605 487927 491769 495603 499732 503911 507445 509894
59871 509894 511436 512323 512294 510969 508568 505822 503348 501544 500837 501363 502437 503022 502877 502809 503690 505691 508620
59854 508620 512419 517044 522231 527770 533855 540879 548921 557530 565858 572994 578353 581829 583515 583404
59840 583404 581635 578978 576686 575680 575913 576464 576103 573971 570093 565283 560401 555770 551357 547174 543120
59825 543120 538845 534330 530356 527662 525746 523234 519565 515631 512601 510765 509701 508937 508071 506848 505495
59810 505495 504575 504198 503847 503226 502750 502838 503223 503393 503285 503015 502365 501079 499381 497611 495557 492728 489182
59793 489182 485567 482399 479684 477143 474375 470890 466476 461591 457012 453038 449409 446036 443357 441748
59779 441748 440919 440205 439369 438806 438900 439329 439235 438187 436863 436587 438153 441216 444799 448183 451272 454325 457611
59762 457611 461275 465421 470230 475840 482002 488059 493592 498976 504914 511486 518112 524475 530873 537451
59748 537451 543685 549054 553723 558067 561918 564910 567311 569777 572376 574506 575947 577374 579467 581916
59734 581916 583720 584364 584365 584624 585425 586212 586277 585555 584633 584042 583741 583353 582772 582352 582464 583009 583416 583222 582588
59715 582588 582126 582140 582288 582155 581926 582157 583061 584504 586574 589580 593406 597451 601384 605401 609428 612718
59699 612718 614734 616057 617838 620593 624031 627778 631602 634977 637036 637208 635615 632758 629040 624694
59685 624694 619934 615103 610650 606857 603501 600035 596247 592476 588911 584999 579968 573767 567020 560163
59671 560163 553108 545723 538219 531013 524607 519672 516772 515749 515671 515624 515382 515173 515138 515344 516137 518000 520899
59654 520899 524126 527077 530079 534060 539284 544685 548686 550415 549905 547478 543524 538740 533795 528550
59640 528550 522296 515119 508357 503178 499219 495323 491218 487702 485295 483508 481517 478923 475750 472284
59626 472284 469057 466432 463931 460428 455424 449817 445102 441924 439615 437036 433642 429768 426092 422943
59612 422943 420186 417756 416028 415499 416273 418058 420414 422723 424192 424453 424158 424469 425859 427829 429822
59597 429822 431899 434277 436707 438717 440227 441616 443328 445541 448038 450166 451193 450955 450019 448973 447745
59582 447745 445893 443424 440901 438762 436859 434871 432903 431445 430682 430131 429095 427408 425543 423951 422587
59567 422587 421230 419993 419166 418660 418001 416942 415767 414898 414452 414306 414361 414577 414931 415527 416599 418245 420261
59550 420261 422388 424665 427359 430558 433882 436671 438616 440379 443541 449707 459597 473077 489829 509371
59536 509371 530195 549321 563389 570450 570786 566188 558699 549864 540744 532293 525581 521564 520537 521813
59522 521813 524016 525828 526678 526847 526870 526765 525903 523820 520917 517931 514734 510254 503888 496528 489661 483744
59506 483744 478050 472020 466051 460755 456079 451635 447482 443990 441074 438179 435187 432806 431667 431320
59492 431320 430627 429198 427962 428130 429834 432129 434140 435782 437350 438819 439917 440666 441554 443221 446197
59477 446197 450812 456902 463498 469249 473502 476811 480091 483462 486290 488192 489487 490597 491577 492491 493762
59462 493762 495620 497515 498682 499303 500579 503553 508217 513944 520310 527176 534212 540842 546754 552231
59448 552231 557790 563435 568314 571283 571926 570913 569162 566747 562971 557479 550958 544693 539732 536439
59434 536439 534341 532229 528956 524617 520665 518500 518242 519239 521353 525100 530741 537981 546616 556849
59420 556849 568768 582128 596929 613795 633397 655888 681235 709610 740625 772021 799612
59409 799612 819017 827775 826282 817291 804631 791882 781571 775231 773983 778679 789025 802507 814621
59396 814621 820760 818357 807617 790622 770025 748226 727018 707388 689557 673360 658704 645730
59384 645730 634767 626126 619765 615025 610830 606344 601413 596405 591788 587990 585414 584255 584254 584716 584903
59369 584903 584558 584209 584867 587056 590098 592717 594525 596497 599696 603950 608314 612615 617873 625142 634482
59354 634482 645254 656939 669305 682125 695194 708651 722957 738349 754353 770007 784659
59343 784659 798475 811834 824199 833981 839939 842438 842800 841472 837492 829968 819455 807377 794421
59330 794421 780148 764175 747152 730285 714226 698734 683342 668028 653170 639126 626049
59319 626049 614006 603062 593186 584218 576014 568562 561889 555910 550436 545307 540536 536372 533268 531752
59305 531752 532248 534987 539994 547137 556335 567776 581609 596990 611388 621382 624666 621329 613208
59292 613208 602226 589498 575766 562123 549973 540276 533003 527458 523167 520311 519244 519870 521777
59279 521777 524826 529172 534803 541503 549317 558578 569259 580695 592150 603358 614385 625371 636594
59266 636594 648276 659981 670551 679019 685303 689824 692810 694368 694820 694510 693541 692027 690223 688029
59252 688029 684822 680401 675787 672400 670638 669830 669371 669265 669711 670862 672910 675720 678380 679805 679931
59237 679931 679680 679614 679143 677286 673713 668880 663550 658334 653320 647992 641769 634617 626847 618543 609766
59222 609766 601178 593658 587176 580807 574083 567599 561978 556957 552048 547507 543984 541576 539811 538358
59208 538358 537259 536626 536548 537189 538530 540143 541609 543100 545221 548286 552082 556256 560579 564718 568157
59193 568157 570610 572406 574209 576311 578330 579651 580032 579650 578697 577269 575708 574658 574454 574586 574075 572377
59177 572377 569791 567127 565034 563483 561759 559284 556596 555135 555714 557626 559662 561545 563695 566007
59163 566007 567765 568691 569160 569297 568633 566840 564174 560925 557025 552432 547361 541901 535926 529606 523521
59148 523521 518028 512939 507973 503053 497987 492462 486598 481045 476208 471850 467690 463888 460641 457762
59134 457762 455007 452399 449932 447408 444904 442984 442035 441735 441551 441520 442238 444263 447745 452413 457814 463726
59118 463726 470353 477875 486032 494687 504508 516174 528939 540940 551199 560374 569251 577603 585026
59105 585026 591833 598259 603706 607681 610758 613645 615940 616817 616434 615567 614254 611942 608758 605588 602920
59090 602920 600575 598551 597182 596384 595577 594470 593197 591567 588898 584761 579290 572719 565257 557524 550432
59075 550432 544430 539369 535161 531903 529240 526284 522522 518290 514078 509908 505689 501706 498245 495043
59061 495043 491563 487789 484409 482120 480831 479585 477355 474035 470527 467751 465755 463974 462125 460434
59047 460434 459199 458564 458663 459532 460785 461778 462194 462226 462136 461935 461543 461037 460623 460458 460537 460708 461019 462082 464759
59028 464759 469197 474523 479841 485297 491726 499514 508282 517485 526781 535888 544577 552781 560287 566464
59014 566464 570754 573329 574717 574924 573617 571224 569115 568342 568632 568964 568820 568630 569169 570773 573071 575471
58998 575471 577922 581029 585249 590165 594827 598531 601001 602158 602211 601710 600907 599285 596302 592425 588727
58983 588727 585674 583134 581442 581388 582924 584923 586726 589118 593229 599134 606207 614317 623861 634819
58969 634819 646428 657774 668373 678314 688133 698367 708887 718828 727438 734792 741333 746953 750894
58956 750894 752437 751291 747459 741117 732714 722821 711774 699634 686568 673076 659709 646672 633878
58943 633878 621433 609923 600060 592034 585430 579892 575628 573016 571887 571567 571561 571796 572135 572097 571258 569724
58927 569724 567940 566197 564492 562749 561013 559457 558266 557423 556635 555565 554211 552966 552287 552397 553238
58912 553238 554549 556028 557610 559624 562488 566235 570517 575136 580451 587149 595624 605516 615884 625923
58898 625923 635648 645695 656407 667359 677978 688364 699151 710743 723115 736292 750508 765792
58886 765792 781691 797532 812741 826859 839462 850144 858412 863637 865351 863675 859351 853381 846674
58873 846674 839771 832545 824334 814799 804713 795548 788229 782584 777992 774091 770650 767221 763376 759139
58859 759139 754824 750359 745030 738005 729083 718803 707954 697091 686496 676312 666510 656893 647353
58846 647353 638035 629023 620087 611074 602330 594242 586572 578910 571673 565803 561311 557054 552289 547621
58832 547621 543929 541182 538887 536923 535201 533311 531347 530432 531433 533722 536244 539229 543589 549014
58818 549014 554050 558052 561693 565381 568511 570670 572473 574553 576558 577757 578006 577581 576601 575113 573331
58803 573331 571317 568701 565069 560479 555460 550633 546306 542154 537343 531309 524375 517366 510872 505245
58789 505245 500915 498057 496245 495090 494919 496132 498245 500540 503309 507297 512125 516624 520834 526175
58775 526175 533105 539872 544314 545959 545590 543666 540060 534883 528663 521861 514708 507417 500316 493950
58761 493950 489007 485676 483133 480322 477250 474811 473361 472362 471500 471127 471269 471214 470611 470131 470559 471971
58745 471971 474221 477404 481329 485321 489097 493112 497581 502016 506211 510805 516227 521966 527565 533413
58731 533413 539739 545709 550567 555043 560497 567094 573780 579747 585003 589762 594128 598300 602474 606767
58717 606767 611689 618221 626745 636253 645294 653355 660682 667140 672079 675090 676198 675452 672856 668457
58703 668457 661960 652612 640137 625521 610203 594705 578642 561901 545176 529418 515186 502471
58691 502471 490827 479893 470023 462015 456045 451356 447251 443673 440391 436507 431577 426545 422743 420450
58677 420450 419143 418520 418371 418029 417064 416185 416456 417937 420047 422996 427729 434591 443062 452768 463744
58662 463744 475552 486998 496858 504299 508662 509721 508207 505332 501605 496706 490558 483795 477064 470483
58648 470483 463968 457574 451409 445652 440732 437070 434640 433146 432529 432884 434005 435463 437046 438726 440412
58633 440412 442197 444544 447596 450457 451768 450953 448405 444730 440470 436352 432967 430141 427288 424516
58619 424516 422857 423289 425908 430051 434824 439551 444128 448901 453955 458694 462412 464974 466632 467563 468065
58604 468065 468731 469823 470846 471324 471570 472013 472268 471708 470627 469880 469609 469289 468895 469087 470271 472328 475260
58587 475260 479319 484470 490504 497661 506279 515814 525076 533596 541977 550690 559213 566657 572696 577739
58573 577739 582616 588182 594757 602010 609837 619174 631346 646732 664757 685073 707930 733330 760531
58560 760531 788544 816501 843387 867956 889016 905485 916375 921400 921565 918601 913840 908047 901951
58547 901951 896103 890329 884124 877476 870529 862556 852189 838838 823125 805802 787007 766716 745328
58534 745328 723678 702932 684350 668470 654614 641828 630177 620395 612522 605800 599801 594631
58522 594631 590033 585365 580680 576850 574294 572399 570457 568382 566226 563779 561017 558363 556137 554252
58508 554252 552570 551104 549833 548850 548559 549025 549266 548090 545667 543352 541865 540653 539237 538174 538245 539534
58492 539534 541734 544681 548174 551885 555827 560456 566093 572764 580683 590227 601304 613338 626060
58479 626060 639674 654131 668916 683620 697954 711104 721812 729309 733475 734072 730729 723945 715245
58466 715245 705999 696827 688353 681587 677068 674348 672833 672634 674252 677989 683999 692341 702625 714036
58452 714036 725915 737776 748658 757116 762173 763772 762074 756983 748649 737890 725697 712701 699466
58439 699466 686990 676529 668883 663782 659971 656252 652699 650507 650417 651916 654445 658489 664677 672533
58425 672533 681213 690814 701662 712709 721998 728516 732399 733588 731770 727525 722130 716082 709045 701233
58411 701233 693503 686056 678356 670475 663182 656663 650482 644942 641067 638983 637597 636137 634812 633897
58397 633897 633547 634612 638054 643248 648331 652546 656789 661510 665781 668913 671455 673858 675613 676455 677130
58382 677130 678266 679636 681097 683078 685610 688038 690158 692544 695450 698669 702701 708586 716181 724154
58368 724154 732057 740827 750833 761242 771912 784045 797995 812132 824930 836708 848267 859188
58356 859188 868533 876045 881778 885726 888525 891286 894037 895626 895792 895830 896643 897772 899122 901853 906535
58341 906535 912062 917609 924234 933446 945374 959228 974225 989296 1003371 1016821 1031122 1046358
58329 1046358 1060616 1072595 1082948 1092194 1099357 1103934 1107390 1111259 1115261 1118509 1121046 1123102 1124439
58316 1124439 1125571 1128039 1132456 1137863 1143885 1151554 1161035 1170733 1179929 1190184 1202714 1216432 1229997
58303 1229997 1243725 1258028 1272101 1285720 1300214 1316034 1331523 1345697 1359985 1375558 1391323
58292 1391323 1406403 1422105 1439338 1456610 1472898 1490099 1510132 1531817 1553258 1575205 1599388
58281 1599388 1625497 1652489 1680903 1711189 1741554 1770314 1798758 1829074 1861085 1893549 1926984
58270 1926984 1962593 2000113 2039170 2081033 2126586 2174469 2223652 2275773 2332384 2392002 2452442
58259 2452442 2513843 2576748 2639618 2701071 2762160 2823592 2883337 2940093 2996438 3055363 3116464
58248 3116464 3178864 3244855 3316851 3393649 3473614 3558667 3651124 3749569 3852128 3960779 4077979
58237 4077979 4202160 4331309 4467972 4615760 4773932 4940484 5117450 5307864 5510690
58228 5510690 5724272 5951586 6196443 6458064 6735392 7032972 7356142 7704356 8076260
58219 8076260 8477387 8915410 9391949 9907225 10468824 11087539 11768806 12517234 13345254
58210 13345254 14267987 15294774 16436526 17716650 19164015 20801546 22655252 24769840
58202 24769840 27204007 30021291 33307054 37193860 41859987 47520956 54453975 63028686
58194 63028686 73690726 86925707 103271295 123345188 147783445 177074046 211344733
58187 211344733 250058196 291532436 332520364 368419288 394410844 407031175 405213529
58180 405213529 390274220 365116092 333264765 298116275 262466071 228303132 196840221
58173 196840221 168681264 144002218 122698467 104511121 89122708 76199962 65404544
58166 65404544 56411143 48930414 42711242 37529876 33192005 29542381 26458974 23837439
58158 23837439 21588626 19645340 17958050 16482799 15179910 14020828 12986214 12057706
58150 12057706 11218316 10458343 9772717 9153335 8590299 8078498 7615920 7196970 6813909
58141 6813909 6463273 6144253 5851933 5578357 5319336 5074597 4842503 4620461 4409456
58132 4409456 4212338 4028077 3852834 3685912 3529554 3383502 3244846 3112850 2989151
58123 2989151 2873512 2763855 2660089 2563533 2472996 2385758 2302038 2224268 2152235 2083230 2016845
58112 2016845 1955440 1899679 1847472 1797546 1750449 1705853 1662361 1620238 1581121 1544791 1509194
58101 1509194 1473702 1439459 1406622 1374204 1342523 1312910 1285136 1257980 1232075 1209121 1188458
58090 1188458 1167540 1145862 1125422 1107166 1089872 1072745 1056287 1040238 1023324 1005427 987565
58079 987565 969547 950078 929360 909156 890082 871212 852493 835078 819014 803047 787150
58068 787150 772906 760880 749700 738238 726776 715654 704708 694404 685691 678361 671105 663295
58056 663295 655187 646534 636839 626782 617520 608746 599393 589976 582072 575654 569225 562516 556620 551371
58042 551371 545126 537546 530229 523993 517778 510914 504299 498504 492687 486328 480312 475437 471217 466813
58028 466813 461722 455205 446655 437061 428544 421896 416051 410283 405220 401226 397523 393646 390182 387365
58014 387365 384418 380998 377885 375493 373024 369795 366209 362813 359582 356647 354574 353364 352343 351468
58000 351468 351556 352830 354516 356269 358662 361801 364867 367570 370660 374284 377182 378342 378294 377961 377248 375614
57984 375614 373154 370300 367196 363930 360758 357632 354148 350232 346176 341906 337142 332345 328417 325348
57970 325348 322311 319244 317062 316024 315323 314734 315198 317084 319189 320309 320675 321000 321178 320853 320367 320135
57954 320135 319702 318297 315809 312567 308677 304216 299727 296016 293662 292780 292845 292827 292267 292158 293933 297640
57938 297640 302204 307465 314504 323591 333217 341894 349728 357355 364314 369419 372034 372111 369561 364405 357237
57923 357237 348924 340111 331255 322678 314304 305876 297661 290391 284289 278763 273268 267879 262927 258798
57909 258798 256133 255387 255996 256813 257458 258390 259587 260247 260048 259522 258854 257403 254993 252652 251475 251544 252454
57892 252454 254047 256095 258098 259877 261715 263571 265019 266220 267968 270351 272416 273671 274898 276886
57878 276886 279340 281665 283863 285991 287593 288415 288866 289154 288888 288192 288245 289874 292441 294939 297347 299965
57862 299965 302254 303457 303853 304360 305277 306260 307197 308276 309428 310405 311124 311463 311087 309997 308797 307950 307215
57845 307215 306270 305292 304377 303010 300687 297613 294293 291075 288532 287498 288029 289001 289548 290279 292290 295494
57829 295494 298761 301241 302860 303960 305269 307767 311751 316299 320276 323503 326318 328586 329996 330867
57815 330867 331657 331868 330353 326677 321438 315301 308388 300618 292084 283055 274057 265809 258658 252213 245979
57800 245979 240154 235390 231861 228983 225967 222457 218769 215695 213800 212749 211645 210143 208833 208431
57786 208431 209164 211104 214318 218267 221727 223945 225441 227258 229870 233176 236996 241062 244982 248606
57772 248606 251936 254444 255241 254347 252968 251946 250695 248380 245320 242354 239473 236032 231974 227919 224334
57757 224334 221295 218789 216662 214666 213151 213182 215314 218757 222468 226466 231214 236274 240671 244295 247881
57742 247881 251740 255407 258514 261133 263216 264410 264544 263835 262659 261473 260727 260392 259852 258761 257652
57727 257652 257217 257340 257400 257130 256566 255612 254341 253362 253180 253498 253802 254230 255123 256098 256364 255637 253983 251229
57709 251229 247482 243921 241976 241681 241763 241354 240795 240733 241309 242442 244198 246548 249171 251671 253744 255216
57693 255216 256112 256548 256323 255036 252897 250830 249255 247413 244599 241437 239042 237421 235834 234429 234339
57678 234339 236163 239374 243451 248825 256536 267555 282653 302502 327820 359537 398505 444536
57666 444536 495790 549009 599513 640837 666006 670900 656337 626363 585373 537721 488492 442189
57654 442189 400570 363340 330861 304478 284168 267794 253385 240853 230861 223260 217374 212794
57642 212794 209226 206219 203584 201450 199697 198059 196901 196905 197688 197829 196717 195470 195362 196108 196300 194957
57626 194957 192179 188823 185984 184301 183399 182338 180721 178861 176898 174570 172053 170119 169045 168086 166393
57611 166393 163886 160915 157784 155007 153353 153124 153770 154461 154658 154048 152573 150773 149549 149362 150064 151434
57595 151434 153195 154574 154759 153909 152869 151780 149941 147193 144402 142236 140486 138950 137880 137102 135839
57580 135839 134071 132974 133164 133433 132208 129513 126600 124279 122550 121274 120215 118792 116673 114361 112509
57565 112509 111014 109481 108135 107521 107599 107874 108122 108257 107820 106424 104581 103342 103207 103942 105283 107106
57549 107106 109022 110621 112195 114547 117860 121231 123605 124865 125821 127311 129484 131873 133982 135615
57535 135615 136598 136467 134841 132032 128888 126057 123789 122375 122094 122585 122902 122438 121279 119497 116851 113560
57519 113560 110628 108811 107732 106594 105293 104295 103790 103584 103627 104035 104686 105156 105074 104402 103539 103210 103904 105293
57501 105293 106630 107679 108760 109742 109870 108916 107773 107364 107597 107935 108382 109201 110142 110665 110646 110274 109530 108361
57483 108361 107014 105680 104121 102281 100992 101373 103470 106006 107545 107681 107181 107127 107816 108441 108092 106979
57467 106979 106110 105777 105195 103882 102504 101821 101593 101252 100931 100971 100890 99801 97685 95509 94140 93626 93395
57450 93395 92710 91184 89185 87491 86360 85401 84561 84432 85116 85651 85358 85041 85966 88154 90578 92549 93905
57433 93905 94262 93243 91394 89933 89552 90057 91042 92186 93033 93267 93154 93202 93430 93482 93181 92605 91948 91792
57415 91792 92910 95149 97063 97454 96772 96199 95969 95613 95261 95415 95764 95507 94713 94147 93838 93010 91533 90286
57397 90286 89945 90396 91363 92659 93800 94387 94917 96235 98121 99505 100162 101068 102931 105375 107790 109931
57381 109931 111554 112469 113133 114141 115072 114966 113964 113133 112540 111091 108653 106623 105696 104740 102930 101420
57365 101420 101500 102375 102367 101433 100878 101138 101510 101811 102715 104345 105821 106551 107020 108031 109833 112240 114970 117625
57347 117625 119781 121292 122285 122908 123325 123777 124242 124229 123331 121923 120843 120447 120385 120251 120016 119759 119343 118601
57329 118601 117684 117043 116949 117097 116904 116345 116190 117003 118217 118734 118280 117461 116570 115281 113639 112408 111975 111785
57311 111785 111393 111311 112143 113524 114607 115093 115149 114816 114235 114000 114532 115468 116373 117601 119663 122096 123940
57294 123940 125138 126523 128415 130195 131393 132381 133690 135307 136926 138331 139245 139373 138962 138926 139959 141760
57278 141760 143460 144662 145667 146734 147512 147447 146613 145842 145874 146584 147209 147254 146912 146727 147246 148911 151723 154838
57260 154838 157007 157729 157721 158069 159257 161160 163465 165808 167937 170088 172760 175789 178195 179421 180239 181764
57244 181764 184004 186086 187704 189503 192123 195504 199238 202942 206132 208238 209079 209150 209264 210001 211463
57229 211463 213349 215353 217547 220224 223247 225918 227785 229282 231181 233668 236380 239156 242251 245885
57215 245885 250005 254533 259541 265148 271433 278296 285287 291841 297979 304508 312156 320762 329612 338367
57201 338367 347257 356662 366919 378302 390732 403675 416733 430097 444015 458136 471973 485806
57189 485806 500499 516491 533431 550751 568057 585068 601745 618570 636286 655316 675628
57178 675628 696933 718613 739767 759911 779491 799204 818989 838283 857135 876367 896635
57167 896635 917905 939889 962408 985210 1007952 1030574 1053424 1076956 1101411 1126658 1152138
57156 1152138 1177296 1202319 1228013 1254578 1281054 1306506 1331106 1355354 1378982 1401701 1424490
57145 1424490 1448809 1474773 1501379 1528377 1556660 1586790 1618467 1651578 1686498 1723161 1761062
57134 1761062 1800477 1842401 1886922 1932904 1979795 2028573 2080391 2135456 2193732 2255555 2320871
57123 2320871 2389054 2460205 2535584 2616057 2701206 2790789 2885924 2988035 3097773 3216025 3344861
57112 3344861 3486337 3641372 3811131 3998862 4209317 4447122 4716877 5024217 5375762
57103 5375762 5778698 6241445 6774421 7390144 8104696 8941112 9931208 11114113 12535169
57094 12535169 14247576 16312409 18792923 21746473 25218553 29237684 33810033 38918239
57086 38918239 44525074 50573229 56978285 63626636 70381167 77070012 83442021 89130705
57078 89130705 93698381 96767377 98147453 97862537 96078435 93015259 88905854 83988717
57070 83988717 78499056 72651928 66632665 60597520 54675231 48967871 43555945 38505169
57062 38505169 33867204 29674935 25940144 22656151 19801349 17341952 15236426 13441317
57054 13441317 11914906 10618021 9514768 8573857 7768690 7076276 6477250 5956848 5504379
57045 5504379 5110971 4768163 4468248 4204680 3971724 3764374 3578694 3411536 3259917
57036 3259917 3121312 2994506 2879453 2776390 2685932 2609808 2550470 2509744 2488355 2485952 2499435
57025 2499435 2520238 2534560 2528083 2491627 2423523 2328437 2214726 2091556 1966514 1844857 1730305
57014 1730305 1625606 1531925 1448585 1374258 1308212 1249926 1198162 1151419 1109183 1071904 1039592
57003 1039592 1011033 984612 959510 935805 913622 892499 871745 851356 832345 815902 802274
56992 802274 790770 780777 772316 765634 760851 758308 758700 762428 769113 777949 787951 797387 803533 803855
56978 803855 797430 784842 767090 745246 720946 696244 672650 650714 630536 612166 595425 580011
56966 580011 566198 555047 547567 543901 543609 546615 553567 565264 581791 602045 623797 644122 659918
56953 659918 668442 667943 658200 640512 617074 590314 562599 535962 511620 489843 470629 454348
56941 454348 441459 431857 425090 421267 421270 425900 435190 448815 466898 490013 518244 550107 582162
56928 582162 609661 627951 633857 626401 606822 578158 544330 508851 474011 441112 411072 384409
56916 384409 360864 339734 320789 304488 291123 280160 270648 262018 254244 247512 242025 237936 235072
56903 235072 232692 229852 226268 222748 220604 220558 222263 224940 228339 232890 239054 246974 256925 269644
56889 269644 285792 305286 327579 352358 379350 407275 433410 454531 468257 473712 471427 462951
56877 462951 450299 435372 419662 404374 390616 379388 371419 367042 366234 368960 375671 387427 405416
56864 405416 430386 462574 501961 548371 601308 659526 720072 777352 823735 852301 859799 847329
56852 847329 818805 779247 733942 687778 644440 606178 574262 549344 531468 520461 516671 521108
56840 521108 534865 558860 594229 642391 704328 779992 868250 966424 1068949 1166553 1247535
56829 1247535 1300868 1319519 1302480 1254731 1185118 1103304 1017572 934096 856939 788168 728445
56818 728445 678082 637573 607262 587020 576679 576585 587490 610006 644323 690195 746844 812543
56806 812543 883744 954110 1014679 1056130 1072001 1060500 1024123 968383 900576 828185 757091
56795 757091 690845 631314 579369 534968 497577 467202 444592 430094 422982 422441 428612 442009
56783 442009 462424 489053 521155 557470 594881 628315 652259 662498 657181 637256 606044 567746
56771 567746 525908 483048 441061 401381 364982 332717 305410 283105 264561 248227 233596
56760 233596 221049 210629 201786 194297 188498 184347 180917 177230 173130 169061 165404 162304 159825 157958
56746 157958 156620 155716 155024 154037 152321 150139 148345 147447 147044 146425 145475 144763 144852 145733 146934 148019 148877
56729 148877 149519 149751 149300 148309 147453 147435 148520 150640 153522 156520 158775 160011 160886 162080 163298 163704
56713 163704 163168 162432 162103 162073 162014 161918 161959 162235 162754 163376 163696 163322 162293 160944 159459 158016 157340 158367
56695 158367 161090 164198 166271 167079 167418 168011 168944 170060 171454 173420 176052 179004 181683 183668 184951
56680 184951 185817 186637 187723 189098 190256 190506 189778 188840 188409 188342 188090 187634 187412 187450 187168 186151 184655 183266
56662 183266 182411 182244 182617 183049 182974 182122 180475 177988 174704 171108 167966 165732 164334 163550 163253 163335 163660
56645 163660 164103 164436 164296 163605 162875 162714 163141 163692 164075 164329 164589 165115 166312 168167 169840 170470 170245 170032
56627 170032 170121 170103 169880 169846 169962 169636 168826 168387 168857 169681 170172 170588 171606 173180 174564 175139 174761 173599
56609 173599 172094 170839 170068 169422 168521 167538 166913 166799 167113 167864 169008 170141 170678 170372 169525 168751 168551
56592 168551 168949 169507 169851 170078 170345 170319 169665 169032 169716 172093 175032 177227 178564 179825 181636 184137 187109
56575 187109 189902 191659 192195 192412 193414 195510 198383 201818 205776 210184 215237 221626 229945 240076
56561 240076 251652 264913 280479 298283 317167 335477 351788 365295 376026 384765 392442 399516
56549 399516 406020 411887 416960 420921 423566 425017 425416 424538 422050 418015 412884 407118 400980 394478 387283
56534 387283 378903 369184 358479 347139 335212 322912 311051 300543 291666 284096 277481 271630 266332
56521 266332 261411 256929 253035 249681 246616 243575 240340 236793 233046 229281 225421 221260 216990 213166
56507 213166 210010 207194 204470 201969 199577 196670 192982 189298 186739 185668 185691 186369 187393 188454 189502
56492 189502 190883 192762 194659 195976 196675 197040 197134 197022 197104 197621 198114 197987 197341 196709 196264 195903 195785 196007
56474 196007 195976 194914 192984 191227 190413 190579 191586 193345 195398 196972 197693 197850 197863 197925 198185 198729 199319
56457 199319 199578 199557 199733 200354 201102 201466 201189 200430 199791 200015 201278 202879 203937 204307 204429 204601 204840 205256
56439 205256 205928 206545 206731 206627 206645 206761 206650 206416 206521 206947 207068 206506 205630 205078 205175 205814 206534 206782 206512
56420 206512 206428 207169 208462 209619 210665 212151 213953 215116 215072 214266 213342 212430 211571 211140 211332 211634 211348
56403 211348 210491 209807 210004 211124 212602 213902 215138 216949 219573 222329 224350 225586 226622 227754 228803
56388 228803 229750 230836 232002 232753 232695 231770 230029 227673 225342 223835 223472 224083 225466 227340 229033 229945
56372 229945 230338 231024 232293 233781 235307 236962 238300 238392 237082 235523 235002 235754 237204 238828 240374 241716
56356 241716 242923 244180 245410 246211 246337 245990 245638 245829 247063 249296 251604 252880 252937 252417 251775 251045 250589
56339 250589 251153 252956 255445 258164 261137 264190 266734 268609 270449 272805 275567 278584 282115 286118
56325 286118 289828 292608 294731 296740 298550 299783 300544 301179 301573 301367 300744 300419 300877 301998 303408 304878
56309 304878 306327 307649 308675 309417 310373 312312 315492 319304 323095 327061 331773 337121 342465 347677 353076
56294 353076 358394 362784 366144 369474 373571 378245 383173 388642 394916 401680 408689 416239 424365 432271
56280 432271 439276 445808 452814 460709 469490 479306 490137 501339 512336 523525 535838 549599 564472
56267 564472 580360 597660 616639 637094 658819 682157 708071 737743 772006 811058 854921
56256 854921 904125 959638 1022217 1092352 1170871 1258912 1357063 1465103 1582728 1709789 1845462
56245 1845462 1987938 2135316 2286053 2437944 2587266 2729630 2861218 2978687 3078465 3157011
56235 3157011 3211724 3241258 3245335 3224752 3181236 3116853 3033752 2934759 2823601 2703909 2578260
56224 2578260 2448646 2317439 2187287 2060242 1937482 1819811 1708072 1603198 1505974 1416547
56214 1416547 1334095 1257457 1186217 1120711 1060897 1005989 955440 909485 868229 830930 796806
56203 796806 765878 738299 713397 690189 668564 649262 632786 618838 606631 595405 584859
56192 584859 575384 567634 561645 556698 552192 548162 544721 541603 538573 535751 533123 530309 527131 523974
56178 523974 521294 519287 518223 518385 519396 520360 521032 522075 523905 526118 528493 531543 535484 539596 543337
56163 543337 547300 552301 558248 564671 571657 579485 587961 596959 607094 619129 633121 648744 665930
56150 665930 684668 704843 726866 751935 781173 815230 855132 902580 958721 1023391 1096021
56139 1096021 1176117 1261867 1349222 1433446 1511156 1580415 1640143 1690730 1734524 1774417 1812040
56128 1812040 1847624 1880518 1908900 1929955 1941713 1944529 1940287 1930875 1917817 1901912 1881895 1854309
56116 1854309 1815938 1765953 1705212 1634890 1557002 1475086 1392830 1312672 1236712 1167761 1107930
56105 1107930 1057027 1013781 977829 949132 926412 907838 892622 880514 870481 861488 853906 848651
56093 848651 845536 843926 844235 847093 851618 856159 860259 864417 868598 872581 877139 883092 889717 895750
56079 895750 901524 908425 916714 925561 934816 945039 956070 967194 978452 990333 1002570 1014651
56067 1014651 1027083 1040757 1055574 1071018 1087318 1104575 1121577 1137163 1152015 1167433 1183109
56056 1183109 1197828 1211493 1224714 1237309 1249101 1261251 1274775 1288680 1301680 1314798 1329997
56045 1329997 1347090 1364423 1381892 1400908 1421976 1444553 1468613 1494075 1519532 1543971 1568974
56034 1568974 1596819 1627284 1658724 1691200 1725846 1762228 1799299 1837982 1879800 1923815 1967951
56023 1967951 2012307 2058077 2104488 2150428 2197893 2249819 2305267 2360790 2415877 2472929 2532479
56012 2532479 2592855 2654326 2719183 2787758 2858471 2931679 3009184 3090267 3172710 3257599 3348522
56001 3348522 3446116 3548131 3654752 3768806 3890692 4018255 4151861 4294357 4445915 4604414
55991 4604414 4771170 4950544 5143526 5347542 5563017 5794009 6041917 6305051 6585152
55982 6585152 6887734 7215228 7566584 7944374 8355154 8802227 9285779 9810948 10387625
55973 10387625 11021533 11714468 12474537 13316956 14253981 15294668 16456351 17765855 19248851
55964 19248851 20931344 22854633 25077110 27662414 30685494 34258198 38538513 43721171
55956 43721171 50050566 57855789 67553135 79610363 94539229 112925862 135402921
55949 135402921 162507275 194478010 230996539 270757622 310958508 347226549 374513163
55942 374513163 388752556 388306419 374298984 349819527 318692803 284494839 250037369
55935 250037369 217230093 187177384 160383430 136955476 116755258 99512717 84912540
55928 84912540 72637456 62374218 53819046 46696060 40766135 35818545 31667802 28163271
55920 28163271 25190432 22656387 20480221 18597604 16962376 15536641 14284647 13177962
55912 13177962 12197710 11326974 10546750 9841905 9204380 8627094 8100257 7616288 7172571
55903 7172571 6766371 6391998 6045352 5726139 5433059 5161422 4907751 4672131 4453870
55894 4453870 4249455 4057033 3878467 3714594 3562545 3419963 3287817 3166699 3054230
55885 3054230 2948523 2850623 2761069 2677153 2595737 2515691 2435774 2353567 2268895 2185376 2106165
55874 2106165 2030640 1957162 1886369 1819591 1756490 1696515 1640705 1590129 1544262 1502409 1464811
55863 1464811 1430971 1398793 1366760 1335165 1304175 1272826 1241078 1210724 1182878 1156429 1130162
55852 1130162 1104521 1080240 1057165 1035432 1015714 997117 976914 953683 929020 905104 882466
55841 882466 861081 841509 823538 805610 787057 769339 753861 740090 726935 714416 702857
55830 702857 691934 681594 672442 664343 656153 647664 640079 633716 626974 618582 609155 599528 589300
55817 589300 578190 567150 556921 547042 537365 529054 522901 518146 514025 511021 509531 508893 508897 510725
55803 510725 515129 521126 527660 535077 543696 552399 559972 566471 571827 574474 572966 567907 560858 552266
55789 552266 541956 530779 520275 511231 503637 497330 491587 484848 476037 465769 455517 446264 438709
55776 438709 433967 433148 436831 445484 459424 477514 496621 513011 523753 526790 521232 508372 491235
55763 491235 472278 452462 432879 415512 401357 389283 378022 368111 360660 355390 351232 347835
55751 347835 345071 341911 337233 331244 324988 318980 313235 307958 303240 298728 294504 291560 290505 290449 290023
55736 290023 288734 286559 283109 278286 273003 268270 264155 260424 257364 255035 252478 248718 243912 238699
55722 238699 233201 227559 222674 219396 217596 216928 217790 220639 225042 230326 236480 243488 250458 256287 260548
55707 260548 262998 263115 261099 258478 256587 255083 252882 249746 245963 241273 235337 228691 222114 215615
55693 215615 209061 203137 198596 195182 192387 190666 190692 191955 193250 194174 195107 196218 197595 199905 203732
55678 203732 208533 213222 217414 221197 224187 225918 226712 227112 226792 225123 222476 219961 218121 216800 215942
55663 215942 215635 215729 216282 217931 220904 224201 226724 228635 230588 232326 233376 234560 237213 241111 244563
55648 244563 246509 247214 246908 245149 241765 237315 232265 226526 219961 212650 204647 196184 188045 180936 174655
55633 174655 168564 162689 157531 153122 149235 146273 144835 144482 144036 143119 142445 142468 142697 142497 141742 140519
55617 140519 138957 137429 136276 135213 133647 131573 129531 127725 125823 123643 121435 119501 118051 117300
55603 117300 117182 117143 116743 116168 115647 114813 113391 112116 112050 113210 114635 115528 115547 114416 112303 110367 109857
55586 109857 110644 111526 111887 112141 112645 113177 113584 114116 114990 116270 118141 120614 123063 124822 126117 127758
55570 127758 130059 132798 135916 139381 142561 144688 145844 146622 146965 146276 144499 142201 139648 136756 133803
55555 133803 131205 128712 125826 122958 121139 120611 120666 120751 120707 120127 118730 117373 117379 118736 120172 121166 122559
55538 122559 124894 127497 129662 131474 132921 133361 132598 131518 130925 130557 129816 128697 127402 125790 123826
55523 123826 121890 120145 118215 115945 113753 111780 109449 106444 103392 100929 98707 96009 92877 89922
55509 89922 87434 85313 83607 82542 82193 82419 82928 83127 82333 80508 78530 77387 77276 77604 77573 76686 75072
55492 75072 73529 72892 73215 73870 74476 75255 76426 77808 79173 80532 81877 83054 84044 84920 85439 85133 83954
55475 83954 82424 81087 80242 80191 81105 82540 83654 84069 84071 83885 83355 82465 81633 81269 81402 81759 81779 80697 78280
55456 78280 75491 73757 73484 73860 74082 74107 74202 74506 75170 76215 77195 77660 77956 78743 79748 79916 78949 77789
55438 77789 77359 77685 78456 79528 80607 81330 81991 83287 85058 86213 86270 85970 85941 85763 84953 83954 83418 83282
55420 83282 83251 83558 84611 86438 88900 91805 94476 96055 96712 97584 98957 99532 98296 96093 94323 93029
55404 93029 91452 89761 88856 88801 88757 88274 87566 86582 84869 82437 79874 77532 75389 73777 73400 74351 75741
55387 75741 76572 76616 76310 76205 76624 77480 78247 78334 77621 76535 75669 75412 75803 76516 77089 77351 77491 77640 77599 77101
55367 77101 76157 74999 73903 73144 72898 73111 73739 75029 77118 79390 80850 81257 81335 81691 82152 82428 82735
55350 82735 83314 83861 83903 83335 82249 80662 78814 77259 76264 75509 74737 74294 74654 75760 77165 78431 79193
55333 79193 79244 78821 78348 77783 76842 75969 76218 77758 79361 79919 79685 79419 79085 78209 76833 75299 73600 71798
55315 71798 70597 70665 71714 73005 74356 75893 77199 77627 77186 76318 75055 73245 71433 70677 71404 73082
55299 73082 74890 76135 76254 75198 73842 73325 73867 74699 75129 75155 75148 75460 76340 77746 79157 79924 79839 79160
55281 79160 78309 77750 77811 78238 78262 77507 76512 75941 75727 75479 75308 75523 75892 75978 75999 76630 78046 79797 81516
55262 81516 83081 84200 84481 84017 83415 83233 83733 84910 86336 87163 86879 85897 84968 84233 83398 82550 82137 82267
55244 82267 82672 83178 83625 83516 82460 80898 79724 79179 78760 78167 77713 77710 78026 78416 78841 79368 80093 81140
55226 81140 82429 83520 84030 84086 84069 84162 84484 85297 86483 87113 86224 83930 81257 79071 77690 77278 77899 79205
55208 79205 80633 81866 82709 82788 81983 80880 80188 79935 79845 80138 81127 82255 82509 81735 80721 79958 79246 78566
55190 78566 78453 79166 80189 80872 81091 81129 81364 82091 83177 83929 83842 83310 83038 82943 82468 81775 81675 82314 82946
55171 82946 83218 83690 84684 85542 85580 85096 84851 85065 85455 85891 86456 87085 87548 87720 87688 87670 87853 88173 88326 88213
55151 88213 88139 88255 88136 87450 86731 86714 87099 86844 85712 84604 84230 84299 84352 84646 85715 87523 89415 90584
55133 90584 90492 89311 88020 87613 88080 88648 88925 89140 89319 89090 88522 88305 88700 89033 88647 87785 87118 86921 87104
55114 87104 87576 88125 88310 87882 87112 86512 86399 86755 87158 86961 85977 84884 84417 84292 83712 82793 82565 83423 84575
55095 84575 85317 85927 86879 88061 89314 90913 92886 94503 95109 94937 94562 94099 93499 93097 93212 93591 93846
55078 93846 94060 94424 94597 94046 92820 91577 90940 91132 91973 92993 93715 94005 93928 93370 92315 91452 91741 93145
55060 93145 94577 95368 95992 96942 97753 97814 97392 97109 96937 96484 95839 95445 95405 95549 95885 96425 96849 96857 96592 96279
55040 96279 95762 94865 93808 92855 91920 91011 90546 90734 91074 91084 91070 91497 92015 91855 90923 89846 89170 89137 89947
55021 89947 91496 93086 94018 94386 94685 94899 94670 94171 94031 94417 94818 94781 94349 93816 93560 94027 95330 96859
55003 96859 97770 97866 97654 97661 98074 98839 99594 99687 98878 97870 97585 97953 98070 97513 96836 96692 97102 97802 98731 99818
54983 99818 100680 100906 100533 100034 99852 99985 100018 99618 99025 98877 99506 100659 101952 103192 104094 104218 103623 103083
54965 103083 103167 103483 103371 102982 102964 103371 103638 103572 103604 104010 104482 104609 104295 103660 102968 102706 103237 104236 104835 104412
54945 104412 103030 101196 99548 98662 98709 99253 99717 100009 100436 101157 102120 103314 104672 105833 106522 107089 108188
54928 108188 109974 112117 114461 117127 120044 123059 126511 131033 136515 141860 146099 149341 152292 155103
54914 155103 157014 157015 154782 151036 146970 143163 139183 134475 129385 124849 121247 118151 115275 113076 112130
54899 112130 112300 112809 112959 112629 112194 112084 112320 112499 112296 111848 111520 111510 111874 112687 113944 115544 117681 120850
54881 120850 125093 129610 133644 137412 141535 145873 149734 153051 156395 159763 162164 162636 161017 157655
54867 157655 153088 148264 144234 141166 138171 134476 130366 126663 123787 121666 120148 119037 118003 116788
54853 116788 115287 113352 110861 108184 106116 105109 104866 104897 105053 105253 105140 104424 103331 102371 101833 101650 101547
54836 101547 101158 100305 99287 98565 98076 97291 96135 95307 95387 96100 96878 97634 98472 99058 98940 98357 98093 98555
54818 98555 99449 100334 101049 101584 101946 102264 102728 103289 103630 103529 103124 102748 102652 102854 103137 103211 103011 102872 103262 104281
54798 104281 105456 106081 105818 105050 104592 104950 105809 106383 106303 105979 106025 106526 107068 107408 107869 108980 110784 112697
54780 112697 114164 115370 116988 119195 121280 122554 123295 124351 125983 127774 129642 132210 135849 139934
54766 139934 143659 147253 151762 157611 163871 169070 172354 173673 173183 170935 167188 162651 158105 153851
54752 153851 149759 145794 142159 138894 135705 132445 129467 127177 125484 124004 122647 121591 120788 119916 118877
54737 118877 117978 117558 117651 118018 118316 118328 118314 119003 120853 123413 125801 127839 130265 133789 138343 143386 148539
54720 148539 153702 158729 163165 166304 167595 167106 165402 162757 158860 153663 148135 143497 139883 136483
54706 136483 132935 129801 127613 126191 125127 124180 122973 121012 118423 115996 114153 112444 110511 108908
54692 108908 108377 108807 109473 109959 110281 110412 110245 109879 109521 109191 108850 108577 108350 107958 107424 107161 107363 107595 107383
54673 107383 106836 106264 105552 104480 103371 102865 103199 104165 105536 106977 107814 107546 106599 106035 106481 107683 109000
54656 109000 109843 109728 108461 106417 104316 102643 101520 101000 101120 101744 102717 104111 105961 107887 109385 110355
54640 110355 110938 110939 109989 108266 106513 105226 104346 103811 103893 104703 105779 106435 106338 105647 104878 104741 105662 107243
54622 107243 108419 108444 107532 106443 105672 105278 105210 105509 106157 106919 107395 107294 106745 106244 106110 106108 105895 105693 106063
54603 106063 106959 107572 107370 106893 107106 108228 109591 110476 110690 110391 109810 109231 108951 109097 109590 110300 111098 111732
54585 111732 111886 111495 110849 110268 109819 109473 109409 109911 110927 111926 112349 112095 111515 110993 110651 110408 110188 110033 110059
54566 110059 110354 110938 111774 112767 113654 114003 113588 112820 112557 113270 114535 115549 116028 116339 116888 117693 118507 119027
54548 119027 119008 118480 117883 117682 117841 118007 118200 118784 119709 120361 120464 120590 121269 122036 121921 120703 119110 117871
54530 117871 117091 116548 116038 115311 114140 112733 111757 111676 112243 112875 113357 113925 114674 115211 115034 114172 113228 112796
54512 112796 112997 113616 114433 115189 115456 114994 114207 113812 113903 113821 113185 112610 112931 113984 114743 114662 114340 114713 115914
54493 115914 117254 118097 118487 118868 119463 120163 120961 122125 123693 125077 125629 125575 125903 127186 128919 130196 130618
54476 130618 130260 129245 127809 126558 126107 126530 127436 128463 129368 129869 129853 129665 129792 130241 130579 130552 130363 130292
54458 130292 130328 130221 129734 128840 127853 127202 126900 126407 125311 123979 123193 123277 123971 125003 126258 127362 127667 126885
54440 126885 125464 124189 123537 123501 123743 123815 123428 122581 121498 120567 120413 121591 123796 125678 126064 125321 124900
54423 124900 125507 126350 126360 125565 124889 124988 125681 126298 126363 126056 126136 127183 128861 130187 130599 130363 129928 129396 128882
54404 128882 128812 129382 130034 130033 129490 129387 130555 132837 135220 136651 136804 136299 136064 136427 136923 137065 136952 136953 137081
54385 137081 137047 136715 136125 135190 133768 132049 130574 129808 129918 130944 132897 135657 138898 142163 144952 146881
54369 146881 148028 149061 150747 153249 156022 158409 160172 161484 162597 163597 164343 164565 164118 163150 161992
54354 161992 160937 160160 159635 158986 157588 155105 151885 148612 145672 143160 141304 140383 140122 139699 138610 137219
54338 137219 136176 135669 135525 135712 136196 136490 135903 134363 132648 131689 131829 132721 133700 134216 134279 134506 135445 136786
54320 136786 137540 137107 135864 134552 133484 132567 131735 130979 130203 129407 128927 129139 130012 131178 132287 133034 133057
54303 133057 132240 131091 130427 130605 131278 131839 131856 131203 130112 129092 128465 128043 127549 127208 127497 128413 129481 130439
54285 130439 131314 131824 131465 130435 129831 130466 131962 133358 134210 134680 135017 135480 136434 137986 139668 140848 141306
54268 141306 141128 140338 139074 137849 137180 137108 137457 138323 139819 141615 143257 144791 146498 148137 149091 149316
54252 149316 149514 150174 150891 150891 149938 148543 147495 147266 147661 147967 147571 146473 145149 144106 143729 144176 144979 145049
54234 145049 143713 141710 140555 140872 141874 142570 142848 143120 143456 143501 142964 141889 140624 139740 139734 140593 141825
54217 141825 143055 144271 145358 145792 145174 143819 142370 140937 139068 136641 134417 133421 133937 135289 136569
54202 136569 137380 137822 138048 138061 137818 137273 136360 135228 134421 134395 134833 134960 134677 134836 136016 137577 138449 138462 138261
54183 138261 138259 138392 138735 139591 140928 142349 143668 144947 145966 146295 146017 145797 146033 146397 146352 145637 144189 142128
54165 142128 140003 138525 137837 137499 137286 137414 137825 137927 137448 136943 136983 137239 136903 135733 134210 132903 132101
54148 132101 131914 132332 133131 133905 134196 133717 132731 132221 133176 135548 138239 140231 141304 141560 140915 139450 137789
54131 137789 136604 136003 135736 135670 135708 135564 135049 134398 134020 134140 134900 136482 138839 141635 144728 148310 152259
54114 152259 155809 158431 160687 163629 167588 172053 176487 180661 184321 187137 188929 189529 188560 185920 182439
54099 182439 179450 177550 176132 174210 171327 167628 163544 159647 156512 154451 153369 152855 152376 151455 149951
54084 149951 148143 146444 145148 144537 144984 146584 148831 150983 152666 153831 154295 153804 152639 151734 151925 153203
54068 153203 154828 156098 156912 157604 158318 158733 158545 158075 158026 158612 159325 159701 159894 160268 160828 161417 162099 162936
54050 162936 163660 164015 164239 164796 165851 167379 169576 172593 176020 179178 182001 185177 189347 194482 200073
54035 200073 205635 210984 216277 221818 227627 233242 238083 241904 244767 246867 248614 250549 252806 254924
54021 254924 256570 258075 259763 261132 261398 260644 259660 258719 257278 254944 252007 248815 245270 241222 236823
54006 236823 232237 227491 222877 219031 216257 214072 211663 208576 204894 201124 198084 196449 196088 196132 195819
53991 195819 194976 193625 191664 189272 187163 185983 185708 185951 186634 187958 189925 192282 194924 198070 202085
53976 202085 207321 214040 222235 231358 240227 247245 250998 251009 247968 242971 236531 228650 219847 211543 205079
53961 205079 200633 197429 194806 192740 191499 191167 191563 192389 193322 194080 194512 194745 195241 196546 198773 201438
53945 201438 203996 206436 209113 212162 215492 219257 223742 228738 233575 237977 242386 247151 251902 256111
53931 256111 259797 263218 266157 268082 268883 269087 269443 270590 272864 276012 279269 282167 285144 288949 293633
53916 293633 298704 304178 310719 318544 326828 334548 341457 347747 353123 356847 358622 359022 358956 358997 359201 359187
53900 359187 358328 356250 353382 350751 348964 347538 345453 342118 337514 331670 324587 316721 308968 301912
53886 301912 295411 289078 282774 276431 269876 263270 257357 252758 249213 245989 242750 239536 236180 232513
53872 232513 229063 226707 225419 224076 221733 218486 214809 210800 206576 202818 200175 198462 197074 195942
53858 195942 195391 195209 194573 193059 191169 189647 188653 187814 186767 185383 183736 182118 180971 180547 180625 180721 180634
53841 180634 180705 181457 182950 184539 185320 184820 183257 181280 179598 178787 179094 180232 181482 182197 182207 181724 180966
53824 180966 179971 178699 177257 176082 175849 177037 179478 182442 185168 187244 188633 189696 191149 193544 196574
53809 196574 199250 201011 202356 204136 206636 209790 213858 219240 225676 232273 238440 244261 249843 254847
53795 254847 258992 262601 266269 270173 274048 277643 280813 283278 284627 284648 283446 281279 278496 275559 272753
53780 272753 269828 266312 262288 258504 255407 252455 248811 244526 240455 237041 233805 230262 226774 224055
53766 224055 222133 220305 217980 215166 212179 209274 206586 204150 201928 199915 198162 196541 194743 192817
53752 192817 191408 190955 190768 189567 187006 184113 182052 181043 180805 181411 183083 185393 187301 188025 187604 186683
53736 186683 185959 185772 185983 186262 186615 187465 189089 191204 193325 195271 197074 198626 199816 200836 201886 202709
53720 202709 202896 202687 202961 204223 205999 207437 208212 208574 208788 208987 209558 211257 214655 219490 224733 229365
53704 229365 233083 236295 239510 242867 246176 249217 251899 254266 256480 258721 260967 263005 264768 266527
53690 266527 268573 270770 272629 273765 274090 273623 272470 270996 269654 268463 267012 265232 263887 263846 264941
53675 264941 266044 266305 265879 265263 264494 263416 262373 261947 262060 261970 261357 260845 261122 261963 262544 262455 261939 261286
53657 261286 260530 259739 259149 258853 258650 258379 258189 258373 259041 260043 261093 261975 262726 263615 264825 266207 267526
53640 267526 268808 270270 272003 273982 276295 279063 282147 285254 288291 291313 294169 296578 298589 300538
53626 300538 302452 303973 305093 306564 309196 312893 316640 319430 321069 322196 323619 325607 327859 330186
53612 330186 332948 336532 340636 344624 348505 352920 358039 363120 367517 371529 375792 380179 383862 386298
53598 386298 387749 388907 390305 392047 393883 395525 396831 397508 396870 394434 390878 387759 385961 384861 383363
53583 383363 381220 378902 376687 374510 372336 370026 367068 363136 358827 355229 352706 350651 348438 346124
53569 346124 344155 342793 342007 341597 341286 340809 339942 338487 336438 334345 333080 332900 333034 332662 331999 331887 332565
53552 332565 333474 334171 334764 335452 336272 337379 339012 340983 342661 343645 344098 344402 344938 346252 348825 352467
53536 352467 356413 360248 364281 368842 373738 378702 383897 389564 395596 401930 409075 417729 428034 439518
53522 439518 451593 463717 475360 486438 497723 510298 524407 539317 554490 570427 588012
53511 588012 607365 627874 649200 671596 695072 718879 742343 765821 790143 815225 839914
53500 839914 863349 885719 907367 927827 946440 963520 980226 997399 1015074 1032945 1050659
53489 1050659 1067698 1083648 1098777 1113876 1129434 1145380 1161684 1178615 1196260 1214276 1232366
53478 1232366 1250487 1268284 1284797 1299199 1311589 1322652 1332730 1341512 1348432 1353013 1354968 1354307
53466 1354307 1351344 1346293 1338920 1328854 1316288 1302166 1287574 1273038 1258395 1243252 1227508 1211448
53454 1211448 1195396 1179277 1162544 1144499 1124735 1103497 1081716 1060517 1040413 1021041 1001887
53443 1001887 983127 965461 949234 934194 920186 907623 896969 888099 880541 874183 869363 866251
53431 866251 864494 863601 863501 864506 866745 869868 873518 877949 883853 891515 900530 910580 922067 935505
53417 935505 950532 966184 982189 999427 1018815 1040147 1062344 1084611 1107070 1130434 1155385
53406 1155385 1182216 1210811 1240883 1272297 1305294 1340398 1378080 1418395 1460923 1505133 1550763
53395 1550763 1597720 1645723 1694446 1744094 1795344 1848440 1902748 1957502 2012420 2067046 2120143
53384 2120143 2170728 2219417 2267667 2315660 2361900 2405051 2445137 2482517 2516680 2546693 2572193
53373 2572193 2593261 2609863 2622084 2630406 2635049 2635266 2629866 2618184 2600086 2575483 2544571 2508311
53361 2508311 2467962 2424265 2377624 2328869 2279072 2228615 2177248 2125219 2073717 2023869 1975866
53350 1975866 1929374 1884383 1841195 1799842 1759928 1720973 1682625 1644570 1606534 1568501 1530833
53339 1530833 1494032 1458329 1423585 1389779 1357609 1328308 1302636 1280142 1259639 1240275 1221939
53328 1221939 1204831 1189016 1174433 1160923 1148058 1135223 1122065 1108757 1095653 1082855 1070261
53317 1070261 1057904 1046005 1034695 1023943 1013846 1004907 997836 993087 990607 989956 990531 991709 993089
53304 993089 994846 997818 1002947 1010539 1020078 1030817 1042499 1055550 1070671 1088234 1108016 1129459
53292 1129459 1152126 1175806 1200266 1225180 1250376 1275838 1301275 1325985 1349489 1372004 1393913
53281 1393913 1414995 1434558 1452085 1467194 1479187 1487408 1492123 1494351 1494640 1492563 1487569 1479730 1469390
53268 1469390 1456726 1442019 1425769 1408021 1388064 1365343 1340401 1314452 1288329 1262256 1236298
53257 1236298 1210443 1184414 1157915 1131018 1104016 1077122 1050677 1025304 1001353 978382 955729
53246 955729 933379 911660 890212 868024 844622 820646 797061 774299 752406 731520 711747
53235 711747 692856 674514 656814 640282 625363 612062 600148 589523 580181 571819 563756 555517
53223 555517 547323 539629 532148 523836 514043 503243 492292 481391 470203 458695 447252 436100
53211 436100 425170 414548 404582 395471 387121 379485 372685 366708 361304 356280 351606 347102 342322 336924
53197 336924 330992 324857 318749 312726 306764 300776 294594 288091 281377 274867 269048 264073 259596 255207
53183 255207 251048 247731 245531 243951 242295 240461 238834 237595 236500 235292 234003 232766 231584 230380
53169 230380 229171 228098 227240 226387 225146 223460 221914 221161 221076 220905 220300 219685 219425 219286 219097 219288 220098
53152 220098 220705 219962 217876 215702 214600 214733 215513 216116 215817 214468 212781 211683 211335 211245 211273 211913 213490
53135 213490 215642 217786 219613 220951 221616 221730 221834 222380 223282 224157 224853 225573 226548 227662 228440 228581 228566
53118 228566 229370 231278 233307 234264 234061 233437 232716 231630 230253 229205 228725 228283 227429 226391 225527 224726 223800
53101 223800 222992 222633 222628 222653 222717 223164 224199 225617 226914 227616 227594 227113 226474 225769 225095 224630 224118 222639 219647
53082 219647 216034 213379 212143 211387 210360 209408 209042 209001 208826 208691 209023 209771 210566 211261 211843 212147 212024 211505
53064 211505 210539 209011 207288 206202 206131 206574 206988 207458 208140 208663 208654 208356 208129 207898 207712 208222 209793 211611
53046 211611 212554 212634 212675 212900 212865 212593 212669 213128 213284 212904 212656 213043 213717 214207 214611 215101 215364 215089 214473 213760
53026 213760 212695 210995 209098 207881 207752 208459 209623 211033 212415 213336 213489 212880 211744 210466 209550 209372
53010 209372 209844 210481 210928 211343 212137 213399 214712 215552 215751 215512 215161 215004 215305 216142 217291 218450 219586
52993 219586 220826 222045 222855 223123 223223 223662 224641 226020 227371 227998 227445 226301 226097 227857 230943 233765
52977 233765 235484 236558 237751 239148 240260 240719 240705 240814 241541 242746 243762 244142 244169 244382 244816 244977 244412
52960 244412 243021 241045 239099 237976 237901 238064 237313 235318 232725 230372 228808 228343 228884 229716 230064 229956
52944 229956 229947 229998 229414 228059 226851 226612 227082 227553 227838 228013 227685 226363 224388 222779 222104 221990 221777 221245
52926 221245 220613 220168 219995 219929 219769 219621 219809 220253 220292 219538 218594 218333 218642 218618 218057 217894 218820 220128 220537
52907 220537 219758 218573 217685 217152 216877 216870 216867 216374 215474 215079 215909 217583 219228 220678 222357 224106 224956 224361
52889 224361 223032 222146 222171 222918 224275 226175 227970 228652 227914 226542 225480 224884 224373 223844 223642 224075 225170
52872 225170 226903 229269 232013 234510 236235 237307 238373 239867 241536 242782 243394 243666 243794 243409 241915
52857 241915 239200 235874 232823 230583 228964 227174 224480 220964 217512 214884 212989 211329 209821 208659
52843 208659 207558 205854 203559 201614 200748 200580 200333 199952 199931 200337 200750 201070 201652 202563 203336 203697 203943 204284
52825 204284 204360 203900 203340 203175 202993 201949 200145 198774 198709 199603 200763 202250 204480 207079 208943 209444 209048
52808 209048 208564 208293 208048 207594 206706 205155 203073 201202 200372 200670 201357 201653 201367 200787 200232 199870 199746 199739
52790 199739 199530 198877 197963 197326 197333 197822 198340 198648 198844 199092 199442 199909 200516 201142 201598 201969 202649 203807 204997
52771 204997 205582 205405 204753 203823 202666 201582 201040 201050 201098 200941 201080 202057 203560 204655 204814 204329 203727 203129
52753 203129 202379 201585 201298 202089 204038 206754 209815 213002 216049 218498 220189 221667 223620 225909 227650
52738 227650 228349 228453 228605 228921 229310 229969 231053 232210 232952 233263 233374 233177 232398 231203 230074 229153 228145
52721 228145 226896 225611 224507 223671 223245 223342 223702 223795 223355 222549 221678 221035 220960 221547 222253 222260 221365 220140 219150
52702 219150 218470 218054 218044 218423 218785 218849 218925 219511 220586 221595 222033 221843 221328 220841 220489 220025 219158 218018 217199
52683 217199 217223 218042 219066 219534 218923 217280 215234 213466 212139 211041 210209 209958 210275 210682 210917 211306 212152
52666 212152 213181 214001 214746 215730 216712 217098 216865 216717 217194 218116 219142 220478 222574 225242 227593 228981
52650 228981 229692 230417 231236 231558 231047 230104 229196 228104 226309 223853 221337 219180 217481 216536 216831 218345
52634 218345 220468 222820 225561 228575 231022 232307 233017 234185 235854 237053 237081 236146 234699 232799 230415
52619 230415 227867 225617 223850 222488 221480 220858 220656 220851 221317 221766 221895 221706 221528 221618 221872 222064 222305
52602 222305 223022 224428 226101 227292 227665 227606 227659 227810 227600 226888 226176 226032 226510 227331 228320 229383 230271 230777
52584 230777 231070 231517 232257 233245 234589 236401 238269 239341 239165 238215 237411 237316 237891 238726 239293 239170 238368 237389
52566 237389 236778 236666 236862 237269 237925 238631 238829 238069 236532 234881 233558 232375 230959 229464 228577 228759 229764
52549 229764 231029 232230 233105 233042 231498 228937 226791 226158 226909 228320 230073 232044 233479 233286 231367 229044
52533 229044 227760 227751 228250 228667 229105 229894 231001 231966 232243 231701 230890 230534 230603 230201 228798 227268 227161 229016
52515 229016 231938 234794 237223 239431 241702 244408 247879 251837 255415 258071 260033 261457 261754 260387
52501 260387 257884 255241 252641 249641 246417 243775 241779 239437 236186 232907 230822 229993 229588 229211 229203 229818
52485 229818 230825 231928 233000 233753 233737 232939 232025 231671 231827 231956 231913 232240 233540 235798 238453 240939 242979
52468 242979 244498 245605 246660 248056 249814 251691 253744 256438 259888 263333 265737 266750 266717 265967 264535
52453 264535 262501 260118 257596 255097 252894 251120 249460 247474 245256 243335 242002 241163 240757 240709 240493
52438 240493 239466 237792 236412 235859 235758 235724 235961 236519 236687 235839 234410 233343 232870 232509 232056 231926 232620
52421 232620 234316 236917 240010 242833 244781 245967 247033 248409 250032 251662 253280 255340 258783 264473
52407 264473 272322 281227 290122 298680 306643 312987 316441 316561 313782 308745 302262 295641 290080 285645
52393 285645 281516 277319 273611 271060 269764 269475 269810 270101 269670 268513 267264 266348 265673 265216 265267 265836 266539
52376 266539 267447 269476 273358 278608 284009 288872 293408 298018 302646 306747 309640 311043 311450 311816 312641
52361 312641 313589 314176 314510 315001 315626 315935 315766 315537 315800 316718 318034 319307 320139 320368 320224 320216 320779 321941
52343 321941 323347 324646 325896 327490 329724 332603 336093 340299 345182 350424 355911 362086 369358 377374
52329 377374 385503 393975 403816 415478 428165 440847 453438 466596 480818 496108 512148 528294
52317 528294 543741 558204 572296 586874 602222 618218 634954 652591 670728 688537 705613
52306 705613 722217 738648 754809 770482 785577 799925 813249 825616 837563 849444 860790
52295 860790 870603 878155 883260 885932 886124 883921 879740 874224 867961 861311 854431 847432 840538 834065
52281 834065 828228 823095 818883 816165 815408 816233 817567 818806 820551 823812 828781 834879 841757 849507 857830
52266 857830 865913 873540 881714 891553 903072 915579 928790 942778 957199 971509 985880 1000997
52254 1000997 1016843 1032443 1047018 1060673 1073643 1085546 1095793 1104193 1110780 1115409 1117907 1118236
52242 1118236 1116321 1112173 1106461 1100372 1094451 1088099 1080708 1072792 1065388 1058662 1051886 1044583 1037040 1029733
52228 1029733 1022897 1016682 1011220 1006398 1002001 998153 995243 993357 992112 991149 990452 990169 990438 991423 993232
52213 993232 995663 998324 1001114 1004400 1008628 1013866 1019684 1025324 1030102 1033984 1037784 1042527 1048521 1055238
52199 1055238 1062047 1068812 1075747 1083017 1090589 1098273 1105836 1113201 1120498 1127721 1134344 1139531 1142733 1143851
52185 1143851 1142894 1139878 1135159 1129465 1123329 1116697 1109260 1100979 1092093 1082858 1073530 1064520 1056281 1049060
52171 1049060 1042897 1037766 1033553 1030003 1026958 1024633 1023456 1023547 1024516 1025828 1027219 1028663 1030074 1031256 1032153
52156 1032153 1032951 1033800 1034483 1034498 1033504 1031669 1029613 1028000 1027185 1027148 1027704 1028692 1029873 1030796 1031007 1030475 1029596 1028665
52138 1028665 1027547 1026050 1024342 1022731 1021251 1019866 1018984 1019376 1021663 1026209 1033322 1042983 1054511 1067160
52124 1067160 1081159 1097443 1116129 1136036 1156049 1176209 1196938 1217948 1238725 1259521 1280887
52113 1280887 1302504 1323443 1343428 1362903 1381852 1399500 1415427 1430128 1444111 1457178 1469019
52102 1469019 1479869 1490037 1499181 1506584 1511820 1514699 1514823 1511797 1505810 1497569 1487564 1475691 1461736
52089 1461736 1446082 1429792 1413953 1398984 1384656 1370812 1357832 1346255 1336179 1327390 1319887 1313782
52077 1313782 1308781 1304372 1300714 1298774 1299355 1302372 1307364 1314207 1322878 1332867 1343382 1354009 1364823
52064 1364823 1375983 1387569 1399724 1412574 1425986 1439683 1453531 1467432 1480904 1493043 1502983
52053 1502983 1510333 1515187 1517854 1518562 1517276 1513825 1508186 1500473 1490580 1478152 1463212 1446601 1429436
52040 1429436 1412207 1394787 1377272 1360375 1344754 1330320 1316508 1303062 1290171 1277852 1265540
52029 1265540 1252496 1238481 1223830 1208981 1194234 1179953 1166647 1154592 1143541 1133049 1122971
52018 1122971 1113395 1104253 1095333 1086622 1078258 1070131 1061835 1053045 1043630 1033363 1021904 1009169 995411
52005 995411 980776 965153 948545 931187 913184 894503 875607 857624 841437 826915 813372
51994 813372 800425 787910 775298 761842 747263 731756 715410 698118 680144 662269 645189
51983 645189 628988 613259 597493 581417 565268 549740 535442 522428 510519 499906 491081 484255
51971 484255 479302 476219 475161 475984 478262 481857 486989 493513 500554 507093 512574 516743 519296 520036 519090
51956 519090 516646 512647 507038 500219 493090 486763 482243 480070 480092 481878 485596 492144 502232 515645
51942 515645 531776 550576 572537 597877 626070 655895 685377 711820 732544 745949 751773 750472
51930 750472 742786 729871 713198 693961 672799 650264 627185 604329 582009 560403 540041 521547
51918 521547 504980 489903 476116 463880 453334 444189 436337 430312 426615 424790 423849 423545 424570
51905 424570 427255 430785 434120 437074 439816 441793 442027 440311 437198 432829 426641 418510 409276 399742
51891 399742 389923 379874 370519 362882 356990 352391 349398 348921 351105 354977 359503 364354 369562 375171
51877 375171 381431 388691 396757 404714 411619 417060 420901 422952 423150 421764 419190 415843 412351 409425
51863 409425 407250 405331 403224 401203 399939 399790 400647 402237 404348 406840 409534 411950 413157 412245 409060
51848 409060 404204 398262 391471 384244 377479 371925 367564 363884 360444 357017 353695 351152 350251 350915 351900
51833 351900 352229 352433 353708 356249 359142 361567 363261 363970 363377 361712 359732 357854 355855 353503 350955
51818 350955 348523 346587 345719 346211 347403 348238 348630 349505 351205 352727 353013 352302 351575 351212 350902 350464 350104
51801 350104 350037 350424 351411 352766 353693 353537 352503 351197 349739 347926 346074 344947 344808 345122 345357 345565 346022
51784 346022 346707 347367 347771 347750 347285 346714 346600 347261 348602 350497 353060 356378 360209 364174 368215 372747
51768 372747 378312 384970 391993 398244 403038 406453 408611 408915 406537 401663 395689 389852 383994 377062
51754 377062 368678 359840 352026 345911 341077 336837 333054 330104 328237 327234 326715 326502 326500 326477 326339 326608
51738 326608 328309 332219 338265 345548 352698 358310 361517 362494 362304 362110 362542 363806 366008 369067 372422
51723 372422 375209 376904 377622 377764 377480 376639 375171 373226 371046 368891 367107 366008 365425 364653 363108 361036
51707 361036 359303 358565 358914 360189 362122 364031 364945 364418 362953 361388 360167 359497 359734 361059 362965 364579
51691 364579 365452 365545 364664 362518 359368 355933 352539 348901 344988 341573 339459 338547 338130 337910 338312 339830
51675 339830 342385 345366 348066 350097 351589 353110 355330 358692 363265 368810 374968 381411 387704 392948
51661 392948 395780 395184 391457 386173 381041 376853 373484 370726 369053 369641 373503 380342 388284 395041 399323
51646 399323 400937 399844 395914 389775 383143 377698 373851 370987 368553 366438 364485 362229 359224 355321
51632 355321 350626 345504 340569 336394 333156 330763 329292 328883 329147 329073 327831 325539 323012 320856 319031
51617 319031 317220 315283 313223 310971 308581 306564 305627 305858 306423 306356 305517 304543 304040 304205 305197 307337 310785
51600 310785 315323 320691 326941 334291 342832 352379 362308 371345 377867 380819 380359 377551 373558 369101
51586 369101 364367 359311 354239 350197 348418 349200 351704 355089 359451 365346 372785 381218 390232 399792
51572 399792 409918 420594 431786 443053 453285 461390 467353 472273 477454 484000 493176 506367 524317
51559 524317 546785 573118 602578 633744 664172 691353 714071 732457 746810 756778 761715 761515
51547 761515 756782 748237 736093 720183 700741 678950 656511 634680 613879 594139 575535 558067
51535 558067 541433 525271 509496 494208 479447 465296 452125 440325 429806 419999 410499 401446
51523 401446 393138 385540 378486 372183 367069 363084 359503 355737 351965 348618 345546 342270 338926 336231
51509 336231 334336 332459 330131 328102 327285 327278 326919 326177 326364 328241 330860 332853 334053 335085 335903 335759
51493 335759 334530 333185 332732 333270 334266 335235 335887 336029 335742 335437 335435 335564 335346 334435 332810 330751 328769 327230
51475 327230 325784 323485 319832 315484 311481 307988 304369 300418 296806 294112 292091 290311 288962 288417
51461 288417 288353 287977 287037 286081 285743 286244 287527 289349 291148 292387 293268 294736 297639 302193 308350 316190
51445 316190 325678 336445 348083 360333 372711 384278 394151 402044 408061 412261 414655 415338 414284
51432 414284 411277 406344 399937 392317 383212 372590 361488 351410 343102 336410 331131 327194 324091
51419 324091 320964 317513 314230 311524 309241 307305 306199 306366 307531 309092 310842 312866 314981 316744
51405 316744 317931 318726 319531 320831 323088 326407 330317 334068 337173 339612 341706 344016 347190 351644 357303
51390 357303 363712 370345 376919 383682 391543 401665 414745 430830 449891 472293 498485 528528
51378 528528 562179 599211 639232 681214 723405 763595 799378 828555 849914 863624 870488 870730
51366 870730 863834 849586 828810 802814 772513 738527 701966 664572 627812 592093 557221 523546
51354 523546 492304 464703 440987 420662 403396 389230 377908 368548 360264 352867 346673 341845
51342 341845 338192 335398 333172 331212 329336 327618 326205 325019 323800 322341 320554 318385 315903 313343
51328 313343 310807 308041 304830 301543 298871 296998 295431 293790 292412 291898 292340 293288 294312 295322 296436
51313 296436 297845 299764 302198 304679 306478 307236 307250 307039 306808 306488 306156 306136 306605 307284 307644 307346 306430 305175
51295 305175 303879 302683 301485 300056 298371 296822 295941 295898 296401 297168 298365 300468 303784 308184 313238
51280 313238 318478 323538 328165 332173 335373 337559 338612 338658 338106 337410 336728 335866 334798 334191 335088 337796
51264 337796 341203 343566 343951 342708 340631 338121 335268 332324 329688 327527 325679 323889 322063 320368
51250 320368 319149 318560 318195 317316 315651 313774 312461 311862 311580 311402 311561 312296 313414 314357 314528 313652 312078
51233 312078 310703 310255 310570 310842 310561 309902 309095 307856 305840 303439 301676 301224 301787 302551 303065 303571 304518
51216 304518 305982 307582 308919 309942 310907 312064 313560 315548 318217 321580 325329 329044 332538 335901
51202 335901 339209 342294 344912 347040 348850 350347 351194 350978 349577 347210 344235 341023 337976 335442 333614
51187 333614 332532 332146 332249 332514 332817 333436 334641 336140 337318 338073 338940 340198 341251 341248 340020 338043 335738
51170 335738 333262 330848 328820 327192 325637 324022 322694 322190 322827 324597 327134 329685 331434 332092 332060
51155 332060 331891 331708 331269 330494 329712 329345 329427 329490 329045 328145 327343 327012 327006 327164 327767 329054 330449 330915 330180
51136 330180 329068 328389 328026 327461 326710 326166 325798 325180 324374 324234 325567 328231 331261 333663 335019 335546 335883
51119 335883 336750 338552 341158 344076 346901 349510 351832 353528 354163 353787 353120 352896 353074 353075 352799 352994 354310
51102 354310 356327 357988 358875 359592 360835 362552 364229 365560 366504 366933 366686 365938 365111 364349 363403 362122
51086 362122 360769 359662 358801 358099 357738 357942 358532 359135 359832 361118 363120 365295 367145 368839 370770 372913
51070 372913 375136 377878 381830 386915 392268 397490 403451 411552 422528 436276 452380 470264 488931
51057 488931 507054 523471 537468 548827 557972 565952 573776 581634 589015 595571 601420 606497 610095
51044 610095 611415 610290 606951 601282 592869 581921 569784 558300 548735 541361 535733 530991 525887
51031 525887 519004 509465 497679 485266 474054 464948 457750 451948 447527 444950 444528 446032 448945 452970
51017 452970 458259 465188 473907 483956 494283 503771 512018 519647 527683 536478 545223 552606 557914 561450
51003 561450 563905 565563 566250 565857 564622 562874 560783 558472 556130 553866 551678 549854 549214 550537 553745
50988 553745 558092 563239 569768 578388 589022 601094 614412 629163 644931 660260 673604 684632
50976 684632 694466 704764 716723 730858 747425 766902 790006 817266 848658 883722 922021 963443
50964 963443 1008119 1056210 1107750 1162506 1219838 1278730 1337988 1396447 1453055 1506914 1557305
50953 1557305 1603647 1645487 1682656 1715406 1744303 1769953 1792896 1813679 1832915 1851339 1869920
50942 1869920 1889633 1910684 1931986 1951841 1969238 1984152 1996543 2005653 2010605 2011202 2007621 1999579
50930 1999579 1986290 1967129 1941803 1909989 1871320 1825861 1774268 1717429 1656257 1591887 1525755
50919 1525755 1459369 1394139 1331334 1271830 1215849 1163299 1114473 1070014 1030076 993954 960861
50908 960861 930745 903971 880390 859167 839504 821205 804426 789194 775334 762760 751612
50897 751612 742019 733778 726407 719594 713510 708526 704663 701504 698717 696460 695163 695023 695848 697349 699428
50882 699428 702189 705736 710011 714860 720253 726318 733053 740145 747374 755210 764670 776351 789770 803834
50868 803834 817881 832105 847169 863683 882054 902498 924994 949368 975633 1004359 1036564
50857 1036564 1073166 1114598 1161092 1213242 1271935 1337620 1410027 1488983 1575277 1670202 1774213
50846 1774213 1886427 2005432 2130028 2258996 2390755 2523612 2655925 2785480 2909002
50837 2909002 3022870 3124329 3211791 3284411 3342144 3386172 3418435 3440560 3453823 3460448 3464273
50826 3464273 3469496 3479052 3494560 3517299 3548290 3587261 3632044 3679149 3724551 3763940 3792941 3807745
50814 3807745 3805541 3784307 3742540 3679552 3595773 3492444 3371176 3234243 3085115 2928052
50804 2928052 2766993 2605171 2445769 2292281 2147700 2013709 1891108 1780696 1683105 1597884
50794 1597884 1523515 1458676 1403110 1357015 1319925 1290530 1267352 1249208 1235106 1224135 1215575
50783 1215575 1208936 1203709 1199192 1194615 1189429 1183403 1176546 1169018 1161054 1152754 1143805 1133554 1121572
50770 1121572 1108117 1093796 1078791 1062758 1045654 1028209 1011183 994473 977534 960521 944398
50759 944398 929834 916552 904021 892295 881926 873519 867672 864948 865466 868825 874767 883578 895414
50746 895414 909649 925554 943443 964446 989218 1017472 1048792 1083164 1120572 1160809 1204069
50735 1204069 1251144 1302461 1357259 1414269 1472986 1533776 1596854 1661640 1727147 1792543 1857183
50724 1857183 1920469 1981840 2040699 2096038 2146159 2188841 2221898 2243771 2253966 2253219 2243354 2226939
50712 2226939 2206931 2186294 2167575 2152671 2143048 2140078 2144924 2157952 2178340 2204391 2234068 2265110
50700 2265110 2294787 2319910 2337249 2343832 2336949 2314380 2275177 2220316 2152331 2074160 1988499 1898107
50688 1898107 1806190 1715939 1629720 1548969 1474752 1408026 1349311 1298512 1255430 1220248 1193261
50677 1193261 1174271 1162552 1157406 1158454 1165326 1177333 1193602 1213314 1235584 1259250 1283041 1305967
50665 1305967 1327370 1346647 1363234 1377046 1388774 1399528 1410152 1420942 1431978 1443577 1456333
50654 1456333 1470618 1486068 1501672 1516730 1531802 1548536 1568382 1591582 1617555 1646007 1677309
50643 1677309 1711936 1749955 1791156 1835248 1881716 1929652 1977933 2025406 2070899 2113374 2152328
50632 2152328 2187912 2220568 2250750 2279152 2306835 2334589 2361979 2386862 2405601 2413789 2407592 2385556
50620 2385556 2349685 2304748 2256346 2209304 2167041 2131487 2103290 2082399 2068660 2061784 2060879 2064422
50608 2064422 2070794 2078566 2086201 2091795 2093164 2088016 2074172 2050215 2016183 1973294 1922866 1865860
50596 1865860 1803535 1737845 1670677 1603027 1535423 1468827 1404530 1343377 1285728 1232115 1183268
50585 1183268 1139370 1099874 1064287 1032696 1005262 981626 961190 943720 929298 917943 909671
50574 909671 904798 903652 905892 910406 916103 922729 930827 941000 953308 967276 982371 998400 1015557
50561 1015557 1034210 1054756 1077512 1102463 1129001 1156189 1183479 1211080 1239370 1268084 1296389
50550 1296389 1323787 1350591 1377311 1403856 1429643 1454488 1479071 1504523 1531717 1561058 1592770
50539 1592770 1627224 1665113 1707493 1755506 1809802 1870183 1936089 2007505 2085242 2170277 2263086
50528 2263086 2363735 2472206 2588183 2710553 2837522 2967166 3097467 3225748 3348557
50519 3348557 3462500 3565048 3654378 3728673 3785854 3823875 3841098 3836622 3810622 3764358 3699712
50508 3699712 3618830 3524372 3419762 3308730 3194634 3080629 2970440 2868382 2778412 2703363
50498 2703363 2645136 2605051 2583651 2580416 2594080 2623088 2665450 2718145 2776845 2836160 2890146
50487 2890146 2932890 2959158 2964874 2947362 2905609 2840667 2755645 2654961 2543279 2424842 2303309
50476 2303309 2181827 2063075 1949186 1841429 1740044 1644739 1555605 1473422 1398976 1332362
50466 1332362 1273039 1220278 1173369 1131839 1095823 1065855 1041871 1022716 1007172 995183 987450
50455 987450 983991 983895 986523 992100 1000792 1011903 1024540 1038630 1054718 1072994 1093142 1115056 1139054
50442 1139054 1165053 1191751 1216933 1238574 1255582 1267549 1274253 1275800 1273205 1268309 1262785 1257397
50430 1257397 1252418 1248396 1246062 1245642 1246740 1248939 1252250 1257112 1264334 1274861 1289130 1306764 1327442
50417 1327442 1351964 1381815 1417671 1459041 1505457 1557156 1614275 1676065 1741426 1809591 1879663
50406 1879663 1949942 2018319 2083155 2143335 2197816 2245587 2285836 2317640 2339631 2350326 2348689
50395 2348689 2334219 2306883 2267315 2216773 2156626 2088299 2014024 1937013 1860300 1785856 1715304
50384 1715304 1650839 1594566 1547370 1509340 1480961 1462877 1454714 1455233 1463616 1479476 1501458 1526889
50372 1526889 1553046 1577746 1598350 1611429 1614316 1606388 1588288 1560679 1524573 1482196 1436394 1389305
50360 1389305 1342328 1297140 1255768 1219435 1187801 1159418 1132463 1105044 1075478 1042844 1007295
50349 1007295 969904 932339 896541 864211 836240 812635 793029 777124 764647 755044 747520 741475
50337 741475 736866 734037 733179 734087 736500 740406 745753 751995 758313 764330 770267 776368 782479 788359 794197
50322 794197 800630 808371 817820 828746 840204 850991 860336 868092 874313 879019 882441 885183 887879
50309 887879 890895 894438 898715 903789 909476 915499 921548 927212 932317 937577 944557 954638 968153 984673
50295 984673 1003815 1025525 1049953 1077468 1108409 1142072 1175710 1204809 1224598 1231700 1225156 1206738
50283 1206738 1180393 1150745 1121470 1094662 1071330 1052073 1037253 1026765 1019935 1015805 1013652 1013242
50271 1013242 1014497 1017137 1020927 1026156 1033283 1041974 1051116 1060184 1070052 1081839 1095355 1109337 1123027
50258 1123027 1136708 1150631 1164162 1176387 1187170 1197267 1207609 1218624 1229968 1240626 1249332
50247 1249332 1255020 1256965 1254746 1248470 1238972 1227424 1214603 1200866 1186961 1174452 1165025 1159443 1157261
50234 1157261 1157110 1156953 1154394 1147484 1135537 1119033 1098749 1075276 1049417 1022586 996359 971611
50222 971611 948310 926134 905028 885122 866393 848651 831799 815965 801355 788064 776001
50211 776001 764956 754804 745623 737444 729897 722358 714647 707313 701040 695986 691893 688556 685749 683056
50197 683056 680286 677907 676414 675335 673569 670800 667907 665780 664332 662936 661168 658755 655397 651191
50183 651191 646793 642702 638752 634710 630875 627551 624430 621177 618232 616260 615047 613747 612111 610752
50169 610752 610148 610092 610207 610344 610356 610024 609481 609250 609764 611248 614139 619073 626215 634980 644677 655193 666997
50152 666997 680801 697237 716467 737976 761115 785958 813245 843370 875754 909299 943055
50141 943055 976357 1008856 1040783 1072856 1105592 1138883 1172366 1205798 1238755 1270088 1297884
50130 1297884 1319806 1333552 1337580 1331804 1317403 1295713 1267557 1233865 1196463 1157672 1119199 1081841
50118 1081841 1046224 1013379 984431 959938 939612 922545 907651 894041 881165 868704 856384
50107 856384 843963 831319 818567 806072 794306 783570 773846 764911 756580 748806 741675 735335 729814
50094 729814 724884 720389 716764 714862 714932 716190 717824 720081 723768 728967 735047 741828 749875 759404 769687
50079 769687 779924 790121 800721 811821 823202 834694 846110 857056 867106 875910 883007 887931
50067 887931 890747 892076 892359 891519 889563 886960 884035 880537 876244 871543 866876 862028 856499 850259 843698
50052 843698 837306 831881 828477 827323 827244 827047 827255 829573 834803 842233 851003 860994 872149 883972 896249
50037 896249 909555 924508 940968 958326 976149 994228 1012491 1031252 1051142 1072374 1094359
50026 1094359 1116318 1137900 1158884 1178721 1196791 1212776 1226418 1237265 1245161 1250766 1255130 1258858
50014 1258858 1261980 1264308 1265386 1264161 1259196 1249206 1233175 1210353 1180836 1146191 1108944 1071267
50002 1071267 1034430 999417 967354 939063 914633 893744 876074 861127 848016 835922 824671
49991 824671 814577 805755 797701 789406 779744 768071 754763 740987 727586 714350 700693 686807
49979 686807 673547 661288 649688 638750 629372 622266 616810 611683 606409 601595 597667 594115 590232
49966 590232 586036 582055 578506 575138 571781 568718 566515 565678 566469 568879 572744 577958 584525 592295 600709
49951 600709 608924 616230 622323 627235 631153 634320 636998 639352 641310 642522 642549 641106 638078 633272 626410
49936 626410 617532 607277 596495 585648 574811 564224 554460 545983 538795 532614 527177 522298 517995
49923 517995 514735 513213 513498 514611 515284 515141 514918 515610 517572 520384 523318 525947 528431 531300 534962
49908 534962 539554 545251 552322 560715 569857 579177 588593 598123 607282 615321 622039 627904 633358 638323
49894 638323 642331 644695 644517 641076 634556 626124 616986 607498 597333 586335 574956 564011 554200
49881 554200 545772 538388 531304 523871 516034 508442 502064 497542 494759 492997 491638 490688 490530 491332 492972
49866 492972 495424 498867 503319 508571 514648 522043 531197 541933 553615 565727 578016 590173 601617
49853 601617 611603 619383 624428 626787 627256 626943 626485 625749 624173 621203 616435 609735 601497 592650 584110
49838 584110 576207 568763 561628 554938 548883 543579 539296 536484 535222 534774 534079 532792 531615 531556 533098
49823 533098 536215 540834 546979 554571 563421 573308 583781 593937 602745 609747 615226 619674 623295 626129
49809 626129 628331 630036 631061 631005 629615 626940 623230 618844 614191 609456 604346 598349 591366 583914 576592
49794 576592 569531 562564 555711 549177 542963 536926 531370 527145 524815 523929 523509 523121 523053 523534 524312 525200
49778 525200 526499 528485 530748 532634 534333 537031 541729 548099 554783 560688 565768 570519 575064 578998
49764 578998 582041 584432 586502 588130 588889 588549 587122 584494 580418 574901 568198 560385 551395 541686 532438
49749 532438 524709 518626 513652 509420 506010 503632 502360 501999 501951 501477 500478 499769 500126 501301 502485 503698
49733 503698 505983 510059 515339 520559 524974 528741 532497 537036 543101 550980 560212 569878 579259 588132
49719 588132 596588 604742 612588 619935 626342 631198 633920 634122 631687 626797 620005 612224 604493 597532
49705 597532 591482 586135 581375 577363 574370 572603 572076 572366 572559 571860 570388 569012 568295 568119 568487 570072
49689 570072 573381 577871 582594 587487 593266 600142 607389 614381 621466 629621 639718 652354 667923
49676 667923 686369 706784 727214 744909 757291 763340 764105 761523 756888 750896 744733 740078 737830
49663 737830 737651 739057 742111 746491 750479 751622 748280 740284 728536 714376 699067 683409 667898
49650 667898 653307 640636 630297 621820 614736 609296 605923 604447 604457 606014 609339 613952 618664 622379
49636 622379 624504 624763 623078 619661 614897 609247 603363 597932 592995 587828 582026 576416 572222 569520
49622 569520 567180 564286 560972 557830 555207 553335 552545 552934 554042 555170 555919 556360 556887 557915 559553
49607 559553 561521 563508 565487 567508 569347 570724 571761 572896 574372 576105 577974 579891 581657 583116
49593 583116 584454 585997 587722 589322 590728 592221 593974 595756 597118 597655 597231 596182 595124 594261 593204
49578 593204 591868 591180 592152 594459 596775 598518 600393 603086 606352 609803 613811 619011 625436 632712 640756
49563 640756 649678 659260 668951 678204 686501 693253 698034 700785 701620 700702 698464 695575 692388 688776 684812
49548 684812 681173 678480 676608 675105 674006 673730 674336 675397 676510 677530 678338 678742 678658 678251 678051 679009
49532 679009 682039 687244 694001 702214 713000 727529 745516 765548 786651 808698 831227 852605
49520 852605 870668 883799 891368 893787 892434 889162 885608 883051 882658 885176 890154 896002 901092 904553
49506 904553 905925 904622 900049 891895 880073 864810 847117 828801 811530 796011 782283 770438
49494 770438 760637 752674 746004 740184 735060 730634 727078 724746 723830 724010 724653 725307 725828 726189 726424 726728
49478 726728 727347 728308 729377 730222 730536 730271 729954 730520 732423 735037 737273 738727 739877 741245 742843 744515
49462 744515 746363 748595 751163 753696 755643 756438 755828 754215 752466 751229 750503 749820 748642 746571 743565
49447 743565 740120 737000 734597 732678 730835 728970 727291 726159 726048 727320 729802 732831 735912 739105
49433 739105 742680 746878 752321 760113 770788 783410 796326 808753 821033 833409 845252 855627
49421 855627 863841 869119 870421 867324 860855 852955 845188 838241 832442 828222 825978 825837 827696 831413
49407 831413 836964 844530 854384 866540 880519 895557 911031 926636 942302 958081 974039 990070
49395 990070 1005844 1021015 1035427 1048992 1061442 1072275 1080947 1087035 1090331 1090915 1089043 1084953 1078829
49382 1078829 1070930 1061581 1050998 1039420 1027545 1016527 1007291 999987 994258 989760 986283 983776 982661
49369 982661 983788 987550 993227 999677 1006476 1013718 1020898 1026849 1030985 1033766 1035522 1035527 1032877 1027842 1021624
49354 1021624 1014989 1007832 1000040 992141 984829 978321 972472 967262 962850 959198 955825 952013 947272 941655
49340 941655 935658 929791 924332 919558 916058 914504 915041 917129 920184 924292 930175 938540 949618 963108
49326 963108 978047 992504 1003828 1009834 1009981 1005283 997291 987470 977251 967711 958749 949224 938486
49313 938486 927411 917318 908328 899552 890674 882316 874877 868110 862208 858306 857179 858103 859722 861567
49299 861567 864013 867183 870701 874304 877845 880773 882317 882277 881036 878777 875286 870558 864900 858283 850284
49284 850284 841014 831548 823012 815698 809496 804793 802331 802283 803975 806555 809713 813751 819145 825961 833489
49269 833489 840541 846333 850972 854894 857987 859687 859907 859442 859253 859719 860934 863524 868632 876883 887777
49254 887777 900368 914212 929039 943481 954836 960583 959962 953834 943457 929912 914389 898182
49242 898182 882171 866809 852666 840454 830336 821814 814640 809380 806724 806610 808441 811814 816568
49229 816568 822439 829198 836883 845431 854338 863236 872611 883252 895011 906762 917624 927574 936782
49216 936782 945049 952228 958571 964244 969018 972876 976511 980709 985672 991541 999249 1010023 1024003 1039952
49202 1039952 1056475 1073018 1089600 1106134 1122370 1138177 1153521 1168349 1182723 1196869 1210779
49191 1210779 1223898 1235495 1245431 1254351 1263118 1272150 1281315 1290372 1299443 1309098 1320033 1332761 1347641
49178 1347641 1365175 1386088 1411148 1440987 1476056 1516387 1561149 1608392 1655259 1698400 1734379
49167 1734379 1760362 1775166 1779913 1777501 1771265 1763887 1757059 1751481 1746942 1742722 1738268 1733577 1728949
49154 1728949 1724620 1720804 1717973 1716834 1717925 1721274 1726380 1732515 1739165 1746385 1754754 1764946 1777250
49141 1777250 1791407 1806735 1822347 1837544 1852248 1867030 1882543 1898972 1916216 1934417 1953887
49130 1953887 1974472 1995372 2015871 2036028 2056450 2077537 2099247 2121457 2144234 2167741 2192137
49119 2192137 2217591 2244295 2272591 2303345 2338168 2378909 2426881 2483018 2549078 2628329 2724288
49108 2724288 2838000 2965956 3100477 3232958 3358456 3478375 3598186 3720518 3838640
49099 3838640 3936416 3996037 4008116 3976444 3914135 3834700 3745072 3645092 3532252 3406772 3273163
49088 3273163 3138408 3009368 2891308 2787479 2699058 2625317 2564282 2513684 2471698 2437089
49078 2437089 2408855 2385800 2366491 2349643 2334519 2320915 2308886 2298517 2289793 2282447 2275958 2269857
49066 2269857 2264042 2258763 2254376 2251183 2249235 2247995 2246353 2243428 2239399 2235234 2231629 2228634 2226357 2225410
49052 2225410 2226299 2228765 2232195 2236380 2241399 2246862 2251762 2255106 2256345 2255192 2251446 2245274 2237469 2229259
49038 2229259 2221824 2215959 2212047 2210249 2210686 2213426 2218155 2223996 2229870 2235160 2239948 2244603 2249180 2253198
49024 2253198 2255927 2256889 2256148 2254193 2251663 2249252 2247685 2247421 2248267 2249666 2251536 2254513 2259055 2264588 2269997
49009 2269997 2274886 2279919 2285955 2293184 2301180 2309393 2317405 2324964 2332001 2338571 2344729 2350457 2355613 2359830
48995 2359830 2362669 2364144 2364913 2365589 2365906 2364970 2362371 2358679 2354760 2351047 2347558 2344222 2340879 2337258 2333247
48980 2333247 2329037 2324805 2320457 2315869 2311168 2306572 2302042 2297278 2291953 2285850 2278975 2271714 2264744 2258694
48966 2258694 2253999 2251080 2250308 2251627 2254486 2258412 2263453 2269860 2277580 2286319 2295962 2306602 2318238 2330716
48952 2330716 2343882 2357605 2371730 2386225 2401296 2417138 2433608 2450288 2466753 2482724 2498283
48941 2498283 2514239 2532061 2552986 2577220 2604259 2633908 2666559 2702520 2741494 2782930 2826558
48930 2826558 2872384 2920358 2970282 3022063 3075924 3132285 3191345 3252753 3315793 3379956 3445118
48919 3445118 3511107 3577298 3642854 3707146 3769673 3829853 3887330 3942389 3995660 4047370 4097152
48908 4097152 4144540 4189309 4231453 4271257 4309420 4346611 4382736 4416967 4448608 4477562 4503900
48897 4503900 4527428 4547919 4565409 4580048 4592019 4601811 4610145 4617288 4622766 4626100 4627456 4627171 4624947
48884 4624947 4620118 4612427 4601999 4588660 4571935 4551756 4528554 4502457 4472905 4439286 4401549 4359962
48872 4359962 4314700 4265989 4214375 4160489 4104784 4047777 3990288 3933021 3876063 3819187 3762601
48861 3762601 3706998 3652929 3600478 3549623 3500559 3453520 3408537 3365508 3324356 3285153 3248327
48850 3248327 3214777 3185373 3160154 3138331 3119276 3103216 3090633 3081288 3074346 3069366 3066666 3066588 3068837
48837 3068837 3072830 3078518 3086591 3097843 3112314 3128961 3146165 3162809 3179006 3195794 3214037 3233601
48825 3233601 3253442 3272406 3290051 3306981 3324391 3343017 3362439 3381538 3399592 3416727 3433337
48814 3433337 3449510 3465237 3480876 3496989 3513796 3531031 3548347 3565725 3583544 3602357 3622589
48803 3622589 3644348 3667539 3692119 3718033 3744806 3771462 3797091 3821401 3844500 3866241 3886093
48792 3886093 3903661 3919129 3933075 3945919 3957663 3968128 3977377 3985787 3993599 4000427 4005326 4007319
48780 4007319 4005756 4000301 3990920 3977962 3961933 3942991 3920880 3895466 3867019 3835793 3801629 3764286
48768 3764286 3723967 3681202 3636449 3590140 3542866 3495129 3447042 3398743 3351009 3304933 3260910
48757 3260910 3218360 3176643 3135876 3096739 3059714 3024759 2991532 2959809 2929711 2901590 2875572
48746 2875572 2851367 2828712 2807948 2789826 2774756 2762592 2753231 2747051 2744518 2745483 2749034 2753947 2759251
48733 2759251 2764483 2769499 2774092 2777949 2781125 2784310 2788184 2792657 2797151 2801593 2806608 2812584 2819062 2825280
48719 2825280 2830922 2836052 2840705 2844888 2848736 2852312 2855467 2858181 2860788 2863527 2866092 2868009 2869303 2870439
48705 2870439 2871690 2872944 2874054 2875001 2875700 2876045 2876160 2876308 2876550 2876885 2877779 2880090 2884108 2888911 2893023 2895644
48689 2895644 2897141 2898458 2900282 2902602 2904857 2906548 2907959 2910246 2914522 2920743 2927672 2934067 2939773 2945576
$$ [...]
##END NTUPLES=NMR SPECTRUM
##END=
