##TITLE=AC1451_MAGAH13260_8011492_QYp4jsbOs2
##JCAMPDX= 6.0         $$ Bruker NMR JCAMP-DX V2.0
##DATA TYPE= NMR SPECTRUM
##DATA CLASS= NTUPLES
##ORIGIN= BRUKER
##OWNER= Administrator
$$ 1.72 TOPSPIN		Version 2.1
$$ 2013-07-05 22:08:07.764 -0700  Administrator@X
$$ Compression mode = diff/dup
##.OBSERVE FREQUENCY= 400.02188249412
##.OBSERVE NUCLEUS= ^1H
##.ACQUISITION MODE= SIMULTANEOUS (DQD)
##.ACQUISITION SCHEME= undefined
##.AVERAGES= 8
##.DIGITISER RES= 22
##SPECTROMETER/DATA SYSTEM= spect
##.PULSE SEQUENCE= zg30
##.SOLVENT NAME= COFFEE_meoh
##.SHIFT REFERENCE= INTERNAL, COFFEE_meoh, 1, 14.98509
##AUDIT TRAIL= $$ (NUMBER, WHEN, WHO, WHERE, PROCESS, VERSION, WHAT)
$$ ##TITLE= Audit trail, TOPSPIN		Version 2.1
$$ ##JCAMPDX= 5.01
$$ ##ORIGIN= Bruker BioSpin GmbH
$$ ##OWNER= Administrator
$$ $$ E:\/data/COFFEE/nmr/AC1451_MAGAH13260_8011492_QYp4jsbOs2/10/pdata/1/auditp.txt
$$ ##AUDIT TRAIL=  $$ (NUMBER, WHEN, WHO, WHERE, PROCESS, VERSION, WHAT)
(   1,<2013-07-05 22:08:00.576 -0700>,<Administrator>,<X>,<go>,<TOPSPIN 2.1>,
      <created by zg
	started at 2013-07-05 22:06:54.123 -0700,
	POWCHK enabled, PULCHK disabled,
       configuration hash MD5:
       C8 4E 4E 5D D3 5C D8 9E 9F 52 82 E0 59 8A DE 15
       data hash MD5: 64K
       6B 77 F7 29 96 24 84 B6 47 72 89 C9 CF 8D 5B 8A>)
(   2,<2013-07-05 22:08:03.670 -0700>,<Administrator>,<X>,<proc1d>,<TOPSPIN 2.1>,
      <Start of raw data processing
       efp LB = 0 FT_mod = 6 PKNL = 1 PHC0 = 0 PHC1 = 0 SI = 32K 
       data hash MD5: 32K
       C3 F3 8C D4 DD 46 47 33 15 E6 95 AC AA 10 BB 42>)
(   3,<2013-07-05 22:08:03.998 -0700>,<Administrator>,<X>,<proc1d>,<TOPSPIN 2.1>,
      <pk PHC0 = 92.85645 PHC1 = 0 
       data hash MD5: 32K
       CA AD F7 62 66 9B 27 77 84 89 8A 63 E2 0E 6F E7>)
(   4,<2013-07-05 22:08:04.217 -0700>,<Administrator>,<X>,<proc1d>,<TOPSPIN 2.1>,
      <abs ABSG = 1 
       data hash MD5: 32K
       C1 95 6E 9B 2F 57 91 22 EA 0D 6C 72 7B DD 97 2B>)
(   5,<2013-07-05 22:08:04.326 -0700>,<Administrator>,<X>,<proc1d>,<TOPSPIN 2.1>,
      <abs ABSG = 2 
       data hash MD5: 32K
       35 4D 01 10 18 35 DF 7E 39 B3 0F 16 56 A3 3A 24>)
(   6,<2013-07-05 22:08:04.404 -0700>,<Administrator>,<X>,<proc1d>,<TOPSPIN 2.1>,
      <abs ABSG = 3 
       data hash MD5: 32K
       42 37 23 E1 A5 1C E0 43 F5 6B 57 E0 E0 7B 1A B2>)
(   7,<2013-07-05 22:08:04.482 -0700>,<Administrator>,<X>,<proc1d>,<TOPSPIN 2.1>,
      <abs ABSG = 4 
       data hash MD5: 32K
       E0 68 2F 46 6F 9D E4 E6 3D 9E D8 3F 94 1C 6D FA>)
(   8,<2013-07-05 22:08:04.529 -0700>,<Administrator>,<X>,<proc1d>,<TOPSPIN 2.1>,
      <abs ABSG = 5 
       data hash MD5: 32K
       5F 42 CD 19 2E F2 14 54 A5 3F 0A EF 70 4E 45 F3>)
$$ ##END=
$$ 
$$ $$ hash MD5
$$ $$ 89 38 2B CB 03 62 2A 6F 4D 34 B9 BA 97 74 38 5A
##$RELAX= 
##$RELAX= 
##$RELAX= 
##$RELAX= 
##$RELAX= 
##$RELAX= 
##$RELAX= 
$$ Bruker specific parameters
$$ --------------------------
##$DU= <E:\>
##$EXPNO= 10
##$NAME= <AC1451_MAGAH13260_8011492_QYp4jsbOs2>
$$ [...]
150 150 150 150 150 150 150 150
##$TP07= 0
##$TPNAME0= <>
##$TPNAME1= <>
##$TPNAME2= <>
##$TPNAME3= <>
##$TPNAME4= <>
##$TPNAME5= <>
##$TPNAME6= <>
##$TPNAME7= <>
##$TPOAL= (0..7)
0.5 0.5 0.5 0.5 0.5 0.5 0.5 0.5
##$TPOFFS= (0..7)
0 0 0 0 0 0 0 0
##$TUNHIN= 0
##$TUNHOUT= 0
##$TUNXOUT= 0
##$USERA1= <user>
##$USERA2= <user>
##$USERA3= <user>
##$USERA4= <user>
##$USERA5= <user>
##$V9= 5
##$VALIST= <valist>
##$VCLIST= <CCCCCCCCCCCCCCC>
##$VD= 0
##$VDLIST= <DDDDDDDDDDDDDDD>
##$VPLIST= <PPPPPPPPPPPPPPP>
##$VTLIST= <TTTTTTTTTTTTTTT>
##$WBST= 1024
##$WBSW= 4
##$XGAIN= (0..3)
0 0 0 0
##$XL= 0
##$YL= 0
##$YMAX_a= 637610
##$YMIN_a= -541352
##$ZGOPTNS= <>
##$ZL1= 120
##$ZL2= 120
##$ZL3= 120
##$ZL4= 120
##$ABSF1= 14.98509
##$ABSF2= -5.573092
##$ABSG= 5
##$ABSL= 3
##$ALPHA= 0
##$AQORDER= 0
##$ASSFAC= 0
##$ASSFACI= 0
##$ASSFACX= 0
##$ASSWID= 0
##$AUNMP= <proc_prof1d_extract_pilot.lims>
##$AXLEFT= 0
##$AXNAME= <>
##$AXNUC= <1H>
##$AXRIGHT= 0
##$AXTYPE= 0
##$AXUNIT= <>
##$AZFE= 0.1
##$AZFW= 0.1
##$BCFW= 0
##$BC_mod= 0
##$BYTORDP= 0
##$COROFFS= 0
##$CY= 15
##$DATMOD= 1
##$DC= 0
##$DFILT= <>
##$DTYPP= 0
##$F1P= 0
##$F2P= 0
##$FCOR= 0.5
##$FTSIZE= 32768
##$FT_mod= 6
##$GAMMA= 0
##$GB= 0
##$INTBC= 1
##$INTSCL= 1
##$ISEN= 128
##$LB= 0
##$LEV0= 0
##$LPBIN= 0
##$MAXI= 10000
##$MC2= 0
##$MEAN= 0
##$ME_mod= 0
##$MI= 0
##$NCOEF= 0
##$NC_proc= -8
##$NLEV= 6
##$NOISF1= 0
##$NOISF2= 0
##$NSP= 0
##$NTH_PI= 0
##$NZP= 0
##$OFFSET= 14.98509
##$PC= 1
##$PHC0= 92.85645
##$PHC1= 0
##$PH_mod= 1
##$PKNL= yes
##$PPARMOD= 0
##$PPDIAG= 0
##$PPIPTYP= 0
##$PPMPNUM= 2147483647
##$PPRESOL= 1
##$PSCAL= 4
##$PSIGN= 0
##$PYNMP= <proc.py>
##$REVERSE= no
##$SF= 400.02
##$SI= 32768
##$SIGF1= 0
##$SIGF2= 0
##$SINO= 400
##$SIOLD= 32768
##$SPECTYP= <>
##$SREGLST= <1H.CDCl3>
##$SSB= 0
##$STSI= 32768
##$STSR= 0
##$SW_p= 8223.68421052631
##$SYMM= 0
##$S_DEV= 0
##$TDeff= 65536
##$TDoff= 0
##$TI= <>
##$TILT= no
##$TM1= 0
##$TM2= 0
##$TOPLEV= 0
##$USERP1= <user>
##$USERP2= <user>
##$USERP3= <user>
##$USERP4= <user>
##$USERP5= <user>
##$WDW= 1
##$XDIM= 32768
##$YMAX_p= 469400897
##$YMIN_p= -660019
##$CURPLOT= <Network HP LaserJet P1505>
##$CURPRIN= <$Network HP LaserJet P1505>
##$DFORMAT= <normdp>
##$LAYOUT= <+/1D_H.xwp>
##$LFORMAT= <normlp>
##$PFORMAT= <normpl>
##$SURQMSG= 1
$$ End of Bruker specific parameters
$$ ---------------------------------
##NTUPLES= NMR SPECTRUM
##VAR_NAME=  FREQUENCY,     SPECTRUM/REAL,   SPECTRUM/IMAG
##SYMBOL=    X,             R,               I
##VAR_TYPE=  INDEPENDENT,   DEPENDENT,       DEPENDENT
##VAR_FORM=  AFFN,          ASDF,            ASDF
##VAR_DIM=   32768,         32768,           32768
##UNITS=     HZ,            ARBITRARY UNITS, ARBITRARY UNITS
##FACTOR=    0.250966925370066, 1,           1
##FIRST=     8223.43324360094, 78747,        120978
##LAST=      0,             10902,           -288242
##MIN=       0,             -660019,         0
##MAX=       8223.43324360094, 469400897,    0
$$ Real data points
##PAGE= N=1
##DATA TABLE= (X++(R..R)), XYDATA
$$ [...]
19541e5255P872k56372P6830d271B05009B9598c35446J14806i2454a1656k37627
19530b49283I4435a26500k0334B36164f686j40783B39701b09289G0320a59496
19519A88411q9890l5818e98r9546k06680e7239l92192J46088a14766p172B0062
19507F0615a56353E1821b06619A98860c1522I6853E111b6170A04644b8034B16983
19495f9090B18597A4186J17014d2255l6658b0917j13398E2628h7601D2698J20161
19484A62859n3930e8262o0931j00690o39A2575J50543d96039d34j72916L4406
19473a38944B783a05212c0265o223A65157D1877a7555l85991a93616M0517B3610
19461A6702J70966J27195a09821o4798l4906C21029A3459a26224B722M3953g4225
$$ y = [-55255, -47383, -303755, -226925, -4271, 205009, 29598, -335446, -220640, -92454, -11656, -249283, 94435, -126500, -146834, 236164, -6686, -147469, 239701, -209289, 70320, -159496, 188411, 98521, 62703, -598, -100144, -306824, -57239, -449431, -303343, -114766, -121938, 20062, 60615, -156353, 51821, -206619, 198860, -31522, 96853, 5111, -26170, 104644, -28034, 216983, -69090, 218597, 14186, 131200, -42255, -78913, -20917, -134315, 52628, -87601, 42698, 162859, 108929, -58262, -119193, -219883, -220522, 12575, 163118, -496039, -434, -173350, -138944, 2783, -105212, -30265, -36488, 165157, 41877, -17555, -403546, -193616, -153099, 23610, 16702, 187668, 314863, -109821, -174619, -209525, 321029, 13459, -126224, 2722, 46675, -74225]
19449a23757j13478a09581E7411m542M3688C5301j2958K19863h8297q8182j34097
19438c10576j80960E9412J09702E542k472c18725q1628a91397A89245b42385i8878
19426H5383J460K15400e06758b3315k75756A65774H0668J54931a69627J3660D0671
19414d70941B55673a1299j39609o2302B84051c54369F1584a85209e8930R519j95488
19403b44899A88330c097H1696O7468n5907J33888e0855I9388l3026a20990j54563
19392b75553m330A99395b15470F6164e6525l91399a72600m46460a89220P6240
19382a12980D711i872j54530b5549j2777A47746h0860l83274B3177b19685o6348
19371b86033a1459r1203A22762a55802M778P3496j35648H3234a51437k17324A13370
$$ y = [-123757, -237235, -109581, 57411, 52869, 96557, 35301, 22343, 242206, -88297, -176479, -310576, -491536, 59412, 169114, 5542, 3070, -318725, -400353, -191397, 189245, -242385, -98878, 85383, 86843, 302243, -506758, -23315, -299071, 165774, 80668, 235599, -169627, -155967, 40671, -470941, 255673, -11299, -150908, -213210, 284051, -354369, 61584, -185209, -58930, -49411, -244899, 188330, -3097, 81696, 149164, 93257, 227145, -50855, 99388, 66362, -120990, -275553, -279883, 199395, -215470, 66164, -56525, -447924, -172600, -619060, -189220, -112980, 4711, -9872, -164402, -25549, -38326, 147746, -80860, -464134, 23177, -219685, -286033, -11459, -102662, 122762, -155802, -151024, -77528, -213176, 83234, -151437, -368761, 113370]
19359B6727M0395c74704Q3089g8159j00176E2749a20910r2186A46259i200j77283
19348a86483e2640r777A94488C0309O0595J0156b92519d8186C5780K4830j2266
19337D8344b55058D3099c27751f1640H7074f367j01537j47397a13076q0459A92602
19325h4901j47644A71496h1488A67679c21676a14710G2879a07425M9437j00762
19315a58750A6314c61992a0635q0937A45455a64816o6928Q7488j19583J28866
19305a34973a9024o154j72457B1819J21403R5229b55183g0900E4549f160C42809
19293C6510b4154j52631g9041c8262r8167E7357E530K60669b3334j95234q7257
19282c05825i0698l9991N7649J2314Q522p2533K1894j22810C34578f6879C23741
$$ y = [26727, 67122, -374704, -291615, -78159, -178335, 52749, -120910, -213096, 146259, -9200, -186483, -52640, -62417, 194488, 30309, 90904, 101060, -292519, -48186, 35780, 60610, 48344, -255058, 43099, -327751, -61640, 87074, -6367, -107904, -255301, -113076, -193535, 192602, -84901, -232545, 171496, -81488, 167679, -321676, -114710, 72879, -107425, -57988, -158750, 16314, -361992, -10635, -91572, 145455, -164816, -231744, -144256, -263839, -134973, -19024, -25178, -197635, 21819, 143222, 238451, -255183, -70900, 54549, -6160, 342809, 36510, -24154, -176785, -79041, -38262, -136429, 57357, 5530, 266199, -23334, -218568, -305825, -90698, -130689, -73040, -60726, -52204, -124737, -102843, -225653, 334578, -66879, 323741]
19270A06646K68076H0233B2476b8864A2373J6168a50983A98491l1028c71963A29934
19258E8651b44940A15735A1564a78370A93148a63229g543C55767b03054O1336
19248a41718K3428K2079l3386L3497a5869j5521m8705k4652d6371k8801b295A56986
19235E3566K856r375R5671C6363a24002n8458K0832A40613b64606i1671F0435
19223B78153J3300A36074c51413J47769G7985K2914a88733l3499c5421a6431n8253
19212g4684k20171e5411j18533A11376c4177j60383o2487Q7412C9130R7779b16372
19200E434e28199a58597J9608n1587N8559j66575B69130H5269g6818j50515R3690
19189a33643k03763A61309i1135o8113A21923B9097a75668h5189l33860A57868
$$ y = [106646, 374722, 80233, 22476, -28864, 12373, 28541, -150983, 198491, 167463, -371963, 129934, 58651, -244940, 115735, 11564, -178370, 193148, -163229, -7543, 355767, -203054, -141718, -118290, -96211, -129597, -96100, -15869, -31390, -80095, -104747, -46371, -75172, -2295, 156986, 53566, 56422, 47047, 142718, 36363, -124002, -182460, -161628, 140613, -264606, -91671, 60435, 278153, 291453, 136074, -351413, -203644, 77985, 100899, -188733, -222232, -35421, -16431, -74684, -294855, -55411, -173944, 111376, -34177, -194560, -257047, -169635, 39130, 136909, -216372, 5434, -528199, -158597, -138989, -190576, -132017, -298592, 269130, 85269, -76818, -227333, -133643, -337406, 161309, -91135, -159248, 121923, 29097, -175668, -85189, -419049, 157868]
19178D255a93203F2122b24782B76335F6166a89157g6962l96662J41114i2649O308
19167h6341B735f8778a3975l85161A8852d9075A90006a30696O2044C490f0348
19155b3522m32013F4350K2118b0218j67213j17805D8939N4409g2765j19448J81
19144a92032A65544H597J3847a01479d8219P00c112H180a41173P606A26292d08151
19131b88854G2281b15037A3434d9560C75264C3631a03697b37j88605G0980c61576
19119b73474k06084A83380D6294b24230i1997C338b10763P8755A09064a41250
19108A44008e7688B67549f7418e69k3197H3741C17J2303O3371b15712c3133D0662
19095b17745H7641a10151P60q5373P4513N9077A93448b09680B39928E0330d58095
$$ y = [4255, -193203, 62122, -224782, 276335, 66166, -189157, -76962, -473624, -332510, -92649, -86341, 2735, -68778, -13975, -399136, 18852, -49075, 190006, -130696, -68652, 3490, -60348, -23522, -455535, 64350, 86468, -20218, -187431, -305236, 48939, 103348, -72765, -192213, -192032, 165544, 8597, 22444, -101479, -48219, -47519, -3112, 8180, -141173, -133567, 126292, -408151, -288854, 72281, -215037, 13434, -49560, 375264, 33631, -103697, -237, -188842, 70980, -361576, -273474, -479558, 183380, 46294, -224230, -91997, 3338, -210763, -132008, 109064, -141250, 144008, -57688, 267549, -67418, -569, -23766, 83741, 317, 12620, 75991, -215712, -33133, 40662, -217745, 87641, -110151, -109391, -194764, -120251, -61174, 193448, -209680, 239928, 50330, -458095]
19083A39712a41171e4317k59416E9260c8949C9822K32618h7552J7498A8115b12772
19071A11662l5452b33221C9934P7090a42357E8071R1421J19501d721p8737B3203
19059i6956A77842B5290A585a86537B58600b2871A47232b05063g6840j64597k7073
19048b68510f7098K5479k16383G3619f9637j34763g4590A12449g3853r3315A00467
19036a9367A41354a73340q2817B14516a11696j94616C4189J61433h1356A53691
19025b9498A79180E8735Q3085a90500A14669a22900B66094j01416g4567A09775
19014b01928A14442i3445H7578b91294i7445A03592P5408E4612J11552c4964r8518
19003a33482G5440c62385A84480a58690C57499a26847D15290D6432N3004c42329
$$ y = [139712, -141171, -54317, -313733, 59260, -38949, 39822, 272440, -87552, -70054, 18115, -212772, 111662, 76210, -233221, 39934, 117024, -142357, 58071, 149492, 268993, -4721, -83458, 23203, -96956, 177842, 25290, 1585, -186537, 258600, -22871, 147232, -205063, -76840, -241437, -268510, -67098, -41619, -258002, 73619, -69637, -204400, -74590, 112449, -73853, -167168, 100467, -19367, 141354, -173340, -256157, 214516, -111696, -306312, 34189, 195622, -81356, 153691, -29498, 179180, 58735, 141820, -190500, 114669, -122900, 266094, 164678, -74567, 109775, -201928, 114442, -93445, 87578, -291294, -97445, 103592, 179000, 54612, 166164, -34964, -133482, 75440, -362385, 184480, -158690, 357499, -126847, 415290, 46432, 99436, -342329]
18992B78476i9063k77783J59322M7612L4631j9157o5320B70385k4047b91979R7005
18981a94974A07418K4220k0877a69644e9614B59775a12418H1297E404a7998j1423
18970b9421k2348o7094r2411a02950B95494f3853I3715A7976c57304a35151l3052
18959a68203O08j11126C6875b48858D8060K71393c05467J44364q0977J4188f6001
18947B26212h4044c369j30743F859e1388j43077G2537b3454A7744a89256R3108
18936i6148q6625b0002j61326A55107a74983e1595B15097A00115c8458j65072
18926b03530M5280e1263D2633c53145I1991e8985m599J0957A18862B8843O1216
18915I0059J5125Q344J03741a76595d5210r9997b5016j50569o2808a07466d1060
$$ y = [278476, -99063, -376846, -217524, -169912, -135281, -154438, -219758, 270385, 246338, -291979, -194974, 107418, 131638, 110761, -169644, -59614, 259775, -112418, 81297, 5404, -17998, -29421, -51769, -118863, -211274, -102950, 295494, -63853, 93715, 17976, -357304, -135151, -168203, -167595, -278721, 36875, -248858, 48060, 319453, -305467, -161103, -242080, -227892, -66001, 226212, -84044, -3369, -134112, 6859, -51388, -194465, 72537, -23454, 17744, -189256, -96148, -182773, -20002, -181328, 155107, -174983, -51595, 215097, 100115, -38458, -203530, -158250, -51263, 42633, -353145, 91991, -58985, -63584, -52627, 118862, 28843, 90059, 105184, 113528, 217269, -176595, -45210, -145207, -25016, -175585, -238393, -107466, -41060]
18903a57585r991i324j13572B93907D1146j6911a40034R066q3363B66164c1234
18891g3416E8441a14042J3563k55928A99033q0701E4993i9949r3573Q5654C7088
18879c65063I1890B6291b67498C57456c82330I5524h4378k09354L8448b1061n8348
18868g9409m30043A07610c70868a41793c1367p1815F0297b93096q3855J79978
18858a96973k511C0214K6683A7497b20140B34114a50437c2153B9536K06755r9960
18847A36331a8794k09487D14844I17c00947i8553k941B05236a9040j76390A84084
18835a187E2086a09544I9285b980r6227o1591A01600c06421B31914q9026a97414
18823a90503c5660q2036A91588i0354k38738A59137b0200k73637N2516A9224h7449
$$ y = [-157585, -167576, -9324, -122896, 293907, 41146, 24235, -140034, -130968, -214331, 266164, -31234, -73416, 58441, -114042, -100479, -356407, 199033, 118332, 54993, -99949, -193522, -107868, 37088, -365063, 91890, 26291, -267498, 357456, -382330, 95524, -84378, -293732, -255284, -21061, -79409, -509452, 107610, -370868, -141793, -31367, -103182, 60297, -293096, -376951, -196973, -199484, 30214, 56897, 17497, -220140, 234114, -150437, -32153, 29536, 236291, 136331, -18794, -228281, 414844, 917, -300947, -98553, -101494, 205236, -19040, -195430, 184084, -1187, 52086, -109544, 99285, -2980, -99207, -160798, 101600, -306421, 231914, 142888, -197414, -190503, -35660, -117696, 191588, -90354, -329092, 159137, -20200, -293837, -241321, 19224, -87449]
18811E3260J29301E689N0234c7175m917j43582J3907g3248j8105L1767F0548a80269
18798b82996J41248j11978k0572N4189c0560A85211c18438G1032d77061g4019
18787A69477b98805A97765D6578i8879A7467a30030e0788a0514j95773K3613K3097
18776a59577C14948h8440l15631h688H7348l8879c64711C232a73709L4331L1963
18765a07415m2477A53055n7249J60664q6633a75827j09978J23123A10525J30293
18755B40818c54394J37566h4406k93261i1080L2243D5940n60J01728a82243B5381
18743a09947m7873L541e161l1318D4455d24880D5448i8019M0159j43448a0514
18731b6834D2259f521k80109B32986a46270J8738C47431A35700P9893F7621i2800
$$ y = [53260, 182561, 5689, 55923, -37175, -42092, -185674, -171767, -73248, -91353, -59586, 60548, -180269, -282996, -141748, -253726, -274298, -220109, -30560, 185211, -318438, 71032, -477061, -74019, 169477, -298805, 197765, 46578, -98879, 17467, -130030, -50788, -10514, -206287, -182674, -159577, 314948, -88440, -404071, -8688, 87348, 48469, -364711, 3232, -173709, -139378, -107415, -149892, 153055, 95806, 256470, 169837, -175827, -285805, -162682, 110525, 240818, -354394, -216828, -84406, -377667, -91080, -58837, 45940, 45380, 147108, -182243, 25381, -109947, -157820, -154279, -5161, -36479, 44455, -424880, 45448, -98019, -57860, -201308, -10514, -26834, 42259, -6521, -286630, 232986, -146270, -127532, 347431, 135700, 215593, 67621, -92800]
18719c88027B12396n0560R022p4880d75037H1914f0695l07173l922J17407B23242
18707e2965j28709k46584B77277a55378f5165A9772M6697d26078a00710d4573
18696E1606g0862H7403c227j61085A19398F680c04665D1155a03803k47052a65193
18684b27916N3266A3184c3454A75343E0163c31392g8521J7546I8559m1680k7414
18673B9465b88115C16827h3962c2000r1388B93124b82830C1634D34d2205d76C8959
18660f207I0613i3631B46294D6337J4746a70141O5628G3017d1783a3985j39451
18649a53436E9113J36803K10143G2526k691b2409A28901c28283A86279G5667C2840
18637A75511a46934E8796b7102j09911K3163e4682a7028k20102A70206e98318
$$ y = [-388027, 212396, 161836, 170858, 95978, -475037, 81914, -60695, -367868, -371790, -254383, 223242, -52965, -181674, -428258, 277277, -155378, -65165, 19772, 66469, -426078, -100710, -44573, 51606, -70862, 87403, -3227, -164312, 119398, 6680, -304665, 41155, -103803, -350855, -165193, -227916, -174650, 13184, -33454, 175343, 50163, -331392, -78521, -60975, 98559, 56879, 29465, -288115, 316827, -83962, -32000, -123388, 293124, -282830, 31634, 434, -42205, -476, 38959, -6207, 90613, -93631, 246294, 46337, 61083, -170141, -104513, 73017, -41783, -13985, -153436, 59113, 195916, 406059, 72526, 69835, -22409, 128901, -328283, 186279, 75667, 32840, 175511, -146934, 58796, -27102, -137013, -113850, -54682, -17028, -237130, 170206, -598318]
18626c4432H0205b20285B31885F6253P012c3326m5861F4977c3343E5559A6129
18614b47074N7505a3294j2889j56256N1415j5859q8445q5078a14478A51968Q439
18603A60407a04488I682b69810I2459b03707o273A92859A8102d8835G8576c25741
18591a90672i4997l5272A25988d356A59433A7793d30901A6453c41991J44900A83178
18579b55767P4865A2466c3620j62088a0247r3956A48022a53730B14708E4620b50244
18567I6702c216B168b89960B1083K65152c6804l46351O4975C3194g5029A89596
18555A69165b30184A5392b08391N6730g4907j76844C35397F5188c51697F579J01867
18544A08446e3188D9378c20113A86912D3146i461j90612A1565a2317k08813E3256
$$ y = [-34432, 80205, -220285, 231885, 66253, 73265, -33326, -79187, 64977, -33343, 55559, 16129, -247074, -189569, -13294, -26183, -182439, -131024, -146883, -235328, -320406, -114478, 151968, 160407, -104488, 9682, -269810, 92459, -203707, -209980, 192859, 18102, -48835, 78576, -325741, -190672, -94997, -130269, 125988, -4356, 159433, 17793, -430901, 16453, -341991, -197091, 183178, -255767, -180902, 12466, -33620, -195708, -10247, -104203, 148022, -153730, 214708, 54620, -250244, 96702, -3216, 2168, -289960, 21083, 286235, -36804, -383155, -318180, 33194, -75029, 189596, 169165, -230184, 15392, -208391, -151661, -74907, -251751, 335397, 65188, -351697, 6579, 108446, -53188, 49378, -320113, 186912, 43146, -9461, -200073, 11565, -12317, -221130, 53256]
18532E3718b24838O6386j7353Q1320L9190K4635k0517K4488p6674d2256j55711
18521a97967j25675f6279D206J61904n3859e574E7012J44826J09199I9691f8173
18509a9415q4492B3624h5322j00969A9671a29849f0705n1466j2785M6366Q331
18498g0259b4693C74001A65251o9878c4831C4553a21732o8607k8041B22818b7391
18486a70396M6176l11965A20914J7118i7741F5232j7116a57447q3549a1956n02383
18475e14339J76478A50208a11533A3110f2760B62078E4083b56646a3007G3023
18464B97260a50480L905J4205A35945j6403a70213q1574A0940b15504b4813o7323
18453i2136a1395k2602q0879d4274j5793E6781O14954a00287K9063l5082p0034
$$ y = [53718, -224838, -158452, -175805, -94485, -55295, -30660, -51177, -26689, -103363, -42256, -197967, -323642, -66279, 4206, 166110, 112251, -5574, 57012, 201838, 311037, 99691, -68173, -19415, -103907, 23624, -85322, -186291, 19671, -129849, -60705, -112171, -124956, -78590, -70259, -24693, 374001, 165251, 95373, -34831, 34553, -121732, -190339, -218380, 222818, -27391, -170396, -124220, -436185, 120914, 138032, -97741, 65232, 48116, -157447, -240996, -11956, -514339, -337861, 150208, -111533, 13110, -62760, 262078, 54083, -256646, -13007, 73023, 297260, -150480, -146575, -132370, 135945, 119542, -170213, -251787, 10940, -215504, -24813, -92136, -11395, -33997, -114876, -44274, -60067, 56781, 671735, -100287, -71224, -106306, -176340]
18442a76340I8220Q2701c1332j17506K5966D5390R7450b18369A11219i6688K7389
18431f9299o2894L9117A09189c75861b2585l3391A62510B370h7757j653j44868
18420b34278d445o9391A70876n3622b41268A24017Q8119b23418b9548j64858C70506
18408a30547b0771A00652a79312h6079I3904O9838m1471M6402k3924b4920k05904
18397b30824j07176g6054B40606c60857c7088j05727l46233i1898M5461F2199
18386c38499Q8915A94831d7603C4613a44296e1842D667J29843d0776B1952b07340
18374b366C2328M4806G93b89836q3328b8218k13783A70092B253J8567c9971j23
18362d0094k3634k01642i5155k84576g129o194r0570C4530h7377j0814H5063r368
$$ y = [-176340, 98220, 180921, -31332, -148838, -122872, 45390, 142840, -218369, 111219, -96688, -69299, -132193, -93076, 109189, -375861, -22585, -55976, 162510, 2370, -87757, -89410, -234278, -4445, -73836, 170876, 117254, -241268, 124017, 212136, -223418, -29548, -194406, 370506, -130547, -20771, 100652, -179312, -86079, 93904, 163742, 122271, 168673, 144749, -24920, -230824, -338000, -76054, 240606, -360857, -37088, -142815, -489048, -91898, -46437, 62199, -338499, -249584, 194831, -47603, 34613, -144296, -51842, 4667, 134510, -40776, 21952, -207340, -2366, 32328, 77134, 793, -289836, -373164, -28218, -242001, 170092, 2253, 20820, -39971, -40094, -63728, -265370, -95155, -379731, -7129, -13323, -103893, 34530, -87377, -98191, 85063, 75695]
18350G5695b06040B60534f6558r7097H942L68072A31767e6303C79664a00734j52352
18339b53086j80975a20303N4015D5177a56005d2012m4707o1013k6247C8615b0317
18327i5799b1721q3879A10159m7193J81954A5893M08410l7086i273k04523j6972
18316b30768g9903j7009j01858i145A61058B3121O8320J12839E4193k2129J09258
18305A41322J86810a14420o0592O9709l1930D11846k02014D4851c20702B16216
18294A66060b55662B69454a19624H754J28630b63854B3946J55012a92119e7326
18283e9354q3045A44362p27F6126A6042R2675h9863B20185B7019J14723M8983
18272A90725I407J94239G0165c07281B69442b13986a4098E9385Q5132G1048b38668
$$ y = [75695, -206040, 260534, -66558, -163655, 8942, 377014, 131767, -56303, 379664, -100734, -253086, -434061, -120303, -66288, 45177, -156005, -42012, -86719, -147732, -173979, 38615, -20317, -95799, -21721, -105600, 110159, 62966, 244920, 15893, 424303, 387217, -9273, -213796, -230768, -79903, -96912, -198770, -9145, 161058, 23121, 91441, 204280, 54193, 32064, 141322, 328132, -114420, -175012, -105303, -137233, 411846, 209832, 44851, -320702, 216216, 166060, -255662, 269454, -119624, 8754, 137384, -263854, 23946, 178958, -192119, -57326, -59354, -142399, 144362, 143635, 66126, 16042, 108717, -89863, 220185, 27019, 141742, 190725, 9407, 203646, 70165, -307281, 269442, -213986, -14098, 59385, 144517, 71048, -238668]
18260C23382E1166O3040a15714d9580B31890K4936a51252k82480A19242k9819
18250H9423J99664b81488r2104e9213A6098d13412a66365A34533e4491l09564
18240c64055J38159A19761a2811j5721j18623l3018e7697j71370G544K42681E5778
18228a51784A78244b16206m8673I8825K5992o1438a13691A28636a06652A93879
18217a18157n8185O0897I0443D2399f5659m45110B03734a04314j31397o6579L0098
18206b72192i7719j84772B1349N8772f7389F3858a2062B74047D3238a05601E5492
18194A50628a99777n0991F6692f0039D4432f7804r5688C8595b62819A20371b91382
18182A92272h9052j54350A60972J0115c3925F9334h3677E2449a08723M2354C37025
$$ y = [323382, 51166, 114206, -115714, -49580, 231890, 256826, -151252, -433732, 119242, 89423, 289087, -281488, -373592, -59213, 16098, -413412, -166365, 134533, -54491, -364055, -225896, 119761, -12811, -28532, -147155, -180173, -57697, -229067, 7544, 250225, 55778, -151784, 178244, -216206, -264879, 98825, 124817, 63379, -113691, 128636, -106652, 193879, -118157, -176342, -115445, 90443, 42399, -65659, -510769, 203734, -104314, -235711, -302290, -272192, -97719, -282491, 21349, 80121, -67389, 63858, -12062, 274047, 43238, -105601, 55492, 150628, -199777, -250768, 66692, -60039, 44432, -67804, -163492, 38595, -262819, 120371, -291382, 192272, -89052, -243402, 160972, 171087, -33925, 69334, -83677, 52449, -108723, -66369, 337025]
18170A80033p6097b76255h7262E9284M2818j7816J37386h2068k25711b4079m08368
18159d32447a5862j34289D2996R3618c5659G8595l4527P546a77704B67541j11003
18148A56538b32930g2791k33707I5462c8986D5539A2546c99062B9798a08671j55246
18137b63917A54798a30736k7673f0897o7779I5186E950d4604G1496K33831c4050
18125a77377f0608m7916o2237r6934C1477O4889A30h9769A62748f7654H3291c2094
18112a27890m7976N6738E9137b6913A24148D8049J07833D7690J65668a33157p52
18101a33909M216J0695k1346g929k22341b1185q7333j10111C3621b04535C0952
18089h2424C43941b71098c4492I7516a6274G7998e1305D06961b50106a0208j59967
$$ y = [180033, 103936, -276255, -87262, 59284, 102102, 84286, 221672, -82068, -307779, -24079, -432447, -15862, -150151, 42996, 136614, -35659, 78595, 44068, 51614, -177704, 267541, 156538, -232930, -72791, -306498, 95462, -38986, 45539, 12546, -399062, 29798, -108671, -263917, 154798, -130736, -158409, -60897, -128676, 95186, 5950, -44604, 71496, 305327, -34050, -177377, -60608, -108524, -170761, -267695, 31477, 96366, 130, -89769, 162748, -67654, 83291, -32094, -127890, -175866, -119128, 59137, -26913, 124148, 48049, 155882, 47690, 213358, -133157, -133909, -129693, -118998, -140344, -7929, -230270, -21185, -108518, -218629, 33621, -204535, 30952, -82424, 343941, -271098, -34492, 97516, -16274, 77998, -51305, 406961, -250106, -10208, -170175]
18078a70175D5459a10199B27450r8536b51090B3212a29217L8783G9148P7398a90853
18066A7734K8293a43446B09834A03173k2095O2131a7489r9980C0613a18082G3217
18054a63683A14502i7002A28485c8077I6322i4128G0182J13938c03053C60729
18043i2168G5789H847b78202a5003I573a9018k17966m9409A11166J37822I776
18031D3634a24804j00359H7875L5980a59272P9195o7458A08620a7127o6518q6561
18020a70206g6326Q46j08959C41121F7582a5862k27251f1742k75404C2414C964
18008e9953D14307c4048h041H6602J04842b33673A14686c00930R6429D8086a08325
17996A28750K7334j4230b05569F3681K35071b5286p9253A22688n6683a26267M4798
$$ y = [-170175, 45459, -110199, 227450, 128914, -251090, 23212, -129217, -90434, 79148, 156546, -190853, 17734, 46027, -143446, 209834, 103173, 81078, 143209, -17489, -117469, 30613, -118082, 73217, -163683, 114502, -97002, 128485, -38077, 96322, -94128, 70182, 184120, -303053, 360729, -92168, 75789, 8847, -278202, -15003, 9573, -19018, -236984, -286393, 111166, 248988, 9776, 43634, -124804, -225163, 87875, 123855, -159272, -80077, -147535, 108620, -17127, -83645, -170206, -76326, -75480, -184439, 341121, 67582, -15862, -243113, -61742, -337146, 32414, 3964, -59953, 414307, -34048, -8041, 86602, 191444, -233673, 114686, -300930, -204501, 48086, -108325, 128750, 156084, 141854, -205569, 63681, 298752, -25286, -104539, 122688, 66005, -126267, -81469]
17985h1469l6047J9446j49481e9057l0959c9807p3072k0674F6314J2290i0697
17973A29619c66110b3371D5736a87176I4869a70948C26104c1309j28689O250B49345
17961H8285c7383n2469H2520a55628I1855L7802a97293C30044a84533N3471B49696
17949B07599r2074d56551c8679F1932j6589L83634c8164H5784c23708B2209h7745
17937C5990J32548a8315A45136i0048q2687h5359I0547a02337E27713b30281N4415
17926a75866A08109k6938L9088b15168K9410C6510d1338j77959A10271d0351j52146
17915a92497h4509j87901B85942A01485P981h2491A13392P8795C4907a59786P7073
17904h2713F7436b08247A80432B534J75300b76968a12204G0901f8777j50390a2264
$$ y = [-81469, -117516, -98070, -247551, -59057, -90016, -39807, -112879, -133553, 66314, 78604, -90697, 129619, -366110, -23371, 45736, -187176, 94869, -170948, 326104, -31309, -159998, -153748, 249345, 88285, -37383, -89852, 82520, -155628, 91855, 129657, -197293, 330044, -184533, -131062, 249696, 207599, 115525, -456551, -38679, 61932, 45343, 428977, -38164, 85784, -323708, 22209, -87745, 35990, 168538, -18315, 145136, -90048, -172735, -85359, 90547, -102337, 527713, -230281, -175866, 108109, 81171, 120259, -215168, -185758, 36510, -41338, -219297, 110271, -40351, -192497, -84509, -272410, 285942, 101485, 109466, -82491, 113392, 192187, 34907, -159786, -82713, 67436, -208247, 180432, 2534, 177834, -276968, -112204, 70901, -68777, -219167, -12264]
17892F3072K7027A5324b60301B13011o3419d28289A69183c8027C91867f0978F9830
17880a15228I0872J8300g7675n525j81963H6495b74773H124c40351J39640i8662
17868b55107n6140A5414a29920j13064D4689a7196m6697b8874j021C81888G2910
17856B78157a06473o363C46378a00690A12208a33795I2199f5945N999E7689a321
17844H3560R4089K51180c50739C229R1906Q5931i478B93509A1113K99577a15952
17832G2060b5077j33478n9140B39229c27533F5730a15988C3275f0712K0231J2369
17821b8112A26370Q6873f142b727A00652a14062d9167p5652H7887L3952c7417
17809B15850b05393c7284F5677J55128o2075c0788J2813p5922A05105i7469A24373
$$ y = [63072, 90099, 15324, -260301, 213011, 149592, -428289, 169183, -38027, 391867, -60978, 69830, -115228, 90872, 109172, -77675, -83200, -265163, 86495, -274773, 8124, -340351, -200711, -98662, -255107, -311247, 15414, -129920, -242984, 44689, -17196, -63893, -28874, -29895, 381888, 72910, 278157, -106473, -112836, 346378, -100690, 112208, -133795, 92199, -65945, -59946, 57689, -1321, 83560, 177649, 428829, -350739, 3229, 95135, 181066, -9478, 293509, 11113, 310690, -115952, 72060, -25077, -158555, -217695, 239229, -327533, 65730, -115988, 33275, -60712, -40481, -28112, 126370, 213243, -6142, -2727, 100652, -114062, -49167, -124819, 87887, 121839, -37417, 215850, -205393, -37284, 65677, 220805, 158730, -30788, -17975, -93897, 105105, -97469, 124373]
17797c53034a68854g1783J5968B9139a87730l4958F717d01088I4557a91303n7418
17786b48721J06784I1246h0649B16944a21463A15435D8764P9969d5827j15789
17776a61616M5828A98440a96203O7152B59684g6487j45399B2282N2813M411a58181
17764f6588A69777a73501F6324J44273l6807K66767E1451h4687n9979A27165E6248
17752A64290M5829e2433B44653b13208O6595B15566C4480J58935d4668k23888
17742b68556g9662A52857C5931b56696j2014a08601C3511c17956k6226B62083
17731B99651e0814C8358K20898b285B96892A5794e606j2665p2414F3815b97709
17719e1032G5685J2798J6185b47561A95363J57892C8086K10600E327J03779j6516
$$ y = [-353034, -168854, -71783, -55815, 29139, -187730, -222688, 6717, -401088, 94557, -191303, -248721, -141937, 91246, -80649, 216944, -121463, 115435, 48764, 128733, -45827, -161616, -115788, 198440, -196203, -129051, 259684, -76487, -221886, 22282, 75095, 79506, -158181, -66588, 169777, -173501, 66324, 210597, 173790, 440557, 51451, -84687, -144666, 127165, 56248, 164290, 210119, -52433, 244653, -213208, -146613, 215566, 34480, 193415, -44668, -268556, -79662, 152857, 35931, -256696, -268710, -108601, 33511, -317956, -344182, 262083, 299651, -50814, 38358, 259256, -2285, 296892, 15794, -5606, -18271, -90685, 63815, -297709, -51032, 75685, 88483, 104668, -247561, 195363, 353255, 38086, 248686, 5327, 109106, 92590]
17708I2590a60720E415K29495B6026J51920E7967L6140a20062E9691g4166A09698
17696a65907E1880a23382C29285b2738E6228a10857C91639G5014b45139J15108
17686a30031j04973E5349j5674R231h9003B03598a30559j73165a09654n0784d2622
17674a62931o7307I566e5149D59297A78183l7134n3385d631A87413a69866A45049
17662b666r9127A04090a63539A05415n0918b66363A38727P5823J34277G6393B3537
17650A99382d0552A40014E9828c050B7347b69224A58157a72980r3731f3833k92032
17639c55865A4559b02707A96655K14923j27282a12798G0647J34584D7946N1208
17629I9154c03869a9738B69679a86877C91725c1324B89521A39582i4337q1585
$$ y = [92590, -160720, 5415, 234910, 26026, 177946, 57967, 94107, -120062, 59691, -74166, 109698, -165907, 51880, -123382, 329285, -22738, 56228, -110857, 391639, 75014, -245139, -130031, -235004, 55349, 39675, 48906, -89003, 203598, -130559, -303724, -109654, -160438, -42622, -162931, -230238, 9566, -55149, 459297, 178183, 141049, 87664, -4631, 187413, -169866, 145049, -2666, -101793, 104090, -163539, 105415, 54497, -266363, 138727, 214550, 348827, 76393, 23537, 199382, -40552, 140014, 59828, -3050, 27347, -269224, 158157, -172980, -266711, -63833, -355865, 14559, -202707, 196655, 411578, 284296, -112798, 70647, 205231, 47946, 99154, -303869, -19738, 269679, -186877, 391725, -31324, 289521, 139582, -94337, -175922]
17619a75922B07103D5831p232J12J50441a56077A69105A5295K01904A0238a39
17607A36915b41757a8733A51049D0508J33472L9117b02024I2536R4435R0409b59636
17595A1778f4715j24877l8858E344P328J76439C8047i6285j03725h1651k4814
17584a06465B47701F0795K129N9783K77563C5814A380a10417N2144j47199G6446
17572d5968j15325j08207A13232d3134j85201R0650N3656M0832m17054I2103K47236
17561C39339A26261A2867M2173a11014C71761a60369a5213E43605A65398a36910
17550g6553c3424c907A71238e2935k9395j06720G6345a56136g2948n1559A15222
17538a283I8711b77847B5842A0231K22597m0705F1560K13536e0652C14543e8197
$$ y = [-175922, 207103, 45831, 38599, 38711, 189152, -156077, 169105, 15295, 217199, 10238, -139, 136915, -241757, -18733, 151049, 40508, 173980, 213097, -202024, 92536, 186971, 277380, -259636, 11778, -64715, -189592, -228450, 5344, 12672, 189111, 38047, -96285, -200010, -81651, -106465, 247701, 60795, 62924, 122707, 400270, 35814, 1380, -110417, -58273, -205472, 76446, -45968, -161293, -269500, 113232, -43134, -228335, -137685, -84029, -43197, -460251, 92103, 339339, 126261, 12867, 55040, -111014, 371761, -160369, -15213, 543605, 165398, -136910, -76553, -33424, -3907, 171238, -52935, -82330, -189050, 76345, -156136, -72948, -124507, 115222, -1283, 98711, -277847, 25842, 10231, 232828, 192123, 61560, 275096, -50652, 314543, -58197]
17526a014B24136a15257q9380b7887n2784j2890d4210j12552c6917J8196H1154
17514b3604j00042J3945H5714O4682K25605f2235A61929m2382h3532B75050B3470
17502a30397e8711A77249F3252R1870C1357J96904j05375R2569K4474j01981a93948
17490A58747k7277l2326D8979b64230A85027c6665a2539n6328A85292q7056B52
17478h1913C41829j20667J35476j8339H9966B0589e1374C8413K16165G8235e9577
17466A39334J02735p9170P838N0487J60358C1661K22775J61181a69434C031h4294
17454B50416L8383j37603a58087B86255b6195C2414K86978J37023j33158M2245
17444C65502j67512M69996G8927M38730A25229M0475J9585L37176A63510L49541
$$ y = [-1014, 224136, -115257, -204637, -27887, -80671, -93561, -44210, -156762, -36917, -18721, 81154, -23604, -123646, -109701, 85714, 150396, 376001, -62235, 161929, 119547, -83532, 275050, 23470, -130397, -58711, 177249, 63252, 155122, 31357, 228261, 122886, 215455, 239929, 137948, -193948, 158747, 131470, 99144, 48979, -264230, 185027, -36665, -12539, -68867, 185292, 98236, 252, -81913, 341829, 221162, 356638, 338299, 89966, 20589, -51374, 38413, 254578, 78235, -59577, 139334, 242069, 162899, 170737, 221224, 381582, 31661, 254436, 415617, -169434, 3031, -84294, 250416, 288799, 151196, -158087, 286255, -26195, 32414, 319392, 456415, 323257, 365502, 197990, 667986, 78927, 517657, 125229, 165704, 185289, 522465, 163510, 513051]
17434E13051A23489J64337j8955j04594K55328j40314L8773j51422A0863J38299
17424A49162J7052a53572B02538r3323J34386J2330k5322K0438q6656J45943A48510
17412f6421B96282L2696N1034I9595B0330N6555J06346N28787b30143g3693B57811
17400C08087E8110b3514n2476C08925o3786l1664k430M83J89704e0563A60181
17388A51516l5541B3759M39683C9316g9260B73276A29813n066c8866A62780p1407
17377I1373M34390G8650a29235d1370E7590a78360G2679K6651e8736D06922A40985
17365h9188C16696j05055K96438f7414F4127L2811M8252l9311P5827K83021j61085
17354C03642d3177C05387Q5138a83813H9456g3897A21906a31626A11643l1592
$$ y = [513051, 123489, 287826, 268871, 164277, 419605, 279291, 318064, 166642, 10863, 149162, 166214, -153572, 202538, 109215, 243601, 255931, 230609, 251047, 164391, 310334, 148510, -66421, 296282, 328978, 380012, 99595, 20330, 76885, 183231, 712018, -230143, -73693, 257811, 308087, 58110, -23514, -75990, 308925, 245139, 213475, 211045, 211528, 401232, -50563, 160181, 151516, 115975, 23759, 463442, 39316, -79260, 273276, 129813, 124747, -38866, 162780, 91373, 525763, 78650, -129235, -41370, 57590, -178360, 72679, 99330, -58736, 406922, 140985, -89188, 316696, 211641, 508079, -67414, 64127, 96938, 145190, 105879, 181706, 464727, 303642, -43177, 305387, 390525, -183813, 89456, -73897, 121906, -131626, 111643, 80051]
17344H0051N9296M5013C4176O3389C112L27966a41557b5501D82726A33633b3058
17332D60732F8310K27909c3558F9684C3942J63286b4740k8686A4884K54537K9840
17321B99261j36352R7988L966F4598k0699J24251a71934K9947f6275A61403O3298
17310B24701p9897M4604b77986B31090e8762B14232Q4613m959K9106j54269J3231
17299A81954a53127C4691A219f401j14465H6395K0741K48511K0789C7258L56107
17288C93365b62691D45948f3837A81094N8000K65136G0298l1839O0250J69546
17278B68255K34977j48788A17251r357a36704A42447L03595H6368L44056c2610
17267B86978j22643Q1086J29748C7984L0602J05260L11282b2709C04289A3774
$$ y = [80051, 139347, 184360, 34176, 97565, 3112, 331078, -141557, -25501, 482726, 133633, -23058, 460732, 68310, 296219, -33558, 69684, 33942, 197228, -24740, -53426, 14884, 269421, 299261, 162909, 260897, 264863, 64598, 43899, 168150, -171934, -141987, -66275, 161403, 224701, 144804, 189408, -277986, 231090, -58762, 214232, 298845, 293886, 322992, 168723, 181954, -153127, 34691, 1219, -6401, -120866, 86395, 107136, 355647, 376436, 37258, 393365, -262691, 445948, -63837, 181094, 239094, 504230, 70298, 38459, 98709, 268255, 503232, 354444, 117251, 107894, -136704, 142447, 446042, 86368, 430424, -32610, 286978, 164335, 245421, 375169, 37984, 68586, 173846, 485128, -22709, 304289, 13774]
17256A22832M427J50503J4793K75720d2806A29931J12034j5952m9527a0380E8700
17244b5511A57250a37520F7789K9895J34160A10002B5480K2388L49866r6938F7076
17232C68974E6952J53326G8429L3587a42437C72697j73979I5366P528J38385d1694
17220A7273L51111j58265F0058O3633a40173B27672K7228B4873J77769n8513P7276
17209B21405a07509B05176A7676L28592A00001J85273e0077A86935G0923j9483
17199E1440J54723O5871J00735A05518D095K11436M30717B66723H3086L81433
17189D64519d5131B45079R7524I1564Q7918K35700j68711l0970J67846F9988J54944
17178B24932o1635a5776C34388A6747N2431O18084k84411m6718n6796J21978A77095
$$ y = [122832, 127259, 277762, 292555, 568275, -42806, 129931, 241965, 226013, 176486, -10380, 58700, -25511, 157250, -137520, 67789, 97684, 231844, 110002, 25480, 47868, 397734, 300796, 67076, 368974, 56952, 210278, 78429, 112016, -142437, 372697, 198718, 95366, 102894, 241279, -41694, 17273, 368384, 210119, 60058, 123691, -140173, 227672, 254900, 24873, 202642, 144129, 221405, -107509, 205176, 17676, 346268, 100001, 285274, -50077, 186935, 70923, 51440, 206163, 272034, 372769, 105518, 4095, 215531, 646248, 266723, 83086, 464519, -45131, 245079, 342603, 91564, 179482, 415182, 246471, 215501, 383347, 69988, 224932, 163297, -15776, 334388, 16747, 69178, 687262, 402851, 356133, 299337, 421315, 177095]
17166C31155j55002q3088J19319A00446J19322b42231F32261B11376C1261K88799
17156C20060k4584P8791R5967j90088j12820l0607J64709L75206B34411K42476
17146D76887J23283A51950K00307j64157j9225J18882P2665g7521B07609J26255
17136C33864A33319D0644K14719J29082N5232i3755F0823M54037K00537B38320
17125C58135j12152l2999J66005P3053b69826B52710Q8482a15256D45304P3398
17115E18702q4336j38049q4032J27314O831J33525R1325j47802j77621L0164p437
17104B68584j09951K02409L23044p7144J09086B56428k0726L99710k44628J98358
17094E89142q8669r3057A17837M74816j02383A82121J72431K35027k80934E4194
$$ y = [331155, 176153, 93065, 212384, 100446, 219768, -242231, 632261, 211376, 31261, 320060, 295476, 374267, 470234, 280146, 167326, 136719, 301428, 676634, 234411, 476887, 600170, 151950, 352257, 188100, 168875, 287757, 360422, -77521, 207609, 333864, 133319, 40644, 255363, 384445, 439677, -93755, 60823, 514860, 715397, 238320, 358135, 245983, 212984, 378989, 452042, -269826, 252710, 341192, -115256, 445304, 518702, 434366, 296317, 212285, 339599, 346430, 479955, 571280, 423478, 245857, 276021, 268584, 158633, 361042, 684086, 606942, 716028, 256428, 235702, 635412, 390784, 589142, 500473, 407416, 117837, 592653, 490270, 182121, 354552, 589579, 308645, 54194]
17083C34823K9700K71663k46614n8586k6557K77615o0010j69442K17530k35822
17073C34300K81240B29573J83736J87395k50912L9243J08614J42292K4176j07410
17063E56707P820B48860L57061j73148n5252o4299L77771B23719K10546J39743
17053E74008m2051M0810A37551K91354A98234M21018j11874k49853L21962O8833
17043F48320Q8099K8223k0805m5598j57563O0009O8580l9568j58282K72976l2382
17032G12009l31946K54870r5906J6402B77366K24419L29510k66597L82495l81455
17022E65738k8790M2721m6443J96647p2632l24162L59572k37996L07393k66150
17012D95898J28815p74Q9938R1943r6628r7556O3138L6492k34051M31334l49976
$$ y = [334823, 364523, 636186, 389572, 330986, 304429, 582044, 522034, 352592, 570122, 334300, 615540, 229573, 413309, 600704, 349792, 389035, 497649, 639941, 664117, 556707, 564527, 248860, 605921, 432773, 377521, 313222, 690993, 223719, 434265, 574008, 531957, 572767, 137551, 428905, 198234, 619252, 507378, 257525, 579487, 648320, 736419, 764642, 743837, 698239, 540676, 600685, 669265, 629697, 471415, 744391, 712009, 380063, 634933, 539027, 555429, 277366, 501785, 831295, 564698, 947193, 565738, 536948, 579669, 533226, 729873, 657241, 333079, 692651, 454655, 762048, 495898, 624713, 623939, 713877, 805820, 709192, 611636, 674774, 711266, 477215, 908549, 558573]
17001E58573K46036B55178M28206K34694Q943q0159k40642j42972L42743k76060
16991E29931K55752o5549P5226J07033R2639J44546k52483J23788n3123j17862
16981H39898O4896P7170k17062J33893r8718j05723K63184k66251L07125L4043
16971A032455m03891O59189k89604l46488K78706j08372q4355Q5004K11404M0081
16961A074129n3541q002J07320p4553L4343L05936j81096l35638K66435Q0550
16951A215883m8188k27588L54092j15923j25204J02410j0347J68398l75872K69637
16941A207298J51043j29194M26793n05597M86J75214J42932n0701m19518J45916
16931A144672Q1759j74924K79594l4158j59141J02103K39232j79176K43789n6308
$$ y = [558573, 804609, 255178, 683384, 918078, 927021, 846862, 606220, 463248, 805991, 529931, 785683, 720134, 795360, 902393, 995032, 1139578, 887095, 1010883, 957760, 839898, 904794, 981964, 764902, 898795, 800077, 694354, 957538, 691287, 998412, 1032455, 628564, 1287753, 998149, 651661, 930367, 821995, 737640, 822644, 1034048, 1074129, 1020588, 1012586, 1119906, 1045353, 1079696, 1385632, 1204536, 868898, 1135333, 1215883, 1167695, 940107, 1294199, 1178276, 1053072, 1155482, 1145135, 1313533, 937661, 1207298, 1358341, 1229147, 1655940, 1150343, 1150829, 1326043, 1468975, 1418274, 998756, 1144672, 1226431, 1051507, 1331101, 1296943, 1137802, 1239905, 1479137, 1299961, 1543750, 1487442]
16921A487442o7255O243j84142K60584J22925n4523q8449J22450L7853M7511M8198
16910A738837k29060J9673L5258q0883p6335L78981j8464M3385Q7587J26338l33635
16899A691682Q3998m8849K07892M4620R6967j72269j01233L66639l03114J69784
16889B036117r0387K56683j92320K85385l85131J07240J38280J05668m60394O69221
16879B470362n23523L86973J25384j10803k04770K44350J16794O5984j12071J84077
16869B642757L48870l62660M81486k10559j25403j50677o7843J70655l2598O3308
16859B757336K13667K14880q8726Q7963m17390P55110j89705J64798m21797K28857
16849C304993j28460M18091J37974j7331L2111R8772k41622K48194j93129j32788
$$ y = [1487442, 1420187, 1426430, 1242288, 1502872, 1625797, 1571274, 1482825, 1605275, 1643128, 1690639, 1738837, 1509777, 1529450, 1564708, 1483825, 1407490, 1786471, 1768007, 1811392, 1898979, 2025317, 1691682, 1775680, 1726831, 1934723, 1979343, 2076310, 1904041, 1802808, 2169447, 1866333, 2036117, 1945730, 2202413, 2010093, 2295478, 1910347, 2017587, 2155867, 2261535, 1801141, 2470362, 1946839, 2333812, 2459196, 2348393, 2143623, 2387973, 2504767, 2570751, 2458680, 2642757, 2991627, 2628967, 3110453, 2899894, 2774491, 2623814, 2555971, 2726626, 2694028, 2757336, 2971003, 3185883, 3097157, 3185120, 2767730, 3522840, 3333135, 3497933, 3076136, 3304993, 3176533, 3594624, 3732598, 3715267, 3747378, 3846150, 3604528, 3852722, 3659593, 3526805]
16839C526805N04653M4890Q512K18516j11065J12231Q7814k51089M88082L40393
16829D969742n43029K56197n6710Q8126L52297L85003Q8874J74482q7257l86K47308
16818E874647k81325K25172K15726J63588M22248P3813j29704J54608n829J18221
16808F831165N49839j45378L85485J9175M97688k20291O96866k31897O2311K41962
16798H686925K93195L51618K54281K2209M54324P6617J49713O71430j39776N44053
16788A1364589P95255j91187M41923J78754K69189J01114Q99096L72010P4548
16779A4305291M19176R25589L40089J68135P16056M42378Q10193L10434R80092
16770A9417433Q69249J73062J059693N09186R56629J140316L64927J107952R33962
$$ y = [3526805, 4031458, 4076348, 4084860, 4303376, 4192311, 4304542, 4392356, 4141267, 4629349, 4969742, 4426713, 4682910, 4626200, 4714326, 5066623, 5451626, 5540500, 5714982, 5627725, 5627339, 5874647, 5593322, 5818494, 6034220, 6197808, 6620056, 6693869, 6564165, 6718773, 6712944, 6831165, 7381004, 7235626, 7621111, 7640286, 8137974, 7917683, 8614549, 8382652, 8444963, 8686925, 8980120, 9331738, 9586019, 9608228, 10062552, 10139169, 10288882, 10960312, 10820536, 11364589, 12159844, 11968657, 12410580, 12589334, 12858523, 12959637, 13858733, 14230743, 14305291, 14724467, 15650056, 15990145, 16158280, 16874336, 17316714, 18126907, 18437341, 19417433, 20286682, 20459744, 21519437, 22028623, 22985252, 24125568, 24490495, 25598447, 26532409]
16761B6532409J203433J124581J296525J184771J165085J574150J352320J550900
16753C6984174J887828J858570J392949K725132J961096J892293K702623K719755
16745E4124420K632465L364620K728344L162429L672843M039673M266679M443282
16737H2434755M267323N125687N217329N713472N694599N663291N952218O630267
16729A26698941N934841O845328O435235O421398N799833N772478M894185M692862
16721A73495101L516291K622393J735240O08286m00976j444853k477520l240642
16713A74413320m400858n327637n314341o023890o535450o145398o750856o458782
16705A27456108o544518o287240o003916o084633n469707n471180m888211m963325
$$ y = [26532409, 27735842, 28860423, 30156948, 31341719, 32506804, 34080954, 35433274, 36984174, 38872002, 40730572, 42123521, 44848653, 46809749, 48702042, 51404665, 54124420, 56756885, 60121505, 62849849, 66012278, 69685121, 73724794, 77991473, 82434755, 86702078, 91827765, 97045094, 102758566, 108453165, 114116456, 120068674, 126698941, 132633782, 139479110, 145914345, 152335743, 158135576, 163908054, 168802239, 173495101, 177011392, 179633785, 181369025, 181977311, 181576335, 180131482, 177653962, 174413320, 170012462, 164684825, 159370484, 153346594, 146811144, 140665746, 133914890, 127456108, 120911590, 114624350, 108620434, 102535801, 97066094, 91594914, 86706703, 81743378]
16697H1743378m208781m387467l822262l841651l365463l077697l101317k704623
16689E3234117k702345k477726k527394j984148k300736j941066j771089j562085
16681C5967528j574224j504587j362998j280654j346764j173059j276847j125116
16673B5323279n33390j171653j073360o75351o63919o82824j027998o02317j074845
16664A7817622k63740l61247p78674o25887r4994q72553o00714k57832m97680
16655A3464301k91905m66961j94239q03094k00727l51833j50732m48300J00791
16646A0657301m22606n18718j11943j48102m93080k10965k9577O1533p78868j83423
16636G821552J15942l35191Q7295q6614n84635P3891m1069k53910m36119N7016
$$ y = [81743378, 77534597, 73147130, 69324868, 65483217, 62117754, 59040057, 55938740, 53234117, 50531772, 48054046, 45526652, 43542504, 41241768, 39300702, 37529613, 35967528, 34393304, 32888717, 31525719, 30245065, 28898301, 27725242, 26448395, 25323279, 24789889, 23618236, 22544876, 21869525, 21205606, 20522782, 19494784, 18892467, 17817622, 17553882, 17192635, 16413961, 15788074, 15693080, 14820527, 14219813, 13961981, 13464301, 13172396, 12705435, 12511196, 11708102, 11507375, 11155542, 11004810, 10556510, 10657301, 10234695, 9715977, 9604034, 9455932, 8962852, 8751887, 8722310, 8783843, 8004975, 7821552, 7937494, 7602303, 7689598, 7602984, 7018349, 7092240, 7051171, 6797261, 6361142, 6418158]
16626F418158k54174k8648j92300P1641l00387N2375l09561J31232k34904J40717
16616E494149j74653n5466j08424m99567Q5780p2972j23353l08499J19923j16225
16606D240693j73662r2053p0099N17813m85873m8578k8711k74579K8044K0008
16596C633003k10184L71593l44348J52964m85614J00858J97837O2812l24430r115
16586C145376n1648k46034K85734m85413N24497k44896r6758K02519k35605l89454
16576B408318L64825j83003j39187K55691k50387l4428L09772m48048j47825k4944
16566B110784K4176K9207k65782N68209l13382j42353L80535k92256l06950K72448
16556B064636o9637J37568j73287j70644k02091J32183J11092Q1664M5926k59657
$$ y = [6418158, 6163984, 6135336, 5943036, 6014677, 5714290, 5766665, 5457104, 5588336, 5353432, 5494149, 5319496, 5264030, 5155606, 4656039, 4741819, 4668847, 4545494, 4236995, 4356918, 4240693, 4067031, 3974978, 3904879, 4422692, 3936819, 3888241, 3859530, 3584951, 3612995, 3633003, 3422819, 3794412, 3450064, 3603028, 3117414, 3218272, 3416109, 3478921, 3154491, 3145376, 3093728, 2847694, 3133428, 2648015, 3172512, 2927616, 2830858, 3033377, 2797772, 2408318, 2773143, 2590140, 2450953, 2706644, 2456257, 2421829, 2731601, 2283553, 2135728, 2110784, 2134960, 2164167, 1898385, 2466594, 2153212, 2010859, 2391394, 2099138, 1792188, 2064636, 1994999, 2132567, 1959280, 1788636, 1586545, 1718728, 1829820, 1911484, 1957410, 1697753]
16546A697753K9288j40721r0024K09049J64839j30247N4487k24064L8820J4065
16536A623245j56864J4371r6162j2895J71152k70702K42462j49695j02111K58389
16526A521190k49933J95281k70796K20999L01478l50366l0922j82341K43242k04423
16516A193409L67804p0976j43776l91004J00881K88039j33507J39986k39750j42874
16506I68232O083L279p3444N5001j93320j93903K18312M38111o7457k48714J43106
16495A055286j68387R2572J13751m15751K39823J44246l12819m4594j79714N51231
16485A075644k9362m10076M1737K36154k39804J89260K57003j74830l16584K23263
16475H52405K3734J25885M0154m91724K72903o5469k3689l0971J96660j267k46131
$$ y = [1697753, 1727041, 1586320, 1496296, 1705345, 1870184, 1739937, 1794424, 1570360, 1609180, 1623245, 1466381, 1480752, 1384590, 1371695, 1542847, 1272145, 1514607, 1364912, 1262801, 1521190, 1271257, 1466538, 1195742, 1416741, 1718219, 1367853, 1336931, 1154590, 1397832, 1193409, 1561213, 1490237, 1346461, 955457, 1056338, 1344377, 1210870, 1350856, 1111106, 968232, 974315, 977594, 904150, 959151, 765831, 571928, 790240, 1228351, 1160894, 912180, 1055286, 886899, 979471, 1093222, 677471, 917294, 1061540, 748721, 704127, 524413, 1075644, 1046282, 636206, 677943, 914097, 674293, 863553, 1120556, 945726, 629142, 852405, 876139, 1002024, 1042178, 550454, 823357, 757888, 734199, 703228, 899888, 898621, 652490]
16464F52490K18525k77562k82772N50084j42995k24948M6672J01610L96367k61756
16454G75715j17044J56272R3727l40107N8381J66898k42215J3309L84506k60652
16444F88790C27649M74302j40702L169j49968O5002p5079J37687k9441o6208N3582
16433E99993j18799K48654k03084m7163J45468Q3461k37696L04126k95249J63435
16423F43146j24861M6580J70694B45144q8099L02849B16070J93969l1974K45604
16413F23669j14916J46545B55759j7875Q0762j7280n3628K70506l354M1043j66521
16402C89412o5361K71420K28005l91677L5745q2106J3373P2663j67044K6434L02107
16391F32971C14130A22997K81507j28043L84661B51025M1852l4525j8269A08127
$$ y = [652490, 871015, 593453, 310681, 860765, 717770, 492822, 539494, 641104, 1037471, 775715, 658671, 814943, 908670, 568563, 626944, 793842, 551627, 564936, 949442, 688790, 327649, 801951, 661249, 664418, 514450, 579452, 504373, 642060, 612619, 546411, 599993, 481194, 729848, 526764, 479601, 625069, 708530, 470834, 774960, 479711, 643146, 518285, 564865, 735559, 245144, 157045, 459894, 216070, 410039, 378065, 623669, 508753, 655298, 255759, 237884, 318646, 301366, 247738, 518244, 514890, 555933, 389412, 324051, 595471, 823476, 431799, 467544, 385438, 398811, 471474, 304430, 330864, 632971, 314130, 122997, 404504, 276461, 661122, 251025, 292877, 258352, 240083, 108127]
16380B81974A28091L09403A02454K01848O1476A42408J27635J37889A56107J46266
16370C02373J86953m677A44102K09294j16276K41877l0548k19986N1232L50076
16360F29771l03492M671p9549A16187J37317O72N0389J17751A68104O1679q8388
16349A41395K45505J74596A04659J61767Q3435J63171k49382j15109K34174A19547
16338C84761R2300M1312p6907F0480M29506G4606J89265N1696k0563H0238J06264
16327A86502O11270l52576r9456n0095f5920F50115E1370J4360L79092a07836
16316F51523b1075A00284J58288M580P4198J77275A97899O3796F7450J76521A1157
16304A03864l4959k1347K13613O7728D0438K24602g3374a0117D41774j53795A33479
$$ y = [281974, 128091, 437494, 102454, 304302, 365778, 142408, 270043, 407932, 156107, 302373, 489326, 484649, 144102, 353396, 237120, 478997, 448449, 228463, 279695, 629771, 326279, 330950, 251401, 116187, 253504, 254176, 304565, 422316, 168104, 229783, 141395, 386900, 561496, 104659, 266426, 349861, 513032, 263650, 148541, 382715, 119547, 384761, 477061, 518373, 441466, 60480, 489986, 74606, 263871, 315567, 295004, 80238, 186502, 797772, 445196, 345740, 295645, -65920, 650115, 51370, 65730, 444822, -107836, 651523, -21075, 100284, 258572, 263152, 337350, 514625, 197899, 261695, 67450, 243971, 11157, 103864, 68905, 47558, 261171, 328899, 40438, 265040, -73374, -10117, 441774, 287979, 133479]
16292d14318D03611p0280b8952C28953A5589a43153D34637i0115C05080D2527
16281A01224C3289M98995A03303j0574J4921J72683h5979H331J86281P3817F1781
16269A59986A7701J97038K05680B01207b9426j06562A00126C6806L0642J49785
16259B17233a03901A81290n429k737a17063A87349r844a02047D5842J61298M5074
16248B52214I0087J52844n3279J03864K21872F2870a9330A72067J49936A11725
16237A8729L24483J30607j88936o5194l706p5938q919c77460C42289a1566B7368
16225C74436j53620E2968c15962C19232c06416C7321L97793j45896A40922n514
16215A35408J92657E0439J85031b25876I7443a01587I2266J13869M3256g6873
$$ y = [-414318, 403611, 333331, -28952, 328953, 15589, -143153, 434637, -90115, 305080, 42527, 101224, 33289, 532284, 103303, 92729, 107650, 280333, -85979, 8331, 194612, 268429, 61781, 159986, 17701, 214739, 420419, 201207, -29426, -135988, 100126, 36806, 67448, 217233, -103901, 181290, 175861, 173124, -117063, 187349, 177505, -102047, 45842, 207140, 252214, 90087, 242931, 189652, 293516, 515388, 62870, -19330, 172067, 322003, 111725, 18729, 343212, 473819, 284883, 219689, 215983, 140045, 131126, -377460, 342289, -11566, 27368, 374436, 220816, 52968, -315962, 319232, -306416, 37321, 435114, 289218, 140922, 135408, 328065, 50439, 235470, -225876, 97443, -101587, 92266, 206135, 249391, -76873]
16204B01580j00526c33417D8695A7988b59203E7812O2879Q1519n1386N7946F7579
16192I1221c95596a1484B22562E2714a88514B94163d808j15653B40865j4393J16604
16181C43076E8149h3150A42244i8811A63366m4957a86662f2181F0479R0273c32586
16169b07208B26783a32147A34573n4073c93390B81976d788m8196f316C6297a64087
16157a64074F01388B06725a21402B9317J70419A748J63621O4481D0920a7352n6154
16146g3506B16688k0652a46871A29202j2567b26329A00068C0097J61859L7937
16136B29893p5559a33305j70071a50121A47813D1623K97454A12525P4474L3299
16126B20298h5622C75603A36259K35670I904O858a22026b296n0354j72609B35178
$$ y = [201580, 101054, -333417, 48695, 17988, -259203, 57812, 120691, 202210, 150824, 208770, 67579, 91221, -395596, -11484, 222562, 52714, -188514, 294163, -4808, -120461, 240865, 226472, 343076, 58149, -83150, 142244, -98811, 163366, 118409, -186662, -62181, 60479, 150752, -332586, -207208, 226783, -132147, 134573, 80500, -393390, 281976, -4788, -52984, -6316, 36297, -164087, -164074, 601388, 206725, -121402, 29317, 199736, 1748, 165369, 229850, 40920, -17352, -73506, 216688, 196036, -146871, 129202, 116635, -226329, 100068, 30097, 191956, 229893, 154334, -133305, -303376, -150121, 147813, 41623, 339077, 112525, 186999, 220298, -85622, 375603, 136259, 371929, 9904, 16762, -122026, -2296, -52650, -225259, 235178]
16114i7552A50429a21256j9933B38033b05858A60410a04364F5265J54910o7630
16104A52545a39375O4924k2562A23731a6457m3319a5064A4964e0597j52089K9301
16093a73385c4943l2769F9504b86292N2012B91743a33435A68672a71059M661B81464
16081b68004h0704F1919Q5453E0771a39893B95612c39435F5621K17053C1315L0806
16070F2121J53243L70082b2896C18151a37438B86431a34939A08541e6379m03963
16060d60342E3349a89337j254B70420q4618H7569a63879A39750K0620g8550l3552
16049a12102d4811A12026a4258B1386J10142c10334A11505C3234e0655E9851J5253
16038G5104b06999H4933J40073p5305m8260c04698A30082a17567B63899A11203
$$ y = [-97552, 150429, -121256, -141189, 238033, -205858, 160410, -104364, 65265, 220175, 152545, -139375, -74451, -97013, 123731, -16457, -59776, -15064, 14964, -50597, -202686, -173385, -34943, -67712, 69504, -286292, -234280, 291743, -133435, 168672, -171059, -166398, 281464, -268004, -80704, 61919, 147372, 50771, -139893, 295612, -339435, 65621, 282674, 31315, 62121, 215364, 585446, -22896, 318151, -137438, 286431, -134939, 108541, -56379, -460342, 53349, -189337, -190591, 270420, 185802, 87569, -163879, 139750, 160370, -78550, -112102, -44811, 112026, -14258, 21386, 131528, -310334, 111505, 33234, -50655, 59851, 75104, -206999, 84933, 225006, 149701, 101441, -304698, 130082, -117567, 263899, 111203]
16027a29314A73791b76872N5829K3792P6143G9453d2627k8841D3097N15173g0716
16015a39403e4215k72426a2877p3624b8389A36944J2257b06594e9436B38893c43361
16003H4791i4420d5968J344j5038B14688q5458i724i11H0313R7742a3357A54729
15990A67598a18374A1863h4486l3097B8604K26227m1821j6919L47296A26106L55633
15979D81739j86099d5915D3070h8593A5787a83977I8903J9210m2237J06044C1144
15967d43861f93I1585R608B4124J91298b45189B47876d7374j99713a21414j23672
15956b45086c6338A05443M9308c27228o0640E9179A1162J25960N500a06083l2084
15945a38167p8575B28674H2055e2100k50567C01608a46816f4278F8857L6671L19328
$$ y = [-129314, 173791, -276872, -221043, -197251, -121108, 79453, -42627, -71468, 43097, 558270, -70716, -139403, -54215, -326641, -12877, -86501, -28389, 136944, 149201, -206594, -59436, 238893, -343361, 84791, -94420, -45968, -44624, -59662, 214688, 129230, -9724, -911, 80313, 178055, -13357, 154729, 167598, -118374, 11863, -84486, -117583, 28604, 254831, 213010, 196091, 543387, 126106, 481739, 295640, -45915, 43070, -88593, 15787, -183977, 98903, 118113, 75876, 181920, 31144, -443861, -693, 91585, 101193, 24124, 215422, -245189, 247876, -47374, -247087, -121414, -245086, -36338, 105443, 154751, -327228, -387868, 59179, 11162, 137122, 142622, -106083, -138167, -216742, 228674, 82055, -52100, -302667, 301608, -146816, -64278, 68857, 105528, 424856]
15934D24856d2353r450q8381O2258A05272A9287a11271b6416B54633a36040D2678
15922D86043A81855B8220K09672i8234A40000b57796K7086K3745L5500C52588
15911A44624c94819a77172A82089i5912B22716e5333J5683B37123d3372j70708
15901b14080A01849D1942J90710F4131J8124b61365E09590B9953a59669n0702
15891b10371j37340d235A64877D7629Q0967a26764N2132a4949F2473a31011b0210
15879g8835j42022D9003e6495A19455a66273F0554J03561b75974f355E2837i7612
15867c05927D5187a3077A23588k3359B3651a45811N1267k83887B86786c2580p3546
15856a06126M3340b6745B57312a83810K4775A24683b27789e3031B9609c32841
$$ y = [424856, -42353, -51803, -140184, -77926, 105272, 19287, -111271, -26416, 254633, -136040, 42678, 486043, 181855, 28220, 237892, -98234, 140000, -257796, -230710, -206965, -171465, 352588, 144624, -394819, -177172, 182089, -95912, 222716, -55333, -39650, 237123, -43372, -214080, 101849, 41942, 232652, 64131, 82255, -261365, 509590, 29953, -159669, -210371, -347711, -4235, 164877, 47629, 128596, -126764, -74632, -14949, 62473, -131011, -20210, -78835, -220857, 49003, -56495, 119455, -166273, 60554, 164115, -275974, -6355, 52837, -97612, -305927, 45187, -13077, 123588, 100229, 23651, -145811, -94544, -378431, 286786, -32580, -106126, -62786, -26745, 257312, -183810, -159035, 124683, -227789, -53031, 29609, -332841]
15845a64707O1277L8768m04387c4558J2108D6912J4220b99772A7000N0767A3148
15833A13819c26032N7286A09175c42258B49005f620j09044B1491b02301o6860
15823b69161A24248E452a72133P0644j67573d2690j2574k06249e0413r2958p2403
15812b15774b8614n4257a3766n751n3116A02254a98165F3294M7478a3367l5105
15801d8472j92613j73272A60164C3639J16761a6389k14326h9373A51657K47238
15791C98895b23986e8108r0285j16022b7561A98438b14686a1597C0735i5435A59604
15779H2277A1649K97646c96200R2196a13590K58D97865C891K5103J64040C9742
15767b04300a3640C14651J1868b32766Q9614A37910b6151D9435F933M2310a73563
$$ y = [-164707, -103430, -64662, -469049, -34558, -22450, 46912, 61132, -299772, 17000, 67767, 13148, 113819, -326032, -268746, 109175, -342258, 249005, -6620, -115664, 21491, -202301, -269161, 124248, 5452, -172133, -101489, -269062, -42690, -55264, -261513, -50413, -143371, -215774, -28614, -82871, -13766, -19517, -72633, 102254, -198165, 63294, 110772, -13367, -48472, -241085, -414357, 160164, 33639, 150400, -16389, -230715, -89373, 151657, 398895, -223986, -58108, -148393, -264415, -27561, 198438, -214686, -11597, 30735, -95435, 159604, 82277, 11649, 309295, -396200, -304004, -113590, -113332, 497865, 3891, 28994, 193034, 39742, -204300, -13640, 314651, 326519, -232766, -143152, 137910, -26151, 49435, 6933, 49243, -173563]
15755A57044K1209n8317C1024Q6823m411L299B5402J81638F5130Q3184m8427f3703
15742A6818K20620c6850n7973p9233b0087l59513D6658b18273I7930a8078m314
15731b2392m6053k10853a15856j77955A91217a53969D2954a05025j22313A98064
15720a06240b986E5149b42056M8640j48939J64433E4253a62123o5346A41372a86211
15708C29311g0079j62963A21810i1803A7988a51471A43837r851j1690l9948B2644
15696H0867L80239A7132R4317P640g9954a7726A29305a294n3605A11470A0941
15684c1877A46247m0855a75877j14825E942K65756e5830A5219b41249A00542J95758
15673B96300B8031L61101A76445Q003b44055O5202j52329H9295a42436L9965G733
$$ y = [157044, 178253, 119936, 31024, 117847, 113436, 116735, 25402, 207040, 65130, 148314, 99887, -63703, 16818, 237438, -36850, -94823, -174056, -20087, -379600, 46658, -218273, 97930, -18078, -22392, -68445, -279298, -115856, -293811, 191217, -153969, 42954, -105025, -227338, 198064, -106240, -2986, 55149, -242056, -193416, -342355, -177922, 54253, -162123, -227469, 141372, -186211, 329311, -70079, -233042, 121810, -91803, 17988, -151471, 143837, 133986, 122296, 82348, 22644, 80867, 461106, 17132, 111449, 119089, -79954, -17726, 129305, -1294, -54899, 111470, 10941, -31877, 146247, 105392, -175877, -290702, 5942, 271698, -55830, 15219, -241249, 100542, 296300, 28031, 389132, 176445, 184448, -244055, -178853, -331182, 89295, -142436, -102471, 7733]
15661B7803c2113r3733N1268a2173A15569D8628b16717g9141A70433o0877P3560
15650A83116E0210b60235A07400r541b2565n1952n9585a6010A22505D8935a41905
15638A88354a50984O3237b9116E2075d5057B0562J39957p4946K45243b70172A22122
15626b05337h4103b367F8812a79836M7729M9860M079K988j91688I3754c4784J7013
15614a7771B01998j2570c26934A59477g930p5012j36526d249j19520q5908B1072
15602a06546F2910k9221a36918C8788c68833J10364b7447r9210j08036e6902A6763
15590h0588c9334q0411c6615j50425g3649A86355a02530I8944b4632E4203a0699
15578F4887b69364d5818A96508c9638q4243N0558A27741i2476l947A12482d8955
$$ y = [27803, -32113, -125846, -74578, -12173, 115569, 48628, -216717, -79141, 170433, 109556, 183116, 50210, -260235, 107400, 97859, -22565, -74517, -134102, -16010, 122505, 48935, -141905, 188354, -150984, -87747, -29116, 52075, -45057, 20562, 160519, 85573, 330816, -270172, 122122, -205337, -84103, -2367, 68812, -179836, -132107, -82247, -78168, -75180, -266868, 93754, -34784, -17771, 201998, 189428, -326934, 159477, -7930, -82942, -219468, -4249, -123769, -209677, 21072, -106546, 62910, 33689, -136918, 38788, -368833, -258469, -27447, -126657, -234693, -56902, 16763, -80588, -39334, -119745, -36615, -187040, -73649, 186355, -102530, 98944, -24632, 54203, -10699, 64887, -269364, -45818, 196508, -39638, -123881, -73323, 127741, -92476, -96423, 112482, -48955]
15566b69931A4757a32224A11029L14799a10896G6841N2180a30079B2885J75975
15556A98860B6704n498M3519b11863m865A6783a5461e063l19222A87442l1669
15545A55773a60120r4283B04196a03132J1515j8055j69410f5937p6271F9219a5974
15533D4073h9916j38563d8543K839k4989b9939k0086A70386b76313Q6175k2875
15522b13013C19576b1300q5412L9458k37726I6081J1705l0526a17963e2703E345
15510C42641f8994B03130b4645j0214k87632d1244I6012f0962A30057a22210q443
15499a30653L2535j49465p7919A84801b5673A7537a92408e7771A41174A4936b12160
15487a89083q0760D0776a12692o0725b5684k42253J19200C9503f9011A44139a16717
$$ y = [-269931, 14757, -132224, 111029, 425828, -110896, 76841, 129021, -130079, 22885, 198860, 26704, 21206, 64725, -211863, -216728, 16783, -15461, -5063, -324285, 187442, 155773, -160120, -254403, 204196, -103132, -91617, -109672, -279082, -65937, -142208, 69219, -15974, 44073, -89916, -228479, -48543, -45704, -70693, -29939, -50025, 170386, -276313, -190138, -213013, 319576, -21300, -106712, -67254, -304980, 96081, 107786, 77260, -117963, -52703, 5345, 342641, -68994, 203130, -24645, -34859, -322491, -41244, 96012, -60962, 130057, -122210, -130653, -98118, -247583, -325502, 184801, -25673, 17537, -192408, -57771, 141174, 14936, -212160, -189083, -269843, 40776, -112692, -173417, -25684, -267937, -148737, 39503, -69011, 144139, -116717]
15475A44472L6027g2625A24381D6777D485J4738K6831a33899k70592I4124O2804
15464A56928A9559b52214G0021f0506B31769e3552l63806a69315A5851e2436l3504
15453h5940b8056D9536N5280a74974B9831J05709f4634r6026j28821a41988A14505
15441E2270a08868A54290J14166j23252a28859j99943B7056a62014A7256J54439
15431A71695m4855D4605K86052I5979a34809K6849l6183A65989p0422G486a63928
15419F1558a61835C06708a88783Q3983A26785E1671J86008C892J70631O7239a89607
15407C04022H6289c99469A33551K5754b58337A7545J13409a11268A06399a07741
15396h0608H3825N5942n2096a16391G9270K40748I0546C3324g7682j24376A37096
$$ y = [144472, 180499, -72625, 124381, 46777, 4485, 19223, 46054, -133899, -404491, 94124, 156928, 19559, -252214, 70021, -60506, 231769, -53552, -417358, -169315, 15851, -52436, -85940, -28056, 49536, 104816, -174974, 29831, 135540, -64634, -160660, -289481, -141988, 114505, 52270, -108868, 154290, 268456, 145204, -128859, -328802, 27056, -162014, 17256, 171695, 126840, 44605, 330657, 95979, -134809, -107960, -144143, 165989, 95567, 7486, -163928, 61558, -161835, 306708, -188783, -104800, 126785, 51671, 237679, 3892, 174523, 241762, -189607, 304022, 86289, -399469, 133551, 159305, -258337, 17545, 130954, -111268, 106399, -107741, -80608, 83825, 139767, 87671, -116391, 79270, 320018, 90546, 33324, -77682, -202058, 137096]
15384A33053b07325A94778i8017r9690A78198G8569J40632g7916A91831H6223
15373b07285f9991A98939M6384A00945D9783i4750B64926c40684b3080C19629
15362C53669b93227A22914j9761N0495b54567L3943h585k03140I2735P1367a39381
15350a45614A95303G0725P5962a27019A08253K8596c69815a6800A68229o3187
15340A05042l0650R5188a45890r493P1750A80718b35948B04101P7782o9016b85949
15328A13111E1391J36219a60224A09151J01634O2357j22816a73834C01593A8754
15317h0041I9146K12733F0715P0251a64681A31114K5402K49518a72312A10405
15306C23276C1489J999h4444A46997k6273c131B6150J65302F5511j3930K00957
$$ y = [133053, -207325, 194778, -98017, -197707, 178198, 78569, 219201, -77916, 191831, 86223, -207285, -69991, 198939, 245323, 100945, 49783, -94750, 264926, -340684, -23080, 319629, 353669, -293227, 122914, 103153, 153648, -254567, -220624, -8585, -211725, 92735, 164102, -139381, -145614, 195303, 70725, 146687, -127019, 108253, 136849, -369815, -16800, 168229, 105042, 74392, 169580, -145890, -155383, -83633, 180718, -235948, 204101, 281883, 212867, -285949, 113111, 51391, 187610, -160224, 109151, 210785, 273142, 150326, -173834, 301593, 18754, -80041, 99146, 311879, 60715, 130966, -164681, 131114, 156516, 406034, -172312, 110405, 323276, 31489, 33488, -84444, 146997, 120724, -3131, 26150, 191452, 65511, 51581, 252538]
15295B52538d7416j82764i9818n9796D28392b23932B46159g67r721D4838b20910
15283B9564K34126I54J95214e7393b6884B9832d8690B28114J30809b21536f1362
15271C05572a21806A69132f5138A05392J48270P558I0688a19767k1033A43291
15260a21768j13068H1488J34008G9236h3291a5726F5154a50363A08723N5057J74172
15249C37952P00041L40134M7981l93112l77783n9638A27978b31291C1563K76216
15239C07779a44571D00475b44540C30877E7724I206a68374d187j4976m2171R052
15228e2282B22704b36801C8689R2286e787l5811k1484B0446J3852J10409f2733
15216B849a3755D3725M50827f1958j02831N0495k67972a55649A51362K5749b81204
$$ y = [252538, -47416, -230180, -99818, -159614, 428392, -223932, 246159, -767, -10488, 44838, -220910, 29564, 263690, 954, 196168, -57393, -26884, 29832, -48690, 228114, 358923, -221536, -61362, 305572, -121806, 169132, -65138, 105392, 253662, 261220, 90688, -119767, -140800, 143291, -121768, -234836, 81488, 215496, 79236, -83291, -15726, 65154, -150363, 108723, 163780, 337952, 1037993, 1378127, 1426108, 1032996, 655213, 595575, 127978, -231291, 31563, 307779, -144571, 400475, -244540, 330877, 57724, 9206, -168374, -4187, -19163, -61334, -52282, 222704, -236801, 38689, 130975, -5787, -41598, -63082, 20446, 34298, 144707, -62733, 2849, -13755, 43725, 494552, -61958, -164789, -114294, -382266, -155649, 151362, 177111, -281204]
15204B73186K6597M4875a20231b397C1282L5072a26278H7275O8884o3214A7583
15192A95495G696K05943G7331a19015B91750A42590L81621j13182e2289B82496
15181d1103a5273A49020r108C9778K05271n0301D7616B3324M29523b35377A3949
15169B28156c9538j50101D2270J13142A8614J91851i338H6580O2424b4633F8906
15157B51782p2561D6221p927L4414B4931M3464c11837A8545e9475E5741g2269
15145A81374A0164J62995G5434J08016C5255d3916B7892Q5321K01930j44376m5772
15134A24995K0358M97690a7453D9558d8291A70922j0789h5132a0953F3335a0565
15122d9439C97611A34548J9715j8759e697B07204m1819l1157c1278B8673L4375
$$ y = [273186, 299783, 344658, -120231, -2397, 31282, 66354, -126278, 87275, 156159, 92945, 17583, 195495, 7696, 213639, 77331, -119015, 291750, 142590, 524211, 411029, -52289, 282496, -41103, -15273, 149020, 139912, 39778, 245049, 194748, 47616, 23324, 452847, -235377, 13949, 228156, -39538, -189639, 42270, 155412, 18614, 210465, -9338, 86580, 149004, -24633, 68906, 251782, 179221, 46221, 38294, 72708, 24931, 68395, -311837, 18545, -59475, 55741, -72269, 181374, 10164, 173159, 75434, 183450, 35255, -43916, 27892, 113213, 315143, 170767, 124995, 145353, 643043, -17453, 49558, -48291, 170922, 160133, -85132, -10953, 63335, -10565, -49439, 397611, 134548, 154263, 135504, -5697, 207204, 165385, 134228, -31278, 28673, 63048]
15111F3048k8141J79811Q457F7570M17025A48156n4073N5187g7679A86710H4581
15099A8432a2424r1744A57952J66139n0863E5441a10794K9968I5472l8943i0291
15087a2496A45052m3455a12396E36660B9557j1409K12560J2034I1116J4434J38533
15076B44083p8648H2290J54597a43501A60898C9638L56271J88115b0858A13035
15065C33242a6808c684r135E3560J7159j8036J53085O6979E2942K54200j40044
15054A67098c7596E59554H8178a78958b1712B25463a478B46892h9939B18629m0696
15043A77933E4246J29479J36042R5892m7462j02152j05190A5703N67708k74213
15033C09198l3933n6943J04974J0278j47940R6716q4342q7680J27380K04442G7
$$ y = [63048, 34907, 214718, 223175, 67570, 484595, 148156, 94083, 149270, -77679, 186710, 84581, 18432, -12424, -104168, 157952, 324091, 273228, 55441, -110794, -80826, 95472, 56529, -90291, -12496, 145052, 101597, -112396, 536660, 29557, 18148, 230708, 242742, 91116, 105550, 244083, 165435, 82290, 236887, -143501, 160898, 39638, 395909, 584024, -20858, 113035, 333242, -16808, -3684, -12819, 53560, 70719, 52683, 205768, 272747, 52942, 307142, 167098, -37596, 559554, 88178, -178958, -21712, 225463, -1478, 246892, -89939, 218629, 177933, 54246, 183725, 319767, 415659, 368197, 266045, 160855, 15703, 583411, 309198, 275265, 218322, 323296, 333574, 185634, 282350, 198008, 110328, 237708, 442150, 77]
15021C60812b49178B60537q7569J67596C5624K07192J72395j50763j26786l626
15011A34036d4879A25242L32595A52560m8161b10356D35980F235J47095j7368
15001A35962f8063C85268m5752a99747A18867Q7422G1457J35002Q6961l6271J26444
14990C83593j72934r7248J25828D2815M24617b14669E46329A20072L289g924I1148
14978F4401J42236D1742A5138K89471E4210K84420E8285M18843B22355J2978K9161
14967B64494I3571J89579R5905a83383B88499K30322q8807H8804M06108I5321
14956C32795r7253p5504J38176j39637J47222K56928g0964C42558K03779B24696
14945C51292F4085L07270A37103L69379A80832A9666L18616A68778N4205j6220
$$ y = [360812, -249178, 260537, 172968, 340564, 35624, 242816, 415211, 264448, 137662, 134036, -44879, 125242, 457837, 152560, 104399, -210356, 435980, 6235, 153330, 135962, -68063, 385268, 339516, -199747, 118867, 206289, 71457, 206459, 293420, 257149, 383593, 210659, 113411, 239239, 42815, 467432, -214669, 546329, 120072, 123361, -7924, 91148, 64401, 206637, 41742, 15138, 304609, 54210, 338630, 58285, 477128, 222355, 235333, 264494, 93571, 283150, 379055, -183383, 288499, 518821, 430014, 88804, 494912, 95321, 332795, 235542, 160038, 298214, 158577, 305799, 562727, -70964, 342558, 546337, 224696, 351292, 64085, 371355, 137103, 506482, 180832, 19666, 338282, 168778, 222983, 206763]
14935B06763J37785n5453K44362H2906M9842K3171K4577M8541K21355B12324n3380
14924A58944k7325N5415j396J68217J3636m8418l8239L1429a10522D12335j56293
14913B56042J88695M30J4157j40802p921j00131A00106Q1378m2930L57663k13191
14902B83026L00286f6182j95553B60431k5752J82761A48559d5422D50322A71847
14891A83313Q9639O2935A51509K95890c6308E09990j00191j66947Q0311J29875
14881D53038J37224J32765k38427o1674k10388N6567H8842J75068J85014j10245
14871C38679J1505L11355A81191K53924A53116K95715k3730b16251C64322L5333
14861C99655j10278M4700j7428r4300L7718Q977P3674j9295K19692n6386K99293
$$ y = [206763, 344548, 289095, 533457, 82906, 132748, 155919, 180496, 229037, 450392, 212324, 158944, 131619, 187034, 185638, 353855, 367491, 319073, 280834, 312263, -110522, 412335, 256042, 444737, 445167, 459324, 318522, 310601, 210470, 100106, 181484, 138554, 496217, 283026, 583312, -66182, -261735, 260431, 234679, 417440, 148559, -45422, 450322, 171847, 183313, 272952, 335887, 151509, 447399, -36308, 509990, 409799, 242852, 323163, 453038, 590262, 723027, 484600, 422926, 212538, 269105, 88842, 263910, 448924, 338679, 350184, 661539, 181191, 435115, 153116, 448831, 425101, -216251, 364322, 399655, 289377, 334077, 316649, 222349, 260067, 269044, 342718, 323423, 543115, 486729, 786022]
14850G86022l32278A36203M83536q1380A33659M28788m0767O0406B01864J13212
14840C15076B5663J49519M80883A22203K69216J84530M3567k44386K10988Q8288
14830F74406q0308k19166o1528J94006r5631K30450A40814K94894p5833M5742
14820D05617j01754K56433j92480K00812j33788K27531B30892N00834p4503j00541
14810E56682j15715P3770P9020p4892j63658J40056k31278N05921N5127l80201
14800D44832J08383j51440m3829M3210j39814M01037j25842j55309J76370r4066
14790D63532M87724l06503k99058K02689j65370K2722j9995K94783Q2334k8830
14780G34028j43385o1363K70886B65917M91103N2675l88061k9994j75422L59551
$$ y = [786022, 453744, 136203, 619739, 538359, 133659, 562447, 521680, 582086, 201864, 315076, 25663, 175182, 656065, 122203, 391419, 575949, 619516, 375130, 586118, 674406, 594098, 374932, 313404, 507410, 411779, 642229, 140814, 435708, 359875, 405617, 303863, 560296, 367816, 568628, 434840, 662371, 230892, 731726, 657223, 556682, 440967, 514737, 593757, 518865, 355207, 495263, 263985, 769906, 825033, 444832, 553215, 401775, 357946, 401156, 261342, 662379, 536537, 381228, 557598, 463532, 951256, 644753, 345695, 548384, 383014, 405736, 385741, 680524, 762858, 734028, 590643, 529280, 800166, 265917, 757020, 809695, 421634, 391640, 216218, 575769]
14770E75769j67064Q5344R8976k77083K50139k6025j3826j0420P9436r5679O4009
14759E63576J14789k34474m8107J91616J6365J25459q8528o228j59546J30065
14749F04987R6713L4211k5668k13482L44789k43240k53987K33117M5929k26984
14739C96385M89159m27115J77297l3995J02285M1675M0403k12532H5055M61143
14729E46198L67419k70729L80741k84013k57584L29588P3152k40652K43578k35450
14719F52248K69817k78040n4454J96653p0382J20995m03241K69778k66488M67794
14709I04680Q9808l96608J09182J18529M6841l01856J5874M02591l64163J57459
14699G82337J94180k93333J18723P537j38519K33249j99964L42136p2421j02277
$$ y = [575769, 408705, 494049, 593025, 315942, 566081, 540056, 526230, 515810, 595246, 499567, 563576, 678365, 443891, 395784, 587400, 603765, 729224, 640696, 634468, 474922, 604987, 701700, 735911, 710243, 496761, 841550, 598310, 344323, 577440, 623369, 396385, 885544, 458429, 635726, 601731, 704016, 745691, 786094, 573562, 85055, 546198, 913617, 642888, 1023629, 739616, 482032, 811620, 884772, 644120, 887698, 652248, 922065, 644025, 589571, 786224, 715842, 836837, 433596, 703374, 436886, 904680, 994488, 597880, 707062, 825591, 872432, 570576, 586450, 989041, 624878, 782337, 976517, 683184, 801907, 809444, 670925, 904174, 704210, 1046346, 973925, 871648]
14689H71648K497K93400l25012J5743J16079k8655j44254k272K77615l37936L3006
14678G71859K89455r6006l66660M53924l59420K89278m2933M4499M6182J41264
14668A171442j15348M4108K56931l68911J72518j0268k22822L0121Q5474L08230
14658A351475l68412j76830K16505L57423r6199j43231j02633j56300K95872j28253
14648A049417R9696p0861j3601O5922J36538j44257l82465L11624L58771j74375
14638A236409o3410L16897l72759j23522L60370k89661J35943K59839l22109K50367
14628A388364Q3467j55708J31951r8401n312N7014l09346l3665L06191o9909m2462
14617A252184K15931n6603M694k75012P06047m93536L7027j93166N06168k29081
$$ y = [871648, 874145, 1167545, 842533, 858276, 974355, 945700, 801446, 799174, 1076789, 738853, 771859, 1061314, 965308, 598648, 1052572, 693152, 982430, 939497, 983996, 1030178, 1171442, 1056094, 1100202, 1357133, 988222, 1160740, 1150472, 927650, 957771, 1043245, 1351475, 983063, 806233, 1022738, 1380161, 1283962, 1140731, 1038098, 881798, 1177670, 1049417, 1149113, 1078252, 1064651, 1130573, 1267111, 1122854, 740389, 1052013, 1410784, 1236409, 1172999, 1489896, 1117137, 993615, 1353985, 1064324, 1200267, 1460106, 1137997, 1388364, 1471831, 1316123, 1448074, 1349673, 1344361, 1401375, 1092029, 1058364, 1364555, 1294646, 1252184, 1468115, 1411512, 1416206, 1141194, 1847241, 1353705, 1390732, 1197566, 1703734, 1474653]
14607A474653J36056k88414M83265o55520M99145m30675L24129M2079j56659N9424
14597A487483J73171K08612l92004O6982J54411q1335R9007J01595j73758L33825
14587A977989l01517K57307j41227Q0202m31674L20114J79959j18228K96823P9415
14577B199163n73143K89041K00166K98980l4351l57154O3023O6380l1821m8122
14567B072162j12085L13437k36499N48276l86232L76993J03760j71782K55829
14558B763859M9730j25483O33325J17122q5645K56855M12312Q91249Q24636J877774
14548G615734M980464J1113890J6536550R97400k0379621I355890m416214j735467
14540C204209q07154k7913l10721k54079L01402k00660l20987K24799J07488J66134
$$ y = [1474653, 1610709, 1322295, 1805560, 1150040, 1649185, 1218510, 1542639, 1584718, 1428059, 1487483, 1660654, 1869266, 1477262, 1544244, 1698655, 1617320, 1716327, 1817922, 1644164, 1977989, 1676472, 1933779, 1792552, 1872754, 1441080, 1761194, 1941153, 1822925, 2119748, 2199163, 1626020, 1915061, 2115227, 2414207, 2379856, 2022702, 2085725, 2152105, 2120284, 2072162, 1960077, 2273514, 2037015, 2585291, 2199059, 2576052, 2679812, 2508030, 2763859, 2813589, 2688106, 3321431, 3438553, 3352908, 3609763, 4022075, 4913324, 5737960, 7615734, 12596198, 23710088, 40246638, 41244038, 20864417, 9355890, 4939676, 3204209, 2397055, 2369142, 2058421, 1804342, 2105744, 1905084, 1584097, 1808896, 1916384, 2082518]
14530B082518P51L5745L28349j40295P2500j84883q8010K2899L38161J54200J7044
14519B638979J16837q5394m69388K45601J62793J63849j70608p5931L30242o0880
14509B796100M7051O621l0946L5656J38178j35919K66677J56347j96973N7121
14499C139913k85093K01190j32773K56032j00514j09310L22444J64204k72194
14490C183899K02956j8400L75008n09193K34803p687L77046q7060L02767l76150
14480C677989j2563J70061q6229k35008O07463k69732L97067r6294k24590N62173
14470D490337k64013k14440M97424j95832K95129l30825O15548j92509m09861
14461D290958M44785J7523k3904N2433J01717K06856J22589J2643j28214k0465
$$ y = [2082518, 2083269, 2119014, 2447363, 2307068, 2379568, 2194685, 2106675, 2129574, 2467735, 2621935, 2638979, 2755816, 2670422, 2201034, 2446635, 2609428, 2773277, 2602669, 2526738, 2856980, 2796100, 2843151, 2849772, 2818826, 2854482, 2992660, 2856741, 3123418, 3279765, 3082792, 3139913, 2854820, 3056010, 2923237, 3179269, 3078755, 2969445, 3291889, 3456093, 3183899, 3386855, 3368455, 3743463, 3234270, 3469073, 3461386, 3838432, 3751372, 4054139, 3677989, 3665426, 3835487, 3749258, 3514250, 4121713, 3851981, 4249048, 4152754, 3928164, 4490337, 4226324, 4011884, 4509308, 4313476, 4608605, 4277780, 4893328, 4700819, 4290958, 4735743, 4753266, 4729362, 4781795, 4883512, 5090368, 5212957, 5225600, 5097386, 5076921]
14451E076921K56721o5302R672K34115l5001L24035j82853J24031O8599n1825
14441E759113M98159n584j54843L6295m6923J55003M7657j95987M17251L08532
14431F818673k19414K06728M147K51939o2045J01932n4016M86803j27166L13636
14421G721217j94444M66130k49001K79486K29350J98075j61632K18440j4272N12105
14411I005454k85425M03406j35900J50642P8257L52796K9425M10386j06985J15293
14401A0017349K16027j20746N26144q1401L80243J95551p5030M50476J43766j60679
14391A1491700N60562J00435L56532K93848O7876J77025M41344L52449l4917K6057
14381A3832911O09476J59073M22328K37718K26335J89195L07633K32729N37975
$$ y = [5076921, 5333642, 5268340, 5278012, 5512127, 5477126, 5801161, 5618308, 5742339, 5810938, 5759113, 6257272, 6251688, 6096845, 6133140, 6086217, 6241220, 6288877, 6092890, 6510141, 6818673, 6599259, 6805987, 6810134, 7062073, 7000028, 7101960, 7047944, 7534747, 7407581, 7721217, 7526773, 7992903, 7743902, 8023388, 8252738, 8450813, 8289181, 8507621, 8493349, 9005454, 8720029, 9123435, 8987535, 9138177, 9216434, 9569230, 9598655, 10009041, 9902056, 10017349, 10233376, 10112630, 10638774, 10557373, 10937616, 11133167, 11058137, 11508613, 11652379, 11491700, 12052262, 12152697, 12509229, 12803077, 12870953, 13047978, 13489322, 13841771, 13806854, 13832911, 14442387, 14601460, 15023788, 15261506, 15487841, 15677036, 15984669, 16217398, 16755373]
14372A6755373M80295M07371L15931K76171N3755O79738N91714K07292L05039
14363B0072679M26528N68510L20210L85776P88081J39867J147354K09641K24575
14354B4283221P01596P99024R55457L88503P61174M81694P23965P59822O83935
14345C0538391J006229P30280J043730N37675J217864Q26653Q74607J050467J117039
14336C8942935J467808J159858R36734J128873J730247J317610J331651J513539
14328D9529255J485007J770420J702938J919274J993482J916453J928730K204113
14320F4449672K485160K374971K654579K633899K765404K972312L223363L460511
14312H7019871L703994L341169M490230M069543M163903M844439M946280N162662
$$ y = [16755373, 17235668, 17643039, 17958970, 18235141, 18288896, 18968634, 19560348, 19767640, 20072679, 20499207, 21067717, 21387927, 21773703, 22561784, 22701651, 23849005, 24058646, 24283221, 24984817, 25783841, 26739298, 27127801, 27888975, 28370669, 29094634, 29854456, 30538391, 31544620, 32274900, 33318630, 33856305, 35074169, 35900822, 36775429, 37825896, 38942935, 40410743, 41570601, 42507335, 43636208, 45366455, 46684065, 48015716, 49529255, 51014262, 52784682, 54487620, 56406894, 58400376, 60316829, 62245559, 64449672, 66934832, 69309803, 71964382, 74598281, 77363685, 80335997, 83559360, 87019871, 90723865, 94065034, 98555264, 102624807, 106788710, 111633149, 116579429, 121742091]
14304A21742091N775395N742957O461287O459836P209536P578138Q328312Q031049
14296A77328601R052117R672192R870441J0823207J1250233J1781917J2332134
14289B52110842J2901045J3686162J4149318J4635644J5203604J5181524J5471399
14282C53339538J5471981J5649800J4904899J4064013J3516109J2318678J0479313
14275D49744331R108958O544190L978056K5362l671332l911024l566802n289841
14267D52961898m794293q116394r468482j1239191j3364079j4850815j5668772
14260C75459872j5971816j5852856j6238240j5577438j5112660j4179812j4215713
14253B68311337j3534096j2755891j2300386j1538270j1153949j0251589r639721
$$ y = [121742091, 127517486, 133260443, 139721730, 146181566, 153391102, 160969240, 169297552, 177328601, 186380718, 196052910, 205923351, 216746558, 227996791, 239778708, 252110842, 265011887, 278698049, 292847367, 307483011, 322686615, 337868139, 353339538, 368811519, 384461319, 399366218, 413430231, 426946340, 439265018, 449744331, 458853289, 465397479, 469375535, 469400897, 465729565, 461818541, 458251739, 452961898, 448167605, 440051211, 430582729, 419343538, 405979459, 391128644, 375459872, 359488056, 343635200, 327396960, 311819522, 296706862, 282527050, 268311337, 254777241, 242021350, 229720964, 218182694, 207028745, 196777156, 187137435]
14246A87137435r367399q372331p957491p752093p302361o630585o389705o357514
14238A27007956n510163m799072n114301m602641m847378l992680l654454l503604
14230I0983663l760591l687657l052942l380303k843896k845380k839805j749988
14222F6823101k754181k093710k058348j843614k294643j981610j562743j367218
14214E0867034j869146p13383j758355j720754j528339r83197n68865j238099
14206D0486896j082587j222747j474720j200451p25236o48589n33360q63790j476373
14197C1259043q75056l95714p12270m33694j033275p04936o46291p44438o32074
14188B5081295o78630m10949l30707m53983o96520o58733l11309l14450q12755
$$ y = [187137435, 177770036, 169397705, 161440214, 153688121, 146385760, 139755175, 133365470, 127007956, 121497793, 116698721, 111584420, 106981779, 102134401, 98141721, 94487267, 90983663, 87223072, 83535415, 80482473, 77102170, 74258274, 71412894, 68573089, 66823101, 64068920, 61975210, 59916862, 58073248, 55778605, 53796995, 52234252, 50867034, 48997888, 48284505, 46526150, 44805396, 43277057, 42293860, 41724995, 40486896, 39404309, 38181562, 36706842, 35506391, 34781155, 34132566, 33599206, 32735416, 31259043, 30383987, 29988273, 29276003, 28842309, 27809034, 27104098, 26457807, 25713369, 25081295, 24402665, 23991716, 23661009, 23207026, 22510506, 21851773, 21540464, 21226014, 20413259]
14179B0413259l09837m85032j30513m83411m24877j61142n29453m27299j9327
14170A7442368o80658j92077l0078m94060M7442n74752m13563l63132j07541k26826
14160A4407123j86087r9291p87104K50372m39106J38943n13621j55362L7262m10726
14150A2242403j22208k77339j66897k94135K89400o94263k4923m44496N5554Q7166
14140A0650262m89816j25875r8612Q5427k86907k00483k36317l963k51776j30144
14130H911796J47463p0894l97870l78462O0040K53680l04207j07900m01564L16759
14120H028841j80985k47931j96011M7785k30533j67723N32721k11219j42251o18126
14110F614568L29726l01043m6236l53755K40287j12326O854j67473j17682J73752
$$ y = [20413259, 20103422, 19618390, 19487877, 19004466, 18579589, 18418447, 17888994, 17461695, 17442368, 16761710, 16569633, 16539555, 16045495, 16092937, 15518185, 15104622, 14741490, 14633949, 14407123, 14221036, 14121745, 13334641, 13585013, 13145907, 13284850, 12771229, 12615867, 12653129, 12242403, 12120195, 11842856, 11675959, 11381824, 11671224, 10976961, 10952038, 10507542, 10563096, 10650262, 10160446, 10034571, 9935959, 10021386, 9734479, 9533996, 9297679, 9293716, 9041940, 8911796, 9059259, 8988365, 8590495, 8212033, 8272073, 8525753, 8221546, 8113646, 7712082, 8028841, 7847856, 7599925, 7403914, 7451699, 7221166, 7053443, 7586164, 7374945, 7232694, 6614568, 6944294, 6643251, 6597015, 6243260, 6483547, 6371221, 6378075, 6210602, 6092920, 6266672]
14100F266672k31657k07867n66J08650l35608j67133j63313K55719l39281K76658
14090E462274k31577j2439L7078l20691K2169J89170j62720l33165N00167m13917
14080D736349q1853k26616L73071l13942L612j2518L8168l43866N82862k89037
14070D466230p2288N1340R2144k91208J18653r6435J13064l98238J42896j68885
14060C957273Q8905j30434K11547L4290l70422L90540n39885L26081k55405m9650
14050C662840j11589j0150J45023j85640k7487l27359K10753j26241L4213R8633
14040C362996J09091m92571Q8546P4191L1129k42147j02684J85771R1488j11767
14030B994043Q2738r0560k20l30035j65180L95917m25285N1088K90902k45924
$$ y = [6266672, 6035015, 5827148, 5826582, 5935232, 5599624, 5432491, 5269178, 5524897, 5185616, 5462274, 5230697, 5218258, 5255336, 4934645, 4956814, 5145984, 4983264, 4650099, 5150266, 4736349, 4654496, 4427880, 4800951, 4487009, 4490621, 4478103, 4516271, 4172405, 4755267, 4466230, 4393942, 4445282, 4537426, 4246218, 4364871, 4268436, 4381500, 3983262, 4126158, 3957273, 4046178, 3915744, 4127291, 4161581, 3791159, 4181699, 3641814, 3967895, 3712490, 3662840, 3551251, 3541101, 3686124, 3500484, 3472997, 3145638, 3356391, 3230150, 3264363, 3362996, 3472087, 2979516, 3068062, 3142253, 3173382, 2931235, 2828551, 3014322, 3105810, 2994043, 3076781, 2986221, 2986001, 2655966, 2490786, 2886703, 2461418, 2512506, 2803408, 2557484]
14020B557484J13228k73096L54532k20739k11970K26237p3797o5149Q2024R6803
14010B585557r9736j0352j85575P1005J87120l06205l67159M40041k40538o6096
14000B008062N58343j82655l21728O7021j44686N82209l49320k65203L0619M62109
13990B444771J76731J011570L025235R389604J7095430R126184j6988303j1276458
13982A4004764n519504k384600j255549p79159k14231n26865k61739J10342j61049
13973C012410m43759l66j24951Q2804J69474m21255O0857k27243L27589j01010
13963B334550N8948p1246j69978P0073k11026J92083j01668k6765J25054P285
13953B207310j72799J22791k99554K04846k63419k41802K37113l0414L9572p3271
$$ y = [2557484, 2670712, 2397616, 2752148, 2531409, 2319439, 2545676, 2471879, 2406730, 2488754, 2585557, 2485821, 2475469, 2289894, 2360899, 2548019, 2241814, 1874655, 2314696, 2074158, 2008062, 2566405, 2383750, 2062022, 2129043, 1984357, 2566566, 2217246, 1952043, 1982662, 2444771, 2621502, 3633072, 6658307, 16047911, 33143341, 42269525, 25281222, 14004764, 8485260, 6100660, 4845111, 4065952, 3851721, 3324856, 3063117, 3173459, 3012410, 2568651, 2568285, 2443334, 2526138, 2695612, 2274357, 2335214, 2107971, 2435560, 2334550, 2393498, 2322252, 2152274, 2222347, 2011321, 2203404, 2101736, 2074971, 2200025, 2207310, 2034511, 2157302, 1857748, 2062594, 1799175, 1557373, 1794486, 1764072, 1803644, 1730373]
13943A730373k06679M36616J26205j09286k79827J05626n88506M87491k5862J15393
13933A791544J0452l26094K16836j34701K68156l78641M8928L97390j80896l92730
13923A320244K5025L91009m41327N14058o05819K84087j08818M04449n99275O15273
13913A798906j70505j26851k43447O3386k29633J40919J49385P4998L47750m64463
13903A340445J76286j83734L68616k27104k65151K99411k53669J73069l18144
13894A110025o5297P8540J78030M0216l06473K5656j4782K62878k96925K59075
13884A270943r1314K65497k52211P1000j97886Q2681L739K25209k91678J80087
13874A266067j95717l6493Q2195J07652k80125K18417k01P4303J26370k77752
$$ y = [1730373, 1523694, 1960310, 2086515, 1977229, 1697402, 1803028, 1214522, 1702013, 1676151, 1791544, 1801996, 1475902, 1692738, 1558037, 1826193, 1447552, 1496480, 1893870, 1712974, 1320244, 1345269, 1736278, 1294951, 1809009, 1203190, 1487277, 1378459, 1782908, 1183633, 1798906, 1628401, 1501550, 1258103, 1321489, 1091856, 1232775, 1382160, 1457158, 1804908, 1340445, 1516731, 1332997, 1701613, 1474509, 1209358, 1508769, 1255100, 1428169, 1110025, 1044728, 1123268, 1301298, 1341514, 1035041, 1060697, 1045915, 1308793, 1011868, 1270943, 1179629, 1445126, 1192915, 1263915, 1066029, 1148710, 1152449, 1377658, 1085980, 1266067, 1070350, 1033857, 1116052, 1223704, 943579, 1161996, 1161795, 1236098, 1362468, 1084716]
13864A084716r2960J44668N3404l83533K71855l6886k2225l07395M74886l76333
13854H10197N61609m35538J50467k28049K37014K51823k89803q3543j51957L40327
13844A162547k31402j95311L17861j40855l43420M02987J79792L3144M7900j60470
13834A072773j56561q2323O2341L5475n3968J47354p1547k51013K23501P4953
13824A000985L0862k19089j30r8185J80124j33508P4470Q4829k19740K40230K2603
13813I63451m65295J47976j28469J74463K12625j24940K42290l65102K84519J20265
13803A061783l27375j18847K16326R3290j31313J94012m2875D62363K17510o8018
13793F11855K16405j2853P6358n681P2482D43353J18669K92675q5882K09375p2900
$$ y = [1084716, 991756, 1136424, 1189828, 806295, 1078150, 1041264, 1019039, 711644, 1186530, 810197, 1371806, 936268, 1086735, 858686, 1095700, 1347523, 1057720, 974177, 822220, 1162547, 931145, 735834, 1053695, 912840, 569420, 972407, 1152199, 1185343, 1233243, 1072773, 916212, 833889, 896230, 931705, 877737, 1025091, 953544, 702531, 926032, 1000985, 1031847, 812758, 812628, 714443, 894567, 761059, 835529, 920358, 700618, 940848, 963451, 498156, 646132, 517663, 692126, 904751, 779811, 1022101, 656999, 941518, 1061783, 734408, 615561, 831887, 925177, 793864, 987876, 945001, 462363, 679873, 611855, 828260, 815407, 891765, 886084, 958566, 443353, 562022, 854697, 768815, 978190, 905290]
13782I05290k06131K58791j93149l12085J69122K27659l04465J01381J92145j35377
13772G03181P9655l08292L88632q9392p7753J28564l38054J43021l0497L16953
13762I16018p4247J85449D21215O2840J79267j01827K55897J13889j79541J04667
13752H56407J92695E23994P6694J60877Q7033j67261K03845j75014p3405L51809
13742I88572l22110J1660K6430j32865J79000l11211l5430K39052k19941J79133
13732F02290Q1922k46713L93724L7908j31805k71718L04480l19971J17509J00671
13722F68297P7013j7572k56748o366J92904k53524r8953N4954J71747j94424J54157
13711D91485K51086J18643l52666r5112O96996n33595B49479R1815J00547K67851
$$ y = [905290, 699159, 957950, 764801, 452716, 621838, 849497, 545032, 646413, 838558, 703181, 782836, 474544, 863176, 773784, 696031, 824595, 486541, 629562, 599065, 916018, 841771, 1027220, 421215, 484055, 663322, 561495, 817392, 931281, 751740, 856407, 1049102, 523994, 600688, 761565, 848598, 681337, 885182, 710168, 636763, 988572, 666462, 678122, 704552, 571687, 750687, 439476, 404046, 643098, 423157, 602290, 684212, 437499, 831223, 869131, 737326, 465608, 770088, 450117, 567626, 668297, 745310, 727738, 470990, 464624, 657528, 404004, 305051, 360005, 531752, 337328, 491485, 742571, 861214, 508548, 413436, 1110432, 576837, 249479, 341294, 441841, 709692]
13701G09692C53551l6538J96788K71666k55647r3519K01927A17079j7005N47021
13691F47095j66725p2180m8439r3646L45813A36166K91045M99807D62426M78773
13681I41199l64391l6275L5947J27307j46101Q4359j3518j98178K8648B08644
13670C93469k5388L46889k38643l5033K8369j22956j1699L14974k76009J5196
13660C89169p3195J9849N80472C03377L60483C20894L01833B68480L56253q1521
13650E43212O4560M7530j23432q5529A81906N66385A00640L54399J14411r9632
13640D69818j72401l7172n2942R0824K79032M7541l10621O5380n9419R1540K55123
13629F66703B68219K29304J58680l11884K15742k55363O7654c6203D57246K69758
$$ y = [709692, 353551, 317013, 513801, 785467, 529820, 436301, 638228, 117079, 100074, 647095, 480370, 408190, 359751, 266105, 611918, 136166, 427211, 927018, 462426, 941199, 576808, 540533, 576480, 703787, 557686, 642045, 628527, 430349, 458997, 208644, 393469, 368081, 714970, 476327, 441294, 469663, 346707, 335008, 649982, 373973, 389169, 315974, 335823, 916295, 303377, 663860, 320894, 622727, 268480, 624733, 543212, 607772, 655302, 531870, 446341, 181906, 748291, 100640, 455039, 569450, 469818, 297417, 260245, 207303, 298127, 577159, 624700, 314079, 379459, 320040, 411580, 666703, 268219, 497523, 656203, 344319, 560061, 304698, 372352, -36203, 457246, 727004]
13619G27004k57387L7532B1405K84149J42666c30694F20828B25731l8327J19219
13609C06623J98225k06749R7766J25756l5378N7837j93904q2940j27192J28018
13599B68062H8113K72654J54354H2181J01387J21541K64457b8489C69121k3731
13589C45390L74639B12997O0435M29932R2166B61876M4860r7150H6746O2462E2602
13577A35144K46144a5021C33233N2947j10603A7097N17482j87288J2540L7199
13567C97030A65992K27136j15829K00637j05943M9467o232k4262A42846K30647
13557C73493J9906q0281M2613j75996L27402K8463a5562n715D30875A75893K39730
13546D15623l7374j02896N55R1268j09416j4074J31222j01401J1057q5750P2857
$$ y = [727004, 469617, 507149, 21405, 305554, 448220, -330694, 620828, 225731, 187404, 306623, 504848, 298099, 395865, 521621, 486243, 544080, 350176, 267236, 140044, 268062, 88113, 360767, 515121, 82181, 183568, 305109, 569566, -28489, 369121, 345390, 720029, 212997, 273432, 703364, 795530, 261876, 306736, 209586, 86746, 149208, 52602, 135144, 381288, -15021, 333233, 386180, 275577, 17097, 534579, 347291, 359831, 397030, 165992, 393128, 277299, 477936, 371993, 421460, 415228, 390966, 142846, 373493, 393399, 313118, 355731, 179735, 507137, 535600, -15562, -21277, 430875, 175893, 415623, 378249, 275353, 275908, 367176, 257760, 243686, 374908, 273507, 284564, 198814, 271671]
13535B71671q0584L11259K9123j33798K18611G4754j6214J35747K11050a07847
13524A91530E3019J22933K93779j16606j1671A12431J78350D8941J31924K42202
13514D23067A58322P8884p5826m1228J19142j4733k5153m4290m0440J64813N8706
13503C38197H7375K73824j54361n5532L9761Q6347I3883M58179k54528n3442o2477
13492A81615m5347g648A12608J4773J59620j05797C4186D188J65001J79723K12145
13481E61057B65821D5997R9614K07900H3553j507P2331K13973J07621j38816O6384
13470D03539J8330A28960M4535L24873A21533J29761F213K7843M08110d4467I2431
13458F25329I6645D5534K97139J75496B28668J19648P4136d7341B25402l1312
$$ y = [271671, 191087, 502346, 531469, 397671, 616282, 74754, 58540, 194287, 405337, -107847, 191530, 53019, 175952, 469731, 353125, 341454, 112431, 290781, 48941, 180865, 423067, 158322, 237206, 161380, 120152, 239294, 224561, 199408, 155118, 114678, 279491, 338197, 87375, 361199, 206838, 151306, 191067, 277414, 93883, 552062, 297534, 244092, 181615, 136268, -7648, 112608, 127381, 287001, 181204, 34186, 4188, 169189, 348912, 561057, 265821, 45997, 145611, 353511, 83553, 82046, 154377, 368350, 475971, 337155, 403539, 421869, 128960, 173495, 498368, 121533, 251294, 6213, 34056, 442166, -44467, 92431, 625329, 96645, 45534, 342673, 518169, 228668, 348316, 422452, -47341, 225402, 194090]
13448A94090q6438J29681R3906j39713q7918L17169D5555J95338k3783O6246d6170
13436F91288l35578n1694j27627K87705K1584k01398d4070C26001A51957K90800
13426D42757n0603A63901K74901K7045c853C01604J06976r8322A07626Q640M41732
13415E57998j11464G0352J93595H124K26526H0613O3915p0589J30195q9802J11043
13404B25375K42784j65497A40802a2008k257A80169c172l16027g1233C34180j22004
13393B12176L34213G8795M14713A09563J20509j0992J50644O0298a36855E6461
13382a53753A34049J41292a50687C13256B4927J32054R717j4963G4005J1938K73628
13371C59571j13060K7903J06041R7066j09028g3292A12975L38042q2723Q6894
$$ y = [194090, 107652, 237333, 331239, 191526, 103608, 420777, 45555, 240893, 217110, 283356, -46170, 691288, 355710, 304016, 176389, 464094, 485678, 284280, -44070, 326001, 151957, 442757, 392154, 163901, 438802, 465847, -3853, 301604, 408580, 310258, 107626, 116266, 557998, 446534, 70352, 263947, 8124, 234650, 80613, 144528, 73939, 204134, 114332, 225375, 468159, 302662, 140802, -12008, -14265, 180169, -3172, -319199, -71233, 334180, 212176, 546389, 78795, 493508, 109563, 230072, 219080, 369724, 430022, -136855, 56461, -153753, 134049, 275341, -150687, 313256, 24927, 156981, 166698, 151735, 74005, 85943, 359571, 246511, 274414, 380455, 477521, 368493, -73292, 112975, 451017, 368294, 455188]
13361D55188j05866M5367A40652a12343C4962J17402g0983A33707M16827h2610
13350A93438b1489D5257N02405k45769J84878J34841A25557K09443J39967K05085
13340F80052a22341B19385P1119I5385R5602R8342j33258M58231B65159J88940
13330D54099A95177p5040K43356L2893I1931J64849k6360j02199b93446A63843
13319B44804a5630D18960j69432K178n8649K35025f7380J5033j68477D91290j10883
13308C80407N4912B02775a27678C41923k0341A20863M1621K19146j72642c00020
13297H4502M09766j71587f995B66564j6875k1989a27866A50412C4449j6469J10393
13286A28373d5708C34824n6341Q0977J7386j18807j25733i4396C00750j22151
$$ y = [455188, 349322, 394689, 140652, -112343, 34962, 152364, -70983, 133707, 550534, -82610, 193438, -21489, 45257, 547662, 301893, 486771, 621612, 125557, 335000, 474967, 680052, -122341, 219385, 290504, 95385, 190987, 289329, 156071, 614302, 265159, 454099, 195177, 120137, 363493, 396386, 91931, 256780, 230420, 128221, -293446, 163843, 244804, -15630, 418960, 249528, 251706, 193057, 428082, -67380, -52347, -220824, 491290, 380407, 435319, 202775, -127678, 341923, 321582, 120863, 162484, 381630, 208988, -300020, 84502, 494268, 322681, -6995, 266564, 249689, 227700, -127866, 150412, 34449, 17980, 128373, -45708, 334824, 278483, 359460, 376846, 258039, 132306, -94396, 300750, 178599]
13276A78599A8860J39420g8186E3723j8033Q1689N1592a400n3704B05373Q865
13265B14238o0105k6768J04140K86682C0128Q7793M6494l2716J74254j9459g6895
13253D8265g1154C00375D9259L8634d6018A98016a22534F4468A939b1905E1911
13241A42909K9180q1078I942J56510C2693Q5032m2541a94107P0206B95496A9180
13229B07665E5874b8498j88541B02585O4995C71J39117b95996C09187K6072a79053
13217d9315C692a69668A69791K15472A8808K3430L54546j49415K9795J76j01625
13206A75715j0349M6409F4211e9815k1600B16009F2000L01685A12160k3524J56797
13195B45433h5732B89330j06110a5235j28081j22904B33761b13694D8954J81626
$$ y = [178599, 18860, 158280, -78186, 53723, 35690, 117379, 168971, -1400, -55104, 205373, 214238, 154133, 127365, 231505, 518187, 30128, 117921, 164415, 131699, 305953, 286494, -76895, 48265, -71154, 300375, 49259, 87893, -46018, 198016, -122534, 64468, 1939, -21905, 51911, 142909, 172089, 91011, 9942, 166452, 32693, 117725, 75184, -194107, -123901, 295496, 19180, 207665, 55874, -28498, -217039, 202585, 267580, 371, 139488, -295996, 309187, 335259, -179053, -49315, 3692, -169668, 169791, 385263, 18808, 42238, 396784, 247369, 277164, 277340, 175715, 165366, 211775, 64211, -59815, -81415, 216009, 62000, 363685, 112160, 88636, 245433, -85732, 289330, 183220, -15235, -143316, -266220, 233761, -213694, 48954, 230580]
13185B30580E9707K27133A09124K07586j57088g3614A17411a20083A21399a7238
13174C25486L04253D6402J183E821a64960C28072j42223h420A33648N5955b25081
13162A68167o7071J96536j48556N5249a09551I0391K1531b82626D69221b67622
13151B1487f6757C58665b33940g6433E3538L22827a19590B50318e4019b5862A35338
13139b9518B94417L7151i9566e266C28786J13635b32738C22716j43317C7301K03164
13128B40465b29508a10296L1387A68043b74112b9677C36970D7246J20982J4104
13118A82332k0493b10482C16499G8412J19385e276k81441a35624A83930b6844
13107A33993L16927j31659A50500I823J9038J2833M52092F9494K54090a35170
$$ y = [230580, 59707, 286840, 109124, 316710, 159622, -73614, 117411, -120083, 121399, -17238, 325486, 629739, 46402, 47585, 5821, -164960, 328072, 185849, -8420, 133648, 189603, -225081, 168167, 101096, 297632, 149076, 204325, -109551, 90391, 111922, -282626, 469221, -267622, 21487, -66757, 358665, -233940, -76433, 53538, 376365, -119590, 250318, -54019, -25862, 135338, -29518, 294417, 331568, -99566, -5266, 328786, 442421, -232738, 322716, 179399, 37301, 240465, -229508, -110296, -78909, 168043, -274112, -29677, 336970, 47246, 168228, 182332, 161839, -210482, 316499, 78412, 197797, -5276, -286717, -135624, 183930, -26844, 133993, 450920, 319261, 150500, 9823, 28861, 41694, 493786, 69494, 323584, -135170]
13096B42080J2510D5737a27276H2154b2648j60671B01145m008d6824j56749G1142
13084a94470k0173Q7802A42399N554K5023K19968A57004o3156K07839H4479K39137
13073C23616D0705K36263E7773B5657L23250n1680D6849a16182J9598B15283q0314
13062A34969g2508A77769k8547b7522l3613b9131j68152b263B10337p3396o1889
13051G5052J29302r6576J00024j1803j9897K21268A66837c107A18668Q3597G4021
13039d4721C257M8785O6526K63057c8126m3682B89839f0022b4509D78641B18578
13027B68K17056l4905J58237A08841D1522J5511h097C13677q7401G9576B0836
13015B90444A25981K19868j71694k7092L577L57187I5445b58540c3621C9145J47441
$$ y = [242080, 254590, 45737, -127276, 82154, -22648, -183319, 201145, 197137, -46824, -203573, 71142, -194470, -214643, -126841, 142399, 147953, 172976, 392944, 157004, 93848, 301687, 84479, 323616, 40705, 276968, 57773, 25657, 348907, 297227, 46849, -116182, -96584, 215283, 134969, -72508, 177769, 149222, -27522, -61135, -29131, -197283, -2263, 210337, 136941, 75052, 204354, 107778, 207802, 195999, 176102, 397370, 166837, -3107, 118668, 202265, 74021, -44721, 3257, 52042, 118568, 381625, -38126, -81808, 289839, -60022, -24509, 478641, 218578, 268, 217324, 182419, 340656, 108841, 41522, 57033, -8097, 313677, 226276, 79576, 20836, 290444, 125981, 345849, 174155, 147063, 150640, 507827, 95445, -258540, -33621, 39145, 186586]
13004A86586H8479K26691m3659n9230a12009A89077E7492A0096b92894J22332
12994a70562q4173d8137j62826A99564c79996C03840j14296D1825g6178C4781
12983B37019Q3978C3339M67382g136l4594B25944a67324B04404b64869O0003K2359
12972a82507C89499A72480d2577B1968J06252a43241K6431F7017R2533F6224d6841
12960B0991a43661F8305b92176J29566A1522h9951L0176D621a20210K6168A70898
12948a54227A66525J41545G3925a05436G3152d9265B00791h8859A5418K86944
12938C02362a22564C71588e4270r8958l1419j9851L5076A92066a4714B57883H4530
12926I1121J68832a56038B54323A07250A0786b74197A31645c470p5886F2866a2674
$$ y = [186586, 88479, 315170, 271511, 212281, -112009, 189077, 57492, 10096, -292894, -170562, -254735, -48137, -210963, 199564, -379996, 303840, 189544, 41825, -76178, 34781, 237019, 320997, 33339, 500721, -7136, -41730, 225944, -167324, 204404, -264869, -204866, -182507, 389499, 172480, -42577, 21968, 128220, -143241, -116810, 67017, 159550, 66224, -46841, 20991, -143661, 68305, -292176, -162610, 11522, -89951, -59775, 4621, -120210, -94042, 170898, -154227, 166525, 308070, 73925, -105436, 73152, -49265, 200791, -88859, 15418, 302362, -122564, 371588, -54270, -153228, -184647, -204498, -169422, 192066, -14714, 257883, 84530, 91121, 259953, -156038, 254323, 107250, 10786, -274197, 131645, -3470, -79356, 62866, -12674]
12914C00755E3320b58614C90102A86821G0844a18120E02054b63439H4988P2692
12904A57680B4739e3332j61181f674F7820C1699b25810D47853F9157b4245r9717
12893a23962k738o9510g3895C28129f4668I2722a07908B51714G7599N9560G553
12881A5050J81854r0162J18314A04322L6215C190c83258C12011A12187a60082
12870d3761B37476R6785j03715C5831N1714C752i1747G4987Q6752k2638a69455
12858A15474O7987a24228A22703d8536j48168A76331K30236d1969a3556j22779
12848a36335o6736D31446b94071f2609B09349o7555d4948a7128j89745i5037D4863
12836A2299P2542b15894a2711B12761b02129B3552a4318G5751P8125c9469C2837
$$ y = [300755, 53320, -258614, 390102, 186821, 70844, -118120, 502054, -263439, 84988, 157680, 24739, -53332, -214513, -6674, 67820, 31699, -225810, 447853, 69157, -24245, -123962, -126700, -196210, -73895, 328129, -64668, 92722, -107908, 251714, 77599, 137159, 7553, 15050, 196904, 106742, 225056, 104322, 140537, 3190, -383258, 312011, 112187, -160082, -43761, 237476, 334261, 230546, 35831, 87545, 3752, -91747, 74987, 161739, 139101, -169455, 115474, 183461, -124228, 122703, -48536, -196704, 176331, 406567, -41969, -13556, -136335, -203071, 431446, -294071, -62609, 209349, 141794, -44948, -17128, -206873, -95037, 44863, 12299, 84841, -215894, -12711, 212761, -202129, 23552, -14318, 75751, 153876, -39469, 32837]
12824g3832B13380l4765D6938a83412O2131l1217F9218a41830k5019C3338g2393
12812d5417k0200D4349L22384D4177a05060j28286a12901A31245a17722J3810
12802a03912G426a64104A91259i2613A51634c16047E67431c00146D0264K48938
12792B89202A41681b03815B35752g3814A32978b56624I8645J28120p5670a73379
12781c20654d0446O384r2696j25737O3301d7622j69545D6150J20427a43642m503
12770a48145G8457h980F6587I817b02322P0117B26041o7194p6255B7917c8104
12758B7971M0123a15203b5297j05075A83793q6308a38479j50142a08634E6353
12747d2131B3392b69996A3557O6920i2291d0071C48266E8777a41032A1586K27020
$$ y = [-73832, 213380, 178615, 46938, -183412, -121281, -152498, 69218, -141830, -166849, 33338, -72393, -45417, -65617, 44349, 366733, 44177, -105060, -233346, -112901, 131245, -117722, -103912, 7426, -164104, 191259, -92613, 151634, -316047, 567431, -300146, 40264, 289202, 141681, -203815, 235752, -73814, 132978, -256624, 98645, 226765, 151095, -173379, -320654, -40446, -34062, -126758, -252495, -189194, -47622, -217167, 46150, 166577, -143642, -148145, 78457, -8980, 66587, 9817, -202322, -132205, 226041, 158847, 82592, 27917, -38104, 27971, 68094, -115203, -25297, -130372, 183793, 97485, -138479, -288621, -108634, 56353, -42131, 23392, -269996, 13557, 80477, -92291, -40071, 348266, 58777, -141032, 11586, 238606]
12736B38606a63772N3904d5684c919C08813i2895B13936F3652b63068E320R6039
12725A01359N7499b26326E14547B24576F760b348d92l2905F04864A63001a26330
12713D14346a00491d9021B0458L4979N3759J72401J54697f2991I2149K27937A52006
12701a84778A13728j90e7685A82600o1377M6989K7850J03773A18258b5938B306
12689G705J44529L7774e1187l8660B35867b600B29918A379a35928q6387I2582
12677A82106K9597E6968K01663e4322A29167C9807a32231f1557A82552B367K89742
12666B92109D7480N91N6642J4425J81043A9802J40597i4210C42466A06000a13226
12654F7488R9783J2559H2512A3149P5574f9561K3852J4685F6837e1312A82292
$$ y = [238606, -163772, -109868, -45684, -3919, 308813, -92895, 213936, 63652, -263068, 5320, 101359, 158858, -226326, 514547, 224576, 6760, -2348, -492, -33397, 604864, 163001, -126330, 414346, -100491, -49021, 20458, 55437, 109196, 281597, 436294, -62991, 92149, 320086, 152006, -184778, 113728, 113538, -57685, 182600, 121223, 168212, 196062, 299835, 118258, -25938, 2306, 7705, 152234, 190008, -51187, -89847, 235867, -2600, 229918, 1379, -135928, -222315, 92582, 182106, 211703, 56968, 258631, -54322, 129167, 39807, -132231, -61557, 182552, 2367, 292109, 47480, 48071, 104713, 119138, 300181, 19802, 160399, -94210, 342466, 106000, -113226, 67488, 167271, 179830, 82512, 13149, 88723, -69561, -45709, -31024, 66837, -51312, 182292]
12642C08762J4765E8568J863N5472J5314B2365L4951A8923P9285B4049A802L47191
12630C48993c3266A6323d387B20839J12110M1726j76917F5497f3851C89003C6088
12618d00k25534J08038r2060A48350p3753j0939a37285D5774K57940E9947J15247
12607A75194J1091n5511B7084O5458e4121B01943F4779a18131C96057A69486N1227
12596B20713J56457b22806H9510L53722G0152L5563O4869j7563f2605n289q3099
12585a50993B13823p3859n3274c57691a1442A6236f8333G3620a40229G8161f536
12573b38023g1811A80771p9071a37826k8693B56995c50812B69799k5208f3597
12562B62761B7065a57222a0694A76379K93868A13705b45870B10717D146b46707
$$ y = [308762, 323527, 58568, 60431, 115903, 131217, 22365, 57316, 18923, 98208, 24049, 1802, 348993, -33266, 16323, -4387, 220839, 332949, 374675, 197758, 65497, -63851, 389003, 36088, -400, -225934, -117896, -209956, 148350, 74597, 63658, -137285, 45774, 303714, 59947, 175194, 186285, 130774, 27084, 92542, -54121, 201943, 64779, -118131, 396057, 169486, 220713, 377170, -222806, 89510, 443232, 70152, 105715, 170584, 153021, -62605, -67894, -150993, 213823, 139964, 86690, -357691, -11442, 16236, -68333, 73620, -140229, 78161, -6536, -238023, -71811, 180771, 101700, -137826, -166519, 256995, -350812, 269799, 244591, -63597, 262761, 27065, -157222, -10694, 176379, 470247, 113705, -245870, 210717, 4146, -246707]
12551b85469B16692L1201H4783f7100A83489n4806J36850a85968A26333d6771
12540g3561k40954a54222M7525B6919b4345j83906A1956c8624C2529a13679p6150
12529a89829A46793F0388J4141d8370A32303R3614O006E9272b9375l19503J03551
12518b45327J08452A88827D7615h0083B01689r4531e6759j11911B68218j24411
12508A43807l3720P7229B850c5368C4386a72104A4769J76477b63789o892F6035
12496H0647l3129e5145B3305c3776j98033h605k33561B7505L69440d55566b0200
12484A55533h6956I8055a73495A51414a78531e2987e706A99610b07827B14615
12473b14701c4238E4611O349J08515o5543g2882B3263e6888j6365H6407a436r020
$$ y = [-285469, 216692, 247893, 84783, -67100, 183489, 128683, 265533, -185968, 126333, -46771, -73561, -314515, -154222, -106697, 26919, -24345, -208251, 11956, -38624, 32529, -113679, -189829, 146793, 60388, 74529, -48370, 132303, 225917, 231923, 59272, -29375, -348878, -245327, -136875, 188827, 47615, -80083, 201689, 107158, -56759, -168670, 268218, 143807, 110087, 187316, 2850, -35368, 34386, -172104, 14769, 191246, -263789, -270681, 66035, 80647, 47518, -55145, 23305, -33776, -231809, -8605, -242166, 27505, 396945, -455566, -20200, 155533, -86956, 98055, -173495, 151414, -178531, -52987, -5706, 199610, -207827, 214615, -214701, -34238, 54611, 60960, 169475, 103932, -72882, 23263, -56888, -73253, 86407, -1436, -10456]
12461a0456B53334g7324B09129a25907N7087b0145j61995B6215a93053A18770
12450a47187A11756O6266b57078O4742F3072a34899D64562b38192j9747G7758
12439d524j93563j32875L8418A88166c8630g314k00150I9709a70492g7126F6651
12427c14492e3882k51251H8058J7483J27214r2901a03592j28047N6589d422j14653
12416a19075a0793j33625b3073B25149H1855J551a34782M0245I6165i2933j68881
12405b61814a30612a7277k3779k43960k60355a81470A49967l0916E3585c7301
12394A19493a26745M4709M0305A06905c6534B13953b92403b6430A0517g9441j75725
12383b55166J27322d6034A02760j8957C0278K40546B7015A2130O5942a80585F3841
$$ y = [-10456, 253334, -77324, 209129, -125907, -68820, -20145, -182140, 26215, -193053, 118770, -147187, 111756, 178022, -257078, -192336, 63072, -134899, 464562, -238192, -257939, 77758, -4524, -198087, -330962, -292544, 188166, -38630, -7314, -207464, 99709, -170492, -77126, 66651, -314492, -53882, -305133, 88058, 105541, 232755, 139854, -103592, -231639, -175050, -4422, -119075, -10793, -144418, -23073, 225149, 81855, 83406, -134782, -94537, 96165, -92933, -261814, -130612, -17277, -41056, -285016, -545371, -181470, 149967, 119051, 53585, -37301, 119493, -126745, -82036, -41731, 106905, -36534, 213953, -292403, -26430, 10517, -79441, -255166, -127844, -46034, 102760, 83803, 30278, 270824, 27015, 12130, 78072, -180585, 63841]
12371A10767c4515A14251o819f3596d345p4109l8140A3238J95177a31747C44437
12359A60098L7157b3604O840j49366e9245m4082A41359e7904l18317c5252k6565
12348f1817D375b63538B96926e8924B72h6518F2388a60594A2610i5146k86636
12337c81782D4511J88712a42963J344A15690l6164C0418O5372Q805b8632o613
12326c5245j67650C33842A65459l2a86337O8692j84629A62125b09413L6716d0339
12314H1025c9163B0052b5566A90426c8761B2651K8446a603A62965E1625e9456
12302B19416E2300j1593d5209n7189j1300A84194a7345E9743K05092G8733a16783
12290a47315A05677k0498b6092A16119f9394A00013a84079A04724A8728J74641
$$ y = [110767, -34515, 114251, 107432, -63596, -4345, -78454, -116594, 13238, 208415, -131747, 344437, 160098, 197255, -23604, -16764, -166130, -59245, -103327, 141359, -57904, -376221, -35252, -61817, 4375, -263538, 296926, -58924, 272, -86518, 62388, -160594, 12610, -95146, -381782, 44511, 233223, -142963, -141619, 115690, 79526, 30418, 95790, 104595, -28632, -35245, -202895, 333842, 165459, 165427, -186337, -117645, -302274, 162125, -209413, -172697, -40339, 81025, -39163, 20052, -25566, 190426, -38761, 22651, 51097, -1603, 162965, 51625, -59456, 219416, 52300, 40707, -45209, -102398, -113698, 184194, -17345, 59743, 264835, 78733, -116783, -147315, 105677, 85179, -26092, 116119, -69394, 100013, -184079, 104724, 18728, 193369]
12280A93369K39099A66408b66102A51956c9308D03820A61750G4976R5086K34426
12270D04488B01380B4584M0262L23406A27296g350A16150M1486J93130o1353L20510
12259F09923a4678k85935B17615K676a35447C30061a06739F22562a19781O366
12249a13415l2790A21278J96644j05869J29145B1905K83172m8465q2601j0969
12239A63042J17418j16879b18627e8467B8659m516a22379M6294B06641N3668Q4040
12228C44349j45393L4709a8j48206C00989A10728K5961M8492J4694a50744B36033
12216B2336a51022a5244P087G612J59660N5872c7761q3971A00185K60385j36345
12205B24225B0573M91943B02003r0847K74278j49074j17701m1232J95488R1179
$$ y = [193369, 432468, 166408, -266102, 151956, -39308, 403820, 161750, 74976, 170062, 404488, 201380, 24584, 64846, 388252, 127296, -7350, 116150, 157636, 350766, 289413, 609923, -14678, -300613, 217615, 220291, -135447, 330061, -106739, 622562, -119781, -113415, -146205, 121278, 317922, 212053, 341198, 21905, 305077, 256612, 174011, 163042, 280460, 163581, -218627, -58467, 28659, 24143, -122379, -76085, 206641, 260309, 344349, 198956, 233665, -18, -148224, 300989, 110728, 136689, 185181, 199875, -150744, 236033, 22336, -151022, -15244, -8157, 7612, 167272, 223144, -37761, -121732, 100185, 360570, 224225, 20573, 512516, 202003, 111156, 385434, 236360, 118659, 77427, 272915, 364094]
12195C64094e4039B29676o1125o2643k8307J86259M3866K1121O4656i675G2630
12183C0499h9637B8639J94042J50249j20170J39734a465A94495J66039A70496
12172E0078J74344j951J85109H409K3315J63614a6391n655m3184B45013B8273
12160C18388l2442J49215a39281F3524h3975k16003h3817I9033C329L30567n7657
12149B76239c18459B1082b65992A18690a07304B0121a9618A22670n4303Q2984
12139A51351M0399b8229C05492r3569q1338l58a04933L5680A03226B91d8676B27805
12126a07155A38640J49995m9162a28909B67173j02676B871J77755b53253d3769
12115B72420e7577k31301I1115A8361i7249M4486F7704J77617B297J65242A5144
$$ y = [364094, -54039, 229676, 168551, 105908, 77601, 263860, 307726, 328847, 393503, -9675, 72630, 30499, -89637, 28639, 222681, 372930, 252760, 392494, -1465, 194495, 360534, 170496, 50078, 224422, 222471, 407580, 8409, 31724, 195338, -16391, -22046, -65230, 245013, 28273, 318388, 285946, 435161, -139281, 63524, -83975, -299978, -83817, 99033, 3329, 333896, 276239, -318459, 21082, -265992, 118690, -107304, 20121, -19618, 122670, 68367, 151351, 191750, -28229, 305492, 211923, 130585, 130227, -104933, -69253, 103226, 291, -48676, 227805, -107155, 138640, 288635, 239473, -128909, 267173, 164497, 2871, 180626, -253253, -43769, 272420, -57577, -288878, 91115, 18361, -97249, -52763, 67704, 245321, 2297, 167539, 15144]
12103c73131A24572R1703b71414J03595A90924e4729l15087a3650F6469b4771
12092A92197N2462o8751J6019D3198a51855b3269j09778j00885A0176a32974O3798
12081f9176A39865K00687D4070L87530N40865L67239E28696B32648a80382H7583
12070B20653k3328O7642j17527F1792L5038f1147a8882A62388F7540c8796B66944
12058e18209g8269a3205A10122b77207A11443b8657I6341f5135b9908l6196D7570
12046A5358a57023E181K58805A21465J6254L3849a02272M2012a7319l05886A10601
12034i0220J9183k2887G7851J9256b04857l5965J19307K6662B0850a62107N4779
12023a07328a5848A37240b50127I757a08502J926A37793B6613J05090C3676i2628
$$ y = [-373131, 124572, 216275, -271414, -167819, 190924, -54729, -369816, -13650, 66469, -24771, 192197, 244659, 175908, 191927, 43198, -151855, -23269, -133047, -233932, 10176, -132974, -69176, 139865, 340552, 44070, 431600, 972465, 1339704, 528696, 232648, -180382, 87583, 220653, 197325, 264967, 147440, 61792, 96830, -61147, -18882, 162388, 67540, -38796, 266944, -518209, -78269, -13205, 110122, -277207, 111443, -28657, 96341, -65135, -29908, -66104, 47570, 15358, -157023, 5181, 263986, 121465, 137719, 171568, -102272, -60260, -17319, -323205, 110601, -90220, -71037, -93924, 77851, 97107, -204857, -240822, -121515, -94853, 20850, -162107, -107328, -15848, 137240, -250127, 9757, -108502, -106576, 137793, 26613, 131703, 33676, -92628]
12011C8262K02925G5873R88a08263A32837A1037c8170k2629A68947p7446i9452
11999a02331m2558j37147L9461H6887Q2935P0250f4200k37738A25565D1649f6411
11987a14169A25657L0277a55180g1653k2232B50094k1551a9015A88021g569B43741
11975b57844a06082b7558j06696b7717D2488e9543E7365a9569j1344m3617I3766
11963F3947d8645k30610j35641J7090a83099g7482L2202K1608k75777C7822M09788
11952D47610j67351c90281O7827c1628A60231M2009g2170I5409a03173H8945a36095
11940b3272A56366o3734a54684L3588q8651f1528A01803b6880E2543b17476N9312
11929a58164B65384B7039c32352a728j38395M5315m1757A83191B3832c38299J37358
$$ y = [38262, 241187, 75873, 76861, -108263, 132837, 11037, -38170, -60799, 168947, 91501, -99452, -102331, -144889, -282036, -242575, 86887, 169822, 240072, -64200, -301938, 125565, 41649, -66411, -114169, 125657, 155934, -155180, -71653, -93885, 250094, 228543, -19015, 188021, -7569, 243741, -257844, -106082, -27558, -134254, -27717, 42488, -59543, 57365, -19569, -30913, -74530, 93766, 63947, -48645, -279255, -414896, -397806, -183099, -77482, -45280, -23672, -299449, 37822, 447610, 280259, -390281, -322454, -31628, 160231, 202240, -72170, 95409, -103173, 88945, -136095, -23272, 156366, 92632, -154684, -121096, -209747, -61528, 101803, -26880, 52543, -217476, -158164, 265384, 27039, -332352, -1728, -140123, -94808, -136565, 183191, 23832, -338299, -200941]
11918b00941O7933B7371K1991a10619j3548k18375B94916f9793C47580b44076
11907b28997B4399a14573L8987A89017j1040O314H6624b08741b9537H206a21741
11895D1303h5864K5498G3436h3044G5426d1217a0956A10263d140C8498J63081
11884B01579b25526M814H7426J58625a99576A31098a50561m066L3667A86815A1658
11872a60227j42842d5853k2249A78421d5322B51900E587f1430j12791E0917h8403
11860a39023k670A50597a69804A67660h6729J970L7939J8971j38776M5982A11724
11848a53322A21612K0635J249B1953M6163J5119J94094a26354o9015g591l12010
11837c19601G3518i4352H0567J78534b3049H5341K79544a32542A93282F2484a08595
$$ y = [-200941, -133008, 27371, 49362, -110619, -124167, -342542, 294916, -69793, 347580, -244076, -228997, 24399, -114573, -75586, 189017, 177977, 184291, 86624, -208741, -29537, 8206, -121741, 41303, -85864, -60366, 73436, -83044, 75426, -41217, -10956, 110263, -4140, 38498, 201579, -225526, -220712, 87426, 246051, -199576, 131098, -150561, -154627, -120960, 186815, 11658, -160227, -303069, -45853, -68102, 178421, -45322, 251900, 5587, -61430, -174221, 50917, -88403, -139023, -141693, 150597, -169804, 167660, -86729, -84759, -46820, -27849, -166625, -120643, 111724, -153322, 121612, 142247, 143496, 21953, 68116, 83235, 277329, -126354, -195369, -7591, -319601, 73518, -94352, 80567, 259101, -23049, 85341, 364885, -132542, 193282, 62484, -108595]
11825a69489A42867o7591b77085A42412A6792b69344B82748I9951a6163H2552
11814h0795A30960J52496k6884i5262A38843a32865l1423K4519f367r8880e1484
11802A85932B8548d9271j40086j22509G6997c16004a41343B18295F4451b27125
11791g2510A7117a85402f9539j15623c3693I5854d7964E5342A6999J2091J75705
11780B04795b6025m9342a0472j63723P293K3231I1458a628k1067j08906J1044
11769a20557R229A27569n515P6670a23350F5964g5017j89362H4715i7064G074
11757h6086A09383O9327f6029A99595d2097A38798D1964b4154A48310c30411a19443
11745F6693a62660p8480L1788B50693i9916k1566J1700K2465A61253b09085F3326
$$ y = [-169489, 142867, 75276, -277085, 142412, 16792, -269344, 282748, 99951, -16163, 82552, -80795, 130960, 283456, 256572, -95262, 138843, -132865, -164288, -139769, -6367, -105247, -51484, 185932, 28548, -49271, -189357, -311866, 76997, -316004, -141343, 218295, 64451, -227125, -72510, 17117, -185402, -69539, -185162, -33693, 95854, -47964, 55342, 16999, 29090, 204795, -26025, -75367, -10472, -174195, -166902, -143671, 91458, -1628, -22695, -131601, -120557, -111328, 127569, 122054, 198724, -123350, 65964, -75017, -264379, 84715, -97064, 7074, -86086, 109383, 178710, -66029, 199595, -42097, 138798, 41964, -24154, 148310, -330411, -119443, 66693, -162660, -241140, -209352, 250693, -99916, -121482, -109782, -87317, 161253, -209085, 63326]
11733f3175A25338b82718N9680B91595a17495B22044n2407a39341B1611q263a82194
11721f3093j32966E055b47996m4181b2504I3080a68870j61198J31729D5031L0931
11710G5962c1159j05757F2352K952g564B36373R4972m7393b71735f3818H0313
11698C37560j58155D9307b630B22112f8252m59I1038J02770a53047I9090i4821
11686A41765a29040B19553G1922L43349d9494M129H7189b43892M2955A25613a12596
11674A88418B7388a02115B34673J53551C1202N4310b16610f8662A92441F5417
11663A77927d6529C4281a79148B7911a702n35440K27696B204h2573k77146B56893
11651A55879j3896f4865A23365N3400b20220l6710L1613h1333c4605A18618j5889
$$ y = [-63175, 125338, -282718, -223038, 291595, -117495, 222044, 169637, -139341, 21611, 13348, -182194, -63093, -196059, 5055, -247996, -292177, -22504, 93080, -168870, -330068, -198339, 45031, 75962, -31159, -136916, 62352, 65304, -7564, 236373, 331345, 283952, -271735, -63818, 80313, 337560, 179405, 49307, -2630, 222112, -68252, -68711, 91038, 193808, -153047, 99090, -94821, 141765, -129040, 219553, 71922, 415271, -49494, -45365, 87189, -243892, -200937, 125613, -112596, 188418, 27388, -102115, 234673, 388224, 31202, 85512, -216610, -68662, 192441, 65417, 177927, -46529, 34281, -179148, 27911, -1702, -537142, -309446, 2204, -82573, -359719, 256893, 155879, 141983, -64865, 123365, 176765, -220220, -256930, -225317, -81333, -34605, 118618, 102729]
11640A02729L1277K25672l5292m1385B230J0396K65546A23346J41611m4458a49894
11628C33261A06127J22909I441e2804A4730N4258O3954c3710k3805j17402I7584
11616I5253f0875B1524a55766c4247k4057B81997j27117B1092J7293i901B1239
11604B387K14336j01309P0361I0789O1497F6980J21499d5282B45923j01594P9530
11593B23859a93825g9498A31803a03991J2568B30846A03974P04398B00878k0408
11583A80470o3592o81E3039a28632r314C62724A71422J70077C5580J48033N6479
11572B40092p9598g3399B18972a40902E1307c4521k35115B41297A06169J01409
11562B07578N0355D3367B738P7293J38803n3308A37O5710K2246c3012a3554B89069
$$ y = [102729, 134006, 359678, 324386, 283001, 2230, 12626, 278172, 123346, 264957, 220499, -149894, 333261, 106127, 229036, 9441, -52804, 14730, 68988, 132942, -33710, -57515, -174917, 97584, 95253, -60875, 21524, -155766, -34247, -58304, 281997, 154880, 21092, 38385, -9901, 21239, 2387, 216723, 115414, 185775, 90789, 152286, 66980, 188479, -45282, 245923, 144329, 223859, -193825, -79498, 131803, -103991, -91423, 230846, 103974, 808372, 200878, 180470, 116878, 116197, 53039, -128632, -137946, 362724, 171422, 341499, 35580, 183613, 240092, 160494, -73399, 218972, -140902, 51307, -34521, -269636, 241297, 106169, 207578, 257933, 43367, 2738, 80031, 218834, 165526, 137, 65847, 88093, -33012, -13554, 289069]
11549e8597m0833G2440L7939L80394j42272b03368F07060F0807J9448J60470a40804
11537E7348a86869d8711r2617c0540I4912J55570a76697A9548M6866P3794C6389
11525A51572a09559C46773a28109H3683J65750a07377M4644k2575a8682A83733
11514C5759J94810D9260L81120G8474a35559o4471A75992a13681a3113D015i6754
11502B31360e4149j08969B6489a71398H1395a26734C40002c07027A52870K2017
11492A74887p9880J2589J2693J29781O6975B6879J41513f7833A71694a31960B38980
11480C02003j23079h7876B32142q3811J17244L00781A30458N4781p3667a22220
11469A97791K02739d8067l9415I9887L7888J18412f9564A1462O3332p363f6677
$$ y = [-58597, -99430, 72440, 110379, 490773, 348501, -203368, 607060, 60807, 80255, 240725, -140804, 57348, -186869, -48711, -141328, -30540, 94912, 250482, -176697, 19548, 66414, 140208, 36389, 151572, -109559, 346773, -128109, 83683, 249433, -107377, -62733, -85308, -18682, 183733, 35759, 230569, 49260, 430380, 78474, -135559, -200030, 175992, -113681, -13113, 4015, -96754, 231360, -54149, -163118, 26489, -171398, 81395, -126734, 340002, -307027, 152870, 174887, 95007, 107596, 120289, 250070, 317045, 26879, 168392, -67833, 171694, -131960, 238980, 302003, 178924, -87876, 232142, 148331, 265575, 566356, 130458, 185239, 111572, -122220, 197791, 400530, -48067, -87482, 99887, 137775, 256187, -69564, 11462, 74794, 67431, -66677]
11457A59629J40102G3361K95364l9901a38237A38392K49060A6822a3213A2839
11446a16304K6781C8521J41271h8205J3845o0910B75478p06a13902A24063b26231
11434a0749j65781A67547i3859L4459A84512k813G0953h1012n5710d223C8682
11422B24134r3949a61679C8715f4562B22204B2886J00075m5561d53557i0323B8955
11410a21400A70429a93592A09893K9856a39392C3276L90769c8185r1539c0290
11399a38146m1306B13190a05513B81432j19870D4899d594o5095J65D9518a74578
11387a2954D25440E4508a37554L3225L5492j29144D6124a17493j5793F3115J11620
11376A74735G6252K0297a40004A15168g2922H3890a29979A31059a26088n9215
$$ y = [159629, 299731, 73361, 368725, 328824, -138237, 138392, 387452, 16822, -13213, 12839, -116304, -89523, 38521, 179792, -88205, -74360, -135270, 275478, 274772, -113902, 124063, -226231, -10749, -176530, 167547, -93859, -59400, 184512, 181699, 70953, -81012, -136722, -4223, 38682, 224134, 130185, -161679, 38715, -64562, 222204, 22886, 122961, 77400, -453557, -90323, 28955, -121400, 170429, -193592, 109893, 139749, -139392, 33276, 424045, -38185, -129724, -30290, -138146, -179452, 213190, -105513, 281432, 161562, 44899, -4594, -69689, -69524, 49518, -174578, -12954, 425440, 54508, -137554, -104329, -68837, -197981, 46124, -117493, -133286, 63115, 174735, 76252, 96549, -140004, 115168, -72922, 83890, -129979, 131059, -126088, -185303]
11366a85303d9852C74798A04107a64199j8872h5749A05624a03881K4882A54020
11355b3418A59417b88262A9114b09999I3158a56659H9300J3556i0833H1031i5185
11343C7126K62719q5678F4701K24749a27861K0534d156B70495F3947O7628a42115
11331E6337B7511J66a47431F2935k8951a50998l6695A06717a1816j54003j613
11320a67432A71629a78435D05406b06705Q2510k33429i2692B99475G9947J74982
11310B54929f1126A37579h356I2348R9230a56576j15698A68821L9227b9492G5410
11298i5964A3349c39922A8426j701K91924F126J15894k5244c0846q1062B171K46254
11286B48425D3646b64191B05114I4299c3990q905C8281j239M1916Q4306a52462
$$ y = [-185303, -49852, 374798, 104107, -164199, -183071, -85749, 105624, -103881, -78999, 154020, -23418, 159417, -288262, 19114, -209999, 93158, -156659, 89300, 102856, -90833, 81031, -95185, 37126, 299845, 214167, 64701, 289450, -127861, -107327, -4156, 270495, 63947, 131575, -142115, 56337, 27511, 27677, -147431, 62935, 33984, -150998, -187693, 106717, -11816, -165819, -167432, 171629, -178435, 405406, -206705, -124195, -357624, -92692, 299475, 79947, 254929, -61126, 137579, -8356, 92348, 191578, -156576, -272274, 168821, 208048, -29492, 75410, -95964, 13349, -339922, 18426, 16725, 308649, 6126, 122020, 96776, -30846, -111908, 2171, 248425, 43646, -264191, 205114, 94299, -33990, -42895, 38281, 37042, 78958, 163264, -152462]
11274C9103b03699f753F9350j3539i9072C79796C5344i6036J9965p1750D9670
11262a12982m3504A60366h3000B906a17099F107J29248a39972I7861h8860n5744
11251a44604P900I0420a17132I7059L4182c4149A12324a5780G6540J47033b37116
11239B5741n447b12753J05054A09334m81J22656I0775l1433a60326A26904P192
11228A34096g3580D6549b28441D3115b28147A55185a13151B67987j18477b96260
11217A92483b01611L8774A58191F5998a87997h007k02097I193a10600A5950a69619
11205a97219b3656j85942a00510F1259d8186p5005A78362C9821i6264B06510a56969
11193a84058H4584c3451r6591B154N4950a04349D5384a05014j21892C90533a19869
$$ y = [39103, -203699, -6753, 69350, 55811, -99072, 379796, 35344, -96036, -76071, -147821, 49670, -112982, -156486, 160366, -83000, 2906, -117099, 6107, 135355, -139972, 97861, -88860, -144604, -136704, 90420, -117132, 97059, 131241, -34149, 112324, -15780, 76540, 223573, -237116, 25741, 20294, -212753, -107699, 109334, 108853, 231509, 90775, 59342, -160326, 126904, 134096, -73580, 46549, -228441, 43115, -228147, 155185, -113151, 267987, 149510, -296260, 192483, -201611, -162837, 158191, 65998, -187997, -8007, -210104, 9193, -110600, 15950, -169619, -197219, -23656, -209598, -100510, 61259, -48186, -123191, 178362, 39821, -96264, 206510, -156969, -184058, 84584, -33451, -130042, 2154, 57104, -104349, 45384, -105014, -226906, 390533, -119869]
11181A53519b05762C06197A17012h4250k20825P3339A69089o1690a58974A62118
11170f7766P933q8363c8018n6313B7575b97384L1257B31138C6705i5785k50260
11159c46045m9195h3067A32061c6018A31273b56065B1913a44344r3375a05422
11148d7777m0389A49293b4431I8844c51118b3677B18128b23040F8303J10724F0753
11136B67120a7124k78428i0442B23031J65231r4665h8457L4996B215N6699b13138
11124A88903C775J78878k2303O5534C2409K90084C1895J54710l7993a02547B32406
11112c2460A04157a75786K9827g0531A31042c4752A38262J5797K9601M1839K17819
11101D43318E5862O5010b8364B56204C9248J10445M2631l4884J90806O7133A26242
$$ y = [153519, -205762, 306197, 117012, -84250, -305075, -231736, 169089, 107399, -158974, 162118, -67766, -59833, -148196, -38018, -94331, 27575, -297384, -266127, 231138, 36705, -95785, -346045, -395240, -83067, 132061, -36018, 131273, -256065, 21913, -144344, -237719, -105422, -47777, -88166, 149293, -24431, 98844, -351118, -23677, 218128, -223040, 68303, 179027, 60753, 267120, -17124, -295552, -90442, 223031, 388262, 293597, -88457, -53461, 2215, 58914, -213138, 188903, 3775, 182653, 160350, 225884, 32409, 322493, 31895, 186605, 148612, -102547, 232406, -32460, 104157, -175786, -145959, -70531, 131042, -34752, 138262, 154059, 183660, 225499, 443318, 55862, 120872, -28364, 256204, 39248, 149693, 192324, 157440, 348246, 415379, 126242]
11089B11498d488B38919g0060B85011r6691K45370k007q2239A18522i9454A15063
11077B94647J17361j64478A10400A9125J82032Q6923R9575A70963M175M09575
11067E84713B77404K38774o3982o6624J86693l9654J14736l05526J96785m4394
11057D94212o182J89881j73393O4939k22623N95607k79014l6404N4063R5744K4708
11046H01538P4356j3717O7206J4364k64316B75632M50068P9315n1973j09890O5835
11035G08987r740l9929j29638k7057O7743Q2960j78195o152N10472l92428O45205
11024A232228m62778k38984m5531r5721J36163L68176j20235j05001L7207k19825
11014D85699k42818O59748k75422k19570L85383k3001k05479K13878q0300R9889
$$ y = [211498, -4488, 238919, -70060, 285011, 188320, 433690, 431683, 349444, 118522, -99454, 115063, 294647, 412008, 247530, 110400, 19125, 201157, 288080, 387655, 170963, 175138, 584713, 277404, 516178, 452196, 385572, 572265, 532611, 647347, 341821, 538606, 494212, 488030, 677911, 504518, 569457, 346834, 942441, 663427, 627023, 681086, 776830, 801538, 875894, 862177, 929383, 943747, 679431, 275632, 725700, 805015, 753042, 643152, 708987, 699247, 659318, 529680, 502623, 570366, 653326, 475131, 468979, 979451, 587023, 1232228, 769450, 530466, 484935, 389214, 525377, 893553, 773318, 668317, 705524, 485699, 242881, 902629, 627207, 407637, 793020, 770019, 564540, 778418, 698118, 798007]
11004G98007l06958q4294L1132L97404L7074l05589k31597M24875k68271j23399
10994C68384P07701m08579J53460k01956J00381O9475k1218K41569m18667K85241
10984H75791j55592L19056K7521k6051K55108l21922J11014N84252j04002N53405
10974B118580j6162N87135J3174L63611k72885l70848j17377l24774j00119j19611
10964A760724j48522K39414j39304K2973n6491L40734j72764Q0334l34075L9256
10954A632279M9211n68469N8758k29398k52457j55465K20433j49262k33879J64971
10944E36722k14245j27628J38597r8390o2048M0260A5804b59085A86912M3646
10934B30558A06300Q8481b00733N9040A8173J80201e6851B37389A15663c6131
$$ y = [798007, 491049, 406755, 437887, 835291, 872365, 566776, 335179, 760054, 491783, 368384, 1076085, 667506, 820966, 619010, 719391, 788866, 767648, 1009217, 590550, 875791, 720199, 1039255, 1066776, 1040725, 1295833, 973911, 1084925, 1669177, 1565175, 2118580, 2102418, 2689553, 2702727, 3066338, 2793453, 2422605, 2305228, 1980454, 1880335, 1760724, 1612202, 1851616, 1712312, 1735285, 1678794, 2019528, 1846764, 1927098, 1593023, 1632279, 1681490, 1113021, 1171779, 942381, 689924, 534459, 754892, 605630, 371751, 536722, 322477, 194849, 333446, 235056, 173008, 213268, 15804, -259085, 186912, 230558, 106300, 194781, -200733, -141693, 18173, 198374, -56851, 237389, 115663, -36131]
10923F0054J98502a17235r4569I2965a33169I3902J46699H7948b05872A50703
10912c9976A3711J21763a72867j63596H9506K8219K91653e2616B61029e0742B98360
10900B7720a32173O3333q7615A22717J38862b49548C44L73772d697q104o2424
10889g5225a6718j18710A98314b93012A76269a11161j53288A12622A5964K29778
10879B45742j7600a29278A52364b52729B98271j26959J58872G0120g8056b4226
10868a07348k89846D5099a36685C5172M7392J71716b77420b1059B5146a09660
10857A12730a26647e7776A13983N5082a93576L2774O1705D8738a38972I3340a41730
10845G8610J12541b19710J0994h0996G4380c12010J55165j43690C8169K46577
$$ y = [60054, 258556, -117235, -211804, 92965, -133169, 93902, 240601, 87948, -205872, 150703, -39976, 13711, 135474, -172867, -336463, 89506, 117725, 409378, -52616, 261029, -50742, 298360, 27720, -132173, -68840, -156455, 122717, 261579, -249548, 344, 374116, -4697, -12801, -75225, -16718, -135428, 198314, -293012, 176269, -111161, -264449, 112622, 15964, 245742, 228142, -129278, 152364, -252729, 298271, 171312, 330184, 70120, -78056, -24226, -107348, -397194, 45099, -136685, 35172, 82564, 254280, -277420, -21059, 25146, -109660, 112730, -126647, -57776, 113983, 169065, -193576, -160802, -99097, 48738, -138972, 93340, -141730, 78610, 191151, -219710, -208716, -80996, 74380, -312010, -156845, -300535, 38169, 284746]
10835B84746b29062A82046g8846j38031j7591M6036B24213b31525n5999B69684
10824b99904C22856b07920d6881D8226a05637r5367q402F0254b23180A35790a2034
10812b00222a5133j03728k229b8296A99697a83723D2432b56476I9604O5034a54327
10800a4187k76287O4145G4526b11366A00290b80504A57991N7474b08467G1067
10789a50839j24601A09227b18685A4293n837a48575q0069r6072Q2200B60990c11820
10777A6687b46662J09075k6084E2871a16681i721j11495A59010J3615l5489a68938
10765C04205c167A67052q0570Q4356a32059A40684a21057M9790j5208A53959M9086
10754B03045n1426a45793E3055J2404L02361a47596k57530b2382E7270d05777
$$ y = [284746, -229062, 182046, -78846, -216877, -234468, -188432, 224213, -231525, -287524, 269684, -299904, 322856, -207920, -46881, 48226, -105637, -201004, -209406, 60254, -223180, 135790, -12034, -200222, -15133, -118861, -121090, -28296, 199697, -183723, 42432, -256476, 99604, 164638, -154327, -14187, -290474, -226329, 74526, -211366, 100290, -280504, 157991, 215465, -208467, 71067, -150839, -275440, 109227, -218685, 14293, 8456, -148575, -228644, -324716, -242516, 260990, -311820, 16687, -246662, -137587, -163671, 52871, -116681, -9721, -121216, 159010, 172625, 137136, -168938, 304205, -3167, 167052, 86482, 170838, -132059, 140684, -121057, -71267, -86475, 153959, 203045, 151619, -145793, 53055, 65459, 367820, -147596, -405126, -22382, 57270, -405777]
10743B42515J7582a13202A31891a40020A74183b9717B31775d5751l7867A74017
10732A82370a81199M1980M4552l1765k02674a35506F9892N8668O0751b13404B33897
10720e2116n0981o5899C12468a68372f4794p0205j22544j59838a11683b3138E5019
10708C8580j6827m341a50089k6378M3802j62381C7481a30720e729I4271J47856
10697B42127b35967A21127b79972M9719h8410A73656a99932A0462O6394a08829
10686A4754F372i2698C8416e466k93944J33454k61342g1083L4797m1066o3785
10675a41137e7490o5565A55925a74031m3047e6360I0362a42676I2224a55428f9745
10663H1729f0416A44368K4533b7301E1174h4875C09512a19821B22017b9392E9178
$$ y = [242515, 260097, -113202, 131891, -140020, 174183, -29717, 231775, -45751, -83618, 174017, 182370, -181199, -139219, -94667, -126432, -329106, -135506, 69892, 128560, 189311, -213404, 233897, -52116, -103097, -168996, 312468, -168372, -64794, -134999, -257543, -417381, -111683, -23138, 55019, 38580, 21753, 17412, -150089, -176467, -132665, -295046, 37481, -130720, -5729, 94271, 242127, -235967, 121127, -279972, -230253, -88410, 173656, -199932, 10462, 76856, -108829, 14754, 6372, -92698, 38416, -5466, -299410, -165956, -427298, -71083, -36286, -77352, -141137, -57490, -123055, 155925, -174031, -217078, -56360, 90362, -142676, 92224, -155428, -69745, 81729, -60416, 144368, 168901, -27301, 51174, -84875, 309512, -119821, 222017, -29392, 59178]
10651B60909c6541B06265k456a00667p3790H4842p133d9446j78714A59036P7722
10640B36758b42536A40817A5893f1494E9577b43993B5804a89481Q7835B0764c4924
10628c11171P5646B33897c89165R4239a20801C20976A04908C9378K4249g0011
10617b51933H3836a99522Q3166l52958b05963A24799n8501c09915a48224A61119
10606I9997c02237a4315A46401b18326e7003n32443A11409c38695B22483j03403
10596A19080B8684i2459M500l0126o3181A40408C1340J60242a19837j61985Q5408
10585a96414A79833q3956b13010f0636F0048A6608i2051J7418l90935J80583d0630
10573b87753C656K76842b81975J40478f5324B5934b5782k1548j72737d4114A20161
$$ y = [260909, -36541, 206265, 203809, -100667, -174457, 84842, 77709, -49446, -228160, 159036, 236758, -242536, 140817, 15893, -61494, 59577, -243993, 25804, -189481, -101646, 20764, -34924, -311171, -235525, 233897, -389165, -294926, -120801, 320976, 104908, 39378, 63627, -70011, -251933, 83836, -199522, -116356, -469314, -205963, 124799, 66298, -309915, -148224, 161119, 99997, -302237, -14315, 146401, -218326, -57003, -589446, 111409, -338695, 222483, 119080, 28684, -92459, -87959, -118085, -181266, 140408, 31340, 191582, -119837, -281822, -196414, 179833, 95877, -213010, -60636, 60048, 16608, -92051, -74633, -465568, -284985, -40630, -287753, 3656, 280498, -281975, -141497, -65324, 25934, -25782, -47330, -220067, -44114, 120161]
10561h8989A24991a18469j59880c5776m78111D0118a27954N33B87938a70090j96160
10550c66250A34998P349B9105a54606P5886I1387J19331b45231B16264p6659b72887
10538a056k01713e3721B05188a94890C5946g8497C0093L803K16823a8339o4338
10527h2677m3122d1953q5723k3827A47055a25122R817L5726A6741L1438b33229
10515c81344A58952b90564B79845H6703J03297G365h031m4732B83131F7027P9929
10504A46956c9769F0017j6543L4108a77830A60499l247R271D5112J26792a20773
10492a7443p0998j67218d7983j00912O5686A49530b76743a20472C48591K0958
10482C69549H5981M68618F9004M36370n2989G0074A7425a60322H8683b95211a0316
$$ y = [-88989, 124991, -118469, -278349, -35776, -513887, 40118, -127954, -127421, 287938, -170090, -366250, 134998, 142347, 29105, -154606, -78720, 91387, 210718, -245231, 216264, 139605, -272887, -1056, -202769, -53721, 205188, -194890, 35946, -78497, 30093, 33896, 250719, -18339, -82677, -125799, -41953, -127676, -151503, 147055, -125122, -115305, -79579, 16741, 48179, -233229, -381344, 158952, -290564, 279845, 86703, 190000, 7365, -8031, -52763, 283131, 67027, 146956, -39769, 60017, 43474, 77582, -177830, 160499, 157252, 166523, 45112, 171904, -120773, -17443, -88441, -255659, -47983, -148895, -83209, 149530, -276743, -120472, 348591, 369549, 85981, 554599, 69004, 505374, 452385, 70074, 17425, -160322, 88683, -295211, -10316]
10470g166j61275g766c783j29388A4231a23437A4022Q6018B7937c3006D5451a90767
10457A3106P4805D3404q59j8738a55268c2125q6491A92325q0461f8402A8737a46368
10444g6955C5288b66731a19395c5023A94299q8981b09116r9524Q7061A83003a7781
10432e126I873J4243a01733l79538A42269D3726e9257G6727R0108i3545B06756
10420A40076h8937k0687l7430n6156A00496a83817A43716F6625c36475B86474
10409H8297b50699O3829c3194j5986K1955a0984j86961B18758b3379f65C7709
10397c2631A88516a47680B20019M187C092L0807H36J74310C6181K23307a08646
10385A1450a26564B19328B9490a31627C1870R2782J48083O3535J93182A67163
$$ y = [-7166, -168441, -7766, -3783, -133171, 14231, -123437, 14022, 100040, 27937, -33006, 45451, -190767, 13106, 87911, 43404, 42545, 23807, -155268, -32125, -118616, 192325, 111864, -68402, 18737, -146368, -76955, 35288, -266731, -119395, -35023, 194299, 105318, -209116, -308640, -221579, 183003, -17781, -5126, 9873, 24116, -101733, -481271, 142269, 43726, -59257, 76727, 166835, -93545, 206756, 140076, -88937, -109624, -147054, -203210, 100496, -183817, 143716, 66625, -336475, 286474, 88297, -250699, -186870, -33194, -49180, -27225, -10984, -197945, 218758, -23379, -665, 37709, -32631, 188516, -147680, 220019, 224206, 3092, 33899, 836, 175146, 36181, 259488, -108646, 11450, -126564, 219328, 29490, -131627, 31870, 124652, 272735, 336270, 529452, 167163]
10374B14421b6432A35534J54723A08565J05081K75979A41836Q0266K56393B07615
10363C29873A42277J60183g9668n9555A66462J60693A7035J22372J05575I3601
10352A34259J83275M31918l21069J18675J3054j91944O8927a5814E33541k6876
10342E06665j21033A90506l2959N7885J64129j15019P4125a94016g7830C12122
10331B59660C4008J86825N6981E5740R7921n4951G370L08123A30421M45212j92190
10320C83443j80828M0605h6874A19762n8881J59864H8067j1461g0792F268J59850
10309A66118A1216d2734j364E0743J01486p4785h7023L2080p0593A28064a92164
10297A28510a28243d3070M061k10227g7962I7400M59614a38998j5397M3142M3991
$$ y = [214421, -26432, 135534, 290257, 108565, 213646, 489625, 141836, 222102, 478495, 207615, 329873, 142277, 302460, -79668, -139223, 166462, 327155, 17035, 139407, 244982, 93601, 134259, 317534, 749452, 428383, 547058, 560112, 368168, 437095, -15814, 533541, 506665, 385632, 190506, 157547, 215432, 379561, 264542, 338667, -194016, -77830, 312122, 259660, 34008, 220833, 277814, 55740, 153661, 98710, 7370, 315493, 130421, 575633, 383443, 202615, 243220, -86874, 119762, 60881, 220745, 88067, 76606, -70792, 6268, 166118, 11216, -42734, -44098, 50743, 152229, 77444, -87023, -54943, -125536, 128064, -192164, 128510, -128243, -43070, -39009, -249236, -77962, 97400, 557014, -138998, -154395, -111253, -67262]
10286f7262j3859A34781a38719a4473D20289A587N0618g1391L3198j5572j02072
10275a55837O4797A79260c56721E1945b85600R6021A54918Q629P814a03270A97565
10263E8786J38444K43509I530N92868B35984K4184A15221K43532j26228b20829
10252A1998J18972b00916A56818L53856A60508b35218P7895A26368c865A17379
10241A25450d9008r3635H7873b43248C85513F3560c4780n2694c5304B7881f6158
10229c59361B20896c34662a8559m8219A26389n4182A5989J76721c4022j31040
10219a65062J5700B48941A04355b2654l17540c5293B22651f3565j34568d3678
10208B84748B4139L1119P3041J62037j4164d07057N5743B1927J54645a83417A4061
$$ y = [-67262, -81121, 134781, -138719, -14473, 420289, 1587, 52205, -71391, -38193, -53765, -155837, -91040, 179260, -356721, 51945, -285600, -189579, 154918, 163547, 171361, -103270, 197565, 58786, 197230, 440739, 9530, 602398, 235984, 260168, 115221, 358753, 232525, -220829, 11998, 130970, -200916, 156818, 510674, 160508, -235218, -157323, 126368, -3865, 117379, 125450, -49008, -142643, 87873, -243248, 385513, 63560, -34780, -87474, -35304, 27881, -66158, -359361, 220896, -334662, -18559, -66778, 126389, 72207, 15989, 192710, -34022, -165062, -149362, 248941, 104355, -22654, -340194, -35293, 222651, -63565, -198133, -43678, 284748, 24139, 55258, 128299, 290336, 276172, -407057, -351314, 21927, 176572, -183417, 14061]
10196b43008A36113k910e4927A5858J17731g9263E3547b04445K428M2753b1504
10184a4676B03516o7798M7937b73600J20949A75740a7896k52144J13702B5138
10173b5698A53569j7162b81254h0200a8070D8732e1645Q164A3865a53277g3961
10161A48806E1676a3396A3489b25380J12287H5003b0335m0682F02c18661A38794
10149D8273j6456a1022F8778L7970b627j00661c8627j22234j60122A97829b02329
10137b40758J3511m0540A45930b44966J09350j36811c7602j56044A33335a3757
10126h9568B13541a06505G0159J08920a08595k7680H5816O5494E9075b15087B34545
10114A23300C3040a5363D25377a23761o6740D7598J51383D4605J34160b54903
$$ y = [-243008, 136113, 133203, -54927, 15858, 133589, -79263, 53547, -204445, -202017, -159264, -21504, -14676, 203516, 135718, 183655, -273600, -152651, 175740, -17896, -270040, -156338, 25138, -25698, 153569, 136407, -281254, -80200, -18070, 48732, -51645, -43481, 13865, -153277, -73961, 148806, 51676, -13396, 13489, -225380, -113093, 85003, -20335, -61017, 602, -318661, 138794, 48273, 31817, -11022, 68778, 106748, -2627, -103288, -38627, -160861, -320983, 197829, -202329, -240758, -227247, -267787, 145930, -244966, -135616, -272427, -37602, -193646, 133335, -13757, -89568, 213541, -106505, 70159, 179079, -108595, -136275, 85816, 151310, 59075, -215087, 234545, 123300, 33040, -15363, 425377, -123761, -190501, 47598, 198981, 44605, 178765, -254903]
10103b28539B45095j07061a21872p6636A97082a26145b3886l02993h9833C58439
10092b14241F6950a43466k78360B50328a28338k8442k07919a22627l56331B56349
10081F4571J22307f6960j57258A18790a28139A88069a9436k08000g8454k27752
10071c06206a22761l28280b0554k58090C0438a06833q514A83641d7342o7166B89241
10059I3090a08191B08384b31103l7454j04188C6485c5547p3235l5234C3983b32806
10047a57955O6491j57987L8276J4770Q1247C50917a12445A13507a23908B2164
10036a13915G369P7412a85393l4367J06930b8667q1423B04417c1127n1458k51223
10025c33808J65083A31151b63947B08588e4236k22243C44416a94056B18285I4680
$$ y = [-228539, 245095, 138034, -121872, -198508, 197082, -126145, -23886, -326879, -89833, 358439, -214241, 66950, -143466, -421826, 250328, -128338, -156780, -364699, -122627, -478958, 256349, 64571, 186878, -66960, -224218, 118790, -128139, 188069, -19436, -227436, -78454, -306206, -122761, -451041, -20554, -278644, 30438, -106833, -115347, 183641, -47342, -114508, 289241, 93090, -108191, 208384, -231103, -268557, -372745, 36485, -35547, -108782, -144016, 33983, -232806, -157955, -91464, -249451, -211175, -196405, -115158, 350917, -112445, 113507, -123908, 22164, -113915, 7369, 84781, -185393, -219760, -112830, -28667, -110090, 204417, -31127, -82585, -333808, -168725, 131151, -263947, 208588, -54236, -276479, 344416, -194056, 218285, 94680]
10014a90169J0855r1891B31826H3173c8675j50132k06773a63227K5609o7655e9628
10002b39093A3478a2726A85584L1884E4332m128B585a52656j81358L5396J12454
9991a86164j07877A29963K1067a37381k09756B32516a27046l16524J8785B8443
9980F7271e1548r8051I1000f4648k46500C02449A6028d6816I016a14798l8690
9969a53488a1762N741G7615a68525e0595A14768d07168J77910b1587o080J2596
9958a5071D8045K97941f5306j36949K8385d9250j4283j32188A02510J29026a42926
9946a67105c1029j57393a3220k55253a20243j24577F6740a10767B2409J37200
9936A59609B0450b30243q9702f8814q5036k0688B9173b12685F1685a815m0726
$$ y = [-190169, -179314, -271205, 231826, 83173, -38675, -188807, -395580, -163227, -137618, -205273, -59628, -239093, 13478, -12726, 185584, 217468, 54332, 50204, 2585, -152656, -334014, -298618, -186164, -294041, 129963, 151030, -137381, -347137, 232516, -127046, -443570, -424785, 28443, 67271, -51548, -149599, 91000, -64648, -311148, 302449, 16028, -46816, 9016, -114798, -153488, -11762, -6021, 77615, -168525, -50595, 114768, -407168, -229258, -21587, -27667, -15071, 48045, 345986, -65306, -202255, -173870, -49250, -63533, -195721, 102510, 231536, -142926, -167105, -31029, -188422, -13220, -268473, -120243, -244820, 66740, -110767, 22409, 159609, 20450, -230243, -319945, -68814, -153850, -174538, 29173, -212685, 61685, -1815, -42541]
9925d2541m08315i6195A6897a56411A47540b46251B5832i9081k29836B50554G7407
9913H0702g6954e842n351B40418F5219a63489D20508B03645c16926B20651b68542
9901D0187b44991B13774c91005f1073l40572a96909a9003j72038j8332Q1077j04460
9890b32756d699I4249K35587c22402a42132C5823K1469b39422G5149a80327A01254
9878D376J14885c03921B1552O2255b15424A15653J7336a56961A13505d74487h0262
9866i4030B1814O582d4870j8030q9382G7952C0878a25603A9323b03341j9597A37240
9853b79835b9498A78681F6501b36314i203A26573J84605A40937J8734E2106N3404
9842A05510e7537m5420j64932A70844h186j17476b0366A12466L6897d9529h198
$$ y = [-42541, -450856, -96195, 16897, -156411, 147540, -246251, 25832, -99081, -328917, 250554, 77407, 80702, -76954, -5842, -11193, 240418, 65219, -163489, 420508, 203645, -316926, 220651, -268542, 40187, -244991, 213774, -391005, -61073, -401645, -196909, -19003, -191041, -209373, -128296, -232756, -4699, 94249, 329836, -322402, -142132, 35823, 57292, -239422, 75149, -180327, 101254, 4376, 119261, -303921, 21552, 83807, -215424, 115653, 132989, -156961, 113505, -474487, -80262, -94030, 21814, 28396, -44870, -62900, -152282, 77952, 30878, -125603, 19323, -203341, -222938, 137240, -279835, -29498, 178681, 66501, -236314, -9203, 126573, 311178, 140937, 159671, 52106, 105510, -57537, -102957, -267889, 170844, -8186, -125662, -20366, 112466, 149363, -49529, -8198]
9830A83186b3439A43227E7517a68985D1994b1023o3371J1000J8105J1077j68495
9819b12707A05326m7491c24905o781J13304a07697k02827A45849b80758h0074
9808C80998i5421L7277j06305f8783F3704h9140j48513E4918b09311K9238f4287
9796a96333c1198l02651Q9145B90422A34059a57865b8292m6071F5363b6781q7066
9785a13847j1527A55401O9154A04801r957B3109b31326B25185b34101Q1887j03831
9774b56045a12725L7667B44441j22076r820a57440A51980b3E04535a10632D5838
9762a21387A19114b48677a17158B16555a87545C3507L9881d53144f3431p079m4364
9751a14874j5460c2647G6395a40114a5514C5943l419c05408n5358A08732b45419
$$ y = [183186, -23439, 143227, 57517, -168985, 41994, -21023, -84394, -73394, -55289, -44212, -212707, 105326, 57835, -324905, -331686, -218382, -107697, -310524, 145849, -280758, -80074, 380998, -95421, -58144, -164449, -68783, 63704, -89140, -237653, 54918, -209311, -180073, -64287, -196333, -31198, -333849, -244704, 290422, 134059, -157865, -28292, -74363, 65363, -26781, -113847, -125374, 155401, 224555, 104801, 94844, 23109, -231326, 225185, -234101, -152214, -256045, -112725, -75058, 244441, 122365, 112545, -157440, 151980, -23, 504535, -110632, 45838, -121387, 119114, -248677, -117158, 216555, -187545, 33507, 73388, -453144, -63431, -70510, -114874, -130334, -32647, 76395, -140114, -15514, 35943, 32524, -305408, -360766, 108732, -245419]
9739i6007l00442e105G4365Q2388d7333A30767e8916I3396C3621b22704j2055
9728b34759f1055l2343F6827b30689I1066p307a31541a4818C54973a76767a3766
9716d8586B3815J8245J86817b15447A25837a13302l0006B11281h5390B1755b28132
9704a03212k2374o2227B413f4453k12765a27809q1934e489l14083h0276q2004
9693a62280n076A61427N389C7657a4420l18053C17519A577Q7856d2029j92070
9682b34099k22911Q9984P0982A741a09413A00823c61898B18078e7581m3026l46958
9671d47565F0842b64618b3325I9746b74012a17167K8461c8381G047R379J34262
9660A50688a61749a7832l91724a48391B26360b80223d7614E7083i7936d1433a0741
$$ y = [-96007, -396449, -5105, 74365, 156753, -47333, 130767, -58916, 93396, 33621, -222704, -234759, -61055, -93398, 66827, -230689, 91066, 83759, -131541, -14818, 354973, -176767, -13766, -48586, 23815, 42060, 228877, -215447, 125837, -113302, -143308, 211281, -85390, 21755, -228132, -103212, -125586, -187813, 2413, -64453, -277218, -127809, -209743, -5489, -319572, -80276, -162280, -167356, 161427, 166816, 37657, -14420, -332473, 317519, 1577, 89433, -42029, -234099, -457010, -367026, -296044, 1741, -109413, 100823, -361898, 218078, -57581, -100607, -447565, 60842, -264618, -23325, 99746, -274012, -117167, -88706, -38381, 7047, 16426, 150688, -161749, -17832, -409556, -148391, 226360, -280223, -47614, 57083, -97936, -41433, -10741]
9648a88257P186N3731k82881a31649E8958i4244j81535m8710f1043j63159G6705
9636b16858l1783J09345L8339K8665K3301j26829L4114B9956i9001E655c71392
9624B06565r6028c3475B06846h5979J710J8740C156a71474L1429P674A12529a41414
9611B1448a38358A08758c14105B13803h6132P088B17124d2576E9763a95220h0794
9599b50367j26484J21589A9981a717j24329B03769c6841j46095B03304b67935
9588c43812J09717C9702a07539l8413L445k46977C33794G6336Q7444p0529L11337
9577D04588k00189b44440e4628k73147h4628n0953e2601h305C8459a74591C5762
9565a62471D8001c40597b5328H0677b05918M5591i325l47493A179a32596k3618
$$ y = [-188257, -181071, -127340, -410221, -131649, 58958, -94244, -275779, -324489, -61043, -224202, 76705, -216858, -248641, -139296, -100957, -72292, -48991, -175820, -141706, 29956, -99001, 5655, -371392, 206565, 110537, -33475, 206846, -85979, -84269, -65529, 3156, -171474, -140045, -132371, 112529, -141414, 21448, -138358, 108758, -314105, 213803, -86132, -79044, 217124, -42576, 59763, -195220, -80794, -250367, -376851, -255262, 19981, -1717, -126046, 203769, -36841, -182936, 203304, -267935, -343812, -234095, 39702, -107539, -145952, -142507, -389484, 333794, 76336, 163780, 93251, 404588, 204399, -244440, -54628, -327775, -84628, -135581, -52601, -8305, 38459, -174591, 35762, -162471, 48001, -340597, -25328, 80677, -205918, -160327, -9325, -356818, 1179, -132596, -156214]
9554a56214F9795d16049a73927j03770a6977A18883a1425A09970a8351I5759O5483
9543A61242C4891N2926c82760I7719d02115J96044G8075f2092b7888Q906l82953
9532d01935I7569K5533a48857a8620j8358j4615D6034c74828M2147E331K09398
9521B14729a45892f5374b974q9775B85244a13128o3665b4663N763j1874k77733
9510c08507J20075D1514O1587b90550I8029L7032l4572a23722A6956J75779i7758
9498B85806j30779k1829b8962A0510b10590A01781a53386A16581E5339c00823
9487c88636A56236P3098p5300a18585I2248a77692A3449c2213r8211B49924n1264
9476A98660H4073l4493c51332F550J24084a59159e5841j40286P9764b288n8219
$$ y = [-156214, 69795, -416049, -173927, -277697, -16977, 118883, -11425, 109970, -18351, 95759, 161242, 34891, 87817, -382760, 97719, -402115, -206071, 78075, -62092, -27888, -18982, -401935, 97569, 123102, -148857, -18620, -36978, -51593, 46034, -374828, -332681, 5331, 214729, -145892, -65374, -2974, -92749, 285244, -113128, -176793, -24663, -18900, -30774, -308507, -188432, 41514, 103101, -290550, 98029, 135061, 100489, -123722, 16956, 192735, -97758, 285806, 155027, 133198, -28962, 10510, -210590, 101781, -153386, 116581, 55339, -300823, -388636, 156236, 229334, 154034, -118585, 92248, -177692, 13449, -32213, -130424, 249924, 198660, 84073, 49580, -351332, 6550, 130634, -159159, -55841, -196127, -116363, -2288, -60507]
9465f0507j08712j64260H5168a07157A06000b6918r1145I7821b8262k993A34586
9453b82677B07132m9225M070B0438K9944a45285b2407j32303H694h3134A27844
9441B3194L14586a50562e4325e641A487c42187I2222c38784J07311h1763H6112
9429C8060b80963A9508J2631f3906A96985l3517b21766P0636l6303A3635a19064
9417a67717A49407b61933i0726j2320G8440a51989l7510d5117r2328H7774b75837
9405a6288D744J02757b49685h1803j57850a15511j52990A13538d05989e9676B09640
9393c44757A52548m0035b71949g1072H9921a2031j40712A9489g1293O194j70629
9382b35728O5561a9796B28141a42852j24365D4103c1581j70561j17753I461g4865
$$ y = [-60507, -169219, -333479, 85168, -107157, 106000, -26918, -118063, 97821, -28262, -31255, 134586, -282677, 207132, 157907, 161977, 20438, 50382, -145285, -22407, -154710, 8694, -83134, 127844, 23194, 337780, -150562, -54325, -5641, 1487, -342187, 92222, -338784, -231473, -81763, 86112, 38060, -280963, 19508, 32139, -63906, 196985, 163468, -221766, -151130, -187433, 13635, -119064, -167717, 149407, -261933, -90726, -103046, 78440, -151989, -189499, -45117, -137445, 87774, -275837, -16288, 4744, 107501, -249685, -81803, -239653, -115511, -268501, 113538, -405989, -59676, 209640, -344757, 152548, 112513, -271949, -71072, 89921, -12031, -152743, 19489, -71293, -65099, -235728, -170167, -19796, 228141, -142852, -267217, 44103, -31581, -202142, -319895, 9461, -74865]
9370a39306j39403B80579a59677D4030a16115n6933h067l49386B33151i3987j51644
9359b45631e150j18171C18159b39988E8745B6806a81346m38904A13074c23522
9348c22817a0464A9303J32289b98782h5796A50478c56166J54604g7551j68835
9338b46386B18043j07795o503f8611d064l0720G1848J70763I5272a29041A80711
9326C00434e45852G6925a19386B15888g6460A4484a84854N572A28092M7542e8965
9314A44352o1797f9627H7655a12051k70391A1343a13623j45859J384h2125J422
9303h0703k10655G9781M4123d48405f3200a8489A59666g8330l968n7762F6612
9291D5340J06653b47810K1326A75025E8391b6593l12019D889J46674i9919l5015
$$ y = [-139306, -278709, 280579, -159677, 44030, -116115, -173048, -8067, -357453, 233151, -93987, -245631, -5150, -123321, 318159, -239988, 58745, 26806, -181346, -620250, 113074, -323522, -322817, -10464, 19303, 151592, -298782, -85796, 150478, -356166, -201562, -77551, -246386, 218043, 110248, 103745, -68611, -4064, -34784, 71848, 242611, 95272, -129041, 180711, 300434, -545852, 76925, -119386, 215888, -76460, 14484, -184854, -179282, 128092, 175634, -58965, 144352, 82555, -69627, 87655, -112051, -382442, 11343, -113623, -259482, -258098, -82125, -80703, -291358, 79781, 123904, -448405, -63200, -18489, 159666, -78330, -82298, -140060, 66612, 45340, 151993, -247810, -226484, 175025, 58391, -26593, -338612, 4889, 151563, -99919, -134934]
9280a34934O3894F7717b95259a5671C61346c06883i9171p5873h509F1293O3207
9269A24500b31515B71684a94467k38314i7051A5386b67080i7715j8530r5665E8496
9257e6451a3350A54574b67888A94931f5487K5412G9998c40692a60969M6193q4773
9246a99549F330a45734j31086O9232O2285j32366a13270i70I6432O9828a27133
9234a79148m6222a01240m3071N9172j11476K4116B08293c06062B97649a98259
9223A96530b57826B01361b08250P5670k2649r653d7040B9297b92722a30000c1827
9211c7332E7364b52412F0265h2195j58353J5184p0922a33541B46332n2022r6641
9200I7669a7494B81609D7889c9124G5125P7947a85745A18733c89509a85206d1804
$$ y = [-134934, -71040, 67717, -295259, -15671, 361346, -306883, -99171, -175044, -8509, 61293, 124500, -231515, 271684, -194467, -432781, -97051, 15386, -267080, -97715, -116245, -211910, 58496, -56451, -13350, 154574, -267888, 194931, -65487, -40075, 79998, -340692, -160969, -114776, -199549, 6330, -145734, -276820, -207588, -145303, -277669, -113270, -970, 96432, 166260, -127133, -179148, -225370, -101240, -144311, -85139, -196615, -172499, 208293, -306062, 297649, -198259, 196530, -257826, 201361, -208250, -132580, -155229, -164882, -47040, 29297, -292722, -130000, -31827, -37332, 57364, -252412, 60265, -82195, -240548, -225364, -296286, -133541, 246332, 194310, 97669, -17494, 281609, 47889, -39124, 75125, 153072, -185745, 118733, -389509, -185206, -41804]
9188B10087c6155k86q4133m1076I7693B7205K3201c14203r583d410k21046m3866
9176b69322C1927c82000C3802Q0677a94421j65499c1407I6247L2377e4897H508
9164f7455L1131p848K301k8898D0840f5501A99498g7063A21192g5135C20546g546
9151a77054j1066R3366B48785A08726l7402a52832j16004a11435j07278A24330
9140a05914D29877A37560c5326C48609a28106B4537c26416d1092k14273a10506
9129A70096o0129M4607K60230d7435G1596J13347a14599K3425E5065b72433O3123
9118b09310c5623B55059A18965a31713p6910m8585E05394a99771A01493j301M9379
9107A49571a47459I650g4185j8866j82665J6000e8959b1558A84515h113j53359
$$ y = [210087, -36155, -36441, -120574, -161650, 97693, 27205, 50406, -314203, -323786, -4410, -225456, -269322, 31927, -382000, 33802, 114479, -194421, -359920, -31407, 96247, 128624, -54897, 8508, -67455, -36324, -44172, -41871, -70769, 40840, -65501, 199498, -77063, 121192, -75135, 320546, -7546, -177054, -188120, -94754, 248785, 108726, 71324, -152832, -268836, -111435, -218713, 124330, -105914, 429877, 137560, -35326, 348609, -128106, 24537, -326416, -41092, -255365, -110506, 170096, 109967, 154574, 414804, -47435, 71596, 184943, -114599, -91174, 55065, -272433, -209310, -35623, 255059, 118965, -131713, -208623, -257208, 505394, -199771, 101493, 100192, 149571, -147459, 9650, -74185, -93051, -275716, -259716, -58959, -21558, 184515, -8113, -161472]
9096a61472r6912K3993g1073o2098d3431n8035E8012k663J21998C449P2326f9431
9083b3971C65681A82521a64396A85074E4341a96959H3216c28638f6372B30621
9072E6283b462j71161A10212c45053E0984c71851e471F1606K24331h7602j55523
9061b43125c7818C395h6892j11488f0346E4179g3166k98034e563A45461a46163
9049G0044c32964d7826A27174M5186e04508e2915j15075A91479D2325c9847A4972
9037a49743A69175a47268F8911C2540a47696l36318A71893a43359A80373a74643
9026a38385N6738j49436j43759J03014a04431M6108A67645a99290k37421q6773
9016e23484K08281a03764r0731c8343m0471j65239c1830C9025h144j29498j2555
$$ y = [-161472, -258384, -234391, -71073, -133171, -43431, -101466, 58012, 55349, 177347, 3449, 75775, -69431, -23971, 365681, 182521, -164396, 185074, 54341, -196959, 83216, -328638, -66372, 230621, 56283, -2462, -173623, 110212, -345053, 50984, -371851, -5471, 61606, 285937, -87602, -243125, -37818, 3395, -86892, -198380, -60346, 54179, -73166, -371200, -5563, 145461, -146163, 70044, -332964, -47826, 127174, 172360, -504508, -52915, -167990, 191479, 42325, -39847, 14972, -149743, 169175, -147268, 68911, 32540, -147696, -484014, 171893, -143359, 180373, -174643, -138385, -81647, -231083, -374842, -271828, -104431, -58323, 167645, -199290, -436711, -523484, -315203, -103764, -194495, -38343, -78814, -244053, -31830, 39025, -8144, -137642, -150197]
9005a50197C5753j4212a49582N6981a0475l45695G1096a69783A84683c52794e1461
8993A57321c11559a35631G6234B1070c2312q8458k89286j544J0661g7963b5332
8981i6170j32380F7991i5591k03315n7547j870f8297R319l6276F5857j6791g7098
8968i6358B49128h2522j90213G8191b0400A50569a67362r2344J07736F5532g0342
8956g4994A83068c8579j85407f9874A11287j0f8671l1817d2299k22297H0962K139
8944H3101J60217Q4101f9182K9576m7382l28830A141K44368j07275Q7505a83202
8932A36840E0182J91576a24479j50018A20594j6367m0497A8509a26771D90632
8921I67265N7018D24439k02144b35789B78008A10046b71041b6949k25372A82263
$$ y = [-150197, 35753, 21541, -149582, -92601, -10475, -356170, 71096, -169783, 184683, -352794, -51461, 157321, -311559, -135631, 76234, 21070, -32312, -120770, -410056, -411600, -400939, -77963, -25332, -96170, -228550, 67991, -95591, -298906, -356453, -358323, -68297, -58978, -95254, 65857, 49066, -77098, -96358, 249128, -82522, -272735, 78191, -20400, 150569, -167362, -259706, -151970, 65532, -70342, -74994, 183068, -38579, -223986, -69874, 111287, 111277, -68671, -100488, -42299, -264596, 80962, 83101, 243318, 327419, -69182, -39606, -86988, -415818, 1141, 245509, 138234, 225739, -183202, 136840, 50182, 241758, -124479, -274497, 120594, 104227, 63730, 18509, -126771, 490632, 967265, 1024283, 424439, 222295, -235789, 278008, 110046, -271041, -26949, -252321, 182263]
8910a32224N2494l8609L9922l40327a26387A20506m3365b03330H0638A2089K99416
8899C11505r5460a93541I5851j3167L08239G4331M8382A1342J20744C5418I128
8887a96445D1879K84168c4947p3486a0514a613m581A12855c8398F7275b8640B36330
8874E3992M2634K43811B9724a92297C0606a19098q73A3289J72082A6593a61848
$$ y = [-132224, -79730, -118339, -78417, -418744, -126387, 120506, 77141, -203330, 80638, 12089, 311505, 216045, -193541, 95851, 82684, 390923, 74331, 122713, 11342, 132086, 35418, 9128, -196445, 41879, 326047, -34947, -108433, -10514, -1613, -6194, 112855, -38398, 67275, -28640, 236330, 53992, 96626, 340437, 29724, -192297, 30606, -119098, -119971, 13289, 185371, 16593, -161848]
$$ [...]
##END NTUPLES=NMR SPECTRUM
##END=
