##TITLE=AC1453_NESNAP272_7818805_155McSOorp
##JCAMPDX= 6.0         $$ Bruker NMR JCAMP-DX V2.0
##DATA TYPE= NMR SPECTRUM
##DATA CLASS= NTUPLES
##ORIGIN= BRUKER
##OWNER= Administrator
$$ 1.72 TOPSPIN		Version 2.1
$$ 2013-05-01 01:20:46.838 -0700  Administrator@X
$$ Compression mode = diff/dup
##.OBSERVE FREQUENCY= 400.02188249412
##.OBSERVE NUCLEUS= ^1H
##.ACQUISITION MODE= SIMULTANEOUS (DQD)
##.ACQUISITION SCHEME= undefined
##.AVERAGES= 64
##.DIGITISER RES= 22
##SPECTROMETER/DATA SYSTEM= spect
##.PULSE SEQUENCE= noesygpps1d.comp
##.SOLVENT NAME= COFFEE_meoh
##.SHIFT REFERENCE= INTERNAL, COFFEE_meoh, 1, 14.96185
##AUDIT TRAIL= $$ (NUMBER, WHEN, WHO, WHERE, PROCESS, VERSION, WHAT)
$$ ##TITLE= Audit trail, TOPSPIN		Version 2.1
$$ ##JCAMPDX= 5.01
$$ ##ORIGIN= Bruker BioSpin GmbH
$$ ##OWNER= Administrator
$$ $$ E:\/data/COFFEE/nmr/AC1453_NESNAP272_7818805_155McSOorp/22/pdata/1/auditp.txt
$$ ##AUDIT TRAIL=  $$ (NUMBER, WHEN, WHO, WHERE, PROCESS, VERSION, WHAT)
(   1,<2013-05-01 01:20:41.760 -0700>,<Administrator>,<X>,<go>,<TOPSPIN 2.1>,
      <created by zg
	started at 2013-05-01 01:09:11.807 -0700,
	POWCHK enabled, PULCHK disabled,
       configuration hash MD5:
       F7 49 AB AC A2 8D 51 76 73 8D C1 9A A6 38 9F DE
       data hash MD5: 64K
       DB 08 10 7C 57 D4 F7 38 64 33 3E BD 95 73 F7 CA>)
(   2,<2013-05-01 01:20:44.697 -0700>,<Administrator>,<X>,<proc1d>,<TOPSPIN 2.1>,
      <Start of raw data processing
       efp LB = 0.3 FT_mod = 6 PKNL = 1 PHC0 = 0 PHC1 = 0 SI = 128K 
       data hash MD5: 128K
       4D 99 9E 7D 54 9D B2 A8 33 D9 92 47 F7 08 8F A7>)
(   3,<2013-05-01 01:20:45.697 -0700>,<Administrator>,<X>,<proc1d>,<TOPSPIN 2.1>,
      <pk PHC0 = -78.22815 PHC1 = 0 
       data hash MD5: 128K
       C5 30 D9 21 C4 29 46 A2 DE F9 9B 26 8E E8 EE A9>)
(   4,<2013-05-01 01:20:46.166 -0700>,<Administrator>,<X>,<proc1d>,<TOPSPIN 2.1>,
      <abs ABSG = 1 
       data hash MD5: 128K
       E9 4E 8A 75 F8 0A D6 B5 D4 61 B2 56 2D 53 60 31>)
(   5,<2013-05-01 01:20:46.276 -0700>,<Administrator>,<X>,<proc1d>,<TOPSPIN 2.1>,
      <abs ABSG = 2 
       data hash MD5: 128K
       6E 92 6C FF 1F 2F C3 1F 63 93 B5 20 7A 24 20 A2>)
(   6,<2013-05-01 01:20:46.401 -0700>,<Administrator>,<X>,<proc1d>,<TOPSPIN 2.1>,
      <abs ABSG = 3 
       data hash MD5: 128K
       25 0A 4D E7 0C 27 05 5F 26 C3 1B A0 33 DE DA 9A>)
(   7,<2013-05-01 01:20:46.510 -0700>,<Administrator>,<X>,<proc1d>,<TOPSPIN 2.1>,
      <abs ABSG = 4 
       data hash MD5: 128K
       89 C9 7E E3 D4 48 BD 57 49 D6 24 C5 8B 36 C0 B9>)
(   8,<2013-05-01 01:20:46.619 -0700>,<Administrator>,<X>,<proc1d>,<TOPSPIN 2.1>,
      <abs ABSG = 5 
       data hash MD5: 128K
       40 A1 66 EF 9A 1F 1E 17 FC 79 6B 2F 4F 93 17 86>)
$$ ##END=
$$ 
$$ $$ hash MD5
$$ $$ 9F E6 AA 41 03 73 4C 09 97 37 AE 45 A1 D7 E9 24
##$RELAX= 
##$RELAX= 
##$RELAX= 
##$RELAX= 
##$RELAX= 
##$RELAX= 
##$RELAX= 
##$RELAX= 
$$ Bruker specific parameters
$$ --------------------------
##$DU= <E:\>
##$EXPNO= 22
$$ [...]
##$TP07= 0
##$TPNAME0= <>
##$TPNAME1= <>
##$TPNAME2= <>
##$TPNAME3= <>
##$TPNAME4= <>
##$TPNAME5= <>
##$TPNAME6= <>
##$TPNAME7= <>
##$TPOAL= (0..7)
0.5 0.5 0.5 0.5 0.5 0.5 0.5 0.5
##$TPOFFS= (0..7)
0 0 0 0 0 0 0 0
##$TUNHIN= 0
##$TUNHOUT= 0
##$TUNXOUT= 0
##$USERA1= <user>
##$USERA2= <user>
##$USERA3= <user>
##$USERA4= <user>
##$USERA5= <user>
##$V9= 5
##$VALIST= <valist>
##$VCLIST= <CCCCCCCCCCCCCCC>
##$VD= 0
##$VDLIST= <DDDDDDDDDDDDDDD>
##$VPLIST= <PPPPPPPPPPPPPPP>
##$VTLIST= <TTTTTTTTTTTTTTT>
##$WBST= 1024
##$WBSW= 4
##$XGAIN= (0..3)
0 0 0 0
##$XL= 0
##$YL= 0
##$YMAX_a= 5611086
##$YMIN_a= -11110216
##$ZGOPTNS= <>
##$ZL1= 120
##$ZL2= 120
##$ZL3= 120
##$ZL4= 120
##$ABSF1= 14.96185
##$ABSF2= -5.596332
##$ABSG= 5
##$ABSL= 3
##$ALPHA= 0
##$AQORDER= 0
##$ASSFAC= 0
##$ASSFACI= 0
##$ASSFACX= 0
##$ASSWID= 0
##$AUNMP= <proc_prof1d_extract.lims>
##$AXLEFT= 0
##$AXNAME= <>
##$AXNUC= <1H>
##$AXRIGHT= 0
##$AXTYPE= 0
##$AXUNIT= <>
##$AZFE= 0.1
##$AZFW= 0.1
##$BCFW= 0
##$BC_mod= 0
##$BYTORDP= 0
##$COROFFS= 0
##$CY= 15
##$DATMOD= 1
##$DC= 0
##$DFILT= <>
##$DTYPP= 0
##$F1P= 0
##$F2P= 0
##$FCOR= 0.5
##$FTSIZE= 131072
##$FT_mod= 6
##$GAMMA= 0
##$GB= 0
##$INTBC= 1
##$INTSCL= 1
##$ISEN= 128
##$LB= 0.3
##$LEV0= 0
##$LPBIN= 0
##$MAXI= 10000
##$MC2= 0
##$MEAN= 0
##$ME_mod= 0
##$MI= 0
##$NCOEF= 0
##$NC_proc= -3
##$NLEV= 6
##$NOISF1= 0
##$NOISF2= 0
##$NSP= 0
##$NTH_PI= 0
##$NZP= 0
##$OFFSET= 14.96185
##$PC= 1
##$PHC0= -78.22815
##$PHC1= 0
##$PH_mod= 1
##$PKNL= yes
##$PPARMOD= 0
##$PPDIAG= 0
##$PPIPTYP= 0
##$PPMPNUM= 2147483647
##$PPRESOL= 1
##$PSCAL= 4
##$PSIGN= 0
##$PYNMP= <proc.py>
##$REVERSE= no
##$SF= 400.020009295576
##$SI= 131072
##$SIGF1= 0
##$SIGF2= 0
##$SINO= 400
##$SIOLD= 131072
##$SPECTYP= <>
##$SREGLST= <1H.CDCl3>
##$SSB= 0
##$STSI= 131072
##$STSR= 0
##$SW_p= 8223.68421052631
##$SYMM= 0
##$S_DEV= 0
##$TDeff= 65536
##$TDoff= 0
##$TI= <>
##$TILT= no
##$TM1= 0
##$TM2= 0
##$TOPLEV= 0
##$USERP1= <user>
##$USERP2= <user>
##$USERP3= <user>
##$USERP4= <user>
##$USERP5= <user>
##$WDW= 1
##$XDIM= 131072
##$YMAX_p= 370108428
##$YMIN_p= -32303200
##$CURPLOT= <Network HP LaserJet P1505>
##$CURPRIN= <$Network HP LaserJet P1505>
##$DFORMAT= <normdp>
##$LAYOUT= <+/1D_H.xwp>
##$LFORMAT= <normlp>
##$PFORMAT= <normpl>
##$SURQMSG= 1
$$ End of Bruker specific parameters
$$ ---------------------------------
##NTUPLES= NMR SPECTRUM
##VAR_NAME=  FREQUENCY,     SPECTRUM/REAL,   SPECTRUM/IMAG
##SYMBOL=    X,             R,               I
##VAR_TYPE=  INDEPENDENT,   DEPENDENT,       DEPENDENT
##VAR_FORM=  AFFN,          ASDF,            ASDF
##VAR_DIM=   131072,        131072,          131072
##UNITS=     HZ,            ARBITRARY UNITS, ARBITRARY UNITS
##FACTOR=    0.0627417313425164, 1,          1
##FIRST=     8223.62146879497, 5373,         -100056
##LAST=      0,             8256,            -100682
##MIN=       0,             -32303200,       0
##MAX=       8223.62146879497, 370108428,    0
$$ Real data points
##PAGE= N=1
##DATA TABLE= (X++(R..R)), XYDATA
$$ [...]
63596A797307J4618J1937Q606N222J340l919j0319j6542k1576k5361k8313l0763
63584A702237l2645l3386l2358k9836k7224k5969k6235k6920k6887k6021k5024
63573A389732k4322k3399k1487j8625j5438j1888p219j541L615P119R839J3298
63561A299684J7556K1673K5707L0614L6296M1417M5433M9262N3389N6679N7836
63550A735546N6968N4856N1663M7274M2343L7935L4489L1848K9999K9094K8834
63539B180849K8561K7853K6730K5330K3713K1795J8985J3956N290p266k2201l6950
63527B306645m9333n8347o3782o5542o3841n9829n5184n0828m6757m3394m2002
63516A707806m2911m4357m4443m3695m4099m5884m6956m5778m3141m0415l7553
$$ plain form
63596 1797307 1811925 1823862 1832468 1837690 1839030 1835111 1824792 1808250 1786674 1761313 1733000 1702237
63584 1702237 1669592 1636206 1603848 1574012 1546788 1520819 1494584 1467664 1440777 1414756 1389732
63573 1389732 1365410 1342011 1320524 1301899 1286461 1274573 1267354 1265813 1269428 1276547 1286386 1299684
63561 1299684 1317240 1338913 1364620 1395234 1431530 1472947 1518380 1567642 1621031 1677710 1735546
63550 1735546 1792514 1847370 1899033 1946307 1988650 2026585 2061074 2092922 2122921 2152015 2180849
63539 2180849 2209410 2237263 2263993 2289323 2313036 2334831 2353816 2367772 2373062 2365796 2343595 2306645
63527 2306645 2257312 2198965 2135183 2069641 2005800 1945971 1890787 1839959 1793202 1749808 1707806
63516 1707806 1664895 1620538 1576095 1532400 1488301 1442417 1395461 1349683 1306542 1266127 1228574
63505A228574l3944l0160k7535k6314k5271k3213k0191j7237j5232j4106j3097
63494I82274j1905j1176j1369j1539j0219p504n129m253m203l826k941j862n00
63481H95848J117K198K001R26J01K75J532L505N261N714M995M732O092Q053Q642
63466I50992P455N920N209N047M662L944L310L003K897K761K670L221N046P774
63452A013911R973J0702J0840J2195J5507J9954K4413K8496L2337L6177M0343
63441A254848M4971M9447N2479N2967N0761M6644M1889L7692L4608L2505L1225
63430A730036L1196L2995L6482M0794M5250M9791N4408N8450O0776O0449N7102
63419B257729N0652M0978K8351J4321J551p825j3496j6171j6017j2915p915k974
$$ plain form
63505 1228574 1194630 1164470 1136935 1110621 1085350 1062137 1041946 1024709 1009477 995371 982274
63494 982274 970369 959193 947824 936285 926066 918562 913433 909180 904977 901151 898210 896348 895848
63481 895848 896965 899163 901164 902090 902191 902466 903998 907503 912764 918478 923473 928205 934297 942350 950992
63466 950992 958447 964367 969576 974623 979285 983229 986539 989542 992439 995200 997870 1001091 1006137 1013911
63452 1013911 1023884 1034586 1045426 1057621 1073128 1093082 1117495 1145991 1178328 1214505 1254848
63441 1254848 1299819 1349266 1401745 1454712 1505473 1552117 1594006 1631698 1666306 1698811 1730036
63430 1730036 1761232 1794227 1830709 1871503 1916753 1966544 2020952 2079402 2140178 2200627 2257729
63419 2257729 2308381 2349359 2377710 2392031 2393582 2385757 2372261 2356090 2340073 2327158 2319243 2316269
63407B316269R81M323O690O339K515k960p883j2521j8728k6911l5360m2153m6423
63394B144178m8142m8046m7589m7713m7847m7155m6200m5996m5997m4852m2869
63383A631772m1719m1550m0454l7229l2766k8033k2655j6486j0838o676k892K209
63371A352683Q601J4898K0217K4569K8213L1720L5981M0970M5162M7261M7976
63360A698251M9068N1178N3493N4897N4440N1523M6951M3117M1624M1160L9266
63349B224968L5801L2879L1442K9900K6645K2167J7662J2970P086p4p614j4913
63337B418919k1959k8605l4232l8142l9928l9529l7325l4208l1367k9874l0228
63326B053522l2002l4102l5848l7781m0874m4992m8798n1302n2732n3452n2651
$$ plain form
63407 2316269 2317250 2321573 2328263 2334602 2337117 2334157 2326274 2313753 2295025 2268114 2232754 2190601 2144178
63394 2144178 2096036 2047990 2000401 1952688 1904841 1857686 1811486 1765490 1719493 1674641 1631772
63383 1631772 1590053 1548503 1508049 1470820 1438054 1410021 1387366 1370880 1360042 1353366 1350474 1352683
63371 1352683 1361284 1376182 1396399 1420968 1449181 1480901 1516882 1557852 1603014 1650275 1698251
63360 1698251 1747319 1798497 1851990 1906887 1961327 2012850 2059801 2102918 2144542 2185702 2224968
63349 2224968 2260769 2293648 2325090 2354990 2381635 2403802 2421464 2434434 2441520 2441446 2433832 2418919
63337 2418919 2396960 2368355 2334123 2295981 2256053 2216524 2179199 2144991 2113624 2083750 2053522
63326 2053522 2021520 1987418 1951570 1913789 1872915 1827923 1779125 1727823 1675091 1621639 1568988
63315A568988m8997m2528l5265k9756k7020k5949k4699k2748k1527k3021k7928
63304A239550l5203m2869m8725n0854m8689m3854l9031l5465l2110k7619k2428
63293H12703j8334j6389j5926j5433j3925j1602r528q520q188p400n833m457m055
63280F73113l926k973j527j075k180l735m447m192l529k678j586m40N64J598K669
63265F45656L025J916J0q12M80K711L795L123K103K389M197O454Q021Q324P362
63250F98754N785M881N762Q317J1260J3319J4109J3887J2993J1806J0884J0790
63238H22547J1757J3530J5359J6383J6478J6647J7825J9340J9611J8619J8464
63227A006560K0455K2796K2713K0422J9055K0428K2576K2349J9223J5326J2565
$$ plain form
63315 1568988 1519991 1477463 1442198 1412442 1385422 1359473 1334774 1312026 1290499 1267478 1239550
63304 1239550 1204347 1161478 1112753 1061899 1013210 969356 930325 894860 862750 835131 812703
63293 812703 794369 777980 762054 746621 732696 721094 711566 703046 694858 687458 681625 677168 673113
63280 673113 669187 666214 664687 663612 661432 657697 653250 649058 645529 642851 641265 640825 641389 642987 645656
63265 645656 648681 650597 650607 649795 650275 652986 656781 659904 662007 664396 668593 675047 683068 691392 698754
63250 698754 704539 709420 715182 723499 734759 748078 762187 776074 789067 800873 811757 822547
63238 822547 834304 847834 863193 879576 896054 912701 930526 949866 969477 988096 1006560
63227 1006560 1027015 1049811 1072524 1092946 1112001 1132429 1155005 1177354 1196577 1211903 1224468
63216A224468J1075J0172R421Q499P032N103L313J844Pk681n358o513n962n378
63202A255042o490r194j1913j3430j3768j3524j3215j3312j3936j4217j2888j0085
63190A109070p571o352n116k337J049K857L083L967O386Q575R265R933J2215J4852
63176A159876J5416J4025J3001J3139J2762J0738Q276O780N638L364j04l567o299
63163A253045q536j0498j1993j2979j3744j4484j5138j5892j7356j9943k3030
63152A089452k5181k5527k4899k4986k6152k6845k5683k3407k1789k1164k0364
63141H23455j8891j7526j6623j5308j3070j0749r127p764o177n067n116n465m762
63128F87810l101j606o03M48J530K007J851J676J625J503J869L445N384N778M417
$$ plain form
63216 1224468 1235543 1245715 1255136 1263635 1270667 1275770 1279083 1280927 1280934 1278253 1272895 1266382 1260420 1255042
63202 1255042 1248552 1239358 1227445 1214015 1200247 1186723 1173508 1160196 1146260 1132043 1119155 1109070
63190 1109070 1101499 1095147 1090031 1087694 1088743 1091600 1094683 1098650 1105036 1113611 1122876 1132809 1145024 1159876
63176 1159876 1175292 1189317 1202318 1215457 1228219 1238957 1247233 1254013 1259651 1263015 1262911 1259344 1253045
63163 1253045 1244509 1234011 1222018 1209039 1195295 1180811 1165673 1149781 1132425 1112482 1089452
63152 1089452 1064271 1038744 1013845 988859 962707 935862 910179 886772 864983 843819 823455
63141 823455 804564 787038 770415 755107 742037 731288 722161 714397 708220 703153 698037 692572 687810
63128 687810 684709 683103 682500 682948 684478 686485 688336 690012 691637 693140 695009 698454 703838 709616 714033
63113G14033L483M674O986Q393Q603Q859R824J0953J1605J1601J0987J0249J0493
63100H30743J2240J4111J3901J1191P957O234O062O133N703N002M318L581K949
63087I30125K956L744M522M289L072J987J881K197J561m74k728l680l154k395
63073I43903k540l327l463j996Q19L963O710R099J1545J4346J7628K1362K5005
63060A043054K7516K8385K8630K9985L2873L5905L7775L8924M0644M3119M5361
63049A432171M6800M7897M9110N0318N1558N3390N5915N8099N8810N8058N6613
63038B018739N4833N2509M9494M5676M0694L4629K8795K4643K1723J7929J2293
63027B401957O400K259k81k942o537j0365j3670j6418j8733k0803k3381k7113
$$ plain form
63113 714033 717516 722190 729176 737569 746172 755031 764855 775808 787413 799014 810001 820250 830743
63100 830743 842983 857094 870995 882186 890143 896377 902439 908572 914275 919277 923595 927176 930125
63087 930125 933081 936825 941347 945636 948708 950695 952576 954773 956334 955860 953132 949452 946298 943903
63073 943903 941363 938036 934573 932577 933396 937359 944069 953168 964713 979059 996687 1018049 1043054
63060 1043054 1070570 1098955 1127585 1157570 1190443 1226348 1264123 1303047 1343691 1386810 1432171
63049 1432171 1478971 1526868 1575978 1626296 1677854 1731244 1787159 1845258 1904068 1962126 2018739
63038 2018739 2073572 2126081 2175575 2221251 2261945 2296574 2325369 2350012 2371735 2389664 2401957
63027 2401957 2408357 2410616 2410335 2407393 2400856 2390491 2376821 2360403 2341670 2320867 2297486 2270373
63015B270373l1208l4003l5176l6005l6936l6477l3610k9891k7525k6214k3692
63004A919636j9018j3559q800m708o49L511P690J1848J5505J7893J8997J9498
62992A967844J9434J8037J5456J3305J2577J1879Q959L478k734p780j1232j3746
62980B035477j6078j8498k0651k2002k2598k3233k4678k7176l0768l5284l9740
62969A754771m2657m3725m4266m5378m6503m6804m6814m7242m7016m4483m0296
62958A259587l7032l5743l4703l2212k8817k5981k4023k2551k1643k1244k0294
62947I55344j7978j5267j3939j4300j4955j4623j3214j1291r557q737q974r278
62935H03231q416o525m962m565m916n388n852o070n491m304l675m141m507l313
$$ plain form
63015 2270373 2239165 2205162 2169986 2133981 2097045 2060568 2026958 1997067 1969542 1943328 1919636
63004 1919636 1900618 1887059 1878259 1873551 1872902 1876413 1884103 1895951 1911456 1929349 1948346 1967844
62992 1967844 1987278 2005315 2020771 2034076 2046653 2058532 2067491 2070969 2068235 2060455 2049223 2035477
62980 2035477 2019399 2000901 1980250 1958248 1935650 1912417 1887739 1860563 1829795 1794511 1754771
62969 1754771 1712114 1668389 1624123 1578745 1532242 1485438 1438624 1391382 1344366 1299883 1259587
62958 1259587 1222555 1186812 1152109 1119897 1091080 1065099 1041076 1018525 996882 975638 955344
62947 955344 937366 922099 908160 893860 878905 864282 851068 839777 830220 821483 812509 803231
62935 803231 794815 788290 783328 778763 773847 768459 762607 756537 751046 746742 743067 738926 734419 731106
62921G31106r27R10J316J039J029J329J602J842K027J749Q22j12j40R10K388L510
62905G50400L819L226K134J380J621K691L763M152L721K694J437L95j31k23j46
62890G80933PK83N56N90M06K96N16J178K254L279L270J564j207l498m319l935
62874G82173l067k123j368j192j744k706l741m743n388m981l280j126J78k7j473
62859G45392l332m591m539l294j631q5J213J840J186k48p21O25K360K560J367
62844G38102M94P24J375K062L256M820N513M752L711L829M919N626N312M693M718
62829G93906N356N629M740L096J986K026K381K026J381J747L414N229O058N737
62815H44712M663L465L122M110N272M878L143K393M022O698Q418R109R908J0925
$$ plain form
62921 731106 730179 731089 732405 733444 734473 735802 737404 739246 741273 743022 743844 743732 743592 744502 746890 750400
62905 750400 754219 757445 759579 760959 762580 765271 769034 773186 776907 779601 781038 781433 781302 781079 780933
62890 780933 780940 781223 781779 782369 782775 783071 783587 784765 787019 790298 793568 795132 793925 790427 786108 782173
62874 782173 779106 776983 775615 774423 772679 769973 766232 761489 756101 751120 747840 746714 746892 746865 745392
62859 745392 742060 737469 732930 729636 728005 727920 729133 730973 732159 731911 731190 731815 734175 736735 738102
62844 738102 738596 739320 740695 742757 746013 750833 756346 761098 764809 768638 773557 779183 784495 789188 793906
62829 793906 799262 804891 809631 812727 814713 816739 819120 821146 822527 824274 827688 832917 838975 844712
62815 844712 849375 852840 855962 860072 865344 870222 873365 875758 879780 886478 894896 904005 913913 924838
62801I24838J1262J0713J0161J0452J1882J4545J8238K2187K5627K8568L1441
62790A119914L4396L7549M1261M5340M8593N0260N1377N3588N6926N9950O1750
62779A660904O2615O2868O2361O1170N9573N7299N3950N0169M7061M4335M0482
62768B262787L5105K9573K4793J9832J3783P581K589j791p631j5901k5599l5147
62756B309974m3547n0245n5042n8443o1308o3946o6034o7481o8608o9254o8551
62745A637515o6108o2849o0005n7642n4876n1347m7583m3830l9486l4297k9355
62734A090137k6011k4115k2328j9958j7500j5290j2862j0107p932p006o603n537
62722I14888l527r40K039N113P411Q505R323J1045J3620J6391J9499K3275K6796
$$ plain form
62801 924838 936100 946813 956974 967426 979308 993853 1012091 1034278 1059905 1088473 1119914
62790 1119914 1154310 1191859 1233120 1278460 1327053 1377313 1428690 1482278 1539204 1599154 1660904
62779 1660904 1723519 1786387 1848748 1909918 1969491 2026790 2080740 2130909 2177970 2222305 2262787
62768 2262787 2297892 2327465 2352258 2372090 2385873 2393454 2396043 2394252 2386621 2370720 2345121 2309974
62756 2309974 2266427 2216182 2161140 2102697 2041389 1977443 1911409 1843928 1775320 1706066 1637515
62745 1637515 1571407 1508558 1448553 1390911 1336035 1284688 1237105 1193275 1153789 1119492 1090137
62734 1090137 1064126 1040011 1017683 997725 980225 964935 952073 941966 934034 927028 920425 914888
62722 914888 911361 910421 912460 917573 924984 933489 942812 953857 967477 983868 1003367 1026642 1053438
62709A053438K8737K9405L0251L1708L3261L5500L9672M4938M8374M8666M7782
62698A471732M7867M8505M8298M7274M6030M4150M1286L8408L6136L3132K8292
62687A931110K3208K0023J7739J3427O740K90m584r474j5484k0950k4156k6299
62675A911590k9786l4844l9738m3609m7322n1454n4890n5883n4071n1081m9154
62664A399758m9019m9343m8518m6489m4070m1060l6556l1145k6974k4916k3181
62653I78487j9925j6004j3793j4003j5087j5364j4336j2154r157o169m210l567
62641H34718l649l885m164m358m169l661l309l222k737j198J016K559K312N53
62627H06806j147j363k24Q46Q65L23L45J285K555L440L622L244K964L710N716
$$ plain form
62709 1053438 1082175 1111580 1141831 1173539 1206800 1242300 1281972 1326910 1375284 1423950 1471732
62698 1471732 1519599 1568104 1616402 1663676 1709706 1753856 1795142 1833550 1869686 1902818 1931110
62687 1931110 1954318 1974341 1992080 2005507 2012247 2012537 2007953 1998479 1982995 1962045 1937889 1911590
62675 1911590 1881804 1846960 1807222 1763613 1716291 1664837 1609947 1554064 1499993 1448912 1399758
62664 1399758 1350739 1301396 1252878 1206389 1162319 1121259 1084703 1053558 1026584 1001668 978487
62653 978487 958562 942558 928765 914762 899675 884311 869975 857821 848664 842495 838285 834718
62641 834718 831069 827184 823020 818662 814493 810832 807523 804301 801564 800366 801382 803941 806253 806806
62627 806806 805659 804296 804072 804918 805783 806106 806451 807736 810291 813731 817353 820597 823561 827271 832987
62612H32987P963R077Q800Q160Q340R758J2097J4671J6793J8267J9561K1203K3101
62599A010778K4793K6051K6800K6794K6066K5454K5815K6693K6665K5176K3132
62588A294217K1389J9507J6632J3085J0290R263R510R363P284L175j426m756o636
62575A400897q602j2127j7109k2152k5824k7521k7794k8149k9849l2390l3845
62564A135535l3254l1957l1720l2172l1296k8180k4100k0773j8634j7124j5761
62553H50564j4307j2553j0544q699p335o323n478m880m494l956l022j952j140
62540G65881p19o98j026j117l6K263M424N220N233O098Q214J0337J1495J2182
62526H27751J3148J4053J4220J4065J4699J6350J8101J9310K0404K2018K3934
$$ plain form
62612 832987 840950 850027 858827 866987 875327 885085 897182 911853 928646 946913 966474 987677 1010778
62599 1010778 1035571 1061622 1088422 1115216 1141282 1166736 1192551 1219244 1245909 1271085 1294217
62588 1294217 1315606 1335113 1351745 1364830 1375120 1384383 1393893 1403256 1410540 1413715 1412289 1407533 1400897
62575 1400897 1392295 1380168 1363059 1340907 1315083 1287562 1259768 1231619 1201770 1169380 1135535
62564 1135535 1102281 1070324 1038604 1006432 975136 946956 922856 902083 883449 866325 850564
62553 850564 836257 823704 813160 804461 797126 790803 785325 780445 775951 771995 768973 767021 765881
62540 765881 765162 764464 763438 762321 762285 764548 768972 774192 779425 785523 793737 804074 815569 827751
62526 827751 840899 854952 869172 883237 897936 914286 932387 951697 972101 994119 1018053
62515A018053K5367K5969K6189K6730K7865K9107K9486K8408K6302K4113K2049
62504A309638J9397J5964J3123J2609J4408J6614J7462J6795J5453J4072J2880
62493A478415J1960J1027R449P239N560N395N937N448L735K653L580N424O007
62480A561829M869L672L916N125N547M028R06k541n193o659p215p406p843r169
62466A543866j1737j5149j8496k1346k4220k7664l1167l3572l4523l4931l5934
62455A255127l7754l9583m0327l9421l7357l5437l4545l4089l2522k9039k4344
62444H70709j9780j6263j4155j3371j3076j1949r547p094o155o613o633m831j871
62431G39371L62P26l76j896l148l816l443j686Q11K437K174Q51J18L28L12o69
$$ plain form
62515 1018053 1043420 1069389 1095578 1122308 1150173 1179280 1208766 1237174 1263476 1287589 1309638
62504 1309638 1329035 1344999 1358122 1370731 1385139 1401753 1419215 1436010 1451463 1465535 1478415
62493 1478415 1490375 1501402 1510851 1518090 1523650 1529045 1534982 1540430 1544165 1546818 1550398 1555822 1561829
62480 1561829 1566698 1570370 1574286 1579411 1584958 1588986 1589892 1587351 1582158 1575499 1568284 1560878 1553035 1543866
62466 1543866 1532129 1516980 1498484 1477138 1452918 1425254 1394087 1360515 1325992 1291061 1255127
62455 1255127 1217373 1177790 1137463 1098042 1060685 1025248 990703 956614 924092 895053 870709
62444 870709 850929 834666 820511 807140 794064 782115 772568 765474 759319 752706 746073 741242 739371
62431 739371 739733 740459 740083 738187 735039 731223 727780 726094 726905 729342 731516 732367 732485 732813 733125 732456
62415G32456j770j929j450j299j490j169q3J132K024K736L254L203K628K228K434
62400G42905K887L149L302L559L861M205M807N604O135O322O678P339P563O898
62386H15214O278P018R060J1107J2316J3047J3918J5031J6315J7918J9974K2415
62374I79611K5164K8081L0747L2932L5338L9013M3756M7995N0811N3423N7770
62363A424641O3929O9815P3327P4186P3607P2779P1893P0300O7568O4382O2021
62352B188448O0572N8230N3353M7002M2125L9945L8333L4538K8468K2099J6345
62341B629458J0072K111p242j7152k7480l8267m8736n7670o4399o8819p0915p1077
62329B169884p0614p0958p2198p3080p2549p0791o8516o5897o2603n8575n4228
$$ plain form
62415 732456 730686 728757 727307 726008 724518 723349 723266 724398 726422 729158 732412 735615 738243 740471 742905
62400 742905 745792 748941 752243 755802 759663 763868 768675 774279 780414 786736 793414 800753 808316 815214
62386 815214 821492 828510 837570 848677 860993 874040 887958 902989 919304 937222 957196 979611
62374 979611 1004775 1032856 1063603 1096535 1131873 1170886 1214642 1262637 1313448 1366871 1424641
62363 1424641 1488570 1558385 1631712 1705898 1779505 1852284 1924177 1994477 2062045 2126427 2188448
62352 2188448 2249020 2307250 2360603 2407605 2449730 2489675 2528008 2562546 2591014 2613113 2629458
62341 2629458 2639530 2641641 2634399 2617247 2589767 2551500 2502764 2445094 2380695 2311876 2240961 2169884
62329 2169884 2099270 2028312 1956114 1883034 1810485 1739694 1671178 1605281 1542678 1484103 1429875
62318A429875m9955m5793m1609l7435l3565l0341k7896k6059k4556k3191k1792
62307A067683k0188j8488j7181j6598j6209j4888j2146q777o149m975m908n001
62295I22175m393k798p18R31J698J996K426K851K640J854J678L241O213Q918J0026
62280I58738R896J0097J1671J4085J6036J7105J8257K0638K4149K7573L0030L1983
62268A190258L4689L8889M4217M9650N4280N7651N9825O1372O3109O5433O7824
62257A787197O9268O9251O8111O6324O3774O0105N5574N1084M7248M3757L9858
62246B421551L5185K9935K4417J8682J2509N610k176j0756j9938k9692l9969n0038
62234B395320n8440o4112o7582p0421p3417p5873p6913p6732p5974p4520p1948
$$ plain form
62318 1429875 1379920 1334127 1292518 1255083 1221518 1191177 1163281 1137222 1112666 1089475 1067683
62307 1067683 1047495 1029007 1011826 995228 979019 964131 951985 943208 937059 932084 927176 922175
62295 922175 917782 914984 914266 915197 916895 918891 921317 924168 926808 928662 930340 933581 939794 948712 958738
62280 958738 968634 978731 990402 1004487 1020523 1037628 1055885 1076523 1100672 1128245 1158275 1190258
62268 1190258 1224947 1263836 1308053 1357703 1411983 1469634 1529459 1590831 1653940 1719373 1787197
62257 1787197 1856465 1925716 1993827 2060151 2123925 2184030 2239604 2290688 2337936 2381693 2421551
62246 2421551 2456736 2486671 2511088 2529770 2542279 2547889 2545713 2534957 2515019 2485327 2445358 2395320
62234 2395320 2336880 2272768 2205186 2134765 2061348 1985475 1908562 1831830 1755856 1681336 1609388
62223A609388o8803o6108o3531n9432n3358m7191m2702l9056l4258k8416k3688
62212A082845k1061j9120j6535j3962j2452j1428r737p765o897p131o796m697
62200I45264j581Q30J513Q41J88R17L226O003Q095R403J0383J1101J1522J2157
62186A019862J3390J4575J4878J4764J5525J7590K0376K3623K7538L1712L5304
62175A249137L8356M1541M4546M6232M6688M7354M8664M9275M8392M7098M6362
62164A753645M5407M3298M0607L8051L5061L1312K8291K7221K6568K3802J8966
62153B112229J4302J0837P649M192P82l376j0071j9114k7687l3717l8104m2504
62141A975418m6580m8953m9529m9260m8363m6316m3230l9923l6751l3290k9147
$$ plain form
62223 1609388 1540585 1474477 1410946 1351514 1298156 1250965 1208263 1169207 1134949 1106533 1082845
62212 1082845 1061784 1042664 1026129 1012167 999715 988287 978550 970785 963888 956757 949961 945264
62200 945264 943683 944513 946026 946867 947055 947972 951198 957201 965296 974699 985082 996183 1007705 1019862
62186 1019862 1033252 1047827 1062705 1077469 1092994 1110584 1130960 1154583 1182121 1213833 1249137
62175 1249137 1287493 1329034 1373580 1419812 1466500 1513854 1562518 1611793 1660185 1707283 1753645
62164 1753645 1799052 1842350 1882957 1921008 1956069 1987381 2015672 2042893 2069461 2093263 2112229
62153 2112229 2126531 2137368 2145017 2149209 2149991 2146615 2136544 2117430 2089743 2056026 2017922 1975418
62141 1975418 1928838 1879885 1830356 1781096 1732733 1686417 1643187 1603264 1566513 1533223 1504076
62130A504076k4342j9071j3633q386l312K009P527J2166J4782J5354J4770J3756
62118A515696J2635J1838J1922J2941J4367J5653J6538J6848J6382J5162J3636
62107A673618J2472J2137J2475J2622J1614R297O625M850M446M825N115N152N612
62094A780860P019Q845J0161J1171J3222J6945K1332K5431K9931L5702M1465M4779
62082B046863M5337M5559M7400N0167N2203N3233N4008N4570N4244N2916N1503
62071B608003N1204N2499N4405N4854N2652M9191M6906M5893M3708L9016L3425
62060C131756K8521K3151J5717P650J881j429n016j0468j6527k1817k6903l2690
62048C093826l8694m4205m9773n6156o2650o7666p0528p1773p2160p2333p3069
$$ plain form
62130 1504076 1479734 1460663 1447030 1438644 1435332 1437341 1444868 1457034 1471816 1487170 1501940 1515696
62118 1515696 1528331 1540169 1552091 1565032 1579399 1595052 1611590 1628438 1644820 1659982 1673618
62107 1673618 1686090 1698227 1710702 1723324 1734938 1744235 1750860 1755710 1760156 1764981 1770096 1775248 1780860
62094 1780860 1787879 1796724 1806885 1818056 1831278 1848223 1869555 1894986 1924917 1960619 2002084 2046863
62082 2046863 2092200 2137759 2185159 2235326 2287529 2340762 2394770 2449340 2503584 2556500 2608003
62071 2608003 2659207 2711706 2766111 2820965 2873617 2922808 2969714 3015607 3059315 3098331 3131756
62060 3131756 3160277 3183428 3199145 3206795 3208676 3207247 3202231 3191763 3175236 3153419 3126516 3093826
62048 3093826 3055132 3010927 2961154 2904998 2842348 2774682 2704154 2632381 2560221 2487888 2414819
62037B414819p4757p6603p7164p6091p4785p4818p5826p5638p2710o7980o3603
62026A604844o0226n6661n2343m8560m6340m4420m0818l5706l1079k8017k5836
62015A134838k3776k1669j8908j4710j0025p355p706r174r512q713p858o799m720
62002I83913k157o59o52j205j734k497l285l145k004j303k190l810m247k860r17
61987I51248m0o27j956l287m486n751p092q294r199r881j0615j1638j2674j2715
61973H52993j0880p840n667n493n913m747k055L1N08P63J995L105K628J536K150
61958H23114M740P077P747Q100J0083J3387J5894J6554J6598J7882K0737K3801
61946I85714K5537K5653K5180K5491K7208K9800L2097L3328L3761L4153L4443
$$ plain form
62037 2414819 2340062 2263459 2186295 2110204 2035419 1960601 1884775 1809137 1736427 1668447 1604844
62026 1604844 1544618 1487957 1435614 1387054 1340714 1296294 1255476 1219770 1188691 1160674 1134838
62015 1134838 1111062 1089393 1070485 1055775 1045750 1038395 1030689 1021515 1012003 1003290 995432 988633 983913
62002 983913 981756 981097 980445 979240 977506 975009 971724 968579 966575 965272 963082 959272 955025 952165 951248
61987 951248 951208 950581 948625 945338 940852 935101 928009 919715 910516 900635 890020 878382 865708 852993
61973 852993 842113 834273 828606 823113 817200 812453 810398 810429 810937 811700 813695 816800 819428 820964 823114
61958 823114 827854 834931 842678 850778 860861 874248 890142 906696 923294 941176 961913 985714
61946 985714 1011251 1036904 1062084 1087575 1114783 1144583 1176680 1210008 1243769 1277922 1312365
61935A312365L3484L0619K7218K5699K6885K9070L0027K9141K7146K4612K1696
61924A617962J8905J7009J6049J5195J3781J2009J0539R776R704J0007J0207R810
61912A770953Q449O018K921J88j214j520j990l174l998l403k268k452m138n525
61898A758847n491n189o201q138r302r283r747j2479j7414k2859k7117k9670l1141
61885A564816l2474l4022l5279l5540l4879l4217l4165l4021l2387k8808k4361
61874A204663k0351j6832j2954q474m194q78J620L999O867J0632J5290J9917K3162
61861A222467K4907K6777L0243L4727L8485M0951M3029M5297M7149M7949M7975
61850A649956M7794M7503M6938M5903M3975M0890L7529L5471L5032L4690L3192
$$ plain form
61935 1312365 1345849 1376468 1403686 1429385 1456270 1485340 1515367 1544508 1571654 1596266 1617962
61924 1617962 1636867 1653876 1669925 1685120 1698901 1710910 1721449 1731225 1740929 1750936 1761143 1770953
61912 1770953 1779402 1785420 1788341 1788529 1787315 1785795 1783805 1780631 1776633 1773230 1770962 1768510 1764372 1758847
61898 1758847 1753356 1748167 1741966 1733828 1724526 1715243 1705496 1693017 1675603 1652744 1625627 1595957 1564816
61885 1564816 1532342 1498320 1463041 1427501 1392622 1358405 1324240 1290219 1257832 1229024 1204663
61874 1204663 1184312 1167480 1154526 1146052 1141858 1140980 1142600 1146599 1153466 1164098 1179388 1199305 1222467
61861 1222467 1247374 1274151 1304394 1339121 1377606 1418557 1461586 1506883 1554032 1601981 1649956
61850 1649956 1697750 1745253 1792191 1838094 1882069 1922959 1960488 1995959 2030991 2065681 2098873
61839B098873L1387L0911L1722L2179L1224K9204K6605K3248J9053J4519R898
61828B378823M736j118o756j1235j4987j9397k4885l0063l3010l3108l1413k9527
61816B148060k8351k7878k7772k7876k8291k9281l1192l4142l7674m1113m4387
61805A790103m8038n2036n5162n6385n6378n6601n6998n5943n2784m8963m5824
61794A204991m2623l8095l2924k8877k6012k2752j8815j5862j4669j3544j0784
61783I40034p040l883j379J062K574J778n72k034j603m64M54J554K735K624Q38
61768I36678p86o09N75R97L89n04j642l068l570k113j09q8k123l632l024j554
61752I15817r29r03l61N82Q78K36n60p15o0J044K020K552K949L696M656N339N807
$$ plain form
61839 2098873 2130260 2161171 2192893 2225072 2256296 2285500 2312105 2335353 2354406 2368925 2378823
61828 2378823 2383559 2382441 2375685 2364450 2349463 2330066 2305181 2275118 2242108 2209000 2177587 2148060
61816 2148060 2119709 2091831 2064059 2036183 2007892 1978611 1947419 1913277 1875603 1834490 1790103
61805 1790103 1742065 1690029 1634867 1578482 1522104 1465503 1408505 1352562 1299778 1250815 1204991
61794 1204991 1162368 1124273 1091349 1062472 1036460 1013708 994893 979031 964362 950818 940034
61783 940034 932994 929111 927732 928794 931368 933146 932574 930540 928937 928473 928927 930481 933216 935840 936678
61768 936678 935892 935283 935858 936855 937244 936740 935098 932030 928460 926347 926238 926150 924027 920395 917371 915817
61752 915817 914888 913985 913624 914206 915084 915320 914760 914045 913985 915029 917049 919601 922550 926246 930902 936241 942048
61735I42048O498P246P572P863Q852R865R241P002N345N559O346O358O548Q089
61721A044432R573Q702N892L715L152K841K007J560J858J745P12m2Q1l88k713
61706A083127n619o979o805o887q012r182r401q776p790o696n946o242p701r430
61692I77661j0248r601p794n706m231l666l553l302k794k263j909j935k548l468
61678I14643l771k802j034N19J463K035K198J586L44o74p87m7J029J832J767Q19
61662I19120J4N62K245L506L547L462M520O172O888O534O556P683Q785Q693Q097
61647I96384Q589J0319J1710J1552J0340R215Q398P404O296N824O247O836O826
61634A105940O389O087N747M680L031K048K407K890J656j281l883m612m164m091
$$ plain form
61735 942048 948546 955792 963364 971227 980079 989944 999185 1006187 1011532 1017091 1023437 1029795 1036343 1044432
61721 1044432 1054005 1062707 1068599 1072314 1075466 1078307 1080314 1081874 1083732 1085477 1086189 1086147 1086228 1085840 1083127
61706 1083127 1077508 1070529 1063724 1056837 1048825 1039643 1030242 1021466 1013676 1006980 1001034 994792 987091 977661
61692 977661 967413 957812 950018 944312 940081 936415 932862 929560 926766 924503 922594 920659 918111 914643
61678 914643 910872 908070 907036 907555 909018 911053 913251 914837 915181 914507 913720 913673 914702 916534 918301 919120
61662 919120 919134 919696 921941 925447 928994 932456 936976 943148 950036 956570 963126 970809 979594 988287 996384
61647 996384 1004973 1015292 1027002 1038554 1048894 1058109 1066507 1073911 1080207 1086031 1092278 1099114 1105940
61634 1105940 1112329 1118416 1124163 1128843 1131874 1133922 1136329 1139219 1140875 1139594 1135711 1131099 1126935 1122844
61620A122844m736n555o716q692j0501j0289q232p098q776j1646j2809j1865j0688
61607A005241j0222r655q714q557r682j0772j0628r973j0186j1158j1583j0824
61595H83287r446q344q100q836r946j0336r539q241p283o700o262o165o434o415
61581G71240n679m816m353l658k136p39p13j403j056K79O10r20k619k678j504
61566G39855n98l60j87M0j70r39j817k436k663k294j202K91J493J749P35j240
61550G30257l124l837l282k255j372p28n27j076j943k107j391p61q18j021j003
61535G05012j475k863m088l985l207l361m605n348m352k179m79n08k221m325n453
61520F56563n611n963o822o905n321l215k147j785r43j64j151l717n437m907l523
$$ plain form
61620 1122844 1118108 1112553 1105837 1097145 1086644 1076355 1068123 1061025 1052249 1040603 1027794 1015929 1005241
61607 1005241 995019 985364 976650 968093 958411 947639 937011 927038 916852 905694 894111 883287
61595 883287 873841 865497 857397 848561 838615 828279 818740 810499 803216 796516 790254 784089 777655 771240
61581 771240 765561 760745 756392 752734 750598 749859 749146 747743 746687 746966 747576 746656 744037 741359 739855
61566 739855 739257 738897 738710 738750 738580 737641 735824 733388 730725 728431 727229 727520 729013 730762 731497 730257
61550 730257 727133 723296 720014 717759 716387 715659 715132 714056 712113 710006 708615 707854 707036 706015 705012
61535 705012 703537 700674 696586 692601 689394 686033 681428 676080 671728 669549 669070 668562 666341 662016 656563
61520 656563 650952 644989 638167 631262 625941 622726 620579 618794 617851 617687 616536 612819 607382 602475 598952
61505E98952l184l788m023l492k819k360j887j235n12J15L84O0n92q58m96k19
61489E74046q17k106l119l078j999n81M32R39J489K417L334L881M449N312N585
61474E90184M248K001P54J174K089K573L145M322N383N459M883M506M416M147
61460F39284L521K608J428K60l23j91J45L61O14P44K23p17r42M8J431K360K825
61443F53679K847K145J239J357K442K857J998J453K221K773J697M55J107K634
61429F80904K356J70j338p07J030K729M314N372M914L081J217q6j252j947j129
61414F99628Q08J972J476J51j393l201m227k791M05K272J450j4l85r49l138n439
61398F86625n723m775m867o015o391n570m838m700m438l967l937m009l039j172
$$ plain form
61505 598952 595768 591980 587957 584465 581646 579286 577399 576164 575652 575767 576151 576211 575619 574761 574265 574046
61489 574046 573229 571123 568004 564926 562927 562346 562778 563717 565206 567623 570957 574838 579287 584599 590184
61474 590184 594432 596433 597187 598361 600450 603023 606168 610490 615873 621332 626215 630721 635137 639284
61460 639284 642805 645413 646841 647101 646778 646587 646732 647093 647707 648451 648674 647957 647015 647063 648494 650854 653679
61443 653679 656526 658671 659910 661267 663709 666566 668564 670017 672238 675011 676708 677163 678270 680904
61429 680904 683260 683430 682092 681385 682415 685144 689458 694830 699744 702825 704042 703956 702704 700757 699628
61414 699628 700436 702408 703884 704035 702642 699441 695214 692423 692828 695100 696550 696536 696151 695202 692064 686625
61398 686625 680902 676127 671260 665245 658854 653284 648446 643746 639308 635341 631404 627395 624356 623184
61384F23184Q1L2l88l26l1L8n5j90l12pJ035K147K364J873J633J828J934K157
61366F36997L204M627N020M212L702M405N480N980O325P232Q481R674J1136J3081
61352G29556J4738J5301J5073J4812J4604J4253J4089J4351J4349J3388J2134
61341H86648J1902J2661J2881J1500R160P212O265O079O282O600O663O057M666
61328I94576K791R21o58k088l714n529o969p472p246p095p423p744p520p061p047
61313I20722p246o521m485k399j725k134j962m98J158J724J244N61R1j11J76R91
61297H99586J641J390N54K26R21K009K504K074J415J638L055M368L775J130j691
61282I24595l079l406l787m124l524j926PK074M295N948O371O433P600R598J0631
$$ plain form
61384 623184 623265 623297 622909 622583 622552 622590 622535 622345 622033 622026 623061 625208 627572 629445 631078 632906 634840 636997
61366 636997 640201 644828 649848 654060 657762 662167 667647 673627 679952 687184 695665 705339 716475 729556
61352 729556 744294 759595 774668 789480 804084 818337 832426 846777 861126 874514 886648
61341 886648 898550 911211 924092 935592 944752 951964 958229 964308 970590 977190 983853 989910 994576
61328 994576 997367 998288 997630 995542 991828 986299 979330 971858 964612 957517 950094 942350 934830 927769 920722
61313 920722 913476 906955 902470 900071 898346 896212 894250 893752 894910 896634 897878 898439 898530 898419 898595 899586
61297 899586 901227 902617 903171 903397 904318 906327 908831 910905 912320 913958 917013 921381 925156 926286 924595
61282 924595 921516 918110 914323 910199 906675 904749 904756 906830 911125 917073 923444 929877 937477 947075 957706
61267I57706J0111R520J0249J2068J4205J6406J8320J9229J9151J8957J8793J7689
61255A142404J5447J3454J2611J1910J0202Q121O803N856M203K194J192J438J816
61242A237651J490N69p18k301l869n161o559q475j0519j2057j3198j4131j4159
61229A148563j2616j0430r227r021q247o156l808k383j912k030k694l530l554
61216A072955k313n91O25J282J899K776M058N942Q160R727R854Q938Q270Q891
61202A140473J0864J3384J5479J6889J8328K0641K3712K6575K8487K9470K9931
61191A374233L0281L0913L1907L2705L2691L2063L1621L1773L2331L3182L4306
61180A728006L5182L4944L3232L0275K6330K1823J7635J4112J0115M560j239m628
$$ plain form
61267 957706 967817 977337 987586 999654 1013859 1030265 1048585 1067814 1086965 1105922 1124715 1142404
61255 1142404 1157851 1171305 1183916 1195826 1206028 1214149 1220952 1226808 1231011 1233205 1234397 1235835 1237651
61242 1237651 1239141 1239710 1238992 1236691 1232822 1227661 1221102 1212627 1202108 1190051 1176853 1162722 1148563
61229 1148563 1135947 1125517 1116290 1107269 1099022 1092866 1089058 1086675 1084763 1082733 1080039 1076509 1072955
61216 1072955 1070642 1070051 1070676 1071958 1073857 1076633 1080691 1086633 1094793 1104520 1114374 1123312 1131582 1140473
61202 1140473 1151337 1164721 1180200 1197089 1215417 1236058 1259770 1286345 1314832 1344302 1374233
61191 1374233 1404514 1435427 1467334 1500039 1532730 1564793 1596414 1628187 1660518 1693700 1728006
61180 1728006 1763188 1798132 1831364 1861639 1887969 1909792 1927427 1941539 1951654 1956214 1954975 1950347
61168A950347n329o185r440j4132j8166k1063k3165k3989k3461k3467k5817k9384
61156A726749l1466l1531l1340l1613l0990k8759k6452k5805k6673k7709k7858
61145A406553k6632k4142k1480j9878j8968j7062j3511r483n907k373J207L599
61133A251923M235M632O367Q904J0993J2939J5525J7924J9080K0429K4541L1029
61121A428521L6539L9321M1313M4663M8576N1113N2311N3469N4748N5486N6019
61110A962079N7083N7853N6674N3811N1417N0392M9001M5559M0913L6997L3902
61099B495681K9898K4014J7205J0841N174k11n331r966j4517j9724k5466l0561
61087B477037l4201l7080m0471m4580m8504n1656n4248n6206n6698n5366n3274
$$ plain form
61168 1950347 1945018 1938833 1929393 1915261 1897095 1876032 1852867 1828878 1805417 1781950 1756133 1726749
61156 1726749 1695283 1663752 1632412 1600799 1569809 1541050 1514598 1488793 1462120 1434411 1406553
61145 1406553 1379921 1355779 1334299 1314421 1295453 1278391 1264880 1255397 1249490 1247117 1248324 1251923
61133 1251923 1256158 1260790 1267157 1276061 1287054 1299993 1315518 1333442 1352522 1372951 1397492 1428521
61121 1428521 1465060 1504381 1545694 1590357 1638933 1690046 1742357 1795826 1850574 1906060 1962079
61110 1962079 2019162 2077015 2133689 2187500 2238917 2289309 2338310 2383869 2424782 2461779 2495681
61099 2495681 2525579 2549593 2566798 2577639 2582813 2582602 2577271 2567305 2552788 2533064 2507598 2477037
61087 2477037 2442836 2405756 2365285 2320705 2272201 2220545 2166297 2110091 2053393 1998027 1944753
61076A944753n1807n1110n0342m8995m7049m4216m0220l5798l2258k9848k7414
61065A485696k4042k0153j6556j3198r413m958l38L561N959O836P381R247J3029
61052A443051J7873K2735K7288L1328L4251L5893L7211L9361M2462M5871M9302
61041A826626N2891N6534N9871O2790O5465O8126P1210P5239P9976Q4185Q7013
61030B589926Q9264R2556R7534J03737J10899J19445J29924J42946J59632J81247
61020C817110K08232K40250K77218L19633L68131M23522M87303N61288O46806
61011G349493P44607Q54586R73607J093521J203779J297794J375968J440790J488923
61002A7823068J509981J494928J446444J380256J314950J260082J214483J174484
$$ plain form
61076 1944753 1892946 1841836 1791494 1742499 1695450 1651234 1611014 1575216 1542958 1513110 1485696
61065 1485696 1461654 1441501 1424945 1411747 1402334 1397376 1397038 1400599 1406558 1413394 1420775 1430022 1443051
61052 1443051 1460924 1483659 1510947 1542275 1576526 1612419 1649630 1688991 1731453 1777324 1826626
61041 1826626 1879517 1936051 1995922 2058712 2124177 2192303 2263513 2338752 2418728 2502913 2589926
61030 2589926 2679190 2771746 2869280 2973017 3083916 3203361 3333285 3476231 3635863 3817110
61020 3817110 4025342 4265592 4542810 4862443 5230574 5654096 6141399 6702687 7349493
61011 7349493 8094100 8948686 9922293 11015814 12219593 13517387 14893355 16334145 17823068
61002 17823068 19333049 20827977 22274421 23654677 24969627 26229709 27444192 28618676
60994B8618676J139432J106576J064156R96098Q96064P74377O49118N30512M11728
60985C6186737K69332P1514k05371n55377r31513j259040j469381j532171j465782
60976B9108948j325267j180714j097821j122780j268341j503388j757289j946778
60968A7906570k013822j948473j781864j560882j327029j108522r19910p63977
60960F482091o36602n32827m49030l81191l24841k77822k40582k12619j90678
60951C235899j71600j54867j40855j28449j16181j04364r4212q5693p7813p0366
60941B091499o3909n8511n3831n0030m7465m5812m4391m3025m1811m0481l8732
60930A563501l6708l4488l1778k8824k6789k6339k6569k6336k5773k5405k4674
$$ plain form
60994 28618676 29758108 30864684 31928840 32924938 33821002 34595379 35244497 35775009 36186737
60985 36186737 36456069 36527583 36322212 35766835 34835322 33576282 32106901 30574730 29108948
60976 29108948 27783681 26602967 25505146 24382366 23114025 21610637 19853348 17906570
60968 17906570 15892748 13944275 12162411 10601529 9274500 8165978 7246068 6482091
60960 6482091 5845489 5312662 4863632 4482441 4157600 3879778 3639196 3426577 3235899
60951 3235899 3064299 2909432 2768577 2640128 2523947 2419583 2325371 2239678 2161865 2091499
60941 2091499 2027590 1969079 1915248 1865218 1817753 1771941 1727550 1684525 1642714 1602233 1563501
60930 1563501 1526793 1492305 1460527 1431703 1404914 1378575 1352006 1325670 1299897 1274492 1249818
60919A249818k2863k0842k0115k0472k0246j8959j7909j7874j7808j6548j4554
60908A041628j3100j2570j2330j1770j0836r861r256r093q873q059o903o153n908
60895I16916n466m548l960m547n957p004p131o952p346q283q818q252p109o572
60881H24971o996p437o877n355l539j743N2J559K311K243J679R64N35R96K480
60866H05843M194N233N543N601N559N334N079M822M155L139K929M318O164O536
60852H74449N173L476K304J306L64J7Nr74l419o089p537p565o776n826n557o566
60836H36785q037q255o955n935o578p984q565q191p576o559m418j425J220K714
60822G60241L053K484J454P24Q08J499K348L123L543L457L652N297P967R548Q998
$$ plain form
60919 1249818 1226955 1206113 1185998 1165526 1145280 1126321 1108412 1090538 1072730 1056182 1041628
60908 1041628 1028528 1015958 1003628 991858 981022 971161 961905 952812 943939 935880 928977 922824 916916
60895 916916 911450 906902 902942 898395 892438 885434 878303 871351 864005 855722 846904 838652 831543 824971
60881 824971 817975 810538 803661 798306 794767 793024 793076 794635 796946 799189 800868 801832 802367 803363 805843
60866 805843 810037 815270 820813 826414 831973 837307 842386 847208 851363 854502 857431 861749 867913 874449
60852 874449 879622 883098 885402 886708 887072 887089 887094 886120 882701 876612 869075 861510 854734 848908 843351 836785
60836 836785 828748 820493 813538 807603 801025 793041 784476 776285 768709 762150 757732 756307 757527 760241
60822 760241 763294 765778 767232 767956 768764 770263 772611 775734 779277 782734 786386 791683 799650 809198 818196
60807H18196P833P654P704O542M813M166M287L451J659R03J991L281L152J974
60793H77606R00J92m86j179j779k342k823l188l888n383p148q076p903p324o855
60778H20324o640p080q314r146q211o302n736o999p927o901n047m165m226m215
60764G29415l984l698k591j32K332K916J922J650L316N509O026M324J876N99J262
60749G50742K983M254M562M823O005P737Q683Q026O206M409L575L792M372M656
60735H24825M678M821N119N483O190P207P385N636K927J494J801J949P47n00l74
60720H79388K10m36k073l246l820m838o379p438p785q126q478q045o894o176o284
60705G99580o235n445m912n719p275p927p012n566n012n540n952n138l505k429
$$ plain form
60807 818196 826029 833683 841387 847929 852742 856908 861195 864646 866305 867208 869199 872480 875632 877606
60793 877606 878506 878698 878212 877033 875254 872912 870089 866901 863013 857630 850482 842406 834503 827179 820324
60778 820324 813684 806604 798290 789144 780933 774631 768895 761896 753969 747068 742021 737856 733630 729415
60764 729415 725431 721733 719142 719010 721342 724258 726180 727830 731146 736655 742681 747005 748881 749480 750742
60749 750742 753725 757979 762541 767364 773369 781106 789789 797815 804021 808430 812005 815797 820169 824825
60735 824825 829503 834324 839443 844926 851116 858323 865708 871344 874271 875765 877566 879515 880262 879762 879388
60720 879388 879598 879162 877089 873843 870023 865185 858806 851368 843583 835457 826979 818934 812040 805864 799580
60705 799580 793345 787900 782988 777269 769994 762067 755055 749489 744477 738937 732985 727847 724342 721913
60691G21913k383k369j520l04M76J004J854K847L564M356N680O964P338O984O523
60676G62927N620L676J505P65J722L171M415N706O724O402M744L191K577K117
60662H15262R27q07k678m672o296o432m917l133k286k193k363l017m178m964m807
60647G63446m315l998l264j728m74o72j690j870o68J143K790L818L629K076L24
60632G58547p5J049K532L462L755L422K454J578K037M066O167O441M570K357K146
60617H04508M451P135P532N500L692M484P449J0302J1504J1060R555P560N795
60604I00527N005N522P197R292J0318Q947N812L437L485M875N561N245N010N073
60590I85306M594L327J961R58M65J094L210N573O345N552M970N421N970O188P125
$$ plain form
60691 721913 719530 717161 715641 715337 715813 716817 718671 721518 725082 729438 735118 742082 749420 756404 762927
60676 762927 768547 772223 773728 774493 776215 779386 783801 789507 796231 802633 807377 810568 813145 815262
60662 815262 816189 815382 812704 808032 801736 795304 790387 787254 784968 782775 780412 777395 773217 768253 763446
60647 763446 759131 755133 751869 750141 749667 748995 747305 745435 744767 745910 748700 752518 756147 758223 758547
60632 758547 758472 759521 762053 765515 769270 772692 775146 776724 778761 782827 788994 795435 800005 802362 804508
60617 804508 808959 816094 823626 829126 832818 837302 844751 855053 866557 877617 887172 894732 900527
60604 900527 905532 911054 918251 927543 937861 946808 952620 956057 959542 964417 969978 975223 980233 985306
60590 985306 989900 993227 995188 996146 996611 997705 1000915 1006488 1012833 1018385 1023355 1028776 1034746 1040934 1048059
60575A048059R188J0836J0810J0194J0770J2452J4032J5584J8202K1601K3923
60564A205651K4264K3945K4590K6222K8046L0173L3273L6913L9425L9838L9140
60553A551480L9095M0187M1316M1268L9780L7173L3748K9987K6804K4984K4381
60542A930203K4028K2913K0556J7253J3974J1632J0066Q105M951J055k656n816
60530B056264q476j0711j3108j6780k1908k6874l0071l1985l4303l7294l9510
60519A785244l9878l8541l5794l1843k7842k5395k4494k3377k0995j8120j5507
60508A483458j2611r064n744l105J02M791R343J1244J0314Q628P593O680M919
60495A516548K180j127m360o520o898o118n654o196p259q299r240r895r993j0040
$$ plain form
60575 1048059 1057247 1068083 1078893 1089087 1099857 1112309 1126341 1141925 1160127 1181728 1205651
60564 1205651 1229915 1253860 1278450 1304672 1332718 1362891 1396164 1433077 1472502 1512340 1551480
60553 1551480 1590575 1630762 1672078 1713346 1753126 1790299 1824047 1854034 1880838 1905822 1930203
60542 1930203 1954231 1977144 1997700 2014953 2028927 2040559 2050625 2058730 2063681 2064736 2062080 2056264
60530 2056264 2047788 2037077 2023969 2007189 1985281 1958407 1928336 1896351 1862048 1824754 1785244
60519 1785244 1745366 1706825 1671031 1639188 1611346 1585951 1561457 1538080 1517085 1498965 1483458
60508 1483458 1470847 1461783 1456039 1452934 1453036 1457827 1467170 1478414 1488728 1497356 1504949 1511629 1516548
60495 1516548 1518728 1517601 1513241 1506721 1499823 1493705 1488051 1481855 1474596 1466297 1457057 1447162 1437169 1427129
60481A427129j1223j3991j7533k0966k4377k8287l2744l7227m0894m2617m1580
60470A115690l8353l4856l2579l1172k9321k6570k3590k0847j7897j4324j0779
60459H35402q432p493o912n830m881n342p120q411p784n924m592m427m647m715
60445G48892n041n812o113n042l096j699j557j979j831o89Q32J570P16j397l376
60430G14378l985l291k257j399m62M37K44j698m190n065l571j094O68J333J315
60415F91363P16l81j211j016o2R18J935L260M107L308J368L21J044K146K203J705
60399G11724J811K425K734K786L098L357K919K143J928K163J976J390J363K118
60385G43935K588J858K80j082j336j63J809L094K767J763J738K767L404L014K541
$$ plain form
60481 1427129 1415906 1401915 1384382 1363416 1339039 1310752 1278008 1240781 1199887 1157270 1115690
60470 1115690 1077337 1042481 1009902 978730 949409 922839 899249 878402 860505 846181 835402
60459 835402 826970 819477 812565 806735 801854 796512 789392 780981 773197 767273 762681 758254 753607 748892
60445 748892 743851 738039 731926 726884 723788 722089 720532 718553 716722 716033 716865 718435 719151 717754 714378
60430 714378 710393 707102 704845 703446 702984 703421 703665 701967 697777 692712 689141 688047 688715 690048 691363
60415 691363 692079 691698 690487 689471 689409 690327 692262 695522 699629 702937 704305 704626 705670 707816 710019 711724
60399 711724 713535 715960 718694 721480 724578 727935 730854 732997 734925 737088 739064 740454 741817 743935
60385 743935 746523 748381 748661 747579 746243 746080 747889 750983 753750 755513 757251 760018 763422 766436 768977
60370G68977K539K162Q83j16M74K048K896K407J383N77N3j92nN32J209K185L723
60353G91735N427O279N677M159K995L119M312N366N308M483M048M396M711M323
60339H56338L717L657L960L950L664L767M325M441L305J218o08j036Q6J831K950
60324H95565K907K103J290R06R40R79N60q6J77K176N148P512Q824R853J0876J1429
60308I61159J1961J3835J6715J7798J5186J0698P653O964P166P227P116O356M461
60295A094295K656K807M469N217M200L018K456Q60l041p853j1668j4744j8167
60282A064505k1268k2401k1417j9469j6950j3574j0100p928o913n389k788o47
60270I15661l06j033j367j371k274m300o036o128m841l479k793k542k481k956
$$ plain form
60370 768977 771516 773678 774561 774445 774919 776967 779863 782270 783653 784230 784283 784091 784086 784618 785827 788012 791735
60353 791735 797162 803441 809118 813277 816272 819391 823703 829069 834377 838860 842908 847304 852015 856338
60339 856338 860055 863712 867672 871622 875286 879053 883378 887819 891124 892342 891734 890698 890784 892615 895565
60324 895565 898472 900575 901865 902771 903711 904690 905250 905164 905341 907517 912665 920177 929001 938854 949730 961159
60308 961159 973120 986955 1003670 1021468 1036654 1047352 1055005 1061969 1069135 1076362 1083478 1089834 1094295
60295 1094295 1096951 1099758 1104227 1109444 1113644 1116662 1119118 1119978 1116937 1109084 1097416 1082672 1064505
60282 1064505 1043237 1020836 999419 979950 963000 949426 939326 931398 924485 919096 916308 915661
60270 915661 915355 914322 912955 911584 909310 905010 898974 892846 888005 884526 881733 879191 876710 873754
60256H73754m111n227n536n295n190n000m070k973l173m603n184l636j467q07
60242H17482j425j496n34K55K99M60J280J990J914J589J783K268K301J802J423
60227H31391J748K733L774M178L894L687M276N426O315O526O152N370M633M885
60213H94988O475Q088Q056O633N681N976O385O066N863O627P512P183N878N050
60199I86461N484O677P763Q146P567O188M455K653R44j55k45j60j216k909k912
60184A028741l82K281K456O59q90j804l238m854m865l268k411l632n347n530m300
60169I93616l079k602k852l658m230l300q06J482K089J573J133O47m59j374p37
60154I77443J124K509K861L462N368P903R614R891R277Q921R769J1656J3043J2412
$$ plain form
60256 873754 869643 864416 858880 853585 848395 843395 839325 836352 833179 828576 823392 819756 818289 817482
60242 817482 816057 814561 814027 814282 814581 815041 816321 818311 820225 821814 823597 825865 828166 829968 831391
60227 831391 833139 835872 839646 843824 847718 851405 855681 861107 867422 873948 880100 885470 890103 894988
60213 894988 901463 909551 917607 924240 929921 935897 942282 948348 954211 960838 968350 975533 981411 986461
60199 986461 991945 998622 1006385 1014531 1022098 1028286 1032741 1035394 1036338 1036183 1035938 1035778 1034562 1031653 1028741
60184 1028741 1028359 1030640 1033096 1033755 1032865 1031061 1027823 1022969 1018104 1014836 1012425 1008793 1003446 997916 993616
60169 993616 990537 987935 985083 981425 977195 973895 973089 974571 976660 978233 979366 980013 979554 978180 977443
60154 977443 978567 981076 983937 987399 992767 1000670 1010284 1020175 1029452 1038373 1048142 1059798 1072841 1085253
60140A085253J0067P878P206P709Q236Q065P171O021N445O058P532Q909R706J0016
60126A195272R584P739M633J612j68q51j153j345j560k302l793n310o032o143
60112A190183o245o118n103l575k867l460m128l398j326O36J234N97j05J30J202
60097A157657K177K442K253K077J870J518J450K076K813K672J872J784K905L757
60083A189323K575m49l330m424l744k410j447j205j489j879k130k283k482k845
60069A161781l583m999p135r530j1483j2491j2513j2024j1798j2223j2772j2594
60057A038636j1654j0702j0035r005p160n114l693k851k108j464j049m46O87J763
60043I75805K131K380L531N192N949N569N371O045O673O459N905N309L713O88
$$ plain form
60140 1085253 1095320 1103198 1110404 1118113 1126349 1134414 1141585 1147606 1153051 1159109 1166641 1175550 1185256 1195272
60126 1195272 1204856 1212595 1217228 1218840 1218672 1217821 1216668 1215323 1213763 1211461 1207668 1202358 1196326 1190183
60112 1190183 1183938 1177820 1172717 1169142 1166275 1162815 1158687 1155289 1153963 1154599 1155833 1156430 1156325 1156455 1157657
60097 1157657 1159834 1162276 1164529 1166606 1168476 1169994 1171444 1173520 1176333 1179005 1180877 1182661 1185566 1189323
60083 1189323 1191898 1191449 1188119 1183695 1179951 1177541 1176094 1174889 1173400 1171521 1169391 1167108 1164626 1161781
60069 1161781 1158198 1153199 1146064 1136534 1125051 1112560 1100047 1088023 1076225 1064002 1051230 1038636
60057 1038636 1026982 1016280 1006245 997240 990080 984966 981273 978422 976314 974850 973801 973355 974042 975805
60043 975805 977936 980316 983847 989039 994988 1000557 1005928 1011973 1018646 1025105 1031010 1036319 1040032 1040720
60029A040720j957k202r70j351m626q655j0613r949q053o218n007m864o059p916
60015I62280q988q509p356p222q788j1054j2516j2705j2258j1663j0571q555o073
60002H36022m295m017m856n356m105j200J497K199J279P48J649L070L969M561
59988H31165N123M824L029P61o20j336k230k685j516N03J268O04N90K108L296
59973H44884K470O23m08o75j343k379k822k614k450k310j672r23j078k184l233
59958H23886l597l384k559j042L87O76K13N09J779K319J076n13m61Q86J338j8
59942H21495j667j828o89J75o4p29q63m75l04p25j411j938k302k637k790k476
59926H00772j622m20Q45J843K343K572L039L710L785K883K076K851N013O537N888
$$ plain form
60029 1040720 1038763 1036561 1035591 1034240 1029614 1020959 1010346 1000397 992344 986126 981119 976255 970196 962280
60015 962280 953292 944783 937427 930205 921417 910363 897847 885142 872884 861221 850650 842095 836022
60002 836022 831727 827710 822854 817498 813393 812193 813690 815889 817168 817916 819565 822635 826604 831165
59988 831165 836288 841112 844141 844902 844282 842946 840716 838031 836515 837018 838286 838890 839480 841588 844884
59973 844884 847354 847977 847569 846894 845551 843172 840350 837736 835286 832976 831304 830381 829303 827119 823886
59958 823886 820289 816905 814346 813304 813691 814367 814580 815089 816868 819187 820263 819750 819289 820175 821513 821495
59942 821495 819828 818000 817311 817486 817422 816693 815830 815355 815051 814326 812915 810977 808675 806038 803248 800772
59926 800772 799150 798730 799575 801418 803761 806333 809372 813082 816867 819750 821826 824677 829690 836227 842115
59911H42115L826K326K222K654K624K229K128K423K654K667K949L902N224O212
59897H86155O514O315N983N785N885O300O833P352P988Q748R086Q439P230O650
59883I85263P185P975P962P039N649L945K113R52J118J956K145J492J056J343
59869A037193J400M05q32r49j60j70j828l816m216k783j035k77l07j49N89J504
59853A024569K217K791L453M182M731M777M266L796M363O209Q135Q526P072M985
59839A094072L618L425M078M805M614L179J555J053J219J55k799n935p493p795
59825A097751q094q480q323p908q064q663q939q950r343r913r737q777p979p808
59811I76773p875q031q598r449r989j0127j0189r869q552o664n382m856m186l296
$$ plain form
59911 842115 845941 848267 850489 853143 855767 857996 860124 862547 865201 867868 870817 874719 879943 886155
59897 886155 892669 898984 904967 910752 916637 922937 929770 937122 945110 953858 962944 971383 978613 985263
59883 985263 992448 1000423 1008385 1015424 1021073 1025018 1027131 1028083 1029201 1031157 1033302 1034794 1035850 1037193
59869 1037193 1038593 1038998 1038166 1037217 1037057 1036887 1035059 1031243 1027027 1024244 1023209 1022932 1022625 1022476 1023065 1024569
59853 1024569 1026786 1029577 1033030 1037212 1041943 1046720 1050986 1054782 1059145 1065354 1073489 1082015 1089087 1094072
59839 1094072 1097690 1101115 1105193 1109998 1114612 1117791 1119346 1120399 1121618 1121773 1118974 1113039 1105546 1097751
59825 1097751 1089657 1081177 1072854 1064946 1056882 1048219 1039280 1030330 1020987 1011074 1001337 992560 984581 976773
59811 976773 968898 960867 952269 942820 932831 922704 912515 902646 894094 887430 882048 877192 873006 869710
59797H69710l259m320n151m747l668k761k075j693k138l019k896j510o89j692
59783H30092l109k979j713j129j524j740j509j578j841j320j43L10l52p09M30
59768H11186K390L609L448K491J770K031L195M338M649M340M124M088L827L515
59754H59001L789M585N044M705M035L657L734M093M337L953K995K352K636L257
59740I12173L560M113N468O285M744J639j16N21J450P89o46j362j567j924j726
59725I33401j82J726K560K608K908L102K220Q74M91R05Q51N67J454L133L365J561
59709I61544QN59K144K828K625K737L358L849M071M018L094J267J01Q79K329K093
59693I97504K09q75J71J980K949L384M203N014M845L898L178K860K184P94q62
$$ plain form
59797 869710 866451 862131 856980 852233 848565 845804 843729 842036 839898 836879 833983 832473 831784 830092
59783 830092 826983 824004 822291 821162 819638 817898 816389 814811 812970 811650 811507 811817 811465 810756 811186
59768 811186 813576 817185 820633 823124 824894 826925 830120 834458 839107 843447 847571 851659 855486 859001
59754 859001 862790 867375 872419 877124 881159 884816 888550 892643 896980 900933 903928 906280 908916 912173
59740 912173 915733 919846 925314 931599 936343 937982 937866 938387 939837 940626 939980 938618 937051 935127 933401
59725 933401 933219 934945 937505 940113 943021 946123 948343 949217 949708 950613 951464 952031 953485 956618 959983 961544
59709 961544 961552 962111 964255 967083 969708 972445 975803 979652 983723 987741 990835 992102 992203 993082 995411 997504
59693 997504 997713 996838 997009 998989 1001938 1005322 1009525 1014539 1019384 1023282 1026460 1029320 1031504 1032298 1031436
59678A031436k428l965n241n521m387k360m07Q80J409J254N21m69j163j130n11
59663A007918kk30j111k028k519k563k141j027P20K386L118K655J318m92k479
59648A003523m283n518n974n604m458k810j210j99J04kON93J769K829K922K054
59632I83742J090N77J29p09j639k113k066j522j64J859L354L346K484K075K122
59617I92565J562L05m40K2J136K399L891N024M332J514j556k945k919k926l254
59602I98710l061k191j484j338j145l43P85J556J449K81j533k880k881k062k019
59587I81844l637o072p655p515o100m431l121k187j697k119l558m925m772l191
59573I20864j963k293l241l189k076j106p49l69L29P40N68N29J264K265K487J761
$$ plain form
59678 1031436 1029008 1025043 1019802 1014281 1009894 1007534 1007127 1008007 1009416 1010670 1011191 1010722 1009559 1008429 1007918
59663 1007918 1007916 1007686 1006575 1004547 1002028 999465 997324 996297 997017 999403 1002521 1005176 1006494 1006002 1003523
59648 1003523 999240 993722 987748 982144 977686 974876 973666 973467 973571 973569 973575 974168 975937 978766 981688 983742
59632 983742 984832 985409 985538 984829 983190 981077 979011 977489 977325 979184 982538 985884 988368 990443 992565
59617 992565 994127 994432 993992 994014 995150 997549 1001440 1006464 1010796 1012310 1010754 1007809 1004890 1001964 998710
59602 998710 995649 993458 991974 990636 989491 989148 989933 991489 992938 993219 991686 988806 985925 983863 981844
59587 981844 978207 972135 964480 956965 950865 946434 943313 941126 939429 937310 933752 928827 924055 920864
59573 920864 918901 916608 913367 910178 908102 906996 906247 905878 906207 906947 907515 908044 909308 911573 914060 915821
59557I15821J067J423K816M394N612O887Q740J0609J1320J0804J0276J0337J0088
59544A010194Q964Q282R448J1396J1663R836Q135Q346R861J1398J3071J5566J8353
59531A154513K0043K0163J9578J9254J9308J9194J8318J6408J3586J0109O174
59520A336648K239o50j579q94KK72L72Q43J176N61q07k007k789l761n275o857
59504A317494q153r623j1668j3312j2807r937o962o358p819q563o798l735j612
59491A210147p95J42K138M769P328R593J1573J3430J5626J8197K0103K0311J9412
59478A351974J8869J8835J8126J6562J5579J6017J6894J7379J8546K1807K6611
59467A557199L1012L3995L5995L7538L8618L9302L9949M0613M0882M0405L9367
$$ plain form
59557 915821 916888 918311 921127 925521 931133 938020 946760 957369 968689 979493 989769 1000106 1010194
59544 1010194 1019158 1027440 1036888 1048284 1059947 1069783 1077918 1086264 1096125 1107523 1120594 1136160 1154513
59531 1154513 1174556 1194719 1214297 1233551 1252859 1272053 1290371 1306779 1320365 1330474 1336648
59520 1336648 1338887 1338237 1336658 1335764 1335766 1336038 1336410 1337253 1338429 1338990 1338183 1336176 1333387 1329626 1324351 1317494
59504 1317494 1309341 1299718 1288050 1274738 1261931 1251994 1245032 1238674 1230855 1222292 1215494 1211759 1210147
59491 1210147 1209352 1209494 1211632 1216401 1223729 1233322 1244895 1258325 1273951 1292148 1312251 1332562 1351974
59478 1351974 1370843 1389678 1407804 1424366 1439945 1455962 1472856 1490235 1508781 1530588 1557199
59467 1557199 1588211 1622206 1658201 1695739 1734357 1773659 1813608 1854221 1895103 1935508 1974875
59456A974875L8591L9151M1252M3305M3027L9914L5689L1716K7188K0951J4030
59445B349689Q645N291K610k1j599j562j122j746l485n775r006j4302k2134l1970
59431B273513m2936n4021o3628o9814p1252o7832o0311m9896l8358k7894k0096
59420A707475j4890j0995p512m628k592q10J314L301M313M669N465O734P245O390
59406A705479N104M381M031L528K910J970m33n211j1952j9875k8816l7950m4632
59393A578534m6329m3432l8530l3299k7869k2967k0268k0010k0341k0217k1230
59382A264042k4901k9432l1148k8879k5074k2424k0879j8673j5026j0854p361
59371A029391n052l971l879l895k810m16K059L499M490O404R284J1794J3399J5211
$$ plain form
59456 1974875 2013466 2052617 2093869 2137174 2180201 2220115 2255804 2287520 2314708 2335659 2349689
59445 2349689 2358334 2363625 2366235 2366214 2364615 2363053 2361931 2360185 2356700 2350925 2341919 2327617 2305483 2273513
59431 2273513 2230577 2176556 2112928 2043114 1971862 1904030 1843719 1793823 1755465 1727571 1707475
59420 1707475 1692585 1681590 1674078 1669450 1666858 1666048 1667362 1670663 1674976 1679645 1685110 1691844 1699089 1705479
59406 1705479 1710583 1714964 1718995 1722523 1725433 1727403 1726970 1721759 1709807 1689932 1661116 1623166 1578534
59393 1578534 1532205 1488773 1450243 1416944 1389075 1366108 1345840 1325830 1305489 1285272 1264042
59382 1264042 1239141 1209709 1178561 1149682 1124608 1102184 1081305 1062632 1047606 1036752 1029391
59371 1029391 1024339 1020368 1016489 1012594 1009784 1009368 1011427 1014926 1019416 1025820 1035104 1046898 1060297 1075508
59357A075508J8082K1094K2892K3598K4357K5662K7159K8527K9414K9105K7577
59346A352975K6426K7159K8712K8343K5237K1611J9725J9208J8143J5656J2386
59335A595581R185O343L756J069k124n687q886j1304j3484j6194j9424k2494k4916
59322A491421k6753k8298k9649l0540l0693l0437l0670l1513l1386k8457k3024
59311A170001j7212j2178p105j632K365L034J564J053K575M054L395J115q34j685
59297A148510k124k547k343j051O70J857K517L434M843N991O310O288O599O782
59283A185736N684L104K48j493j430O35M439Q712J1688J2871J3556J4906J6312
59270A274968J6490J5444J4159J2928J1340R698Q961R060Q665P221N979O155O927
$$ plain form
59357 1075508 1093590 1114684 1137576 1161174 1185531 1211193 1238352 1266879 1296293 1325398 1352975
59346 1352975 1379401 1406560 1435272 1463615 1488852 1510463 1530188 1549396 1567539 1583195 1595581
59335 1595581 1604766 1611109 1614865 1615934 1613810 1608123 1599237 1587933 1574449 1558255 1538831 1516337 1491421
59322 1491421 1464668 1436370 1406721 1376181 1345488 1315051 1284381 1252868 1221482 1193025 1170001
59311 1170001 1152789 1140611 1133506 1131874 1134239 1137273 1138837 1139890 1142465 1146519 1149914 1151029 1150195 1148510
59297 1148510 1146386 1143839 1141496 1140445 1141115 1142972 1145489 1148923 1153766 1159757 1166067 1172355 1178954 1185736
59283 1185736 1191420 1194524 1194772 1193279 1191849 1192484 1196923 1205635 1217323 1230194 1243750 1258656 1274968
59270 1274968 1291458 1306902 1321061 1333989 1345329 1355027 1363988 1373048 1381713 1388934 1394913 1401068 1407995
59257A407995O445M385K274J229M75j371m205o418o882o415o844q886j1255j2095
59243A358432j0941q929p145n445l181o31J064J388J181J612K726L531L278K213
59229A339153J064J71o79j696k595k728j962j428k915o997j2000j5501j6804j7245
59215A257838j8080j9042j9457j9751k0851k2508k3318k2466k0651j9046j7938
59204A034730j6713j4795j2305r805p600n477l299j671j444k487l599l903l647
59191I47985l274k506j083M05J413K512M399O368P077O628O455P267Q476R736
59177A001858J1469J3545J5006J5668J6636J8469K0110K0464J9889J9201J8362
59166A190677J7156J6139J5687J4991J3297J1346J0313R966R278Q291P836P756
$$ plain form
59257 1407995 1414440 1418825 1421099 1422328 1422803 1421432 1417227 1410809 1403927 1397512 1390668 1381782 1370527 1358432
59243 1358432 1347491 1338562 1331417 1325972 1322791 1322160 1323224 1324612 1325793 1327405 1330131 1333662 1336940 1339153
59229 1339153 1340217 1340388 1339709 1338013 1335418 1332690 1330728 1329300 1326385 1319388 1307388 1291887 1275083 1257838
59215 1257838 1239758 1220716 1201259 1181508 1160657 1138149 1114831 1092365 1071714 1052668 1034730
59204 1034730 1018017 1003222 990917 981112 973512 968035 964736 963065 961621 959134 955535 951632 947985
59191 947985 944711 942205 941122 941527 942940 945452 949851 956219 963296 969924 976379 983646 992122 1001858
59177 1001858 1013327 1026872 1041878 1057546 1074182 1092651 1112761 1133225 1153114 1172315 1190677
59166 1190677 1207833 1223972 1239659 1254650 1267947 1279293 1289606 1299572 1308850 1317141 1324977 1332733
59154A332733O950N174L252J468q02l629o128p971r922j2349j4438j5676j6963
59141A261699j9174k1507k2368k1462j9915j8593j7284j5481j3122j0365p380
59130A075048m658k950k462k253r42J907N216P358P716P210P213Q090R021R242
59116A124756R091R637J1404J3756J5631J6607J7015J7092J6558J5396J4573J5129
59104A296645J6458J6436J3898J0383Q484Q904J0057J0394R923R194Q061O180
59092A425017L966K066K84j976m403n914o226o414p438q813r292q606p865q247
59078A356139r676j1021j1392j1145j1540j3325j5785j7414j7559j6932j6398
59067A203952j5800j4478j2606j1205j0951j1490j1989j1764j0497q573p332q070
$$ plain form
59154 1332733 1339683 1344857 1348109 1349577 1348775 1345146 1339018 1331047 1321125 1308776 1294338 1278662 1261699
59141 1261699 1242525 1221018 1198650 1177188 1157273 1138680 1121396 1105915 1092793 1082428 1075048
59130 1075048 1070390 1067440 1064978 1062725 1061783 1063690 1068906 1076264 1083980 1091190 1098403 1106493 1115514 1124756
59116 1124756 1133847 1143484 1154888 1168644 1184275 1200882 1217897 1234989 1251547 1266943 1281516 1296645
59104 1296645 1313103 1329539 1343437 1353820 1362304 1371208 1381265 1391659 1401582 1410776 1418837 1425017
59092 1425017 1428983 1431049 1431333 1429357 1424954 1419040 1412814 1406400 1398962 1390149 1380857 1372251 1364386 1356139
59078 1356139 1346463 1335442 1324050 1312905 1301365 1288040 1272255 1254841 1237282 1220350 1203952
59067 1203952 1188152 1173674 1161068 1149863 1138912 1127422 1115433 1103669 1093172 1084599 1077267 1069197
59055A069197j0406j2238j1843r476o667m649l876m164m532l709j688j30k82j205
59041I94332j229m31o0N3J541M720P546Q163P215O803Q167J1027J4280J6601J7183
59026A095911J6605J6300J6707J6751J5700J4477J4207J4473J4109J3079J2350
59015A260669J2318J2461J2533J3019J4224J5619J6385J6289J5841J5691J5871
59004A420920J5746J4906J3711J2433J0343O854L291J973L181M640M599L822L572
58991A519991L471K850K627L846N360N080L092J491J391J880J867J146m07k863
58977A550822n198n875m899l895l804l946l702l601l989m056l111j711o92M8R02
58962A503293J603J866K248L339M454M221K433M52m45o32j545l623n408n322m105
$$ plain form
59055 1069197 1058791 1046553 1034710 1025234 1018567 1013918 1010042 1005878 1001346 997637 995949 995819 995537 994332
59041 994332 993103 992672 992612 992665 994206 998926 1006472 1014635 1021850 1028653 1036820 1047847 1062127 1078728 1095911
59026 1095911 1112516 1128816 1145523 1162274 1177974 1192451 1206658 1221131 1235240 1248319 1260669
59015 1260669 1272987 1285448 1297981 1311000 1325224 1340843 1357228 1373517 1389358 1405049 1420920
59004 1420920 1436666 1451572 1465283 1477716 1488059 1494913 1498204 1500177 1503358 1507998 1512597 1516419 1519991
58991 1519991 1523462 1526312 1528939 1532785 1538145 1543225 1546317 1547808 1549199 1551079 1552946 1554092 1553685 1550822
58977 1550822 1545624 1539749 1534850 1530955 1527151 1523205 1519503 1515902 1511913 1507857 1504746 1503035 1502343 1502391 1503293
58962 1503293 1504896 1506762 1509010 1512349 1516803 1521024 1523457 1523909 1523464 1522832 1521287 1517664 1512256 1506934 1502829
58947A502829m402p420j1177j3138j3587j4779j7319j9435j9889j9622j9760j9735
58935A322566j8518j6449j4558j2967j1219r699r366j0177j0763j0019q401p290
58923A183140p312p693p335o205n049l845j602J890N121O677P121P927R290J0503
58909A192628J1833J4154J6953J8685J9250K0171K2033K3656K4351K5064K6552
58898A415330K8222K9676L1636L4281L6428L7511L8713M0822M2559M2517M1194
58887A818889L9461L6532L1412K5145J9590J4893J0234O171L993L297K392R63
58875B012972J18j95j673n203r635j3519j6603j9323k2104k5609l0306l5470l9623
58862A793827m2229m3909m4902m4621m2924m0618l8318l5867l3092l0098k6662
$$ plain form
58947 1502829 1498427 1491007 1479830 1466692 1453105 1438326 1421007 1401572 1381683 1362061 1342301 1322566
58935 1322566 1304048 1287599 1273041 1260074 1248855 1239156 1229790 1219613 1208850 1198831 1190430 1183140
58923 1183140 1175828 1168135 1160800 1154595 1149546 1145701 1144099 1145989 1151110 1157787 1164908 1172835 1182125 1192628
58909 1192628 1204461 1218615 1235568 1254253 1273503 1293674 1315707 1339363 1363714 1388778 1415330
58898 1415330 1443552 1473228 1504864 1539145 1575573 1613084 1651797 1692619 1735178 1777695 1818889
58887 1818889 1858350 1894882 1926294 1951439 1971029 1985922 1996156 2002327 2006320 2009617 2012009 2012972
58875 2012972 2013090 2012895 2011222 2006019 1996384 1982865 1966262 1946939 1924835 1899226 1868920 1833450 1793827
58862 1793827 1751598 1707689 1662787 1618166 1575242 1534624 1496306 1460439 1427347 1397249 1370587
58851A370587k2604j8977j7483j8250j9374j9236j8127j7081j6275j5313j4144
58840A173723j2930j1702j0719j0401j0500j0183r348q854q878q214o086l721
58828A062187k984m085n567o105n508m286l105k338j598r1J963K977J861k86j360
58813A031675p89J23K12k92n64k14P44K178L582M180L649K539J640J290J383J698
58797A053034J960J907J617J574K084K795L176L353L944M980N517M788L445L067
58783A097241M378O441P704P437O013M338L372L663M836N755N693N015M390L812
58769A170088L034K521K941L860L978K829J364N56J99l84j144j405p79N50K182
58754A190390L704M613M497L439K206J897L088N150O692P160P607R333J1951J3740
$$ plain form
58851 1370587 1347983 1329006 1311523 1293273 1273899 1254663 1236536 1219455 1203180 1187867 1173723
58840 1173723 1160793 1149091 1138372 1127971 1117471 1107288 1097940 1089086 1080208 1071994 1065908 1062187
58828 1062187 1059203 1055118 1049551 1043446 1037938 1033652 1030547 1028209 1026611 1026520 1028483 1031460 1033321 1033035 1031675
58813 1031675 1030886 1031009 1031221 1030929 1030365 1030151 1030895 1033073 1036655 1040835 1044484 1047023 1048663 1049953 1051336 1053034
58797 1053034 1054994 1056901 1058518 1060092 1062176 1064971 1068147 1071500 1075444 1080424 1085941 1090729 1094174 1097241
58783 1097241 1101619 1108060 1115764 1123201 1129214 1133552 1136924 1140587 1145423 1151178 1156871 1161886 1166276 1170088
58769 1170088 1173122 1175643 1178584 1182444 1186422 1189251 1190615 1191171 1191370 1190986 1189842 1188437 1187658 1188208 1190390
58754 1190390 1194094 1198707 1203204 1206643 1208849 1210746 1213834 1218984 1225676 1232836 1240443 1249776 1261727 1275467
58740A275467J3881J3417J3608J4210J4091J3005J2017J2213J3405J4251J3622
58729A423187J1836J0410J0340J0995J1154J0811J1065J2360J3802J4409J4183
58718A554552J3644J3125J2778J2509J1604R307O083L403J823L06j915m011n032
58705A628176n749p674j0731j3170j3728j2906j2254j3034j5350j7983j9393j9514
58693A466690j9934k1615k3312k3557k3349k4944k8150k9940k8291k4631k1542
58682A197425j9491j7230j4303j1520r259o802l686o90J096J615J798K334L017
58669A124304L372L619M501O073P240O996N781M941N029N488O006P080Q744R701
58655A208875Q777O768N688O175O591N208K529P05Q22J574R84j139l097l518k797
$$ plain form
58740 1275467 1289348 1302765 1316373 1330583 1344674 1357679 1369696 1381909 1395314 1409565 1423187
58729 1423187 1435023 1445433 1455773 1466768 1477922 1488733 1499798 1512158 1525960 1540369 1554552
58718 1554552 1568196 1581321 1594099 1606608 1618212 1627519 1633602 1637005 1638828 1639134 1637219 1633208 1628176
58705 1628176 1622427 1614753 1604022 1590852 1577124 1564218 1551964 1538930 1523580 1505597 1486204 1466690
58693 1466690 1446756 1425141 1401829 1378272 1354923 1329979 1301829 1271889 1243598 1218967 1197425
58682 1197425 1177934 1160704 1146401 1134881 1125622 1118820 1115134 1114444 1115540 1117155 1118953 1121287 1124304
58669 1124304 1127676 1131295 1135796 1141869 1149109 1156105 1161886 1166827 1171856 1177344 1183350 1190430 1199174 1208875
58655 1208875 1217652 1224420 1230108 1236283 1242874 1248082 1250611 1251316 1252138 1253712 1254696 1253557 1250460 1246942 1244145
58640A244145k143k040k406l456n275o702o089l498j046l80p98n69O90K067L134
58625A215634M370N978P490Q773J0358J2327J3719J3560J1974R861Q014O932O886
58612A335876P536P880P371O799P375R049J0528J1010J1002J1146J1033R970Q415
58599A454990P635P873P735N944L116J075O31Q63P53P20J805L887N664O368O625
58584A515684P226P904Q002P852Q488J0231J2249J3685J4483J4952J5291J5883
58572A651930J7488K0393K3645K5677K5703K4243K2333K0609J9109J7629J6063
58561A884822J4474J2928J1411J0004Q987Q385P558N887L916L153M157N425M936
58548A986043K463l85k401m234p417j2436j8086k2434k4278k3916k2658k1585
$$ plain form
58640 1244145 1242002 1239962 1237556 1234100 1228825 1222123 1216034 1212536 1211490 1211110 1210312 1209743 1210433 1212500 1215634
58625 1215634 1220004 1225982 1233472 1242245 1252603 1264930 1278649 1292209 1304183 1314044 1322058 1328990 1335876
58612 1335876 1343412 1351292 1358663 1365462 1372837 1381886 1392414 1403424 1414426 1425572 1436605 1446575 1454990
58599 1454990 1462625 1470498 1478233 1484177 1487293 1488368 1488999 1489862 1490615 1491335 1493140 1497027 1502691 1509059 1515684
58584 1515684 1522910 1530814 1538816 1546668 1555156 1565387 1577636 1591321 1605804 1620756 1636047 1651930
58572 1651930 1669418 1689811 1713456 1739133 1764836 1789079 1811412 1832021 1851130 1868759 1884822
58561 1884822 1899296 1912224 1923635 1933639 1942626 1951011 1958569 1964456 1968372 1971525 1975682 1981107 1986043
58548 1986043 1988506 1988121 1985720 1981486 1974069 1961633 1943547 1921113 1896835 1872919 1850261 1828676
58536A828676k0853k0178j9510j8922j8270j7514j7002j6812j6195j4493j2351
58525A636576j1013j0499r662q081o569n411l560m39K574L774L459L357M191N158
58511A603855N708O524Q305J0435J1433J0416P960N703M965N500N788M923L803
58498A695318L866N110O244O563O597O801O653N518L761K505K616M107O145P574
58484A769378P897P655P440O760M786K014j7q71j798l678n653o638o949p304p192
58469A765830n732l508k019j556j178p48j370l406n541o609p196q508j0459j1886
58455A696114j2208j1941j1742j1649j1206r930p734n234l482l002l169k825j397
58442A600595P25K669L753L954L952M449N364O093O615P620R181J0144R618Q478
$$ plain form
58536 1828676 1807823 1787645 1768135 1749213 1730943 1713429 1696427 1679615 1663420 1648927 1636576
58525 1636576 1625563 1615064 1605402 1597321 1590752 1585341 1581781 1581342 1583916 1587690 1591149 1594506 1598697 1603855
58511 1603855 1609563 1616087 1624392 1634827 1646260 1656676 1664636 1670339 1675304 1680804 1686592 1691515 1695318
58498 1695318 1699184 1704294 1710538 1717101 1723698 1730499 1737152 1742670 1746431 1748936 1751552 1755659 1761804 1769378
58484 1769378 1777275 1784930 1792370 1799130 1803916 1805930 1805913 1805042 1803244 1799566 1793913 1787275 1780326 1773022 1765830
58469 1765830 1760098 1756590 1754571 1753015 1751837 1751089 1749719 1746313 1740772 1734163 1726967 1718459 1708000 1696114
58455 1696114 1683906 1671965 1660223 1648574 1637368 1627438 1619704 1614470 1610988 1607986 1604817 1601992 1600595
58442 1600595 1601320 1603989 1607742 1611696 1615648 1620097 1625461 1631554 1638169 1645789 1654970 1665114 1674732 1683210
58428A683210Q393R678J1067J1442J0821R653Q217O973O503O647O450N475M507
58415A789036M512N439O543P241O989M951R14l632o341o401n507o015q431j1019
58401A778279j1680r912p049m952m481m899m623k876p89n79l061o208o863m032
58387A706275J63K876L126J708k57j730j618K35K179K120Pk127k593j516J90K066
58371A711104L888N399O784Q591J0565J1502J0865R751R524J0197J0894J1255
58359A820319J1562J1838J1643J0712R387Q483Q796J0318J2004J2962J3603J4650
58347A956277J5327J4235J2076J1398J2788J3522J1500Q632Q197J0345J2558J3638
58335B100493J4630J6184J7478J7976J8185J8387J8240J7909J7974J8157J7729
$$ plain form
58428 1683210 1691603 1701281 1712348 1723790 1734611 1744264 1752481 1759454 1765957 1772604 1779054 1784529 1789036
58415 1789036 1793548 1798987 1805530 1812771 1819760 1824711 1825625 1821993 1815652 1809251 1803744 1797729 1789298 1778279
58401 1778279 1766599 1756687 1749638 1744686 1740205 1735306 1730683 1727807 1727018 1726439 1723378 1717170 1710307 1706275
58387 1706275 1706438 1709314 1712440 1714148 1713891 1712161 1710543 1710778 1712957 1715077 1715084 1712957 1710364 1708848 1709038 1711104
58371 1711104 1714992 1720391 1727175 1735766 1746331 1757833 1768698 1778449 1787973 1798170 1809064 1820319
58359 1820319 1831881 1843719 1855362 1866074 1875461 1883944 1892740 1903058 1915062 1928024 1941627 1956277
58347 1956277 1971604 1985839 1997915 2009313 2022101 2035623 2047123 2055755 2063952 2074297 2086855 2100493
58335 2100493 2115123 2131307 2148785 2166761 2184946 2203333 2221573 2239482 2257456 2275613 2293342
58324B293342J7298J8268K0269K1045J9595J7683J7351J8456J9585K0072K0040
58313B503004J9545J8777J8430J8997K0150K1238K1783K1351J9926J8689J9285
58302B721175K1825K4634K6443K7711K9294L0977L2162L3012L4029L5232L6349
58291C052843L7198L7459L6973L6579L7651M0263M2888M4527M5971M8232N0764
58280C511348N2360N2961N3661N5363N8162O1499O4478O6604O8556P1443P4984
58269D191419P7544P8521P9446Q1918Q5489Q8592R0834R3300R7037J01980J07062
58258E173142J10983J13335J15245J18284J22788J27996J33675J40357J47913
58249F303718J55374J62434J69679J77127J84089J90877J98938K08862K20043
$$ plain form
58324 2293342 2310640 2328908 2349177 2370222 2389817 2407500 2424851 2443307 2462892 2482964 2503004
58313 2503004 2522549 2541326 2559756 2578753 2598903 2620141 2641924 2663275 2683201 2701890 2721175
58302 2721175 2743000 2767634 2794077 2821788 2851082 2882059 2914221 2947233 2981262 3016494 3052843
58291 3052843 3090041 3127500 3164473 3201052 3238703 3278966 3321854 3366381 3412352 3460584 3511348
58280 3511348 3563708 3616669 3670330 3725693 3783855 3845354 3909832 3976436 4044992 4116435 4191419
58269 4191419 4268963 4347484 4426930 4508848 4594337 4682929 4773763 4867063 4964100 5066080 5173142
58258 5173142 5284125 5397460 5512705 5630989 5753777 5881773 6015448 6155805 6303718
58249 6303718 6459092 6621526 6791205 6968332 7152421 7343298 7542236 7751098 7971141
58240G971141K32625K47697K64848K82005K98855L18100L41857L68921L97232
58231A0723281M27093M60012M96190N35204N77817O25334O78408P38037Q06379
58222A6067755Q85218R75287J078587J199579J342675J510993J710064J951338
58214B6721496K249890K619466L070078L606673M227348M926093N702417O568824
58206E9692285P546625Q653573R894893J1262824J2740662J4302248J5898599
58199A39991709J7438489J8792473J9840346K0525444K0845349K0771147K0189134
58192B78394091J8956424J7033544J4560880J1806741R050157O503708M306637
58185C60612182K545607J265497M71207J31311J80718N15016R78633J355521J367920
$$ plain form
58240 7971141 8203766 8451463 8716311 8998316 9297171 9615271 9957128 10326049 10723281
58231 10723281 11150374 11610386 12106576 12641780 13219597 13844931 14523339 15261376 16067755
58222 16067755 16952973 17928260 19006847 20206426 21549101 23060094 24770158 26721496
58214 26721496 28971386 31590852 34660930 38267603 42494951 47421044 53123461 59692285
58206 59692285 67238910 75892483 85787376 97050200 109790862 124093110 139991709
58199 139991709 157430198 176222671 196063017 216588461 237433810 258204957 278394091
58192 278394091 297350515 314384059 328944939 340751680 349801837 356305545 360612182
58185 360612182 363157789 364423286 364894493 365025804 365206522 365721538 366700171 368055692 369423612
58176C69423612O84816j045349m100215q508815j3875729j9374963k4016144k7055157
58168B72132056k8261649k7871520k6330938k4071827k1437175j8695537j6051635
58161A09411775j3639275j1525096r726491q227787o992852n979244n148408m466265
58153D3706357l901415l427910l027583k687120k395241k143976j928797j744788
58145B2449527j585017j443977j319420j209185j109243j016583r31057q52713
58137A2982332p80068p12401o50864n95669n44831m97133m53716m15489l81694
58128G950467l52185l28033l08515k90668k73361k58551k46763k34718k19876
58119E437797k04094j90161j77722j65495j54736j47017j40714j33250j25353
$$ plain form
58176 369423612 370108428 369063079 364962864 356454049 342578320 323203357 299187213 272132056
58168 272132056 243870407 215998887 189667949 165596122 144158947 125463410 109411775
58161 109411775 95772500 84247404 74520913 66293126 59300274 53321030 48172622 43706357
58153 43706357 39804942 36377032 33349449 30662329 28267088 26123112 24194315 22449527
58145 22449527 20864510 19420533 18101113 16891928 15782685 14766102 13835045 12982332
58137 12982332 12202264 11489863 10838999 10243330 9698499 9201366 8747650 8332161 7950467
58128 7950467 7598282 7270249 6961734 6671066 6397705 6139154 5892391 5657673 5437797
58119 5437797 5233703 5043542 4865820 4700325 4545589 4398572 4257858 4124608 3999255
58110C999255j19641j16090j12148j06768j01333r6896r3070q9588q6590q3421
58100B993710p9137p4333p0655o8420o6195o2832n8744n5120n2759n1491n0100
58089B303924m7304m3444m0451l9506l9668l9429l8387l6648l3994l0910k8961
58078A885222k8742k8701k7475k6056k5947k6506k6148k5181k5090k5666k5074
58067A594636k2739k0254j9255j9843k1095k1929k1608k0474j9859k0386k0984
58056A366210k0571j9653j8917j7549j4901j2692j3033j4815j4828j2471j0642
58045A196138j1397j3290j4038j3661j3513j3851j3862j3143j1894j0333q906
58034A058250q353q833r489r590r416r444r331q484p106n912n196m880n107o024
$$ plain form
58110 3999255 3879614 3763524 3651376 3544608 3443275 3346379 3253309 3163721 3077131 2993710
58100 2993710 2914573 2840240 2769585 2701165 2634970 2572138 2513394 2458274 2405515 2354024 2303924
58089 2303924 2256620 2213176 2172725 2133219 2093551 2054122 2015735 1979087 1945093 1914183 1885222
58078 1885222 1856480 1827779 1800304 1774248 1748301 1721795 1695647 1670466 1645376 1619710 1594636
58067 1594636 1571897 1551643 1532388 1512545 1491450 1469521 1447913 1427439 1407580 1387194 1366210
58056 1366210 1345639 1325986 1307069 1289520 1274619 1261927 1248894 1234079 1219251 1206780 1196138
58045 1196138 1184741 1171451 1157413 1143752 1130239 1116388 1102526 1089383 1077489 1067156 1058250
58034 1058250 1049897 1041064 1031575 1021985 1012569 1003125 993794 985310 978204 972292 967096 962216 957109 951085
58020I51085p171p712p438o979o937p114o865o043n228m950m932m395l009j215
58006H71097L78J471J985K052K137K570K906K490J800K197L852N052M394K692
57992I07073J604J236M83p35j212m83K32m72k571m790n801n180l723k787k905
57977H79969l262l141l255m716o895p665o012l371j908k212l122l327k680k174
57963H26229k805m374n519n121l467j726o48k43l64q71j404j520j010K26K139
57948G99522L933M257K768R04J90L85L52O5K80O57Oj481k033q46P00J082P42J058
57930H12541K112K567J507m79k027k417k195k446l475m468m696m539m738n140
57916G82107n016m352l908m114m829n979p479q742r330r892j1270j2771j2756
$$ plain form
58020 951085 943914 936202 928764 921785 914848 907734 900869 894826 889598 884648 879716 875321 872312 871097
58006 871097 871475 872946 874931 876983 879120 881690 884596 887086 888886 891083 894935 899987 904381 907073
57992 907073 908677 909913 910396 909661 908449 907966 908198 907726 905155 900365 894564 889384 885661 882874 879969
57977 879969 876707 873566 870311 865595 858700 851035 845023 841652 839744 837532 834410 831083 828403 826229
57963 826229 823424 819050 813531 808410 804943 803217 802569 802326 801962 801091 799687 798167 797157 797383 799522
57948 799522 803455 807712 810480 811384 811574 811959 812311 812376 812656 813313 813319 811838 809805 808959 809659 810741 811483 812541
57930 812541 814653 817220 818727 818248 816221 813804 811609 809163 805688 801220 796524 791985 787247 782107
57916 782107 777091 772739 768831 764717 759888 753909 746430 737688 728358 718466 707196 694425 681669
57903F81669j1006r031p852o946n773m695l874k797j653j598k647k921j209J087
57889F20754J995J776J923K401J860K10r31n03P73J681J805J362P90P72J783L288
57873F41739M007L219J254j120l090l775k823j330j240l372o478q508q363o294
57859F03826l362q83J21l27j057q74K17J118J055O00J073K901M962N841N446M878
57843F25535M776M657M088L572L621L663K866J622J108J516J804J342P88P67O44
57828F62369n50k413l265k060L03J733Q13k121n440p562p970p176o067n280n054
57813F10260n322n877o497p012p288p284p176p294p684p915p583p025p140q353
57799E10810j0004j0999j0946j0352r770r103p906o163m404l187k698k838l325
$$ plain form
57903 681669 670663 661632 653780 646834 641061 636366 632492 629695 628042 626444 623797 620876 619667 620754
57889 620754 622749 624525 626448 628849 630709 630919 629988 629485 630258 631939 633744 635106 635896 636668 638451 641739
57873 641739 645746 648965 650219 649099 646009 642234 639411 638081 636841 633469 626991 618483 610120 603826
57859 603826 600464 599581 599702 599375 598318 597444 597661 598779 599834 600434 601507 604408 609370 615211 620657 625535
57843 625535 630311 634968 639056 642628 646249 649912 652778 654400 655508 657024 658828 660170 660958 661725 662369
57828 662369 661819 659406 656141 654081 654384 656117 656930 654809 649369 641807 633837 626661 620594 615314 610260
57813 610260 604938 599061 592564 585552 578264 570980 563804 556510 548826 540911 533328 526303 519163 510810
57799 510810 500806 489807 478861 468509 458739 449636 441730 435567 431163 427976 425278 422440 419115
57786D19115l663l318k163n47J123K583L437L279K434K105L113M761N590N045
57772D42894L780K541J539R57J168K103L127L776M059L814K621P69m96m35N3m54
57756D71816k059l619m393m623m676m513m321m700n774o680o465n190l711k686
57742D08406k282k501l133l378k425o74K24q08k824l880l259j942r51k73L11L89
57726C81000l68j277j415r59r73j902k986l212k346j102n77j306k466k405m81
57711C57225J997L299L135K261R79o55j669r15R39J816R54k71o88q88j629k207
57695C63683j620k60Q10J497K436L756N138O549Q023R231J0145J1403J3217J4772
57681D48780J5812J7755K1652K5809K7454K6439K5205K4886K3729K0209J5728
$$ plain form
57786 419115 415452 412134 409971 409424 410547 413130 416567 419846 422280 424385 427498 432259 437849 442894
57772 442894 446674 449215 450754 451711 452879 454982 458109 461885 465944 469758 472379 473148 472652 472217 472270 471816
57756 471816 469757 466138 461745 457122 452446 447933 443612 438912 433138 426458 419993 414803 411092 408406
57742 408406 406124 403623 400490 397112 394687 394013 394237 393429 390605 386725 383466 381524 380573 380300 380611 381000
57726 381000 380632 379355 377940 376981 376008 374106 371120 367908 365562 364460 363883 362577 360111 357706 357225
57711 357225 359222 362521 365656 367917 368896 368241 366572 365657 366596 368412 369366 369095 368407 367519 365890 363683
57695 363683 362063 361803 362613 364110 366546 370302 375440 381989 390012 399243 409388 420791 434008 448780
57681 448780 464592 482347 503999 529808 557262 583701 608906 633792 657521 677730 693458
57670F93458J2626J0843Q405M780J923J673L416M978N069M012K537R75l29q58
57656G53508j043k820p957j5902k4225l1120l6411m0012m1057l9337l6249l3073
57644D44302k9331k4052j7861j2297p832m210k209k990n610p188o231m199l088
57631C17204k902k609k207k497l441m072l744k591j006M57R97K33j113j981k290
57616B88438k713l217k848j290K60N20j47l71J19Q1j252k805l079k279j919k617
57600B64881l327k913j449K81J625K112J594P75N64N55o74l044m335l229j621
57585B51795k014l781m186k611j281j534j885o85J175J598J15j838k834k630j985
57570B27419j883k553k972j947Q7J223L69j527k837k876j834k23R33M17j705l603
$$ plain form
57670 693458 706084 716927 725332 730112 732035 733708 737124 742102 747171 751183 753720 754695 754366 753508
57656 753508 752465 749645 741688 725786 701561 670441 634030 594018 552961 513624 477375 444302
57644 444302 414971 390919 373058 360761 352929 348719 346510 343520 337910 330722 324491 320292 317204
57631 317204 314302 311693 309486 306989 303548 299476 295732 293141 292135 292592 293589 293822 292709 290728 288438
57616 288438 285725 282508 279660 278370 278630 279150 279003 278632 278751 278832 277580 274775 271696 269417 267498 264881
57600 264881 261554 258641 257192 257473 259098 261210 262804 263579 264143 264698 264024 260980 256645 253416 251795
57585 251795 249781 246000 241814 239203 237922 236388 234503 233818 234993 236591 236706 234868 232034 229404 227419
57570 227419 225536 222983 220011 218064 218151 219374 219743 218216 215379 212503 210669 210446 211379 211796 210091 206488
57554B06488l517j601O20J929K021J165M6o01p93j177j743j513j61R85M71j449
57538B01170l309m126l765k334k29J721L005L916M666M657L537K228J873K329
57524B15339K672K662K597K282J397M49J79L21J85N4P11J834K209J485L60p12
57508B34024j633j703k95J389J082j520m031m342k828r65O05J563J060j043l013
57493B18350k936j256k34j109k911m045l962l156k358k071k304k537k247j460
57479A85764o50k00k39p69j561k064j812q73K50R95R23Pj034j120L4J505K345
57462A81501K611K729K447J351J6m72j64k54j173j760r67N45J317J005M25J14
57446A89271j40m24l98o8K5k65l32J55O06M99L28P31J180O40p15j552j228n32
$$ plain form
57554 206488 202971 201370 201990 203919 205940 207105 207151 206550 205757 204580 202837 201324 201163 202148 202619 201170
57538 201170 197861 193735 189970 187636 187407 189128 192133 196049 200715 205372 208909 211137 213010 215339
57524 215339 218011 220673 223270 225552 226949 227398 227577 227898 228083 228137 228848 230682 232891 234376 234736 234024
57508 234024 232391 230688 230393 231782 232864 231344 227313 222971 220143 219178 219783 221346 222406 221363 218350
57493 218350 215414 214158 213924 212815 209904 205859 201897 198741 196383 194312 192008 189471 187224 185764
57479 185764 185114 184914 184675 183906 182345 180281 178469 177596 177846 178841 179764 179771 178737 177617 177651 179156 181501
57462 181501 184112 186841 189288 190639 190655 190183 190019 189765 188592 186832 185865 186410 187727 188732 189157 189271
57446 189271 189131 188707 188309 188241 188266 188001 187669 187824 188430 188929 189257 189988 191168 191808 191093 189541 188313 187781
57428A87781l05l72k36pK0m6j32n33j186j261l11Q08J008M34oq4k00l01n0J36
57408A85157n19j770k464k133j379n97N22J857K517K135J483J233J003K05r67
57393A86283k041k898l284k548o38J336K274K236J880J476J191J404J802J031
57379A89504j480l988m101j687J138K615K617J570k00j820k103j096k73n50j107
57364A79039q32R7Q15J081J107P57qm61Q1J033J199N27J89P70J422J185M02Q0
57346A88483M58R05J104J541K609L745L808K331K7j875k626k255j201M9R61J052
57330A99116K46q89j571j565j353j490j853j816j092j41M51O97J032J536J803
57315A93111J637J393J290Q34n02k292l451l566l344l516l831l602k885k491k841
$$ plain form
57428 187781 187476 187104 186868 186861 186881 186835 186703 186170 184984 183723 183412 184220 185228 185662 185656 185572 185372 185071 185021 185157
57408 185157 184638 182868 180404 178271 176892 176295 176817 178674 181191 183326 184809 186042 187045 187250 186283
57393 186283 184242 181344 178060 175512 174874 176210 178484 180720 182600 184076 185267 186671 188473 189504
57379 189504 188024 184036 179935 178248 179386 182001 184618 186188 185988 184168 182065 180969 180696 180146 179039
57364 179039 178207 178304 179119 180200 181307 182064 182056 181595 181676 182709 183908 184435 184624 185394 186816 188001 188403 188483
57346 188483 188941 189846 190950 192491 195100 198845 202653 204984 205011 203136 200510 198255 197054 197103 198064 199116
57330 199116 199362 198473 196902 195337 193984 192494 190641 188825 187733 187592 188043 188740 189772 191308 193111
57315 193111 194748 196141 197431 198265 197763 195471 192020 188454 185110 181594 177763 174161 171276 168785 165944
57300A65944l341l166k395j980k555l672m415m642n133o360p550p454o012m613
57286A02656m502n312n683n024l979l193k383j072L03Q47O30Q30K149L735M215
57271H4217L451K579K489K949L327L513L843M482N290N973O121N427M153L140
57257A40954L017L582M282M928N569N937N611M680L698K972K324J602R70O39P00
57242A91465J357K768M439N236M355K147r9j080l01J467K578J932K16q57o96l77
57226B14550o98p02P71K921L750K877K058K575L450L029J431L45Q15K177L072
57211B42421K787J519j4j027j104l76P91K139L365L922L561K946L218M734O715
57196B75597Q245R165R796J0315J0808J1557J2635J3435J3217J2160J1312J1215
$$ plain form
57300 165944 162603 159437 157042 155062 152507 148835 144420 139778 134645 128285 120735 113281 107269 102656
57286 102656 98154 92842 87159 82135 78156 74963 72580 71508 71811 72658 73288 74118 76267 80002 84217
57271 84217 87668 90247 92736 95685 99012 102525 106368 110850 116140 122113 128234 133661 137814 140954
57257 140954 143971 147553 151835 156763 162332 168269 173880 178560 182258 185230 187554 189156 190126 190765 191465
57242 191465 192822 195590 200029 205265 209620 211767 211668 210588 210287 211754 214332 216264 216480 215623 214927 214550
57226 214550 213852 213150 213921 216842 220592 223469 225527 228102 231552 234581 236012 236357 237172 239349 242421
57211 242421 245208 246727 246713 245686 244582 244206 244997 247136 250501 254423 257984 260930 264148 268882 275597
57196 275597 283842 293007 302803 313118 323926 335483 348118 361553 374770 386930 398242 409457
57184D09457J1131J0124Q601Q072R266J1161J2253J2373J2615J3612J4642J4774
57172E48081J4258J4311J5655J7786J9499J9895J8947J7460J6360J5788J4990
57161G33030J3448J1796J1070J1273J1437J0962J0167R377Q478P697P809Q908
57149H55452R753R297Q274Q236R376J0342J0145R168Q218P480O812O238N747N099
57135I69637M152L038J913R67O71J315K175J908J69j849k883k882k415j681q54
57120I73381p38j973l816m569l211J90N460J3013K3673L8848O1046R3145J36140
57107A330589J87194K39224K81693L02273K90277K41114J58472N1457p2181k12577
57097B797535l80174n92697q68490b63902j650349k148251k679254l173990l530764
$$ plain form
57184 409457 420588 430712 439313 447385 456651 467812 480065 492438 505053 518665 533307 548081
57172 548081 562339 576650 592305 610091 629590 649485 668432 685892 702252 718040 733030
57161 733030 746478 758274 769344 780617 792054 803016 813183 822560 831038 838735 846544 855452
57149 855452 865205 874502 882776 891012 900388 910730 920875 930043 938261 945741 952553 958791 964538 969637
57135 969637 973789 976827 978740 979707 980378 981693 983868 985776 985945 984096 981213 978331 975916 974235 973381
57120 973381 972643 970670 966854 962285 959074 959264 964724 977737 1001410 1040258 1101304 1194449 1330589
57107 1330589 1517783 1757007 2038700 2340973 2631250 2872364 3030836 3082293 3010112 2797535
57097 2797535 2417361 1824664 956174 -263902 -1914251 -4062502 -6741756 -9915746 -13446510
57088a3446510l645496l460488l000878k371013j712442j151997p67350n75932
57080c0132106n37870n67579n57531m14324r3790L84261R50712J521167K027341
57071b7419719K428201K700995K829158K803943K638668K377327K082641J809544
57063g749242J584751J405981J256186J118671R84439e47157A77081O04430M95059
57054A276570L97675L13333K42039J82092J30809Q6213M7640J4637j4140m0363
57044B636505o4674q6582j05889j23350j39338j52174j58886j57992j50965j40631
57034A356024j28790j16033j03171r1556q1761p3009o4385n6098m9113m3839l9622
57023E08647l5332l0350k5081k0532j7088j3832r543m232R15M855O798M960k982
$$ plain form
57088 -13446510 -17092006 -20552494 -23553372 -25924385 -27636827 -28788824 -29556174 -30132106
57080 -30132106 -30669976 -31237555 -31795086 -32209410 -32303200 -31918939 -30968227 -29447060 -27419719
57071 -27419719 -24991518 -22290523 -19461365 -16657422 -14018754 -11641427 -9558786 -7749242
57063 -7749242 -6164491 -4758510 -3502324 -2383653 -1399214 -547157 177081 781511 1276570
57054 1276570 1674245 1987578 2229617 2411709 2542518 2628731 2676371 2691008 2676868 2636505
57044 2636505 2571831 2485249 2379360 2256010 2116672 1964498 1805612 1647620 1496655 1356024
57034 1356024 1227234 1111201 1008030 916474 834713 761704 697319 641221 592108 548269 508647
57023 508647 473315 442965 417884 397352 380264 366432 356889 352657 353572 358427 365225 370185 367203
57010C67203j6795l1915m2366m5526m3217l8628l3551k8556k4091k0508j7628
56999B4422I370c140r759o597l389r03N92J483J837J210j18o55M36J695Q71k007
56983a8444m360m071j736N22J655K239L030L861M059L399K440K060b609A390M683
56968F073L899J998M11M30K089M201N513N801N889O498P249P058N615M044L768
56953G0536M822N866N936N628O149P611Q986R571R690R563Q333N128Q00k271k461
56938A53887m44J718K524J822L13r99j131K77K406L767L573K484J813K234L403
56923A77647M692N893O984P430O202K811j858o182r232j1227j2558j3060j2572
56910A44970j1474r973p383l133J776N392P016P796Q916J0273J1427J2750J4581
$$ plain form
57010 367203 350408 318493 276127 230601 187384 148756 115205 86649 62558 42050 24422
56999 24422 9370 -3140 -12899 -19496 -22885 -23788 -23196 -21713 -19876 -18666 -18784 -19439 -19003 -17308 -16437 -18444
56983 -18444 -22804 -26875 -28611 -28089 -26434 -24195 -21165 -17304 -13245 -9846 -7406 -5346 -2609 1390 6073
56968 6073 9972 11970 12381 12811 14900 19101 24614 30415 36304 42802 50051 57109 62724 66768 70536
56953 70536 75358 81224 87160 92788 98937 106548 115534 125105 134795 144358 152691 157819 158619 156348 153887
56938 153887 153443 155161 157685 159507 159820 158821 157690 157967 160373 164140 167713 170197 172010 174244 177647
56923 177647 182339 188232 195216 202646 208848 211659 209801 203619 194387 183160 170602 157542 144970
56910 144970 133496 123523 116140 113007 114783 120175 127191 134987 143903 154176 165603 178353 192934
56897A92934J6048J5936J4431J2881J1970J1191J0093Q904P604N494K386n03j677
56884C07692r66O23K369M394O894R498J1617J3002J3726J3854J3415J2659J2080
56871D20857J2039J2383J2619J2569J2610J3076J3595J3513J2802J2033J1395
56860E59491J0443R119Q345Q982J0557J1818J2464J3582J6189J9939K3601K6358
56848G30888K8111K8731K7726K4933K1218J7960J5811J4319J2917J1880J1826
56837I46320J2541J2902J2049J0140P872N812M440M240N240O846Q609J0749J3383
56824A061143J5681J6554J5910J4163J0591L533p056j8179k6013k9205k9180k7546
56812A000396k4482j9984j5376j2367j0952r468o936m349l151l147k798j127J515
$$ plain form
56897 192934 208982 224918 239349 252230 264200 275391 285484 294388 301992 307486 309872 309369 307692
56884 307692 306726 307349 309718 314112 321006 330504 342121 355123 368849 382703 396118 408777 420857
56871 420857 432896 445279 457898 470467 483077 496153 509748 523261 536063 548096 559491
56860 559491 569934 579053 587398 596380 606937 618755 631219 644801 660990 680929 704530 730888
56848 730888 758999 787730 815456 840389 861607 879567 895378 909697 922614 934494 946320
56837 946320 958861 971763 983812 993952 1001824 1007636 1012076 1016316 1021556 1028402 1037011 1047760 1061143
56824 1061143 1076824 1093378 1109288 1123451 1134042 1137575 1130519 1112340 1086327 1057122 1027942 1000396
56812 1000396 975914 955930 940554 928187 917235 907767 900831 896482 893331 890184 887386 886259 887774
56799H87774M322O545P142N189J102l627q559j4953k3141l0314l2860l0724k7646
56786G40250k6626k6830k5792k3158k0672j9241j7782j5127j1699q763o820n483
56774E32257m477l976m000m082l998m558p101j1910j7526k2071k5091k7392k9198
56761C66877k9375k6999k2974j9290j7045j5838j4867j3697j2074r898p759o723
56749A70338p072p665p061n029k670j313j496k666l450k654n19J129O85j409l055
56734A26093k743q67J074J922J321l71k164k906k225p91N79J638K311K326J851
56719A27048J828K721L410K462L35r40k99J308K578L273L482K768J102l73o26
56704A50077j90k14o10l14Q47J799J789J375J497K256K846K366P28r49j201J02
$$ plain form
56799 887774 892096 898641 905783 910972 912074 908447 899888 884935 861794 831480 798620 767896 740250
56786 740250 713624 686794 661002 637844 617172 597931 580149 565022 553323 544560 537740 532257
56774 532257 527780 523804 519804 515722 511724 507166 500065 488155 470629 448558 423467 396075 366877
56761 366877 337502 310503 287529 268239 251194 235356 220489 206792 194718 184820 177061 170338
56749 170338 163266 155601 148540 143511 140841 139528 138032 135366 131916 129262 128743 129872 130557 129148 126093
56734 126093 123350 122483 123557 125479 126800 126429 124265 121359 119134 118343 118922 120560 122871 125197 127048
56719 127048 128876 131597 135007 137469 137804 136864 136565 137873 140451 143724 147206 149974 151076 150703 150077
56704 150077 149887 149673 149063 148749 149596 151395 153184 154559 156056 158312 161158 163524 164252 163303 162102 162204
56688A62204J420J428O54L14K76m58j725k291j907j593j607r15O62J498M22j420
56672A56962k180j671q30J90J876L829M848M447L119J379m94j908k307k007j691
56657A63562j185K17K134L052K269Q74K38L42K77j67k91K66Q97R42Q90J937M285
56640A80539O310O058L523P68k94M00J706K696K941K225Q36k67m08L8M71J118
56624B08660K395L695L957L190K376J874J043l54j432j272p8J035R82n47k671
56609B22853l694k582j36J934K880L110K829J802M94Q8R05J848J951J519J257
56594B37058J308J717K745L955L999K357N18K80J390K006J227%m22Q0P39Q32R1
56577B59880j223k381k566j471M94K411L369L089K304K188L209M743N860O139
$$ plain form
56688 162204 163624 165052 165706 166020 166296 165838 164113 161822 159915 158322 156715 155800 156462 157960 158382 156962
56672 156962 154782 153111 152281 152471 154347 158176 163024 167471 170590 171969 171475 169567 167260 165253 163562
56657 163562 162377 162594 164728 167780 170049 170923 171161 171503 171780 171613 171322 171588 172485 173427 174317 176254 180539
56640 180539 186849 192907 196430 197198 196904 197304 199010 201706 204647 206872 207708 207441 207033 207071 207542 208660
56624 208660 211055 214750 218707 221897 224273 226147 227190 226836 225404 224132 224054 225089 226071 225524 222853
56609 222853 219159 216577 216441 218375 221255 224365 227194 228996 229490 229578 230483 232331 234282 235801 237058
56594 237058 238366 240083 242828 246783 250782 253139 253657 253937 255327 257333 258560 258560 258138 258218 258957 259789 259880
56577 259880 258657 256276 253710 252239 252733 255144 258513 261602 263906 266094 269303 274046 279906 286045
56563B86045N644M742M074M141M623M782M686N144O075O114M630L025K965M092
56549C50782M754M342L573K892K075J253R02Q32L55m62r88j386k398l613l607
56534C59306k306j552k418l461k962j668j543k497k402m48J361R19j038j991r94
56519C36306L00J03j263k297k608l069l913m145l269k355k465l046l022k683k977
56504B99597l547l195k035j264p61P94K927K897l53l867m257k054l54l95r03j057
56488B82173j306j338QK217K879R85j483k359j836j012L25K574M368L808J227
56473B91230j049j557q21J71J184K193K877K953K325R25q34j719q90O85J174K88
56457B99135m96k08N04R32J506K551L193K586J465J169J671J739P82n17j318j431
$$ plain form
56563 286045 291689 296431 300505 304646 309269 314051 318737 323881 329956 336070 340700 343725 346690 350782
56549 350782 355536 359878 363451 366343 368418 369671 370573 371405 371760 371298 370310 368924 366526 362913 359306
56534 359306 357000 355448 353030 349569 346607 344939 343396 340899 338497 338049 339410 340329 339291 337300 336306
56519 336306 336606 336709 335446 333149 330541 327472 323559 319414 316145 313790 311325 308279 305257 302574 299597
56504 299597 296050 292855 290820 289556 288795 289589 292516 295413 295060 291193 286936 284882 284528 284133 283230 282173
56488 282173 280867 279529 279537 281754 284633 285618 284135 281776 279940 278928 279253 281827 286195 290003 291230
56473 291230 290181 288624 287803 287974 289158 291351 294228 297181 299506 300431 299597 297878 296988 297673 298847 299135
56457 299135 298639 298431 298935 299867 301373 303924 307117 309703 311168 312337 314008 315747 316529 316012 314694 313263
56441C13263j075n63k74k34J44J255K401K517J694J097J258J415R37M26Q00J888
56425C26949K695K732K375K041J608Q49N1r5P09J788J988R92j28j08R61J821J742
56408C48970J280J201J412J501J517J536R74p05k819l942l642k948k838l003k499
56393C35995j085O44K088K987L130K413J289O82J022J663J620Q63M96J446L194
56378C58447M157L345J400j95o83m93k37K12J320K898M062M179L423K358J489
56363C85682J376K428M023M402K462n10j866n94J659K854K799K532K473K305K097
56348D14122K227K301J413j81q48L54K163K556J283J37O77K378L369K610Q55m39
56332D34977n71L01J867L700M777M130K278R59R09R84K73k4J629M294N391M168
$$ plain form
56441 313263 312188 311625 311351 311117 311261 312516 314917 317434 319128 320225 321483 322898 323835 324261 325061 326949
56425 326949 329644 332376 334751 336792 338400 339249 339300 339205 339914 341702 343690 344682 344554 344446 345407 347228 348970
56408 348970 350250 351451 352863 354364 355881 357417 358391 357686 354867 350925 347283 344335 341497 338494 335995
56393 335995 334910 335554 337642 340629 343759 346172 347461 348143 349165 350828 352448 353311 353807 355253 358447
56378 358447 362604 365949 367349 367154 366471 365978 365741 365953 367273 370171 374233 378412 381835 384193 385682
56363 385682 387058 389486 393509 397911 400373 399863 397997 397403 399062 401916 404715 407247 409720 412025 414122
56348 414122 416349 418650 420063 419882 419034 419388 421551 424107 425390 425527 426204 428582 431951 434561 435416 434977
56332 434977 434406 434707 436574 440274 445051 449181 451459 452418 453327 454311 454584 454560 456189 460483 465874 470042
56316D70042K495J903J791J210P37J302K464L140L287L511L629K885J418L67N42
56301E00723J705L044L700L173J863J028J504K681L373L385L422L752L803L072
56287E40228J678P2j130j102N93L164N055N440M924M660N216O381P569Q229Q168
56272E99145P702P431P788Q696R433R047P477O281P410J0844J4379J6242J6974
56259G28849J7936J9028J9286J9072J9897K2170K4604K6132K7081K8056K8845
56248I80956K8958K8393K7404K6196K5297K5402K6422K7216K6753K5071K2886
56237A270954K0767J8900J7164J5118J2372R037N461J803j608l842m483m976p397
56224A349270j1663j5429j7345j8904k2011k6007k8572k8832k8054k7545k7199
$$ plain form
56316 470042 472537 474440 476231 477441 478178 479480 481944 485084 488371 491882 495511 498396 499814 500181 500723
56301 500723 502428 505472 509172 512345 514208 515236 516740 519421 522794 526179 529601 533353 537156 540228
56287 540228 541906 541978 540848 539746 540339 543503 548558 553998 558922 563582 568798 575179 582748 590977 599145
56272 599145 606847 614278 622066 630762 640195 649242 656719 663000 670410 681254 695633 711875 728849
56259 728849 746785 765813 785099 804171 824068 846238 870842 896974 924055 952111 980956
56248 980956 1009914 1038307 1065711 1091907 1117204 1142606 1169028 1196244 1222997 1248068 1270954
56237 1270954 1291721 1310621 1327785 1342903 1355275 1364312 1369773 1371576 1369968 1366126 1361643 1356667 1349270
56224 1349270 1337607 1322178 1304833 1285929 1263918 1237911 1209339 1180507 1152453 1124908 1097709
56213A097709k6246k4505k2478k0763j9542j8493j7308j6329j6142j6269j5132
56202H84502j1932p969n292m496m650m865m834m209k632n07J220K170K666K783
56188H41955K277J534J598K809M235M885M732M177L356K643L000M818O803P072
56174H95894N390L555L383M974P145Q940J0213J1031J1170J0418R208Q677R791
56161I99789J2340J4941J6367J6840J7763K0168K3653K6971K9347L1038L2868
56150A242085L5489L9007M3114M7577N2680N8957O6333P3875Q0613Q6414R1670
56139A917814R6444J00451J03687J06408J08529J09746J10317J10966J11785J11954
56129B988101J10826J08702J06168J03327J00113R6608R2445Q6495P7880O6842
$$ plain form
56213 1097709 1071463 1046958 1024480 1003717 984175 965682 948374 932045 915903 899634 884502
56202 884502 872570 864601 859309 854813 850163 845298 840464 836255 833623 833116 834336 836506 839172 841955
56188 841955 844232 845766 847364 850173 854408 859293 864025 868202 871558 874201 877201 882019 888822 895894
56174 895894 901284 904839 908222 913196 920341 929281 939494 950525 961695 972113 981321 989998 999789
56161 999789 1012129 1027070 1043437 1060277 1078040 1098208 1121861 1148832 1178179 1209217 1242085
56150 1242085 1277574 1316581 1359695 1407272 1459952 1518909 1585242 1659117 1739730 1826144 1917814
56139 1917814 2014258 2114709 2218396 2324804 2433333 2543079 2653396 2764362 2876147 2988101
56129 2988101 3098927 3207629 3313797 3417124 3517237 3613845 3706290 3792785 3870665 3937507
56119C937507N3986L9325K2883N866r772k2877l3571m2475n0257n7695o5357p3195
56107C704368q0949q8474r4980r8614r8242r5496r3680r4414r6505r8280r9534
56096B665200j00556j00474r7699r1434q2137p1038n9750m9702m1110l2892k4210
56085A914198j5849r468n783m013k907j656J42K768O120R394J1527J2328J2990
56072A929791J4918J8035K0795K2144K2681K3407K4116K3874K2660K1504K1283
56061B165208K2261K4400K7112K9045K9334K8911K9396L0936L2383L3439L4964
56050B487389L7065L8621L9170L9782M1305M3171M4645M5925M7156M7517M6453
56039B958199M5000M4838M6496M9120N1606N3562N5646N9047O3846O7999O9258
$$ plain form
56119 3937507 3991493 4030818 4053701 4059567 4049795 4026918 3993347 3950872 3900615 3842920 3777563 3704368
56107 3704368 3623419 3534945 3439965 3341351 3243109 3147613 3053933 2959519 2863014 2764734 2665200
56096 2665200 2564644 2464170 2366471 2275037 2192900 2121862 2062112 2012410 1971300 1938408 1914198
56085 1914198 1898349 1888881 1883098 1879085 1876178 1874522 1874664 1877432 1883552 1892946 1904473 1916801 1929791
56072 1929791 1944709 1962744 1983539 2005683 2028364 2051771 2075887 2099761 2122421 2143925 2165208
56061 2165208 2187469 2211869 2238981 2268026 2297360 2326271 2355667 2386603 2418986 2452425 2487389
56050 2487389 2524454 2563075 2602245 2642027 2683332 2726503 2771148 2817073 2864229 2911746 2958199
56039 2958199 3003199 3048037 3094533 3143653 3195259 3248821 3304467 3363514 3427360 3495359 3564617
56028C564617O8407O9009P3218P9242Q3814Q5910Q7016Q8874R2194R6835J02122
56017D491258J07392J12752J18640J24459J28930J32309J36783J43789J52356
56008E648668J61078J70104J79851J89368J97813K06559K17751K31307K45162
55999G447661K58206K71386K86057L02715L21613L43314L68098L95350M23994
55990A0418394M53644M85543N22099N64825O12907O64833P21414P85936Q61250
55981A6090845R48203J047474J161576J294703J452266J641483J871787K154759
55973B7663096K504433K935766L458721M072935M771537N552504O425505P407730
55965F4792227Q514775R754214J1123639J2611786J4197430J5835527J7433605
$$ plain form
56028 3564617 3633024 3702033 3775251 3854493 3938307 4024217 4111233 4200107 4292301 4389136 4491258
56017 4491258 4598650 4711402 4830042 4954501 5083431 5215740 5352523 5496312 5648668
56008 5648668 5809746 5979850 6159701 6349069 6546882 6753441 6971192 7202499 7447661
55999 7447661 7705867 7977253 8263310 8566025 8887638 9230952 9599050 9994400 10418394
55990 10418394 10872038 11357581 11879680 12444505 13057412 13722245 14443659 15229595 16090845
55981 16090845 17039048 18086522 19248098 20542801 21995067 23636550 25508337 27663096
55973 27663096 30167529 33103295 36562016 40634951 45406488 50958992 57384497 64792227
55965 64792227 73307002 83061216 94184855 106796641 120994071 136829598 154263203
55958A54263203J8849801J9938060K0607430K0826113K0560609J9732756J8268304
55951B93046276J6196322J3690193J1009141Q405168O070470M130960K652516
55944C55201046J647814J090993R33382J103428J490623J930859K204661K043066
55936C67645872J134142q53815m188574q905210j4622804k0510165k5514639k8764391
55928B65420416k9889908k9072156k6847886k3850103k0623447j7541860j4801487
55921A02793569j2462377j0509122q897035p572718o483229n583942m840130m222037
55913D2222979l703380l265009k894373k579686k308620k072972j869286j693384
55905B1836269j538557j399999j276272j165020j061783r64683q76023p97306
$$ plain form
55958 154263203 173113004 193051064 213658494 234484607 255045216 274777972 293046276
55951 293046276 309242598 322932791 333941932 342347100 348417570 352548530 355201046
55944 355201046 356848860 357939853 358873235 359976663 361467286 363398145 365602806 367645872
55936 367645872 368780014 367926199 363737625 354832415 340209611 319699446 294184807 265420416
55928 265420416 235530508 206458352 179610466 155760363 135136916 117595056 102793569
55921 102793569 90331192 79822070 70925035 63352317 56869088 51285146 46445016 42222979
55913 42222979 38519599 35254590 32360217 29780531 27471911 25398939 23529653 21836269
55905 21836269 20297712 18897713 17621441 16456421 15394638 14429955 13553932 12756626
55897A2756626p26388o61201o02471n50753n04247m61613m23786l91045l61232
55888H073890l32817l06958k84692k64781k46168k29753k15965k03206j90694
55879E798856j80185j72799j66563j59262j51341j43926j36391j28371j21862
55870D438156j18492j16532j13457j10045j08996j10514j12042j11835j10262
55861C425981j08005j05169j02195r9671r7239r4073r0189q5971q0984p4764o8386
55850B419335o3586o0376n7142n3109m9335m7006m5868m4769m2969m0529l7983
55839A876663l5954l4777l4223l3648l2463l0622k8706k7386k6610k5701k4537
55828A542036k3877k3945k3615k2172k0954k1515k2726k1889j8756j6174j6182
$$ plain form
55897 12756626 12030238 11369037 10766566 10215813 9711566 9249953 8826167 8435122 8073890
55888 8073890 7741073 7434115 7149423 6884642 6638474 6408721 6192756 5989550 5798856
55879 5798856 5618671 5445872 5279309 5120047 4968706 4824780 4688389 4560018 4438156
55870 4438156 4319664 4203132 4089675 3979630 3870634 3760120 3648078 3536243 3425981
55861 3425981 3317976 3212807 3110612 3010941 2913702 2819629 2729440 2643469 2562485 2487721 2419335
55850 2419335 2355749 2295373 2238231 2185122 2135787 2088781 2042913 1998144 1955175 1914646 1876663
55839 1876663 1840709 1805932 1771709 1738061 1705598 1674976 1646270 1618884 1592274 1566573 1542036
55828 1542036 1518159 1494214 1470599 1448427 1427473 1405958 1383232 1361343 1342587 1326413 1310231
55817A310231j7508j7778j6457j4571j2963j2006j1810j1781j0964r420q203p510
55805A159260o360m606l531l644l611k521j557k051l250l549k805k037j755j872
55791A116111k511l667m774n543o445p607q245p984p635p882q310q654r562j1192
55777A016100j2466j2821j3252j4383j5198j5071j5425j7417j9470j9191j6715
55766H44691j4080j2229j0757r764r736r983r376q395q490r520r747q463p010
55753G17141o948q319r796r752p607m940m384o375q169p516n907o193q135q954
55739F14146p595n774m912m667m686n374o363o383n245m234m090m367m943o068
55725E39445o649m828j068J566J227m79j225r81q48p37j10R9j537m396n932m543
$$ plain form
55817 1310231 1292723 1274945 1258488 1243917 1230954 1218948 1207138 1195357 1184393 1174973 1166770 1159260
55805 1159260 1152900 1148294 1144763 1141119 1137508 1134987 1133430 1131379 1128129 1124580 1121775 1119738 1117983 1116111
55791 1116111 1113600 1109933 1105159 1099616 1093171 1085564 1077319 1069335 1061700 1053818 1045508 1036854 1027292 1016100
55777 1016100 1003634 990813 977561 963178 947980 932909 917484 900067 880597 861406 844691
55766 844691 830611 818382 807625 797861 788125 778142 768766 760371 751881 742361 732614 724151 717141
55753 717141 710193 701874 692078 682326 674719 669779 665395 659020 650851 643335 637428 631235 623100 614146
55739 614146 606551 600777 595865 591198 586512 581138 574775 568392 563147 558913 554823 550456 545513 539445
55725 539445 532796 527968 526900 528466 529693 529214 527989 527008 526160 525423 525313 525412 523875 519479 513547 509004
55709E09004j337J077R74j245l634m434l370j454Q8L42j039l173m111k965j543
55694D83180k289m771o083m994l678m419o432p353o549n339m671m119l052j723
55680D17708j006j471k669l327k681j452q82r24n25L97P55L55M89J775K906K681
55664D12129J846J693J932J445K97m21k89L02J147K121K505J863J295K367M749
55649D34981O213N232K460m96k645l548k880j032M85J69j811l704m143l599l558
55634D22124m407m842l755k061j670k890m018l773k915k828l493l910l775l622
55620C74165l704l755l662l476k888j697n98n01j110j239o95o59j781l051l295
55605C42054k856k736k782k064q73q74k817n139n804m772l726l620l619k584o86
$$ plain form
55709 509004 507667 508744 509718 508473 504839 500405 497035 495581 495669 496011 494972 491799 487688 484723 483180
55694 483180 480891 476120 470037 465043 461365 456946 450514 443161 436612 431273 426602 422483 419431 417708
55680 417708 416702 415231 412562 409235 406554 405102 404220 403296 402771 403168 403923 404278 404767 406542 409448 412129
55664 412129 413975 415668 417600 419045 419342 418921 418632 418934 420081 422202 424707 426570 427865 430232 434981
55649 434981 441194 446426 448886 448390 445745 442197 439317 438285 438770 438939 437128 433424 429281 425682 422124
55634 422124 417717 412875 409120 407059 405389 402499 398481 394708 391793 388965 385472 381562 377787 374165
55620 374165 370461 366706 363044 359568 356680 354983 354385 353884 352774 351535 350840 350181 348400 345349 342054
55605 342054 339198 336462 333680 331616 330743 329869 327052 321913 316109 311337 307611 303991 300372 297788 297102
55590B97102R41J514J104K67m32p79j117j756j986m65K853N966O905O103N628
55575C21848O338P068O553N011L405K195J374R11O44K60j54o3N52P85j55j860
55559C54712l222l765l916m093m092l584k916k947l930m929m868m043l749m276
55545C00382m329l011j394j075j989k863l146l131k694j609q48j634l161l125
55531B66373r47J292J728Q04k82j416k772l630l375k568j840p20J202K889L001
55516B59739J709L10m25n01p5M28K52o78j418j491j786k863l583k795j373q58
55500B44592r65l33Q32R25l90j650j818j319o13N02J790K288J691Q72O05P57R39
55483B48705R10K35j232k475k261j089p59j747k586k199j247n05L20J258J275
$$ plain form
55590 297102 298043 299557 300661 300928 300496 299717 298600 296844 294858 294393 297246 303212 310117 316220 321848
55575 321848 328186 335254 341807 346818 350223 352418 353792 354703 355347 355607 355453 355390 355942 356727 356572 354712
55559 354712 351490 347725 343809 339716 335624 332040 329124 326177 322247 317318 312450 308407 304658 300382
55545 300382 296053 293042 291648 290573 288584 285721 282575 279444 276750 275141 274293 272659 269498 266373
55531 266373 265426 266718 268446 269250 268968 267552 264780 261150 257775 255207 253367 252647 253849 256738 259739
55516 259739 261448 261758 261333 260832 260757 261185 261437 260759 259341 257850 256064 253201 249618 246823 245450 244592
55500 244592 243627 243294 244126 245051 244661 243011 241193 239874 239261 239763 241553 243841 245532 246404 247009 247766 248705
55483 248705 249615 249850 248618 246143 243882 242793 242034 240287 237701 235502 234255 233750 234070 235328 236603
55468B36603N6q45j87Q68N23p57j057j58K71m04p04M57J899J865N12n16m53j21
55450B37852k93m97R1J127J308L6j753k656k210r55M64J639K157J757P77j69r10
55433B37765j531j639p54M66M79j108k675k468o91J106K046K367K313J757R64
55418B38397O39R23J078N77j99p33j176j793k078j307J11P55Rq80k73J661L019
55401B38730K536J096L61N40L19j139k932l519k504r77j81j61J22J306K450J875
55385B37922o70l350m295l767l305l092j646J521M298M206J520r87j245J41J183
55370B28434R42J87R7Q64J609J464M58o40j169j042n07J70P17R90J166J482J677
55353B36899J128j88j310j274k19Q14R98K53r84k043k265j491l35L99O46R98J694
$$ plain form
55468 236603 236659 235814 235627 236495 237018 236261 235204 235046 235317 234913 234209 234666 236565 238430 238942 238426 237973 237852
55450 237852 237559 237062 237153 238280 239588 239624 237871 235215 233005 232050 232514 234153 236310 238067 238844 238675 237765
55433 237765 236234 234595 233841 234307 234786 233678 231003 228535 227844 228950 230996 233363 235676 237433 238397
55418 238397 239036 239959 241037 241614 241415 240682 239506 237713 235635 234328 234439 235194 235203 234323 234050 235711 238730
55401 238730 241266 242362 242723 243263 243582 242443 239511 235992 233488 232511 232330 232169 232291 233597 236047 237922
55385 237922 237252 233902 229607 225840 222535 219443 217797 219318 223616 227822 229342 228355 227110 227251 228434
55370 228434 229376 229563 229660 230524 232133 233597 234055 233415 232246 231204 230697 230867 231584 232574 233740 235222 236899
55353 236899 238027 237839 236529 235255 235036 235850 236848 237101 236117 234074 231809 230318 229983 230382 231028 232026 233720
55336B33720K069J294n47k409l235k868k029j480j374j342j131q25m76J54J230
55321B20751K366K817K164P86l85m85O71K392L517L298K031P81M61J047J688J509
55305B45409L79j063k058k324k028j452q25k89J70O17Q32L97n89j183o02O43J315
55288B37349J124R89J455J718Q64o62j571j342n40K18Q43J301J304P74J33q5K61
55271B44133Q77J312J199N06m15j193j788k284k429j853p73l8k06q01p75L19J795
55254B37586K451J708J02j334k033k039j380J04J952K776J585p00j970j341j04
55239B37363Q4p25j167n00P02J595J909J679R44J29M3Q65J540Q21j152k919l237
55222B37974k084k28J459K106J198n76j462m60J333K035J410Q73J144J179N7j294
$$ plain form
55336 233720 235789 237083 236536 234127 230892 228024 225995 224515 223141 221799 220668 219843 219367 219521 220751
55321 220751 223117 225934 228098 228884 228499 228014 228685 231077 234594 237892 239923 240704 241165 242212 243900 245409
55305 245409 245788 244725 242667 240343 238315 236863 236038 235749 235919 236536 237368 237765 237176 235993 235391 236034 237349
55288 237349 238473 239462 240917 242635 243499 242837 241266 239924 239384 239602 240445 241746 243050 243824 243957 243872 244133
55271 244133 245010 246322 247521 248027 247612 246419 244631 242347 239918 238065 237292 237254 237048 236247 235472 235791 237586
55254 237586 240037 241745 241847 240513 238480 236441 235061 235165 237117 239893 241478 240778 238808 237467 237363
55239 237363 237447 236722 235555 235055 235757 237352 239261 240940 241884 242013 242056 242921 244461 245282 244130 241211 237974
55222 237974 235890 235662 237121 239227 240425 239849 238387 237927 239260 241295 242705 243578 244722 245901 245958 244664
55206B44664j378m56k28j318k353j856o5J571K040J425M99J81R29K136K501J382
55190B49674m95k059l112l917m187l370j773l45O79J880L222L586K461J121J109
55175B44474K008J974L52j367j678j108j343k694l463k044R96L445L830K667J335
55160B47384M09l44q74p32o9K43j33m45j11K90R8j06N82J587J412n0j161q28J13
55141B47265M07J10m6K2jJ6J63j77j360k255j355R89K700K552J419O11J58n29
55123B50689j214j093j52P39J070J193J356R77m80k238k626j097Q11J173R3m77
55107B48724O60K451L127K413J423R40P34M23Q3j03j12J03O12J208J528J408Q41
55090B66463j63j247j545n81R00J646J340O32l2p10j332j703k098k708k611o58
$$ plain form
55206 244664 243286 242830 242602 241284 238931 237075 237010 238581 240621 242046 242545 242726 243655 245791 248292 249674
55190 249674 249179 247120 244008 240091 235904 232534 230761 230416 231095 232975 236197 239783 242244 243365 244474
55175 244474 246482 248456 248808 247441 245763 244655 243312 240618 237155 235111 236107 239552 243382 246049 247384
55160 247384 247793 247449 246575 245843 245774 246017 245884 245439 245328 245618 245716 245610 246192 247779 249191 249141 247980 247152 247265
55141 247265 247672 247782 247736 247758 247757 247773 247936 247759 246399 244144 242789 243778 246478 249030 250449 251060 251218 250689
55123 250689 249475 248382 248230 248969 250039 251232 252588 253565 253085 250847 248221 247124 247935 249108 249201 248724
55107 248724 249384 251835 254962 257375 258798 259738 260472 260895 260978 260875 260763 260866 261478 262686 264214 265622 266463
55090 266463 266300 265053 263508 262927 263827 265473 266813 267445 267413 266703 265371 263668 261570 258862 256251 255593
55074B55593K342L825K551J99r28o58l76p78j440j897j855q57J011K443K192Q31
55058B62198K4K24L50k09p32o37n27j024j475q02Q52K120J975P58l98q05p57r28
55040B60207j354j319l57R39J543J207N24r9q88j985k899k955k102r98m41o66
55024B48357r92l20J645L822M804M336L237K076P07p85j612j284m45r7k93j29
55008B63027R89K443K872J507r00k603k524j229K2P87J399J826J710J454J954
54993B72734K821K299j33k363k155j44J290J421J564K156J771k39k035j616L62
54978B77733J588J168Q7q39j789k584k244n58J110J472R89R84J615J796R07m08
54962B81027j254j464j206l31J272K984L704K934J277j90q47p56j70Q60K222L283
$$ plain form
55074 255593 257935 261760 264311 264510 263582 262924 262548 261770 260330 258433 256578 255721 256732 259175 261367 262198
55058 262198 262222 262446 262796 262587 261855 261218 260691 259667 258192 257390 258242 260362 262337 263095 262697 261892 261135 260207
55040 260207 258853 257534 257177 258116 259659 260866 261390 261291 260403 258418 255519 252564 250462 249464 249023 248357
55024 248357 247365 247045 248690 252512 257316 261652 264889 266965 267672 266887 265275 263991 263546 263449 263156 263027
55008 263027 264016 266459 269331 270838 269938 267335 264811 263582 263604 264391 265790 267616 269326 270780 272734
54993 272734 275555 277854 277721 275358 273203 273059 274349 275770 277334 279490 281261 281022 278987 277371 277733
54978 277733 279321 280489 280576 279737 277948 275364 273120 272562 273672 275144 276133 277117 278732 280528 281435 281027
54962 281027 279773 278309 277103 276772 278044 281028 284732 287666 288943 288753 287906 287150 286980 287840 290062 293345
54946B93345L105J422p82j986j543k42N83K93o00r66l2J806L114K758J282M79
54930C02036J246K458K546J664J392K425L754M355M567N099N621N325M343L465
54916C50296K753J640L22k29P7Q2p30j188j98J358J752Q42K6J7rr48k521l848
54898C49494m355l975l222l120m088m935m139k270j515k341k381R4L320M383L314
54883C24264K655L526M422L949K702J766J239J058J718L123L892L066J621J119
54869C60120J548J709J267J112J741K446K346J414J70j096k427l798n000n835
54855C55717o363o804p127o840n541l673k308k031k391k587k321j797j368j423
54841C03143k076k673k163m48J116J107l00j593j649p09K08M01J1l06k11j16n63
$$ plain form
54946 293345 296450 297872 297090 295104 293561 293319 293902 294195 293595 292629 292597 294403 297517 300275 301557 302036
54930 302036 303282 305740 308286 309950 311342 313767 317521 321876 326443 331542 337163 342488 346831 350296
54916 350296 353049 354689 355011 354782 354859 354941 354211 353023 352825 354183 355935 356777 356803 356820 356811 355863 353342 349494
54898 349494 345139 341164 337942 334822 330734 325799 321660 319390 317875 315534 313153 313247 316567 320950 324264
54883 324264 326919 330445 334867 338816 341518 343284 344523 345581 347299 350422 354314 357380 359001 360120
54869 360120 361668 363377 364644 365756 367497 369943 372289 373703 373873 372777 370350 366552 361552 355717
54855 355717 349354 342550 335423 328583 323042 319369 317061 315030 312639 310052 307731 305934 304566 303143
54841 303143 301067 298394 296231 295783 296899 298006 297706 296113 294464 293755 293963 294364 294375 294069 293858 293742 293179
54824B93179j269j411r62q05j168r78M66K035K142J058O16J705L262L832L113
54809C04815J702K70n96n79j54k85j129j541n44J173J928J081k77q24n58m70j052
54792C02960j733j824j353o94P1Q76J212Q37N74J364K589K636J336N07J337K667
54776C13362K929K597L103M258M585L926L839N126O681P218O836O257N729N362
54762C81808N490N851N259L028J96j451j299k41N17M62j05m58j33L91N7j493l392
54745C94487m634n146n404n506n259m819m533m420m384m604n085n015l505r44
54731C31229J270K505L463M618N164M442L546M095N621N805L690J197N03J223
54717C78371J490Q39K71J8p01j717j830j120j281k653l098j237J021J050q50k556
$$ plain form
54824 293179 291910 290499 289537 288732 287564 286586 287052 289087 291229 292287 292903 294608 297870 301702 304815
54809 304815 306517 306787 306191 305612 305458 305173 304044 302503 301959 303132 305060 306141 305864 305040 304482 304012 302960
54792 302960 301227 299403 298050 297356 297427 298303 299515 300352 300926 302290 304879 307515 308851 309358 310695 313362
54776 313362 316291 318888 321991 326249 330834 334760 338599 343725 350406 357624 364460 370717 376446 381808
54762 381808 387298 393149 398408 401436 401632 400181 398882 398641 399158 399620 399515 399057 398924 399315 399372 397879 394487
54745 394487 389853 384707 379303 373797 368538 363719 359186 354766 350382 345778 340693 335678 332173 331229
54731 331229 332499 335004 338467 343085 348249 352691 356237 360332 365953 371758 375448 376645 377148 378371
54717 378371 379861 380700 380971 380989 380288 378571 376741 375621 374340 371687 368589 367352 368373 369423 368573 366017
54701C66017l646n212o889o897n180l893m201m830m552l995l982l852k736j134
54687C05018M8R32J991K838K624J073j421l918m944l565r22P37R00J082J761J247
54671C05481j201l303k772o87L42Jm9O99J314J672K476L155K190k26j967j791
54655C05334n88M62J133J289N97l42k18R71J745J437J067J338J504J116J076J851
54639C19772K162R28p90j301o92k36k57k03k15q92j720j333M96K314K721J683
54623C22437L7j410k137j955j138p4J137K378L077K677J432R0r61j708k007j883
54607C19992j950k475k362l15K946M984M570K957J744Q67l00j189r08j34m41j828
54591C26158k553j629j33M94K56q5n04j435k512k697j661j89Q30J251J458J877
$$ plain form
54701 366017 362371 357159 350270 343373 338193 334300 330099 325269 320717 316722 312740 308888 306152 305018
54687 305018 305066 305998 307989 310827 313451 314524 313103 309185 304241 300676 299754 300491 301391 302473 304234 305481
54671 305481 304280 300977 298205 297518 297860 297861 297812 298511 299825 301497 303973 307128 309318 309092 307125 305334
54655 305334 304746 305208 306341 307630 308227 307885 307667 308638 310383 311820 312887 314225 315729 316845 317921 319772
54639 319772 321934 322862 322072 320771 320079 319843 319586 319383 319168 318276 316556 315223 315719 318033 320754 322437
54623 322437 322474 321064 318927 316972 315834 315760 316897 319275 322352 325029 326461 326551 325590 323882 321875 319992
54607 319992 318042 315567 313205 312890 315836 320820 325390 328347 330091 330958 330658 329469 328561 328427 327986 326158
54591 326158 323605 321976 321843 322337 322593 322508 322004 320569 318057 315360 313699 313510 314340 315591 317049 318926
54575C18926K724L702L862K422m4j825j837o93L41Q60J250J535J236L26m97p18
54559C31570o48p80j013r12m99j84k1M51J478K525K727J801L21p67p70L58J893
54542C37530K674K080R05Q15K472M455M657K746N79p9M06L59p79j724j214K52
54526C56134J164J047R91K008L509L871K251n87l055l942l010r99P57J191L13
54511C61643r66j808j914j155M22J972K091M31j508k061j451j120j319p14J310
54496C53853L192K934P32j053o25J181J899M44j455j359O45J960R67q01j035Q2
54480C61561O30K12L71J855L552M501N025N232M266K019m6q52j003j047j55K068
54464C88189L991L901K427J254O19j20n22J52R00J47j455j723l55O06o9j334j943
$$ plain form
54575 318926 321650 325352 329214 331636 331592 329767 327930 327237 327578 328438 329688 331223 332459 332785 332288 331570
54559 331570 330922 330142 329129 328217 327718 327534 327513 327964 329442 331967 334694 336495 336816 336049 335279 335637 337530
54542 337530 340204 342284 343189 344004 346476 350931 355588 358334 358913 358834 359240 359599 358820 357096 355882 356134
54526 356134 357298 358345 359336 361344 364853 368724 370975 370388 367333 363391 360381 359382 360139 361330 361643
54511 361643 360677 358869 356955 355800 356222 358194 360285 360716 359208 357147 355696 354576 353257 352543 353853
54496 353853 357045 359979 360711 359658 359033 360214 362113 362557 361102 359743 360388 362348 363315 362514 361479 361561
54480 361561 362191 362403 362774 364629 368181 372682 377707 382939 387205 389224 389178 388326 387323 386276 386121 388189
54464 388189 392180 396081 398508 399762 400381 400261 399739 399891 400791 400938 399483 397760 397405 398011 397942 396608 394665
54447C94665j928j566p41j6m95j931k697k264j891k072j467N14K021J440R0K75
54431C81937J802K568J873J046J039J243Q52pq33j340j332q18k21J09M86J285
54415C89689K089K213J827J614J503P14r21k537l171k610j325j97r8j073j975
54400C85742j678m79L41K31j32J6O68J378J791J685J040J72n27q79o73M06J979
54383C91081K712J714p4r06m67Ql17r18j058o82L0Q72J127M5j669k120o62J057
54365C89773J374P06L90M02j43r48p05O40J450O88o70j171r41j197k221k872k157
54348C82398o47R3o41j836j889m66J149J519M59j191k603l297l017k022j239j291
54332C65479j421m38J246J683K1k000k084j17K143L489M004L636J741j392l840
$$ plain form
54447 394665 392737 391171 390430 390414 389919 387988 385291 383027 381136 379064 377597 378111 380132 381572 381662 381937
54431 381937 383739 386307 388180 389226 390265 391508 392360 392353 391520 390180 388848 388030 387809 387918 388404 389689
54415 389689 391778 393991 395818 397432 398935 399649 398728 396191 393020 390410 389085 388888 388790 387717 385742
54400 385742 384064 383585 383926 384157 384025 384041 384709 386087 387878 389563 390603 390775 390248 389369 388696 389102 391081
54383 391081 393793 395507 395433 394527 394060 394068 393751 392833 391775 391093 391123 391995 393122 393167 391498 389378 388716 389773
54365 389773 391147 391853 392243 392645 392502 391554 390849 391489 392939 393627 392957 391786 390845 389648 387427 384555 382398
54348 382398 381751 381844 381203 379367 377478 377012 378161 379680 380139 378948 376345 373048 370031 368009 366770 365479
54332 365479 364058 363620 364866 366549 366570 364570 362486 362369 364512 368001 372005 375641 377382 375990 372150
54317C72150l848j826L23J418J798K167K547K487J701K68j293k107j510J35J544
54302C75954J641N76n60q76l48L97P48N57R9k52l19k47l81r18j533j420n2J974
54284C75040L174K566P57p41j103q34q23j217j496j351j080j121j518j988k255
54269C66010k049r92Q96K609K697R31j085j550l92J091K096K717K720J425p77
54254C76347k095j430J95J137J204J200J285J035N72L33J35l42n46O1N65k81j660
54237C77715j385P69K346J610j00n16N13J444J377N42o93j916k257j218L23R43
54221C79497K91r46k222l276l585k803j580q68n86jP12O49j40m44K25P77J61j134
54203C64727j856j594q17J0O48P77K26n69j060j350j978k933l531l295k437j250
$$ plain form
54317 372150 368302 366476 366799 368217 370015 372182 374729 377216 378917 379185 377892 375785 374275 374410 375954
54302 375954 377595 378171 377611 376735 376387 376784 377532 378089 378188 377936 377617 377370 376989 376071 374538 373118 373066 375040
54284 375040 378214 380780 381537 380796 379693 378859 378036 376819 375323 373972 372892 371771 370253 368265 366010
54269 366010 363961 362969 363865 366474 369171 370102 369017 367467 367075 368166 370262 372979 375699 377124 376347
54254 376347 374252 372822 373017 374154 375358 376558 377843 378878 379450 379783 379918 379576 379030 379091 379656 379375 377715
54237 377715 376330 377099 379445 381055 380955 380439 380952 382396 383773 384315 383622 381706 379449 378231 378554 379497
54221 379497 379788 378842 376620 373344 369759 366956 365376 364508 363922 363921 364633 365282 365142 364698 364923 365700 365861 364727
54203 364727 362871 361277 360460 360470 361118 361895 362121 361552 360492 359142 357164 354231 350700 347405 344968 343718
54187C43718L30K157L260K610N18j388j896j407j048j098r71n23m12r67j432q96
54171C40555M41J425J289L72m72q75j107j382j262k02J296J716K33j931k672j429
54155C35995L39J156J130J246J873K523K642K159J479J168J315J182N0j559k225
54140C50473j423j51O14J125J960K775K819K100J184K34r46k207l014k869j489
54125C51185R23L240M084L578L541M991O415N698L121R49M37P39P43M44K48Q3
54109C90419k82q36j562k322k465j319P23K337K714K261J751J441J176P32n8j043
54093C93667j636j464j009j021j446j665j510j238p09L77J515J709R79M77Q37
54078C87863J305Q72m72j835k262j346L28J324O14j249k819l412l242k331n45
$$ plain form
54187 343718 344048 346205 349465 352075 352593 351205 349309 347902 346854 345756 344785 344262 343850 342883 341451 340555
54171 340555 340996 342421 343710 344082 343610 342735 341628 340246 338984 338782 340078 341794 342027 340096 337424 335995
54155 335995 336334 337490 338620 339866 341739 344262 346904 349063 350542 351710 353025 354207 354257 352698 350473
54140 350473 349050 348899 349513 350638 352598 355373 358192 360292 361476 361710 360764 358557 355543 352674 351185
54125 351185 352108 355348 359432 363010 366551 371542 377957 383655 386776 387725 388162 388901 389644 390088 390336 390419
54109 390419 390137 389301 387739 385417 382952 381633 382356 384693 387407 389668 391419 392860 394036 394768 394710 393667
54093 393667 392031 390567 389558 388537 387091 385426 383916 382678 381969 382346 383861 385570 386549 387026 387863
54078 387863 389168 390040 389568 387733 385471 384125 384453 385777 386391 385142 382323 378911 375669 373338 372793
54063C72793J320J842P53o68j145m85Q85K214K337P48j066r09J166K801K684K099
54047C87369K356K671J931Q38O64J124J186J078J786L283M736N832O560O323M842
54032D32579L369L411M533M901L765K035O81L4M35K058L986M828M321L158J480
54017D75574r83l300l723k130m99k44m97J5P03K4k046l869m211l459k620k008
54001D46727j311n34l02r84j912k065j501j423k502l834m178l494k478j211N96
53986D19594K348K844J829K34j079j928k221j888j474j654k090j864j147j096
53972D10408j857k166j464r38j599k591k505j340K6J390K996M413M915M589L937
53957D18214K918J502O37J224K404K455J502J627L763N909N544K851L39k58M62
$$ plain form
54063 372793 374113 375955 376708 376040 374895 374410 375295 377509 379846 380594 379528 378619 379785 382586 385270 387369
54047 387369 389725 392396 394327 395165 395829 396953 398139 399217 401003 404286 409022 414854 421414 427737 432579
54032 432579 435948 439359 443892 448793 452558 454593 455274 455308 455743 457801 461787 466615 470936 474094 475574
54017 475574 474591 471291 467568 465438 464939 464695 464198 464213 464916 464940 462894 459025 454814 451355 448735 446727
54001 446727 445416 444882 444580 443596 441684 439619 438118 436695 434193 430359 426181 422687 420209 418998 419594
53986 419594 421942 424786 426615 426849 425770 423842 421621 419733 418259 416605 414515 412651 411504 410408
53972 410408 408551 406385 404921 403983 402384 399793 397288 395948 395974 397364 400360 404773 409688 414277 418214
53957 418214 421132 422634 423271 424495 426899 429354 430856 432483 436246 442155 447699 450550 450889 450631 451093
53942D51093J127J619K788M603N557M391J959M91R16J891J947J599K273L820M709
53927D90783M537M665N781O485N422L670L496N297P150P265N604L056L52j817
53913E51746k619j768M3J892L367M353M717M510M080L576K845K056J825K189K108
53898E84920O37j818m006n232n626n464n087n084n607n685m245j863m52j024k699
53883E31665m176n214o156o817o606n271l091q01M06m62k877m755m505k722j257
53868D77361j002j279j128m44K31M76N07R85K158L228L165K350K454M258O515
53853D99835P798Q535R903J1518J1892J1104J1192J3403J6457J8270J8450J8235
53841F56592J8601J9291J9395J8241J5830J2699R354N863K339l81j288n31N76
$$ plain form
53942 451093 452220 453839 456627 461230 466787 471178 473137 473628 474544 476435 478382 479981 482254 486074 490783
53927 490783 495320 499985 505766 512251 517673 521343 524839 530136 537286 544551 550155 553211 553563 551746
53913 551746 549127 547359 547402 549294 552661 557014 561731 566241 570321 573897 576742 578798 580623 582812 584920
53898 584920 585557 583739 579733 574501 568875 563411 558324 553240 547633 541948 537703 535840 535388 534364 531665
53883 531665 527489 522275 516119 509302 502696 497425 494334 493533 493939 493477 490600 485845 481340 478618 477361
53868 477361 476359 475080 473952 473508 473739 474215 474722 475707 477865 481093 484258 486608 489062 493320 499835
53853 499835 507633 516168 526071 537589 549481 560585 571777 585180 601637 619907 638357 656592
53841 656592 675193 694484 713879 732120 747950 760649 770003 775866 778205 777824 776536 776005 776581
53828G76581J084J282J710K189K298J971Q41k273q042j5086k0852k4119k5717
53815F91867k6672k6675k5013k2209j9699j7900j5608j1727p041l514j950j232
53803E12627j39R09P44l55o43P12K372K691K070K347M044N371M469J866j24k43
53787E38718L58j00j563k351j475J91J337J762J827J197o36k883l880l090j732
53772E27680j038j013j304k213l906n437n612m486l181k558k744l606m671m816
53758D81095l193o33Q42K14j509k696k744k001r54j56l19j543k714k451o65J351
53742D61924K352K113J068j86q54j32J895L888M476L700K808K652K928L098L325
53727D95055M045M962N141M058K238P65M02J155K437L523M034M020L657L126K848
$$ plain form
53828 776581 777665 778947 780657 782846 785144 787115 787956 785683 777641 762555 741703 717584 691867
53815 691867 665195 638520 613507 591298 571599 553699 538091 526364 519323 515809 513859 512627
53803 512627 512488 513397 514141 513786 513143 513855 516227 518918 520988 523335 527379 532750 537219 539085 538961 538718
53787 538718 539076 538976 537413 535062 533587 533778 535115 536877 538704 539901 539265 536382 532502 529412 527680
53772 527680 526642 525629 524325 522112 518206 512769 507157 502671 499490 496932 494188 490582 485911 481095
53758 481095 477902 477269 478111 478325 476816 474120 471376 469375 468421 468265 467946 466403 463689 461238 460573 461924
53742 461924 464276 466389 467457 467271 466417 466285 468180 472068 476544 480244 483052 485704 488632 491730 495055
53727 495055 499100 504062 509203 513261 515499 516264 516666 517821 520258 523781 527815 531835 535492 538618 541466
53712E41466L361M486N063M240K821K420L266L959L691L521M574N962N883M300
53698E99013L015L112L744L793L433L293L182K736K564L432M717M892L700K622
53684F47248K840L656L508J931p6j224j000K13J420J633O07r42k010k041r94P68
53668F55537K310K304J84k934m931m486k080N26J606P55o95q28Q29K769L521L566
53652F57953M325N794O574O213N963O828Q223R260J0203J1672J3357J4590J5481
53639G76436J6430J7045J6636J5372J3871J1992R135N721L315L057M573O436P233
53626I07252O410M786M024M889O401P386Q139R182R054N350j659q428j2037j3157
53612I37592j4078j5196j5114j3290j0729q127n217k279q02j587l035k518O12
$$ plain form
53712 541466 544827 549313 554376 558616 561437 563857 567123 571082 574773 578294 582868 588830 594713 599013
53698 599013 602028 605140 608884 612677 616110 619403 622585 625321 627885 631317 636034 640926 644626 647248
53684 647248 650088 653744 657252 659183 659107 657883 656883 657096 658516 660149 660756 659814 657804 655763 654769 655537
53668 655537 657847 660151 660335 657401 652470 647984 645904 646430 648036 648791 648096 647268 648097 650866 654387 657953
53652 657953 662278 668072 674646 680859 686822 693650 701873 711133 721336 733008 746365 760955 776436
53639 776436 792866 809911 826547 841919 855790 867782 876917 882638 885953 889010 893583 900019 907252
53626 907252 913662 918448 922472 927361 933762 941148 949287 958469 967523 972873 971214 962786 950749 937592
53612 937592 923514 908318 893204 879914 869185 861058 855841 853562 852760 851173 848138 845620 846232
53599H46232M144N358L663O90j635k517k210j485j355k509m448n742n648m939
53585H27599m592m333l425k277k033k729l201k877k416k348k321k181k449k996
53571G87421k541n56J219N22k585n726o846n828l772j763m93k04m91o20k69K20
53555G57688M32M67Q36J884L286M193M227M232N473P831R457Q845O729N290N763
53540H26633P523R371J0900J2445J4174J5705J6471J6458J6354J6854J7896J9043
53528I99827K0503K2884K5838K7882K8278K8251K9457L1874L4175L5647L6566
53517A321182L7092L7205L7767M0037M3625M6176M5968M4012M2767M3383M5088
53506A784302M6696M7617M7562M6483M5213M5214M7059M9515N0772N0330M9070
$$ plain form
53599 846232 850376 855734 859397 860087 858452 855935 853725 852240 850885 848376 843928 838186 832538 827599
53585 827599 823007 818674 815249 812972 810939 808210 805009 802132 799716 797368 795047 792866 790417 787421
53571 787421 784880 784324 785543 786065 783480 777754 770908 765080 761308 759545 759052 758848 758357 757737 757468 757688
53555 757688 758120 758587 759423 761307 764593 768786 773013 777245 782718 790549 800006 808851 815580 820870 826633
53540 826633 834156 843527 854427 866872 881046 896751 913222 929680 946034 962888 980784 999827
53528 999827 1020330 1043214 1069052 1096934 1125212 1153463 1182920 1214794 1248969 1284616 1321182
53517 1321182 1358274 1395479 1433246 1473283 1516908 1563084 1609052 1653064 1695831 1739214 1784302
53506 1784302 1830998 1878615 1926177 1972660 2017873 2063087 2110146 2159661 2210433 2260763 2309833
53495B309833M7718M6117M4132M2371M1346M0573L9202L7217L5177L3146L0815
53484B747647K8549K7206K6703K5825K3762K1010J8278J5585J2895J0638Q809
53473B966907O430K858j111m409p264j0496j3889j6564j8620k0990k3749k5958
53461B833145k7334k8730l0707l2766l4522l6482l8933m0891m1134l9815l8249
53450B443582l7254l6435l5036l3021l1083k9786k8962k7939k6142k3300j9328
53439B115296j4602j0239p253n151k179K384P098J0325J2497J5199J8639K1635
53427B163649K3852K6391K9898L3534L6434L8845M1319M3807M6261M9033N1963
53416B584986N4034N4863N5779N8425O2807O7463P1129P3472P4658P5160P5804
$$ plain form
53495 2309833 2357551 2403668 2447800 2490171 2531517 2572090 2611292 2648509 2683686 2716832 2747647
53484 2747647 2776196 2803402 2830105 2855930 2879692 2900702 2918980 2934565 2947460 2958098 2966907
53473 2966907 2973337 2976195 2975084 2970675 2963411 2952915 2939026 2922462 2903842 2882852 2859103 2833145
53461 2833145 2805811 2777081 2746374 2713608 2679086 2642604 2603671 2562780 2521646 2481831 2443582
53450 2443582 2406328 2369893 2334857 2301836 2270753 2240967 2212005 2184066 2157924 2134624 2115296
53439 2115296 2100694 2090455 2083202 2078051 2075872 2078256 2085354 2095679 2108176 2123375 2142014 2163649
53427 2163649 2187501 2213892 2243790 2277324 2313758 2352603 2393922 2437729 2483990 2533023 2584986
53416 2584986 2639020 2693883 2749662 2808087 2870894 2938357 3009486 3082958 3157616 3232776 3308580
53405C308580P7303P9692Q2564Q5520Q8082Q9684R0453R1525R3823R6603R8011
53394D281840R7135R5078R3896R4605R6201R6556R4522R1097Q8009Q5219Q0900
53383E295058P4225O7000O1472N7392N2560M5775L7781K9461K0723J1507K592
53372E755546n542j3674k2788l2502m1419m8780n5134o1319o7477p3201p8257
53361E255453q2802q7019r0938r4707r8787j03470j08216j11830j13601j14011
53351D250072j14118j14345j14163j12782j09880j05777j01159r6642r2393q8155
53341C200658q3731p9289p5122p1383o8176o5593o3409o0980n7873n4311n0668
53330B470123m6804m2363l7609l3353l0105k7588k5108k2068j8257j4065j0320
$$ plain form
53405 3308580 3385883 3465575 3548139 3633659 3721741 3811425 3901878 3993403 4087226 4183829 4281840
53394 4281840 4378975 4474053 4567949 4662554 4758755 4855311 4949833 5040930 5128939 5214158 5295058
53383 5295058 5369283 5436283 5497755 5555147 5607707 5653482 5691263 5720724 5741447 5752954 5755546
53372 5755546 5750004 5736330 5713542 5681040 5639621 5590841 5535707 5474388 5406911 5333710 5255453
53361 5255453 5172651 5085632 4994694 4899987 4801200 4697730 4589514 4477684 4364083 4250072
53351 4250072 4135954 4021609 3907446 3794664 3684784 3579007 3477848 3381206 3288813 3200658
53341 3200658 3116927 3037638 2962516 2891133 2822957 2757364 2693955 2632975 2575102 2520791 2470123
53330 2470123 2423319 2380956 2343347 2309994 2279889 2252301 2227193 2205125 2186868 2172803 2162483
53319B162483p489n215k963q58P45K321M931Q840J3093J6690J9547K1939K3811
53306B257875K5077K6168K7686K9816L2473L5662L9272M2757M5440M6943M7212
53295B656381M6431M5255M4616M4773M4840M3754M1495L8950L6869L5457L4570
53284C113391L3644L1716K8248K3863J9572J5540J1416P418L913Qn872j3408j9908
53271C249541k3376k4994k7373l1268l5513l9535m4015m8928n2740n4373n4854
53260B812572n5944n7850n9254n9451n9420o0516o2595o3934o3133o0792n8939
53249B150744n8738n9323n9161n7946n6485n5284n4176n3121n2213n0830m7910
53238A545557m3520l9224l6495l5443l5333l5404l4800l2870l0231k8533k8282
$$ plain form
53319 2162483 2154994 2149779 2146816 2145958 2146703 2149024 2153955 2162795 2175888 2192578 2212125 2234064 2257875
53306 2257875 2282952 2309120 2336806 2366622 2399095 2434757 2474029 2516786 2562226 2609169 2656381
53295 2656381 2702812 2748067 2792683 2837456 2882296 2926050 2967545 3006495 3043364 3078821 3113391
53284 3113391 3147035 3178751 3206999 3230862 3250434 3265974 3277390 3284808 3288721 3288729 3282857 3269449 3249541
53271 3249541 3226165 3201171 3173798 3142530 3107017 3067482 3023467 2974539 2921799 2867426 2812572
53260 2812572 2756628 2698778 2639524 2580073 2520653 2460137 2397542 2333608 2270475 2209683 2150744
53249 2150744 2092006 2032683 1973522 1915576 1859091 1803807 1749631 1696510 1644297 1593467 1545557
53238 1545557 1502037 1462813 1426318 1390875 1355542 1320138 1285338 1252468 1222237 1193704 1165422
53227A165422k7796k5358k1640j8756j7509j6872j5921j4989j4761j5224j5740
53216I60856j5612j4676j3830j4479j6714j8451j7531j4326j1263r938r964j0434
53204G93638j1054j1612j1638j1088j0393r547q190o856o850q395r929j0032r057
53191F68997q136p496o620n491m830n273o737q249q313o197l116j201j097j609
53177E94632k014l167n390o815n507k327L4M18k3j97l93r78j439j333j057r08
53161E63536l86P84J634R28j074k649k379m49J761K868K290M90j305j942j323
53146E62784m42j38j19L49J096J294J006J324K456K957J822L28K82J247J311K86
53130E77843L6J451L075L388K709J963J265P83J423L277M724M379K907J562K23
$$ plain form
53227 1165422 1137626 1112268 1090628 1071872 1054363 1037491 1021570 1006581 991820 976596 960856
53216 960856 945244 930568 916738 902259 885545 867094 849563 835237 823974 814036 804072 793638
53204 793638 782584 770972 759334 748246 737853 728306 720116 713260 706410 698015 688086 678054 668997
53191 668997 660861 653365 646745 641254 636424 631151 624414 616165 607852 601655 598539 597338 596241 594632
53177 594632 592618 589451 584061 577246 571739 569412 569446 569864 569841 569644 569251 568273 566834 565501 564444 563536
53161 563536 563150 563934 565568 566496 565422 562773 560394 559945 561706 564574 566864 567354 566049 564107 562784
53146 562784 562342 562204 562085 562434 563530 564824 565830 567154 569610 572567 574389 574717 574999 576246 577557 577843
53130 577843 577879 579330 582405 585793 588502 590465 591730 592513 593936 597213 601937 606316 609223 610785 611008
53115F11008j560k694j802L63J680J561J263J533J665R83l72k159m098n220m626
53100E97525k969j873j794j907j952k443k939k101r4R53k00k109k867k707l130
53085E69393m421n401n062l450j357J13J32q94j430n77P43R74j15j254j234j67
53069E45993M96p53l719n965n153k071j36j297l653m042j830J027K697K759J462
53054E25815n67k031j846n52K96J46j61o9m3l14j62P06J125q1k102k825j460M74
53036E16349J197P87O22J187J508Q73J32N27J797K341J229p12j943j765o12O01
53020E24118J171J057Q91J296K180K988L524L897L781K631Q16m17m66n5J35N12
53004E48059J528K385J956N65k75J36Q96Q15k00j334j852j640j134r49j362k061
$$ plain form
53115 611008 609448 606754 604952 605315 606995 608556 609819 611352 613017 614000 613628 611469 607371 602151 597525
53100 597525 594556 592683 590889 588982 587030 584587 581648 579547 579453 580406 580206 578097 575230 572523 569393
53085 569393 564972 559571 554509 551059 549702 549815 549947 549053 547623 547046 547789 548763 548648 547394 546160 545993
53069 545993 546489 545736 542017 536052 530899 528828 528692 527395 523742 519700 517870 518897 521594 524353 525815
53054 525815 525248 523217 521371 520819 521115 521261 521100 521031 520988 520674 520512 521218 522343 522262 520160 517335 515875 516349
53036 516349 517546 518333 518955 520142 521650 522523 522655 523182 524979 527320 528549 527837 525894 524129 523517 524118
53020 524118 525289 526346 527237 528533 530713 533701 537225 541122 544903 547534 548350 547933 547467 547412 547547 548059
53004 548059 549587 551972 553928 554493 554218 554354 555250 556065 555865 554531 552679 551039 549905 548956 547594 545533
52988E45533k362j721j08J839L013K684J282l5p41j286j859j680k59J307J367
52973E46974j30j482j379l12M52O12R58K020L188L373K388J320J294K087K323
52958E63686J023j382l628m700m244k606p26M55Q79J256J853J997J088m95j901
52943E52555k559k110m47J519K019M30j592k058j195p83j376j719r69j2M2m35
52927E41310j37J412L219L729K331K22n52N69J698Q89j047j541n9R58k88k210
52911E50503k145j80J141N55m32o9J148J354j76k343l623l403k143r40r50k520
52895E35777m561n316m208k522j753j717j200j70o7j457k743k173k49J159J503
52880E10303J809K407K077J00k177k796j548O2Q63J154J798K817L241K253L36
$$ plain form
52988 545533 543171 541450 541342 543181 546194 548878 550160 550125 549384 548098 546239 544559 544300 545607 546974
52973 546974 546844 545362 543983 543671 544123 544735 545693 547713 550901 554274 556662 557982 559276 561363 563686
52958 563686 564709 563327 559699 554999 550755 548149 547423 547878 548757 550013 551866 553863 554951 554456 552555
52943 552555 549996 547886 547439 548958 550977 551407 549815 547757 546562 545779 544403 542684 541715 541703 541745 541310
52927 541310 541173 542585 545804 549533 551864 552086 551534 552103 553801 554690 553643 552102 552043 553001 552713 550503
52911 550503 548358 548178 549319 549874 549442 549373 550521 551875 551699 549356 545733 542330 540187 539247 538297 535777
52895 535777 531216 525900 521692 519170 517417 515700 514500 514330 514263 512806 510063 507890 507641 508800 510303
52880 510303 512112 514519 516596 516696 514519 511723 510175 510237 511100 512254 514052 516869 520110 522363 522699
52865E22699r88p06N75J426J223N62J95L26Q75J604J830Q67q35j783j220k27l68
52848E26055j649k585k015k94J272J587M68j347k751l010k065k55J871L454L664
52833E22400K561J181L35k76j243k189k189j241m02k49m5J026K412K750J706N55
52817E27092O45J798K613K168R38M4Q6Q52J691J842Q56p97j836j460l75O7l89
52800E35835p23j82P60J183P34l27j557k479k920l380m512o014o769o354n597
52785D97698n226m844l939l004k702k589j744k43J015J708K280K919L298L263
52771D87890K946K237J097J94K18O84N34j39k19L65K32j283k909l204k343j221
52755D85079N1J574K598K559K363L111M009L335J305J55J014K455K798K225J664
$$ plain form
52865 522699 521711 521005 521580 523006 524229 524791 524986 525312 526187 527791 529621 530488 529653 527870 526650 526423 526055
52848 526055 524406 521821 519806 519512 520784 522371 522839 521492 518741 515731 513666 513411 515282 518736 522400
52833 522400 524961 526142 526477 526201 524958 522769 520580 519339 518937 518688 518643 519669 522081 524831 526537 527092
52817 527092 527737 529535 532148 534316 535254 535298 535384 536236 537927 539769 540625 539828 537992 536532 536157 536224 535835
52800 535835 535112 534930 535690 536873 537607 537280 535723 533244 530324 526944 522432 516418 509649 503295 497698
52785 497698 492472 487628 483689 480685 477983 475394 473650 473407 474422 476130 478410 481329 484627 487890
52771 487890 490836 493073 494170 494364 494582 495266 495800 495661 495442 495807 496039 494756 491847 488643 486300 485079
52755 485079 485130 486704 489302 491861 494224 497335 501344 504679 505984 506139 507153 509608 512406 514631 516295
52740E16295R87l11j614j872j227o38k25O61J928K625K429K009J664Q96k44n65
52724E22798O97K648L735L463K367J003l74j539k378k911k789j495M39J298J35
52709E27097j913l297m087m992n281l683j047K08m61r73l0R81O58N1P37J999K131
52692E08098J442J602K548K462Q31o85q90m48o9Q13K397L262K215K78o94n31l84
52675E22247l67N87K489L483K063q89k964k724p73J276K293K189J468O02j12l28
52659E30540L27J822L514M625M806M054K388L7k154l058k291o38P26J282J354
52644E47334J491J885K281K173J196m73k032k578j891o93P9J70J29N18J255J787
52628E52631J708J017lr05j151n40M39R52P13K92M00J035J520J264L67m93p47
$$ plain form
52740 516295 517282 516971 515357 513485 512258 511620 511395 512056 513984 516609 519038 521047 522711 523607 523363 522798
52724 522798 523495 526143 529878 533341 535708 536711 536337 534798 532420 529509 526720 525225 525664 526962 527097
52709 527097 525184 521887 517800 512808 507527 503844 502797 503005 502544 501571 501541 502522 503180 503231 503968 505967 508098
52692 508098 509540 511142 513690 516152 516983 516298 515408 514960 514891 515704 518101 521363 523578 523856 523162 522631 522247
52675 522247 521880 522467 524956 528439 530502 529613 526649 523925 523152 524428 526721 528910 530378 530980 530868 530540
52659 530540 530867 532689 536203 540828 545634 549688 552076 552113 549959 546901 544610 543972 544698 545980 547334
52644 547334 548825 550710 552991 555164 556360 555887 553855 551277 549386 548693 548772 548942 549071 549589 550844 552631
52628 552631 554339 555356 555353 554448 553297 552757 553196 554148 554861 555153 555553 556588 558108 559372 559739 559246 558499
52611E58499n72p48j712k884l274k731k132k185k546k392j422L6J558K763L174
52596E43432K527J200r0r73j588k044k131j520m8K014L718L861K256L95M1J179
52580E52229K131J852J104R71J201Q77no86j004j370j523n57J495L196L450K784
52564E66145K163J425m9j674k078j116j37Qj1N25J070R27O31R65J346O75n43o67
52546E69605M14R07m0q45JJ424J401Q2o14l8N15K68J80J141K418K846K393J659
52528E83717Q07j35o82n98n36r27q94N01K348K676J167j99K95J899K520J458K35
52511E93652P26K974N136N485M146K600J718R89j64j245j500j181j096j263j079
52496F09898n19j81k31m03r68k449m133m303k560p58o14j402j222J76J173P51
$$ plain form
52611 558499 557927 557179 555467 552583 549309 546578 544446 542261 539715 537323 535901 535937 537495 540258 543432
52596 543432 545959 547159 547069 546096 544508 542464 540333 538813 538765 540779 544497 548358 550614 551009 551050 552229
52580 552229 554360 556212 557316 558287 559488 560365 560360 559674 558670 557300 555777 555220 556715 559911 563361 566145
52564 566145 568308 569733 569684 568010 565932 564816 564679 564687 564676 565201 566271 567198 567829 568794 570140 570815 570272 569605
52546 569605 570019 570926 570886 570041 570042 571466 572867 572949 572335 572297 572812 573080 573260 574401 576819 579665 582058 583717
52528 583717 584524 584389 583707 583109 582573 581646 580752 581253 583601 586277 587444 587245 587540 589439 591959 593417 593652
52511 593652 594378 597352 602488 607973 612119 614719 616437 617426 617262 616017 614517 613336 612240 610977 609898
52496 609898 609379 609198 608967 608564 607596 605147 601014 596711 594151 593393 592779 591377 590155 590331 591504 592255
52480E92255r9K07J829L376L497K227Q73O30J400K203K625L205M166M578L522
52465F26494J567J81j38k46q60j614j834j535j239j218j284j060k81Q53J518Q26
52449F20130j128l138m031l790l267l033k946k645k096j545j267j554k514l544
52435E83632l369j320J429K629J424n73j268n50J03M7J99J272K551L033K842K757
52419E94838L026L374L686M004M300M758N761P082P697P137O304O241O680O751
52405F71639O384N844M627K358L16K78J762K256O89r01m0L005N658N844L533J94
52389G13446k520l851m303m735n116m760l817l392l757l684k303o51k92j072j452
52374F67741p29K11L28k67n91Q4J560K890L405L405L494L286J749p53j975k23
$$ plain form
52480 592255 592156 592363 594192 597568 601065 603292 604165 604795 606195 608398 611023 614228 618394 622972 626494
52465 626494 628061 628242 628104 627858 626998 625384 623550 622015 620776 619558 618274 617214 616933 617786 619304 620130
52449 620130 619002 615864 611833 608043 604776 601743 598797 596152 594056 592511 591244 589690 587176 583632
52435 583632 580263 578943 580372 583001 584425 583852 582584 582034 582137 582184 582383 583655 586206 589239 592081 594838
52419 594838 597864 601238 604924 608928 613228 617986 623747 630829 638526 645663 651967 658208 664888 671639
52405 671639 678023 683867 688494 690852 691168 691446 693208 695464 696153 695252 695212 698217 703875 709719 713252 713446
52389 713446 710926 707075 702772 698037 692921 688161 684344 680952 677195 673511 671208 670557 670265 669193 667741
52374 667741 667012 667223 667551 667284 666693 666777 668337 671227 674632 678037 681531 684817 686566 685813 683838 683615
52358F83615L365N959N964L941J245j015k010j494k75N91J098K021L377M261M361
52343G15004M595N741P169P563O553N257N392P821J1566J4317J4499J2974J2081
52330H30532J2910J4233J4388J3418J2754J3364J4945J6713J8189J9243J9914
52319A000603K0485K1362K2495K3038K2009J9498J7058J6456J8066K0646K2690
52308A224406K3527K3098K1382J8568J5429J2870J1170J0071R446R406R801J0009
52296A399183R363P756N911N014N543O335N507K772P0o94O9N58R5m50m27k55l49
52279A446001m79l55n9M10J120J677J635J553K596M778O760P722Q356R529J1052
52264A502296J2455J3776J4784J4588J3079J1834J2248J3527J3907J3197J2711
$$ plain form
52358 683615 686980 692939 698903 702844 704089 703074 701064 699570 699295 699886 700984 703005 706382 710643 715004
52343 715004 719599 725340 732509 740072 746625 751882 757274 765095 776661 790978 805477 818451 830532
52330 830532 843442 857675 872063 885481 898235 911599 926544 943257 961446 980689 1000603
52319 1000603 1021088 1042450 1064945 1087983 1109992 1129490 1146548 1163004 1181070 1201716 1224406
52308 1224406 1247933 1271031 1292413 1310981 1326410 1339280 1350450 1360521 1369967 1379373 1389174 1399183
52296 1399183 1408546 1416302 1422213 1427227 1432770 1439105 1444612 1447384 1447454 1446760 1446829 1447387 1447482 1447032 1446605 1446350 1446001
52279 1446001 1445522 1445167 1445108 1445518 1446638 1448315 1449950 1451503 1454099 1458877 1465637 1473359 1481715 1491244 1502296
52264 1502296 1514751 1528527 1543311 1557899 1570978 1582812 1595060 1608587 1622494 1635691 1648402
52253A648402J2906J2760J1588J0073R103Q613P989O845N179L455K553K771K775
52240A745012P86k865n646n928n047n310o940q285q369p694o699n059k918j509
$$ plain form
52253 1648402 1661308 1674068 1685656 1695729 1704832 1713445 1721434 1728279 1733458 1736913 1739466 1742237 1745012
52240 1745012 1745798 1742933 1737287 1731359 1726312 1721002 1714062 1705777 1697408 1689714 1683015 1677956 1675038 1673529
$$ [...]
##END NTUPLES=NMR SPECTRUM
##END=
