##TITLE=AC1455_pasto13261_7818943_EZZGiarK81
##JCAMPDX= 6.0         $$ Bruker NMR JCAMP-DX V2.0
##DATA TYPE= NMR SPECTRUM
##DATA CLASS= NTUPLES
##ORIGIN= BRUKER
##OWNER= Administrator
$$ 1.72 TOPSPIN		Version 2.1
$$ 2013-04-30 19:26:49.687 -0700  Administrator@X
$$ Compression mode = diff/dup
##.OBSERVE FREQUENCY= 400.02188249412
##.OBSERVE NUCLEUS= ^1H
##.ACQUISITION MODE= SIMULTANEOUS (DQD)
##.ACQUISITION SCHEME= undefined
##.AVERAGES= 64
##.DIGITISER RES= 22
##SPECTROMETER/DATA SYSTEM= spect
##.PULSE SEQUENCE= noesygpps1d.comp
##.SOLVENT NAME= COFFEE_meoh
##.SHIFT REFERENCE= INTERNAL, COFFEE_meoh, 1, 14.96102
##AUDIT TRAIL= $$ (NUMBER, WHEN, WHO, WHERE, PROCESS, VERSION, WHAT)
$$ ##TITLE= Audit trail, TOPSPIN		Version 2.1
$$ ##JCAMPDX= 5.01
$$ ##ORIGIN= Bruker BioSpin GmbH
$$ ##OWNER= Administrator
$$ $$ E:\/data/COFFEE/nmr/AC1455_pasto13261_7818943_EZZGiarK81/12/pdata/1/auditp.txt
$$ ##AUDIT TRAIL=  $$ (NUMBER, WHEN, WHO, WHERE, PROCESS, VERSION, WHAT)
(   1,<2013-04-30 19:26:44.796 -0700>,<Administrator>,<X>,<go>,<TOPSPIN 2.1>,
      <created by zg
	started at 2013-04-30 19:15:14.593 -0700,
	POWCHK enabled, PULCHK disabled,
       configuration hash MD5:
       F7 49 AB AC A2 8D 51 76 73 8D C1 9A A6 38 9F DE
       data hash MD5: 64K
       66 E5 4F 42 DD 03 D2 4F B6 8F 47 F1 C3 A3 5E 55>)
(   2,<2013-04-30 19:26:47.687 -0700>,<Administrator>,<X>,<proc1d>,<TOPSPIN 2.1>,
      <Start of raw data processing
       efp LB = 0.3 FT_mod = 6 PKNL = 1 PHC0 = 0 PHC1 = 0 SI = 128K 
       data hash MD5: 128K
       EB 13 0B 99 0B 54 E6 CB 22 4B 9E 11 66 BF D2 7E>)
(   3,<2013-04-30 19:26:48.671 -0700>,<Administrator>,<X>,<proc1d>,<TOPSPIN 2.1>,
      <pk PHC0 = -79.6344 PHC1 = 0 
       data hash MD5: 128K
       64 1D FB 88 5F 56 76 AD A1 10 32 E2 31 04 3C D6>)
(   4,<2013-04-30 19:26:49.124 -0700>,<Administrator>,<X>,<proc1d>,<TOPSPIN 2.1>,
      <abs ABSG = 1 
       data hash MD5: 128K
       15 FB CB C0 2C 50 B6 FD 08 D1 05 A0 86 F1 3E B1>)
(   5,<2013-04-30 19:26:49.234 -0700>,<Administrator>,<X>,<proc1d>,<TOPSPIN 2.1>,
      <abs ABSG = 2 
       data hash MD5: 128K
       BD 08 BA 19 8F B4 36 F0 62 AB E7 FC 39 27 71 0E>)
(   6,<2013-04-30 19:26:49.312 -0700>,<Administrator>,<X>,<proc1d>,<TOPSPIN 2.1>,
      <abs ABSG = 3 
       data hash MD5: 128K
       06 5C 48 D7 D2 3E 37 C6 44 2C 55 2E 82 CC 76 29>)
(   7,<2013-04-30 19:26:49.390 -0700>,<Administrator>,<X>,<proc1d>,<TOPSPIN 2.1>,
      <abs ABSG = 4 
       data hash MD5: 128K
       65 F8 62 20 88 D1 CD 13 D4 23 B1 5C 4B 12 B4 6B>)
(   8,<2013-04-30 19:26:49.484 -0700>,<Administrator>,<X>,<proc1d>,<TOPSPIN 2.1>,
      <abs ABSG = 5 
       data hash MD5: 128K
       61 3E F0 20 F4 83 10 D7 D6 23 4C 7E 79 C0 FC 4B>)
$$ ##END=
$$ 
$$ $$ hash MD5
$$ $$ 71 14 42 4F 01 69 D2 F4 3D A1 05 74 71 05 51 BF
##$RELAX= 
##$RELAX= 
##$RELAX= 
##$RELAX= 
##$RELAX= 
##$RELAX= 
##$RELAX= 
##$RELAX= 
$$ Bruker specific parameters
$$ --------------------------
##$DU= <E:\>
##$EXPNO= 12
$$ [...]
150 150 150 150 150 150 150 150
##$TP07= 0
##$TPNAME0= <>
##$TPNAME1= <>
##$TPNAME2= <>
##$TPNAME3= <>
##$TPNAME4= <>
##$TPNAME5= <>
##$TPNAME6= <>
##$TPNAME7= <>
##$TPOAL= (0..7)
0.5 0.5 0.5 0.5 0.5 0.5 0.5 0.5
##$TPOFFS= (0..7)
0 0 0 0 0 0 0 0
##$TUNHIN= 0
##$TUNHOUT= 0
##$TUNXOUT= 0
##$USERA1= <user>
##$USERA2= <user>
##$USERA3= <user>
##$USERA4= <user>
##$USERA5= <user>
##$V9= 5
##$VALIST= <valist>
##$VCLIST= <CCCCCCCCCCCCCCC>
##$VD= 0
##$VDLIST= <DDDDDDDDDDDDDDD>
##$VPLIST= <PPPPPPPPPPPPPPP>
##$VTLIST= <TTTTTTTTTTTTTTT>
##$WBST= 1024
##$WBSW= 4
##$XGAIN= (0..3)
0 0 0 0
##$XL= 0
##$YL= 0
##$YMAX_a= 6148418
##$YMIN_a= -13035120
##$ZGOPTNS= <>
##$ZL1= 120
##$ZL2= 120
##$ZL3= 120
##$ZL4= 120
##$ABSF1= 14.96102
##$ABSF2= -5.597161
##$ABSG= 5
##$ABSL= 3
##$ALPHA= 0
##$AQORDER= 0
##$ASSFAC= 0
##$ASSFACI= 0
##$ASSFACX= 0
##$ASSWID= 0
##$AUNMP= <proc_prof1d_extract.lims>
##$AXLEFT= 0
##$AXNAME= <>
##$AXNUC= <1H>
##$AXRIGHT= 0
##$AXTYPE= 0
##$AXUNIT= <>
##$AZFE= 0.1
##$AZFW= 0.1
##$BCFW= 0
##$BC_mod= 0
##$BYTORDP= 0
##$COROFFS= 0
##$CY= 15
##$DATMOD= 1
##$DC= 0
##$DFILT= <>
##$DTYPP= 0
##$F1P= 0
##$F2P= 0
##$FCOR= 0.5
##$FTSIZE= 131072
##$FT_mod= 6
##$GAMMA= 0
##$GB= 0
##$INTBC= 1
##$INTSCL= 1
##$ISEN= 128
##$LB= 0.3
##$LEV0= 0
##$LPBIN= 0
##$MAXI= 10000
##$MC2= 0
##$MEAN= 0
##$ME_mod= 0
##$MI= 0
##$NCOEF= 0
##$NC_proc= -2
##$NLEV= 6
##$NOISF1= 0
##$NOISF2= 0
##$NSP= 0
##$NTH_PI= 0
##$NZP= 0
##$OFFSET= 14.96102
##$PC= 1
##$PHC0= -79.6344
##$PHC1= 0
##$PH_mod= 1
##$PKNL= yes
##$PPARMOD= 0
##$PPDIAG= 0
##$PPIPTYP= 0
##$PPMPNUM= 2147483647
##$PPRESOL= 1
##$PSCAL= 4
##$PSIGN= 0
##$PYNMP= <proc.py>
##$REVERSE= no
##$SF= 400.020009627911
##$SI= 131072
##$SIGF1= 0
##$SIGF2= 0
##$SINO= 400
##$SIOLD= 131072
##$SPECTYP= <>
##$SREGLST= <1H.CDCl3>
##$SSB= 0
##$STSI= 131072
##$STSR= 0
##$SW_p= 8223.68421052631
##$SYMM= 0
##$S_DEV= 0
##$TDeff= 65536
##$TDoff= 0
##$TI= <>
##$TILT= no
##$TM1= 0
##$TM2= 0
##$TOPLEV= 0
##$USERP1= <user>
##$USERP2= <user>
##$USERP3= <user>
##$USERP4= <user>
##$USERP5= <user>
##$WDW= 1
##$XDIM= 131072
##$YMAX_p= 446675817
##$YMIN_p= -11667
##$CURPLOT= <Network HP LaserJet P1505>
##$CURPRIN= <$Network HP LaserJet P1505>
##$DFORMAT= <normdp>
##$LAYOUT= <+/1D_H.xwp>
##$LFORMAT= <normlp>
##$PFORMAT= <normpl>
##$SURQMSG= 1
$$ End of Bruker specific parameters
$$ ---------------------------------
##NTUPLES= NMR SPECTRUM
##VAR_NAME=  FREQUENCY,     SPECTRUM/REAL,   SPECTRUM/IMAG
##SYMBOL=    X,             R,               I
##VAR_TYPE=  INDEPENDENT,   DEPENDENT,       DEPENDENT
##VAR_FORM=  AFFN,          ASDF,            ASDF
##VAR_DIM=   131072,        131072,          131072
##UNITS=     HZ,            ARBITRARY UNITS, ARBITRARY UNITS
##FACTOR=    0.0627417313425164, 1,          1
##FIRST=     8223.62146879497, 1406,         -57447
##LAST=      0,             2992,            -58120
##MIN=       0,             -11667,          0
##MAX=       8223.62146879497, 446675817,    0
$$ Real data points
##PAGE= N=1
##DATA TABLE= (X++(R..R)), XYDATA
$$ [...]
63889H79576k4335k3928k3424k2724k1783k0709j9866j9450j8997j7717j5381
63878F51262j2542r832p355m882k317K13K579M754O760Q536R936J0942J1904J3298
63864F83256J5093J6578J7148J6993J6736J6513J5920J4734J3138J1198Q770O132
63852H52209M132L151K278J26l487p176r508j0547j1597j3558j5973j7761j8547
63839G53742j8937j9706k1058k2626k3808k4086k3418k2485k2085k2186k1870
63828E11477k0438j8246j6169j4648j3566j2757j2138j1545j0839j0045r200q261
63816C53625p373o938p032p056o365m974l382j994j071q64j255j556j225n45j11
63801C01884rk3l10j108k087k704k988l239l245k709k177k477l323l569k903k186
$$ y = [879576, 855241, 831313, 807889, 785165, 763382, 742673, 722807, 703357, 684360, 666643, 651262, 638720, 628888, 621533, 616651, 614334, 614547, 617126, 621880, 628640, 637176, 647112, 658054, 669958, 683256, 698349, 714927, 732075, 749068, 765804, 782317, 798237, 812971, 826109, 837307, 846077, 852209, 856341, 859492, 861770, 861896, 858409, 851233, 841725, 831178, 819581, 806023, 790050, 772289, 753742, 734805, 715099, 694041, 671415, 647607, 623521, 600103, 577618, 555533, 533347, 511477, 491039, 472793, 456624, 441976, 428410, 415653, 403515, 391970, 381131, 371086, 361886, 353625, 346252, 339314, 332282, 325226, 318861, 313887, 310505, 308511, 307440, 306576, 305321, 303765, 302540, 301995, 301884, 301875, 301852, 301542, 300434, 298347, 295643, 292655, 289416, 286171, 283462, 281285, 278808, 275485, 271916, 269013, 266827]
63785B66827j960j805j480j476j912k001j361q19j094j536j180k98J01j67m65
63770B49374n23o12o94m06R8J86k12l81J53R12J036K26j040j938j895j022j8N07
63752B43751N45L65j1o13j038o99L58J383J800J854K125K721L186L193L002L051
63736B64973L254L046K255J591J770K457K640K035J440J514J963K323K807L744
63722B97812M711N026M844M923N397N600N154M515M111L575K324N43r31j604j829
63707C44171k237k951l491l363k564j575r56j002j524j854j322L6J362J902J880
63692C26512K063K606K914K640K219K106K136J977J751J714J609R26l68j724k553
63677C46528k563j760m79O31J074R72Q85J190J781K288K403K092J635J379J382
$$ y = [266827, 264867, 263062, 261582, 260106, 258194, 256193, 254832, 254013, 252919, 251383, 250203, 249905, 250006, 249839, 249374, 248851, 248239, 247545, 247139, 247237, 247423, 247211, 246830, 246983, 247895, 248931, 249157, 248117, 246179, 244284, 243262, 243244, 243751, 244296, 244661, 244650, 244037, 242999, 242300, 242658, 244041, 245841, 247695, 249820, 252541, 255727, 258920, 261922, 264973, 268227, 271273, 273528, 275119, 276889, 279346, 281986, 284021, 285461, 286975, 288938, 291261, 294068, 297812, 302523, 307549, 312393, 317316, 322713, 328313, 333467, 337982, 342093, 345668, 347992, 348535, 347604, 346000, 344171, 341934, 338983, 335492, 332129, 329565, 327990, 327034, 326032, 324508, 322654, 321332, 321368, 322730, 324632, 326512, 328575, 331181, 334095, 336735, 338954, 341060, 343196, 345173, 346924, 348638, 350247, 351173, 350805, 349081, 346528, 343965, 342205, 341726, 342357, 343431, 344403, 345288, 346478, 348259, 350547, 352950, 355042, 356677, 358056, 359438]
63662C59438J398J245R03L27n67j627k580l461m489n426n591m816l796l180k823
63647C24955k342j875j749j820j734j456j045l12P43J516J626J737K786M505N630
63632C31165N524M779M241M174M538N278O076O513O693P178Q076Q823R180R774
63618D22012J1195J3072J4645J5894J7473J9629K1851K3714K5580K8085L1165
63607F44315L3943L5781L7051L8480L9796L9530L6399L0491K2849J4419O013j121
63595I77946n691p540p839p905q245q838r769j1221j3200j5661j8646k2018k5233
63582H16140k7695k9140k9552k8857k7048k4486k1810j9423j7253j4975j2462
63571E63439r900p541n347l021m24K121M056N084N386N445N705O266O815P024
$$ y = [359438, 360836, 362081, 362984, 363311, 362744, 361117, 358537, 355076, 350587, 345161, 339570, 334754, 330958, 327778, 324955, 322613, 320738, 318989, 317169, 315435, 313979, 312934, 312622, 313365, 314881, 316507, 318244, 321030, 325535, 331165, 336689, 341468, 345709, 349883, 354421, 359699, 365775, 372288, 378981, 386159, 394235, 403058, 412238, 422012, 433207, 446279, 460924, 476818, 494291, 513920, 535771, 559485, 585065, 613150, 644315, 678258, 714039, 751090, 789570, 829366, 868896, 905295, 935786, 958635, 973054, 979067, 977946, 972255, 964715, 956876, 948971, 940726, 931888, 922119, 910898, 897698, 882037, 863391, 841373, 816140, 788445, 759305, 729753, 700896, 673848, 649362, 627552, 608129, 590876, 575901, 563439, 553539, 545998, 540651, 537630, 537206, 539327, 543383, 548467, 553853, 559298, 565003, 571269, 578084, 585108]
63557E85108P088P630Q978J0809J2708J4709J7012J9526K2209K5576L0230L6009
63545G97592M2028M7506N1801N3677N1381M4057L2760J9859P606k609j0165j4925
63533A120568j6973j6547j4276j1408r261q342q406r490j2311j7245k3365k9094
63521I43850l3590l6957l9284m0155l9262l6963l4013l1025k8357k6192k4399
63510E73653k2494k0078j7364j4998j3363j2194j0963r446p782o199m907m101
63498D29764l797l684l404k987k721k615k356j883j569j618j664j370j036j126
63484C97934j378r99K75J813K882L397L680L871L873L674L455L341L227K886K186
63469D34117J198M2j236k538l563m060m227m429m498l804k307j020q11j205j049
$$ y = [585108, 592196, 599826, 608804, 619613, 632321, 647030, 664042, 683568, 705777, 731353, 761583, 797592, 839620, 887126, 938927, 992604, 1043985, 1088042, 1120802, 1140661, 1148267, 1145658, 1135493, 1120568, 1103595, 1087048, 1072772, 1061364, 1052103, 1043761, 1035355, 1025865, 1013554, 996309, 972944, 943850, 910260, 873303, 834019, 793864, 754602, 717639, 683626, 652601, 624244, 598052, 573653, 551159, 531081, 513717, 498719, 485356, 473162, 462199, 452753, 444971, 438772, 433865, 429764, 425967, 422283, 418879, 415892, 413171, 410556, 408200, 406317, 404748, 403130, 401466, 400096, 399060, 397934, 396556, 395557, 395832, 397645, 400527, 403924, 407604, 411475, 415348, 419022, 422477, 425818, 429045, 431931, 434117, 435315, 435357, 434121, 431583, 428020, 423960, 419733, 415304, 410806, 407002, 404695, 403675, 402864, 401659, 400610]
63454D00610j78M64L80K82J005K331L441M067M634N503O603P704Q660R390R907
63439D64803J0410J1159J2287J3915J6325J9823K4314K9095L3050L5033L4251
63428G04465L0613K4882J8454J2800Q941P224P475R315J2409J6507K1298K6340
63416I00723L1292L6142M1012M5466M8185M7669M3377L6064K6944J6981P050j720
63404A279185q403j2784j5051j5264j3799j1989j1494j2919j5825j9964k5498
63393A116195l1731l6816l9494m0381m0781m0832l9706l7161l3984l1000k8360
63382G15949k5786k2993j9971j7133j4929j3025j0352o476k362Q40L151N293P375
63369E99581R046J0460J2019J3449J4153J4429J5268J7010J9101K1187K3506K6188
$$ y = [400610, 400432, 400896, 401276, 401558, 402563, 404894, 408335, 412402, 417036, 422539, 429142, 436846, 445506, 454896, 464803, 475213, 486372, 498659, 512574, 528899, 548722, 573036, 602131, 635181, 670214, 704465, 735078, 759960, 778414, 791214, 800155, 807379, 814854, 824169, 836578, 853085, 874383, 900723, 932015, 968157, 1009169, 1054635, 1102820, 1150489, 1193866, 1229930, 1256874, 1273855, 1280905, 1279185, 1270782, 1257998, 1242947, 1227683, 1213884, 1201895, 1190401, 1177482, 1161657, 1141693, 1116195, 1084464, 1047648, 1008154, 967773, 926992, 886160, 846454, 809293, 775309, 744309, 715949, 690163, 667170, 647199, 630066, 615137, 602112, 591760, 585284, 582922, 583762, 586913, 592206, 599581, 608627, 619087, 631106, 644555, 658708, 673137, 688405, 705415, 724516, 745703, 769209, 795397]
63357G95397K9134L2600L6926M1566M5311M7564M8350M7057M2460L4434K4609
63346A225408J4830N894j831p717j1524j3802j4956j4754j3485j2715j3991j7285
63334A124072k1469k5732k9786l3277l5883l7746l9023l9306l8047l5294l1520
63323G56989k7170k2745j8746j4884j0107m359K32J018k447q160j3826j8301k1117
63310E96377k1930k0922j8963j6912j5089j3540j2260j1013r388p350n363l818
63298D39829k677j774j163r54j084j438k003k778l642m391m809m819m635m646
63284C99016m955n138m715l789k972k649k576k264j600r44p03q72j073r83o55
63269C63128m01m97j001j627j733q20P60J948K218K161K434K695K425K218L019
$$ y = [795397, 824531, 857131, 894057, 935623, 980934, 1028498, 1076848, 1123905, 1166365, 1200799, 1225408, 1240238, 1246132, 1244301, 1236584, 1225060, 1211258, 1196302, 1181548, 1168063, 1155348, 1141357, 1124072, 1102603, 1076871, 1047085, 1013808, 977925, 940179, 901156, 861850, 823803, 788509, 756989, 729819, 707074, 688328, 673444, 663337, 658978, 659210, 660228, 657781, 649621, 635795, 617494, 596377, 574447, 553525, 534562, 517650, 502561, 489021, 476761, 465748, 456360, 449010, 443647, 439829, 437152, 435378, 434215, 433261, 432177, 430739, 428736, 425958, 422316, 417925, 413116, 408297, 403662, 399016, 394061, 388923, 384208, 380419, 377447, 374798, 372222, 369958, 368358, 367414, 366711, 365839, 364766, 363783, 363128, 362727, 362230, 361229, 359602, 357869, 357049, 357809, 359757, 361975, 364136, 366570, 369265, 371690, 373908, 376927]
63254C76927M354M685L698K814L067L782M108M522N786P428Q411Q671Q906R352
63240D56511R835J0518J1704J3158J4478J5770J7234J8548J9535K0795K2795K4841
63228F55722K6059K6808K7842K8577K7753K5670K4155K4111K4587K4585K4410
63217I40279K4685K5308K5992K6860K7681K7500K5719K2925J9823J6062J0876
63206A193710M461k092p989j3288j8443k3728k8913l3164l5495l5653l4342l2404
63194I32660l0068k7219k3937k0451j6916j3592j0882q828o865m417j512J464
63182G69437M350P224R980J2269J3771J4425J4553J4804J5658J6840J7520J7297
63170I28128J6690J6466J6746J6958J6390J4673J1995R028O281L417l80n248j0315
$$ y = [376927, 381281, 385966, 389664, 392478, 395545, 399327, 403435, 407957, 413743, 421171, 429582, 438253, 447159, 456511, 466346, 476864, 488568, 501726, 516204, 531974, 549208, 567756, 587291, 608086, 630881, 655722, 681781, 708589, 736431, 765008, 792761, 818431, 842586, 866697, 891284, 915869, 940279, 964964, 990272, 1016264, 1043124, 1070805, 1098305, 1124024, 1146949, 1166772, 1182834, 1193710, 1198171, 1196079, 1188090, 1174802, 1156359, 1132631, 1103718, 1070554, 1035059, 999406, 965064, 932660, 902592, 875373, 851436, 830985, 814069, 800477, 789595, 780767, 773902, 769485, 767973, 769437, 773787, 781011, 790991, 803260, 817031, 831456, 846009, 860813, 876471, 893311, 910831, 928128, 944818, 961284, 978030, 994988, 1011378, 1026051, 1038046, 1047074, 1053355, 1056772, 1056392, 1051144, 1040829]
63157A040829j4775j8802k2840k6545k9004k9882k9753k9331k8796k7919k6453
63146G56729k4336k1771j9220j7159j5736j4709j3675j2311j0567q704p042n629
63134E85870m330l227k606k386j931p89O83J779K469L465N240P318Q774R267R280
63119F18876R337R219Q268O424M574L586L277K753J631M15k79l78q1M84J057J164
63103F70327O48l8l57l85n54j000j543k106k740l210l020j989o00L64M99J14j30
63086F54280Q9L90K18l30m84K23J347K102K316K475L013L882M776N499O100O807
63070F92703P786Q823R460R641R943J0863J2055J2852J3406J4685J7169K0127
63058H39513K2593K4581K6839K9686L2680L5491L8442M1900M5551M8784N1594
$$ y = [1040829, 1026054, 1007252, 984412, 957867, 928863, 898981, 869228, 839897, 811101, 783182, 756729, 732393, 710622, 691402, 674243, 658507, 643798, 630123, 617812, 607245, 598541, 591499, 585870, 581540, 578313, 575707, 573321, 571390, 570601, 571284, 573063, 575532, 578997, 584237, 591555, 600329, 609596, 618876, 628213, 637432, 645700, 652124, 656698, 660284, 663561, 666314, 667945, 668360, 668081, 667703, 667622, 668106, 669163, 670327, 670975, 670937, 670580, 670195, 669641, 668641, 667098, 664992, 662252, 659042, 656022, 654033, 653433, 653797, 654296, 654410, 654280, 654369, 654759, 654977, 654647, 654163, 654386, 655733, 657835, 660151, 662626, 665639, 669521, 674297, 679796, 685896, 692703, 700489, 709312, 718772, 728413, 738356, 749219, 761274, 774126, 787532, 802217, 819386, 839513, 862106, 886687, 913526, 943212, 975892, 1011383, 1049825, 1091725, 1137276, 1186060, 1237654]
63047A237654N4579N7945O1019O2968O3740O3864O3577O2584O0781N8763N7390
63036A904864N7021N7328N7725N7823N7628N7361N6944N5573N2029M5608L6655
63025B496559K6010J4156J181j2591k6388l9510n1681o2717p2026p8796q2645
63014B111552q3950q3374q1233p7294p1311o3669n5442m7708m0780l4144k7178
63003A445469j9837j2568n753N87O530J1901J6316J9589K1949K3840K5447K6531
62991A560001K6845K6707K6930K7956K9196K9595K8794K7291K5442K2923J9440
62980A851120J5345J0819N059k820j2178k1180k8892l5994m3065m9176n3032n4780
62968A581226n5647n6189n5912n4531n2508n0176m7256m3647m0009l7047l4674
$$ y = [1237654, 1292233, 1350178, 1411197, 1474165, 1537905, 1601769, 1665346, 1727930, 1788711, 1847474, 1904864, 1961885, 2019213, 2076938, 2134761, 2192389, 2249750, 2306694, 2362267, 2414296, 2459904, 2496559, 2522569, 2536725, 2537906, 2525315, 2498927, 2459417, 2407736, 2345019, 2272993, 2194197, 2111552, 2027602, 1944228, 1862995, 1785701, 1714390, 1650721, 1595279, 1547571, 1506791, 1472647, 1445469, 1425632, 1413064, 1407311, 1407898, 1414428, 1426329, 1442645, 1462234, 1484183, 1508023, 1533470, 1560001, 1586846, 1613553, 1640483, 1668439, 1697635, 1727230, 1756024, 1783315, 1808757, 1831680, 1851120, 1866465, 1877284, 1882343, 1879523, 1867345, 1846165, 1817273, 1781279, 1738214, 1689038, 1636006, 1581226, 1525579, 1469390, 1413478, 1358947, 1306439, 1256263, 1209007, 1165360, 1125351, 1088304, 1053630]
62957A053630l2370l0007k7963k6558k5767k5311k4737k3635k2072k0661j9857
62946G74692j9311j8295j6690j5150j4212j3650j2909j1853j0814j0037r434q791
62934F13546p984o944n690m458l542k948k466k215k647l690m293l395j276O66
62920E62664J415J102K72q28j979k722k899k973l324l613l418l092l336m122m730
62905E28417m727m317l701k820j843j225j081r28m38O2J72J12M10R78J095L39
62889E10505p94j466j457j288j386j454r68%Q08J085J076J124J149R46N78J84
62873E08642k69p76j055q92n31l66m39n32n72o91r17j103j044n93J42O68N51J27
62855E00350K74J235K251K606K503K376K090J486J088J361J761J409M40k55l83
$$ y = [1053630, 1021260, 991253, 963290, 936732, 910965, 885654, 860917, 837282, 815210, 794549, 774692, 755381, 737086, 720396, 705246, 691034, 677384, 664475, 652622, 641808, 631771, 622337, 613546, 605562, 598618, 592928, 588470, 584928, 581980, 579514, 577299, 574652, 570962, 566669, 563274, 561998, 562664, 564079, 565181, 565453, 564625, 562646, 559924, 557025, 554052, 550728, 547115, 543697, 540605, 537269, 533147, 528417, 523690, 519373, 515672, 512852, 511009, 509784, 508703, 507775, 507337, 507399, 507571, 507683, 508093, 509071, 510166, 510505, 509711, 508245, 506788, 505500, 504114, 502660, 501692, 501692, 502500, 503585, 504661, 505785, 506934, 507880, 508458, 508642, 508373, 507597, 506542, 505650, 505119, 504753, 504314, 503782, 503210, 502519, 501602, 500499, 499455, 498862, 499004, 499672, 500223, 500350, 500624, 501859, 504110, 506716, 509219, 511595, 513685, 515171, 516259, 517620, 519381, 520790, 521230, 520975, 520592]
62840E20592l75l84j46J78M3n58j061j269j401j277m67O52J041M80j10p1K51N14
62822E16632J079K132L046L192K774K363K241K585L515M514M653L896L359L837
62808E59818M824N511N840N881N204L864L118M031N980P583Q520R308R797R393
62794F48672Q523Q562J0052J2168J4128J6149J8682K1587K4605K8005L2212L7213
62782H80558M2632M8174N3785N9612O5822P2320P8714Q4786R0773R6697J01668
62771A675541J04430J04537J02340R7929R0810Q0743O8175N3566L6991J8808J70
62760B434040j7666l4178m9294o2631p3632q2284q9061r4077r6795r6836r4754
62749A642832r1576q7844q3429p8371p3324o8886o4794o0284n5155m9946m5079
$$ y = [520592, 520217, 519833, 519687, 519865, 519908, 519350, 518289, 517020, 515619, 514342, 513875, 514527, 515568, 516048, 515938, 515867, 516118, 516632, 517711, 519843, 522889, 526081, 528855, 531218, 533459, 536044, 539559, 544073, 548726, 552622, 555981, 559818, 564642, 570153, 575993, 581874, 587078, 590942, 594060, 598091, 604071, 611654, 620174, 629482, 639279, 648672, 657195, 665757, 675809, 687977, 702105, 718254, 736936, 758523, 783128, 811133, 843345, 880558, 923190, 971364, 1025149, 1084761, 1150583, 1222903, 1301617, 1386403, 1477176, 1573873, 1675541, 1779971, 1884508, 1986848, 2084777, 2175587, 2256330, 2324505, 2378071, 2415062, 2433870, 2434040, 2416374, 2382196, 2332902, 2270271, 2196639, 2114355, 2025294, 1931217, 1834422, 1737586, 1642832, 1551256, 1463412, 1379983, 1301612, 1228288, 1159402, 1094608, 1034324, 979169, 929223, 884144]
62738H84144m0339l5496l0924k7198k4332k1817j9324j6946j4914j3330j2167
62727F27357j1200j0017q370o540n070m080l167k023r21l17j20L45J573L282M795
62712E85527N898P055Q690J0606J2360J3951J5764J8042K0793K4047K7836L1909
62700G82478L5878L9594M3061M6160M8880N1672N5080N8943O2587O5681O8277
62689A358291O9952O9672O6767O1474N4312M5516L5209K3631J0894k850j6790
62678A776078k9652m0734n0140n7813o3172o6129o7620o8504o8590o7275o4576
62667A131873o0915n6525n1715m7191m3406m0005l6513l3069k9944k6915k3829
62656F81846k1222j9566j8358j6757j4762j2960j1506j0177r106q608q533q496
$$ y = [884144, 843805, 808309, 777385, 750187, 725855, 704038, 684714, 667768, 652854, 639524, 627357, 616157, 606140, 597770, 591230, 586160, 582080, 578913, 576890, 575969, 575652, 575532, 575877, 577450, 580732, 585527, 591425, 598480, 607170, 617776, 630136, 644087, 659851, 677893, 698686, 722733, 750569, 782478, 818356, 857950, 901011, 947171, 996051, 1047723, 1102803, 1161746, 1224333, 1290014, 1358291, 1428243, 1497915, 1564682, 1626156, 1680468, 1725984, 1761193, 1784824, 1795718, 1792868, 1776078, 1746426, 1705692, 1655552, 1597739, 1534567, 1468438, 1400818, 1332314, 1263724, 1196449, 1131873, 1070958, 1014433, 962718, 915527, 872121, 832116, 795603, 762534, 732590, 705675, 681846, 660624, 641058, 622700, 605943, 591181, 578221, 566715, 556538, 547432, 538824, 530291, 521795]
62644E21795q450q317p515n777m023l353l440k949j434L26J685K630K938K141
62630D86257N83o02j027j532k633l499l166k016j193j054r46k86Q13J907K774
62615D74380L460M101M778N492O121O412O075N228M680N317P001Q647R642J0561
62601E61895J2027J3622J4752J5930J8181K1513K5080K8579L2351L6236L9569
62590H19735M2418M5605M9167N1828N2446N1064M8164M3803L7953L0926K2872
62579A295981J3582L307o828j5781k3473l0230l5815l9668m1742m2644m3080m3434
62567I90175m3596m2982m1060l8053l4861l2119k9669k7072k4257k1490j9041
62556F35975j6999j5153j3052j0621q591p764p876p808o890n417l907k628j959
$$ y = [521795, 513345, 505028, 497513, 491736, 487713, 484360, 480920, 477971, 476537, 476863, 478548, 481178, 484116, 486257, 486840, 486238, 485211, 483679, 481046, 477547, 474381, 472365, 471172, 470118, 469172, 468886, 469699, 471606, 474380, 477840, 481941, 486719, 492211, 498332, 504744, 510819, 516047, 520727, 526044, 533045, 541692, 551334, 561895, 573922, 587544, 602296, 618226, 636407, 657920, 683000, 711579, 743930, 780166, 819735, 862153, 907758, 956925, 1008753, 1061199, 1112263, 1160427, 1204230, 1242183, 1273109, 1295981, 1309563, 1312870, 1306042, 1290261, 1266788, 1236558, 1200743, 1161075, 1119333, 1076689, 1033609, 990175, 946579, 903597, 862537, 824484, 789623, 757504, 727835, 700763, 676506, 655016, 635975, 618976, 603823, 590771, 580150, 571559, 563795, 555919, 548111, 541221, 535804, 531897, 529269, 527310]
62543E27310k272l179l587k942j772p74p5L62L25j53n72o42n80m36K07J375K306
62526E14901K482K443L094M609O597Q775J1000J3024J4747J6411J8212K0193K2635
62513F59123K5934K9752L3097L5617L8086M1039M3817M5520M6146M5979M4705
62502A088815M2041L8547L4701K9806K3027J5170Q161K964q33l453m242k749N16
62489A272471M833R912J5543K1315K7060L2971L9072M5114N1307N8340O6105P2593
62477A716636P4613O9818N8385M3263K8633J7208Q304j405j4883l2231n0760o7008
62465A850573p8705q5482q8419q9070q8581q7351q5119q1412p6089o9614o2607
62454I58124n5170m7121l9044l2391k7995k4928k1602j7672j4051j1243q664n844
$$ y = [527310, 525038, 521859, 518272, 515330, 513558, 512784, 512709, 513071, 513396, 513243, 512671, 512029, 511449, 511013, 511220, 512595, 514901, 517383, 519826, 522920, 527529, 534126, 542901, 553901, 566925, 581672, 598083, 616295, 636488, 659123, 685057, 714809, 747906, 783523, 821609, 862648, 906465, 951985, 998131, 1044110, 1088815, 1130856, 1169403, 1204104, 1233910, 1256937, 1272107, 1280268, 1283232, 1282399, 1278946, 1274704, 1271955, 1272471, 1277304, 1287216, 1302759, 1324074, 1351134, 1384105, 1423177, 1468291, 1519598, 1577938, 1644043, 1716636, 1791249, 1861067, 1919452, 1962715, 1991348, 2008556, 2016860, 2015455, 2000572, 1968341, 1917581, 1850573, 1771868, 1686386, 1597967, 1508897, 1420316, 1332965, 1247846, 1166434, 1090345, 1020731, 958124, 902954, 855833, 816789, 784398, 756403, 731475, 709873, 692201, 678150, 666907, 658243, 652399]
62442F52399l254j466k19J100K504L652M661N939P298P918P302N792L984K056
62428F99666r0k394m653o709q362r338r653r822j0288j0801j0798j0284r718r065
62414E87691p798o116n280o039p390p745o895n922n427m977m243l579l177k597
62400E10506j575n64o4M4J16L76J111K594M324N088M301K734J559J183J482K366
62384E35581L467L958L590L345M276O024P374P898Q139Q454Q667Q826R373J0382
62370F29354J1352J1910J2231J2682J3565J5154J7412J9707K1465K3104K5738
62359H13674K9885L5089M0791M6902N3308N9511O4998O9374P1976P1895O8737
62348A426140O2923N5025M5400L4694K4077J4377N444l189j1378j8685k5245l1635
$$ y = [652399, 649145, 647679, 647460, 648560, 651064, 654716, 659377, 665316, 672614, 680532, 687834, 693626, 697610, 699666, 699576, 697182, 692529, 685820, 677458, 668120, 658467, 648645, 638357, 627556, 616758, 606474, 596756, 587691, 579893, 573777, 568497, 562458, 555068, 547323, 540428, 534506, 529079, 524102, 519859, 516280, 513103, 510506, 508931, 508367, 508303, 508347, 508463, 508839, 509950, 512544, 516868, 521956, 526257, 528991, 530550, 531733, 533215, 535581, 539048, 543006, 546596, 549941, 554217, 560241, 567615, 575513, 583652, 592106, 600773, 609599, 618972, 629354, 640706, 652616, 664847, 677529, 691094, 706248, 723660, 743367, 764832, 787936, 813674, 843559, 878648, 919439, 966341, 1019649, 1079160, 1144158, 1213532, 1285508, 1357403, 1426140, 1489063, 1544088, 1589488, 1624182, 1648259, 1662636, 1668080, 1664891, 1653513, 1634828, 1609583, 1577948]
62336A577948l7931m3471m7547m9925n0648m9823m7761m4939m1642l7899l3908
62325A092454l0180k7101k4670k2924k2224k2626k3294k3181k2330k1809k2169
62314H29946k2621k2093k0561j8736j6882j4708j2227r951q134o486m774l141
62302F69632j704l34R05J588J523J174J152J539J902J771J021M5m39j03M72M21
62286F80565k56p42o47m42m81m12J7L30J47J2O78J967L089L777M425N277O215
62269G03519P226Q524J0056J1419J2318J2901J3652J5151J7731K1210K5154K9601
62257H88462L5088M1748M8833N5517O1693O7431P2169P4921P5059P2318O6499
62246A559738N7866M7519L6655K5697J4719M356m685j2834k1377l0855m0448m9048
$$ y = [1577948, 1540017, 1496546, 1448999, 1399074, 1348426, 1298603, 1250842, 1205903, 1164261, 1126362, 1092454, 1062274, 1035173, 1010503, 987579, 965355, 942729, 919435, 896254, 873924, 852115, 829946, 807325, 785232, 764671, 745935, 729053, 714345, 702118, 692167, 684033, 677547, 672773, 669632, 667928, 667594, 668499, 670087, 671610, 672784, 673936, 675475, 677377, 679148, 680169, 680214, 679775, 679672, 680144, 680565, 680309, 679567, 678920, 678478, 677997, 677585, 677602, 677932, 678079, 678091, 678769, 680736, 683825, 687602, 692027, 697304, 703519, 710745, 719269, 729325, 740744, 753062, 765963, 779615, 794766, 812497, 833707, 858861, 888462, 923550, 965298, 1014131, 1069648, 1131341, 1198772, 1270941, 1345862, 1420921, 1493239, 1559738, 1617604, 1665123, 1701778, 1727475, 1742194, 1746550, 1741865, 1729031, 1707654, 1676799, 1636351, 1587303]
62234A587303n6178o1617o4937o5917o4945o2703n9623n5874n1573m6831m1832
62223I55273l6890l2286k8031k4077k0607j7870j5795j4130j2820j1874j1002
62212G29891r838q421p024n676m349l440l369l671l204j503O37K150K810L093
62198F88086L409L870M539N498O661P714Q328Q437Q345Q456Q826R144R250R482
62184G90045J0265J1551J2896J3936J4552J4704J4360J3469J1891R609P177N578
62172I30033N341O143P540R649J2731J6601K0934K5816L1328L7003M2208M6767
62160A192094N0529N2733N2480M9631M4527L7231K7934J7864Q800J520m518j0038
62148A520787j5330k0667k6364l2109l7010m0620m3226m4918m5041m3027l9313
$$ y = [1587303, 1531125, 1469508, 1404571, 1338654, 1273709, 1211006, 1151383, 1095509, 1043936, 997105, 955273, 918383, 886097, 858066, 833989, 813382, 795512, 779717, 765587, 752767, 740893, 729891, 720053, 711632, 704608, 698932, 694583, 691143, 687774, 684103, 680899, 679396, 680033, 682183, 684993, 688086, 691495, 695365, 699904, 705402, 712063, 719777, 728105, 736542, 744887, 753343, 762169, 771313, 780563, 790045, 800310, 811861, 824757, 838693, 853245, 867949, 882309, 895778, 907669, 917278, 924455, 930033, 935374, 941517, 949057, 958706, 971437, 988038, 1008972, 1034788, 1066116, 1103119, 1145327, 1192094, 1242623, 1295356, 1347836, 1397467, 1441994, 1479225, 1507159, 1525023, 1533823, 1535343, 1530825, 1520787, 1505457, 1484790, 1458426, 1426317, 1389307, 1348687, 1305461, 1260543, 1215502, 1172475, 1133162]
62137A133162l5072l1233k7911k4547k0652j6585j3439j1789j0938r888q664p998
62125I14446q013q071p786p265o493n320m017k926j689K60K522M134N101O232
62111H81115P263O573L411p86m011n711o449o457n515l865k376j937k944n018
62097H53293p001p788p412o740o055m800k919j374p65m31L76J347J999K797M314
62082H18841N878O277N532M969N595P263R353J1449J3299J4803J6132J7478J8702
62069I55571J9621K0443K1453K2485K3305K4368K6566L0093L4009L7005L8360
62058A253279L8042L6257L2960K7833K0811J2707N027j109n814j0044j4537j9359
62046A376053k4256k9136l4083l8948m3047m5495m6116m5723m5193m4480m2976
$$ y = [1133162, 1098090, 1066857, 1038946, 1014399, 993747, 977162, 963723, 951934, 940996, 931108, 922444, 914446, 906433, 898362, 890576, 883311, 876818, 871498, 867481, 864555, 862866, 863126, 865648, 869782, 874883, 881115, 888378, 894951, 898362, 897576, 893565, 887854, 881405, 874948, 869433, 865568, 863192, 861255, 858311, 853293, 846292, 838504, 831092, 824352, 818297, 813497, 810578, 809204, 808439, 808008, 808384, 809731, 811730, 814527, 818841, 824719, 830996, 836528, 841497, 847092, 854355, 863708, 875157, 888456, 903259, 919391, 936869, 955571, 975192, 995635, 1017088, 1039573, 1062878, 1087246, 1113812, 1143905, 1177914, 1214919, 1253279, 1291321, 1327578, 1360538, 1388371, 1409182, 1421889, 1426916, 1425807, 1419993, 1409949, 1395412, 1376053, 1351797, 1322661, 1288578, 1249630, 1206583, 1161088, 1114972, 1069249, 1024056, 979576, 936600]
62035I36600m0575l7715l4567l1034k7514k4705k2576k0387j7951j5932j4595
62024F49049j3322j1822j0794j0702j0886j0588j0062r704r028p515n845n095
62012E33686n146n024m481m080l919l428k448j453n89N36J896K785K833K618K880
61997E16666L679M555N064M889L977K798K116K149K176J288o64l008n035o647
61983E34003q196r785j0873j0819r774q624p948p389o364n018m023l711l836m049
61969D33594m161l993l357k291j097j71J78o0m23k95L96J069J280J286J530J938
61953D25423K111J967J767J729J955K569L529M487N126N570O111O778P438Q186
61939D84746R274J0760J2406J3817J4565J4465J3821J3158J2596J1855J0899J0057
$$ y = [936600, 896025, 858310, 823743, 792709, 765195, 740490, 717914, 697527, 679576, 663644, 649049, 635727, 623905, 613111, 602409, 591523, 580935, 570873, 561169, 552141, 544626, 538781, 533686, 528540, 523516, 519035, 514955, 511036, 507608, 505160, 503707, 503118, 503654, 505550, 508335, 511168, 513786, 516666, 520345, 524900, 529964, 534853, 538830, 541628, 543744, 545893, 548069, 549357, 548693, 545685, 540650, 534003, 525807, 516022, 505149, 494330, 484556, 475932, 467984, 460595, 454231, 449213, 445190, 441479, 437643, 433594, 429433, 425440, 422083, 419792, 418695, 418524, 418702, 418642, 418219, 417924, 418320, 419389, 420669, 421955, 423485, 425423, 427534, 429501, 431268, 432997, 434952, 437521, 441050, 445537, 450663, 456233, 462344, 469122, 476560, 484746, 494020, 504780, 517186, 531003, 545568, 560033, 573854, 587012, 599608, 611463, 622362, 632419]
61927F32419R362Q386P040N788M700L007K55k669m487n042n179n444n693n704
61913F36739n397m506k792n63J564L382N137O967Q807J0728J2782J4461J4807
61900G02116J3224J0070O436L393J165r81l725o529q081q019p406p201p152o776
61886F80534o399o444o477o041n692o130o918p271p572q703j0222j0772j0172
61873E81721r605r612r345q222o898n993n023l426j716p74n57k78N29J700K928
61858E25429M140N529P370R586J1524J2637J3337J4630J6817J9215K1186K2772
61846F84172K4108K4985K5230K4955K4099K2315J9544J6155J2325P893L078j347
61834H87512m940p987j0573j1984j1559r657p176m567j835R39L713O761J0063
$$ y = [632419, 641781, 650167, 657207, 662995, 667695, 670702, 670957, 668288, 663801, 658759, 653580, 648136, 642443, 636739, 631342, 626836, 624044, 623481, 625045, 628427, 633564, 640531, 649338, 660066, 672848, 687309, 702116, 715340, 725410, 731846, 735239, 736404, 735423, 731698, 725169, 717088, 709069, 701663, 694462, 687310, 680534, 674135, 667691, 661214, 655173, 649481, 643351, 636433, 629162, 621590, 612887, 602665, 591893, 581721, 572116, 562504, 553159, 544937, 538039, 532046, 527023, 523597, 521881, 521107, 520550, 520272, 520801, 522501, 525429, 529569, 535098, 542468, 552054, 563578, 576215, 589552, 604182, 620999, 640214, 661400, 684172, 708280, 733265, 758495, 783450, 807549, 829864, 849408, 865563, 877888, 885781, 888859, 887512, 882572, 874585, 864012, 852028, 840469, 830812, 823636, 819069, 817234, 818173, 821886, 828647, 838710]
61821H38710J2682J3462J2365J0473Q562O249K790j711o310j0227j3349j5711
61809H57985j6972j6850j5905j5259j5382j5539j4881j3694j3083j3592j4612
61798F92216j5147j4709j3520j2172j1137j0312r136p459o001n524n712n507m503
61785E71377l434l161l683m259m160l229k056j552j982k614k634k227k079k129
61771E32178j649o22n1n67j433j414p1K061M096N225N086M129L340L312L876M713
61755E62209N796O997P778P652O669N104L087P71j487l449n177o616p369p249
61741E74716o696o318o155n802n070m226l690l660l940l975l242j792k71O57Q57
61726E21393O82N86Q16J187J248Q64N43Q61J675K310K458K345K075J454O14J32
$$ y = [838710, 851392, 864854, 877219, 887692, 896254, 902503, 905293, 903582, 897272, 887045, 873696, 857985, 841013, 824163, 808258, 792999, 777617, 762078, 747197, 733503, 720420, 706828, 692216, 677069, 662360, 648840, 636668, 625531, 615219, 606083, 598624, 592623, 587099, 581387, 575880, 571377, 567943, 564782, 561099, 556840, 552680, 549451, 547395, 545843, 543861, 541247, 538613, 536386, 534307, 532178, 530529, 529907, 529856, 529289, 527856, 526442, 526371, 528432, 532528, 537753, 542839, 546968, 550308, 553620, 557496, 562209, 568005, 575002, 582780, 590432, 597101, 602205, 605292, 606063, 604576, 601127, 595950, 589334, 581965, 574716, 568020, 561702, 555547, 549745, 544675, 540449, 536759, 533099, 529159, 525184, 521942, 520150, 519879, 520536, 521393, 522075, 522661, 523477, 524664, 525912, 526776, 527319, 528180, 529855, 532165, 534623, 536968, 539043, 540497, 541111, 541243]
61710E41243K31L90Q3n55j170j802k654l589m280m632m747m643m388m205m197
61695E01085m171l983l867m032m244m176l959l922l926l490k653k174k605l451
61681D50432l722l133k340j940j744j320q27p90j225j598j668j724j914j937j646
61666D22904j374j283j035m27J84N95J203K209K994K980K596K614L049L492L976
61651D44677M605M790L937K591J753J387P40m5J2J038J944J983J545J188R41Q55
61635D73941J156J530J301N94L42Q24J237J049O65K95o38k342l991m949n631o404
61619D58979o583n471l646k279j737j640j720j862j782j435j357j961k885l593
61605D21028m104m599m838m575m107l848l788l789l930m143m082l759l602l497
$$ y = [541243, 541474, 541864, 541947, 541392, 540222, 538420, 535766, 532177, 527897, 523265, 518518, 513875, 509487, 505282, 501085, 496914, 492931, 489064, 485032, 480788, 476612, 472653, 468731, 464805, 461315, 458662, 456488, 453883, 450432, 446710, 443577, 441237, 439297, 437553, 436233, 435406, 434616, 433391, 431793, 430125, 428401, 426487, 424550, 422904, 421530, 420247, 419212, 418785, 418969, 419564, 420767, 422976, 425970, 428950, 431546, 434160, 437209, 440701, 444677, 449282, 454072, 458009, 460600, 462353, 463740, 464480, 464435, 464447, 465485, 467429, 469412, 470957, 472145, 473086, 473941, 475097, 476627, 477928, 478522, 478864, 479688, 480925, 481974, 482639, 482934, 482296, 479954, 475963, 471014, 465383, 458979, 452396, 446925, 443279, 441000, 439263, 437623, 435903, 434041, 432259, 430824, 429467, 427506, 424621, 421028, 416924, 412325, 407487, 402912, 398805, 394957, 391169, 387380, 383450, 379307, 375225, 371466, 367864, 364367]
61591C64367k706j290o21j507k785k881k013j558j783j643o58L20L62m82j576
61576C43546k350k399j669o76p5J13M19J124J871K091J500M02m03l01L28M81n4
61559C43948l16M06J552K242K440K439K051J261Q92J511K233J899R01N47Q92P67
61543C65665j81r83j083j101j427j356l63Q89J552J848K502L448L937L579K672
61528C79598J674Q02M5o91j462k088k276j969j429r30o68q71j553k151j913q71
61512C63247M8J01m40q20q00o81n54j58M87Q18M46j27o0O29J064Q45P42J566K884
61493C69237L676L855M105M397L847K304R17O53J120J478J571J581J384J091J434
61478D02650K709L969M248L953M036M283L642J966K63p55j315j714j829j664j634
$$ y = [364367, 361661, 360371, 359750, 358243, 355458, 352577, 350564, 349006, 347223, 345580, 344922, 345242, 345604, 345122, 343546, 341196, 338797, 337128, 336452, 336377, 336490, 336909, 338033, 339904, 341995, 343495, 343897, 343494, 343193, 343521, 344002, 343948, 343632, 344038, 345590, 347832, 350272, 352711, 354762, 356023, 356915, 358426, 360659, 362558, 363459, 364006, 364898, 365665, 365484, 364501, 363418, 362317, 360890, 359534, 359171, 360060, 361612, 363460, 365962, 369410, 373347, 376926, 379598, 381272, 382074, 382119, 381428, 379966, 377878, 375602, 373633, 372204, 371274, 370606, 369735, 368182, 366031, 364118, 363247, 363295, 363396, 362956, 362136, 361336, 360655, 360101, 359943, 360430, 361248, 361694, 361567, 361507, 362136, 363200, 364045, 364787, 366353, 369237, 372913, 376768, 380873, 385270, 389117, 391421, 392338, 392991, 394111, 395589, 397160, 398741, 400125, 401216, 402650, 405359, 409328, 413576, 417529, 421565, 425848, 429490, 431456, 431719, 430964, 429649, 427935, 426106, 424442, 422808]
61463D22808k001k630l324l895m000l427k570k014j745j312o17K5M78P74O87K5
61447C97262p80j091r34p34l57O95K130K887K494J627J118J128J492K142K835
61432D11914L117K839K322J792J159N07J79J75P3k42j96O87K110L316L860L790
61416D37402L365K813K234J593R31M57K39km71q36o31p7Q3n05j409k028k163j953
61398D39042j594j264j072r84r19q47p13m75l34n31p83l70Q17J971K462K686L202
61381D40294L670L483K952K932L524M082M312M448M490M169L647L399L374K996
61367D91772K060R49J8o25q61p68q99j603k322k284j646j083n28N83K026K911
61351D87700L171L780N246O863P690P412O123M126K146R24M05P8L5P29J755K021
$$ y = [422808, 420807, 418177, 414853, 410958, 406958, 403531, 400961, 398947, 397202, 395890, 395273, 395298, 395776, 396550, 397237, 397262, 396482, 395391, 394457, 393723, 393366, 394061, 396191, 399078, 401572, 403199, 404317, 405445, 406937, 409079, 411914, 415031, 417870, 420192, 421984, 423143, 423650, 423829, 424004, 424077, 423835, 423639, 424326, 426436, 429752, 433612, 437402, 440767, 443580, 445814, 447407, 448338, 448795, 449034, 449032, 448561, 447725, 447094, 447017, 447100, 446595, 445186, 443158, 440995, 439042, 437448, 436184, 435112, 434128, 433209, 432362, 431649, 431174, 430840, 430309, 429526, 429156, 429973, 431944, 434406, 437092, 440294, 443964, 447447, 450399, 453331, 456855, 460937, 465249, 469697, 474187, 478356, 482003, 485402, 488776, 491772, 493832, 494781, 494799, 494174, 493313, 492545, 491646, 490043, 487721, 485437, 483791, 482708, 482180, 482763, 484789, 487700, 490871, 494651, 499897, 506760, 514450, 521862, 527985, 532111, 534257, 535181, 535586, 535664, 535699, 536428, 538183, 540204]
61335E40204J292M93J97Ll82n37l08k93q39j425j573j510j538j540j448j396j065
61318E28335J08J863L222L994N019O519P561P723P998R211J0784J2013J3410J5593
61304F33353J7832J8933J8809J8026J6487J3793J0370P029L831N31k305l900m705
61291G48084o006q160j0225j1372j1668j1399j0684r885r583r813r936r459q481
61278F21413p206n602l693j742J4J476K456K759K514K103J722J334J039J088J443
61263F21118J726J776K002K931M507O057O936P025O541N566M091K443J213N69
61249F74501P5n11q30o98p42j466k204k034j370j468k381k737j846p40n80j121
61233F53848j447j325r79k71J023K527L581L999M107M368N216O718Q100Q302P360
$$ y = [540204, 541496, 541989, 542186, 542189, 541807, 541270, 540962, 540669, 539830, 538405, 536832, 535322, 533784, 532244, 530796, 529400, 528335, 528443, 530306, 533528, 537522, 542541, 549060, 556621, 564344, 572342, 581553, 592337, 604350, 617760, 633353, 651185, 670118, 688927, 706953, 723440, 737233, 747603, 754632, 758463, 758994, 756689, 752789, 748084, 742078, 733918, 723693, 712321, 700653, 689254, 678570, 668685, 659102, 649289, 639353, 629894, 621413, 614207, 608605, 604912, 603170, 603184, 604660, 607116, 609875, 612389, 614492, 616214, 617548, 618587, 619675, 621118, 622844, 624620, 626622, 629553, 634060, 640117, 647053, 654078, 660619, 666185, 670276, 672719, 673932, 674501, 674576, 674065, 673235, 672537, 671795, 670329, 668125, 666091, 664721, 663253, 660872, 658135, 656289, 655549, 654969, 653848, 652401, 651076, 650097, 649826, 650849, 653376, 656957, 660956, 665063, 669431, 674647, 681365, 689465, 697767, 705127]
61218G05127O559O761P432P794Q038Q583Q957Q409P120N876M956M164L589L442
61204G96807L427L093K659K794L707N049O476P801Q927J0216J2429J5621J8455
61191H97461J9409J8365J6239J3472R912N995K868J002l81k096l878m935n186
61178I68247n469o572q388j0044j0819j0815j0667j0725j0899j1177j1770j2514
61166H48388j2740j2201j1665j2076j3326j4344j4317j3407j2372j1723j1201
61155G09016j0063p943n417l353j810j36J866L610M712N424N667M519J436k528
61141G05000n566o922p252p384p393o870n617l907k154m58J359L137M189M268
61127F64430M332N555P766R798J1251J2814J4824J6763J8485K0581K3108K5160
$$ y = [705127, 711686, 718447, 725879, 733673, 741711, 750294, 759251, 767660, 774780, 780656, 785612, 789776, 793365, 796807, 800234, 803327, 805986, 808780, 812487, 817536, 824012, 831813, 840740, 850956, 863385, 879006, 897461, 916870, 935235, 951474, 964946, 974858, 980853, 983721, 984723, 984342, 982246, 978368, 973433, 968247, 962778, 956206, 947818, 937774, 926955, 916140, 905473, 894748, 883849, 872672, 860902, 848388, 835648, 823447, 811782, 799706, 786380, 772036, 757719, 744312, 731940, 720217, 709016, 698953, 691010, 685593, 682240, 680430, 680294, 682160, 685770, 690482, 695906, 701573, 706092, 707528, 705000, 699434, 692512, 685260, 677876, 670483, 663613, 657996, 654089, 651935, 651477, 652836, 655973, 660162, 664430, 668762, 674317, 682083, 691881, 703132, 715946, 730770, 747533, 766018, 786599, 809707, 834867]
61115H34867K6317K7273K8376K8850K8368K8082K8973L0148L0050K8520K6542
61104A146366K4705K2970K1322J9486J6631J2391P681L609K05k914n527p498r561
61091A249866j2181j4381j5015j4491j3919j3277j1900j0181r117q533p333n336
61079A114202l346j535P79L693O449Q635J0485J1984J2821J3314J4183J5372J6161
61066A223197J6401J6645J7034J7084J6655J6138J5630J4771J3390J1622R573
61055A388140P488N916M969L888K167M81m07r10j617j942j116J49N69L10N24J422
61039A410031K403L595N481P430Q394Q740R617J0866J1511J1923J3401J5865J8131
61026A537388K0293K3492K7309K9863L0690L1188L2022L2575L3286L5886M0760
$$ y = [834867, 861184, 888457, 916833, 945683, 974051, 1002133, 1031106, 1061254, 1091304, 1119824, 1146366, 1171071, 1194041, 1215363, 1234849, 1251480, 1263871, 1271552, 1275161, 1275366, 1272452, 1266925, 1259427, 1249866, 1237685, 1223304, 1208289, 1193798, 1179879, 1166602, 1154702, 1144521, 1135404, 1126871, 1119538, 1114202, 1110856, 1109321, 1110100, 1113793, 1120242, 1128877, 1139362, 1151346, 1164167, 1177481, 1191664, 1207036, 1223197, 1239598, 1256243, 1273277, 1290361, 1307016, 1323154, 1338784, 1353555, 1366945, 1378567, 1388140, 1395628, 1401544, 1406513, 1410401, 1412568, 1413049, 1412642, 1411732, 1410115, 1408173, 1407057, 1407206, 1407775, 1408085, 1408609, 1410031, 1412434, 1416029, 1421510, 1428940, 1437334, 1446074, 1455691, 1466557, 1478068, 1489991, 1503392, 1519257, 1537388, 1557681, 1581173, 1608482, 1638345, 1669035, 1700223, 1732245, 1764820, 1798106, 1833992, 1874752]
61015A874752M6700N3846O3933P6695Q8898R8334J06350J15475J27408J44449
61005B796840J69767K04583K48062L01400L68619M52146N52550O75482Q34071
60996F603520J041779J308834J645305K044785K437141K662948K540987K008668
60988B2293967J206874M08563j51095l83374l18127k6037L92223P63912Q65702
60979B5052608N50892j29172r44640j638733k070052k236962k209741k063472
60971A4310728j856252j630767j413446j214309j034894q76202p38785o20590
60963D925483n19051m33633l64155l08463k63608k27688j98999j75057j54136
60954B280693j36295j21496j08125r4794q2227p1650o2506n3575m5636m0990m0393
$$ y = [1874752, 1921452, 1975298, 2039231, 2115926, 2204824, 2303158, 2409508, 2524983, 2652391, 2796840, 2966607, 3171190, 3419252, 3720652, 4089271, 4541417, 5093967, 5769449, 6603520, 7645299, 8954133, 10599438, 12644223, 15081364, 17744312, 20285299, 22293967, 23500841, 23909404, 23758309, 23374935, 23056808, 23030771, 23422994, 24186906, 25052608, 25603500, 25474328, 24529688, 22890955, 20820903, 18583941, 16374200, 14310728, 12454476, 10823709, 9410263, 8195954, 7161060, 6284858, 5546073, 4925483, 4406432, 3972799, 3608644, 3300181, 3036573, 2808885, 2609886, 2434829, 2280693, 2144398, 2022902, 1914777, 1819983, 1737756, 1666106, 1603600, 1550025, 1504389, 1463399, 1423006]
60943A423006m1898m2919m2425m0987l9526l8353l7118l5423l3507l2005l0995
60932A007850k9771k7767k5251k2775k0567j8751j7579j6929j6116j4679j2970
60921G84695j1571j0502r516q653q054p498o753o017n556n104m247l172k527k510
60907F93015k671k575k246j894j600j439j544j910k327k670l071l623m148m474
60893F56823m858n740p003p888p896p546p724q437q709p836o266n047m801n485
60879E61587o635p529p507o601n557m884m284l411k729k875l477l414k260p29
60865D99695L85J019J495J973K530L266M053M583M860N320O189P052P201O254
60851E55875M326J988J88k38O84J979K633K413J673P16l46j300j890k185k630
$$ y = [1423006, 1381108, 1338189, 1295764, 1254777, 1215251, 1176898, 1139780, 1104357, 1070850, 1038845, 1007850, 978079, 950312, 925061, 902286, 881719, 862968, 845389, 828460, 812344, 797665, 784695, 773124, 762622, 753106, 744453, 736399, 728901, 722148, 716131, 710575, 705471, 701224, 698052, 695525, 693015, 690344, 687769, 685523, 683629, 682029, 680590, 679046, 677136, 674809, 672139, 669068, 665445, 661297, 656823, 651965, 646225, 639222, 631334, 623438, 615892, 608168, 599731, 591022, 583186, 576920, 571873, 567072, 561587, 554952, 547423, 539916, 533315, 527758, 522874, 518590, 515179, 512450, 509575, 506098, 502684, 500424, 499695, 500080, 501099, 502594, 504567, 507097, 510363, 514416, 518999, 523859, 529179, 535368, 542420, 549621, 555875, 560201, 562189, 562377, 562139, 562823, 564802, 567435, 569848, 571521, 572237, 571891, 570591, 568701, 566516, 563886]
60836E63886l603n052o571p760q401q406p765o665n554m873m668m583m326l933
60822D81726l553l155k729k560k992l887m623m724m357m081m237m605m667m179
60808D27377l406k783k408j996j397q81q40j299j890k147j771p36O40J791K243
60793D10497J936J232O28M28N93Q61J099J371J659J706J387J067J232J817K300
60778D29813K381K094J364P2j305j797j112k20k94j327k233k170j360o32m54n15
60762D22305k34M20P85L85l64o71m17j50j82l34n26r26j403j555j367j170q27
60745D13769J37J385J811J180O37Q77Q59o09k862m209m268m107m310m246l401
60730C92643k236j355p06l8M76N70M47N90J150J738J793J202N68O69J541K407
$$ y = [563886, 560283, 555231, 548660, 540900, 532499, 524093, 516328, 509663, 504109, 499236, 494568, 489985, 485659, 481726, 478173, 475018, 472289, 469729, 466737, 462850, 458227, 453503, 449146, 445065, 440828, 436223, 431556, 427377, 423971, 421188, 418780, 416784, 415387, 414506, 413666, 412367, 410477, 408330, 406559, 405823, 406463, 408254, 410497, 412433, 413665, 414293, 414721, 415314, 416175, 417274, 418645, 420304, 422010, 423397, 424464, 425696, 427513, 429813, 432194, 434288, 435652, 435724, 434419, 432622, 431510, 431290, 430996, 429669, 427436, 425266, 423906, 423274, 422820, 422305, 422071, 422491, 423276, 423661, 423297, 422626, 422209, 422059, 421877, 421543, 421017, 420091, 418688, 417133, 415766, 414596, 413769, 413906, 415291, 417102, 418282, 418919, 419796, 420655, 420046, 417184, 412975, 408707, 404600, 400290, 396044, 392643, 390407, 389052, 388346, 388308, 388784, 389354, 389801, 390391, 391541, 393279, 395072, 396274, 396842, 397511, 399052, 401459]
60714D01459K685K598K490K130J331P37J138K187K679K101J190P84Q08O09j07
60699D24819j029j636j732j566j486j456j201q23q11j244j579j571j743k393k835
60684D01714k342j341p64o03j16Q45J753K489L413M346M511L720K782K441K635
60669D25483K912K872K093M28j415k392k439k560l325m105m096l375k505j704
60655D05872q87k7Q69J775K346K173J562J458K273L359L999M233M248L597J793
60640D38643o92k723l736m043m113m033l722l254k813k485k142j509m79O33J332
60625D04864J465J221O93j42q86q08K77J546K016J555P39Q5k63l13j66o0j12j58
60607D11553o6Jj07j41J66N45M52j23n72m40J10P09J259J747J936J637J127R35
$$ y = [401459, 404144, 406742, 409232, 411362, 412693, 413430, 414568, 416755, 419434, 421535, 422725, 423509, 424317, 424926, 424819, 423790, 422154, 420422, 418856, 417370, 415914, 414713, 413890, 413079, 411835, 410256, 408685, 406942, 404549, 401714, 399372, 398031, 397267, 396664, 396548, 397393, 399146, 401635, 405048, 409394, 413905, 417625, 420407, 422848, 425483, 428395, 431267, 433360, 433788, 432373, 429981, 427542, 424982, 421657, 417552, 413456, 410081, 407576, 405872, 404985, 404958, 405827, 407602, 409948, 412121, 413683, 415141, 417414, 420773, 424772, 429005, 433253, 436850, 438643, 437951, 435228, 431492, 427449, 423336, 419303, 415581, 412327, 409514, 407029, 404887, 403378, 402899, 403532, 404864, 406329, 407550, 408243, 408101, 407215, 406407, 406684, 408230, 410246, 411801, 412540, 412625, 412362, 412049, 411883, 411823, 411711, 411553, 411487, 411488, 411381, 411240, 411406, 411951, 412403, 412280, 411708, 411268, 411378, 412087, 413346, 415093, 417029, 418666, 419793, 420728]
60589D20728J175J448J479J488J738K016J991J796J823J988J785J117N57N09O29
60574D42267N01M13R63K131L366M413N523O826Q105R298J0654J2185J3298J3424
60560E33367J2725J1813J0835R234O552L155j31k960n492p501q131p064n376m436
60546E46590m114l090q94J365K706L599M972O696Q055R187J1058J4105J7730K1058
60532F39023K3655K5423K6391K6564K5628K3001J8511J2826O798P42n119r967
60520H13476j2951j4229j4703j4811j4257j2927j1328j0059r321q970q540p359
60508F74021n239k925j319l21R70L029N600Q483J1908J5915K0151K4436K9022
60495G83731L4067L9200M3764M7200M9265N0196N0442M9862M7559M3074L7437
$$ y = [420728, 421903, 423351, 424830, 426318, 428056, 430072, 432063, 433859, 435682, 437670, 439455, 440572, 441129, 441638, 442267, 442768, 443181, 444144, 446275, 449641, 454054, 459577, 466403, 474508, 483806, 494460, 506645, 519943, 533367, 546092, 557905, 568740, 577974, 584526, 587681, 587550, 584590, 579098, 571597, 563466, 556402, 551026, 546590, 542476, 539386, 538492, 539857, 542563, 546162, 551134, 557830, 565885, 575072, 586130, 600235, 617965, 639023, 662678, 688101, 714492, 741056, 766684, 789685, 808196, 821022, 827820, 828562, 823443, 813476, 800525, 786296, 771593, 756782, 742525, 729598, 718270, 708211, 698890, 689920, 681380, 674021, 668782, 665857, 664538, 664217, 665187, 668216, 673816, 682299, 694207, 710122, 730273, 754709, 783731, 817798, 856998, 900762, 947962, 997227, 1047423, 1097865, 1147727, 1195286, 1238360, 1275797]
60484A275797L2270K7972K3622J8379J2111M655m457j5228k6797l7994m7784n5185
60472A207361n9560o1104o0520n8270n4683n0475m6232m1588l6017l0378k6342
60461F82192k4148k2248j9559j6739j4661j2948j0977r266q661q783q471p377
60449E18354o223n603n337m953m236l326k628k522k912l210k967k332j723j443
60435D68939j659k283k744k419j495q30p45o71k62r6p12j590j794j257p31o90
60419D48961q26n81K38J303K059K199J965J809J756J477R19M57M06Q10J647K697
60403D67296L264K769J676J099J360J728J732J803K274K698K651K418K412K597
60389D97777K995L877M956N219M271L118K779K877K434J501R82J269J993K847
$$ y = [1275797, 1308067, 1336039, 1359661, 1378040, 1390151, 1394806, 1390349, 1375121, 1348324, 1310330, 1262546, 1207361, 1147801, 1086697, 1026177, 967907, 913224, 862749, 816517, 774929, 738912, 708534, 682192, 658044, 635796, 616237, 599498, 584837, 571889, 560912, 551646, 542985, 534202, 525731, 518354, 512131, 506528, 501191, 496238, 492002, 488676, 486048, 483526, 480614, 477404, 474437, 472105, 470382, 468939, 467280, 464997, 462253, 459834, 458339, 457509, 456764, 456093, 455831, 455735, 455023, 453433, 451639, 450382, 449651, 448961, 448135, 447554, 447792, 449095, 451154, 453353, 455318, 457127, 458883, 460360, 461279, 461736, 462142, 462952, 464599, 467296, 470560, 473329, 475005, 476104, 477464, 479192, 480924, 482727, 485001, 487699, 490350, 492768, 495180, 497777, 500772, 504649, 509605, 514824, 519095, 522213, 524992, 527869, 530303, 531804, 532786, 534055, 536048, 538895]
60375E38895L723M199L817K885K280K347K519K131J207L96L23R77J617J507Q57
60360E69680O28J294K288K950L375L954M694N503O624Q127R452J0098J0364J0739
60346F49770J0931J0217Q521O374L981J056k408n754q198r417r611r279q825q225
60332F29133p247o073n353n365n645n607n168m471l555k713k571l251l886l575
60318E64653k483j407o82j7Q73K107L810N920Q014R770J1366J2959J4166J4532
60304F43581J4203J3675J3166J2678J2312J1991J1242R709P556M904J371l243
60292G53145q217j2514j5676j7616j7959j6475j3927j1620j0110q981p774o523
60280F05753n379m371l577l157l149l500m143m826n173n131n044n048m861m469
$$ y = [538895, 542618, 546817, 550634, 553519, 555799, 558146, 560665, 562796, 564003, 564399, 564722, 565699, 567316, 568823, 569680, 570308, 571602, 573890, 576840, 580215, 584169, 588863, 594366, 600990, 609117, 618569, 628667, 639031, 649770, 660701, 670918, 679439, 685813, 689794, 690850, 688442, 682688, 674490, 665073, 655462, 646183, 637358, 629133, 621886, 615813, 610460, 605095, 599450, 593843, 588675, 584204, 580649, 577936, 575365, 572114, 568228, 564653, 562170, 560763, 560081, 560064, 560937, 563044, 566854, 572774, 580788, 590558, 601924, 614883, 629049, 643581, 657784, 671459, 684625, 697303, 709615, 721606, 732848, 742557, 750113, 755017, 756388, 753145, 744928, 732414, 716738, 699122, 681163, 664688, 650761, 639141, 629031, 620050, 612276, 605753, 600374, 596003, 592426, 589269, 586120, 582620, 578477, 573651, 568478, 563347, 558303, 553255, 548394, 543925]
60266E43925m394m806n040m573l914l720l635k847j402j13O03R03Q78M83Qr0K35
60249E12501Q00J572K286K186R68k90j68J295K585K463J002q87k229k394j547
60234E20143o14k79j49M95J506K206K554L047L694M045M115M334M663M670M475
60219E58905M654N217N588N652N925O610P338P994Q875R907J0563J0711J0764
60206F58703J0838J0621J0236J0271J0705J0623R439P672O164N223M852N021N287
60193G65655M824L346J498p7j479k957m199m828n147n782o796p721q257q502q488
60178G11090q019p073o077n550n484n345m719l845l237k942k517j795j166j005
60164F52316j249j722k334k738k452j657j200j304j099k3J073J167O87Q45J815
$$ y = [543925, 539531, 534725, 529685, 525112, 521198, 517478, 513843, 510996, 509594, 509481, 510084, 510987, 511865, 512348, 512356, 512266, 512501, 513301, 514873, 517159, 519345, 520313, 520023, 519855, 521150, 523735, 526198, 527200, 526313, 524084, 521690, 520143, 519529, 519250, 519101, 519596, 521102, 523308, 525862, 528909, 532603, 536648, 540763, 545097, 549760, 554430, 558905, 563559, 568776, 574364, 580016, 585941, 592551, 599889, 607883, 616758, 626665, 637228, 647939, 658703, 669541, 680162, 690398, 700669, 711374, 721997, 731436, 739108, 745272, 750495, 755347, 760368, 765655, 770479, 773825, 775323, 775246, 773767, 770810, 766611, 761783, 756636, 750854, 744058, 736337, 728080, 719578, 711090, 703071, 695998, 689921, 684371, 678887, 673542, 668823, 664978, 661741, 658799, 656282, 654487, 653321, 652316, 651067, 649345, 647011, 644273, 641821, 640164, 638964, 637660, 636561, 636538, 637611, 638778, 639465, 640310, 642125]
60149F42125K676K925K812K435J643Q04O33J188J925K746M012N548O674P307Q112
60134F93565R345J0482J1094J1337J1368J1084J0496R614Q021N398K493N56j79
60121G94674n19q42p16q2M33P46J591L057L951L338J877R18R49J489J859J508
60105H14231J54j783l338m033m329m753n184n340n367n476n498n195m602l840
60091G55647k946k128j750j797j834j556j013k96M63Q97Q22Q13J548K689L213
60076G52772K820K043J055n76k805m998p044r381j1610j2453j1643j0555j0263
60063F77362j0166r374q262p588p109o237n337n115n226m695l395k129j365p76
60049F00588Q3J309K723L898M365M235M268M902N644N935O073O587P172P044O097
$$ y = [642125, 644801, 647726, 650538, 652973, 654616, 655420, 656053, 657241, 659166, 661912, 665924, 671472, 678146, 685453, 693565, 702910, 713392, 724486, 735823, 747191, 758275, 768771, 778385, 786406, 791804, 794297, 794853, 794674, 794155, 793313, 792597, 792515, 792948, 793694, 795285, 798342, 802293, 805631, 807508, 808426, 809375, 810864, 812723, 814231, 814385, 812602, 809264, 805231, 800902, 796149, 790965, 785625, 780258, 774782, 769284, 764089, 759487, 755647, 752701, 750573, 748823, 747026, 745192, 743636, 742623, 742327, 742790, 743687, 744509, 745322, 746870, 749559, 752772, 755592, 757635, 758690, 758114, 755309, 750311, 743267, 733886, 722276, 709823, 698180, 687625, 677362, 667196, 657822, 649560, 641972, 634863, 628626, 623289, 618174, 612948, 608253, 604858, 602729, 601364, 600588, 600671, 601980, 604703, 608601, 612966, 617201, 621469, 626371, 632015, 637950, 644023, 650610, 657782, 664826, 670923]
60034F70923M954L981K967J712M20n81j168j491j938k906m446o242p980r501j0605
60019F38099j1204j1645j2250j2506j1492r350p439o668o431n748m623l668l049
60006E32026k530k027j459n82M64R80O44J05K9J46m3k41J22Q62J420J957L029
59989E34902M400N097M691L825L394L764M695N549N617M710L422K376J444J07
59975E87993j635l160l952l989l595l248l371l855l977l133j515K69K007L821
59961E58660N557O780P332P518P631P520O713M956K690P90l51j307k666l905l896
59946F04022k565j102l98j77r1n96k067l799m707m582m007l459l079k830k411
59931E68152j396L8J191K005L399N740P792Q127P015N846N091L958J962j80j426
$$ y = [670923, 675877, 679858, 682825, 684537, 684957, 684376, 683208, 681717, 679779, 676873, 672427, 666185, 658205, 648704, 638099, 626895, 615250, 603000, 590494, 579002, 569652, 562213, 555545, 549114, 543366, 538743, 535075, 532026, 529496, 527469, 526010, 525428, 525892, 526872, 527516, 527621, 527650, 527796, 527753, 527512, 527634, 528496, 529916, 531873, 534902, 539302, 544399, 549090, 552915, 556309, 560073, 564768, 570317, 575934, 580644, 584066, 586442, 587886, 587993, 586358, 583198, 579246, 575257, 571662, 568414, 565043, 561188, 557211, 554078, 552563, 552832, 554839, 558660, 564217, 570997, 578329, 585847, 593478, 600998, 607711, 612667, 615357, 616147, 615796, 614489, 611823, 607918, 604022, 601457, 600355, 599957, 599780, 599689, 599093, 597026, 593227, 588520, 583938, 579931, 576472, 573393, 570563, 568152, 566756, 566794, 567985, 569990, 573389, 579129, 586921, 595048, 602063, 607909, 613000, 616958, 618920, 618740, 617314]
59916F17314j448o61K79R58J481K294L497M584N149N426N861O471P001P271O963
59901F72440N650L520J562M76j50j037k092k770l022l136k940j975l05J494K954
59886F70669L877M202M242M675N703O624O746O402O435P070P922Q646Q997Q711
59872G60921P884P116O625N801M225K489J257K80p56j176l71P38O56n71j638k145
59856G91335l008m631o141o766o721o321n364l888k597j884j136M14K710N108
59842G51110P016P882P098M492P66k858n292n926m751k374L84K917M741N275M146
59827G74626J779q33k951m400n246n638n901o295o626o474n774m848l990l333
59813G14096k961k698k082j008k32o05j898k977l085k512j961j811k082k675l492
$$ y = [617314, 615866, 615205, 615484, 616442, 617923, 620217, 623714, 628298, 633447, 638873, 644734, 651205, 658206, 665477, 672440, 678090, 681610, 683172, 683648, 683498, 682461, 680369, 677599, 674577, 671441, 668501, 666526, 666221, 667715, 670669, 674546, 678748, 682990, 687665, 693368, 699992, 706738, 713140, 719575, 726645, 734567, 743213, 752210, 760921, 768805, 775921, 782546, 788347, 792572, 795061, 796318, 796598, 795842, 794666, 794295, 795033, 795689, 795118, 793480, 791335, 788327, 783696, 777555, 770789, 764068, 757747, 752383, 748495, 745898, 744014, 742878, 743292, 746002, 751110, 758126, 766008, 773106, 777598, 778364, 775506, 770214, 764288, 759537, 757163, 757547, 760464, 765205, 770480, 774626, 776405, 775572, 772621, 768221, 762975, 757337, 751436, 745141, 738515, 732041, 726267, 721419, 717429, 714096, 711135, 708437, 706355, 705347, 705115, 704510, 702612, 699635, 696550, 694038, 692077, 690266, 688184, 685509, 682017]
59798F82017m415n199n427m913m235m292n069n470m817l868l702m220m493m126
59784F17771l425k588j649r91j053j620k086k209j974j113M57J973K541K404K579
59769F09017L385M165M438M484M727N295O225P381Q189Q192P840Q064R015R919
59755G00336J0170R993R994J0608J1906J3387J4156J3849J3208J3088J3242J2775
59743H46712J1514J0071Q737P269N654M183K802J182n59k002l225m625n989o615
59729H75109o373n858n380m680l696k836k363k107j896j728j549j386j543k174
59715H31540k847l142l271l498l492k987k539k593k400j021J024K390K788K894
59701H12846K775J977J000R93J889K521K660L363M900O041N898M997L903K293
$$ y = [682017, 677602, 672403, 666976, 662063, 657828, 653536, 648467, 642997, 638180, 634312, 630610, 626390, 621897, 617771, 614346, 611758, 610109, 609118, 608065, 606445, 604359, 602150, 600176, 599063, 599520, 601493, 604034, 606438, 609017, 612402, 616567, 621005, 625489, 630216, 635511, 641736, 649117, 657306, 665498, 673338, 681402, 690417, 700336, 710506, 720499, 730493, 741101, 753007, 766394, 780550, 794399, 807607, 820695, 833937, 846712, 858226, 868297, 877034, 884303, 889957, 894140, 896942, 898124, 897565, 895563, 892338, 887713, 881724, 875109, 868736, 862878, 857498, 852818, 849122, 846286, 843923, 841816, 839920, 838192, 836643, 835257, 833714, 831540, 828693, 825551, 822280, 818782, 815290, 812303, 809764, 807171, 804771, 803750, 804774, 807164, 809952, 812846, 815621, 817598, 818598, 819591, 821480, 824001, 826661, 830024, 834924, 840965, 846863, 851860, 855763, 858056]
59687H58056J23j744k820l632m353m173k978k327l463n449o573o781p352q671
59673G97863r731r703q898q035p401o870o258n487m606l706k828k029j402p25
59659G20184N58K468M023M340L981M206N138N827O022O410P006O758N263L505
59645G85689K254R53j011l128m752o205p994r762j0902j1459j1585j0911r293
59632G01894p502o261n268l990k755k247k495l237m585o410p652p430o405n991
59618F29666o393o540n840m934m537m397l869k955k278k143k015j078O96K390
59604E85773L205L340L352L079K024O09k1M06Q79O55K22K84O65Q42Q80J198J856
59587F09248K551K837K193M86j350j997j393q97j448k496l207l621l960l855l205
$$ y = [858056, 858179, 856435, 853615, 849983, 845630, 841457, 838479, 836152, 832689, 827240, 820667, 813886, 806534, 797863, 788132, 778429, 769531, 761496, 754095, 747225, 740967, 735480, 730874, 727168, 724340, 722311, 720909, 720184, 720742, 723210, 727233, 731573, 735554, 739760, 744898, 750725, 756747, 763157, 770163, 776921, 782184, 785689, 787943, 788896, 787885, 784757, 780005, 773800, 765806, 756044, 745142, 733683, 722098, 711187, 701894, 694392, 688131, 682863, 678873, 676118, 673871, 671376, 668139, 663554, 657144, 649492, 642062, 635657, 629666, 623273, 616733, 610893, 605959, 601422, 597025, 593156, 590201, 587923, 585780, 583765, 582687, 583383, 585773, 588978, 592318, 595670, 598749, 600773, 601382, 601361, 601767, 602646, 603301, 603523, 603807, 604472, 605314, 606194, 607392, 609248, 611799, 614636, 616829, 617315, 615965, 613968, 612575, 611678, 610230, 607734, 604527, 600906, 596946, 593091, 589886]
59572E89886k838l327l838l284k045j416j741k173k028j403n83K62Q02P63M12
59557E67449L11N43P06O29N57P29J137J665K173K431K283J835J418J396J956K837
59541E90055L536M103N386Q018J1525J5190J9201K3526K5962K3244J4845M298
59529G48889l996q311r417q499o471m285k462p23J054K124J915J089N91K35p92
59514G10941k533m362n997p530q729r254r244r021q459p396o265n638n429n222
59500F15862n021n050n090m627l508k000n44L32L71J80P44K008K741K371J910
59485F00679K355L100K979K119J651K016K722L399M160N028N797O373O662O488
59471F55528N970N537N122M022K147N84K20M85L52j61l34rN25J326K536L685M247
$$ y = [589886, 587048, 583721, 579883, 576599, 574554, 573138, 571397, 569224, 567196, 565793, 565210, 565472, 566274, 567037, 567449, 567760, 568303, 569009, 569638, 570195, 570924, 572061, 573726, 575899, 578330, 580613, 582448, 583866, 585262, 587218, 590055, 593591, 597694, 603080, 611098, 622623, 637813, 657014, 680540, 706502, 729746, 744591, 748889, 744893, 736582, 727165, 718666, 712195, 707910, 705448, 704725, 705779, 707903, 709818, 710907, 711498, 711733, 710941, 708408, 704046, 698049, 690519, 681790, 672536, 663292, 654271, 645812, 638416, 632151, 626513, 621084, 615862, 610841, 605791, 600701, 596074, 592566, 590566, 590022, 590354, 590725, 590905, 591649, 593657, 596398, 598769, 600679, 603034, 606134, 609113, 611232, 612883, 614899, 617621, 621020, 625180, 630208, 636005, 642378, 649040, 655528, 661498, 667035, 672157, 676179, 678326, 678910, 679130, 679615, 679967, 679806, 679472, 679463, 679988, 681314, 683850, 687535, 691782]
59454F91782M485M996N833O712P587Q261Q094O954N837N580N577M653K646J25
59440G69122k699n694q077r141r265r135q533p043n412m757m838m406l077j548
59426F85497j74J393L211M876O395Q120R936J1409J2712J4447J6674J8870K0741
59413H14107K2341K3978K6576L1126L6295L7598L1057J7709K981q318j4864j7268
59401A003318j6088j2045o197J175J0284J9338K3758J9712Q208n347j5583k0691
59389A009842k2039k1618k0389j8654j6944j5808j4890j3227j0755q676p766p199
59377H31877n875m215l461l714l822l087j960j173j018j457k090k104j045N24
59363G97380J727K452L058L470L507L682M635O055P187Q072R328J0908J2190J3061
$$ y = [691782, 696267, 701263, 707096, 713808, 721395, 729656, 737750, 744704, 750541, 756121, 761698, 766351, 768997, 769122, 766423, 760729, 752652, 743511, 734246, 725111, 716578, 709535, 704123, 699366, 694528, 690122, 687045, 685497, 685323, 686716, 689927, 694803, 701198, 709318, 719254, 730663, 743375, 757822, 774496, 793366, 814107, 836448, 860426, 887002, 918128, 954423, 992021, 1023078, 1040787, 1043768, 1035450, 1020586, 1003318, 987230, 975185, 968988, 970163, 980447, 999785, 1023543, 1043255, 1051463, 1046116, 1030533, 1009842, 987803, 966185, 945796, 927142, 910198, 894390, 879500, 866273, 855518, 846842, 839076, 831877, 826002, 821787, 818326, 814612, 810790, 807703, 805743, 804570, 803552, 802095, 800005, 797901, 796856, 797380, 799107, 801559, 804617, 808087, 811594, 815276, 819911, 825966, 833153, 841225, 850553, 861461, 873651, 886712]
59349H86712J3968J5082J6322J7820J9421K0163J9443J8238J7869J7939J6861
59338A079838J4204J0994P887M559R41k401n400q626j2072j4976j7017j8575j9755
59325A019601k0274k0346k0422k0062j8435j6006j4274j3633j2947j1568j0336
59314H41298r999j0042r718r147q733q399p966p504o894n812m446l324k322p32
59300G46260J497L524M955O401Q544J1437J4766J7673J8265J4700P317j325q797
59287H45217j4240j7484j8240j6834j4526j2304j0028p296m263j277J547L925
59275G34197N448O402P782J0090J2784J5110J6747J7536J7418J6782J6091J5111
59263H91498J3356J1178R360P734N373K216p53l002m806o072o274n790n766o271
$$ y = [886712, 900680, 915762, 932084, 949904, 969325, 989488, 1008931, 1027169, 1045038, 1062977, 1079838, 1094042, 1105036, 1112923, 1117482, 1118423, 1116022, 1110622, 1101996, 1089924, 1074948, 1057931, 1039356, 1019601, 999327, 978981, 958559, 938497, 920062, 904056, 889782, 876149, 863202, 851634, 841298, 831299, 821257, 811539, 802392, 793659, 785260, 777294, 769790, 762896, 757084, 752638, 749314, 746992, 746260, 747757, 751281, 756236, 762637, 771181, 782618, 797384, 815057, 833322, 848022, 855339, 854014, 845217, 830977, 813493, 795253, 778419, 763893, 751589, 741561, 734265, 730002, 728725, 730272, 734197, 739645, 746047, 753829, 763919, 776703, 791813, 808560, 826096, 843514, 860296, 876387, 891498, 904854, 916032, 925392, 933126, 938499, 940715, 939962, 936960, 932154, 926082, 919808, 914018, 908252, 901981]
59249I01981o062m566k703j221J88J558K057J588J518K755M287M671L873K670
59235I12594J257m49j975k831l326m037n044o184p443q611r280r599j0215j1074
59221H33783j1317j0729j0272j0623j1239j1395j1057j0241q653o669n432n206
59209G20950m776l265j478n05j69K35O32O90P57J249J840K217K814L922M845M924
59193G34882M709N058N737N911N497N015M590M036L569L615M106M579M704M258
59179H00266L076J442O9o95j175j560j535j111r97j589k276k304j706r32k40J57
59163G88890ln59r91j282j917k874l552l945m797o240p404p845q156q712q940
59148G21673q514q040p918p670p063o782p188p552p287o859o651o126m927l762
$$ y = [901981, 895919, 891353, 888650, 887429, 887617, 889175, 891232, 892820, 894338, 897093, 901380, 906051, 909924, 912594, 913851, 913402, 911427, 908596, 905270, 901233, 896189, 890005, 882562, 873951, 864671, 855072, 844857, 833783, 822466, 811737, 801465, 790842, 779603, 768208, 757151, 746910, 738257, 731588, 726156, 720950, 716174, 712909, 711431, 710926, 710757, 710992, 711624, 712314, 713071, 714320, 716160, 718377, 721191, 725113, 729958, 734882, 739591, 744649, 750386, 756297, 761794, 766809, 771399, 775435, 779004, 782619, 786725, 791304, 796008, 800266, 803342, 804784, 804853, 804158, 802983, 801423, 799888, 798777, 797780, 796191, 793915, 791611, 789905, 788973, 788733, 788890, 788887, 788328, 787337, 786055, 784138, 781264, 777712, 773767, 768970, 762730, 755326, 747481, 739325, 730613, 721673, 713159, 705119, 697201, 689531, 682468, 675686, 668498, 660946, 653659, 646800, 640149, 634023, 629096, 625334]
59134F25334l232k854k111j390j016m03Q78K201K970L590M445N050N164N571O788
59119F50985Q070Q776R493J0701J1581J1430J1099J1603J2330J2126J1229J0639
59107G80062J0377R817Q996Q192O892M673K467J504J509J243K58j095k752m629
59093H27514n809n472m300l681l816l792l097j942n86N24M38j282l609n158n835
59078G80097o408p143p891q862j0014j0327r038p062n889n540m949l908l238l272
59064F86556l514l706m050m457m519m122l386k303j150p15j333k189k402k085
59050F46625j668j036k94l54j539k550k101q23j68k02L2O18P92L89q6l95m24L31
59032F37147J954L443M089M690O155P877Q979J0184J2581J5449J7320J8499K0350
$$ y = [625334, 622102, 619248, 617137, 615747, 614731, 614328, 615206, 617407, 620377, 623967, 628412, 633462, 638626, 644197, 650985, 659055, 667831, 677324, 688025, 699606, 711036, 722135, 733738, 746068, 758194, 769423, 780062, 790439, 800256, 809252, 817444, 824336, 829009, 831476, 832980, 834489, 835732, 835990, 834895, 832143, 827514, 821705, 816233, 811933, 808252, 804436, 800644, 797547, 795605, 795019, 795543, 795981, 794699, 791090, 785932, 780097, 773689, 766546, 758655, 749793, 739779, 729452, 720414, 713352, 707463, 701923, 696974, 693066, 689828, 686556, 683042, 679336, 675286, 670829, 666310, 662188, 658802, 656499, 655349, 654634, 653301, 651112, 648710, 646625, 644957, 643921, 643627, 643273, 641734, 639184, 637083, 636260, 636092, 635890, 635922, 636540, 637332, 637721, 637635, 637240, 636816, 637147, 639101, 642544, 646633, 651323, 657478, 665355, 674334, 684518, 697099, 712548, 729868, 748367, 768717]
59019G68717K2541K3201K1706J9137J6011J1620N934K28m564q468j1255j2208
59007H52600j1545j0518r696q505o722n068l892k572o47J445L060L869L685K709
58993H08203J921K107K614K121N41r93j838k325k637k561k344k503k749k275j120
58978G96162p7P56K103M244O658Q903J0767J1764J1745J1758J2978J4909J5895
58965I08565J5326J4062J2873J1859J1241J1241J1066R542O814M141J922p11m250
58952A013691q141j1824j5188j7743j8723j8218j7227j6427j5824j5416j5116
58941H43844j4147j1866q965o691n073l268j334j34L57J043J993K400K270K498
58927H02927L126L113K141J080L14r05k883m682n406n215m649l964l412l243l179
$$ y = [768717, 791258, 814459, 836165, 855302, 871313, 882933, 888867, 889095, 884531, 876063, 864808, 852600, 841055, 830537, 820841, 812336, 805614, 800546, 796654, 794082, 793435, 794880, 797940, 801809, 805494, 808203, 810124, 812231, 814845, 816966, 817507, 816514, 814676, 812351, 809714, 807153, 804809, 802306, 799557, 797282, 796162, 796085, 796841, 798944, 803188, 809846, 818749, 829516, 841280, 853025, 864783, 877761, 892670, 908565, 923891, 937953, 950826, 962685, 973926, 985167, 996233, 1005775, 1012589, 1016730, 1018652, 1017941, 1013691, 1005550, 993726, 978538, 960795, 942072, 923854, 906627, 890200, 874376, 858960, 843844, 829697, 817831, 808866, 802175, 797102, 793834, 792500, 792366, 792723, 793766, 795759, 798159, 800429, 802927, 806053, 809166, 811307, 812387, 812701, 811796, 808913, 804231, 798825, 793610, 788961, 784997, 781585, 778342, 775163]
58912G75163k756k248k267k551k156p79J096L199N532P724R378J0847J2572J4138
58898H26892J5087J5977J7226J7708J6296J4127J3385J4266J5172J5566J6473
58887I98175J8244K0011K1330K2329K2266K0115J6625J3623J1233Q039M079J139
58875A177208k94j864m489p055q703j0087j1490j1910j1037j0070r545q413o319
58862A075932m818n109o328p259q040r008r566r409r356r899j0306j0123r973
58849I66738r871q610n982l952m146n646o807p849j0016j3142j5708j6777j6653
58836H41579j6016j5374j4922j4241j2693j0487q609p421o310n010m073l624k834
58823G19965j266M13J526K202K707L044L529M533N479N374M468L964L951L332
$$ y = [775163, 772407, 770159, 767892, 765341, 763185, 762406, 763502, 766701, 772233, 779957, 789335, 800182, 812754, 826892, 841979, 857956, 875182, 892890, 909186, 923313, 936698, 950964, 966136, 981702, 998175, 1016419, 1036430, 1057760, 1080089, 1102355, 1122470, 1139095, 1152718, 1163951, 1171990, 1176069, 1177208, 1176914, 1175050, 1170561, 1163506, 1154803, 1144716, 1133226, 1121316, 1110279, 1100209, 1090664, 1082251, 1075932, 1071114, 1066005, 1059677, 1052418, 1044378, 1035370, 1025804, 1016395, 1007039, 997140, 986834, 976711, 966738, 956867, 948257, 942275, 938323, 934177, 928531, 921724, 913875, 903859, 890717, 875009, 858232, 841579, 825563, 810189, 795267, 781026, 768333, 757846, 749237, 741816, 735506, 730496, 726423, 722799, 719965, 718699, 719112, 720638, 722840, 725547, 728591, 732120, 736653, 742132, 747506, 751974, 755938, 759889, 763221]
58809G63221K012J264J428J186j36j387j629j647k420l574m390n002n696o159
58795G37071o219o235o295o137o151o971p863p110m494j704P4J231K168K614K985
58780F86964M347O416P618P709Q214R575J0192R106P318N385K249k297o262q168
58766G48366r048j0194j0980j0481r407q631p521n366k955j167N12K664M512N197
58752F85501N070M515L095R65m85o52o92j398j809j058K06J377K949M836N744
58737G08164N445N496O461O768N819N567P190Q705Q179O874O820P441P142O276
58723H02347N881N265L605K292K965M592N244N367O571Q362R010Q703R016R860
58709H89080R602P745N205K350j039m432p127r688j2954j6272j8462j9743k0941
$$ y = [763221, 765233, 766497, 767925, 769111, 768975, 767588, 765959, 764312, 761892, 758318, 753928, 748926, 743230, 737071, 730852, 724617, 718322, 712185, 706034, 699063, 691200, 684090, 679596, 677892, 677966, 679197, 681365, 683979, 686964, 691311, 697727, 705345, 713054, 721268, 730843, 741035, 750141, 757459, 762844, 765093, 762796, 756534, 748366, 739318, 729124, 718144, 707663, 698256, 689625, 682104, 676738, 673783, 672616, 673128, 675792, 680304, 685501, 690571, 695086, 698181, 699146, 698661, 698009, 697317, 695919, 694110, 693052, 693258, 694635, 697584, 702420, 708164, 713609, 719105, 725566, 732334, 738153, 743720, 750910, 759615, 767794, 774668, 781488, 788929, 796071, 802347, 808228, 813493, 817098, 819390, 822355, 826947, 832191, 837558, 844129, 852491, 861501, 870204, 879220, 889080, 898682, 906427, 911632, 913982, 912943, 908511, 901384, 891696, 878742, 862470, 844008, 824265, 803324]
58696H03324k1672k1249k0417k0216j9956j8300j5626j3356j1733j0078q501p546
58684F14674o844n895n348n802o283n643m557m306m541m082k956j880p12Q46K027
58669E58698K281K650M159O056P437R149J2078J4904J5758J4781J2913R670M546
58656F75080p44m133o184q581j0811j1121r852q910q578p639o189n528n656n356
58642E75798m529m096l895k955j514n73Q0J312K655L088L105L783M420L513J545
58627E81737L95L95K81l25o59o74r88j271p57J73P57J561L317N005N266M956N853
58610F05022P546Q047O898N293L801K278J428J972K838K491J416J015R33l7j286
58595F49655j350o89q82j682j711j267j507j557M80M040O690P841Q988J0553J1526
$$ y = [803324, 781652, 760403, 739986, 719770, 699814, 681514, 665888, 652532, 640799, 630721, 622220, 614674, 607830, 601935, 596587, 590785, 584502, 578859, 574302, 569996, 565455, 561373, 558417, 556537, 555825, 556671, 558698, 560979, 563629, 567788, 573844, 581281, 590430, 602508, 617412, 633170, 647951, 660864, 670534, 675080, 674336, 670203, 664019, 655438, 644627, 633506, 623654, 614744, 606166, 598527, 592338, 586810, 581154, 575798, 571269, 567173, 563278, 560323, 558809, 558236, 558316, 559628, 562283, 565371, 568476, 572259, 576679, 580192, 581737, 582132, 582527, 582808, 582483, 581824, 581150, 580162, 578891, 578134, 578307, 579064, 580625, 583942, 588947, 594213, 599169, 605022, 612568, 620615, 627513, 632806, 636607, 638885, 640313, 642285, 645123, 647614, 649030, 650045, 650978, 650941, 649655, 648305, 647616, 646734, 645052, 643341, 642074, 640567, 639010, 639490, 643530, 650220, 658061, 667049, 677602, 689128]
58580F89128J1976J2910J3756J2908J0744R327R094Q567P278O327O222O738Q589
58567H13564J2503J7038K0087K2224K5649L0324L4195L6737L8975M0322L8852
58556A130470L4707K9894K4654J7509Q967J724l154o937r881j0633r475q662q886
58543A190297q625p703q207j1028j4592j7890k1771k6242k9436l0366l0172k9684
58531I54581k8239k5652k3002k0695j8017j5112j3030j1619r697p517o490o371
58519G69140n469l765k971l334l338k811l246m621m992l781k558k049j265q8K36
58504G25088l14k67N22O30l2K1Q17O66o18j227n07K71O21J388K289K049J365K513
58486G35275N628Q411R901J1425J3535J5181J6345J8262K0679K2053K2557K3682
$$ y = [689128, 701104, 714014, 727770, 740678, 751422, 760749, 769843, 778410, 785688, 792015, 798237, 804975, 813564, 826067, 843105, 863192, 885416, 911065, 941389, 975584, 1012321, 1051296, 1091618, 1130470, 1165177, 1195071, 1219725, 1237234, 1246201, 1247925, 1244771, 1237834, 1227953, 1217320, 1207845, 1199183, 1190297, 1181672, 1173969, 1165762, 1154734, 1140142, 1122252, 1100481, 1074239, 1044803, 1014437, 984265, 954581, 926342, 900690, 877688, 856993, 838976, 823864, 810834, 799215, 789518, 782001, 775511, 769140, 763671, 759906, 756935, 753601, 750263, 747452, 744206, 739585, 734593, 730812, 728254, 726205, 724940, 724852, 725088, 724774, 724507, 725029, 725659, 725627, 725648, 726465, 727131, 726513, 725286, 724779, 725050, 725671, 727059, 729348, 731397, 732762, 735275, 740903, 749314, 759215, 770640, 784175, 799356, 815701, 833963, 854642, 876695, 899252, 922934]
58474I22934K4772K3461J9561J4917R594K224n848j1166j3259j4844j6607j6259
58462I39480j3434j0753r087o339k076J227K871N367R701J3614J5968J8366K0754
58449I85659K0054J5123Q879L556j969q265j3036j5019j6164j7797j8317j6726
58437I25978j4696j3173j0707o989m275l404k268J0J376J184K044N290Q638J0467
58423H99475J2396J5356J7040J5686J2703R406M898q20n353p646r448j1410j1676
58410I40607j0088r474j0857j1656j0615r991j0778j0448p873n761n727n406l144
58397H28789r71k64R84L771N529M792M058N102N799M467L063L245L519K909L099
58382H77891M489M640L090K889M894N722L960K984M717O232N647N692P991R570
$$ y = [922934, 947706, 971167, 990728, 1005645, 1015239, 1017463, 1011615, 1000449, 987190, 972346, 955739, 939480, 926046, 915293, 906206, 899867, 897791, 899018, 901889, 907256, 916957, 930571, 946539, 964905, 985659, 1005713, 1020836, 1029715, 1033271, 1031302, 1023037, 1010001, 994982, 978818, 961021, 942704, 925978, 911282, 898109, 887402, 880413, 876138, 872734, 870466, 870476, 871852, 873036, 875080, 880370, 889008, 899475, 911871, 927227, 944267, 959953, 972656, 982062, 986960, 986140, 980787, 973141, 963693, 952283, 940607, 930519, 921045, 910188, 898532, 887917, 877926, 867148, 856700, 848827, 843066, 837339, 831933, 828789, 827818, 827554, 828538, 832309, 837838, 842630, 846688, 851790, 857589, 862056, 865119, 868364, 871883, 874792, 877891, 882380, 887020, 890110, 892999, 897893, 903615, 907575, 910559, 915276, 921508, 927155, 932847, 940838, 950408]
58368I50408Q712Q492J0732J2263J1181J0926J3807J6457J6239J6160J8522J9686
58356A113585J6507J2294J0857R971O483K660J737J952O57m14O27J194o39j403
58342A176068J772N444N844N442P698J0418J0615J0922J4604J8861J9721J9188
58330A306597K0996K3402K2717K0006J8030J5630J1117P107N977M982J650q12
58318A457399N32K208N91j022J518N287N692M826O969J0422J1387J1475J3853
58305A531137J6313J5592J4344J6381J9317J9129J7616J8181J8898J7003J5424
58294A719335J7459J9960J9190J8140K0562K3296K2461K1393K4214K7423K6433
58283A959866K4505K6351K8908K7632K5827K8330L1990L2121L2079L6484M1308
$$ y = [950408, 959120, 967612, 978344, 990607, 1001788, 1012714, 1026521, 1042978, 1059217, 1075377, 1093899, 1113585, 1130092, 1142386, 1153243, 1163214, 1169697, 1172357, 1174094, 1176046, 1176703, 1176289, 1176916, 1178110, 1177471, 1176068, 1177840, 1183284, 1189128, 1194570, 1202268, 1212686, 1223301, 1234223, 1248827, 1267688, 1287409, 1306597, 1327593, 1350995, 1373712, 1393718, 1411748, 1427378, 1438495, 1445602, 1451579, 1456561, 1458211, 1457399, 1457931, 1460139, 1460730, 1459708, 1461226, 1466513, 1472205, 1477031, 1484000, 1494422, 1505809, 1517284, 1531137, 1547450, 1563042, 1577386, 1593767, 1613084, 1632213, 1649829, 1668010, 1686908, 1703911, 1719335, 1736794, 1756754, 1775944, 1794084, 1814646, 1837942, 1860403, 1881796, 1906010, 1933433, 1959866, 1984371, 2010722, 2039630, 2067262, 2093089, 2121419, 2153409, 2185530, 2217609, 2254093, 2295401]
58272B295401M1077L9571M2667M6984M6700M5177M8441N3463N4562N4990O0334
58261B829367O6899O8724O9366P4379P9192P7330P3421P4677P7008P3545O9195
58250C633103P1919P7374P7580P7053Q4209R4438R8584J00582J09320J20560J25062
58239D669784J27101J36308J48570J54269J57927J69750J85278J94011K00532
58230F143530K15799K35316K48016K58731K78971L03795L21662L38440L66751
58221H711011M00693M27347M53601M93922N41734N82232O22885O80375P48712
58212A3662512Q13259Q84152R80551J095096J211936J345765J521705J732245
58204B3247221J959348K222742K557442K962373L426147L983768M688650N554496
$$ y = [2295401, 2336478, 2376049, 2418716, 2465700, 2512400, 2557577, 2606018, 2659481, 2714043, 2769033, 2829367, 2896266, 2964990, 3034356, 3108735, 3187927, 3265257, 3338678, 3413355, 3490363, 3563908, 3633103, 3705022, 3782396, 3859976, 3937029, 4021238, 4115676, 4214260, 4314842, 4424162, 4544722, 4669784, 4796885, 4933193, 5081763, 5236032, 5393959, 5563709, 5748987, 5942998, 6143530, 6359329, 6594645, 6842661, 7101392, 7380363, 7684158, 8005820, 8344260, 8711011, 9111704, 9539051, 9992652, 10486574, 11028308, 11610540, 12233425, 12913800, 13662512, 14475771, 15359923, 16340474, 17435570, 18647506, 19993271, 21514976, 23247221, 25206569, 27429311, 29986753, 32949126, 36375273, 40359041, 45047691, 50602187]
58196E0602187O595833P900141R583159J1710083J4359003J7727417K2071014
58189A40548837K7575865L4320653M2002343M9132391N2530322M8521743L5640462
58182D30272616J6403201l891459k0352775l0748717l5377354l5735866l3596711
58175B86972935l0632263k8000592k5991272k4235345k2324637k0170351j7891538
58168A17726937j5617083j3457855j1516576r833458q377353p118666o058411
58161D5747535n179842m435602l797593l268493k835724k462467k131934j856078
58153A9779802j633905j441711j269538j128699j018145r19027q26556p53405
58145A0788816o97932o41343n79713n27977m88872m47665m01084l62747l35817
$$ y = [50602187, 57198020, 65098161, 74681320, 86391403, 100750406, 118477823, 140548837, 168124702, 202445355, 244447698, 293580089, 346110411, 394632154, 430272616, 446675817, 442784358, 422431583, 391682866, 356305512, 320569646, 286972935, 256340672, 228340080, 202348808, 178113463, 155788826, 135618475, 117726937, 102109854, 88651999, 77135423, 67301965, 58924612, 51805946, 45747535, 40567693, 36132091, 32334498, 29066005, 26230281, 23767814, 21635880, 19779802, 18145897, 16704186, 15434648, 14305949, 13287804, 12368777, 11542221, 10788816, 10090884, 9449541, 8869828, 8341851, 7852979, 7405314, 7004230, 6641483, 6305666]
58136F305666l07435k74768k50877k40003k30777k18233k09934k06384j97261
58127D169994j81148j68507j61646j51476j36906j27749j25346j19621j08441
58118B889154j01161r9824r5278q5326p8800p8019p4510o5896o0285o0035n7377
58107B032643n0161m6256m8216m8687m5034m3883m7072m7380m2421l9184m0542
58096A533807m0387l6169l3465l4217l2891k8071k5789k7594k7244k2797k0185
58085A204998k1349k0585j6325j4840j8259k0311j8061j6918j9749k1667k0006
58074I96928j9163k1299k1985j9346j7956j9657j9758j6290j3849j4495j3934
58063G99196j0508q836j0651j0997p584n234o880q644p912q065j0978j2773j1252
$$ y = [6305666, 5998231, 5723463, 5472586, 5232583, 5001806, 4783573, 4573639, 4367255, 4169994, 3988846, 3820339, 3658693, 3507217, 3370311, 3242562, 3117216, 2997595, 2889154, 2787993, 2688169, 2592891, 2507565, 2428765, 2350746, 2276236, 2210340, 2150055, 2090020, 2032643, 1982482, 1936226, 1888010, 1839323, 1794289, 1750406, 1703334, 1655954, 1613533, 1574349, 1533807, 1493420, 1457251, 1423786, 1389569, 1356678, 1328607, 1302818, 1275224, 1247980, 1225183, 1204998, 1183649, 1163064, 1146739, 1131899, 1113640, 1093329, 1075268, 1058350, 1038601, 1016934, 996928, 977765, 956466, 934481, 915135, 897179, 877522, 857764, 841474, 827625, 813130, 799196, 788688, 779852, 769201, 758204, 750620, 745386, 738506, 729862, 721950, 713885, 702907, 690134, 678882]
58050F78882r975j1002j1016q457p059q491q855o256m621o183p345n889n216p476
58036E71041r222p849n971n775n341l996m844q512j0764r732r128j1011j1982
58023D66914j0001q349r094r114o493m516n362n919l869k043k763l502k167j048
58009C92674j779j870q0L85k088l829k175q3m42j115K08J335N3j473r76k69j265
57992C77211k163j453j294l202m631l508j943j941j679L65J882R10n66o15q24
57977C56549k400l091j412J21n42j348l11P68J44l60Q97K031J339N57J174J503
57961C55619M95L66K209L184J383o83p93r15k879m510l871l160m437n547m256
57946C32205k625l080l886k615o23J05J024L824O484O740O375P891R962J0228
$$ y = [678882, 668907, 657905, 646889, 638432, 631373, 622882, 614027, 607771, 603150, 596967, 589622, 583733, 578517, 571041, 561819, 553970, 547999, 542224, 536883, 532887, 528043, 519531, 508767, 499035, 489907, 478896, 466914, 456913, 448564, 439470, 430356, 423863, 419347, 413985, 408066, 404197, 402154, 399391, 395889, 393722, 392674, 390895, 389025, 388945, 389330, 387242, 383413, 381238, 381155, 380713, 379598, 379806, 381141, 381194, 379721, 378745, 378476, 377211, 375048, 373595, 372301, 369099, 364468, 360960, 359017, 357076, 355397, 355762, 357644, 358554, 357988, 357373, 356549, 354149, 351058, 349646, 349767, 349225, 347877, 347566, 348334, 348478, 348118, 349015, 351046, 352385, 352942, 354116, 355619, 356114, 356480, 358689, 361873, 363256, 362573, 361780, 360865, 357986, 353476, 349605, 346445, 342008, 336461, 332205, 329580, 326500, 322614, 319999, 319376, 319481, 320505, 324329, 330813, 337553, 343928, 351819, 361781, 372009]
57932C72009R717J0392J1037R663P335N779L845J50l399m585m863o580q783r445
57918C92272r383j0220j0855r625p755p102o782n335l888l776l538j666K04J88
57904C12739k96O67J707P35j159j889k035k899l325k009n66q42j471n08J010J403
57888C01262J710L240M536M207L982N329O016M019J836K574M442L841J441M76
57874C48911J027Q12j46k30k1r27j573Q3K505K777J532J380J966J078o42p01O23
57857C58454J030O28J350K877L320L136M093N257M279J922J049J672J222p11k060
57842C87518k350l051m140m153l416l583m240l633k251k007k359j164J084J858
57828C54113J187J597L480M532M018L640L892L295J784J225J938J999O50o56j161
$$ y = [372009, 381726, 392118, 403155, 412818, 420153, 425932, 429777, 429927, 426528, 421943, 417080, 410500, 401717, 392272, 382889, 372669, 361814, 352189, 344434, 337332, 330550, 325215, 321327, 317551, 314013, 312347, 312551, 312739, 312443, 313110, 314817, 315552, 314393, 312504, 310469, 307570, 304245, 302236, 301670, 300828, 299357, 298849, 299859, 301262, 302972, 306212, 310748, 314955, 318937, 324266, 330282, 334301, 336137, 338711, 343153, 346994, 348435, 348911, 349938, 350750, 350604, 350374, 350353, 349426, 347853, 347936, 350441, 353218, 354750, 356130, 358096, 359174, 358532, 357831, 358454, 359484, 360112, 361462, 364339, 367659, 370795, 374888, 380145, 384424, 386346, 387395, 389067, 390289, 389578, 387518, 385168, 382117, 377977, 373824, 370408, 366825, 362585, 358952, 356701, 354694, 352335, 351171, 352255, 354113, 355300, 356897, 360377, 364909, 368927, 372567, 376459, 379754, 381538, 382763, 384701, 386700, 387350, 386694, 385533]
57813C85533j697k341k093j403k131m525o859q283r476j0362r951q610p820p547
57799C02435o455m738m018m440m568m106m065m275l565k295j892k011j039O37
57785B55605R63j39n50M92J631K404L859N748O275N294M819N581N867M636L179
57770C05664K692K522J795O96n42k106l566m155m245m806n423m940l835l632m096
57755B72023l464j455M18J622L093M862N724N549N485N674N083L863L386L776
57741C15639L828L441L658M197L598K091J540K200K287J214M89P18N07q05j844
57726C42758j626r89o86j97O39Q66J81m02l39k97n24k92N37J101J157J367J758
57709C45012J545O99k8o38j603k272j543n5N01J18L41J515K527L170M297N617
$$ y = [385533, 383836, 381495, 379402, 377999, 375868, 371343, 364484, 356201, 346725, 336363, 326412, 317802, 309982, 302435, 295980, 291242, 287224, 282784, 278216, 274110, 270045, 265770, 262205, 259910, 258018, 256007, 254968, 255605, 256568, 256429, 255879, 256371, 258002, 260406, 264265, 270013, 276288, 281582, 286401, 291982, 297849, 302485, 305664, 308356, 310878, 312673, 313369, 312827, 310721, 307155, 303000, 298755, 293949, 288526, 283586, 279751, 276119, 272023, 268559, 267104, 267522, 269144, 272237, 277099, 282823, 288372, 293857, 299531, 304614, 308477, 311863, 315639, 319467, 322908, 326566, 330763, 334361, 336452, 337992, 340192, 342479, 343693, 344182, 344900, 345407, 344602, 342758, 341132, 340143, 339457, 339260, 339899, 340765, 340946, 340544, 340205, 339908, 339384, 339092, 339629, 340730, 341887, 343254, 345012, 346557, 347256, 347228, 346590, 344987, 342715, 341172, 341117, 341618, 341736, 342077, 343592, 346119, 349289, 353586, 359203]
57693C59203N773M716L549K085p86m343o458o859p214p785p120n291m280m456
57679C20734l841j679L20J302K893O266J0334J4122J8509K4398L1468L9883N0948
57666E15657O4719P8495Q8101Q8885P6148M8441J1658k3211m8161o2376o8589
57655G69767o8860o5049n9687n3958m6992l8870l1847k7249k3578j9289j5147
57644C19241j2158r641p075n573n708n943m955l605k991k581j773j330j622j497
57630B52789m74j0r92j954j557q36j187k042k332k501l148l403k515j509j532
57615B26797j911j552p68k23M56J473J852J086K99L54L85l20p66j18O13L42k92
57598B27707m61q05j902k724k392j850k107k418j937j549k227l150l244l066l259
$$ y = [359203, 364976, 369692, 373241, 375326, 374540, 370197, 363739, 356880, 349666, 341881, 334761, 329470, 325190, 320734, 316893, 315214, 315534, 316836, 319729, 325995, 336329, 350451, 368960, 393358, 424826, 464709, 515657, 580376, 658871, 746972, 835857, 912005, 960446, 972104, 948893, 900732, 838356, 769767, 700907, 635858, 576171, 522213, 475221, 436351, 404504, 377255, 353677, 334388, 319241, 307083, 297442, 290367, 284794, 279086, 273143, 268188, 264583, 261592, 259011, 257238, 255908, 254286, 252789, 252315, 252305, 251313, 249359, 247802, 246966, 245779, 243737, 241405, 238904, 235756, 232353, 229838, 228329, 226797, 224886, 223334, 222566, 222343, 222799, 224272, 226124, 227210, 227509, 227863, 228248, 227928, 227162, 227044, 227657, 227999, 227707, 227246, 226441, 224539, 221815, 219423, 217573, 215466, 213048, 211111, 209562, 207335, 204185, 200941, 197875, 194616]
57583A94616k806q63J124J398O49O64J299J091p8j083j634k331l179l718m030
57568A81119m223l703k333j370j853k955l341l052k693j947m83P90J004Q20J138
57553A56918J433J005O92J558K924L501L536M008M541L929K134J58j463k602k723
57538A79549j623k94L24O20J150J214Q1j397j975j958k374l003k827j757n03O32
57522A65859J566J829J331R06J002Q37l3n21K90J516J935J827J885J584L14j095
57506A81032j583j549j755j757j035m12o32q00k9O87K33m64j35K88p26k312k407
57489A66644j169n79j110j363p43j71j73l66o85j236j113O67L115M098L115J570
57473A70501M58m71j374j908k199k717l216l144k903l325m134m294l559k505j454
$$ y = [194616, 191810, 190947, 192071, 193469, 194118, 194782, 196081, 197172, 197094, 196011, 194377, 192046, 188867, 185149, 181119, 176896, 173193, 170860, 169490, 167637, 164682, 161341, 158289, 155596, 153649, 153166, 153956, 154960, 155780, 156918, 158351, 159356, 160048, 161606, 164530, 168031, 171567, 175575, 180116, 184045, 186179, 186337, 184874, 182272, 179549, 177926, 177632, 177956, 178576, 179726, 180940, 181021, 179624, 177649, 175691, 173317, 170314, 167487, 165730, 165227, 165859, 167425, 169254, 170585, 171491, 172493, 173330, 173297, 172776, 173066, 174582, 176517, 178344, 180229, 181813, 182127, 181032, 179449, 177900, 176145, 174388, 173353, 172941, 172309, 171509, 171480, 172167, 172400, 171936, 171801, 172089, 171363, 169051, 166644, 165475, 164896, 163786, 162423, 161680, 161509, 161336, 160970, 160285, 159049, 157936, 158603, 161718, 165816, 168931, 170501, 170959, 170488, 169114, 167206, 165007, 162290, 159074, 155930, 153027, 149702, 145568, 141274, 137715, 135210, 133756]
57458A33756o13n86j395j739o95N97N91k24k77M02M41m16j156j380j504j366m38
57441A23998P18R56L66O0M27R66J490K040K147J639J450K191K732J966J003J580
57425A45729L110L541K549J543R68L2j099j246m49q6n45q11m70k34l34j53M55
57408A52500J027J617K475K893K021N34l09p60j823k925k634j364r43j554j531
57393A49224k93Q64J187J387J801J785J433J767K800L361L267L701M864N344M404
57378A86896L102K439K067J472R07N23J2n16n92n47j223k389k980k850k771k755
57362A80795k104j106q38j283j398j054r50p63M17J863J803M42m7J041K016J817
57346A80651J474J778J889J308R95J373J263j6j294j416q21k75K99P84M01p51
$$ y = [133756, 133143, 132557, 131162, 129423, 128728, 129325, 129916, 129692, 129415, 129817, 130258, 129842, 128686, 127306, 125802, 124436, 123998, 124716, 125672, 126038, 126098, 126525, 127491, 128981, 131021, 133168, 134807, 136257, 138448, 141180, 143146, 144149, 145729, 148839, 152380, 154929, 156472, 157440, 157472, 156373, 155127, 154678, 154592, 154047, 153236, 152766, 152532, 152198, 152045, 152500, 153527, 155144, 157619, 160512, 162533, 163067, 162758, 161998, 160175, 157250, 154616, 153252, 152309, 150755, 149224, 148931, 149795, 150982, 152369, 154170, 155955, 157388, 159155, 161955, 165316, 168583, 172284, 177148, 182492, 186896, 189998, 192437, 194504, 195976, 196883, 197406, 197418, 196902, 196310, 195763, 194540, 192151, 189171, 186321, 183550, 180795, 178691, 177585, 176747, 175464, 174066, 173012, 172062, 171299, 171716, 173579, 175382, 175824, 175777, 176818, 178834, 180651, 182125, 183903, 185792, 187100, 188095, 189468, 190731, 190715, 189421, 188005, 187184, 186909, 187208, 187992, 188393, 187642]
57330A87642j284o26L3k76r19j080r37o46J63J080Q78l47q50K2O36k16j291r66
57312A81016L40J273J672K073K329K076J637J296O19n32j299j052l12K76P90J274
57296A93476J430J628K757M392M744L341K004K232L195L568L641M278N187N710
57282B41583O071O580O707O195N885O246O293N225L878L218K580R51j087k241
57268B98084k440k543k760k747k590k500k130j283o65q81j353j161l61M50J200
57253B76320K110L028L764M464N106N371N497O286P705Q619Q492Q161Q259Q206
57239C61388P587P180P603Q196Q357Q736R957J1231J1502J1022J0641J0471J0328
57226D84199J0629J1684J2855J3335J3121J2558J1779J1242J1598J2346J1936
$$ y = [187642, 186358, 185732, 185765, 185489, 184570, 183490, 182553, 181907, 182070, 183150, 184028, 183681, 182831, 182853, 183489, 183273, 181982, 181016, 181356, 182629, 184301, 186374, 188703, 190779, 192416, 193712, 194331, 193799, 192500, 191448, 191136, 191412, 192202, 193476, 194906, 196534, 199291, 203683, 208427, 211768, 213772, 216004, 219199, 222767, 226408, 230686, 235873, 241583, 247654, 254234, 260941, 267136, 273021, 279267, 285560, 290785, 294663, 297881, 300461, 301412, 300325, 298084, 295644, 293101, 290341, 287594, 285004, 282504, 280374, 279091, 278426, 277545, 276192, 275031, 274670, 275120, 276320, 278430, 281458, 285222, 289686, 294792, 300163, 305660, 311946, 319651, 328270, 336762, 344923, 353182, 361388, 368975, 376155, 383758, 391954, 400311, 409047, 419004, 430235, 441737, 452759, 463400, 473871, 484199, 494828, 506512, 519367, 532702, 545823, 558381, 570160, 581402, 593000, 605346, 617282]
57215F17282J0063Q425Q290Q805Q873R097J0449J2364J3803J4965J6313J7020
57203G55749J6165J4608J3889J3877J3181J1489R923R348R561R966J0115R846
57191H97717R648J0373J2005J3451J4119J4652J5534J6225J6524J7307J8831J9754
57179A076140J9201J8401J8751J9542J9289J8162J7392J7175J6965J7055J8063
57168A276136J9482K0323K0693K1306K2067K2566K3206K4360K5139K4607K3535
57157A523420K3358K3944K3990K3089K1924K0845J9819J9277J9527J9787J9145
57146A758125J8068J7526J7253J6345J5034J4316J4237J4131J4159J4984J6280
57135A930458J6968J6708J5915J4767J3506J3159J4442J6368J7420J7596J7884
$$ y = [617282, 627345, 635770, 644060, 652865, 661738, 670835, 681284, 693648, 707451, 722416, 738729, 755749, 771914, 786522, 800411, 814288, 827469, 838958, 848881, 858229, 867790, 877756, 887871, 897717, 907365, 917738, 929743, 943194, 957313, 971965, 987499, 1003724, 1020248, 1037555, 1056386, 1076140, 1095341, 1113742, 1132493, 1152035, 1171324, 1189486, 1206878, 1224053, 1241018, 1258073, 1276136, 1295618, 1315941, 1336634, 1357940, 1380007, 1402573, 1425779, 1450139, 1475278, 1499885, 1523420, 1546778, 1570722, 1594712, 1617801, 1639725, 1660570, 1680389, 1699666, 1719193, 1738980, 1758125, 1776193, 1793719, 1810972, 1827317, 1842351, 1856667, 1870904, 1885035, 1899194, 1914178, 1930458, 1947426, 1964134, 1980049, 1994816, 2008322, 2021481, 2035923, 2052291, 2069711, 2087307, 2105191]
57124B105191J8265J7973J7280J7282J8197J9456K1267K4485K9131L4591M1086
57113B364204M9393N9247O9505P9779R0546J01857J13482J26064J40794J58215
57103C353086J78809K04391K37305K78599L28676L89431M63848N53542O58518
57094F646205P79182R16572J070377J238648J419598J611610J810479K007857
57086A7500528K192245K349137K458861K495856K431976K242271J912403J449077
57078C5032354Q90197L03854k31447o57578r58644j158800j299373j413986j518368
57069B8988209j615151j701282j769729j809740j811714j773599j701334j603828
57061A5201832j489392j366001j241400j121226j008046r02750q05773p16909
$$ y = [2105191, 2123456, 2141429, 2158709, 2175991, 2194188, 2213644, 2234911, 2259396, 2288527, 2323118, 2364204, 2413597, 2472844, 2542349, 2622128, 2712674, 2814531, 2928013, 3054077, 3194871, 3353086, 3531895, 3736286, 3973591, 4252190, 4580866, 4970297, 5434145, 5987687, 6646205, 7425387, 8341959, 9412336, 10650984, 12070582, 13682192, 15492671, 17500528, 19692773, 22041910, 24500771, 26996627, 29428603, 31670874, 33583277, 35032354, 35922551, 36226405, 35994958, 35337380, 34378736, 33219936, 31920563, 30506577, 28988209, 27373058, 25671776, 23902047, 22092307, 20280593, 18506994, 16805660, 15201832, 13712440, 12346439, 11105039, 9983813, 8975767, 8073017, 7267244, 6550335]
57053F550335o35491n61403m95085m36475l84890l39900l01112k67205k36516
57044B892258k08658j84386j63825j46070j30499j17177j05812r5555q6004p7282
57034A576990o9125o1016n3208m6453m0633l4924k9171k3762j8088j0445J29J3018
57022A203312K6801L9423M7394M6478L4361J2523j4333m0183n9794p0789p4304
57011A150889p3039o8792o2417n5164m8448m2515l6817l1558k7447k4187k0765
57000F59740j7173j4342j2368j0405q345p019o579o247n792n731n880n223l538
56987E51098j686R0K666O434J0388J3143J3717J1255N477k233r477j4920j8751
56974E67201k1155k1796k0909j9404j7580j4975j1796r102p306n728l799j506
$$ y = [6550335, 5914844, 5353441, 4858356, 4421881, 4036991, 3697091, 3395979, 3128774, 2892258, 2683600, 2499214, 2335389, 2189319, 2058820, 1941643, 1835831, 1740276, 1654272, 1576990, 1507865, 1446849, 1393641, 1347188, 1306555, 1271631, 1242460, 1218698, 1200610, 1190165, 1190294, 1203312, 1230113, 1269536, 1316930, 1363408, 1397769, 1410292, 1395959, 1355776, 1295982, 1225193, 1150889, 1077850, 1009058, 946641, 891477, 843029, 800514, 763697, 732139, 704692, 680505, 659740, 642567, 628225, 615857, 605452, 597107, 590088, 583509, 577262, 571470, 565739, 559859, 554636, 551098, 549412, 549502, 552168, 558602, 568990, 582133, 595850, 607105, 612582, 610349, 600872, 585952, 567201, 546046, 524250, 503341, 483937, 466357, 451382, 439586, 430484, 423178, 417450, 413651, 412145]
56962D12145J387N149R088J2276J5264J9414K4183K6703K4574J7803P921l128
56950E72779j2936j9414k2429k3506k3536k2153j9479j6741j4576j2301r466o634
56938C69608m044j027K722O631J0594J5492K1761K8544L4376L7332L4723K4830
56926E81542R657n795j7743k5696l0366l1870l0882k9279k8130k6517k3574k0130
56914C21217j7268j4717j1934r516q197p585p013o595o427n824m392k891k128
56901B16730j926j914k331l153l537k934j841p48O84K675M675O371Q331J1042
56887B32124J4265J7820K1695K4805K4923K0743J3178M254m161j0354j3193j3345
56875C32754j2762j2285j0968q171m770j660J343M488P529J0933J5953K2646K9533
$$ y = [412145, 413532, 418681, 427769, 440045, 455309, 474723, 498906, 525609, 550183, 567986, 575907, 572779, 559843, 540429, 518000, 494494, 470958, 448805, 429326, 412585, 398009, 385708, 376242, 369608, 365564, 364537, 367259, 373890, 384484, 399976, 421737, 450281, 484657, 521989, 556712, 581542, 591199, 585404, 567661, 541965, 511599, 479729, 448847, 419568, 391438, 364921, 341347, 321217, 303949, 289232, 277298, 267782, 259585, 252000, 244987, 238392, 231965, 226141, 221749, 218858, 216730, 214804, 212890, 210559, 207406, 203869, 200935, 199094, 198346, 199030, 201705, 206380, 212751, 221082, 232124, 246389, 264209, 285904, 310709, 335632, 356375, 369553, 373807, 369646, 359292, 346099, 332754, 319992, 307707, 296739, 288568, 283798, 282138, 283481, 287969, 295498, 306431, 322384, 345030, 374563]
56862C74563L5995M3369N2545O1826O7966O7835N8825M0130J5226q908k6782l7599
56850G44991m2973m3775m0728l5830l0865k5703j9726j3552p739j259O907J5997
56838E05745K5097L5267M8181O3746Q0674R7650J11498J15423J02540P2019L0603
56827A288443j1746m6873p0583q2718q5902q3217p6633o7643n8119m9378m1188
56816F14443l2807k4262j5705o500L825J4646K5472L7241N1049O6025P8990Q5282
56804H97699P9723N9283K6898q544l7977n7680o8612p2508p0747o5456n8863n1637
56792E71579m3540l5287k8084k1954j6143j0594n450K21P501J5915K4280L2516
56780D90960M0649M6284M5233L5134J7605k917k1438l4315m0769m2818m2879m1602
$$ y = [374563, 410558, 453927, 506472, 568298, 636264, 704099, 762924, 803054, 818280, 809372, 782590, 744991, 702018, 658243, 617515, 581685, 550820, 525117, 505391, 491839, 484100, 482841, 489748, 505745, 530842, 566109, 614290, 678036, 758710, 856360, 967858, 1083281, 1185821, 1257840, 1288443, 1276697, 1229824, 1159241, 1076523, 990621, 907404, 830771, 763128, 705009, 655631, 614443, 581636, 557374, 541669, 535169, 538994, 553640, 579112, 616353, 667402, 733427, 812417, 897699, 977422, 1036705, 1063603, 1055059, 1017082, 959402, 890790, 818282, 747535, 682079, 623216, 571579, 528039, 492752, 464668, 442714, 426571, 415977, 410527, 410748, 418249, 434164, 458444, 490960, 531609, 577893, 623126, 658260, 675865, 672948, 651510, 617195, 576426, 533608, 490729, 449127]
56768D49127l8682l4707l0911k7670k4612k1733j9207j6653j3778j1247r762q865
56756A91300p764o631n956n359m287l182k752k735k550k396k597k631k016j304
56742A39140j031o29L59J054O19j56j87L9m44j121q22K45R12R13P73O06M20Q39
56724A41529K036K866K472J755J748J758Q84P1O00J620J423L40P1P78J165R16
56708A62032Q64J072Q27L15L65Q05Q22N58O56P28M2q17q32m65q70j792k185k163
56690A59962k384k300j140N6k42j287j083L65J304J363J851L047L720L449L121
56675A69802K939K092O27m26q71j446k069j908j059l91Q2Q25J207L64q41r29l72
56658A67626o81j481j078L07P31j20n40J03N98M45N46R82P20j31k71J93k73j610
$$ y = [449127, 410445, 375738, 344827, 317157, 292545, 270812, 251605, 234952, 221174, 209927, 200165, 191300, 183536, 176905, 170949, 165590, 161303, 158121, 155369, 152634, 150084, 147688, 145091, 142460, 140444, 139140, 138109, 137480, 137839, 138893, 139512, 139356, 139169, 139208, 138764, 137643, 136821, 137066, 137978, 138891, 139664, 140270, 140690, 141529, 143565, 146431, 148903, 150658, 152406, 154164, 155048, 155119, 155719, 157339, 158762, 159102, 159173, 159951, 161116, 162032, 162896, 163968, 164795, 165110, 165475, 166280, 167102, 167660, 168316, 169044, 169086, 168269, 167437, 166972, 166102, 164310, 162125, 159962, 157578, 155278, 154138, 154194, 153952, 152665, 151582, 151947, 153251, 154614, 156465, 159512, 163232, 166681, 169802, 172741, 174833, 175460, 175034, 174163, 172717, 170648, 168740, 167681, 167290, 167372, 168197, 169404, 169768, 168927, 167998, 167626, 166945, 165464, 164386, 164693, 165424, 165304, 164764, 164867, 165465, 165910, 166456, 167438, 168158, 168027, 167756, 167949, 167676, 166066]
56640A66066j869n65M08L0k79O33J806K136J984J779J046j19n59pL28j17l49J86
56622A72538N89K50k35n45j159j806j393j25L02o03j287q02j95l56n18qL93M7
56604A65087k70K10R66J276J249J040M31l01m48k46o11j316j128j05K67m31r15
56587A64755n59l03o68q94o85p62j048m17J045J681Q76J6R2M84Q05J736L143L645
56569A72942K994K738L547M039L352K688L175M303N625P956J1559J5070J7409
56556B57397J8819J8988J6288J0318L338k124n448o789n982l922k902l938n365
56543B88678n425m648m326m421m323m156m044l506k670k559l291l603l033k752
56529B35921l354l743l200k572k392j855p09j44o11q02K8P55N67K81L54k64j894
$$ y = [166066, 164197, 163632, 164040, 164070, 163791, 164424, 166230, 168366, 170350, 172129, 173175, 173056, 172497, 172490, 172818, 172701, 172352, 172538, 173127, 173377, 173142, 172597, 171438, 169632, 168239, 168114, 168416, 167813, 166526, 165724, 165529, 165173, 164655, 164647, 165040, 165087, 164817, 165027, 165993, 167269, 168518, 169558, 169989, 169688, 169240, 168994, 168383, 167067, 165939, 165834, 166101, 165670, 164755, 164196, 163893, 163225, 162331, 161646, 160884, 159836, 159419, 160464, 162145, 163021, 163037, 163129, 163613, 164418, 166154, 169297, 172942, 175936, 178674, 182221, 186260, 189612, 192300, 195475, 199778, 205403, 213359, 224918, 239988, 257397, 276216, 295204, 311492, 321810, 325148, 323024, 317576, 310787, 304805, 300883, 297981, 294043, 288678, 283253, 278605, 274279, 269858, 265535, 261379, 257335, 253829, 251159, 248600, 245309, 241706, 238673, 235921, 232567, 228824, 225624, 223052, 220660, 218805, 218096, 217952, 217341, 216539, 216567, 217322, 217889, 218170, 218524, 218260, 216366]
56512B16366k969k522j785j898k123j740j513j821j511j75O21ln96j6M98k78j258
56495A97277j100n47p33j040o02j66n39r02m47L8j24RJ107J971J506N28R4j33
56477A96197l70K96J893K680J871R91J026O59q73j929j389p39j077q75R36K351
56461B01648J533k1l45m17j597k291o31J711J989Q19O36J398J384Q54J325K399
56445B10394K729L018M665O435N800K930K60j170j966j914m41J140Q67p51j555
56430B30441j150q78j048p99j77J42N50J600K191J152l42l73N67O49l4J9P34P23
56412B33967j05p03j025j581j667m71Q21M85r65j767j667j426p55O67J426L52
56396B25586q66J2K011K485J428J016J677J890J429J548K274K390J920J898K013
$$ y = [216366, 213397, 210875, 209090, 207192, 205069, 203329, 201816, 199995, 198484, 198309, 198930, 198927, 198331, 198315, 198813, 198535, 197277, 196177, 195630, 194897, 193857, 193255, 193089, 192550, 191648, 191201, 191239, 191115, 191124, 192231, 194202, 195708, 196236, 196330, 196197, 195827, 196123, 198016, 200696, 202567, 203558, 204584, 205243, 204370, 202441, 201052, 200313, 199236, 198361, 199297, 201648, 203181, 203160, 202815, 202398, 200801, 198510, 197879, 199590, 201579, 202398, 203034, 204432, 205816, 206670, 207995, 210394, 213123, 216141, 220806, 227241, 233041, 235971, 236231, 235061, 233095, 231181, 230740, 231880, 232747, 231996, 230441, 229291, 228413, 227365, 226566, 226389, 226531, 227081, 228681, 230872, 232024, 231682, 231309, 231876, 232525, 232491, 232510, 233244, 233967, 233862, 233159, 232134, 230553, 228886, 228415, 229236, 229721, 228756, 226989, 225322, 223896, 223141, 223808, 225234, 225586, 224720, 224732, 226743, 229228, 230656, 231672, 233349, 235239, 236668, 238216, 240490, 242880, 244800, 246698, 248711]
56381B48711J147j40l19L83N54L22R45K140K531K186K224K409J712O49N42J017
56365B67013O92k93p90p60o35K43K076K957J543j22M44J993J734K28K15J645J963
56348B80146P63J77Q15J053L37j93k89o31o13Q10K463K369J270J560L285M471
56332B97793M742N156N201L640J735J894L599M379M229N129O707O529M491K895
56318C58119K226R24q27j164k86j24m33O17K167J489r25j602K27J788J939K619
56302C66754M392N232M712M960O380O671N294M702N809O363N126L889L910M075
56288D38269L810M317N647O104N584O069P847Q852Q551Q810J0088J0573R938J0061
56274E44520J1175J1326J0546J1385J4262J6512J7203J8561K1359K3239K3202
$$ y = [248711, 249858, 249718, 249399, 249782, 250336, 250658, 251603, 253743, 256274, 258460, 260684, 263093, 264805, 265454, 265996, 267013, 267705, 267412, 266622, 265862, 265227, 265470, 267546, 270503, 272046, 271924, 272368, 274361, 276095, 276323, 276538, 278183, 280146, 280909, 281086, 281901, 282954, 283291, 283098, 282809, 282178, 281565, 282375, 284838, 287207, 288477, 290037, 293322, 297793, 302535, 307691, 312892, 316532, 318267, 320161, 323760, 328139, 332368, 337497, 344204, 350733, 355224, 358119, 360345, 361269, 360442, 359278, 358992, 358868, 358435, 359052, 361219, 362708, 361783, 360181, 360408, 362196, 364135, 366754, 371146, 376378, 381090, 386050, 392430, 399101, 404395, 409097, 414906, 421269, 426395, 430284, 434194, 438269, 442079, 446396, 452043, 458147, 463731, 469800, 477647, 486499, 495050, 503860, 513948, 524521, 534459, 544520, 555695, 567021, 577567, 588952, 603214, 619726, 636929, 655490, 676849, 700088, 723290]
56263G23290K3523K5484K7434K8805L1892L7607M3535M8186N3452O0805O8810
56252A172823P6469Q5400R6631J08609J20255J32604J45672J57185J66101J73936
56242B435685J81002J84920J84383J80731J74172J62254J43878J21139R5619O6684
56232C930467L5097M228k4194n1655p8313j01017j17877j30805j41423j48451
56222C176057j51281j52122j52261j50055j44842j38962j33674j27025j18108
56213A907727j09463j02844r6526q9176q2469p7358p1755o4503n7861n3456m9567
56202A052749m4878m0967l8517l5118k9663k4981k3234k2483k0543j8484j7471
56191G36410j5959j2944j0387r607q829o870n544n898n976m803m470n738n814
$$ y = [723290, 746813, 772297, 799731, 828536, 860428, 898035, 941570, 989756, 1043208, 1104013, 1172823, 1249292, 1334692, 1431323, 1539932, 1660187, 1792791, 1938463, 2095648, 2261749, 2435685, 2616687, 2801607, 2985990, 3166721, 3340893, 3503147, 3647025, 3768164, 3863783, 3930467, 3965564, 3969792, 3945598, 3893943, 3815630, 3714613, 3596736, 3465931, 3324508, 3176057, 3024776, 2872654, 2720393, 2570338, 2425496, 2286534, 2152860, 2025835, 1907727, 1798264, 1695420, 1598894, 1509718, 1427249, 1349891, 1278136, 1213633, 1155772, 1102316, 1052749, 1007871, 966904, 928387, 893269, 863606, 838625, 815391, 792908, 772365, 753881, 736410, 720451, 707507, 697120, 687513, 678684, 671814, 666270, 660372, 654396, 649593, 645123, 639385, 633571]
56178F33571l326j142j345j801o56K15n98r07P09J849R22L90J996L321K677K723
56162F38598N348P675P215O489Q295J0712J1269J1742J4317J6993J7429J7522
56150G73604J9699K2414K3739K5612L0106L5222L8849M3180N0846O0357O9687
56139A193315Q0375R3571J05798J13303J16794J17465J12534R9930Q3705O9863
56129B186653O0016N3523N1605N4031N5469N0697M0803K9786J8546O772l067r005
56117B595829j3832k1526l2451m5918o3320q4171j03040j15191j21561j24096
56107A870723j20945j11090r8862q8448p8319o6282n5230m8212m2544l4747k6927
56096A099117k2330j9000j3963r309p945p550m838j672j034j143N28K000J348
$$ y = [633571, 630245, 629103, 627758, 625957, 625301, 625516, 624918, 624011, 624720, 626569, 627491, 627881, 629877, 633198, 635875, 638598, 643946, 651621, 658836, 665325, 673620, 684332, 695601, 707343, 721660, 738653, 756082, 773604, 793303, 815717, 839456, 865068, 895174, 930396, 969245, 1012425, 1063271, 1123628, 1193315, 1273690, 1367261, 1473059, 1586362, 1703156, 1820621, 1933155, 2033085, 2116790, 2186653, 2246669, 2300192, 2351797, 2405828, 2461297, 2511994, 2552797, 2582583, 2601129, 2607901, 2604834, 2595829, 2581997, 2560471, 2528020, 2482102, 2418782, 2334611, 2231571, 2116380, 1994819, 1870723, 1749778, 1638688, 1539826, 1451378, 1373059, 1306777, 1251547, 1203335, 1160791, 1126044, 1099117, 1076787, 1057787, 1043824, 1034515, 1026570, 1019020, 1014182, 1012510, 1011476, 1010333, 1010861, 1012861, 1014209]
56083A014209J575M976P818O917N947Q608J1241R553O886Q040J0434R597Q112
56070A113913J0505J4245J4526J3350J5215J8310J8565J7887J9804K1560J9286
56059A297166J6323J7471J9760J8040J4860J5366J7247J5482J2392J3114J5567
56048A472788J4877J3226J5353J8807J8722J7575K0049K3229K2269K0613K3793
56037A681301K8412K8450K7016L0140L4592L4065L1944L5112M0473M0764L8566
56026B050835M0951M5292M4468M1253M3240M8153M8693M7368N1617N8758O0912
56015B581540O0422O5002P2073P3639P2240P6063Q2767Q4415Q3695Q8570R5894
56004C436320R7535R7365J04300J14149J17041J17058J24923J37212J43296J46694
$$ y = [1014209, 1015784, 1020760, 1028578, 1035495, 1041442, 1050050, 1061291, 1070844, 1077730, 1085770, 1096204, 1105801, 1113913, 1124418, 1138663, 1153189, 1166539, 1181754, 1200064, 1218629, 1236516, 1256320, 1277880, 1297166, 1313489, 1330960, 1350720, 1368760, 1383620, 1398986, 1416233, 1431715, 1444107, 1457221, 1472788, 1487665, 1500891, 1516244, 1535051, 1553773, 1571348, 1591397, 1614626, 1636895, 1657508, 1681301, 1709713, 1738163, 1765179, 1795319, 1829911, 1863976, 1895920, 1931032, 1971505, 2012269, 2050835, 2091786, 2137078, 2181546, 2222799, 2266039, 2314192, 2362885, 2410253, 2461870, 2520628, 2581540, 2641962, 2706964, 2779037, 2852676, 2924916, 3000979, 3083746, 3168161, 3251856, 3340426, 3436320, 3533855, 3631220, 3735520, 3849669, 3966710, 4083768, 4208691, 4345903, 4489199, 4635893]
55994D635893J57969J72632J78870J81241J92951K10678K21720K29924K48521
55985F430399K73298K90217L03741L28958L61731L86656M08469M43772M87908
55976I715149N23689N56720O06513O69102P26342P85569Q69393R73276J077133
55967A6502886J191870J346895J538733J743604J973860K266388K623989L030951
55959C2219176L518539M146520M930963N870626P035336Q539721J0446402J2808398
55951H9515681J5799368J9681274K4660975L0870916L8228367M5705073N0541712
55944C15003366M8918111L8471734K0612391J33566j7726028l0027850l6574980
55937C38810310l8614243l7606237l4808109l1205656k7424430k3758392k0356334
$$ y = [4635893, 4793862, 4966494, 5145364, 5326605, 5519556, 5730234, 5951954, 6181878, 6430399, 6703697, 6993914, 7297655, 7626613, 7988344, 8375000, 8783469, 9227241, 9715149, 10238838, 10795558, 11402071, 12071173, 12797515, 13583084, 14452477, 15425753, 16502886, 17694756, 19041651, 20580384, 22323988, 24297848, 26564236, 29188225, 32219176, 35737715, 39884235, 44815198, 50685824, 57721160, 66260881, 76707283, 89515681, 105315049, 124996323, 149657298, 180528214, 218756581, 264461654, 315003366, 363921477, 402393211, 423005602, 423139168, 405413140, 375385290, 338810310, 300196067, 262589830, 227781721, 196576065, 169151635, 145393243, 125036909]
55930A25036909j7328414j4705585j2439112j0490787q859789p516883o390631
55923D7305708n433788m641118l993540l444207k968751k575484k256974j979860
55915B0011986j729776j520792j353008j202617j060789r42733q51091p66996
55907A0584184o84151o17141n69131n23577m74532m34749m07380l78492l43918
55898F151113l16212k98914k79661k54533k34613k22972k08725j89210j75291
55889C970982j69482j60677j45560j34201j29518j21765j08248r8634r5580q9266
55879B718051p6344o6091o2839n9900n5487n7096o5315p0208o8623o8785p3205
55868A994158p3401o6478o0924o0652n8628n1698m6888m7373m6328m0425l6040
$$ y = [125036909, 107708495, 93002910, 80563798, 70073011, 61213222, 53696339, 47305708, 41871920, 37230802, 33237262, 29793055, 26824304, 24248820, 21991846, 20011986, 18282210, 16761418, 15408410, 14205793, 13145004, 12202271, 11351180, 10584184, 9900033, 9282892, 8713761, 8190184, 7715652, 7280903, 6873523, 6495031, 6151113, 5834901, 5535987, 5256326, 5001793, 4767180, 4544208, 4335483, 4146273, 3970982, 3801500, 3640823, 3495263, 3361062, 3231544, 3109779, 3001531, 2902897, 2807317, 2718051, 2641707, 2575616, 2512777, 2452877, 2397390, 2340294, 2274979, 2204771, 2136148, 2067363, 1994158, 1920757, 1854279, 1793355, 1732703, 1674075, 1622377, 1575489, 1528116, 1481788, 1441363, 1405323]
55857A405323l6532l6176l1966k9096k9789k8689k4119k2135k4916k6575k4778
55846A090552k4935k8699k9934k6399k4100k5600k5332k0951j8240j9949k0675
55835H25738j7541j5479j7071j7446j4118j1818j2806j2208p863n077o701p970
55823F79640o075n498q805j1302j0043r299j1877j3521j1278r147j0137j0638
55811E62020p893n433n935n970k881J32M96J001L635N584N537P036J1306J3814
55797E82449J2065R843R564P701K161l032n049p176j1722j4971j4120j2536j3066
55784E42111j2690q902n236n212o663p029q329j1870j3840j1474q128p071n572
55771D30095l41O306J0882J4322J7870J8213J2288L085m412r488j3607j6019j5874
$$ y = [1405323, 1368791, 1332615, 1300649, 1271553, 1241764, 1213075, 1188956, 1166821, 1141905, 1115330, 1090552, 1065617, 1036918, 1006984, 980585, 956485, 930885, 905553, 884602, 866362, 846413, 825738, 808197, 792718, 775647, 758201, 744083, 732265, 719459, 707251, 699388, 694311, 687610, 679640, 673565, 668067, 659262, 647960, 637917, 628618, 616741, 603220, 591942, 582795, 572658, 562020, 554127, 548694, 542759, 536789, 533908, 534040, 534536, 535537, 539172, 544756, 550293, 557329, 568635, 582449, 594514, 604357, 613921, 621622, 623783, 620751, 615702, 608526, 596804, 581833, 567713, 555177, 542111, 529421, 520519, 515283, 510071, 503408, 496379, 488050, 476180, 462340, 450866, 442738, 435667, 430095, 429754, 436060, 446942, 461264, 479134, 497347, 509635, 512720, 508308, 498820, 485213, 469194, 453320]
55758D53320j5171j5453j4946j2512j0676j1328j2405j2066j2037j3507j4115
55747C09104j2353j0581j0336r248n997l544l807l913j544Q20Q36O38K161K912
55733B55148P85j545j371p06j900l011k040j383l339n386m782l742n101o697n297
55718B09633k534j762k195j215M91J043J703M286O984P348O792P584Q139N931
55704B52228K432N20n63l037n762o294n593o184p513p411o392o260o249m629k456
55689A86837j863k228j655n10o1N07K303L926L850L527M811O435O415N599N409
55674B23302M549J595j490k240j835k597l626k796j025n42q17r2R64Q30N11J575
55658B16266K768K275J398K146L238K459J063J631L280L202J546O08M79m39j834
$$ y = [453320, 438149, 422696, 407750, 395238, 384562, 373234, 360829, 348763, 336726, 323219, 309104, 296751, 286170, 275834, 266586, 260589, 257045, 253238, 249325, 247781, 248601, 249437, 250075, 252236, 255148, 255933, 254388, 253017, 252311, 250411, 247400, 245360, 243977, 240638, 235252, 230470, 226728, 221627, 214930, 209633, 207099, 205337, 203142, 201927, 202418, 203461, 205164, 209450, 216434, 223782, 230574, 238158, 246297, 252228, 254660, 255180, 254617, 251580, 245818, 239524, 233931, 227747, 220234, 212823, 206431, 200171, 193922, 189293, 186837, 184974, 182746, 181091, 180581, 180520, 181027, 183330, 187256, 191106, 194633, 199444, 205879, 212294, 217893, 223302, 227851, 229446, 227956, 225716, 223881, 221284, 217658, 214862, 213837, 213295, 212478, 212386, 213350, 214180, 214691, 216266, 219034, 221309, 222707, 224853, 228091, 230550, 231613, 233244, 236524, 239726, 241272, 241880, 242359, 241920, 240086]
55643B40086k244k369l767n450n451m654n336p038p517o806o629o834o028m807
55629A65156m751n110l968j845p85p78l54K84j9n61K3Q26K23q33m27O00K2j772
55611A45931k631k451k654k937k074r49j264k153j624l54n11j707j827j008j022
55596A20765j539q32M50J17j409j611k65M80J21K03Q28L81j083j623p79j1K43
55579A14436R18J832J915J725K724M243M331L376L674N561P195Q074R446J1127
55565A80577J1230R463P623O448M760K025q47l386n804p377p179o228o400p427
55551A77478p558o777o530o705n836m130l210l109k405j196r28j447j236l83l66
55536A25662j024q82k02n48j472j047L52L38j230j847p37p7j131k424k690k656
$$ y = [240086, 237842, 235473, 231706, 226256, 220805, 216151, 210815, 203777, 196260, 189454, 182825, 175991, 169963, 165156, 160405, 155295, 151327, 149482, 148697, 147919, 147565, 147849, 147830, 147269, 147292, 148118, 148341, 147508, 147081, 147681, 147703, 145931, 143300, 140849, 138195, 135258, 133184, 132235, 130971, 128818, 127194, 126840, 126329, 124622, 122795, 121787, 120765, 119226, 118394, 118844, 118961, 117552, 115941, 115676, 116156, 116277, 116480, 117308, 117689, 116606, 114983, 114204, 114193, 114436, 115354, 117186, 119101, 120826, 123550, 127793, 132124, 135500, 139174, 144735, 151930, 160004, 169450, 180577, 191807, 201270, 208893, 215341, 220101, 222126, 221279, 217893, 212089, 204712, 197533, 191305, 184905, 177478, 169920, 163143, 156613, 149908, 144072, 139942, 136732, 133623, 131218, 130022, 129094, 127647, 126411, 126028, 125662, 124638, 123756, 123554, 123006, 121534, 120487, 120839, 121177, 119947, 118100, 117363, 117286, 116155, 113731, 111041, 108385]
55520A08385k947k946k596k802l364k999j880j551k042j727m59P2m87n03M39P14
55504H3307k87j017o48l29p59r97o16n64j049r05J46Q95R12J112J635J576J236
55487H3648J925L160K805P25n70J82J314J324R49R56N59n97j256o81J17L54O35
55470I5549J150R25j76q07m44k12o03n68J59J87j064k128j917j321j342j557j431
55453H4400j283j029rJ240J095m20j199k88O78K94n80p40n05m27r3O05P82K38
55435H2759J17R25J609J473J141Q91J7j306j602m90N08M63L02O76P33N0l56q5
55417H7825k01j011j167k40J58p49j228R9J812J971J013M64L57j01o22m39J56
55400H8097L94L06K24m1n82q87q22q95j026m10P80J166L14n34n84n70q97o65M67
$$ y = [108385, 105438, 102492, 99896, 97094, 93730, 90731, 88851, 87300, 85258, 83531, 83072, 83144, 82657, 82154, 82593, 83307, 83020, 82003, 81355, 81026, 80267, 79270, 78654, 78090, 77041, 76136, 76282, 77177, 78089, 79201, 80836, 82412, 83648, 85573, 88733, 91538, 92263, 91693, 91875, 93189, 94513, 95462, 96418, 96977, 96380, 95124, 94443, 94560, 94914, 95549, 96699, 97624, 97448, 96641, 96197, 95985, 95382, 94814, 94973, 95160, 94096, 91968, 90051, 88730, 87388, 85831, 84400, 83117, 82088, 82079, 83319, 84414, 83994, 82795, 82507, 83185, 83479, 82899, 82159, 81654, 81227, 81134, 81739, 82521, 82759, 82876, 83801, 85410, 86883, 88024, 88915, 88932, 87626, 86024, 85534, 86042, 86505, 86807, 87483, 88216, 88266, 87910, 87825, 87624, 86613, 85446, 85206, 85364, 84615, 83387, 83486, 85298, 87269, 88282, 88746, 89103, 89002, 88380, 87941, 88097, 88491, 88797, 89021, 88980, 88398, 87511, 86689, 85794, 84768, 84358, 85138, 86304, 86618, 86084, 85500, 84930, 84033, 83368, 83835]
55381H3835J266Q98J50k83r03j776j727l64R54J287J430J957J938R26K15O65J133
55364I1601N56k15j80j5n41j043p73m84q76j074k20Q87J224J114R13o2j804k514
55346H6494j125P56J204P25P44R75M02m51l73L39N66L28K89K05m19r91p98l93
55328H8477n26p34m63m42j322k088j569m74j52l52KP58J046J017J227J136J3j351
55310H4203j568p11J02N04P32M42o35j448q18O58J400J096P26P80Q50O31J56n86
55292H6514j237r51L18J244Q54r0n05o08r17q10K96J410J285M43K15N39L65m27
55274H7938j081j364j409q54M37J415J114K05j08j5l71q25m03O04J027P29N40
55257H7579O85P07O77J058J600J585Q90j16j187j764q89J275K787K205O33J4L61
$$ y = [83835, 85101, 85999, 86149, 85866, 84963, 83187, 81460, 81096, 82050, 83337, 84767, 86724, 88662, 89588, 89803, 90468, 91601, 92157, 91942, 91762, 91747, 91206, 90163, 89390, 88906, 88030, 86956, 86736, 87623, 88847, 89961, 90874, 90812, 89008, 86494, 85369, 86125, 87329, 88054, 88798, 89773, 90175, 89724, 89351, 89690, 90256, 90584, 90873, 91078, 90659, 89668, 88870, 88477, 87951, 87217, 86754, 86312, 84990, 82902, 81333, 80859, 80707, 80355, 80357, 81115, 82161, 83178, 84405, 85541, 85554, 84203, 82635, 81924, 82026, 82530, 83262, 83704, 83069, 81621, 80803, 81461, 82861, 83957, 84683, 85463, 86313, 86944, 87100, 86514, 85277, 84326, 84644, 85888, 86742, 86652, 86147, 85539, 84622, 83812, 84108, 85518, 86803, 87246, 87461, 88000, 88365, 87938, 86857, 85493, 84084, 83230, 83667, 85082, 86196, 86401, 86293, 86278, 85907, 85082, 84679, 85283, 86310, 87039, 87579, 88264, 88971, 89648, 90706, 92306, 93891, 94781, 94665, 93478, 91714, 90825, 92100, 94887, 97092, 97725, 97739, 98100]
55240I8100L42k76o36o00o86o61MO92L67n79r11n96o23j065j102o91n54o25j92
55221H9708M61K22r63j831j594p04K19R68J232P02k36p62o32r7P11J515J556O06
55203I1081l11k66J20j32n35o4P81N98n22j053l92N21R47J154J287Q30l36j421
55185I2287j604q07M44J328J144K6j008j277j093p55R3J339J833J085L01M74O70
55168I4480j53r34r8J635K193J264L04m3l20m01M44J678J781O07m25o12o45q88
55150I9867q43n09n51q07l17Q60J426Q39K1k57l13m92n20l24l52p02r29q99r25
55131I4273r95p81l89j47Q7N60Q95Q02Q37J326J340J70r47m22J040J445O54L11
55113A00059Q58R66M9q74j135j229j268o50L19M25l64o67JN15L17L64J217J967
$$ y = [98100, 98442, 98166, 97530, 96930, 96244, 95583, 95587, 96279, 96646, 96067, 95156, 94560, 93937, 92872, 91770, 91079, 90525, 89900, 89708, 90169, 90391, 89428, 87597, 86003, 85299, 85518, 86486, 87718, 88420, 88184, 87422, 86790, 86693, 87404, 88919, 90475, 91081, 90770, 90504, 90624, 90492, 89957, 89893, 90674, 91272, 90750, 89697, 89305, 89826, 90773, 91927, 93214, 94044, 93708, 92287, 90683, 89876, 90320, 91648, 92792, 92818, 91810, 90533, 89440, 88685, 88778, 90117, 91950, 93035, 93336, 93810, 94480, 94327, 93393, 93295, 94930, 97123, 98387, 98691, 98648, 98328, 97927, 98371, 100049, 101830, 102437, 102012, 101400, 100755, 99867, 99024, 98515, 97964, 97157, 96840, 97700, 99126, 99965, 99986, 99729, 99416, 98924, 98404, 98080, 97728, 97026, 96097, 95198, 94273, 93278, 92497, 92108, 91961, 92048, 92608, 93503, 94305, 95142, 96468, 97808, 97978, 97031, 96609, 97649, 99094, 99748, 100059, 100917, 101883, 101932, 101058, 99923, 98694, 97426, 96776, 97095, 97520, 97156, 96489, 96490, 97005, 97322, 97686, 98903, 100870]
55095A00870J895J600J642J540Q90J48l82r13j110k09J239J511K81o39l8R57R75
55078A10257N76R21J631J534O45j9l5J64J58j75q12j408j442r75o18m84k9P24
55060A10613Q63J8q45p98j95J10K3k9K3pj17k30l37k85O3K89k49j389k169k064
55040A03288j463q91m78k77k92r8O61J476J546J014O02K55n51j338j006J66N77
55023A03191l00j126q13L9M44M32M03K77P3K60R02J343J223R45P19K17m30m03
55005A07396N60J716K393K537K016P19m06L6J764K745J910M80k4K62M32K92J9
54988A24847m97j110j256r86j099j685j763j070o99j206j533q51pJ6j94L40J191
54971A12438J340Q63N19L70Q7o1K84O88O41N34Q85J201P39j40m72j39J91K02Q0
$$ y = [100870, 102765, 104365, 106007, 107547, 108437, 108585, 108203, 107290, 106180, 105971, 107210, 108721, 109002, 108363, 108325, 109282, 110257, 110833, 111754, 113385, 114919, 115564, 115545, 115510, 115674, 115832, 115657, 114845, 113437, 111995, 111020, 110402, 109918, 109889, 110613, 111476, 111494, 110649, 109851, 109656, 109766, 109789, 109760, 109783, 109776, 109659, 109429, 109092, 108807, 108870, 109159, 108910, 107521, 105352, 103288, 101825, 100934, 100456, 100179, 99887, 99789, 100450, 101926, 103472, 104486, 105088, 105343, 104792, 103454, 102448, 102614, 103191, 102891, 101765, 100952, 100991, 101435, 101867, 102270, 102547, 102620, 102880, 103782, 105125, 106348, 107293, 108012, 108229, 107799, 107396, 107956, 109672, 112065, 114602, 116618, 117337, 116931, 116967, 118731, 121476, 123386, 123866, 123842, 124104, 124536, 124828, 124847, 124350, 123240, 121984, 120998, 119899, 118214, 116451, 115381, 114682, 113476, 111943, 111092, 111085, 111101, 110907, 111247, 112438, 113778, 114641, 115160, 115530, 115617, 115556, 115840, 116528, 117169, 117703, 118588, 119789, 120528, 120388, 119916, 119777, 119968, 120170, 120250]
54952A20250j12l92m46l4M86O08L67J01r4k26k20k00m21o36k13P73J398J234Q72
54933A23095P55N08k9j98L09P47O19O84J684K989L605L777M501N912P208P789
54917A63955P656P029O212N462M503K663j3k469l956m845n633o012n650n062m842
54902A58998m785m486m151l994l558k479j316q26q79q65n99k45J86O44Q68Q76
54886A33389J032J254J060O46R57K102K924K810K774L826N403O466P087P789Q134
54871A87653P233N120K549lk292l898m764n492o337o646o031n222m875m512l567
54856A48916k606k304k198j634j100j315j798j693j289j396j758j590j108j141
54842A25986j595j736j638j960k493k310j295k79K89O57Q72O49J93R4M29P19P78
$$ y = [120250, 120138, 119746, 119300, 119266, 119752, 120360, 120727, 120828, 120734, 120508, 120288, 120088, 119667, 119031, 118818, 119591, 120989, 122223, 123095, 123850, 124358, 124329, 124131, 124440, 125187, 125806, 126490, 128174, 131163, 134768, 138545, 143046, 148958, 156166, 163955, 171611, 178640, 184852, 190314, 194817, 197480, 197467, 194998, 191042, 186197, 180564, 174552, 168902, 163840, 158998, 154213, 149727, 145576, 141582, 138024, 135545, 134229, 133403, 132524, 131659, 131060, 130815, 131001, 131645, 132513, 133389, 134421, 135675, 136735, 137381, 138338, 140440, 143364, 146174, 148948, 152774, 158177, 164643, 171730, 179519, 187653, 194886, 200006, 202555, 202552, 200260, 196362, 191598, 186106, 179769, 173123, 167092, 161870, 156995, 152483, 148916, 146310, 144006, 141808, 140174, 139074, 137759, 135961, 134268, 132979, 131583, 129825, 128235, 127127, 125986, 124391, 122655, 121017, 119057, 116564, 114254, 112959, 112680, 112969, 113626, 114498, 115147, 115340, 115434, 115863, 116582, 117360]
54825A17360P96Q11P57Q34J036P13n39j893k110j163j51K14J73J52K05K66L14
54808A17775L96P67J626K465K375J396O75P03M80p53k014j997j054l84o6O28J494
54791A24512J613R81N28N54M48l2l79k84kK26L80L69K08K61O69R35O97M15O13
54772A32712J065J501K300L630M670M811M808N588O746P434P873Q535Q659P241
54758B07573M847K726O94k173n217o659o349o011o573p029o400n087l831k762
54744A57749k021k057k692l032k661k098j771j538j311j212r79j84Q98J579J848
54729A40518K212K578K482K239K655L560M035M053M556N778O831P134O929O172
54715B01732M286J420j366l484n184o317o168m950m143m603n475n590m915m055
$$ y = [117360, 118156, 118967, 119724, 120558, 121594, 122307, 121768, 119875, 117765, 116602, 116451, 116665, 116838, 116990, 117195, 117461, 117775, 118171, 118938, 120564, 123029, 125404, 126800, 127475, 128178, 128658, 127905, 125891, 123894, 122840, 122456, 122390, 123018, 124512, 126125, 127106, 127634, 128188, 128636, 128604, 128225, 127941, 127939, 128165, 128545, 128914, 129122, 129383, 130052, 130987, 131684, 132099, 132712, 133777, 135278, 137578, 141208, 145878, 150689, 155497, 161085, 167831, 175265, 183138, 191673, 200332, 207573, 212420, 215146, 215840, 213667, 208450, 201791, 195442, 189431, 182858, 175829, 169429, 164342, 160511, 157749, 155728, 153671, 150979, 147947, 145286, 143188, 141417, 139879, 138568, 137356, 136377, 136193, 137091, 138670, 140518, 142730, 145308, 147790, 150029, 152684, 156244, 160279, 164332, 168888, 174666, 181497, 188631, 195560, 201732, 206018, 207438, 206072, 202588, 197404, 191087, 184919, 179969, 175826, 171223, 165748, 160158, 155243, 151188]
54701A51188l249k545k093j754j097k55L2m06q15p43p10j207j806j842j349p78
54685A30571l81k36l77n92n94n09o86j015j045p56m93k38K30N70K21m77n17K30
54667A23906P10J56r72j739j679q60J83N88j6q86j108r14j076j309o75O03J246
54650A16158R49P51J116J198N88K12P61J472J361O12r6o37j087j153p07k19n5
54633A21224K0K27L17J78J06J21j72o59n82K57J031J091Q10P53Q63R19R81R16
54615A28401L36n83j027p59n06p05p57j34O68R29P02M24J64j12j97l4P1J0N5K59
54595A27205L28K85M90Q20P30L14K46M87J83p85j351r54m40o20j030r31n28l65
54577A24084l34j31L6n6j60j78m67r86r11J25J261J541J134O99L87J22J41N34
$$ y = [151188, 147939, 145394, 143301, 141547, 140450, 140195, 140227, 139821, 139006, 138263, 137553, 136346, 134540, 132698, 131349, 130571, 130190, 129954, 129577, 128985, 128391, 127882, 127196, 126181, 125136, 124380, 123887, 123649, 123879, 124449, 124670, 124193, 123676, 123906, 124616, 124772, 123800, 122061, 120382, 119522, 119705, 120293, 120277, 119391, 118283, 117369, 116293, 114984, 114309, 114912, 116158, 117107, 117858, 118974, 120172, 120760, 120972, 121733, 123205, 124566, 125178, 125082, 124445, 123358, 122205, 121498, 121279, 121224, 121244, 121471, 121788, 121966, 122072, 122193, 122021, 121362, 120780, 121037, 122068, 123159, 123969, 124722, 125585, 126504, 127485, 128401, 128737, 128154, 127127, 126368, 125862, 125157, 124400, 124266, 124934, 125863, 126565, 126989, 127153, 127041, 126844, 126810, 126881, 126891, 126946, 127205, 127533, 127818, 128308, 129128, 129858, 130172, 130418, 130905, 131088, 130303, 128952, 127998, 127558, 126938, 125908, 124977, 124449, 124084, 123750, 123619, 123655, 123599, 123439, 123261, 122794, 121808, 120897, 121022, 122283, 123824, 124958, 125657, 126044, 126166, 126307, 126841]
54559A26841Q88R81J134J393J169L05m39n54n42q20q11j7R62J342J319J424J508
54542A36083J317J296J831K299J847N96o77j521j710r13O37J806J761R73K88k90
54526A45623j017j470j188o68o00o95k67M11M54k70j088j547j619j270n71M9L57
54509A34624P32J299J353M27o13o23J52M74j07r24j299j152o14N6L70R3l25l80
54491A33543j74j1K05N22N20N5k09J89O41M66R5K67P33Q58Q73J344J890J695R72
54472A44474O53R18J218J484K094K778K841K335J902J516O02o15j114n50L19P52
54456A61607O20j22j427k518k412j281l38k08l97m68o85j149j405j273j157j183
54440A46204r48m69m48j078j473r35kM20L29L10M51L58M5M5O62J571K165K035
$$ y = [126841, 127729, 128710, 129844, 131237, 132406, 132711, 132272, 131718, 131176, 130356, 129545, 129528, 130490, 131832, 133151, 134575, 136083, 137400, 138696, 140527, 142826, 144673, 145269, 144592, 143071, 141361, 140448, 141085, 142891, 144652, 145625, 145913, 145623, 144606, 143136, 141948, 141280, 140680, 139985, 139718, 140129, 140583, 140313, 139225, 137678, 136059, 134789, 134218, 134267, 134624, 135356, 136655, 138008, 138435, 137822, 137199, 137351, 137825, 137718, 136794, 135495, 134343, 133729, 133785, 134155, 134248, 133923, 133543, 133369, 133358, 133563, 134085, 134605, 134660, 134451, 134640, 135281, 135747, 135842, 136109, 136842, 137700, 138573, 139917, 141807, 143502, 144474, 145127, 146045, 147263, 148747, 150841, 153619, 156460, 158795, 160697, 162213, 162815, 162200, 161086, 160536, 160855, 161607, 162227, 162105, 160678, 158160, 155748, 154467, 154129, 153921, 153524, 153056, 152371, 151222, 149817, 148544, 147387, 146204, 145256, 144787, 144339, 143261, 141788, 140853, 140851, 141271, 141600, 141910, 142361, 142719, 142764, 142809, 143471, 145042, 147207, 149242]
54422A49242J186N1p19o74M4Q26J104Q66N77N63N12r9j125j745j486p52j15M10
54404A48666R26J106P07K52L93Q61Q32K67M8O53J456J641J245Q86Q36Q06N47K75
54386A62403L35N82M76j14m84K8J009J399Q87J76j50k57l00L8Q05J417J583J827
54368A71660K490K948K680K346K851L815M039L202K091J329P41M2o98j329j868
54353A96339k382k937l507l715l095j931j248j487j838j528j047j223j739j672
54339A66990j080q45j171j335r33l42N8K70K48j11n10m98k28k67o91r64p35j34
54321A57722O19J275J410Q24K7l20k79l28n22n81n93p90r31o68l08l43n17k36
54303A55461K43J10o39j087p47j11K15J47k27p73j048o53P7M46M15N12Q21R28
$$ y = [149242, 150428, 150479, 149760, 149086, 149130, 149956, 151060, 151926, 152503, 153066, 153578, 153479, 152354, 150609, 149123, 148371, 148256, 148666, 149592, 150698, 151405, 151657, 152050, 152911, 153743, 154010, 154058, 154711, 156167, 157808, 159053, 159939, 160775, 161581, 162128, 162403, 162738, 163320, 163796, 163682, 163198, 163226, 164235, 165634, 166521, 166697, 166547, 166290, 165990, 166028, 166833, 168250, 169833, 171660, 174150, 177098, 179778, 182124, 184975, 188790, 192829, 196031, 198122, 199451, 200192, 200234, 199536, 198207, 196339, 193957, 191020, 187513, 183798, 180703, 178772, 177524, 176037, 174199, 172671, 171624, 170401, 168662, 166990, 165910, 165065, 163894, 162559, 161626, 161284, 161342, 161612, 161860, 161749, 161239, 160741, 160513, 160246, 159555, 158591, 157856, 157722, 158341, 159616, 161026, 161850, 161877, 161557, 161278, 160950, 160428, 159847, 159254, 158464, 157533, 156865, 156557, 156214, 155697, 155461, 155704, 155814, 155175, 154088, 153341, 153230, 153445, 153592, 153365, 152592, 151544, 150891, 150968, 151414, 151829, 152341, 153162, 154090]
54285A54090Q27R31J157R15J88k71MO56J219J612J736J354N97q3n36r13r47j13
54267A62423J359K355K129J081J14k86j28L49Q05R85R21P06K80k28k78L80J146
54250A74113J370J277J392J391N63q38j733j671j166p51n70p47j173j082P3J435
54234A71883J645P77J82L74N00N4l16j43L5k17m47k58k5q9j62n3j05l53k00M99
54214A73581R29M76l57q42j051j320j419j001l84j42l31n64o06n20m84o76j002
54197A64287r78l43K95J22o20r51o37l87m61k55M52R79R26Q07R77R66N08K02M51
54178A66340O64L61J42O38J297J154L24k35q5L39N36L39k33r87j594j959k267
54161A64774k444k036j014j60j68p10q86l27N48J114J077O62L92M48L87q5l79
$$ y = [154090, 154917, 155848, 157005, 157920, 158108, 157837, 157841, 158497, 159716, 161328, 163064, 164418, 165015, 164932, 164396, 163483, 162536, 162423, 163782, 166137, 168266, 169347, 169461, 169175, 169047, 169396, 170201, 171186, 172107, 172813, 173093, 172865, 172587, 172967, 174113, 175483, 176760, 178152, 179543, 180106, 179268, 177535, 175864, 174698, 173947, 173377, 172630, 171457, 170375, 170448, 171883, 173528, 174305, 174487, 174861, 175361, 175415, 175099, 174956, 174991, 174774, 174327, 174069, 174044, 173955, 173793, 173740, 173635, 173282, 173082, 173581, 174510, 174986, 174629, 173787, 172736, 171416, 169997, 168996, 168612, 168470, 168139, 167575, 166969, 166449, 165965, 165289, 164287, 163309, 162966, 163261, 163383, 162763, 161812, 161175, 160788, 160327, 160072, 160524, 161503, 162429, 163236, 164213, 165179, 165687, 165889, 166340, 167004, 167365, 167507, 168145, 169442, 170596, 170920, 170685, 170600, 170939, 171475, 171814, 171581, 170594, 169000, 167041, 164774, 162330, 160294, 159280, 159120, 158952, 158242, 157356, 157029, 157577, 158691, 159768, 160430, 160822, 161270, 161657, 161572, 161193]
54144A61193J56R12O49n18j032k11O65K90p78j072k80O37Q86N12o8m87n66m11
54126A60477k32J06Q85J795K067J510P61L60L46Q24J918K900K582J099J74R42
54110A78514K553L669M277N081O050O628O674O248N088L179J257n8j042k039k599
54095B23480k339j936k215k842k915k435k153k397k909l486l874l463j999l29
54081A88188M31J79m05q85j081n67Q00K192K593K070J487J246J079Q04M36j99
54065A98368j096j583j034J10P69N62k0n09q29r30p47m27o2N39J336J733J364
54048A97544Q14Q56J394J869K198K553K664K310K120K884M247N084N030M772M907
54033B41246N365N905O368O487O117N638N513N582N345M735M048L344K599K110
$$ y = [161193, 161349, 162261, 162910, 162392, 161360, 161149, 161814, 162104, 161326, 160254, 159974, 160611, 161497, 162009, 161941, 161454, 160888, 160477, 160245, 160351, 161236, 163031, 165098, 166608, 167369, 167729, 168075, 168899, 170817, 173717, 176299, 177398, 177572, 178514, 181067, 184736, 189013, 194094, 200144, 206772, 213446, 219694, 224782, 227961, 229218, 229160, 228118, 226079, 223480, 221141, 219205, 216990, 214148, 211233, 208798, 206645, 204248, 201339, 197853, 193979, 190516, 188517, 188188, 188619, 188798, 188393, 187508, 186427, 185860, 186660, 188852, 191445, 193515, 195002, 196248, 197327, 198131, 198567, 198368, 197272, 195689, 194655, 194765, 195534, 196096, 196076, 195567, 194738, 193808, 193061, 192634, 192572, 193111, 194447, 196180, 197544, 198358, 199214, 200608, 202477, 204675, 207228, 209892, 212202, 214322, 217206, 221453, 226537, 231567, 236339, 241246, 246611, 252516, 258884, 265371, 271488, 277126, 282639, 288221, 293566, 298301, 302349, 305693, 308292, 310402]
54019C10402K083K024J313Q0j063j839k247k171j821k062l384m896n392m999m800
54004B81228n071n107m635m229m243m333m125l554k571j323n32p70j490j695j388
53989B36162j370j737j764j352j286j763j854r51K07N67Q9m61n69k71J79O09J027
53972B25462J554K141K574L036M290O690R393J1149J1518J0553P851L114k513
53959B96812o870q702q331o664m570l117l021l636l570k591j789j720j592p13
53945B39926M93J460K382L450M139M045L658L621L833L941M032M245M261L786
53931B87272L089K543K050J436R08O81O25O98J258K468L810M685N037N101M964
53916C26625M835N191O137P022P200O858O617O705O925P139P235O877N779M121
$$ y = [310402, 312485, 314509, 315822, 315902, 314839, 313000, 310753, 308582, 306761, 304699, 301315, 296419, 291027, 286028, 281228, 276157, 271050, 266415, 262186, 257943, 253610, 249485, 245931, 243360, 242037, 241505, 240735, 239245, 237550, 236162, 234792, 233055, 231291, 229939, 228653, 226890, 225036, 224085, 224292, 224859, 224948, 224487, 223918, 223647, 223826, 224435, 225462, 227016, 229157, 231731, 234767, 239057, 245747, 255140, 266289, 277807, 288360, 296211, 299325, 296812, 289942, 281240, 272909, 266245, 261675, 258558, 255537, 251901, 248331, 245740, 243951, 242231, 240639, 239926, 240419, 241879, 244261, 247711, 251850, 255895, 259553, 263174, 267007, 270948, 274980, 279225, 283486, 287272, 290361, 292904, 294954, 296390, 297298, 297979, 298604, 299302, 300560, 303028, 306838, 311523, 316560, 321661, 326625, 331460, 336651, 342788, 349810, 357010, 363868, 370485, 377190, 384115, 391254, 398489, 405366, 411145, 415266]
53902D15266K336O19r69k138k526k192j686j584k072k913l749m438n147o001o831
53887C75975p408p791q143q348q183p718p123o352n438m890m998n019l942k136
53873B88486j215j948l209l544l009k763l333m075m139l396k414j849j896k188
53859B49508k332k446k821l138k668j385l12l52j198j792j604j041p54r63j359
53844B25343j520j349j104q87l28Q69K134K370J269j68p15j97N21O32J94j67j11
53827B26786j3l72r43q82M6R82J097P25P14J104J222Q82O19P58J077J365J637
53810B36804J797J712J684K047K461K397K228K881M300N392N627N608N731N427
53796B86096M407L634M128N488O385O096M912L450K290J851K000J978J199kq12
$$ y = [415266, 417602, 418221, 417252, 415114, 412588, 410396, 408710, 407126, 405054, 402141, 398392, 393954, 388807, 382806, 375975, 368567, 360776, 352633, 344285, 336102, 328384, 321261, 314909, 309471, 304581, 299583, 294564, 290622, 288486, 287271, 285323, 282114, 278570, 275561, 272798, 269465, 265390, 261251, 257855, 255441, 253592, 251696, 249508, 247176, 244730, 241909, 238771, 236103, 234718, 234406, 234054, 232856, 231064, 229460, 228419, 227665, 226702, 225343, 223823, 222474, 221370, 220483, 220155, 221024, 223158, 225528, 226797, 226629, 225914, 225717, 226238, 226870, 227064, 226897, 226786, 226773, 226401, 225458, 224576, 224622, 225604, 226701, 227426, 228140, 229244, 230466, 231348, 231967, 232725, 233802, 235167, 236804, 238601, 240313, 241997, 244044, 246505, 248902, 251130, 254011, 258311, 263703, 269330, 274938, 280669, 286096, 290503, 294137, 298265, 303753, 310138, 316234, 321146, 324596, 326886, 328737, 330737, 332715, 333914, 333912, 333100]
53781C33100r26p93j071k091l571m741m983m488m005l939m181m661n403n929n472
53766B76846m094k830k414k504k576k731l130l362l076k647k511k362j657n83
53752B40369J47K24q7m90q22r59r62j102j364j240m85K66J56p73j616j633q67
53735B28762J00O56N42J8l38k22J86O26J093J628K094K315K227J795J109O08Q01
53718B44000J647K521K909K719K018R93J83J15N72R22J172J950L238M065L879
53703B72903L371L379L723L718L317L081L384M184N144N680N323M330L448K897
53689C27882K261J580J603K403K730J514o81k478l274l254k506j167j1J65m10
53674C26357q64r11r74j307j610j557j140n73j69j59l22j99J78K63rK7N92Q52
$$ y = [333100, 332174, 331381, 330310, 328219, 324648, 319907, 314924, 310436, 306431, 302492, 298311, 293650, 288247, 282318, 276846, 272752, 269922, 267508, 265004, 262428, 259697, 256567, 253205, 250129, 247482, 244971, 242609, 240952, 240369, 240516, 240740, 240653, 240163, 239341, 238382, 237420, 236318, 234954, 233714, 233229, 233495, 233651, 232878, 231262, 229629, 228762, 228862, 229518, 230060, 230078, 229740, 229518, 229704, 230330, 231423, 233051, 235145, 237460, 239687, 241482, 242591, 243199, 244000, 245647, 248168, 251077, 253796, 255814, 256807, 256990, 257105, 257677, 258599, 259771, 261721, 264959, 269024, 272903, 276274, 279653, 283376, 287094, 290411, 293492, 296876, 301060, 306204, 311884, 317207, 321537, 324985, 327882, 330143, 331723, 333326, 335729, 338459, 339973, 339292, 336814, 333540, 330286, 327780, 326613, 326602, 326767, 326357, 325493, 324582, 323608, 322301, 320691, 319134, 317994, 317421, 317252, 317093, 316771, 316572, 316750, 317013, 317004, 317031, 317623, 318475]
53656C18475J42r10j281r83o68m54jN28O38L48Q9mj3K84J090K020K565K800L023
53637C27688L122K970K988L426L635K940J854J438J811K330K789L385L784L467
53623C67627K879K938L525L543K612J544J062J125J654K730L874M176L617L281
53609D06187L881M839N254M951M264L480K872K682K789K868K964L239L261K360
53595D55891Q05l31o02n45m38J16R74J051j52j623k227k207k406k797k811k549
53579D40149k596k894k846k463k453l062l612l428k675j997j771j909k140k182
53565D04121j818j045j93K86K62J00K57O58P52L14j06R9O82Q87N58L63P85J479
53547D08441J843J791J664J644J600J395J160J236J867K854L680M129M629N561
$$ y = [318475, 318617, 317707, 316426, 315443, 314775, 314321, 314320, 314848, 315486, 315834, 315923, 315919, 315906, 316190, 317280, 319300, 321865, 324665, 327688, 330810, 333780, 336768, 340194, 343829, 346769, 348623, 350061, 351872, 354202, 356991, 360376, 364160, 367627, 370506, 373444, 376969, 380512, 383124, 384668, 385730, 386855, 388509, 391239, 395113, 399289, 402906, 406187, 410068, 414907, 420161, 425112, 429376, 432856, 435728, 438410, 441199, 444067, 447031, 450270, 453531, 455891, 456696, 456365, 455763, 455218, 454780, 454896, 455870, 456921, 456769, 455146, 452919, 450712, 448306, 445509, 442698, 440149, 437553, 434659, 431813, 429350, 426897, 423835, 420223, 416795, 414120, 412123, 410352, 408443, 406303, 404121, 402303, 401258, 401065, 401351, 401613, 401713, 401970, 402628, 403380, 403694, 403588, 403687, 404369, 405256, 405814, 406177, 406962, 408441, 410284, 412075, 413739, 415383, 416983, 418378, 419538, 420774, 422641, 425495, 429175, 433304, 437933, 443494]
53533D43494O534O833O535O575P577R171J0575J1411J1743J1780J1810J2053J2360
53520E68451J2404J2277J2539J3448J4614J5673J6869J8548K0419K1904K3002
53509G50148K4286K5939K7372K7949K7851K7789K7996K7912K7076K5940K5376
53498A045634K5461K5283K4161K2533K1323K0832K0626K0278J9707J8979J8273
53487A283090J7954J8249J8783J8891J8435J8031J8387J9536K0708K0897J9771
53476A492732J8137J7126J6678J5409J2391Q593N757M266K885N58k502n574q424
53463A578032j1131j3525j5220j6041j6222j6279j6702j7526j8342j8950j9664
53452A398430k0703k1628k2025k2301k3041k3846k3727k2617k1537k1086k0697
$$ y = [443494, 450028, 456861, 463396, 469971, 477548, 486719, 497294, 508705, 520448, 532228, 544038, 556091, 568451, 580855, 593132, 605671, 619119, 633733, 649406, 666275, 684823, 705242, 727146, 750148, 774434, 800373, 827745, 855694, 883545, 911334, 939330, 967242, 994318, 1020258, 1045634, 1071095, 1096378, 1120539, 1143072, 1164395, 1185227, 1205853, 1226131, 1245838, 1264817, 1283090, 1301044, 1319293, 1338076, 1356967, 1375402, 1393433, 1411820, 1431356, 1452064, 1472961, 1492732, 1510869, 1527995, 1544673, 1560082, 1572473, 1581066, 1586823, 1591089, 1593974, 1594532, 1592030, 1586456, 1578032, 1566901, 1553376, 1538156, 1522115, 1505893, 1489614, 1472912, 1455386, 1437044, 1418094, 1398430, 1377727, 1356099, 1334074, 1311773, 1288732, 1264886, 1241159, 1218542, 1197005, 1175919, 1155222]
53441A155222j9630j7913j5902j3606j0987q383o239m703l720l144k598j633j76
53428A046588J530L395N406P133Q012Q226Q594R478J0483J1516J3174J5705J8369
53415A167609K0409K2061K3970K6111K7909K9127L0044L0976L2066L3350L4654
53404A478286L5640L6285L7082L8554M0775M3538M6639M9734N2317N4150N5515
53393A968515N6763N7910N8878N9750O0556O1078O1114O0643N9666N8174N6395
53382B619442N4647N2937N1063M9097M7139M4635M0725L5536L0229K5457K0635
53371C071542J5268J0006N512J056m733j2081k0013k7739l5118m1856m7266n1070
53359B863508n3752n5886n7612n8941o0051o1015o1557o1236n9836n7514n4738
$$ y = [1155222, 1135592, 1117679, 1101777, 1088171, 1077184, 1068801, 1062562, 1057859, 1054139, 1050995, 1048397, 1046764, 1046588, 1048118, 1051513, 1056919, 1064052, 1072064, 1080290, 1088884, 1098362, 1108845, 1120361, 1133535, 1149240, 1167609, 1188018, 1210079, 1234049, 1260160, 1288069, 1317196, 1347240, 1378216, 1410282, 1443632, 1478286, 1513926, 1550211, 1587293, 1625847, 1666622, 1710160, 1756799, 1806533, 1858850, 1913000, 1968515, 2025278, 2083188, 2142066, 2201816, 2262372, 2323450, 2384564, 2445207, 2504873, 2563047, 2619442, 2674089, 2727026, 2778089, 2827186, 2874325, 2918960, 2959685, 2995221, 3025450, 3050907, 3071542, 3086810, 3096816, 3102328, 3103384, 3098651, 3086570, 3066557, 3038818, 3003700, 2961844, 2914578, 2863508, 2809756, 2753870, 2696258, 2637317, 2577266, 2516251, 2454694, 2393458, 2333622, 2276108, 2221370]
53348B221370n1996m9429m6922m4637m3213m3084m3838m4541m4567m3774m2162
53337A723207l9800l7052l4449l2221l0151k7898k5263k2189j8795j5440j2691
53326A427258j1110j1004j2159j3796j5044j5550j5474j4990j4090j2876j1591
53315A279574j0314r025q026p657p494o522m453k205o03O87K270L709M073L581
53301A237595L689N479Q633J2052J4902J6908J8289J9658K1572K3905K5945K7298
53289A435925K8368K9727L1195L1840L0877K8474K5672K3463K1969K0587J8886
53278A726983J7048J5259J3036R582M819k92m590p690j0069j2308j4481j6371
53266A720926j8127k0313k3082k5675k7269k8129k9303l1158l2868l3620l3622
$$ y = [2221370, 2169374, 2119945, 2073023, 2028386, 1985173, 1942089, 1898251, 1853710, 1809143, 1765369, 1723207, 1683407, 1646355, 1611906, 1579685, 1549534, 1521636, 1496373, 1474184, 1455389, 1439949, 1427258, 1416148, 1405144, 1392985, 1379189, 1364145, 1348595, 1333121, 1318131, 1304041, 1291165, 1279574, 1269260, 1260235, 1252209, 1244552, 1237058, 1230536, 1226083, 1223878, 1223275, 1223962, 1226232, 1229941, 1234014, 1237595, 1241284, 1246763, 1255396, 1267448, 1282350, 1299258, 1317547, 1337205, 1358777, 1382682, 1408627, 1435925, 1464293, 1494020, 1525215, 1557055, 1587932, 1616406, 1642078, 1665541, 1687510, 1708097, 1726983, 1744031, 1759290, 1772326, 1781908, 1786727, 1786435, 1781845, 1774155, 1764086, 1751778, 1737297, 1720926, 1702799, 1682486, 1659404, 1633729, 1606460, 1578331, 1549028, 1517870, 1485002, 1451382, 1417760]
53255A417760l3526l3376l2784l1809l1055l0905l1063l0929l0158k8922k7752
53244A075481k7049k6738k6514k6345k6339k6162k5209k3503k1837k0734j9811
53233H05240j8537j7024j5543j3877j1792r748q419p780p344p078p336q057q739
53220F63966r207r784j0664j1723j2877j4071j4888j4803j4009j3341j3236j3202
53208E12161j2609j1551j0554r804r011p937o721n772n458n880o766p615q082
53195D04401q248q468q852q971q293o920n671n161n088m786m253m032m205m218
53181C17235l857l619l799l870l297k367j734j519j439j371j307j102q26r48j579
53166B84601j943j319k07K41k40q57j002q54p50o70n68n66o81p50p85r67j274
$$ y = [1417760, 1384234, 1350858, 1318074, 1286265, 1255210, 1224305, 1193242, 1162313, 1132155, 1103233, 1075481, 1048432, 1021694, 995180, 968835, 942496, 916334, 891125, 867622, 845785, 825051, 805240, 786703, 769679, 754136, 740259, 728467, 718719, 710300, 702520, 695176, 688098, 680762, 672705, 663966, 654759, 644975, 634311, 622588, 609711, 595640, 580752, 565949, 551940, 538599, 525363, 512161, 499552, 488001, 477447, 467643, 458632, 450695, 443974, 438202, 432744, 426864, 420098, 412483, 404401, 396153, 387685, 378833, 369862, 361569, 354649, 348978, 343817, 338729, 333943, 329690, 325658, 321453, 317235, 313378, 309759, 305960, 302090, 298793, 296426, 294692, 293173, 291734, 290363, 289056, 287954, 287128, 286180, 284601, 282658, 281339, 281132, 281373, 281133, 280276, 279274, 278420, 277670, 277000, 276432, 275866, 275185, 274435, 273650, 272683, 271409]
53149B71409j540j861k376k753k401j331k18M96J011J481J528Q08l17j033q44
53134B62059Q1J133J694J567J117Q24P44O22M10L26L90L22M5p7K89J005J667K089
53116B76307K455K951L415L372K589J448N88J49k33o29o29k49l21j323k412k456
53100B85022j681j277j541j570q80l01p07j746k390k238j642j019n72m22n12n15
53084B66009j91K77N06L00l52j341k264k548k078j458j303j405j060p4R18J245
53068B55181R24M43P4l26r05j480j775j750j517j051l46K29J81l50n53L2Q27J024
53050B48862P03O34J135J701J718J106K27l91l10M22J120J151P32N82Q51Q99L00
53033B61442n73j096j109q49n61m35o18r79j140q65l23J47K73l9n29n67K22J316
$$ y = [271409, 269869, 268008, 265632, 262879, 260478, 259147, 258929, 259425, 260436, 261917, 263445, 264253, 263936, 262903, 262059, 262140, 263273, 264967, 266534, 267651, 268475, 269219, 269841, 270251, 270577, 270967, 271289, 271334, 271257, 271546, 272551, 274218, 276307, 278762, 281713, 285128, 288500, 291089, 292537, 293125, 293274, 293041, 292412, 291783, 291534, 291213, 289890, 287478, 285022, 283341, 282064, 280523, 278953, 278073, 277772, 277065, 275319, 272929, 270691, 269049, 268030, 267458, 267036, 266524, 266009, 265818, 266095, 266601, 266901, 266549, 265208, 262944, 260396, 258318, 256860, 255557, 254152, 253092, 253018, 253936, 255181, 256105, 256548, 256622, 256296, 255391, 253911, 252136, 250386, 248869, 247818, 247472, 247701, 247882, 247532, 246979, 247011, 247838, 248862, 249565, 250199, 251334, 253035, 254753, 255859, 256086, 255695, 255385, 255807, 256927, 258078, 258810, 259392, 260243, 261142, 261442, 260869, 259773, 258664, 257815, 257254, 256819, 256201, 255222, 254082, 253217, 252894, 253041, 253314, 253275, 252746, 252179, 252401, 253717]
53015B53717J733J253O58O06Q52Q49N58K19k13p96j102o23M04J136J129P74O52
52998B61806Q68J146J283J235J018O93M36L45L03J53P0M20J200J841J817J350
52982B75984J204J754K607L132L113K690K002J124J98n84j040j020n07K01O67
52967B91525P72P54P67P72Q41J120J390J202O53L87N67M91l13j338j948k273k576
52950B92793k547k005j656k032k314j498k44j60j315k076j534o70n90r88j030
52935B72134o40j54M51J182J557J230N74P5l17p07q05n26m53r59j431j108k64
52918B69839J62j09n09n96m97m09k37J81P45J084P72k59j350j558o80M37R10P54
52900B68680M55J06n04j158j241m98O28J442J553J047L66m1p6Q7L87Q70J231Q53
$$ y = [253717, 255450, 256703, 257361, 257967, 258819, 259668, 260226, 260445, 260232, 259436, 258334, 257711, 258115, 259251, 260380, 261154, 261806, 262674, 263820, 265103, 266338, 267356, 268049, 268485, 268830, 269133, 269286, 269356, 269776, 270976, 272817, 274634, 275984, 277188, 278942, 281549, 284681, 287794, 290484, 292486, 293610, 293808, 293224, 292184, 291164, 290657, 290858, 291525, 292297, 293051, 293818, 294590, 295431, 296551, 297941, 299143, 299796, 300183, 300750, 301241, 300928, 299590, 297642, 295369, 292793, 290246, 288241, 286585, 284553, 282239, 280741, 280497, 280337, 279022, 276946, 275412, 274742, 274152, 273164, 272134, 271494, 271340, 271791, 272973, 274530, 275760, 276334, 276409, 276092, 275385, 274580, 274054, 273601, 272642, 271211, 270103, 269839, 270001, 269892, 269383, 268787, 268290, 267881, 267644, 267825, 268570, 269654, 270426, 270167, 268817, 267259, 266579, 267016, 267926, 268680, 269135, 269241, 268737, 267579, 266338, 265840, 266468, 267910, 269463, 270510, 270876, 270835, 270759, 270846, 271233, 272103, 273334, 274187]
52882B74187l00j276j037L22J661J987J317M57J90O33J284J719K098K768L481
52867B89491L570K910K125J693J438J122R12Q80O30q9q89j430k054l137m210m484
52851B88478m017l616l660l759l541l143k767k287j591r72q79j399k154k611k504
52836B49578k020j587j416j346j043k59R85K227K687J978P76K19N38Q44M35k84
52820B52312n69l81j35J59P80J516J688J008ln44k34O16J300J342R55P41Q64Q49
52802B62264K96n83j360j894k213k252k052j811j559j176q87j190j927k117j240
52787B40299k7N61O16P99J109J072P54O90R13R00N25K55L49M68L24J45K93P57
52769B50802J089P55m00j790k452k015j105m79j63J43L77L79M52Q96J312J133
$$ y = [274187, 273887, 272611, 271574, 271896, 273557, 275544, 276861, 277318, 277508, 278141, 279425, 281144, 283242, 286010, 289491, 293061, 295971, 298096, 299789, 301227, 302349, 303261, 304141, 304771, 304682, 303793, 302363, 300309, 297172, 292962, 288478, 284461, 280845, 277185, 273426, 269885, 266742, 263975, 261688, 260097, 259125, 258246, 256847, 254693, 252082, 249578, 247558, 245971, 244555, 243209, 242166, 241907, 242892, 245119, 247806, 249784, 250560, 250779, 251317, 252161, 252596, 252312, 251743, 251362, 251227, 251386, 252166, 253682, 255370, 256378, 256375, 255831, 255597, 256213, 257513, 258855, 259810, 260551, 261415, 262264, 262560, 261977, 260617, 258723, 256510, 254258, 252206, 250395, 248836, 247660, 246773, 245583, 243656, 241539, 240299, 240272, 240833, 241449, 242248, 243357, 244429, 245183, 245873, 246786, 247686, 248211, 248466, 248815, 249283, 249607, 249752, 250045, 250802, 251891, 252646, 252246, 250456, 248004, 245989, 244884, 244405, 244242, 244385, 244762, 245141, 245593, 246489, 247801, 248934]
52753B48934O21N01P65O85P8k89L37J838L471M380L989K488R89N39R45J187Q81
52736B72339O18P50P40L1r99j446q49L97J436J651J247J007J284J479R38k4o26
52719B79973p77r59j212j150q78r03j186j165p79m97l06J89O26P4j295k022j420
52702B66313o15p24j080m16J029J828J330K67m76p86r59j122j092n64M88J437
52686B64858J464N84k42l15N4L42N93Q70P20n1o94m75J44J99l28o56m74j03L26
52667B66816Q55J056M58m00l97M89J035N68r8Q6J016J841K120K000J831K040K956
52650B84272M203M698L719J716k80j716k613l022k963k692k472k155j421l86L96
52635B79284N37J30m44p59m85L25J147J539J777K500L704M518M128K625P00j087
$$ y = [248934, 249555, 250056, 250821, 251506, 251584, 251295, 251632, 253470, 256941, 261321, 265310, 267798, 268787, 269326, 270271, 271458, 272339, 272957, 273707, 274447, 274478, 273479, 272033, 271184, 271581, 273017, 274668, 275915, 276922, 278206, 279685, 280623, 280599, 279973, 279196, 278237, 277025, 275875, 274997, 274094, 272908, 271743, 270964, 270467, 270161, 270350, 270976, 271050, 269755, 267733, 266313, 265698, 264974, 263894, 263478, 264507, 266335, 267665, 267932, 267456, 266670, 265711, 264589, 263497, 262933, 263421, 264858, 266322, 266906, 266664, 266349, 266403, 266745, 267338, 268208, 268928, 268877, 268183, 267708, 267852, 268051, 267723, 267067, 266593, 266490, 266816, 267671, 268727, 269185, 268785, 268388, 268877, 269912, 270480, 270382, 270468, 271484, 273325, 275445, 277445, 279276, 281316, 284272, 288475, 293173, 296892, 298608, 298328, 296612, 293999, 290977, 288014, 285322, 282850, 280695, 279274, 278888, 279284, 279821, 279951, 279507, 278748, 278263, 278588, 279735, 281274, 283051, 285551, 289255, 293773, 297901, 300526, 301226, 300139]
52619C00139k444l122l043k611k397k455k298j702j141j191j691j923j472n95
52605B72054K71J004J608J881J560Q25L25N78J365J891J551N25m92j036j147r82
52589B81781n02J75M95Rq48j122n11L46Q83J366K163K877K843K213J767J703J389
52572B97027N03l64n90m41n46r05j059r81j111j495j546r15o9K98P7l24o74j089
52554B85796j596j869j560p66k2K24M8n6J45K79j80j102j703j380k87R74J920
52537B78865K265J874R91K67J26K67J26l09n71m40r9M22J303K306K608J678N3
52520B91732j039q00N25J923K465K041J380J241J634K072K417L018M003M914N279
52505C22805N020M147K554M31j545k853l645m256m605m481m091l778l443k757
$$ y = [300139, 297695, 294573, 291530, 288919, 286522, 284067, 281769, 280067, 278926, 277735, 276044, 274121, 272649, 272054, 272325, 273329, 274937, 276818, 278378, 279203, 279528, 280106, 281471, 283362, 284913, 285438, 284946, 283910, 282763, 281781, 281279, 281454, 281949, 281958, 281110, 279988, 279477, 279823, 280706, 282072, 284235, 287112, 289955, 292168, 293935, 295638, 297027, 297530, 297166, 296576, 296135, 295589, 294684, 293625, 292644, 291533, 290038, 288492, 287577, 287508, 287806, 287883, 287559, 286885, 285796, 284200, 282331, 280771, 280005, 279983, 280207, 280255, 280199, 280344, 280623, 280443, 279341, 277638, 276258, 275971, 276945, 278865, 281130, 283004, 283995, 284262, 284388, 284655, 284781, 284472, 283901, 283461, 283362, 283784, 285087, 287393, 290001, 291679, 291732, 290693, 289893, 290418, 292341, 294806, 296847, 298227, 299468, 301102, 303174, 305591, 308609, 312612, 317526, 322805, 327825, 331972, 334526, 334957, 333412, 330559, 326914, 322658, 318053, 313572, 309481, 305703, 302260, 299503]
52491B99503j805j118j032j401j799j778j125k22J20m38j202j235m33N57J288
52476B87880J722J791J412R71J083J763K395K614K652K690K449J766J075R43J448
52461C14654K290L261M222M773M316K554n1k453l797m146m235m429m317l603k853
52446C06186k773l013k581j337l21l54j145j916k289k206j667r75o85q22o55K62
52430B83709J282J456P98J62O3K28K46J22J27M34J016J660K061K046J738J365
52414B98513J041Q17P74R05J092J357K010L334N261P452R580J1351J2467J2714
52400C68668J1914R736N920R79l680o701p793p589o830n999n401n103m806m235
52386C39080l547l028k559j912j360j301j326m74J241K395J901N99L20J585L207
$$ y = [299503, 297698, 296580, 295548, 294147, 292348, 290570, 289445, 289223, 289343, 288905, 287703, 286468, 286035, 286592, 287880, 289602, 291393, 292805, 293776, 294859, 296622, 299017, 301631, 304283, 306973, 309422, 311188, 312263, 313206, 314654, 316944, 320205, 324427, 329200, 333516, 336070, 336019, 333566, 329769, 325623, 321388, 316959, 312642, 309039, 306186, 303413, 300400, 297819, 296482, 296161, 295807, 294662, 292746, 290457, 288251, 286584, 285609, 284924, 284102, 283447, 283709, 284991, 286447, 287245, 287407, 287470, 287698, 287944, 288066, 288193, 288627, 289643, 291303, 293364, 295410, 297148, 298513, 299554, 300371, 301145, 302050, 303142, 304499, 306509, 309843, 315104, 322556, 332136, 343487, 355954, 368668, 380582, 390318, 396238, 397217, 393537, 386836, 379043, 371454, 364624, 358625, 353224, 348121, 343315, 339080, 335533, 332505, 329946, 328034, 326674, 325373, 324047, 323573, 324814, 327209, 329110, 329709, 330029, 331614, 334821]
52371C34821M118M694N780P200P930P456O223M770L083J046r35k114k177j571
52357C80324j108j229j605j526p71J17N66O76Q35R24N57QP9R11J693J890J953
52340C84294K360K723K558K265K490L047L391L801M994O741P965Q286Q500R292
52326D52707J0444J1533J2633J3858J4932J5593J5933J5960J5424J4458J3825
52315F07300J4132J5124J6116J6756J7131J7515J8238J9379K0418K0677K0273
52304H03059K0063K0400K0662K0308J9694J9344J9139J8772J8376J7934J6657
52293A014408J3829R960O260L248O29j699l459m743o038p342q039p924p634p714
52279I93742p841p435o609n973n658n046l586j520M00J805L062M639O397P741
$$ y = [334821, 338939, 343633, 349413, 356613, 364543, 371999, 378222, 382992, 386075, 387121, 386186, 384072, 381895, 380324, 379216, 377987, 376382, 374856, 374085, 374202, 374768, 375444, 376279, 377203, 377760, 377768, 377847, 378758, 380451, 382341, 384294, 386654, 389377, 391935, 394200, 396690, 399737, 403128, 406929, 411923, 418664, 426629, 434915, 443415, 452707, 463151, 474684, 487317, 501175, 516107, 531700, 547633, 563593, 579017, 593475, 607300, 621432, 636556, 652672, 669428, 686559, 704074, 722312, 741691, 762109, 782786, 803059, 823122, 843522, 864184, 884492, 904186, 923530, 942669, 961441, 979817, 997751, 1014408, 1028237, 1038197, 1044457, 1047705, 1048334, 1046635, 1043176, 1038433, 1032395, 1025053, 1017014, 1009090, 1001456, 993742, 985901, 978466, 971857, 965884, 960226, 955180, 951594, 950074, 950474, 952279, 955341, 959980, 966377, 974118]
52265I74118Q358Q493Q491Q512Q740R503J0852J2333J3423J4043J4541J5320J6593
52252A123320J8229J9667K0259J9764J8301J5866J2486Q798N762L510J189j643
52240A265508m261n945p146q637j0197j1130j1685j2749j4340j5512j5788j5626
52228A132492j5306j4464j3136j2244j2420j3050j3076j2281j1123r841q356o839
52216I90356n684n027m663m387m003l170j684J27J650K645L306L678L500K740
52202I79384J895J490J493J567J701K267L406M757N894O738P378P735P739P642
52188A041086P760P937P586O324M293J930l34k143l455m735o491q476r759r832
52174A031691r294r018r043q694p578o060m764l956l421k705j513K1J502K689
$$ y = [974118, 982476, 990969, 999460, 1007972, 1016712, 1026215, 1037067, 1049400, 1062823, 1076866, 1091407, 1106727, 1123320, 1141549, 1161216, 1181475, 1201239, 1219540, 1235406, 1247892, 1256690, 1262452, 1265962, 1267151, 1265508, 1261247, 1255302, 1248156, 1239519, 1229322, 1218192, 1206507, 1193758, 1179418, 1163906, 1148118, 1132492, 1117186, 1102722, 1089586, 1077342, 1064922, 1051872, 1038796, 1026515, 1015392, 1005551, 997195, 990356, 984672, 979645, 974982, 970595, 966592, 963422, 961738, 961865, 963515, 966160, 969466, 973144, 976644, 979384, 981279, 982769, 984262, 985829, 987530, 989797, 993203, 997960, 1003854, 1010592, 1017970, 1025705, 1033444, 1041086, 1048846, 1056783, 1064369, 1070693, 1074986, 1076916, 1076582, 1074439, 1070984, 1066249, 1059758, 1051282, 1041523, 1031691, 1022397, 1013379, 1004336, 995642, 988064, 982004, 977240, 973284, 969863, 967158, 965645, 965666, 967168, 969857]
52160I69857L615M295M580M493M271L971L325K225J041J88k72m06j65L36P22R30
52144A003006J444K474L346L303K591K050J874J523P58Pl48l81j87M08J526L109
52128A026503N248Q068J1160J3683J5362J6985J9411K2379K4783K5948K6270K6541
52116A242341K7036K7472K7596K7435K6906K5664K3619K1399J9735J8530J7054
52105A504787J5148J3562J2903J2868J2876J2821J2676J1965J0334Q239O335M443
$$ y = [969857, 973472, 977767, 982347, 986840, 991111, 995082, 998407, 1000632, 1001673, 1001861, 1001589, 1001183, 1001018, 1001354, 1002076, 1003006, 1004450, 1006924, 1010270, 1013573, 1016164, 1018214, 1020088, 1021611, 1022369, 1022376, 1022028, 1021647, 1021460, 1021868, 1023394, 1026503, 1031751, 1039819, 1050979, 1064662, 1080024, 1097009, 1116420, 1138799, 1163582, 1189530, 1215800, 1242341, 1269377, 1296849, 1324445, 1351880, 1378786, 1404450, 1428069, 1449468, 1469203, 1487733, 1504787, 1519935, 1533497, 1546400, 1559268, 1572144, 1584965, 1597641, 1609606, 1619940, 1628179, 1634514, 1638957]
$$ [...]
##END NTUPLES=NMR SPECTRUM
##END=
