##TITLE=AC1456_PAST113262_8026711_zgmu2fensB
##JCAMPDX= 6.0         $$ Bruker NMR JCAMP-DX V2.0
##DATA TYPE= NMR SPECTRUM
##DATA CLASS= NTUPLES
##ORIGIN= BRUKER
##OWNER= Administrator
$$ 1.72 TOPSPIN		Version 2.1
$$ 2013-07-11 14:57:44.766 -0700  Administrator@X
$$ Compression mode = diff/dup
##.OBSERVE FREQUENCY= 400.02188249412
##.OBSERVE NUCLEUS= ^1H
##.ACQUISITION MODE= SIMULTANEOUS (DQD)
##.ACQUISITION SCHEME= undefined
##.AVERAGES= 8
##.DIGITISER RES= 22
##SPECTROMETER/DATA SYSTEM= spect
##.PULSE SEQUENCE= zg30
##.SOLVENT NAME= COFFEE_meoh
##.SHIFT REFERENCE= INTERNAL, COFFEE_meoh, 1, 14.98509
##AUDIT TRAIL= $$ (NUMBER, WHEN, WHO, WHERE, PROCESS, VERSION, WHAT)
$$ ##TITLE= Audit trail, TOPSPIN		Version 2.1
$$ ##JCAMPDX= 5.01
$$ ##ORIGIN= Bruker BioSpin GmbH
$$ ##OWNER= Administrator
$$ $$ E:\/data/COFFEE/nmr/AC1456_PAST113262_8026711_zgmu2fensB/10/pdata/1/auditp.txt
$$ ##AUDIT TRAIL=  $$ (NUMBER, WHEN, WHO, WHERE, PROCESS, VERSION, WHAT)
(   1,<2013-07-11 14:57:37.938 -0700>,<Administrator>,<X>,<go>,<TOPSPIN 2.1>,
      <created by zg
	started at 2013-07-11 14:56:30.985 -0700,
	POWCHK enabled, PULCHK disabled,
       configuration hash MD5:
       C8 4E 4E 5D D3 5C D8 9E 9F 52 82 E0 59 8A DE 15
       data hash MD5: 64K
       81 2D 56 81 4B 3E EF C2 5F 1E 90 BD E1 AF B7 90>)
(   2,<2013-07-11 14:57:40.907 -0700>,<Administrator>,<X>,<proc1d>,<TOPSPIN 2.1>,
      <Start of raw data processing
       efp LB = 0 FT_mod = 6 PKNL = 1 PHC0 = 0 PHC1 = 0 SI = 32K 
       data hash MD5: 32K
       6A 30 68 06 64 3F FC AC 7A 57 81 08 A2 74 93 CD>)
(   3,<2013-07-11 14:57:41.250 -0700>,<Administrator>,<X>,<proc1d>,<TOPSPIN 2.1>,
      <pk PHC0 = 98.5199 PHC1 = 0 
       data hash MD5: 32K
       A9 9F A8 42 E3 E6 FF 88 7C D7 24 2C 8B CE 97 C0>)
(   4,<2013-07-11 14:57:41.344 -0700>,<Administrator>,<X>,<proc1d>,<TOPSPIN 2.1>,
      <abs ABSG = 1 
       data hash MD5: 32K
       33 64 6F DD 68 CB BE 26 28 01 C3 CE E6 2D 2D 02>)
(   5,<2013-07-11 14:57:41.438 -0700>,<Administrator>,<X>,<proc1d>,<TOPSPIN 2.1>,
      <abs ABSG = 2 
       data hash MD5: 32K
       D6 67 6E 7F 40 87 92 41 17 B9 BC 0B 96 5F 73 5A>)
(   6,<2013-07-11 14:57:41.500 -0700>,<Administrator>,<X>,<proc1d>,<TOPSPIN 2.1>,
      <abs ABSG = 3 
       data hash MD5: 32K
       66 A7 41 B8 D1 CB 65 A6 E0 B2 BE 66 0B 58 5F E6>)
(   7,<2013-07-11 14:57:41.547 -0700>,<Administrator>,<X>,<proc1d>,<TOPSPIN 2.1>,
      <abs ABSG = 4 
       data hash MD5: 32K
       0A DA 19 08 92 6E AD 6D 46 4A 8E BD 6C C0 4D 41>)
(   8,<2013-07-11 14:57:41.610 -0700>,<Administrator>,<X>,<proc1d>,<TOPSPIN 2.1>,
      <abs ABSG = 5 
       data hash MD5: 32K
       08 F7 1A 22 6D 94 75 9B EC F1 40 CB 15 5B 92 96>)
$$ ##END=
$$ 
$$ $$ hash MD5
$$ $$ 18 94 B1 04 0F F6 0A A2 C2 77 A4 BE CC 97 C4 48
##$RELAX= 
##$RELAX= 
##$RELAX= 
##$RELAX= 
##$RELAX= 
##$RELAX= 
##$RELAX= 
$$ Bruker specific parameters
$$ --------------------------
##$DU= <E:\>
##$EXPNO= 10
##$NAME= <AC1456_PAST113262_8026711_zgmu2fensB>
$$ [...]
##$TP= (0..7)
150 150 150 150 150 150 150 150
##$TP07= 0
##$TPNAME0= <>
##$TPNAME1= <>
##$TPNAME2= <>
##$TPNAME3= <>
##$TPNAME4= <>
##$TPNAME5= <>
##$TPNAME6= <>
##$TPNAME7= <>
##$TPOAL= (0..7)
0.5 0.5 0.5 0.5 0.5 0.5 0.5 0.5
##$TPOFFS= (0..7)
0 0 0 0 0 0 0 0
##$TUNHIN= 0
##$TUNHOUT= 0
##$TUNXOUT= 0
##$USERA1= <user>
##$USERA2= <user>
##$USERA3= <user>
##$USERA4= <user>
##$USERA5= <user>
##$V9= 5
##$VALIST= <valist>
##$VCLIST= <CCCCCCCCCCCCCCC>
##$VD= 0
##$VDLIST= <DDDDDDDDDDDDDDD>
##$VPLIST= <PPPPPPPPPPPPPPP>
##$VTLIST= <TTTTTTTTTTTTTTT>
##$WBST= 1024
##$WBSW= 4
##$XGAIN= (0..3)
0 0 0 0
##$XL= 0
##$YL= 0
##$YMAX_a= 602212
##$YMIN_a= -511751
##$ZGOPTNS= <>
##$ZL1= 120
##$ZL2= 120
##$ZL3= 120
##$ZL4= 120
##$ABSF1= 14.98509
##$ABSF2= -5.573092
##$ABSG= 5
##$ABSL= 3
##$ALPHA= 0
##$AQORDER= 0
##$ASSFAC= 0
##$ASSFACI= 0
##$ASSFACX= 0
##$ASSWID= 0
##$AUNMP= <proc_prof1d_extract_pilot.lims>
##$AXLEFT= 0
##$AXNAME= <>
##$AXNUC= <1H>
##$AXRIGHT= 0
##$AXTYPE= 0
##$AXUNIT= <>
##$AZFE= 0.1
##$AZFW= 0.1
##$BCFW= 0
##$BC_mod= 0
##$BYTORDP= 0
##$COROFFS= 0
##$CY= 15
##$DATMOD= 1
##$DC= 0
##$DFILT= <>
##$DTYPP= 0
##$F1P= 0
##$F2P= 0
##$FCOR= 0.5
##$FTSIZE= 32768
##$FT_mod= 6
##$GAMMA= 0
##$GB= 0
##$INTBC= 1
##$INTSCL= 1
##$ISEN= 128
##$LB= 0
##$LEV0= 0
##$LPBIN= 0
##$MAXI= 10000
##$MC2= 0
##$MEAN= 0
##$ME_mod= 0
##$MI= 0
##$NCOEF= 0
##$NC_proc= -8
##$NLEV= 6
##$NOISF1= 0
##$NOISF2= 0
##$NSP= 0
##$NTH_PI= 0
##$NZP= 0
##$OFFSET= 14.98509
##$PC= 1
##$PHC0= 98.5199
##$PHC1= 0
##$PH_mod= 1
##$PKNL= yes
##$PPARMOD= 0
##$PPDIAG= 0
##$PPIPTYP= 0
##$PPMPNUM= 2147483647
##$PPRESOL= 1
##$PSCAL= 4
##$PSIGN= 0
##$PYNMP= <proc.py>
##$REVERSE= no
##$SF= 400.02
##$SI= 32768
##$SIGF1= 0
##$SIGF2= 0
##$SINO= 400
##$SIOLD= 32768
##$SPECTYP= <>
##$SREGLST= <1H.CDCl3>
##$SSB= 0
##$STSI= 32768
##$STSR= 0
##$SW_p= 8223.68421052631
##$SYMM= 0
##$S_DEV= 0
##$TDeff= 65536
##$TDoff= 0
##$TI= <>
##$TILT= no
##$TM1= 0
##$TM2= 0
##$TOPLEV= 0
##$USERP1= <user>
##$USERP2= <user>
##$USERP3= <user>
##$USERP4= <user>
##$USERP5= <user>
##$WDW= 1
##$XDIM= 32768
##$YMAX_p= 411182676
##$YMIN_p= -759163
##$CURPLOT= <Network HP LaserJet P1505>
##$CURPRIN= <$Network HP LaserJet P1505>
##$DFORMAT= <normdp>
##$LAYOUT= <+/1D_H.xwp>
##$LFORMAT= <normlp>
##$PFORMAT= <normpl>
##$SURQMSG= 1
$$ End of Bruker specific parameters
$$ ---------------------------------
##NTUPLES= NMR SPECTRUM
##VAR_NAME=  FREQUENCY,     SPECTRUM/REAL,   SPECTRUM/IMAG
##SYMBOL=    X,             R,               I
##VAR_TYPE=  INDEPENDENT,   DEPENDENT,       DEPENDENT
##VAR_FORM=  AFFN,          ASDF,            ASDF
##VAR_DIM=   32768,         32768,           32768
##UNITS=     HZ,            ARBITRARY UNITS, ARBITRARY UNITS
##FACTOR=    0.250966925370066, 1,           1
##FIRST=     8223.43324360094, -162818,      -146717
##LAST=      0,             -161696,         -16548
##MIN=       0,             -759163,         0
##MAX=       8223.43324360094, 411182676,    0
$$ Real data points
##PAGE= N=1
##DATA TABLE= (X++(R..R)), XYDATA
$$ [...]
23869 -78183 -72103 172433 -94304 -110718 19661 -117840 -4057 -42336 80565 -136272 338642
23857 -177446 30578 -89110 223338 121215 -45299 280230 110919 -54803 404379 -306177
23846 32079 12293 -57733 168893 -81914 82962 -3361 38203 -95793 -118248 118309 138773
23835 138773 363172 72823 119415 50780 -149110 -23956 -149339 176303 -112219 71766
23824 -44698 66626 -236851 31121 60482 -103812 -134097 42469 -76270 -309560 -99908 -268390
23813 -268390 -94908 -2718 -139525 69107 244723 -134641 67580 120124 50588 -203281 -129776
23802 -129776 -144985 -449621 252164 -172274 137134 -163016 454421 -235306 93503 245933
23792 245933 58526 91246 152956 -248305 -73040 -23490 -58395 -345351 -7954 -220028 -47548
23780 -236009 -10197 17854 -25745 20332 280867 -22360 -114502 -133063 30127 270120 -335822
23768 -41418 -130698 -95245 -44288 -23314 30991 216739 -162333 -118211 35993 74670 38649
23757 38649 -122646 101423 242940 54160 -143775 215391 -227916 -268129 88466 373528
23747 373528 -36807 -220062 -158785 147098 -60893 56262 -92263 -141173 -130022 -37318 65585
23735 208797 -65242 -108938 66159 -29506 119593 -49340 -308690 -89595 234882 8524 -289077
23723 205061 -135298 212205 87370 51297 146394 -255851 368845 88606 -210949 -32803
23712 86200 84796 -100460 123058 -4178 32261 103888 149531 -110193 -118300 18234 148427
23701 148427 -40972 -3795 -207810 -361791 6796 348658 -89838 10479 267797 -108304 -57398
23690 -57398 -34959 -11562 -14538 -168615 -112330 -86654 -479 -207961 3657 83229 -250860 115435
23677 152303 -60533 224609 -146001 -259887 255318 70461 -209256 -106852 53395 -1714
23666 -138060 240844 178565 217212 68577 -51533 -58577 -31745 -71693 26983 -124715 128595
23654 -56449 118413 108059 298104 256964 196653 163725 -203645 -77645 56162 -162124 -256614
23643 -256614 -119558 -106013 -233451 -114158 -336173 121172 179126 9686 68765 -245979
23632 29001 82637 192046 -69835 -110546 27396 -109769 -93546 39907 261297 201343 215060
23621 215060 38153 -126741 -328124 155789 166080 -255903 27879 100334 39831 19685 -259098
23609 -128531 -3180 -204188 122566 -185873 -26990 125789 -256568 276639 -233410 -124781
23599 -124781 -101187 -507851 -16090 23983 222369 -125794 36509 32685 329545 205337 -16889
23587 83248 117732 21030 -14525 55214 -58945 107569 -5358 214314 61630 -31782 -176269
23576 -176269 -124255 158988 31833 -71905 93882 -184511 -242562 -117210 -141036 229862 -204267
23564 -86075 -282328 -52668 -149844 -79702 239273 -147652 106735 -205857 112862 -6962 -65632
23553 -65632 -81762 -329503 39146 -148997 -84104 -233036 -19293 166051 13345 157606 -89072
23541 217739 -74715 -199790 -116891 -148520 -132153 15530 -362478 -174383 54684 -84173 173920
23529 -31995 54118 -238726 158648 -122603 -258145 -158623 183946 68385 -19259 27675 90177
23518 90177 129625 97687 -128487 -55409 31582 60378 -281207 -195635 51433 -170737 214518
23506 -80315 -108248 -195399 20799 307043 272623 -155990 109820 -173633 -168543 156492 -83610
23494 -16764 -74308 -62625 91184 -35771 -347995 48931 -142362 -193269 46567 -218854 -98114
23482 -223226 61491 108873 11410 181977 101254 87373 182017 -86042 396672 285777 97240
23470 81973 66672 -48199 15694 -102731 40885 -20849 60842 -47818 163845 -83080 -281657
23459 -281657 -144555 -40365 324415 74514 88160 113867 147041 -109886 -159491 -24223 -101684
23448 -101684 -133762 -71399 -287671 -96752 -419432 311077 267751 -24143 29322 -172187 103105
23436 -267776 -13111 6266 279781 -180513 247069 -1423 92237 358110 -189767 128972 139981
23425 139981 -181027 -186503 128895 -84443 92580 33658 13592 -170074 -180990 90611 -218742
23413 -118610 -118683 29142 -2102 -18469 -45226 -264028 -177994 -55724 200014 -147010 390849
23401 -85755 -34642 -600919 -135062 59851 -30787 -22043 -30207 -148718 -279795 41184 -13481
23389 206161 149661 -48636 189817 114743 166601 -54100 32360 -143091 86797 -12093 -17872
23378 -17872 122735 306394 -149049 128470 -105141 -48019 -166194 176313 272957 -54693
23367 217367 -124140 -42018 335470 -33282 -226278 116403 -88610 -14824 119570 125644 190591
23356 190591 -164719 -208903 -407508 -336823 -22591 -232360 -203382 -127282 -42023 -223988 -106389
23344 45255 -176421 24453 -20755 -266447 -60954 160155 -131693 -106325 -91306 -106523 4518
23332 -188830 36044 158533 164192 -100871 -50954 -103266 184406 184586 87392 -57569 117283
23320 89082 -84590 -36457 3999 -85252 -144040 -254311 -362282 -90330 -181720 -173007 -28399 206315
23307 229952 15359 -101919 -149228 -22328 -23215 -200903 11725 160963 142850 -23706 167524
23295 -227763 148172 -150692 -144952 -105149 -161761 -40109 -61989 372705 -151905 -266457 232662
23283 31503 -283905 -175657 460354 168308 -245800 -131474 -7737 59641 19805 70877 -121765
23271 60575 -37948 -251023 -5589 31121 323619 43437 241971 -174406 179936 23000 -228284
23259 245328 -209084 -130425 -96565 35701 -54062 -267149 157676 148909 -157360 32868 50077
23248 50077 -73519 40294 489032 -114709 87271 -71389 -174796 -78215 103378 150793 -39588
23236 252584 71717 -57197 -176133 97892 83300 58376 59918 -99398 -39109 -139433 303117
23224 46220 -124195 153680 243476 179827 -6977 -177366 49828 43749 30204 21975 -292809
23212 -21720 -8500 -81408 -197079 -194198 -76684 109337 245130 -41988 -193975 86057 109468
23201 109468 -130376 -28508 78902 449067 -88364 -37623 -186414 -55952 -51958 -2992 -47544
23190 -47544 -200875 1648 28634 -368216 -142013 -5090 -160052 -1661 -117184 180620 -124235
23178 104198 -165376 91097 153138 -12401 -146227 -60650 -477041 28339 22892 -191019 -222316
23167 -222316 -13521 -149503 -127711 127294 -252256 -14258 4759 -27410 55747 -124892 32214
23155 132347 -107672 -244252 -9908 56474 59595 5928 -46110 -54153 -157809 -149676 -135214 119934
23142 -107800 -111328 2791 -59065 136096 2680 -37582 18185 537659 -210486 -108674 171162
23130 24805 -250133 1788 -234467 82441 20651 -113823 -14238 88577 -140563 228479 219088
23119 219088 -266162 -236613 -23145 -45989 -129078 360010 -39466 -510384 -185152 -272639 -120274
23107 34232 -231413 52187 -259099 74914 -87145 127196 29862 69580 46467 -153040 -151063
23096 -151063 -201984 -10135 251350 -283309 -185889 -87224 -38863 73899 -95295 -103197 -48042
23084 -331649 31212 -31360 -19036 -56102 -36099 89887 -201662 -28172 83586 -248904 180680
23072 -176426 -32047 90513 147937 -4548 -73126 -181479 -71179 297010 110252 -59752 -274499
23061 -274499 370214 -284315 261114 272122 -157549 -73124 -54237 -243469 75496 257312
23051 257312 380683 98977 13004 121941 -214947 48778 -288388 -99635 -135429 45241 192790
23040 192790 -111392 -268392 112395 -244616 234815 204792 -206358 -201586 212103 353028
23030 353028 -195614 56035 120567 195589 -173400 -31105 -84630 4629 191312 -163300 8200
23018 154335 -47783 -161683 -38426 67543 -113668 281983 111938 44651 108173 142749 -281771
23006 -75329 -131318 -131879 12987 134477 28920 3411 -265650 53352 294390 -247911 443174
22994 92480 -100126 155955 -4918 222224 197820 -94041 423431 226872 304442 150936 91017
22983 91017 -229438 -312602 -166438 -40657 -107288 -92759 -179098 -129839 -195582 8654 -134431
22971 248534 157902 149133 -149491 29885 114389 -187871 6937 68935 -268286 -83760 100836
22959 -19199 210103 18297 -118934 -62117 -185175 -114956 -179654 -129119 -155819 89365 -116182
22947 -407635 -115785 112835 30895 -64740 -375455 -74607 -6424 -18018 43006 -218343 -120130
22936 -120130 -121659 -102609 -264219 -40926 -55815 134749 -35731 12039 -85533 22499 1144
22924 63583 -8504 -30347 46584 242754 12125 83743 -134554 24454 31018 -207187 -201453 -74129
22911 318468 -605661 309201 76877 173278 -344872 -25525 56449 785 -86565 311400 55028
22899 80448 -122593 -158642 -345814 -186700 -30301 -384030 -267188 -393388 85513 -57133
22888 -134884 -149942 229788 17565 17776 -4720 -312466 -228201 -16705 65002 183068 120105
22877 120105 -45571 11836 76955 -138172 -14773 -190360 334904 -46182 114096 -179886
22866 -5356 -142316 64044 -7333 20737 127654 -240306 -142637 8710 474830 579033 -184904
22854 -24468 -201946 -75231 142720 184735 -33623 -65142 -68910 -218804 36926 49547 537981
22843 537981 -127334 -322587 -344383 191310 179109 196152 -252350 33812 -19800 30599 9311
22831 -261637 -295337 -304746 -221933 8914 -162920 325546 216697 74792 15613 20089 59671
22820 59671 -195078 88655 -126786 -53570 75138 128866 129289 31281 -238894 103171 -250664
22808 377874 61065 41 -123032 -11833 -397673 82874 -187754 -151503 -63639 -2815 -143258
22797 -143258 -156451 155998 125120 -62107 334806 377064 -219410 141223 -57508 172860
22786 124827 -84918 305079 -59845 84396 60444 -394514 -79800 -159413 157396 -266835 184477
22774 -73113 -44845 147264 48608 11944 -59420 60077 14195 -129445 -295640 41924 25537
22763 25537 -77652 44823 -153234 31707 -18529 -250281 5148 -46216 -347554 -154533 -196506
22752 -196506 -281164 -205729 380240 -30769 -164265 31960 -83978 82957 20074 103771 -148261
22740 -115827 -123822 228521 -108129 -79725 -150871 -40420 43369 -110370 -357378 223486 -427612
22728 -36044 68817 89080 29880 35235 -245991 -54972 -136757 226460 91470 -322481 44133
22716 -6039 324906 -242056 -197361 176293 70674 -76619 219102 74642 -30218 177294 -97064
22704 -209223 287266 -67317 2999 -142711 84676 -85599 145048 -41130 -144268 62338 -53684
22692 194724 -107629 -190925 -151699 -121418 275879 75881 -106072 182417 -162312 126732
22681 -42515 -281326 -284143 -245825 213495 135585 -58464 100124 -185606 207591 13687 -214837
22669 47624 -123933 -179709 -90320 -312643 -81216 46365 -241768 21249 184974 -74908 -220904
22658 -220904 31558 105349 264298 115703 -157410 -101818 165624 103892 -41850 -207623
22648 -207623 346382 22415 -74727 38392 -204751 51186 -288406 -332455 -178073 -167662 241074
22636 -318083 278426 -110055 162090 39961 23536 -147544 -264797 -395074 -76952 73773
22625 -36771 -107307 -15825 -232 15243 110574 -558346 241079 46593 224888 268935 -31439
22613 260535 7617 42805 -179580 19706 -83134 65806 -191298 -222272 -48748 110306 -177946
22601 191347 94480 -15088 -129265 -125787 -67343 -125337 94157 -180182 -93706 95814 -187469
22589 -94562 -66117 -77731 -81857 -126315 117086 37528 147742 168591 212467 -26702 -143484
22578 -143484 26923 21121 147942 -75188 -23697 -129819 -170252 14967 52343 177799 32387
22566 217080 97023 36606 -96356 -83228 199833 -19621 -41838 34608 234808 -55582 -1108
22554 -7268 -48309 25485 134671 -219911 -164147 -146311 16667 -335350 226782 -69806 -159266
22543 -159266 276121 -102047 -201376 -166444 -54175 297268 -158221 65863 -108604 125032
22532 -146742 144612 7766 -240184 -175586 -69490 -353056 -261618 68909 67879 -26998 -34302
22521 -34302 -195508 -523097 98753 33222 397 98217 -104857 -129313 30784 -70212 64472
22509 -297185 3463 -107694 9034 124836 164730 81737 -540873 293844 -16852 270744 -307910
22497 93102 -42404 84986 20728 -58512 -186743 -102594 -328233 -87843 308670 -41558 162849
22485 -151249 -85752 -249230 -97020 -475239 -131596 30076 187128 -164063 -65760 -158243
22475 -158243 -104306 -64630 -141295 53170 164476 137550 -261527 -172932 36340 -163258 -110650
22464 -110650 -385696 -349395 -103801 120044 360020 -121654 103694 23625 20855 32393
22454 32393 -240293 77849 143316 -305650 -315109 310484 251626 190962 24482 63356 -95308
22442 -9164 -79815 -102829 194427 -275872 -64078 -64701 444687 -70096 141732 248745 205652
22431 205652 -312494 147092 -227207 -170368 -85405 43470 129271 -3141 -39623 155635 -39963
22419 46531 3913 -1928 123098 -15287 102506 204598 40606 167563 52325 241383 -84140
22407 -170427 43787 33892 -10272 -87508 -217095 -147262 -30447 91377 31817 -40784 160492
22395 374134 -45188 -108471 187972 -17858 83588 278016 72296 83894 -196962 -189502 -13185
22383 2358 -344362 -59828 148792 217116 -260306 -126666 -39461 9160 -311023 -66405 56147
22371 278981 -98395 -78312 -22047 58436 -157214 -241701 50733 236692 -286834 -106293 -269674
22360 -269674 -37946 -215875 -291749 120393 129129 -4598 -7398 26674 -8928 70887 -389569 -373134
22348 -373134 -467245 7124 -60657 211429 292202 -64786 -42507 -136558 -64283 174370 -227252
22336 -12762 -8265 -61403 -229840 -311892 137351 58676 -343561 -224201 90986 186707 179913
22325 179913 134193 -73591 -2783 -15910 -102212 -69549 -79681 -246946 74292 269573 484485
22314 484485 -76076 -88749 -116489 -178837 157649 32379 -95527 219468 -27264 272971 89831
22302 -190203 -87147 -101004 77417 338032 94163 199732 -140359 -57715 189583 -42230 12144
22290 -137632 62315 346443 279260 -40820 68154 195986 -103072 220458 -272809 -28977
22279 137227 -82356 114786 -42151 240257 -264398 90801 -17087 -274723 -300429 -68587 -10110
22267 -238601 117971 353293 -112744 -2950 259528 -83561 -482713 25755 -103050 52078
22256 89 -156237 -271711 100241 42135 -126597 -176015 -370548 -192107 336551 -30170 -234308
22245 -234308 -65739 -133001 114566 -411116 -11618 23236 -90277 15446 -12670 -224151 -243297
22234 -243297 249512 176513 -279182 63010 -21126 -163498 195848 -100112 261118 -28978
22223 -58177 -222884 -81645 -24162 -3791 -149361 -282188 252256 183511 -5309 331974 337372
22212 337372 -132217 72223 -259712 39507 183867 -29819 -124434 -399688 -263067 -326856
22202 -326856 -185273 -336622 -172402 10135 62404 -32866 -139123 -65312 -71918 339659 -54315
22190 -20339 -243505 -91909 147469 128592 292035 170700 7343 333699 394502 -187320 59233
22178 91538 21137 -211506 271199 41345 -62413 -95644 142795 252130 -328883 69568 -217748
22166 305036 182493 -118051 -26807 -252606 111430 -3669 138753 49607 -199360 -73400
22155 -265200 -65557 -91424 -291836 -170592 -100747 246235 -90132 145058 -39758 206858
22144 -37216 -199353 160387 -32540 114861 126923 -94672 208049 -338074 -228811 51508
22133 -144837 -132470 -96819 -230701 -470767 -41725 264382 162941 113420 -77079 -67655 137146
22121 -93740 -82214 137680 -146571 -95182 4501 170327 -239809 129873 19889 -61884 -154091
22110 -154091 56106 -409325 -208218 61750 31453 -515604 -30857 -257598 223895 113670
22100 113670 150456 151088 55400 -70281 -181844 -210241 9940 48942 -57966 105382 -41486 -121555
22088 -121555 -165323 151082 -161841 -87651 -48189 -98075 88134 -21774 89324 -129354 146899
22076 248463 -252902 -145080 -60056 114374 -87636 78559 -81397 -35204 89432 -13700 -117993
22065 -117993 295720 -16109 157117 93027 16123 -299805 10446 19086 94508 210364 -47690
22053 186353 -172676 338476 -51649 215887 -287424 19529 46193 -190082 18639 39196
22043 39196 -450673 213023 171492 -86021 50463 296350 -82641 -10424 99016 -41959 -163228
22032 -163228 -52642 65336 83659 288462 381911 3557 121054 83831 53764 -178403 -87412
22020 -135306 68058 -222702 -205222 207987 -15562 17896 -119270 -227198 -405260 29512
22009 -127578 116302 20279 -61849 -22632 101060 69213 313300 69134 126816 -56918 1147
21997 81612 -56311 283262 -85754 -228740 21900 -401670 -102822 -53949 -40711 302916 -227747
21985 -186012 30768 -71152 -53229 9958 -85598 196862 -236806 -130205 4228 -158592 46353
21973 -6416 -417391 11414 8321 185042 171958 -69927 -69326 -774 281226 33876 37697 -198219
21960 -131539 -266389 191188 132443 117631 -146036 -90243 51655 136245 -47413 116457 2689
21948 70796 -95497 57942 -175928 76053 -337109 -85080 228583 18136 -116850 -69759 -321000
21937 -321000 273296 6093 -336647 37484 -47097 151653 100430 82531 -309158 -163900 -109485
21926 -109485 -242933 -188313 382212 -158129 -223599 -32704 -157206 197494 -107465 -117239
21916 -117239 20971 -181404 -173527 -146345 -24933 -220736 51567 -166804 102263 -248427 34193
21904 -13970 288666 42725 96301 -92207 16790 64940 -485521 -114593 11812 212348 -189438
21892 -164117 -230227 -234796 -474468 -48456 -287887 -117060 -154091 -210029 125063 -149593 -256924
21881 -256924 -26706 64292 195025 -169588 293868 -51861 132754 6648 -153538 179031
21870 -207723 172477 -267832 38352 -154598 -249311 -23291 -68990 -147148 81986 241148 130808
21859 130808 -107812 -52971 -186008 -29629 134756 -60001 -213962 189807 -226193 -281807
21849 -281807 -255783 -37886 -123249 94839 86737 -208589 -385787 -350841 57366 -206196 -89735
21837 -139712 -107173 -73002 13434 -243247 -162486 -94084 35927 23452 -403374 -143939 -278589
21826 -278589 118549 95883 12043 171399 228876 -49703 190802 -158304 -90223 -119957 -109655
21815 -109655 -171849 -79368 276560 -251407 -31597 -4721 -13155 -51200 -120133 192157 -131445
21803 55463 -409558 34083 44999 -349460 -333682 -160596 123558 -71976 125686 -268230
21792 188837 61560 -28520 184597 -258384 49351 271234 166203 71385 -140497 70271
21781 -207501 -368151 38562 -85107 -56947 6773 16547 -44901 -15443 102107 -70353 -649291
21770 -649291 -111507 -100172 -86445 -78956 -220950 63382 -12604 -10326 -358105 -169708 -140202
21759 -140202 149400 -229996 -198849 67058 132450 -187016 159588 -200287 -72776 156321
21748 216890 79483 2228 6023 59114 89289 16446 255381 -70742 147016 24267 301846
21737 301846 237390 118430 -451623 -113382 35180 -151364 181603 -269724 51511 34860
21727 34860 -84838 -211738 56586 -78325 60422 -187758 -49523 -53506 185654 -111446 84208
21715 24899 75797 295090 -140682 -199218 49763 -226645 -319082 -191699 -121768 -139718 147360
21703 123584 66196 -251855 -130678 99944 -95509 -70412 -25907 -51651 -35465 39121 -52680
21691 -28069 -187825 95030 -8831 47518 22122 -165302 -93589 172782 -147032 -145799 -131361
21680 -131361 -113785 -37668 -374577 -298488 347465 -316233 -69869 -178550 142461 -50300
21669 -77995 -170233 48582 -176390 209047 28371 -8034 196428 171840 96161 180166 197399
21658 197399 82313 -115703 -342665 -26776 -124236 -56705 1658 -41695 -328365 244455 -273426
21646 -41498 -190095 -220117 45051 61997 -289806 177755 -285664 31969 -144173 27511 -30521
21634 176323 56621 216813 -370807 215710 190927 -94054 -138356 129936 175814 39809 -208124
21622 -151676 120169 356785 -62026 -545 -113807 162667 -217921 -332260 103254 191768
21612 191768 3515 71290 62465 69935 256816 -145990 -211823 -39022 126497 88509 -86107
21600 -69866 394103 -104628 134450 249646 -227695 100492 -414544 -269397 -19279 56760
21589 -34323 -58031 -9765 -7661 -313517 -118238 -376567 -46839 279642 -304677 -189378 -136486
21578 -136486 -74613 -50253 -393312 30320 -138311 60805 -160462 -329279 -98862 -120406 31870
21566 -130347 -272080 -225850 -316374 -261170 -82876 -119740 -190244 -206353 -127016 -5447 -260947
21555 -260947 -35926 -46558 -62932 90827 38384 196763 -14107 -386251 -170248 -15355 -131510
21544 -131510 65871 296332 -10451 -47046 32336 -255081 -160033 -206327 187362 -69748 -467288
21533 -467288 -178853 130195 -25452 79268 -84153 -129974 -57904 276387 -320548 -48881 -129126
21522 -129126 -119196 -316329 28320 2914 66640 126052 235984 209419 -220188 -118457 114939
21510 3645 -100253 -80223 -456083 180617 -38363 -66063 -28073 -88453 -352898 15032 -408267
21498 -90716 19369 -154488 -27545 26887 210103 -111339 -99491 -264250 -45801 95187 -515772
21486 -103388 164427 -236432 135419 -111957 -59204 -42858 -68288 132720 52872 -16820
21475 -61064 -238850 72514 63080 -160124 -73328 -377490 -151599 -216481 -158032 135136 147916
21464 147916 86564 19474 -116497 -167153 8190 19004 18399 -44741 -56943 -183542 -185348 -263085
21452 -263085 33981 16960 37027 -103914 -139770 229880 -38709 114691 -49163 64236 -30302
21440 381056 347568 176077 -15338 427408 107057 139809 -61625 -235881 -58232 259495
21429 -60869 -74355 -355658 252729 215479 28432 -57755 -202838 -78547 117522 148796 -7070
21417 -55640 -64001 199762 95466 -3600 -131098 -28176 10644 75721 -260734 -190680 96014
21405 16085 -286769 254954 -16041 137049 -119670 -125900 -105770 -201737 108104 32799 151412
21394 151412 -155639 -114487 257125 234844 133808 -341074 -89313 -210441 67252 74308 278626
21383 278626 -121816 -73265 -304646 76603 -88739 122925 -23376 -13587 -43479 61860 2844
21371 -207931 40509 302287 -197474 97106 101594 -94318 6622 -183743 -1832 41580 -34441
21359 -229863 17491 -48466 214995 176499 90427 -65113 -58899 -12737 4897 -89419 71368 -46311
21346 60426 -317882 134447 -188123 -86596 -323225 81663 -73888 -116160 -18861 -66643 105319
21334 -72387 148207 -158195 -382579 -121597 -137513 183661 -116683 25901 97422 -159021
21323 201516 -285408 -145111 89917 231406 -320590 -184089 -90903 -24065 -248557 -109101
21312 265019 -21786 -26114 262109 332802 -194347 -198781 113677 -341312 471727 218521 -184271
21300 -132411 -433367 -181831 21388 80432 -84332 36058 -280047 -130404 -113176 136035
21289 50689 78520 34103 294849 -137613 -25972 -256696 -225205 244582 -111823 -153934 -38750
21277 -36607 -36506 259973 -47715 -226321 -89757 -58509 108330 153643 -325850 29518 -116242
21265 -46447 -49642 -102555 117609 -300827 139178 -191481 -203004 190212 -178226 -241179 27637
21253 -148368 425870 -76786 11726 -136126 -149863 103008 -156095 -36715 101388 182243
21243 182243 1228 -387108 -168221 -105397 -85459 95543 -260287 59656 -153578 22568 210371
21232 210371 -159319 7119 -164666 -113378 128955 -333689 -104650 -32721 -88997 83200 19732
21220 -199277 16435 -92504 -120401 -10786 -160416 -145818 -209220 -282022 182018 -52666 -184638
21209 -184638 111570 -115338 6184 319140 38425 -444239 182942 289049 -332848 73137
21198 -45311 -152025 -38552 -133406 -111050 -99018 -142213 150041 -36459 -13142 -57913 84044
21186 -422016 -213051 59625 -230790 2759 -254589 215698 -139702 -58491 -66059 -81968 -38231
21174 197671 -369991 -32324 94967 26729 -190552 -201509 -7280 31762 -251561 -96268 -431861
21163 -431861 -6783 -178883 -49140 58617 310248 -132399 128170 -386680 31867 -12930 114245
21151 70271 84402 69762 -176334 -101524 89236 -408904 -442063 238807 -68960 -32423 67685
21139 27154 -311419 264133 452943 -222027 126751 39872 142816 108342 -63800 -124211
21129 -124211 -96885 -166193 -186673 -67455 -75763 -71835 169867 -152752 5379 -47074 10902 44864
21117 44864 -124724 -465485 -102999 443329 -49114 65382 12114 163690 24085 -171739
21106 40327 -98788 41564 23064 -399435 -156 -77478 -163244 -60035 -102313 120189 128983 -20856
21093 -266055 -250345 46458 -272245 -72787 68288 -192413 -138481 -108018 192001 -11543 37478
21081 271616 -113895 -293998 74131 -219766 -46894 -105846 175358 97052 45345 27258 -57169
21069 7763 -62791 -166643 -182687 -104592 -251754 -103766 74546 -263988 288105 421132 15424
21057 -128967 35831 -401516 -48394 -239157 118949 -352598 -60544 -298506 -196480 -236013
21047 -236013 -61042 -255961 -186565 209052 -79238 43911 137269 -60199 -358955 301449 20127
21035 39661 -85544 -98924 96926 -63987 106956 -44350 -93429 19545 -173173 -157619 289354
21023 -222872 -82082 14016 -8894 -179738 -310935 -122365 -81975 119865 -18608 -76594 279898
21011 26701 -30387 -113431 -114478 -49208 122553 -204128 97228 -132480 -22677 -193954 151985
20999 -56369 154627 -271474 -160087 140412 -18202 43700 120267 115264 -75518 107864 -14014
20987 152234 143142 32262 -28056 -72778 -162068 -248845 -186814 -178278 -198440 -104889 -213908 86274
20974 -279208 99706 166637 -149611 -3900 -32048 -177322 39847 -274799 -48681 -69080 92724
20962 31574 238191 56980 -193025 -79259 -144429 186290 1898 -211949 74628 12116 -1260
20950 -7113 68129 14098 -151211 247894 -72392 92512 -44033 160475 290840 104499 74136
20939 74136 -52540 -209500 -275278 113438 131978 -152996 -96841 44897 -239225 -91889 59422
20927 -573 -132065 136999 132313 -18702 12495 143293 206966 37571 -239953 -304567 159807
20915 53355 -114383 -4484 -242148 72767 94764 -177665 250919 -3148 185812 82749 137195
20904 137195 102325 -477139 -71692 -48619 -316375 -85285 6732 -257513 -114425 -101524 71124
20892 11700 24866 -69267 -114020 8658 56816 67843 76804 20373 17924 -197515 -406617 -188382
20879 -270418 -61196 208400 -194488 -120285 -103526 -414987 213290 129098 -150679 -209800
20869 -209800 -212391 -64641 -115565 -135123 -71525 196269 -749 -138875 -62388 -223618 -216582 -283342
20857 -283342 -46706 -165852 99546 142526 -183463 -78323 295838 -187666 8647 -14928 35996
20845 -153678 -125077 -291916 97515 248158 144126 -55472 185819 -127078 -241383 -36032
20834 -73592 -206665 31238 -2519 -215851 12360 -386452 574 -6310 13858 -73534 130677 -259570
20821 131477 -258549 -209762 173840 -759163 -58445 189212 -386402 -272601 254504 57239
20810 292554 39753 -112370 48000 -466401 -62438 -214467 -166531 8010 -293772 48705 -92631
20798 -121917 167527 -173145 -99616 -58605 -14622 -285294 186620 139797 -113425 -119343 -59920
20787 -59920 -114619 -50676 -41012 -54201 -445540 32453 -187567 25308 292345 56625 -16459
20775 184865 284568 36088 -158023 -163493 -30654 34893 -15238 -193262 -9383 -382805 -69744
20763 293943 98632 145910 -417958 -63880 -15556 67884 -66612 96926 -88600 -96745 33065
20751 -180710 30886 213947 84127 -67905 -161339 38957 -46912 -91478 95222 120886 -52862
20739 -123323 65037 -66769 -264015 -226308 -198062 -29250 -18095 -27213 -76333 -93836 -116856
20728 -116856 168366 -162190 -206748 -76027 -157699 203739 -17413 -74998 -97204 -588987 82233
20716 -270653 196147 -203194 -97610 -48669 63471 39388 67543 198914 45644 -155839 231967
20704 -109256 -348777 -26653 -330063 -31472 -292534 -114004 -235317 21728 -464198 -51677
20693 -149223 -230783 -60072 -352341 277996 140020 -101185 237285 -207459 9992 23025
20683 23025 -47587 -291394 244515 -92454 -161583 -55018 37199 -317354 -124630 210179 -345092
20671 113378 -3008 -89494 -147152 -150708 238085 -201284 -15055 125905 42684 -158574 -215136
20660 -215136 -10214 -10543 148886 -170271 -30977 192945 137085 130385 -24908 70740 190465
20649 190465 77026 39769 -28653 9756 24197 67261 57342 214657 30108 -80564 177532
20637 -240997 -380033 -259008 -67168 249730 -250804 63614 120619 -8275 53631 -21253 -90897
20626 -90897 66091 186362 -165527 101027 137790 -186306 43189 121918 -7007 -182257 -41186
20614 -491781 -180427 73994 211960 -110039 -310686 -19093 305485 140582 -160774 219723
20603 79081 -281640 -522 -30680 -165996 -59071 -91708 68742 -136876 -67086 303552 -79897
20591 55898 -228251 -196572 66118 -286533 13967 129480 -114132 67111 -60074 -254823 -256723
20580 -256723 231977 69331 -60426 -12929 100089 -82861 -87502 -55942 390304 -299831 -244451
20569 -244451 -204937 -148718 147942 -148777 -327421 53529 -12737 -172807 -28810 250137
20558 -132790 239697 27226 -40262 43479 -12317 -153407 58613 -421611 -181288 -190022 37392
20546 313233 -8136 -180259 -16573 -359711 -195737 410418 -180940 -45056 -224094 -25767
20535 -368296 -241172 -143535 31043 -182822 106396 227972 -188608 -439286 -102033 -100914
20525 -100914 -237513 -460758 -63949 -3178 -236256 -256546 217357 63937 -125101 46788 -136166
20513 -46552 213941 -47141 -20582 71576 263626 182005 27597 -207323 116714 15939 -105489
20501 39549 -253475 -108124 -12101 -27817 -127846 -33914 7525 -251262 -216698 31488 -66479
20489 -223855 117550 -140483 29048 44178 82849 -7042 -5423 -63992 -100691 -342711 190242
20477 -40883 214723 -192889 -286670 482151 -158552 172310 -226787 -234716 -280330 -38919 36795
20465 209112 14350 74335 -37546 -2102 168097 80750 -93217 67426 109689 101488 -300612
20453 255951 -50538 32980 -136889 -228265 116926 130283 263330 -119782 -1482 -185594 -2940
20441 279921 -128044 -41066 -167575 215474 23738 -81772 -203772 -58629 35713 139195
20431 139195 45578 -234674 -168763 -130268 -155178 -46093 308302 -204790 95316 -163692 171409
20419 -151421 -328395 95139 111452 162026 230145 -293155 158539 -116473 46730 -74544 -316937
20408 -316937 118448 60230 286616 -93717 -117381 -50686 -334937 -241709 192572 64326 -227223
20396 -38136 165798 111563 -134494 5557 -4195 -2186 85592 199902 149441 109794 -317112
20384 -79541 -217991 322980 140475 -13735 -380608 -206925 -27855 33234 -120613 205383
20373 -514 100328 253056 333933 114414 -134483 -249983 41567 -52381 299456 50027 -313647
20361 -168544 101186 -67582 -116745 49841 -192322 -249373 -101222 7242 -273919 -218389 -196344
20350 -196344 -165714 -180180 15297 -103860 -63907 -377200 210202 -199501 16477 -109809
20339 -85884 234354 147088 -70907 130185 -169538 -145670 75167 1680 -51078 -77565 -22072
20327 -43814 37784 -63803 26253 -34332 -184165 267765 -226354 137688 -131360 -101505 -282714
20316 -282714 -64261 327210 -183449 17843 204855 -117856 59829 -239096 156266 2118
20305 -129527 -507758 -192493 35988 76513 -252231 71814 -3848 -209354 -52946 -261682 75429
20293 -368184 -6887 -195846 280959 39273 -140255 -208085 -434154 -28361 18288 -349955 72513
20281 -324498 -64120 -232556 52610 -291407 100934 -150412 -187891 -10055 228981 103044
20270 296545 46161 59216 220860 254764 -176687 1835 63107 -177019 -237318 41092 199891
20259 199891 -264992 -303315 -202497 -102450 -301012 -290520 104966 86423 -95852 -134492
20249 -134492 6600 -244660 -639 -20200 -70369 117834 217200 -143713 28255 64377 44720
20238 44720 52572 -122213 -59379 222503 -316561 -379552 -95827 -69036 -63581 313893 101897
20226 -293492 -113104 31248 100470 -123533 116050 312218 -51985 134707 -42765 -118653
20216 -118653 -295993 -120379 -110341 -167243 -173301 49385 -210622 133918 -137008 -235212 -114141
20204 41660 -217161 -212521 205710 -82012 -113212 -194573 43128 -126568 -55286 75988 -199749
20192 49282 -39403 -103752 -52369 139444 -24510 269696 60195 -227098 -2372 -354489 4408
20180 336806 -25349 -129569 -166179 86008 9419 -133377 -200813 -372 47168 -220589 241095
20168 -332732 86145 188779 -352014 170193 -22197 -80356 -306477 422696 117519 361425
20158 361425 -246838 -58095 -132181 -246493 43894 -31724 312829 -144047 -433732 12314
20147 101094 -71257 106484 -8268 175611 76569 -157789 132027 -319807 -138430 127836
20136 145393 90539 93808 11173 -108182 -109808 -338412 -171650 33000 -69207 -68499 174528
20124 197777 -126021 -168267 17785 5295 -117091 -29871 -173017 123349 -130543 149570
20113 -127663 29848 -113170 -32266 -208163 262396 91844 -13627 -188778 21697 -26169 141193
20101 63598 -117379 72632 167826 111599 70809 85613 169518 -191876 54573 23573 -345479
20089 25422 -5306 -35834 -145805 27420 -34377 87105 -16044 -88064 63372 88450 -47445 -157452
20077 -157452 -15549 -141697 -161015 -48573 -534857 -370447 141672 105370 -121407 -240835
20067 -240835 -67696 -553329 -15367 -74104 -170948 -278952 -24770 24894 56380 -267545 -106277
20055 -218252 221346 25149 -259157 74574 -99194 -219212 132224 -222153 -29637 79590
20044 277525 -149308 -98622 241153 -144546 -109384 78539 -289677 123950 -59538 128559
20033 -95634 160824 159882 182863 -262344 87494 -375861 214578 204274 -140804 -123314 -248318
20022 -248318 244385 -263788 -82517 -42813 100110 -190772 249070 -514164 58622 83695
20012 83695 -223394 -424864 -321005 80398 64089 -157355 75921 -156475 -106627 -109929 -240268
20001 -240268 -151324 6046 -207845 180756 -132092 175244 -90805 -331916 -255183 83166 -28698
19989 -182307 -304050 -332166 143579 -258788 155006 -172253 -164591 -85465 -100829 113949
19978 -197865 -434709 -31742 -106894 -343284 55020 300261 -144887 -276504 -22406 -3941 -157608
19967 -157608 -2776 -60863 32337 136327 27733 -225104 -310929 -89541 123688 -208409 55531
19955 122217 -347929 -76621 -118869 381837 -362739 -33285 6625 -99576 186491 -7758 -245936
19944 -245936 -215380 -94271 140304 206630 -191869 131186 85306 -6664 111059 -125096 81499
19932 82538 -173817 -143180 351811 -371840 91491 -22410 -111277 39089 -384480 -26951 19416
19920 178527 -80607 200523 91752 85350 6917 -104173 61006 -266496 -57109 -460672 194137
19908 124562 -79248 179835 -59847 -312214 -180467 -95487 196327 280040 53969 311926
19898 311926 262659 -82865 164521 119255 -18511 -157742 -495132 -185655 122363 -189341
19887 -321518 54553 -26257 130399 -142437 -24253 -91164 -285351 -166017 146498 -73461
19876 -10925 -382817 -232517 6051 53031 -337789 -77041 -131488 -243684 50662 -122231 61544
19864 132834 -205036 139292 -32995 49394 17984 -307319 -110437 -134078 17001 -159744
19853 -71061 93819 -115942 47813 -23650 -180913 122268 -161103 154141 -107628 -275588
19843 -275588 136388 -52578 -131357 -159258 169866 -114939 -126019 -59748 -60997 -276784 26411
19831 -36510 -137564 46746 -145778 -98976 -327309 -19597 -142431 94897 -295186 266318
19820 -221314 168241 -57806 -119594 -56818 -77238 -337369 -54155 16520 107311 192281 -239637
19808 125503 -41933 -46696 78338 -215255 -323743 -33341 159166 -410101 -115335 -154309 -295071
19797 -295071 200652 -120952 88511 -154765 -125509 -53881 -21470 -258920 254884 -143976
19786 -314897 -54113 208498 30918 -69536 -121692 53181 -124166 -304111 49922 97134 138279
19775 138279 -245675 80633 -201146 73851 -82555 1182 -9689 -38686 103892 -296183 -84027
19763 -279477 -331938 37818 38002 -304323 -37065 -243798 -35928 314210 -181094 -131404 71053
19751 132529 84567 -291411 8548 -4977 70293 106360 978 -208966 -112032 -138386 63935 99740
19739 99740 -301293 76120 66607 8781 -295161 -86777 186237 178706 158736 -80088 -233692
19728 -233692 208686 87896 -207602 -91496 -233526 157359 298162 -289647 1339 -39837
19717 52181 -217258 -146818 -100637 -180952 266413 -404644 -112778 -26418 -181058 141900
19706 112222 49300 154242 -83053 94037 361299 -80757 94330 -166963 196296 161236 -103742
19694 -218286 141172 34004 -158732 -87651 -260001 -92899 -14995 -138674 -34172 138530
19683 -258653 -423883 308656 123291 -158418 96553 38287 -103011 -361101 -202211 45944
19672 64806 -292754 -93407 150560 -33376 -32558 174464 -41837 97413 183691 -292597 -115001
19660 -194627 53165 123276 77826 -201146 -138313 -68095 -20534 -37279 -15935 109989 134456
19649 134456 98100 -249428 -156148 34252 -203587 -40103 -173480 -224078 86522 47904 110593
19638 110593 32173 129549 210754 -27058 -63115 108952 -282523 -280694 -292826 70455 -140216
19626 -1874 110962 69131 -180716 -354450 -205955 -143334 -158081 -283501 145599 -285417
19615 176923 -275802 -110014 -309895 -3708 -149934 -363570 -185396 381614 -46490 45325
19604 -226312 -261837 -180432 -173156 178562 -16128 42523 -23912 283660 295664 60093 -190463
19592 -170118 111406 -127167 -89574 4099 38683 206245 -54983 -65038 142852 -151306 46787
19580 -5227 227087 -245605 -319262 200747 -244176 -205995 2385 136845 -40471 -50230 47886
19568 76976 -202302 -219788 268241 -26450 -29513 -185126 116399 40692 -133517 -74966 15743
19556 -80290 -56531 -158833 88685 76735 -360245 -282516 71024 250942 24960 107155 -155050
19544 68523 -305252 -169772 188261 1228 -226777 115025 -42799 -58395 -96831 -242419 -95105
19532 -189727 -8743 -533429 15888 -163414 -139717 -368579 -31633 -137755 -4882 -119787 144086
19520 5606 99036 -234458 334886 -105360 10127 -43514 233412 -208819 -136146 22427 52846
19509 52846 73408 -17929 -66000 -187777 -12561 -161396 7693 175105 -24475 -254506 -184100
19498 -184100 -244485 -173164 -61920 -112343 -207785 -73889 -188255 -42518 2138 -293692 -68809
19486 -388858 -374650 -133894 -44788 48766 -336329 34918 -300609 17053 -334268 434385
19475 -332219 160391 -199178 -93775 -68860 -123171 -150801 179646 -126950 -25101 -190600
19465 -190600 21536 -76706 225783 -155614 250673 -151752 148036 152263 42095 -15001 -278490
19454 -278490 56136 -104554 113148 161253 -44017 4629 -221266 -185560 178528 -6658 42019
19442 -53965 -162811 100177 -272854 -93528 181665 298993 -265498 -93170 -57311 41639
19431 7072 6977 -482129 158615 -55803 9859 -48987 38119 -127796 -69445 -273042 -22762 154119
19418 -251403 120428 120233 -67353 -107113 -178974 -10244 -311795 -132579 227095 -244449 130625
19406 -298438 -21070 85382 270679 -177598 -71849 -166137 119015 -283124 -137465 28879
19395 -196224 -60722 -217968 47641 70604 -154952 -121409 -220346 -118992 -232097 146908
19384 -257238 275854 -132399 17008 -90891 -51100 -277554 178044 -26250 29544 -9865 -3814
19372 41180 -184757 244330 62132 41039 114789 -88043 168152 41925 -346788 -5030 102140
19360 236976 -4617 -38421 262682 -5218 -66284 23794 206063 16832 -270820 36159 43024
19349 43024 87275 59971 -158500 151986 -94921 206317 109205 -115141 -55046 -87950 -175531
19338 -175531 -104484 4997 30434 -283917 -30561 214378 29546 -35737 -44361 148990 -143957
19326 -339669 103240 -250343 -65213 -245596 16305 -200824 101114 -24124 39118 -156460
19315 24904 -308987 -17427 125512 -137865 -397121 -301565 22843 -281939 162972 111944
19305 111944 79914 -38793 184820 -328846 -13700 -212034 223036 -324365 314304 86660
19294 -241379 -94210 -76209 33199 -147443 -175735 -175173 -337111 -227024 -275904 -14869 74382
19282 -87834 248047 -149462 -79388 -36313 -59949 57376 10972 -231919 -198310 -68053 -197366
19271 -197366 -104882 15410 182129 485822 52178 53252 -26403 -10308 39173 -100427 221732
19259 37351 155907 5068 -417610 -43957 95199 116218 -162733 -90706 140937 -86245 203337
19247 98209 182781 -174836 136253 29919 -216783 36217 -139288 81642 90717 -496767 -114400
19235 -60204 2120 5639 299710 -267289 167229 -360758 -142871 -159336 -12939 95182 167786
19224 167786 11284 1805 -264788 -232499 -279109 322570 162940 148628 -89918 -225556 49595
19212 -24715 167674 -241586 -118332 -142097 -192539 -125447 206318 55941 -140050 -226360 -207951
19201 -207951 32668 -55751 -43600 -20138 -265450 178501 169036 -115436 11117 -48050 -22338
19189 -70307 -91003 232782 65338 158704 -206333 -72309 -95674 240812 -77058 -68850 -54717
19178 -54717 197097 -24170 26050 -63946 -183448 29748 100538 -301832 233018 -63475 27536
19166 78124 -3292 226869 -55815 -187592 -163645 -139683 -67239 -388567 -32773 -178613 11004
19154 -27357 -77507 131676 303540 50728 91053 -403571 -466830 71476 -115437 -395474 -96117
19142 116064 41895 -59873 22504 90686 -57079 116631 167625 180715 -83385 115022 -225296
19130 50615 192804 -6540 -104588 73035 -299561 -28422 -108609 -113969 -64803 -199139 -229492
19119 -229492 -135090 -39796 -62432 -318320 -251172 118492 76134 -345821 181272 -195790
19108 -180722 -130086 55927 -174447 -113060 -243003 6860 -86365 -40590 276537 -124476 -123640
19097 -123640 -202175 -239750 -173750 84069 -50903 -32323 -235682 -298733 -166443 123277 72624
19086 72624 -38645 -176515 -220428 241689 49526 -152450 -194792 13760 7641 -211712 93329
19074 -99435 120808 -78298 21696 -92502 -3841 -49475 -185845 147892 128265 255662 34181
19062 300867 -13029 -187291 -56768 16779 -223789 149184 21256 -172285 43 -66466 -168458
19051 -168458 -252678 -28130 73135 -249097 -125368 -184751 -93262 107298 148216 116374 76101
19040 76101 -25578 -47669 336596 -217339 11385 -176979 -205339 178105 -51918 -35741 -109779
19029 -109779 184057 84328 190859 78659 -53860 255116 -26710 -6929 -186917 1797 253661
19018 253661 69484 185444 109830 120611 187644 116109 -168508 -266353 -115767 -424345 -193653
19006 -185687 -400369 -49276 64185 -5638 -41405 -288314 97720 2034 -141744 -265036 -104207
18994 15666 33369 -47438 260126 -124176 -235792 112784 131631 -93697 -226604 -111125
18983 -3359 -156562 136132 26204 -85198 -97991 -102840 -98176 -25544 -3152 211676 -274246 320314
18970 -285934 -25655 41942 -33954 -166826 -240900 209696 -277707 -35433 248201 -89459 -292636
18959 -292636 -32107 81183 -78994 -208946 -207703 -181760 -103964 89059 -12705 -25880 -265709
18948 -265709 64858 -179303 -242427 -43677 -188673 39247 -116774 73048 -154490 -51047 -369826
18937 -369826 -85459 22162 -135823 -149964 -193192 -25184 64692 -279704 -102398 -121525 111810
18925 -52517 -249970 -279459 234891 91975 -9729 248390 -133106 -240949 11035 -23585 -17237
18914 -17237 -165998 68725 -94828 -189775 -122292 63340 -45716 266213 62965 10942 101848
18903 101848 -43889 -272041 -26245 166049 101883 275454 -171032 -31407 -45944 159442
18892 -192275 -106592 15192 141244 21101 70752 -126543 -94871 -140597 -302484 -127273 94808
18880 -145671 -11613 -107733 31740 -251727 -26332 -187049 309671 -117076 185603 289023
18870 289023 -152092 14249 -198703 -102723 79070 -66400 223423 -437284 61447 -88684 54706
18858 -234472 30430 -124727 134769 -73268 -153963 -75960 -293491 219042 139456 25469 136990
18847 136990 -2726 -60449 138053 -241224 -99813 182679 -340876 -137731 -65171 -315779
18837 -315779 17265 32056 3772 -159755 -223108 -202740 -170036 265261 73059 18463 -250279
18825 -14708 -289893 -72458 61492 -23786 -86313 131620 108678 61938 -216969 -43932 150646
18813 312397 -286537 61826 -105660 94183 21198 128522 35791 -15063 29699 172058 -169975
18801 -23510 67049 137618 -327013 6598 -99201 303957 -147236 -119502 -108007 -26084 -107622
18790 -107622 -157343 -271065 93649 57476 -10424 112924 -4915 69492 -44655 46131 124647
18779 124647 572781 -148781 -147349 -129912 -95715 -130381 11828 -152014 36916 32140 -275329
18767 -343590 -154705 30182 43842 -247879 -8699 -30340 -45052 -141308 -336436 -20827 90227
18755 -46390 24427 -44851 -28369 -220015 -10885 -170790 -311207 -164212 81539 -279605 57109
18743 16277 -159141 -149036 -258850 -85911 -49450 -109277 123399 -72251 -96410 -441688 -65632
18731 52815 319109 139684 94999 -247969 -319658 129064 6644 183446 -199055 127926
18720 98324 168022 75028 -237261 884 -40686 112858 80878 -157016 157400 69943 32141
18708 -166321 256923 218586 -319869 270868 204364 -371369 -138118 6891 -197869 -150059
18698 -150059 -40051 -174134 93149 -310243 -305812 -28559 -181490 -130523 -72849 -128303 -93146
18687 -93146 -21948 -128955 -321075 -173846 -79661 -29982 -29994 -136820 -502889 -65768 -268297
18676 -268297 200404 -84380 -263030 258265 8256 114230 -29352 -176674 -149036 -77376 26246
18664 388167 112153 297337 -188594 68701 34085 -66705 -107654 19464 83870 -18792 51908
18652 3616 17602 103412 -56426 -111627 66326 55208 -62523 -244564 -11830 -105375 152699
18640 -71245 -90568 261575 -502107 27769 -72082 -265070 -95210 -385218 -183842 260609
18629 -12455 31194 -158587 -67164 -162169 -83851 -268691 455035 -317440 -127132 -261507
18619 -261507 -125440 -188934 77438 70430 -212775 64785 -196541 -13879 -143113 -189268 58999
18607 -58710 5028 -167296 -28284 -12738 -138527 -344112 -9895 -139188 862 -85814 -80724 104009
18594 -247819 84806 5686 -33488 -248959 311356 -153793 -100957 -151256 46547 108748 -133798
18582 238452 -219957 -89350 83246 96019 -60383 -28646 244037 -64422 -30774 -17253 -91108
18571 -91108 -143692 -442585 -35120 -113147 -290842 148763 -298 -228208 -122894 173411 -119868
18559 -209694 -40507 -210328 37073 -426396 110478 20574 -286436 144301 114748 596 -53904
18547 87729 -125668 -138824 -187822 -46102 -234293 -195384 -120897 -88602 -147812 -217432 -61258
18535 -56618 -128742 -309670 -135995 -166496 257910 130150 -195768 -11659 37310 -42623 -122762
18524 -122762 -35587 -7500 72692 -118022 97226 90067 115887 -106188 -40277 773 187753 -56202
18511 -109539 298229 -31916 43672 -135077 -42531 191615 -207263 -209239 -93545 164084 204179
18500 204179 -111309 -82762 148903 -161658 -104051 6524 71776 -108493 -31609 -15014 -172530
18489 -172530 -77954 -195077 -360073 -116667 245926 267350 -138159 -36638 -13693 -246087
18479 -246087 -56300 -99893 -188456 -253004 -157076 -6126 -289679 175606 200060 164250 -7341
18467 -158846 190477 -76827 -102325 327440 -104959 -61102 116409 312995 -11938 4038 -237992
18455 -167443 -19389 -143806 108855 125766 -178333 85959 -96067 -61477 -246009 -159926 -66929
18443 -169764 -180484 71619 -32153 -98552 48903 35268 217932 -206290 186652 129326 91474
18432 91474 -86320 -146938 -111264 -94336 -246410 -266682 -250080 55943 -56795 -1446 -14950 56580
18419 133216 -296672 41748 -15363 -201519 -135885 -193590 -148263 -10143 -101077 151016 123975
18408 123975 -51545 24782 -124542 -348032 12246 39047 429394 -96039 -193208 -41570 -114986
18397 -114986 263274 338394 89246 148765 268964 -37042 -24870 -175274 -60999 -276262 -222627
18386 -222627 -103480 163510 -55256 154298 140595 6922 107727 31220 -267795 -131105
18375 -234482 -357435 -217280 -106364 -81414 -276670 -33899 -213780 45326 138516 -121769
18364 -261955 7192 202838 161117 136777 -288306 -228577 -222099 -10541 -318128 -87557 121267
18352 11895 67641 -52531 98272 11925 -81351 -291947 -61372 -189378 -255490 142144 -169336
18340 178929 119613 -114001 -13116 148811 49358 -149222 -201730 -198782 239013 -81952 -64656
18329 -64656 153718 -125570 -34347 -370168 -20584 -286157 135604 206022 37364 -55261 136390
18317 -67976 308056 -11925 -40513 -34987 29374 -192612 29912 -86072 -266568 -362761 5291
18305 -183760 -185489 -305071 -243860 -106406 241302 -27232 77766 36997 158229 172191 -17244
18293 -40954 71371 314289 -103715 -165900 136615 25095 -159079 -85381 -137320 -52660 -85763
18282 -85763 -190805 -114419 59579 -137330 -361084 -154916 121229 -85927 183062 24641
18271 59958 13560 -190153 -44810 105316 416191 -377111 -28947 -170468 -148253 -146275 6299
18259 -196024 -155897 -63776 192144 373230 -353332 150149 -29731 121873 -76496 -330590
18249 -330590 125172 -135724 -109491 -41519 -89605 108634 -148182 -140171 -360625 482243
18238 -105502 185201 -9174 233577 76704 171379 190392 125948 -135175 15624 345093 -147147
18226 43783 18119 -236173 -6505 167001 29876 -13009 93649 -123277 45110 -63149 -245319
18215 -245319 -200189 26954 -69745 -90827 72156 -297858 -46056 -216752 164195 37532 191279
18204 191279 114913 -123424 -89479 34771 207047 -127979 113253 19890 -96761 76433 -398586
18192 270624 -113802 335535 -198999 -90227 56412 75715 -42456 -286846 -71232 108167
18181 -27627 -188320 159956 324693 -118327 -226370 110375 -61396 76803 -55539 -306558
18171 -306558 -88925 57820 -95970 -134360 213837 114312 -146639 -94877 -56915 -103088 -194228
18160 -194228 -77197 -99934 -95905 162044 -285048 36440 -26890 -345803 -56591 400 -101669
18148 196660 192818 230964 -260128 42350 -634 76449 -91635 208620 82204 -285855 -4080 -299042
18136 -299042 -247303 -162250 150605 118832 -98716 -290365 -133219 164229 72913 -90668 154790
18124 81517 -41528 424814 82495 -9466 -209850 -160256 -180445 -313561 -39214 225056 190821
18113 190821 40755 16370 132556 -285211 -249964 -200425 -234001 -61795 -23267 -26786 -179043
18102 -179043 75483 92902 -32772 69699 120558 -63922 -29503 -237535 30814 -146311 -48213
18090 -60171 -23936 139372 -140385 -78578 17027 139616 235844 -86297 -55311 -206146 4244
18078 -165365 -24010 -89066 -244905 -132027 52055 -40481 -84593 5244 534563 -103318 69098
18066 258528 -95100 -73222 -192685 -1052 -124993 -38095 42122 -49240 51209 83457 -86231
18054 -216315 40220 -158955 145155 144035 -148323 95030 -367291 -190024 43487 -106376
18043 238086 -1734 -115677 -231786 -287269 355980 38893 194293 -26197 183357 -152118
18032 -13358 -131656 5808 -81278 -122742 -306022 -46491 147154 -15250 -103562 -64085 -247276
18021 -247276 -226207 -103380 -28644 -79348 3099 120272 139649 86549 12084 -107309 112917
18009 1251 -395565 -78817 -116114 107901 68214 94238 169556 258334 -195494 4161 -100908
17997 -30386 189510 -47821 -29819 -204308 239172 -488451 62093 -183839 123112 -159191
17986 105620 19521 -409 99634 142119 81533 -42161 66087 134354 -308229 -45907 -152019
17975 -152019 -225441 -14854 53064 339984 -365864 -184042 -104635 217912 -325583 -119815
17964 323723 -10061 295156 56469 78722 118077 -44755 84557 -102775 -488 147705 -44305
17952 -49041 -64914 256417 -88622 30402 378774 -20563 113038 -14218 -124240 341194 171786
17941 171786 -65213 -189907 -333094 -41334 308085 -313751 205761 94884 129194 -39629
17930 35849 146625 -219399 163595 -326138 -132028 132254 -53599 -160424 -95703 -48402
17920 -48402 -311548 67403 6233 -78233 -341342 25377 -277796 -89775 423734 -65479 -57893
17909 -57893 -105914 10778 -127839 -4408 -241591 109124 -36283 200242 208374 280324 -40560
17897 -6018 127615 -345731 -12147 -192726 232668 -239306 245409 -164841 -98820 -191703
17887 -191703 -405599 6018 1179 -141114 -144764 -35973 -151570 -108293 -83427 -125284 110962
17875 139719 -54482 -251203 13378 174332 -4032 -108284 -37270 155477 121977 35321 182361
17864 182361 -105194 25692 158238 147039 117446 -10111 -130101 -162120 -322256 -75145 -222776
17853 -222776 131239 96984 -3165 -244185 -275654 -48985 -47947 -399838 350375 117241 -133796
17841 143807 -194531 101968 -57855 120968 380380 18043 -105549 277042 47603 124585
17831 124585 90145 14591 86160 146991 310602 -122941 -155058 -52138 10874 -277258 229079
17819 70181 262732 -79321 312220 -12529 110048 131201 -17407 -653 24611 -467772 234097
17807 339571 175733 134641 -10898 101710 63113 -64801 38328 254321 -66062 -178018 91201
17795 26630 124535 -145442 -193205 107191 -24148 5326 28779 367136 271350 253163 114747
17783 -17252 8951 374095 -127824 330978 -154264 -277753 205411 -278296 158701 -146603
17772 26627 204152 -184441 -19718 14138 -455032 2800 -13268 119434 -165010 -86921 -30484
17760 308411 -86632 -142176 97278 -293499 -199287 -28114 256621 42331 -88394 -248072 101380
17748 276787 201130 159205 253811 46902 97236 -10524 107236 -19106 -40803 349466 -26419
17736 35252 -216034 -89989 6998 -292664 154114 -287159 -81977 81035 43498 -97028 39007
17724 -5127 38297 -100313 -21186 -31630 -256996 215093 -264557 67900 -35920 -86569 154991
17712 -279815 90959 -85125 17962 -46079 -23172 -356936 193431 55877 26325 166900 183407
17701 183407 -14772 -76355 -154959 305570 -237440 -52715 -250404 33190 171769 220372 6207
17689 -54918 -10087 67050 -205964 296895 210057 57099 -44403 112953 -304022 -140097 160312
17677 217294 56496 35684 47425 142283 -248245 5661 18550 -58793 249450 -70150 -105860
17666 -105860 177214 -1866 18410 75067 -339376 -54828 27898 -137021 6877 201799 82816
17654 63633 -112052 74860 -279173 144920 215341 -85579 241191 -43921 48847 155332 248294
17643 248294 -35012 -27674 -191799 -294826 -6723 -134221 229814 -36571 132018 17981 -108091
17631 -69176 -99255 375918 90749 -987 5913 97869 64047 88470 -46765 137721 78700 -92811
17618 171810 -253353 -170385 74500 143549 128626 -99699 -333275 38879 -215647 241378 47956
17606 18099 23874 205845 -337582 33041 -76835 41435 -8870 -311654 -72249 79562 216215
17595 216215 140154 39037 189679 179692 -111483 123991 3509 -107226 111408 221808 -18913
17583 104318 178713 -18001 -242930 -191089 267709 105161 334402 -187715 373913 5637
17572 56814 49706 -10127 49904 54283 143860 -28249 184156 179468 291781 21813 74024 -54641
17559 -128552 362163 -45633 124364 297524 -130007 -149999 67467 175154 -103524 381043
17548 350345 1049 201080 81238 -261618 -132110 275611 163076 399041 -53140 -373041
17538 -373041 -149623 275959 -100868 117036 42433 61098 -172146 -120313 81021 -174039
17527 80874 14279 54582 37730 159904 -150190 484465 119222 -89942 -181587 297639 181333
17516 181333 122451 -3402 220618 37562 301653 -79823 475187 217286 -45756 83461 227176
17505 227176 152097 -154841 214984 194254 114230 105394 385399 16109 -133015 304943 -62659
17493 -156880 1075 -84347 -255493 325529 66208 -99414 330898 202934 421277 308951
17483 308951 195907 -115988 20053 429382 382833 34618 -127285 -28787 50630 177605
17473 177605 42780 117954 172608 -67859 61689 189865 125456 -37214 -66823 96959 -92196
17461 141086 -152504 209639 373937 140933 239348 23537 195010 328886 375665 352383
17451 352383 23156 139836 325707 463649 425443 327010 392234 377756 87677 319533 64656
17439 25918 529417 89524 145028 291955 335365 29016 230432 60608 235177 380152 227712
17428 227712 68965 95310 -57637 117826 -3513 282699 267219 339226 216990 173119 241765
17417 241765 452903 39079 174220 349278 116536 364090 276676 99687 174256 30987
17406 171285 11098 140149 101183 54568 218743 296383 153351 552230 274702 -77280
17395 241983 195031 -293124 94989 -16379 190526 140366 -175778 339508 120532 -113022
17384 40896 30439 -77938 -110084 228840 237315 197161 481028 101154 -86384 115374 26170
17372 83872 178497 39801 270931 197183 -83913 331021 160558 50718 11813 167804 66003
17360 -146319 152935 27790 100196 373613 59833 27676 -11192 178553 296795 18484 51
17348 -41010 289437 321548 128243 193097 -70363 409935 358864 70120 48982 447841 124301
17336 130508 233474 141160 170911 164760 73724 328829 -177410 -188515 297742 440655 83983
17324 44053 87229 203718 201892 54632 200098 -35788 29362 128013 356054 406749 -45538
17312 41845 211877 112239 375940 60271 40539 -36362 48659 -48605 213576 450821 244624
17301 244624 351921 167208 -85549 32871 -18580 540089 144858 336480 338107 366656 176624
17289 378029 153396 181966 135666 198593 268752 388824 196888 -108854 146791 -23923
17278 111174 -132400 260017 328795 89444 141571 183574 291244 105077 50856 68117 186496
17267 186496 115004 100987 -20673 389721 58598 173622 317772 376848 254033 91481 -107620
17255 339820 -25493 254526 197603 383608 30343 145060 217900 287314 27616 33401 376818
17244 376818 189173 233793 -105495 494282 31790 504796 372366 39515 244663 96351
17233 601835 121910 359127 256922 300523 114157 272411 523740 4055 163972 348158
17223 348158 298691 414316 179691 54942 334858 314708 246853 420485 180945 110214
17213 110214 287916 94918 48981 107109 167180 53815 12378 4237 92471 126901 227955
17202 227955 468219 214422 281597 298595 150611 60788 166943 493114 210101 358884
17192 358884 199544 225556 292300 219251 539234 218603 474402 59284 160833 501629
17182 501629 487232 -112803 64766 314423 91775 248837 82899 292780 502702 306810
17172 306810 -25139 341876 415468 14637 243699 575726 128885 46159 284813 297067
17162 297067 326266 319362 353408 216371 287102 394799 51410 494310 251852 495831 713996
17151 713996 235407 454578 80536 560031 614876 222092 517115 400680 366854 -30567
17140 12404 244952 271286 149339 78773 376663 277525 540451 219898 37210 230075
17130 230075 117819 186309 361454 56576 335363 -71432 321060 577388 583585 458140
17120 458140 230582 561643 440737 272980 -65576 360592 360089 508445 477914 247787
17110 247787 276004 243982 342231 336985 367969 397178 425554 345088 372406 317835 519895
17099 519895 374892 420266 577054 186130 154477 373288 239977 634439 542119 408378
17089 408378 541091 58060 108355 416192 608042 508435 519849 446004 477035 606549 322393
17078 322393 669739 237238 651695 791762 328569 504520 406505 391854 352289 532474
17068 532474 483890 472508 585915 987017 329237 470975 756854 406801 578545 477802
17058 477802 558526 634387 461494 478712 370310 699758 571506 421213 479305 621499
17048 621499 949000 461606 633274 656007 655313 536415 443119 496168 791525 685547 329436
17036 674527 786268 440410 719499 917746 505452 686683 643756 403988 515807 455248
17026 455248 713573 782438 765726 475901 919655 793006 746560 666175 573570 656270 410226
17015 410226 600576 528989 1073083 786950 762494 696407 609973 817680 752376 859635
17005 859635 448851 584239 581287 615060 1172166 420147 775989 635928 864879 708820
16995 708820 696014 897703 765312 723839 741328 862258 726468 976162 754810 919890
16985 919890 904399 627014 392946 827723 1227584 869300 1044658 516064 827390 888490
16975 888490 949131 1219760 1217803 1127547 707079 905591 946736 1332142 759058 1097099
16965 1097099 757481 1110712 1108734 1104217 1162048 992431 967375 584633 865772 936167 1005190
16954 1005190 750873 887716 1102281 1011714 1023649 1196614 1140419 1272757 1488387 981170
16944 981170 1013193 1025886 995909 1437570 1324017 1075489 1428722 1396078 1429668 1663342
16934 1663342 1206818 1107956 1594532 1254148 1334075 1358934 1424836 1384162 1179032 1188639 1595660
16923 1595660 1204585 1134914 1220297 1462067 1423276 1616498 1505031 1346573 1778494 1537094
16913 1537094 1451537 1730657 1649888 1561718 1784890 1513230 1676598 1577166 1622409 1653987
16903 1653987 1882078 1796737 1549655 1576254 1720565 1814127 1872465 1708264 1566091 1623351
16893 1623351 1689762 1880206 2322724 2083624 2044007 2036729 2021305 1776598 2375528 2054825
16883 2054825 2438168 2094190 2029701 2323094 2369823 2159996 2428634 2405375 2252186 2353528
16873 2353528 2335912 2568734 2618555 2374350 2048526 2726820 2715813 2730061 2640020 3080599
16863 3080599 3004326 3049330 2725404 2845004 3112893 2480562 2984880 3090961 3491552 3164230
16853 3164230 2852245 3224552 3115044 3255272 3421837 3457593 3391032 3665609 3722494 3719827
16843 3719827 3866034 3929912 3822619 3874062 3975314 4089148 4274612 4230049 4101576 4314883
16833 4314883 4315824 4578323 4840337 4803072 4593619 5220209 4891449 5157691 5092301 5042899
16823 5042899 5433493 5332972 5392649 5486882 5705517 5955543 6037426 5972172 6059569 6446660
16813 6446660 6185808 6548830 6755762 6940297 6818944 6988721 7287150 7353790 7443437 7476147
16803 7476147 7739040 8095607 8224688 8452469 8200508 8645160 8800082 9489087 9477859 9733605
16793 9733605 9706212 10312788 10421291 10986573 10990202 11351511 11805539 11688117 12593839 12748226
16783 12748226 12865007 13559079 13947971 14346391 14553076 15092644 15474591 15882125 16364958
16774 16364958 17055710 17633832 18307514 18928654 19456884 20152926 20571069 21352773 22405402
16765 22405402 23036695 24048434 24628339 26125147 26587252 28020462 29115509 30525011
16757 30525011 31548975 32729200 34291512 35791855 37159831 38897309 40878312 42387629
16749 42387629 44730632 46814963 49248613 51140132 54352285 56627444 59701989 62677399
16741 62677399 66027612 69083218 73017702 76954032 81049255 85564220 90145521 94594693
16733 94594693 99489755 104520947 109994784 115052156 121005689 125976673 131810116 136669374
16725 136669374 141948846 146462195 150505550 154227445 157191717 159448891 160570513 161590431
16717 161590431 160891462 159690899 157695842 155013183 151310502 147485756 142807875 137645414
16709 137645414 132816165 127021341 121683801 116181531 110462225 104895844 99895532 94525410
16701 94525410 89468803 84883848 80692431 76218984 72427507 68794530 65225567 61637136
16693 61637136 58774022 55413855 52873104 50471624 47710914 45423502 43087564 41089210
16685 41089210 39450033 37541472 35628802 34360518 33054117 31352043 30058245 28685154
16677 28685154 27397319 26618663 25372024 24362665 23827336 22600007 21627165 21317238 20307815
16668 20307815 19444616 19157394 18312213 17352978 17019114 16305626 15791620 15372411 14961284
16659 14961284 14494988 14168227 13541034 13262981 12786052 12303555 12078307 11893209 11360507
16650 11360507 11109059 10454431 10469398 10095377 9813064 9389169 9253415 9115768 9110751 9012343
16640 9012343 8476439 8157470 8277984 7986877 7649819 7624380 7164389 7361791 7134786 6744468
16630 6744468 7116833 6331222 6476864 6418871 6021957 5955926 5741150 5728973 5686804 5634358
16620 5634358 5598712 5433998 5167362 5057853 4932405 5030613 4814631 4868540 4628062 4492678
16610 4492678 4596852 4147762 4235466 4015639 4159218 3972777 4117298 3994217 3771427 3843108
16600 3843108 3623599 3506857 3635172 3618480 3629391 3294465 3408606 3395045 3168580 2869398
16590 2869398 3359248 2827817 2741763 3066530 2587648 2946640 2868427 3017599 2662870 2668619
16580 2668619 2526655 2644230 2588538 2582870 2405854 2486315 2296149 2587944 2127262 2467488
16570 2467488 2271886 2363019 2484335 2050176 2096514 2058022 2259844 1839776 1980397 2149164
16560 2149164 1828875 1842801 1907006 2197445 1712538 1800279 1920113 1748153 1837225 1854100
16550 1854100 1652006 2129980 1865074 1810665 1800963 1542068 1712814 1435714 1421552 1773712
16540 1773712 1287128 1403825 1566188 1394394 1411817 1502064 1772763 1243113 1205837 1198594
16530 1198594 1394388 1073156 1293644 1001040 1623426 990551 1213156 1410699 1262613
16521 1262613 1237150 1082216 1045160 1082981 1026232 1485792 1153743 846621 1218698 1171297
16511 1171297 742698 921914 909933 983326 945122 1156339 1058142 846432 1294957 1130394
16501 1130394 1068502 1035979 860223 1401712 915989 849103 995289 936225 927717 962445 958975
16490 958975 950644 934381 987960 578732 1076689 867485 951034 990510 673554 1087981 702101
16479 702101 901839 720679 511562 462478 795183 761264 376287 680280 917285 606497
16469 606497 621823 829505 894528 821421 676664 768250 1071239 657190 707587 718271 650541
16458 650541 844689 618158 608169 734622 353162 605973 566045 709219 533483 688340
16448 688340 600505 426048 557767 542059 645144 529765 888956 708899 849149 692324
16438 692324 757897 446643 744914 516062 525723 290019 250414 548162 394346 494576
16428 494576 529156 557827 290424 712604 337804 357875 439920 370419 285634 326572 193620
16417 193620 376060 485708 600573 570086 378699 369910 424130 538080 424432 185611
16406 280247 413394 436565 248227 339396 466963 619547 472612 542225 405102 456138
16396 456138 502934 616379 350582 457323 494596 205988 558868 296943 318540 293192
16386 293192 782719 439458 147902 434954 410830 288052 354326 249127 355472 61932
16375 493036 563941 429662 161149 451373 304995 340540 263762 401912 310139 304830 435405
16364 435405 124047 377050 357785 467850 498899 441044 -74962 46121 342427 297410 278536
16353 278536 408377 495321 383193 288880 330922 413634 154689 319606 89318 485836
16343 485836 178713 145003 363200 642991 182943 349101 268212 383749 328868 470686
16333 470686 277765 165353 116606 144789 151410 351593 330364 -26716 273490 263426 289253
16322 289253 -51193 297929 102511 358021 447051 297396 486730 -119965 408392 297764
16312 297764 124447 223137 426344 -33761 69878 499322 -50174 303099 192153 96054
16301 186057 138012 -99592 77175 154163 407606 44403 131173 314269 249367 290884 -15747
16289 552132 -21217 153357 160133 186329 31067 385308 -58683 -58312 221483 419801 391720
16278 391720 60663 547149 150921 173168 79881 259633 35683 339511 89240 97421 220670
16267 220670 158625 288863 104384 108628 452622 264655 269880 180985 81816 -123937 -9277
16255 102936 232108 204581 -8116 -196223 220884 279721 211452 5575 294580 -87538 394571
16243 76434 -189057 98192 215140 151622 207858 320856 -233301 -22843 254068 -57287 120905
16231 180659 119480 50989 76290 -67055 298250 182832 376592 221072 -98450 176254
16220 212010 -104093 -170759 139402 60563 234512 165017 433396 -281787 46564 80660
16210 80660 -63666 88190 26510 31481 31072 152640 -205222 -162221 61290 -396792 -11950 -75067
16198 -75067 -87121 267246 367389 107526 -79258 -34072 431357 -279282 430968 99075
16187 -82307 -9747 110645 84922 -49760 -105693 195661 48023 247670 -194829 -151011 29925
16175 80726 -59956 253596 37108 -120228 -82394 -107344 -133930 -38738 282151 -59777 -14756
16163 143517 -99485 -113778 369124 -129245 151219 -90573 10799 100373 155895 96738 -228535
16151 15205 52467 315081 426043 380782 48966 83466 -173757 106807 196930 -19243 23605
16139 79317 -216386 -71564 153783 125139 106478 -13359 -217284 -170286 49149 85433 114121
16128 114121 -344026 464291 86196 -278133 97684 -274274 -221010 81815 36202 24573 57756
16117 57756 39950 -135697 -346417 -139843 52695 37767 9182 90496 96154 -161075 -3429
16105 74419 -51167 34365 163589 410774 -49313 -153714 329783 52385 13832 270198 -124002
16093 361047 62401 -79065 336598 -14873 -65632 -237815 70071 344977 45291 -250330 55643
16081 133362 -7190 -192306 304744 -156502 -318859 -143580 -85794 66078 38818 -46775 -44450
16070 -44450 269583 -90879 16400 -386051 -110018 -16282 98821 -29944 71839 509758 -209047
16058 154822 108465 -138231 -33968 -16533 -285676 260191 139538 242781 -14416 23847
16047 -191924 121515 32391 -92417 -71943 -83230 -7797 129334 -238962 -174615 135433 -105384
16035 -110710 -431646 55085 105218 -10884 -349911 226531 -42676 -10968 127317 -213387
16024 82204 -76446 -172704 35790 194412 43672 258364 106028 -14748 -180863 -77667 -87002
16013 -87002 -206756 148568 -6128 -76328 9765 144928 -168476 -137673 244446 174480 233185
16002 233185 -112792 192018 -117551 -307981 -208097 66989 77104 -105692 211199 72743
15991 192129 -43688 24659 -102323 -86086 -208349 126897 333205 314209 112594 119506 155735
15980 155735 7035 -114576 65303 45307 72559 90188 114898 -333197 46441 214440 227445
15969 227445 -19250 24902 -51213 40515 212167 -229624 -50358 -14840 -90998 -75909 269522
15957 -130331 -102937 -355300 -273651 -23767 -319787 -186326 -272844 228374 129534 81764 157949
15946 157949 -129692 -158249 -63598 -266514 -52903 -43057 -40739 -39240 152114 124617 -283133
15934 -180838 -43286 142810 170503 -9050 -249717 52590 -125565 -94201 -52498 -122235 256453
15922 194122 -130229 81475 197218 -144812 -214418 -123157 -313492 -14893 310601 41724
15911 273315 -23503 207318 63256 71552 -225655 -106063 -144054 109793 79684 -8130 49643
15899 16739 -300156 -269512 -294777 128491 221306 -124200 -357860 -25935 -317476 190160
15888 -102377 -17885 -180373 203207 -28746 -217419 210767 -399709 -89735 -140713 -294922
15878 -294922 81948 191768 -292302 173271 -196437 -133167 -255842 91597 -282762 -118663
15867 11344 -16090 -189248 -276727 -146082 -14224 -68287 -20239 190507 -144347 227848 61373
15855 168165 -216786 -59277 180911 -134631 -164551 -254889 -244938 -89184 150109 -186553 139983
15843 -184033 -105724 8362 -108245 -11452 -157334 625 182695 13726 185695 -38709 -77112
15832 -77112 -71289 -30380 -162691 -190412 117636 -375758 256920 -227889 203296 -8023 46473
15820 182433 162451 -257989 127540 -222646 -292097 -192196 272755 -231145 6215 -115370
15809 -128675 47078 87441 -123180 137510 -78482 -211178 181426 -187171 58542 -328996
15798 515702 -83923 192993 -236264 -62657 166944 501863 174089 232412 -174173 39304
15787 -149592 88830 7561 -4046 77701 305290 70879 -272245 128830 -40252 -32320 -18156
15776 -18156 -336095 125548 74837 73631 -53582 -11509 -59311 53413 99751 -65799 1312 -265183
15763 -101703 -184928 212930 324100 225228 -205130 26343 26596 420291 315234 -128540 68437
15751 -285531 122677 -11912 217449 151776 -39224 -198455 362432 -325809 337004 208332
15741 208332 -28888 350740 -163190 191326 110227 75119 188269 70559 -113896 -44349
15730 -193451 120071 -30497 -35680 -184091 -130528 -95669 -67219 -77697 -25988 -65343 25751
15718 -58801 -48310 -116761 -5621 -193742 -271835 151708 -147348 -250824 157056 82465 -360848
15706 91415 -1135 -97805 -125577 274347 -79526 -307916 -159543 -205681 117503 -96339 -96218
15695 -96218 80293 -348616 82248 308602 -167899 -225894 66012 479216 87004 -311144 334959
15683 598 49414 217213 261723 -291199 126715 19653 50820 29127 134278 -17325 103613
15671 142436 415 178666 -19985 150142 127109 -171253 70780 -34360 16073 -283513 -3503
15659 -232769 10007 -12558 -194549 66329 -50963 -49137 144605 -112811 -101312 280802 -202595
15647 -70275 -280430 145405 85369 -237907 -135174 150936 -41600 153000 52021 -27357
15636 -21041 -26625 124283 -199430 -78324 -179805 62326 -109808 -5381 131811 100088 -211013
15624 -189951 72247 -222620 -20666 51823 243951 122883 230864 256087 -367847 -111808
15613 -251540 -197940 -28759 -34941 -89639 252829 13030 -219762 -121673 125735 98327 -23611
15601 181839 -151067 5820 -35222 -364454 -310039 28378 -147888 -22641 -134722 258723 -253982
15589 -86702 72357 -106697 -117904 199596 -4802 -102037 -267721 -138566 -63448 110495 103543
15578 103543 140098 -169633 116638 165724 42118 182964 41985 102126 255800 -66330 -23753
15566 -44544 -178056 23617 149841 -157102 -228615 157054 -125096 -245888 182274 -51636
15555 256348 -5337 -40263 140303 11916 -64387 33734 77186 369565 -285810 -27039 296312
15543 -79464 8424 -22806 80556 -156921 163359 267271 -435051 74234 -75647 68075 121587
15532 121587 -14456 -248278 -47181 69344 20901 221983 227652 -17740 -139788 21834 83104
15521 83104 239216 190488 -250036 176224 -17561 132365 38018 -22273 -462050 259050
15510 181618 124616 25866 -12630 -36996 -108563 419152 -115706 31400 -205972 160060 -448337
15498 42525 10272 -12856 -178316 120146 50228 -16761 -269126 -217969 -79032 192485 86327
15486 86454 -111403 248129 -423017 69426 -19002 -92037 219137 53398 42890 -161403 203067
15474 -138799 245565 195275 204353 -189485 246094 6013 -204583 128861 279560 -32292 45483
15462 -23767 -266726 -91059 35280 -204398 118725 150428 -367303 114463 292086 179703
15452 179703 -67765 188094 59289 -15946 347628 -87622 118725 -167783 -45886 393569
15441 27427 133918 19031 -139702 3052 45123 -129544 301463 -35948 170146 -189121 120128
15429 -154245 -175654 119000 74895 -131732 -357026 -96282 -58348 -109075 145375 -210708
15418 145696 -106409 -61475 56752 127410 2053 125228 129945 73736 129386 276531 104286
15406 37071 -207605 -9965 52811 -89484 3978 228574 -74384 -31119 69638 285853 113748
15394 -156776 -131195 146048 -159159 -220515 -108002 -17846 51568 -54052 -335338 -142928
15383 -110210 -297847 383145 -109532 -165220 -188665 109946 90723 -173247 -249432 -22527
15372 141000 -388273 -28532 -269891 -93115 -63912 -202360 -58577 -43833 -72399 -143352 102829
15360 -179566 -210453 -79778 -233649 -221468 318338 -49876 385281 27312 -33339 -77637 12643
15348 -298080 37109 314662 -40726 176850 80241 -32994 173385 165166 -46025 -166063 271233
15336 203892 -24361 -70044 213369 56919 69503 -63203 -5458 194751 -135325 -143592 162137
15324 -270481 -449065 144768 64733 172677 132768 -193174 132035 2197 236860 163339
15314 163339 -21901 152980 -95711 163026 -161408 224779 -58332 -17606 283603 177654
15304 177654 -42527 86834 102799 -74216 337237 228702 -127492 -155232 -60711 -192057 -198921
15293 -198921 -23075 372315 -7922 -293580 207716 260534 -189758 316234 -284337 -111888
15282 13353 -156379 -24588 58620 -9002 266931 36912 -50713 -279831 -198750 295089 -126294
15270 6819 274506 -158705 16443 267407 252264 82155 31756 -115791 77056 47826 367483
15259 367483 82649 4114 -31765 28801 331600 114794 -171906 47617 425548 294697 1170701
15248 1170701 1289259 1172559 1218018 741899 247626 85841 -67129 -85455 -251522 231328
15237 -45764 -26881 163195 86735 -67113 -142649 -145871 -19156 92347 55814 204842 130584
15226 130584 309571 68926 56107 133516 201595 -103064 105226 97256 -290236 201900 202675
15215 202675 273733 387661 129051 326621 74585 98342 166239 -30669 15394 -52577 207608
15203 63800 125735 189640 -313588 -202787 -67969 -38060 124280 88609 131233 331788 46700
15191 -37364 140304 137353 79113 78100 -218848 222534 48433 163778 -206286 389589 210805
15180 210805 66713 -212429 -286020 89578 81909 -18849 -30763 164865 -25200 -171186 -40829
15168 183068 230878 -16912 -8381 4041 -61638 229828 -14409 247769 152961 134333 -80050
15156 137476 -96848 232185 198995 -11957 -42556 98832 48310 -37478 252010 95835 79528
15145 79528 55700 153199 55698 73998 188744 187969 155998 -30710 130958 7603 253226 275164
15133 275164 234284 151932 104878 -15665 -4004 123957 194241 256032 400635 -44913 251531
15121 382644 151704 181925 435527 2104 -182428 15537 18213 -21730 412818 341770 86210
15109 -79484 312876 -156492 77542 232964 -93820 -43242 101906 173826 243270 463081 171656
15097 229133 273613 36771 258437 196188 248152 91107 -395094 45005 190601 3744 -208501
15085 210770 239405 3441 93311 -40254 111242 -11781 -79942 78627 104792 -168253 -80410
15073 446598 -285783 -70491 -45010 113088 301932 -18798 -9875 39040 -9087 -197771 -53143
15061 168378 -196709 -86897 223046 379959 288834 165178 253747 60838 295227 126963
15050 163668 -501 -53448 244279 -15814 -81263 172671 53251 374718 249036 -165854 181440
15038 267194 230366 -104330 66914 149037 181518 419283 46599 114199 138127 551572 89970
15026 44069 9215 103698 324727 473835 126796 -158597 224787 810 202614 201947 479231
15015 479231 188017 122574 59391 316511 66483 460392 346569 63013 60225 194199 16758
15003 146394 140610 197303 187063 116645 374144 68197 -5064 388664 -37867 188469 3638
14991 270530 30237 375155 318001 411676 302499 433974 213315 30340 240904 168098
14981 168098 168141 479719 262495 -53515 638859 234399 350812 317460 150133 209251 410251
14970 410251 -89737 476835 132988 497280 163056 262194 160761 169780 -13744 301413
14959 317729 42518 148993 306951 40946 455614 487063 -45101 28906 371676 330619 360209
14948 360209 230711 170492 47992 339099 169119 346827 91128 171824 69405 687878
14938 687878 158352 325305 257115 309127 607814 310007 316406 220282 191051 93173 214356
14927 214356 272232 394690 454376 54971 180793 315188 34223 407164 343887 461091
14917 461091 -62464 266232 162704 196380 351568 240689 56772 454427 535858 90710
14906 124217 408666 352734 91965 264777 1900 204264 17029 293978 257904 694915 211530
14894 511181 317463 159800 553422 323559 465045 219402 363847 396343 277811 576633
14884 576633 2751 192560 451647 217147 319656 397036 174072 433194 505170 417744
14874 417744 255367 390434 572277 484805 233983 279174 425284 759214 516302 436530
14864 436530 272609 -104313 24578 313235 756201 524572 266342 79153 642594 322537
14854 322537 336945 635933 307111 485220 524300 202908 436315 466505 296340 465781
14844 465781 306744 463883 343633 635163 460193 34905 199473 414962 202992 797081
14834 797081 310869 484705 240184 498093 273953 499764 522662 132132 244572 564502
14824 564502 650376 288239 418023 180127 278329 287858 540294 549004 563205 191182 554362
14813 554362 619656 596292 297220 279291 433009 551497 488589 369936 471634 620729
14803 620729 573553 653433 842719 378319 188233 551275 346152 696564 389741 853325
14793 853325 380694 710538 332643 526957 597788 521370 518035 398872 835263 453510
14783 453510 603342 597928 96555 357262 384224 546029 474361 824600 581933 487106 660155
14772 660155 444871 480070 645479 275306 779340 120215 466803 160243 959168 670406
14762 670406 446563 642875 728992 599607 1000393 636414 402762 680147 622179 491854
14752 491854 546361 506680 776024 532096 345998 409173 997729 964526 735115 688297
14742 688297 481636 632537 573951 753447 982553 433628 795821 666499 783995 441208
14732 441208 656140 989765 761486 537012 512484 652746 611552 425707 820967 454661
14722 454661 698275 565955 770040 628892 831163 626243 350022 694852 613353 766297
14712 766297 520163 490691 1047754 820787 435606 523194 565824 952395 723178 1110400
14702 1110400 495795 532444 562651 518178 883082 629517 772048 767914 966847 790326
14692 790326 783523 967002 935110 1045420 1077206 774483 938864 829917 811239 726907 931778
14681 931778 826894 822143 1255341 805172 886351 812435 727049 900147 1060414 923138
14671 923138 882780 991755 802187 845749 1079280 1140068 1077626 1251475 970470 898813
14661 898813 685025 866597 1057676 1004587 1030211 821137 1315819 1029006 1474284 1251523
14651 1251523 1076830 1279855 1208371 1062257 887054 1101820 1081570 1184516 1218782 1300865
14641 1300865 908702 1415669 1391384 1296489 999051 1200156 1353722 1392624 1143343 1212287
14631 1212287 1371969 1399662 1157558 1398320 1308339 1238101 1456122 1100432 1546153 1262147
14621 1262147 1329625 1430345 1464133 1416935 1641306 1593907 1518653 1506672 1562854 1377904 1493082
14610 1493082 1452939 1284831 1358570 1634459 1230774 1435480 1649043 1451319 1473063 1514748
14600 1514748 1749747 1440740 1919883 1604324 1844266 1612719 1677389 1460430 1787594 1664852
14590 1664852 1532230 1715461 1461871 1509907 1710186 1585526 1864898 1897966 2093838 1987626
14580 1987626 2077163 1866248 1991487 2048785 1812035 1916333 2291974 1848070 1980005 2358641
14570 2358641 2181250 2018856 2168358 2211441 2293624 2438514 2276536 2377908 2231095 2643101
14560 2643101 2581205 2559267 2780841 2644099 3017743 2823170 3088658 3396954 3587440 4219047
14550 4219047 5215556 6632986 9558053 16997744 34028853 45015194 21381314 9380622
14541 5014935 3187449 2425080 1769940 2351173 1932344 1870376 2011743 2066556 2059790 1869197
14531 1869197 1968778 1891873 1863790 2189076 2329590 2348237 2667595 2505566 2149765 2302331
14521 2302331 2249330 2488959 2333345 2294397 2391407 2387796 2389475 2231758 2546703 2193441 2793820
14510 2793820 3101301 2614852 2929231 2615291 3002823 2708012 2626868 3039968 2949671 2746076
14500 2746076 2792341 2833522 3051847 2845791 3131279 3210550 3038535 3308858 3395919 3469438
14490 3469438 3179620 3207400 3600367 3261538 3552478 3600536 3450681 3704124 3599606 3807574
14480 3807574 3868973 3559579 3741822 3716059 4151381 4006747 3990499 3781586 4140472 3880094
14470 3880094 4184748 4090704 4334454 4385624 4343378 4075042 4515943 4526207 4516214 4431197 4427554
14459 4427554 4766468 4664745 4741935 4795634 5010935 4628095 4805466 4894785 5262018 5107209
14449 5107209 5471211 5216947 5349425 5496345 5469403 5461990 5427999 5817180 5606620 5927481
14439 5927481 5698929 5882304 5862411 5835009 6426911 6217003 6268471 6462501 6653851 6622399
14429 6622399 6727784 6550286 6859323 6779029 6988460 7275070 7271783 7358724 7115964 7428514
14419 7428514 7743565 7915830 7658814 7753171 8003296 7939492 8172894 7922896 8525046 8376615
14409 8376615 8749684 8832839 9015851 9459102 9156449 9430831 9845741 9598207 9949335 9946889
14399 9946889 9920862 10441589 10573908 10725652 11031892 10910243 11145469 11430956 11669294 11885188
14389 11885188 12056915 12399393 12497011 12810828 13217273 13239747 13448494 13420360 13785807 14142437
14379 14142437 14320071 14539284 14784844 15191961 15643899 15402481 15801975 16184260 16701671
14370 16701671 17131289 17294388 17690067 18203116 18259384 18681547 19220375 19313223 19785831 20407996
14360 20407996 21138451 21259976 21850816 22154949 22414555 22962780 23550017 24340461 24803243
14351 24803243 24966601 25828040 26695276 27146847 27938839 28598071 29286208 29935334 30925873
14342 30925873 32014583 32874970 33377740 34313092 35563166 36363494 37575894 38215206 39132163
14333 39132163 40643703 41995073 43156745 44205171 45657599 47004208 48567314 50002819
14325 50002819 51553680 53607599 55357492 57064151 59409206 61070927 63256524 65435056
14317 65435056 67790798 70158960 72830434 75459498 78367989 81689731 85010434 88016024
14309 88016024 91600973 95173399 99261654 103374633 107785640 112675209 117397891 122466382
14301 122466382 127949443 134077688 140390802 146507635 153327414 160513046 168263143 176647740
14293 176647740 184865750 193788034 203045849 212745229 223153140 234213314 245274477
14286 245274477 256785303 268848815 281272785 293651041 306286694 319447356 332265959
14279 332265959 344998530 357384314 368966425 380240815 390366471 398951067 405296832
14272 405296832 408980076 410263771 411182676 411085198 408713463 405774950 401428367 396197794
14264 396197794 389555021 381598177 371528358 360295362 348032502 334906755 321917178
14257 321917178 308015821 294693217 282267345 269330024 257018325 244718247 233456212
14250 233456212 221997708 211304121 200993355 191548669 182298829 173767982 166180008
14243 166180008 158529536 150990754 143996577 137597485 131231622 125573279 120769324 115004279
14235 115004279 109971984 105261684 101087923 97090330 93618355 89899588 86169877 82840738
14227 82840738 79259536 76656191 74005368 71032543 68437044 66189530 63801693 61713289
14219 61713289 59625673 57732939 55572865 53973297 52085154 50805350 49338877 47845989
14211 47845989 46371582 44666715 43483244 42044470 41369985 40283209 39161775 37903609
14203 37903609 36602811 35912368 35120519 34125251 33446061 32214068 31340133 30597942 29596614
14194 29596614 29360655 28909996 27872583 26963257 26482396 25721898 25203953 24278165 23943860
14185 23943860 23420888 23027857 22003698 21775451 21360256 20952732 20664967 20023609 19709769
14176 19709769 19482809 18854842 18670272 17989689 17760881 17255331 16879553 16674099 16372019
14167 16372019 16148737 15598737 15340577 15446376 14768800 14798243 14384298 13960020 14160934
14158 14160934 13694835 13492418 13319317 12863269 12786787 12352281 12463426 12444703 12141899 11971243
14148 11971243 11815209 11713539 11059992 11212320 11056764 10526864 10508424 10342700 10117103
14139 10117103 10114666 9873560 9759481 9913692 9631165 9487577 9337561 8735765 9018843 8807858
14129 8807858 8828172 8581154 8655273 8509642 8040854 8283214 8244857 8116667 7844515 7616193
14119 7616193 7297686 7428693 7725677 7509327 7253026 7180070 7254189 7272582 6818301 6722457
14109 6722457 6507434 6753526 6649494 6414056 6496737 6070291 5974779 6369619 6179413 5992305
14099 5992305 6098977 5902843 5783394 5808523 5614143 5808492 5847124 5753277 5661608 5249268
14089 5249268 5423082 5643758 5025651 5355445 4831762 5242003 4954170 4959100 4874120 4864012
14079 4864012 4781795 4780381 4901419 4837158 4662359 4181994 4683093 4257595 3995718 4388960
14069 4388960 4444291 4207378 4271868 4205449 4265770 4102933 3814817 4097676 3954951 4015839
14059 4015839 3979615 3730349 3816110 4168188 3814676 3642610 3616457 3825880 3334353 3258687
14049 3258687 3473984 3313805 3471259 3281602 3620576 3196894 3569892 2957287 3268524
14040 3268524 3350745 2813654 3219222 3144666 3000078 3013191 3168327 3477140 3049108 3127634
14030 3127634 3216170 3106798 3117303 2741996 2859392 2749222 2926825 2815931 2791777 2567651
14020 2567651 2462788 2643748 2435925 2248597 2317979 2402868 2779576 2511031 2584609 2896825
14010 2896825 2377932 2350182 2567151 2645665 2114732 2089058 2047433 2121494 1913541 2267132
14000 2267132 2053099 1954771 2147372 2040381 1906569 2211942 2078468 2005619 2064465 2057933
13990 2057933 2301722 3493048 4928508 10429480 25346844 45088296 26854757 14450660
13982 14450660 8747806 6374547 5125609 4237814 3925501 3170558 2924610 3154139 2823192
13973 2823192 2845413 2786255 2682618 2510493 2573519 2339626 2089995 2206828 2265024 2357633
13963 2357633 2297330 2429360 1830424 2150492 2121166 2163606 2101018 1967814 2159532 1596287
13953 1596287 1921656 1773336 2114901 1623941 1938791 2070463 2082230 1751361 2062301 1593646
13943 1593646 1795911 1773152 1710252 2331801 1376022 1671678 1854480 1541576 1663560 1578646
13933 1578646 1806495 1722798 1721972 1593706 1522537 1505378 1264634 1563909 1675546 1628461 1718881
13922 1718881 1549012 1370273 1130186 1272785 1711348 1672568 1573149 1460973 1289138 1449767
13912 1449767 1382286 1246948 1417954 1406102 1263442 1607811 1449568 1441797 1780915 1324353
13902 1324353 1301623 1234276 1479187 1199341 1356048 1230554 1333177 1319209 1467763 1535216
13892 1535216 1172089 1418804 1259213 900612 1248805 1664069 1433068 1328313 1403753 1090810
13882 1090810 1216569 1173242 1106897 872439 1025726 1177158 1315768 863426 928774 1388963
13872 1388963 1075650 1001449 1204859 991865 1327347 1193999 1191011 1016312 876383 1015893
13862 1015893 1266167 1006050 885470 1136858 1206141 975642 1190794 1211450 1146639 912848
13852 912848 867220 1084229 744348 1046683 815449 1180560 1185846 898218 958528 1010996
13842 1010996 1010391 698663 1093545 851122 818130 982363 1137800 602662 1153253 855986
13832 855986 1061271 801583 967933 645593 775134 977722 916908 842122 872120 587342
13822 587342 980489 856244 699548 435723 389315 791816 523931 558759 905790 761964
13812 761964 970092 1055399 1010581 735027 642974 1242325 729784 793976 797631 903966 718511
13801 718511 609854 544740 771484 980497 668686 609297 679326 759746 1010076 1042125
13791 1042125 495244 846200 759395 680445 428578 628727 718621 571524 836293 743840
13781 743840 458409 661425 767040 657164 781306 502191 885511 915187 618861 946137
13771 946137 964376 870756 768518 513661 498692 770925 794943 767134 668792 733553 740377
13760 740377 612725 778999 848641 676699 799296 348423 675552 799199 501700 647533
13750 647533 652194 659556 434015 308765 549022 974984 795893 456969 777459 741593
13740 741593 400966 806257 350460 638890 471938 636995 743699 935026 541775 737035
13730 737035 725518 302590 901123 464667 466984 318948 778299 762830 292656 554147
13720 554147 577639 435451 509663 629745 647963 397643 723142 513357 311472 1078741
13710 1078741 663077 244850 590170 465923 663049 706226 729137 464880 566387 578634
13700 578634 473262 444375 683996 286337 638814 558907 234022 649425 443634 617546
13690 617546 424824 444886 590571 360124 547469 392638 534565 796913 450172 540909
13680 540909 711198 851019 522431 415413 628813 220578 561309 476465 542954 583999
13670 583999 731225 508700 605992 417610 577855 308973 560333 265720 594328 430994
13660 430994 500606 476780 340941 505919 570888 301183 580539 425143 63448 345188
13650 345188 311391 155327 341277 590059 493775 393654 349791 564497 244539 343914
13640 343914 670275 508403 431065 64588 430758 100440 797579 524467 381474 379538
13630 379538 117189 220827 463476 341766 515721 383950 314529 616828 507515 686566
13620 686566 446511 420036 395440 499960 234910 331928 280171 374078 -13608 231024 342878
13609 342878 371190 189332 277184 250445 436531 199576 350126 640419 426082 478073
13599 478073 701501 -26145 425348 573933 462366 47084 286142 355267 457152 454675
13589 454675 519154 311930 468022 89313 296785 358877 168920 3374 235345 348692
13579 348692 474882 510793 363198 364058 192299 249442 216723 229615 600360 282745 124509
13567 329208 89964 370092 264237 275522 251828 323173 350021 366828 378636 133659 373819
13556 373819 386203 177368 389429 306051 327344 314222 120019 107136 -64738 277337 126197
13544 213745 497714 436315 471905 274524 508156 383871 98662 206405 473615 320154
13534 320154 225823 427998 537789 287714 34719 289177 172727 279147 505118 319236
13524 319236 230189 162758 295955 191434 335729 317844 323960 584013 316199 251108 278060
13513 278060 378408 211760 209712 405535 82850 518293 194303 369313 343766 60727
13502 398191 163324 362843 177086 69404 304196 334903 307228 490153 295770 176075
13492 176075 146044 118488 -6550 505451 208436 251676 -6029 288072 157643 207921 232136
13481 232136 -95862 94963 480307 431152 157884 216896 37757 438058 296053 -67650 14746
13469 388728 66588 -49670 259784 105699 94491 -61004 461842 158466 178616 400602
13459 400602 321671 119640 157734 158012 109588 -11269 238963 192115 192600 491987 301381
13448 301381 243526 384682 372730 287404 347621 299986 190758 137352 238636 441524 197958
13436 277752 128704 123433 132188 73429 75235 503522 154188 547596 450073 376732 160768
13424 420768 192416 -88496 217709 208256 127388 288152 35864 259277 374781 79916 -70871
13412 207984 321766 267031 -100052 438511 254913 55164 386352 31976 373449 18317
13401 332921 155158 110062 46975 9709 98351 155290 452679 313382 133748 11608 176639
13390 176639 184553 -1514 55613 123418 472543 271978 344412 203604 302963 227632 285117
13379 285117 156505 -51512 33574 114961 281733 114384 308791 75053 -15846 430321
13368 279278 93616 339706 160143 301696 223414 462145 295417 130744 103616 184933
13358 184933 314324 264441 114572 161198 430935 514062 318050 403535 219109 277280
13348 277280 264571 238285 280556 73575 280564 225962 443695 90163 457525 174927 68525
13336 309850 369218 372253 207474 -129468 141349 118103 285310 333541 177466 206702 -71737
13324 156846 124538 331886 225366 -77902 180831 428151 125918 86954 472113 410650
13314 410650 277565 202287 489472 91065 -57482 288892 -15752 260646 101865 63595
13304 63595 377394 518608 171524 382538 106433 251753 28646 416136 99642 84226
13294 84226 107645 -82029 199915 245750 225304 273072 267884 -314955 92425 95 -70504 71279
13281 160532 -241019 177974 92050 165183 119809 52464 -4465 113297 270202 37741 136658
13270 136658 80627 -11167 134042 -137254 409106 94816 180182 8808 293008 275376 -167048
13258 264323 205413 -17164 25934 110998 82426 59400 -39571 86796 -42149 238778 243569
13247 243569 345694 245819 250463 -126197 220841 178876 102615 110107 102016 70660 75920 50574
13235 50574 -248631 -110184 -31210 207259 542225 277587 205899 96559 253652 98536
13224 200568 -1353 300650 181172 132424 172508 369695 248325 402376 443024 -32824 -4289
13212 -289416 41867 -147210 346527 48795 54472 -53471 276051 -369934 262781 156714
13202 156714 135848 -144707 305227 123446 226939 -5174 122396 -54231 84296 47346 65562
13191 65562 -96833 345862 54513 -139893 187998 143840 159153 459856 28021 -109366 82045
13179 148481 243347 -73047 178693 -143756 221422 169306 41388 201064 61431 -77142 49629
13167 118001 -7245 -143293 208293 186153 51875 -88777 187579 149057 69269 -160784 117003
13155 29560 -240216 -283766 156509 155772 246553 15278 280587 -27956 426187 -112633 223739
13143 11410 5897 212037 -171333 284050 -73644 -168902 99219 141503 267536 74943 65353
13132 65353 40582 460789 307098 162671 232505 -143626 37084 407 33694 240660 193487
13121 193487 -57053 49359 42178 -188261 60613 67073 40702 143439 317025 557946 136675
13109 196637 87929 425832 -84046 -40721 6197 -198284 -27537 -60727 188425 -162424 135121
13097 -84876 -12280 -123045 148348 220414 -211262 183384 275608 11089 230631 -176143
13086 88332 160554 -109926 105446 198747 -217400 -108349 -112719 81273 -71197 -6753 158627
13074 -315308 258168 315206 -49414 -173398 515623 -109848 94427 -71802 -170606 216140
13063 26705 155711 255789 -39647 -18603 116976 2610 146777 89190 102429 173421 305564
13052 305564 278382 296709 98811 212298 35373 -149044 354525 322634 402895 93985 35697
13040 274936 -6137 -222443 -67113 199377 253767 -329455 205059 -243620 322305 154027
13029 14858 240425 378353 193453 -193648 147360 -87963 99744 103273 -198167 -21402 12437
13017 20579 468411 -198401 259088 -6684 80799 29734 -129246 -67866 73955 284894 185636
13006 185636 89042 266624 189808 227467 -47399 84904 125553 130402 -6412 290564 41612
12994 -126960 -282692 118700 425110 10166 320423 282001 343008 359469 -77758 -65133 116699
12982 -266321 22820 -246825 177574 415396 -86656 240675 103869 178636 81347 334729
12972 334729 6727 -8449 70659 81631 150023 126767 75648 366482 -137112 22340 -21942
12960 95026 -19038 396829 163826 -237821 42241 89929 59204 -16027 666503 -50556 -35420
12949 -35420 257644 156921 -56077 -280120 138151 200690 150074 61021 -59137 102483 -66457
12937 230376 189178 -41074 -102869 167726 129332 467919 -120758 -187062 -66828 -153611 -138340
12926 -138340 94309 -211990 -130026 -110144 -131452 -63212 59434 -113219 -150322 227055 308542
12915 308542 198859 206862 -8734 67800 28476 135186 -193711 262005 -30773 -142973 -231888
12904 -231888 22455 -178430 -59821 106394 115668 423872 97603 98126 -369695 -147796 146488
12892 50840 -7857 -219321 92985 116146 257798 -69746 -125971 129779 -137591 137402 24020
12880 30984 -87793 201180 131386 -153673 -215514 -37223 15170 -73845 -34972 20322 -20406
12868 141574 91026 -254411 -128463 5066 109428 -105388 56685 -6664 -17108 -7964 11073
12856 -218666 -69005 -348113 -68698 -51200 -94213 60257 -80587 237343 18278 -82787 172934
12844 113223 -66776 67519 159276 12461 -112291 -255715 25014 -78074 116517 266513 97788
12832 -236821 -131688 -216220 184628 -288154 50565 -9831 -38251 444069 -264160 -173990 -198987
12821 -198987 3287 215269 -223908 -76390 118698 -192440 -55450 243096 -58355 -71099 -24530
12809 102697 143546 128857 180196 -55659 -14445 71493 -196865 273633 567391 -121079 175951
12797 173732 118236 371100 -136719 137225 16693 -56469 114332 77205 -102522 69337
12786 -184336 62147 201200 -61183 -221944 -63482 100349 -173342 -9364 -90903 41629 -17400
12774 24835 -222667 -172231 77293 278684 378612 -76185 227912 -69830 -51368 417678 383688
12763 383688 86734 -181825 -46210 322481 23266 -24989 412443 256405 -126263 -242538
12753 -242538 -275675 297618 -182689 33309 -15830 139303 34830 -76109 -32855 -59069 326871
12741 319171 -66476 -193381 -174438 146392 150155 191860 187173 -61198 95235 231556 353212
12730 353212 157677 318113 -87791 92713 179291 189213 -251616 46727 -139795 138898 -165207
12718 -153812 188030 112624 215866 -154740 41200 -144927 122382 214795 397369 49422
12707 -41879 35886 49382 467708 561425 54735 193655 215634 94086 135534 15731 -20904
12695 -130975 222429 193915 -36175 -17416 117983 12066 16316 194054 -148591 201199 3442
12683 -102957 188820 -342509 -79198 171936 -36618 243086 462559 386726 296677 -99516
12672 135729 123191 29891 3319 53511 114108 -100686 132291 -75400 152064 421056 541517
12661 541517 -38189 -3418 126179 185936 381965 -215674 60070 443729 -66270 -112895 104636
12649 198131 -156777 -17926 191901 6715 -165792 173337 -381005 -127636 48414 40170 9068
12637 -90692 162544 -179621 167268 -90751 150037 -39818 216583 341140 291927 137045
12626 271061 -99045 18534 -115538 347459 333177 79216 -93068 390670 39055 -52723 -104384
12615 -104384 -211820 88622 -58672 74409 51488 101129 79867 58389 -107599 3482 322179
12604 322179 143521 -182353 211138 289423 -288081 159221 -145395 143401 152183 173479
12594 173479 45040 -110002 -149121 161792 50684 -362829 -19995 -108763 -95238 -41430 -162633
12583 -162633 36482 79748 -27072 233989 230613 95586 431427 46476 12772 -123123 98247
12571 220288 -55466 -11396 262110 -89001 -144994 443506 29293 23896 308268 -14239 -5539
12559 28773 57169 -184106 124526 -397193 -70966 -502870 179936 37517 261425 -122871
12548 -20010 -287542 612463 -74429 234746 40877 -140776 -61854 -57101 -171312 997 -2921
12536 -250954 6746 -270410 207038 43245 20554 -53833 385973 280863 241550 236130 127970
12525 127970 -89521 142462 8428 -327677 227484 26466 3768 74556 46891 -356862 -55262
12513 -166403 271830 -7986 123889 136401 246150 -214028 -50502 -171117 -148699 79089 200598
12502 200598 54559 -124752 -198637 200963 125189 -109495 7580 161626 364445 -78908 166585
12490 76430 -62765 307670 -303027 -96713 -55092 -10831 134050 196379 -36125 157292 20239
12478 -181595 -34355 -158162 -140028 159974 -30269 67296 -122187 32334 317611 188930
12468 188930 68886 185939 -4585 -160112 -154478 87103 -204791 -17110 101163 -120922 23050
12456 191470 -51972 -4594 71648 -175477 40409 -293097 -107946 -5913 119722 250705 -108324
12444 84388 120866 -113438 222408 107933 122304 -41234 -159200 -107895 -254011 39484 85597
12433 85597 62014 315770 258400 65450 -95100 -229959 -64099 -82940 -19538 14259 -83553
12421 104786 210477 117559 -122595 -159276 311010 195527 -145416 -63629 7417 59617 -291470
12409 -4930 38300 282526 174389 244779 -439176 -181523 228514 170616 -3157 384495 -200537
12397 46519 -257203 75695 -256942 -59622 -242246 -48244 -213239 -106704 -44138 53401 -219468
12385 -226556 42680 100240 -283105 -11031 -47464 219509 -1861 60224 -459471 283648 478715
12374 478715 59617 -231449 50861 -311442 -204789 166660 228114 4652 -202815 86411 118922
12363 118922 -228687 -153234 -514704 -179019 -21844 -123653 -236817 -186740 -86972 -98994
12353 -98994 268831 -190948 -124738 63463 89699 271176 327097 -136288 203361 130853 -39249
12341 -160180 39010 408148 92787 -337609 -14801 34235 -145327 -84434 114432 -26122 180493
12329 252759 -189120 -17553 131785 -246461 35273 -4372 289614 148815 284469 -219032
12318 100221 -179815 152226 40821 101251 401897 -35540 -147974 -18298 -23340 -79285 220668
12306 -98950 -702 59588 19091 87748 -23491 -45943 -14705 240247 248027 390217 -42307 84955
12293 76477 -196275 -121120 -314559 38867 143257 260405 -185288 11583 -254274 114963
12282 298107 186710 24885 154117 383612 348881 77450 -170230 309839 205399 93567
12271 68048 16698 41950 -203752 976 121833 -133192 240231 252109 -88158 357948 120193
12259 2923 -40458 -210856 514 241539 218942 157027 201594 99119 83322 208804 -216822
12247 153640 -173781 -40473 302192 -89830 21799 -35004 49352 -53401 -482 79559 -199689
12235 -35658 83838 242897 47798 -10902 240336 -35117 181207 369264 460872 365127 158959
12223 131309 -29469 104185 186569 9477 446077 155297 202426 303952 278435 -4054 -291894
12212 -291894 -23070 -127920 112258 -128888 177709 260854 40223 286773 135159 140842
12202 140842 37198 59325 132924 -7453 235079 310193 67406 474055 179701 -116260 3910
12190 127239 351037 57069 -62613 120534 -105266 105081 17160 349103 435918 200654
12179 464391 32030 80828 209010 65315 126512 -92749 89582 -341933 -132932 -120051 280667
12167 338107 40751 -94442 258355 229839 103449 227472 194012 -167972 400506 -70679
12156 166900 -67836 229856 216663 171123 -152497 -34158 -128456 62197 -65657 -121559 15823
12144 -111031 152196 196489 -85250 436453 214661 -77632 -35234 -145275 90146 68652 -59901
12132 302781 -198183 -159235 -35284 -115840 -60519 185644 -14276 25841 200231 -129026 84559
12120 159240 62506 -204814 -202869 187827 246587 68359 -188760 343603 -76117 312319 -106677
12108 15791 -141501 -228781 250966 -17381 -7203 107139 -34796 -159691 105330 -56554 -262275
12097 -262275 24142 -170068 -114737 -117243 68033 -26851 -24996 -134917 -48429 -103229 -159795
12086 -159795 434589 842 231031 -93712 -170777 -83857 169464 -218574 345383 641938 2182357
12075 2182357 1226831 444668 29552 205128 -310824 410563 264877 -3216 32896 24210
12065 24210 -90138 423263 172673 22274 -151142 243158 337131 -168608 -17547 72675 -86995
12053 53854 143888 -296035 -96593 163644 180346 -19508 -186122 69931 -166823 261389 109805
12041 127693 53623 -126786 174901 -385440 138727 -141792 29934 129642 -113201 85378
12030 -310262 155609 -3023 -159055 -117841 -38262 26602 39937 29432 26456 86722 5176 323285
12018 323285 46544 133732 151527 -70253 -106245 316937 9459 130602 338168 76543 81699
12007 81699 -32157 -83728 10691 115681 -81923 25775 369598 -27887 -168105 126336 -86036
11995 -59043 -391690 153566 -382601 -35046 55747 -152620 -205319 -94902 15200 -116501 142645
11983 -23858 -49393 -349834 -177196 6448 -81699 87493 -106696 247452 -69199 -248518 73944
11971 94055 -353986 -125322 -15984 147265 -17501 355525 230137 -298009 -236062 -303552
11961 -303552 -141950 101063 -171432 -156341 60030 -105506 -74585 -536887 -204505 111111
11950 40902 -71364 -69749 -25539 168057 12838 207128 20110 410503 -308159 298555 265955
11939 265955 286849 -238060 30261 -108469 -17986 -190639 103428 -10093 -19555 -222827 -473426
11928 -473426 271003 -81375 175693 98576 -77190 -267443 94211 -122768 174264 94127
11918 94127 -174563 245349 -362433 -343714 -108124 172306 74458 -26894 121308 -308573
11907 195115 188773 -8679 161401 -283409 -194442 113213 -212549 71492 41280 -60194 102319
11895 -126874 76781 -164759 118711 -77647 -163378 137631 200317 -109077 -120946 113922
11884 -28341 142218 -109962 -162898 -342884 346100 98331 -236246 186564 39301 -257520
11873 -224283 -236860 -130397 29412 71571 -22921 73021 -121848 -59243 58180 -95942 48299
11861 -391119 237754 -130126 -248123 -110754 9306 -316129 52762 -65775 16203 67647 -328070
11849 18315 -3827 5540 47339 18985 2010 -273171 -291213 -272985 315057 -25627 -280101 -142930
11837 -142930 -132631 -18746 -173858 53672 -162901 137136 -261230 -107154 -135335 -49647
11826 -181556 -50437 500 210405 308347 202165 -32775 282503 -264521 -78890 66927 -85943
11814 140686 -209435 24363 162595 58459 -10510 30385 -140412 79435 28245 -79401 -9174
11802 211313 -215347 -165284 -81573 59097 253047 142953 -243521 -237653 43360 32139 -203374
11790 -319130 128857 64876 119840 -12596 -105902 57743 -2334 68933 13553 -118481 64338
11778 31579 -13353 18055 376823 58692 242140 25571 -62994 13429 -292185 20889 -76926
11766 -18101 -135925 -51609 9020 116518 63347 166626 220492 -5545 -132254 -101049 284184
11754 -86075 -259610 124588 122520 -375475 121371 -184872 -99234 89642 63273 -184734 173555
11742 34210 -181384 155185 103613 159185 123713 -76149 67450 -76030 -48724 -190602 -262934
11731 -262934 76201 89065 418226 150308 -121623 -54475 -151586 59553 33685 -144426 41795
11719 -198918 101036 334882 -113577 218795 111614 -138746 120974 52514 -36489 -217782
11709 -217782 210065 24408 -276248 -7290 -254995 -1713 92131 -84004 -204217 344449 -28046
11697 -131586 -111332 -206023 98920 186761 38956 31737 -2084 -143927 241152 -31179 -208357
11686 -208357 -262906 -88555 223684 29335 -92556 20713 -45466 55705 118098 -137313 -52202
11674 173492 197882 296990 -184201 221572 455221 -189192 -223300 206284 -244459 246881
11663 -276682 -34439 149256 40359 32323 135055 -62557 -106202 218877 150378 -16266 165987
11651 126291 -43393 -176370 229959 8431 -91617 153633 -155178 -115011 -178032 -38089 2822
11639 -57740 4289 271752 -234984 -176749 -47394 -94060 -14740 -128550 -168402 -23284 309113
11627 93040 -188913 124280 -161362 -141682 -78630 243398 219798 50517 -181728 15687 -92991
11615 16434 -130794 -77059 208660 -475945 -161011 528869 -374791 239752 265798 -71785
11604 75475 -144454 46426 193780 -60499 60058 182861 80356 144422 131579 49648 178395
11593 178395 -268569 -18787 101550 38922 -42934 109681 200328 142001 483878 167795
11582 74525 -85426 141775 318026 156458 -207774 260223 -104487 -53265 -45470 -83834 -36215
11570 -57314 20664 75031 101116 192006 116985 -80156 -87278 183717 333828 -79454 -510361
11559 -510361 -25215 -137732 -65282 189777 19573 234414 -211631 -26846 -81725 80945 162731
11548 162731 -58464 281275 60109 75896 144054 116564 225682 253981 -94561 376479 86175
11536 264608 310626 72200 -60314 489345 -137435 36393 217579 212880 68431 211568 -143973
11524 380643 23776 160495 -106595 -172120 168017 42050 -188518 86663 134406 71905 71806
11513 71806 18619 31511 59636 35604 83908 243248 89446 116629 84900 73662 -25072
11501 -27228 -78444 12004 -268418 108013 -32609 -72854 -39803 -5061 145699 -181940 181170
11489 -254140 379249 402665 -345749 251751 150418 58729 194494 163791 13980 28757
11479 28757 -81838 236117 317946 302377 151167 120109 184526 121836 -25580 -20191 -73172
11468 -73172 338884 -1008 299274 322490 31173 -149829 -15040 -38308 189874 240226 260336
11457 260336 180329 -62338 -36227 -140564 212573 32372 118501 95189 -83684 198511 -72628
11445 -5693 365750 205939 -177956 -123098 85003 -122152 154977 -240716 -9737 -127657 -44298
11433 119569 -145963 -282070 161239 27462 45338 242001 309126 -52364 -87253 24635 -91436
11421 -84691 53298 166012 48561 -50867 -60253 -172512 -72432 224101 238619 77249 -148284
11409 -134792 -340159 -19209 190673 -70863 211991 121406 280403 289908 -70497 264299 108746
11397 -231210 55253 -303720 -89035 373588 41435 -221598 110779 -114680 94158 275783
11387 275783 -80638 -30223 14053 -36772 -143510 -138577 -142904 -8114 -134746 -84485 -19696 -81114
11375 -81114 149442 23852 -116832 205206 -28855 224709 -137476 -4823 257725 -18004 -298975
11364 -298975 -5947 -9123 65879 109933 -34955 198370 109874 -145978 -59072 121087 -233120
11352 53426 -32939 -146915 17330 -17991 -153444 -48866 -17656 304860 -210647 -247759 -2652
11340 -126110 -210826 -290352 20670 -229334 22986 -90969 -154379 392196 21586 28792 169626
11329 169626 -73766 -22956 39831 73358 -225392 -330679 -80107 -155430 -196516 14683 106057
11318 106057 -6356 5686 178280 37491 158419 54868 12005 -34170 -371609 58103 -112454
11306 -19951 -98634 -159569 -341168 26030 48009 -320675 122966 128951 -330777 16460 255941
11295 255941 241808 -424550 -172317 57129 38241 -215093 -53015 -52969 2511 821 38365 -137502
11282 325851 133699 -121634 179839 68816 83805 -149337 58525 16783 102928 334967
11272 334967 -196265 -14210 -433115 23137 113213 -114803 -210600 -160712 364673 -58641 107804
11260 60306 149778 223852 95031 74471 115093 39269 -56405 167647 -330389 276004 9073
11248 -338709 -46400 130267 63811 70665 -26006 289794 51449 -38282 -64973 -112572 -102254
11237 -102254 -20225 -189294 83091 -25915 -229722 -113678 -77386 69220 -34603 77786 -90418
11225 -144617 127629 -328867 -298937 -430323 73412 18374 184215 27783 202226 -47414
11214 40110 -131008 -183699 229379 -327392 72949 -19847 -197323 264476 -245198 48504
11203 -93651 -109323 109226 -306118 -318544 -182939 -139254 -308010 317235 17726 -212638
11192 -96399 27129 -40136 145522 -2853 -52864 129039 -6172 128326 -282465 -277638 -179829
11181 -179829 -129819 -165158 146539 -220203 29597 3603 -277891 231140 -109201 191202
11170 -238948 -216223 37175 31728 -46748 -107270 -303935 221217 -212053 135342 93928 123479
11159 123479 -17550 -10071 213548 -84468 -35628 -106836 -203210 -14015 85550 -231549 -189160
11148 -189160 -149255 255365 23530 201061 -203534 7196 124383 97297 119518 -99320 289621
11136 241556 -242413 162684 129256 -87704 213990 30192 -103746 37704 17678 21981 199792
11125 199792 56914 209445 222292 -5941 -66376 99861 289518 220494 90065 -35211 405913
11113 -62672 11142 -164424 132264 -255404 225219 -108788 144226 -220941 -129498 5514
11102 159472 99661 66389 190137 261615 249610 141279 92494 279143 359934 30016 63459
11091 63459 107875 358033 21885 150873 77672 105333 229037 -6928 103869 295817 125725
11079 -57356 129726 375921 455812 376228 135542 301651 345193 124527 149980 474862
11069 474862 284221 232282 593099 41909 17096 192285 517260 510322 469916 504197 438575
11058 438575 403705 220136 365045 674534 644557 486593 182051 593861 630730 538298
11048 538298 731529 668848 573093 702023 405726 776853 528030 701539 618569 522551
11038 522551 846032 670410 601952 516786 837071 349860 278863 463348 474180 749123
11028 749123 725066 592544 799825 451513 573024 752156 633314 552886 806846 534979
11018 534979 847895 669054 611697 90650 487949 506177 440604 667143 454128 314188
11008 314188 521727 508840 840768 720323 846672 463878 663450 589811 791835 796552
10998 796552 261017 465251 539263 674969 835454 375099 509390 531529 343141 578949
10988 578949 1098237 758190 567551 1233884 899098 925863 697560 949323 984028 1029824
10978 1029824 1446651 1262256 1575401 2032477 2129743 2186899 2340069 2684354 2392580 2416689
10968 2416689 2588268 1768751 2097699 1588249 1764350 1319186 1780939 1380055 1341066 1448111
10958 1448111 1297162 1318951 1292372 1488523 1448144 1244736 1229809 879952 804935 644775
10948 644775 623545 629872 508314 435900 340652 316666 144726 -50911 323961 607127 56382
10936 118062 251922 -88612 88491 -32894 19042 136425 42988 109246 -33268 -19481 -138285
10925 -138285 88092 88249 -118900 -17026 -122450 56668 -527070 112553 92255 200583 -27855
10913 -149172 -4952 -28816 16931 108598 194888 123083 93985 88849 -128756 236833 -164254
10901 99091 -17297 213808 -146144 138074 -337098 -124179 349614 65260 103109 255402
10891 255402 -220631 -91102 -118502 111130 21912 -153411 62155 -66753 -420040 -44343 123273
10879 559181 104952 -203167 235095 -56983 -27421 -123091 14715 -14815 124066 -245639
10868 99460 -294326 194291 17424 331831 -105596 191856 42723 408637 299762 131302
10857 71665 27829 -225465 120078 -349135 289422 133123 98063 173071 -68699 267466
10846 91943 349335 -297485 94508 69605 347011 -125199 -123503 334376 -482453 50940 -22967
10834 147783 222295 -93191 -154219 169061 100460 -265732 178426 66389 57491 -72533 141656
10822 1241 -142758 58517 117194 160322 -125401 -191836 -47235 6998 88182 -39576 -16440 62593
10809 -186598 130488 185175 222462 -71073 -153857 -236891 109499 131105 231067 -21365 410940
10797 -42702 -191188 62694 -326570 289340 105716 -66011 98913 70408 110366 -80139 -166933
10786 -166933 -265149 324279 -259647 11970 -44620 123825 -178343 33560 -190657 -233109
10776 -233109 -33835 -54164 -133827 -61100 -54255 -55041 -21243 61011 -157853 -116352 19914 -135170
10763 83350 -157107 -32347 -235316 20859 -5631 11704 -37551 -108730 -118811 -326910 -76813
10751 -319033 92062 -161789 15965 58736 -186649 -253767 -52471 143533 -164404 -229452 -170720
10740 -170720 -94591 55723 -228053 -73099 74542 -39864 -205800 -66122 -132642 -96726 222962
10728 -328929 -49461 -147833 -92421 -108736 133329 180265 26613 -68775 270598 -307104 -136100
10716 -222122 -182108 -35742 500766 -122578 -119348 142071 -253197 -64644 -21479 337774 231334
10705 231334 -356261 19838 -40809 112551 69513 -176381 96667 -207822 -218358 26788 -99971
10693 -60842 182386 158753 -192031 181660 20165 -206060 -22024 -128559 56785 -231073
10682 -194359 -66685 51244 218638 -207548 -76798 -44184 164467 -275393 -144108 -218589
10672 -218589 191814 -197092 52640 -172617 82054 -119771 -350468 59294 93149 -216930
10661 6907 -174099 140700 -65794 27643 -53057 -105914 120813 -41617 -94815 35125 -85632
10649 -300814 131140 202961 -101494 -79434 -42566 140186 43383 102301 10434 -67033 -56362
10638 -56362 -136469 12467 95047 76799 169429 -44113 -272700 71533 -18824 -222866 52795
10626 47620 -283925 -81827 -420632 -222442 -75392 -107890 177522 -414424 403084 44777
10615 144649 141223 90748 -18782 -422002 254070 78720 -144873 -123729 25416 -116857 198147
10603 -282784 -45574 367 -89922 83173 127266 -170726 30698 -62421 -143056 -92510 195840
10591 248776 -168802 -29062 155214 -302302 -258059 104859 15087 327552 72315 128655
10581 128655 238362 98587 24817 65859 -69681 -208670 -21540 -369396 -291441 -263220 159934
10569 -306313 -214646 -57658 255758 -119942 -85623 -344950 31668 77669 131414 -304611 80234
10557 -96185 78573 145538 -66558 -71369 136483 -317661 -40733 -180870 -325269 -182305 157619
10545 73464 208957 -101467 -34934 91403 215859 171707 218953 -151759 53494 192789 -10229
10533 -381261 -123626 31692 61542 18732 23854 -17907 -60679 -36804 303612 242978 190533
10522 190533 27404 284812 160165 -80607 -236847 687 -179605 346024 -211411 165082
10511 -61523 -107084 -252682 -118939 300762 -240232 262449 11946 -204188 3170 -107691
10500 43195 -120274 -440193 -282993 -273253 -121066 108554 -106951 432154 135105 -134271
10489 17403 23167 -38100 -118409 91223 91702 111831 552261 544159 266726 494227 469563 128698
10476 29431 -134512 -29698 -10905 -26400 -157652 59793 145608 -117092 -99753 247371 137423
10465 137423 101027 302933 -56596 248221 -324664 -69213 99676 59348 68569 -2420 41450
10453 -2986 71918 299017 -334703 329754 -15046 -287675 178055 -72397 -199039 159610
10442 -254836 45118 -165150 47002 -109724 104888 -130434 361759 -214488 103593 101068
10432 101068 -55246 3355 -212382 -75958 -5587 -80182 -77091 -216124 160227 -183621 -36209
10420 -107997 -257925 474039 -130865 317781 -153043 -830 -31055 -43637 -8620 -142446 -249748
10409 -249748 94604 109723 -158426 101178 -29914 -172145 120257 -211837 -134470 125928
10398 -251677 -107929 -122418 -173663 -128168 269799 6469 23898 -187658 -138209 305728 226827
10387 226827 143971 237651 129185 31746 -52048 -156148 234743 -380887 212184 83907
10376 222460 387097 293361 207168 220512 265155 -67209 217113 67904 343990 423746 527847
10365 527847 491882 382286 34233 256390 231339 23736 450046 283712 -69819 -155605 164823
10353 249969 127735 539982 713867 577739 644147 448353 210013 252280 140049 104653
10343 104653 369963 327702 392167 238434 216108 32081 186028 -19133 62935 188187 63142
10331 40514 127799 124317 115963 221167 -75754 78123 84512 -9285 271384 172037 178189 -13839
10318 280404 41739 233722 179825 -7045 86293 10527 188907 -253200 10648 169706 140385
10307 140385 -31603 -132805 5184 -23520 26771 189452 60878 52210 -27768 148256 96039
10296 96039 -207915 -253647 39995 -277095 -30558 179461 -196006 -111358 -54469 -120175 75633
10284 -122955 20824 35860 -308970 138007 -195442 -126768 88999 148507 -125837 -56889 279085
10272 -198706 46549 -160813 -115110 -11632 -43883 179021 -68311 -147882 -166890 87237 51605
10261 51605 227088 249929 122921 99623 283640 53427 183838 -256252 34661 47433 13618
10249 -50453 -261768 -121154 -39717 -144889 -932 -92603 -5499 -6031 23882 110429 147930 87980
10237 87980 -243606 66541 -32183 147741 -28660 -340937 -31809 -117278 -322978 -196248 141235
10225 -9835 -90868 37253 -345205 59332 -149378 -178331 -295745 -353009 -281728 -293379 143277
10213 323116 -280892 5846 174643 211279 156580 -224964 -15870 106852 -50831 -107388 401716
10201 -6703 -349833 -52823 -75314 -266954 35869 -61726 -54438 228950 -314756 30933 5404
10189 -16923 33065 -95725 -273074 77177 39212 -289386 -48072 -106286 -35916 53048 -390960
10177 25871 -154555 -66208 248969 144220 -77527 -174049 -66170 -181571 -350716 -31919 187737
10165 164137 12374 4470 -50300 -421377 10689 339085 304953 -22246 264308 -149697 -147238
10154 -147238 -316475 -91739 -140823 103686 -144493 179802 -209745 202375 75908 -8062
10143 250956 -34764 -11813 -137561 159302 29116 171034 -194763 25950 -305472 -172496
10133 -172496 -408542 99 -350949 60633 11991 -510918 -56050 -392937 -12722 -100961 28027
10121 -201980 -137351 -149074 43454 -201844 236293 -205403 -220580 -71202 -150797 -160127 -225930
10110 -225930 159959 -34039 -457313 -33650 -128859 50066 168623 -209441 -120569 -167955 -82631
10098 16992 101296 -9220 159307 -116609 297692 106777 -32197 285301 -48284 142697 187143
10087 187143 7563 -183811 -243050 -125110 -24034 -226758 -144530 -100123 -29842 -106288 -571
10075 -51740 -240460 -61913 87155 238253 -214107 -221642 57750 -198920 -268507 138430 119445
10064 119445 3212 -204041 352019 -202643 -32654 -20894 -90562 -45973 20483 -133792 -194150
10053 -194150 -54488 115534 -9196 15147 -160422 -65971 -225761 64590 -162230 -41166 163294
10041 82344 -204773 320201 -323636 122494 37660 8031 314927 -156821 274676 257422
10031 257422 -116936 -108217 -120128 -34814 -32951 -131795 -84440 -91019 -135872 -89404 217698 -354464
10018 -23031 23115 -31246 51537 -336945 -225888 -237706 -124556 -266937 -138113 -65079 -239711
10007 -239711 150091 -107177 38227 -300433 62724 -51915 32401 -318097 -151774 -43530
9996 -144146 -226075 -98585 73090 -55055 60391 -137275 -199639 67024 -181163 68056 -155094
9984 -24808 -229424 194099 26 -285413 16897 187973 -174946 -119421 152814 23341 55383
9973 55383 143405 -165505 -201106 84349 -58767 -4690 -208575 201585 89724 154226 127277
9962 127277 -277448 -121359 -258216 255043 -201947 120893 -256957 -51395 4174 76643
9952 76643 -43069 -252054 -66297 69738 -63947 -274000 -102268 60471 -288461 50760 -53608
9940 -167107 -328001 30598 98336 -221765 -76816 -12147 111433 218942 -85407 -164266 190707
9928 -275470 -36525 -25242 197340 95282 -547 -181344 -26796 58953 302938 -38168 -95572
9917 -95572 -234682 -74830 -103190 -68027 -244925 -145030 -48718 -190923 -231445 -35587 -333905
9906 -333905 -18077 -104576 -143158 65939 106590 -264350 35788 -290536 -82190 -159338 -37702
9894 -193927 232851 83190 -69084 99275 137210 -314719 -241103 -3038 72206 96244 -207142
9882 -103982 73984 1502 -142263 197798 234335 -191102 -27940 -134659 -200489 -235817 -86423
9870 175853 -293978 -168841 90187 33214 79854 33818 18510 -80285 -36142 71780 174508
9859 174508 -237184 -199143 -145755 36808 -44698 -101686 16563 71019 75495 -5658 6822 238474
9847 238474 -33308 138535 124687 7323 -97138 -86466 156626 -251803 84887 329138 -96914
9835 -306589 -7294 -77108 -196304 -151731 264185 -134219 57854 -87499 -53991 -52251 -237085
9824 -237085 -111013 133650 95773 -6067 54503 -195100 100925 -265607 -271454 86909 119265
9813 119265 -137770 43589 -158498 -169957 -113562 -180269 -58377 -165353 -542056 -90202 -92457
9802 -92457 118863 -88383 -55109 -131375 97786 -189129 -157635 35087 341697 29330 -86921
9790 30696 168689 255268 225702 -177359 -68230 -148444 -204223 -67159 -115339 192434 27398
9778 86412 2390 -451733 -84661 -96440 -318099 -78906 -102110 36950 56812 253628 -111099
9766 -46843 -86000 31447 -165338 -17418 11539 -199787 -13978 543 -114489 -173462 175785
9754 -185922 -349070 103992 -261497 -251418 -32359 192435 -124311 -184645 -88641 86566 -88422
9742 2359 15778 -159440 57732 -155098 -74245 -106346 140619 -97839 -353413 -187903 -24592
9730 -334201 -90828 -186202 29131 -192079 134378 99922 -47042 -16755 -412546 -332193 -40877
9718 -355766 -309515 447505 93992 -376057 -102634 99491 -105768 -148723 85862 -207995 -167743
9707 -167743 -186889 -298847 -317886 285468 -167345 -207395 -182688 -114092 -59913 67834 -15606
9695 -6139 -95727 -157280 -322866 -217827 -15350 -28589 -126023 -140450 -40953 38847 5253 72987
9683 72987 227035 -197311 -180363 133228 -115203 -166877 98989 -172305 -229419 -449537 -239165
9672 -239165 77599 305098 -80461 179495 -122524 20844 69658 -232599 11395 -29522 41984
9660 -129349 -81409 -7641 122644 -324946 -117037 99654 337233 -53171 -149232 207990 -76848
9648 82554 -143525 -49323 108570 312676 155536 175881 -99481 -83465 41420 -218664 -367509
9637 -367509 -246852 -92051 35288 -231720 142299 -223688 -76605 97052 -294773 -420037
9627 -420037 -349168 -55815 -249723 -37836 76720 22894 -362 -214824 185260 -63620 245054
9615 -210684 143118 -310977 -87733 -207571 20935 -162408 44309 79916 59029 -207308 24258
9603 -229221 -121068 -84910 -103711 333593 -1267 -199813 -258185 54453 16866 -91611 -61054
9592 -61054 146822 -348159 -78136 -219613 -110014 -41692 564 147107 12246 152420 -142280
9580 -273362 -136512 -96676 -264516 -218431 -61398 -257406 -212195 -320810 -133697 -83368 -197390
9569 -197390 -77669 -437953 66929 30198 167626 -280000 -238475 -85620 85724 -187949 -157283
9558 -157283 -63149 -147460 -233257 89721 11731 101908 19727 76361 87481 -89485 -525650
9547 -525650 85433 -237903 -233712 -291419 -5526 149099 -277332 -118755 -2265 -169543 -40363
9535 -160638 -26501 -234788 -47217 -342933 -3279 -79443 35277 187023 46317 -146839 85429
9523 -69054 32774 74883 -68865 -311695 119672 95673 -204612 -47847 96424 255553 -313186
9511 186645 -207112 -507566 -185822 167477 148444 -75059 -66244 -202113 89977 16008 109857
9500 109857 -515197 132331 1360 -119754 -170425 30709 -146842 -73907 195206 19235 274860
9489 274860 98406 -238767 45160 -363553 58706 -5695 -364073 -115220 -144055 -159847 201810
9477 -118016 234367 126003 -16763 4114 -38662 -100815 -238157 243854 -253179 -41066 -97627
9466 -97627 -99643 30236 21085 94741 -367373 227545 130101 170192 133655 76433 -231014 -269428
9454 -269428 254026 -193591 38744 -124172 -191727 63278 127437 52384 -148810 -176172 143960
9442 121068 231265 -217333 -336204 -1335 -73959 -207210 -21251 -34833 -44092 79505 205678
9431 205678 -122304 176460 215694 -64016 27894 -55638 87859 52218 -229121 35575 -414019
9419 185259 -94495 -171297 -350020 -84426 -242356 -382232 -142596 160390 256030 -411128
9408 207967 -274882 -16275 53267 373258 213765 -230745 -297203 145447 -112743 -238781
9398 -238781 -240292 35711 106414 -188857 27280 -147876 -346151 177072 -102044 -171928 -85499
9386 -83954 55798 20262 -99900 197328 55633 73830 7649 -314769 -77007 -111001 -83679 133482
9373 101473 -69469 -82517 -124389 223150 -243861 283929 12541 -83501 -156513 -94031 9639
9361 -443109 -101630 -38814 -115841 -163511 4418 193019 24517 -249965 13813 -117202 -116005
9350 -116005 147819 -153976 27176 -250709 142368 -207670 222730 -262424 -254856 318935
9339 -59815 -400109 51287 4658 283405 -139259 -237487 -172420 61759 -93545 193997 262915
9328 262915 -16880 -218860 -88429 -244336 -73041 -276862 1087 -215435 107641 -47086 -106024
9317 -106024 -51092 133580 -69214 289586 -141657 -75835 4693 -15570 26043 93908 226464
9306 226464 -248728 -70749 -108158 -408469 -355792 -271328 213827 -319923 -136569 -190514 -227895
9295 -227895 -59500 130111 7613 73506 -357022 -59812 -270515 -405875 -87875 -173031 -201572
9284 -201572 254953 -49501 -37368 306457 -155452 -39791 -296355 -329903 15080 -321006 -12945
9272 -19856 -242410 2078 60419 -201946 233902 -58032 116859 -63770 -167968 -126677 76346
9260 204087 -180530 -60619 -209309 -207782 355845 -275516 254286 64454 117364 -26883 -63658
9249 -63658 77492 -350120 161375 -93728 25885 -155303 -151902 -69190 -236906 58481 -10204
9237 -15519 -146319 -433596 -83527 -29632 -175353 -46662 5654 -97431 -143961 -79160 31616
9225 -3747 -542 54284 -61626 18888 -47496 -42968 -187273 -183099 -172512 -36040 -103356 -164593 -104004
9212 -104004 -167381 -211945 -42647 -27977 -173101 -18038 114432 29363 -272875 138488 -20007
9200 -14240 -162903 -93121 -24530 -236608 147908 -142766 -113860 -226152 -200357 -75604 35623
9188 72689 -180797 134113 35610 16274 -121881 88297 239191 168609 19341 -368546 3009
9176 -96355 -229383 -61076 80328 -152464 80321 71344 78979 -116629 -99999 -132869 -200346 -68550
9163 193936 -204953 -253242 -125029 -830 -242758 -55574 69960 -149750 -5566 211859 -52435
9151 62056 162160 -17641 -56859 324471 52118 47930 193398 -229799 -50305 -230376 -1480
9139 -4227 162759 -229368 -217329 -99994 -189620 -204451 91070 -55053 -201310 9950 309470
9128 309470 113148 -364694 -71971 113825 -222260 26957 239360 -261374 -48416 86203
9117 -410105 -168834 1283 -60760 125528 -198564 -211088 -35395 -170633 -160875 -50524 -181474
9106 -181474 250293 -124683 99536 155777 -255214 29247 -86406 16622 156047 -148119 54740
9094 -136149 131797 -25558 -212721 -57837 -78434 169671 -194017 89946 -179911 83677 153348
9083 153348 333215 195476 -158278 10823 -88426 -171895 -58919 -150946 -147708 -61325 -99669
9072 -99669 -23782 350353 73624 -34333 -44928 -235844 -95601 -57901 283009 -73752 14192
9060 -346856 -185734 42850 -81786 -94326 -20710 -252651 -194074 -166005 23365 -153483 83152
9048 57319 -7160 -256528 -229483 11808 89367 -177806 -384505 981 -47459 141919 -135441
9036 -14792 244988 311765 -21002 -185274 -36271 -48321 -54191 11790 85327 -16592 -386626
9025 -386626 95343 178650 89490 297376 -42241 -189680 -226155 -21065 -188286 202865 -9290
9013 -109290 -253582 -165234 -42650 66927 -89348 154916 -56657 -232822 -132845 83406 -53321
9001 29614 172018 -357685 5235 78506 -225956 -245595 -80060 -321960 -211098 -35537 -172946
8990 -172946 -147755 108308 -241332 -144916 -138285 62940 110186 -242282 -256926 -89127 78413
8978 -160515 -69748 -141706 -154038 -97953 -51553 276124 -27167 -23461 110133 -100952 -84216
8967 -84216 89189 -136359 44966 49144 -57761 -67029 -196809 -32257 85437 5254 -17165 11301
8954 116195 -75796 -93854 -5166 131546 -137002 -125362 16437 -157442 69221 -24617 24728
8942 -160689 58988 -277509 227588 -238926 -179278 -221051 -400278 -448622 192428 -132271
8931 -91645 -16892 -9117 -104600 -276640 -18059 -252651 226273 -323097 329341 598338 982164
8920 982164 126148 179348 -9705 68598 -59968 145544 146195 84933 235977 107795 120011
8909 120011 -31723 -39906 -442685 67087 -112983 -20214 138535 -381989 -48507 40637 -82867
8897 -59093 -211000 -86926 -85720 80478 -207740 -162315 -128575 -63286 111292 -80396 -72807 -224953
8885 -224953 -102056 -317912 -56445 -99774 -48587 67070 45799 95256 1754 -114057 -190427
8874 -190427 247025 1573 12287 86281 29395 -72003 -172709 17156 -149007 11257 -245741
8862 -36133 -201523 116883 47699 100427 14601 -203057 -220142 201419 79132 74239 18145
8850 -100897 201846 -225176 25159 -55588 85409 -38617 197420 104992 -140254 -14105 -74771
8839 -74771 -93060 -76309 -236053 120185 -102147 -218828 109101 -100186 -32239 -121261 -140392
8828 -140392 -148051 -59702 -54918 73568 170605 -36793 -44499 -80482 -31887 -201278 -43635 -356160
8816 -356160 94848 24652 1714 -234299 -128685 -365957 -234339 -54729 -99333 -48774 -137578
8805 -137578 -45762 -17853 10501 49297 3120 82355 -202997 479450 72871 172053 -372915
8793 29911 232911 -66778 -23635 -121763 256399 -154753 -55877 -53166 78149 -117611 52548
8781 128856 9820 -115732 -298196 -103435 -127101 32976 -264958 -58031 157003 210755 113352
8770 113352 74949 -73341 127516 -171552 -190509 -252618 -370119 40560 75740 -179296 -96602
8759 -96602 -423067 -317875 35072 -262521 -69770 139420 -227912 -63829 59151 -208464 -175896
8748 -175896 -64938 257637 -260347 140969 -174064 160271 113556 -278706 -146538 35421
8737 24437 114693 249519 55210 91410 -64484 234527 -158615 14056 -151466 162801 -130920
8725 -100255 142052 -277516 -28479 -6320 353663 23489 63112 -285004 -48434 -232196 54027
8713 149455 -240540 -160817 65835 -348271 232255 239910 -21133 -260617 -12115 -97752 -159033
8702 -159033 -393265 -139165 -332131 123397 -178901 196252 66630 -114262 5409 -241226
8691 -222848 -163361 -167903 -73758 -104586 -224182 -128962 27746 21699 -33521 76492 -174280 554
8678 -107925 -193755 20752 -108712 -181734 167683 -134390 153465 467192 -80416 43854 -138633
8666 -63574 -34123 -100480 9954 140726 -107476 71888 -51460 -121716 235677 -226974 -89207
8654 120955 -247969 -66998 -102535 286909 -58859 -73899 -240682 -214706 485095 -130888 -109977
8643 -109977 -109187 48772 34858 -220220 78996 -248229 6574 -47396 128617 -249814 -34666
8631 -110591 70832 131127 95916 166106 -41482 -207652 -38379 275987 -75361 -78821 -210606
8620 -210606 232828 17129 187418 7264 -220298 -137230 118300 14120 14662 -164435 118526
8608 -150878 -39571 -93830 -14432 -62778 -154028 152156 -251266 -93348 -186516 -396718 -174340
8596 -230405 48099 -236029 -30612 -81075 -140481 134093 -113325 -42627 21120 220638 -124205
8584 -308876 -322305 -192043 -25217 -118311 -422943 34211 279441 239191 -37714 -163321 -155639
8573 -155639 -108419 -250911 202373 133707 -5479 -88307 377407 -161502 83047 -142291 -186725
8562 -186725 -280062 -135742 -126694 144843 -32431 -97222 -24356 -124696 -86681 -289567 -93436
8550 317509 96969 167172 33505 -338668 -61301 168981 35138 73078 92196 -211635 181530
8538 -184244 -435 -347198 -25448 -204881 -110742 94330 -350860 -66932 -316344 -183890 -38926
8526 -397758 -269028 146469 -297790 -36128 241273 186057 68699 96990 -59510 246266 301964
8515 301964 46972 -174035 -218817 20431 -355563 -50815 -18705 -190485 -193639 57976 33626
8504 33626 -275978 241038 49671 205561 -38965 164989 194320 294805 30473 -267611 60343
8492 -47460 157650 228011 -156402 -48449 -207022 -132447 137304 -82049 112074 -112960 -17550
8480 -110531 165522 -208760 -21225 74079 -37969 42138 119838 53778 7739 6722 38547 -38555
8467 89400 -37 -180016 -183230 -179188 206551 306713 -205199 -137361 -194169 110088 -68192 -24431
8454 -254792 22452 -28369 132040 62508 179455 90466 -185735 117902 -347101 208843
8443 -552132 -130049 56774 104265 -52365 126730 109175 130706 -206769 172939 -73975 41360
8431 -9875 91968 -262335 329601 -433340 452 239392 -31140 -25210 -111228 -9904 -105239 194463
8418 -22542 36066 -12730 -249089 11611 -133761 -28406 114658 -186185 -200336 -248714 -220852
8407 -220852 27434 2936 1608 24328 -22094 34625 -278566 111147 -299190 -178205 59769
8395 -274060 6824 -154311 -457828 77898 -46080 -20312 262478 -30550 -186453 94113 -50482
8383 -29180 -274106 5702 74703 -340059 78896 -222695 63751 160211 -4796 -7939 -107151 -336655
8371 -336655 -225669 162582 8985 -236931 -59793 -164615 -186528 82581 -67806 -39301 -125631
8360 -125631 -257732 55306 -163595 -137377 77048 -111444 -109887 -424329 44558 43071 -83416
8348 -127321 425574 -248509 -79107 13876 237018 -48233 -113478 -8986 -390673 166044 -198223
8336 -4862 -184063 -99856 -260325 -9808 -399155 211167 128196 -228223 -62297 105964 122178
8325 122178 -216383 26744 198143 16577 -103869 -96146 -176780 -37523 -203851 8125 -113290
8313 200340 -10560 -85977 -173821 34754 16728 -67372 -154862 -12054 -193655 16891 -79836
8301 144460 -12534 66107 -248949 -135252 -29562 -19210 231282 71429 164554 112961 47909
8289 -16179 197801 -60143 -82318 3472 49208 94937 176771 37257 50391 -354770 -91094 61737
8276 -132067 101244 101505 -114840 -305037 -262112 -194210 -25277 -323237 191919 -8815 -188050
8265 -188050 -248632 -70234 235179 -84439 -110424 -87190 -90370 -291078 40098 9065 -160473
8253 364087 36012 -128811 152408 123029 222149 -273551 -38617 245756 -83681 218986 -212174
8241 68430 -200635 -276608 93267 -193429 258051 56542 -34480 -154101 48121 -227769 -93271
8229 -71066 -193613 110371 214053 -154256 -43530 -55597 -149858 2481 -147486 -207708 175582
8217 251358 116160 -277337 -123085 -312755 261310 92603 -291888 -173804 -144589 142073
8206 -107651 -202602 -4166 283066 -22305 -34239 -34101 -79774 -69111 -324384 -91621 160219 -7472
8193 -16175 -3555 255688 -83655 219723 -62229 -194170 6258 63326 138795 -287458 126928
8181 -211708 -17189 -116488 -88763 -142501 -143986 -44017 -235733 71165 97907 -284580 51155
8169 180450 261101 -23247 225551 -309726 -46617 185639 36203 -328551 65771 85477 -22079
8157 -4206 -184118 -119922 288694 -52835 -217968 -284409 32488 84814 13777 -197723 317478
8145 87219 -101843 -36422 198885 -20284 -20204 -479387 -119603 -11817 259232 -320619 -43484
8133 113687 -138882 126051 7059 -83540 -69517 -210581 52823 -146737 -228670 238290 212359
8122 212359 -183693 25658 -57010 -23749 -203253 87878 -209699 244630 -133994 22900 32853
8111 32853 -258900 -120765 336895 186933 65979 -121241 -86952 -342203 -142635 -324954
8101 -324954 114676 73938 88985 184342 -5522 80037 -93055 -65458 -166967 -90784 -265905
8090 -265905 91198 49076 -21278 -252373 -315016 54776 118381 40869 -237115 -236248 434161
8078 51219 29399 -101813 -121235 74879 -11721 -278188 140851 70486 -142077 124639 92903
8067 92903 81324 -44824 -227133 -210722 -247641 -242333 -99416 76392 -17816 188148 170872 24609
8054 42315 93563 -77921 225089 -230845 -191495 32748 -70705 -155563 -4405 -117224 -26230
8042 -484499 41854 -257771 43088 -163800 173090 -61124 -139599 41845 -194453 12994 -201294
8030 -17885 -43777 -111618 -119736 -87637 150940 302666 119123 -84991 -6962 950 -60874 -140435
8018 -140435 -60017 -64591 58285 -31370 -44670 -224798 -108337 51469 301704 -50043 -8062
8006 -157935 -366246 -168635 28108 -84557 -63074 -48667 110640 -277562 -61349 -294339 -142932
7994 -82325 -116321 -168105 -45572 35669 -5503 -128148 -38706 -146158 254228 97233 -270942
7982 -204606 -150780 -70477 -118649 -178113 114252 -364130 24482 -86832 318507 99960 -212708
7970 -248301 -83542 -4092 1909 186812 -262806 216008 -112989 -121067 14140 -137108 -248737
7959 -248737 -116283 -176908 279805 -65649 7429 254665 4861 260755 19411 -12601 -50095
7948 -50095 -246049 -309632 140035 125761 166004 -239298 -57874 -128105 -139103 -115887 -9061
7936 -49370 29328 -339899 -72977 -127073 -107601 142324 197560 -17089 -390051 15301 -141501
7924 -333848 310850 57782 -160408 57902 -244103 58761 64028 153224 491330 -27125 53738
7912 139863 -28137 -354685 36059 132241 363031 164234 211493 -175030 156696 26342 -169869
7900 45494 -79836 70859 63896 186945 -119367 -193036 -2494 -72326 -87583 133553 101651 307006
7888 307006 4267 -276408 -28666 -74634 92689 -203645 -106763 243318 -250042 113215 -67831
7876 -81953 -365885 -98384 -50528 -170984 -81361 -146459 -2103 189457 -80200 -81449 -99460 107511
7863 -82044 -229618 175261 -2333 10931 -186178 -213766 135664 8561 12833 51206 -129618
7851 -147788 37677 126565 -202519 23334 185524 110529 321808 -81639 -68017 298811 237177
7840 237177 158131 93734 109045 -243876 -270657 14303 -44403 25019 -387010 234387 94331
7828 53890 180328 -105368 -73213 -59143 -3618 -125070 -394649 -81859 -144273 -195553 51338
7816 -170600 154948 -290184 685 -20880 50709 -41180 97773 -381025 -92832 96934 9497 -158724
7803 -141676 -199763 -80963 155116 -176538 -203430 81873 410954 -265488 -145798 258816
7792 61651 -20361 184064 -166372 -119465 -188203 228647 185459 -71467 11137 134849 111007
7781 111007 -235934 -205313 -106898 218483 -181577 -9053 -400124 -133759 -261502 -301179 8144
7769 -26747 -75887 28357 -194875 -94476 30948 -34635 -78809 -4549 188289 -19883 -22905 64369
7756 -109809 -182504 -147822 9985 23172 334651 298175 -109944 -50940 -79601 -151361 -116937
7745 -116937 53401 12315 215092 -180908 7392 -137704 23596 106323 -8053 38759 -62077
7733 -241474 -58838 -97327 -12468 7549 -241370 300442 -90506 -185970 201874 190363 -205369
7721 107996 35577 -229925 -7183 11653 -242203 -230692 -16222 -180327 -144848 -295422 -268714
7710 -268714 105017 -74230 76452 -53051 271354 -47005 -371403 -239901 33162 -173640 -177533
7699 -177533 -105911 180885 184552 291144 -92274 -277653 225258 53372 -147857 104260 -198084
7687 35742 166818 -293098 -194823 -161836 -189098 67427 -33965 170291 43896 133224 114938
7676 114938 -368878 -144527 78724 -93772 -119870 137512 -132558 114316 139335 -127279
7665 -36491 128557 34171 101527 8601 59643 215651 -95423 149599 50080 171736 -347137
7653 -139256 272461 158876 -122451 -155380 -332037 27532 93282 100415 -134085 75381 -146278
7641 208559 66123 59070 106072 -10477 55904 -20746 -351497 79354 -63085 -111082 -41756 -369859
7629 -369859 75789 10673 102787 -46110 82769 -185051 128922 -6169 -96670 -139106 108570
7617 -52686 -230320 -69626 -46339 -12695 24439 -158739 -44838 -130481 -92906 -99725 134524
7605 266883 -209749 172210 59115 -34009 85270 -38227 102103 231600 -3705 -66219 -202093
7594 -202093 -143868 -6602 29239 -239899 -42500 15925 107 -143949 -157656 179867 18220 167173
7582 167173 -476096 -110928 70988 140457 -317769 90601 40590 -41015 -237787 -137972 -172057
7571 -172057 -130224 -20085 -354544 135592 -139679 253101 52929 42829 -64672 73174 -334265
7559 -112956 -129726 -24713 13553 -122225 44691 196871 -118453 -124147 93825 -189563 -196287
7548 -196287 39773 -20424 72325 25412 -196524 -607914 -14408 -89322 22029 -505432 -73373
7536 -199512 -281347 198553 -175353 109299 -90975 -44239 50278 -83558 -129457 -2315 75529
7524 198435 181303 -67377 23344 -383149 151107 173719 -227849 -321396 -125430 202278 -32548
7512 85854 -86712 -337757 -199419 -128675 -24098 -170573 -120619 -378469 -73960 15020 -286829
7500 -56949 -136902 61487 413817 138879 241094 277773 -173987 304880 -76902 284576 66110
7488 168022 -155873 235311 -361586 137114 134939 90343 127342 -125286 -22382 -166361 -169189
7477 -169189 203997 166425 25687 75897 40991 -444101 -202368 -23522 162407 12369 59036
7466 59036 226803 132984 100128 -223879 16648 84121 -52805 -158873 -301762 25350 -453534
7454 -349608 -79692 -346963 -70007 -142361 -64519 68502 32777 -140791 -61379 -113905 -154017
7443 -154017 92020 -161772 -196875 -47163 -30536 17856 -462715 -319590 39522 -5439 -70062
7432 -70062 12987 -130644 101366 -14082 26465 -99476 -81092 -108782 168302 66949 -244660
7420 -126223 -219130 -242826 159533 -161706 306643 3837 126688 470106 -200300 -177221 130925
7408 379305 83208 121439 -16723 -171329 183821 -125382 68524 -53833 -335084 218247 -72102
7396 -50335 -36039 -179834 -264016 -288076 143464 37941 283717 3863 105637 51627 80431
7385 80431 -203069 -55721 -2444 -78945 56206 -155427 -33469 29951 496 -281634 136008 234725
7373 234725 78659 19188 207635 117705 -175583 124621 105682 -37406 -210403 -492533 5448
7361 -365814 -212238 -64176 -160870 12705 27974 157274 133964 -81456 -159660 1707 -177279
7349 59714 -15301 -227899 -81478 -394130 45961 -16504 -51327 55826 40994 -292240 -400284
7338 -400284 -196534 187666 42912 -11939 -149047 -208202 329041 167450 40138 -364582
7327 104828 39615 -287127 -226035 47945 -356641 98668 -367186 -51873 -282477 -250292 335270
7315 185933 -365895 -181946 79824 -181012 124220 -115487 115812 115256 -366353 168508
7304 -151177 88342 -244150 -320074 -119896 106083 -111795 25969 -134017 -55074 -186316
7294 -186316 88680 739 -129200 214172 195924 -14132 -200100 -215307 -65005 207895 -200644
7282 -266913 -67447 -269931 -343374 58681 -63247 -61137 -224751 130740 90653 -77122 -10895
7270 292309 32621 -27633 -46511 -247406 3594 68118 151302 -130554 -332356 -35354 193785
7258 -146627 153300 39123 -61526 81059 -98076 156141 -8720 -236966 -58660 197820 220821
7247 220821 -44321 129380 -110252 343655 -65569 111504 -89198 238533 -59065 160613
7236 144815 50063 307671 -220405 -75154 64987 67132 -213707 110005 66872 -166520 16399
7224 -53282 -49720 -212301 22651 -266524 -79695 262091 -426668 206360 97773 287901 -151945
7212 27240 89631 -102245 -11557 -31314 -34337 226273 -404118 318434 -141598 16567 -115619
7200 123810 -21280 -99736 63710 -11252 -142600 -259507 348441 -334186 -158391 74966 -301284
7188 -393258 28481 -47935 36058 26614 -6450 104399 -177728 101844 7314 189336 73540
7176 -129127 117435 -127950 -8103 -375977 -109890 8028 -84782 60071 6107 151384 -206328
7164 -96905 27891 23306 -125880 65615 324152 125639 -164361 130677 -44232 155856 57683
7152 -211709 -244523 4754 -94833 -170203 -204195 63111 -269977 -313060 -257661 -23325 1157 -75434
7139 156108 -349246 11140 -78667 -200247 -46988 271484 207912 382137 82730 51341 -9358
7127 -76431 -86570 -112607 2256 400548 -65455 272962 14240 11622 98190 29714 48609 -5981
7114 -91356 -246589 29240 -206525 -435935 -42285 -109091 3361 9250 166156 -7827 -163271
7103 -163271 148592 45414 -144000 150246 62255 -105879 208438 244846 -118484 -118582 172106
7091 174330 30170 -309688 -378121 349526 -271863 -77411 47072 204932 -47057 -14745 53895
7079 -265231 -150187 -193888 -78511 -104552 -68536 7932 12240 58428 145039 -67231 -64520 -6389
7066 -168831 -95223 33752 188284 -335593 -148716 132903 151094 98503 352859 65008 114907
7055 114907 45046 -116485 195911 181018 -252169 -8959 -92199 -205382 -64453 -135023 -498112
7044 -498112 116592 -92095 -13068 -26777 239462 -175191 -52779 341164 124780 187927 62449
7032 212052 87395 -167611 130869 -54498 72607 -74022 -229871 100306 -169609 -275371
7022 -275371 -6577 -19712 -159254 214207 -219443 312619 153444 157751 -254660 -104474 31819
7010 36406 -208632 -21198 -4231 28763 228065 100069 -67630 -97644 -7667 26641 -110346
6998 -201932 -1094 57646 41133 63137 62291 -44025 112497 -99193 -103106 241562 -53629 -190610
6986 -190610 -112933 71499 82915 84749 159464 -253782 -149076 8292 -269415 -40689 -80752
6975 -80752 -144881 -78178 262063 -92701 -203286 75866 10770 -184976 -130558 -201710 144869
6963 -101462 161717 -250724 -279295 -90066 218514 94137 -96063 -59719 36865 68974 149698
6952 149698 35194 -182992 -47385 -139375 14517 -254018 -375977 -36218 99989 -142755 5796
6940 -255729 -212845 338862 114069 -99315 234267 -173002 -140641 213479 -278250 -332095
6930 -332095 18168 -26133 -44643 -11440 498673 52801 -278534 31172 377186 -38654 218989
6918 69930 -116636 -74168 -211579 -278458 -184717 -21619 1375 36446 -49858 -50969 -134590 -100819
6906 -100819 186673 -229848 -464195 508566 -78921 -232469 -2736 -339016 65772 -205517
6895 -12465 -53035 284930 129182 -287933 266145 -79176 75720 103775 -12911 -139679 311493
6883 -15654 49754 -13 99903 -42326 2890 56336 58225 -252127 -246861 -14510 195953 -69019 -15806
6869 86719 -39794 326458 -142658 -130845 -175000 -271188 205 334038 -79609 -351461 117644
6857 -157745 311479 -39014 11040 5314 -520916 74799 -317126 9282 -258107 -112010 58855
6845 -177451 -160675 -62691 22244 -72225 -208848 -4239 -202470 -147143 5247 -126391 112973
6833 -271484 19942 86808 -124486 -92852 -110979 227932 145915 -236288 -190161 14248 -92820
6821 110051 -38117 -328729 -190043 -143803 -138229 107475 275342 -187577 -68558 169646 -290803
6809 16553 2673 -353231 145477 -164572 88160 -163935 137536 211711 452309 -198232 403822
6797 326811 -117483 46060 79926 137973 89942 -49877 298465 -15416 -173176 54813 205736
6786 205736 58731 227919 -143140 -221097 281999 -45984 -73269 -188532 -262393 10955 -190087
6774 -117293 -38907 -382841 95451 -320584 -339750 -90847 -70487 30491 -423889 -11271 -133334
6763 -133334 91902 17779 -123798 269070 9972 -203861 285945 -104273 -176878 -165385 -263684
6752 -263684 37895 -266209 357973 200333 163647 -129664 -43288 -287700 -145444 -210621
6742 -210621 2428 -17120 46605 -145836 -270541 117449 267802 -421411 -86852 -128244 -24027
6730 -149728 61405 -181224 88848 -41578 62138 165647 45 51311 -56786 -128411 305073 287917
6718 287917 -69824 -207253 298985 -65664 -101032 253332 -1576 -87655 -104973 -2784 239070
6706 -6157 156677 234249 -96988 117753 -77338 -267606 -20597 115025 -202675 -200272 103484
6694 -5336 4073 169904 -87568 -123725 2947 120099 111518 175924 105138 -42421 196935 -55074
6681 -189196 10526 85913 -15601 194675 112693 -357552 306900 -154581 -225261 -424231 -221943
6670 -221943 -265319 -96552 92263 -43762 -311093 122975 120543 101035 -124152 -17468 118142
6658 51702 64907 94896 -294893 -6791 66671 -32476 -11533 -96819 71735 -283161 -359249 -244540
6646 -244540 -235970 178437 -246347 -85820 134970 25035 116612 -445074 3682 -188680 136606
6634 204732 -148904 -237907 -136610 -223424 -151238 -123351 163757 -310909 24984 -119873 -424589
6623 -424589 164729 -242657 312193 -100416 54372 97944 45889 -95895 93438 -64840 -179074
6612 -179074 48036 -96891 296793 -19422 -188315 -293449 920 26411 -171040 22652 22637 -6762
6599 -321090 -382835 -278529 -254024 220522 264698 -250832 58077 -75845 109170 -174618 -152243
6588 -152243 -7037 -127533 -142750 36041 11728 119506 -79681 141225 12834 133835 163103
6577 163103 37473 -22670 168876 -134648 -104769 -158387 182076 191993 226158 41901 32075
6566 32075 267565 112738 -94673 -118613 258428 100346 -178368 17538 17000 -619319 -272669
6554 -87050 -117601 94963 -54186 224494 121301 -9730 57335 -163215 261408 281469 147447
6543 147447 -58216 -12652 55827 -258798 241588 80959 201125 42303 28582 -30333 168644
6531 -84115 151782 -123872 238947 34648 339398 -8856 -81009 142291 230301 191896 301274
6520 301274 -106391 137784 133858 206746 152751 132490 201337 169055 -221450 -78219 206802
6508 197233 108882 -328248 242558 -112425 197653 -203573 -186237 -75776 -64427 -395774
6498 -395774 101701 -28054 98935 -136166 142165 -363267 -164753 -123425 -10728 217859
6487 159600 -148298 177603 163298 -23337 -132673 132083 -432283 -17672 -150990 -97366
6477 -97366 96735 -35210 -160316 139648 -113198 -182728 43818 -140865 194029 67663 108216
6466 108216 -97114 -256383 -174915 306109 -187068 48649 -21844 -10767 -44598 163239 -20556
6454 14997 -31345 13888 -57234 23431 -101030 -56584 -97138 -438771 -9548 -125343 181249
6442 73367 -29953 -25904 148069 159706 -19056 8668 20734 -40876 -54980 174932 163325 172046
6430 172046 128062 -43843 -28342 -286842 119070 -258215 219382 -51281 -38645 61490 -208921
6418 172485 187194 -147089 -76642 111744 -30265 -4295 68140 265413 128359 63727 -243341
6406 1375 -148686 -48355 -134643 259061 -8485 -210572 -235378 -226380 43219 -9180 195791 204870
6394 204870 -98539 -95813 -278892 -31930 168181 -96694 -16884 -61554 118823 362710 225325
6383 225325 115242 -159984 155277 78388 -43178 -230143 -123008 -149403 -68911 -80790 -26618
6371 -145146 -148490 -95782 -227726 99162 -24347 -6087 230959 -69948 148527 -147881 -73428
6359 -107454 -304428 41454 40661 -107516 122822 349077 -38963 256713 -418421 -138168 49147
6347 62722 -183000 86985 -72906 -256575 -148888 229918 -177356 -207338 -13786 -253175 -97291
6335 -185698 -198440 232860 -317531 -56828 -126721 52154 -98738 177832 -139097 333811 381892
6324 381892 -194985 -155324 117638 180472 110897 -142483 -173588 9696 295682 -56595 -104111
6313 -104111 194426 -3764 -35620 -148735 -151197 -17331 -336003 -134450 -95356 420003 112701
6301 87176 175946 50128 -188560 233152 284613 17307 -11803 -234450 35331 193114 -30649
6289 17150 -257326 -304563 63465 154940 80842 40399 110316 30195 -331565 -31893 -6960 -54814
6277 -54814 -187914 -193628 117579 -168486 -93047 -91836 -9421 284655 -27419 106516 -190343
6265 -45714 -56286 162743 -142086 123193 99994 -78845 157899 -90266 20476 -57488 -196526
6254 -196526 7153 -130506 -108986 -181397 -145498 211330 -347590 -160934 225019 334747 -48512
6242 195606 162342 149505 245487 82157 397423 -45940 -134342 -122999 122184 -158421 -100761
6231 -100761 121976 -138973 -94169 229596 81618 -290316 -71993 -158574 68118 -204535 -19397
6219 -293854 -53691 -268395 10716 98294 140026 10587 -95740 -222724 167698 80180 -37184
6207 -69114 -133858 -24380 24806 310694 973 -95701 -19081 -54493 -340110 3812 220831 -108463
6194 -97461 -127618 -153202 100287 -252699 -230698 -388384 -86861 -103385 143509 -80263 -196814
6183 -196814 41440 -117351 -7495 -81907 50712 168632 145072 -188350 84943 8142 -241023
6171 -187989 -165961 88816 27276 67789 -435802 119364 311405 14321 197427 8321 2957
6159 21130 -139670 75667 30877 45896 -71058 -171008 -138760 -53791 -140782 -62560 -150158 466156
6146 109216 -144214 50660 22774 20242 -277095 -161831 -89113 -192531 -562 156456 -171242
6134 -69395 -55498 87957 -158924 -37951 47336 -267146 -61081 3100 -50966 -70196 162391
6122 -167357 327806 -230977 -120802 57204 -82922 93776 -175326 -23581 122351 -35837 231562
6110 176642 30715 -43597 232512 -203091 -29736 -163211 -312387 39085 -116798 159386
6099 -57597 91292 108340 -252546 429814 -12169 2768 -167703 -91977 -15324 -52261 20348
6087 46863 89906 85578 -53011 72652 -71323 413712 -39032 251132 -278003 279672 121343
6075 -218062 56679 -77903 -145211 -105421 -141186 194800 -39559 86981 204172 -280432 58893
6063 73799 -167346 42158 -121764 -38426 -22615 436530 -222898 208102 309949 -182584
6052 -85686 51451 -116541 111871 48555 81203 11982 -104771 292568 -5780 196187 -170648
6040 7074 233361 -97556 18681 411378 232751 74931 27657 -501483 -156435 12540 -160083
6028 49259 102385 -253465 226325 -42614 -54806 -155244 112908 58477 -6571 -23685 -42447
6017 -42447 83042 -36065 -515817 28484 114680 185300 214740 -37227 -30528 -70480 120511 -325774
6004 160835 -69731 39618 287255 117946 103412 151258 -48383 -72692 -183567 106796 -215027
5992 -56148 -381683 27283 -96763 -184560 232155 98218 -232800 -42334 -39852 -131519 290559
5980 -100613 -32695 68990 70965 185582 88671 -2497 -146653 -29646 -79148 -108957 261449
5968 -270467 44073 -76417 245953 -91891 -401784 -15860 71654 -366076 -140854 -62547 -115957
5957 -115957 -113340 -134065 34366 -201482 156671 121051 73357 -54918 -3926 134669 73571
5946 73571 -48220 -57239 375746 -94100 -63266 -316766 -48425 -60739 -43943 -115554 51434 -138999
5933 243094 -252499 11173 -103960 133390 -57950 -120026 272179 -170398 -117188 -8336 259106
5921 3485 105135 280677 335877 -19177 155101 117114 181368 -339380 -194856 90239 -225880
5909 -131652 -266379 144043 -48556 253441 -68340 -134433 15276 204255 -178748 286020
5898 -20670 -90023 215024 -155874 192831 -74312 -102535 -221505 -96465 -13264 125910 162396
5887 162396 -115153 -39524 263101 289172 148751 -51556 -93554 27306 86276 -283295 312972
5875 -94716 -148485 -73128 -175187 -64278 155872 158531 -93978 -199751 17752 -49549 -129222
5864 -129222 -7626 153259 143792 -72262 -124152 2021 99496 -89672 -27765 32775 -52064 78670
5851 -51039 71968 29726 -12316 -22553 59481 -272324 63190 180114 -77294 -33099 147017
5839 -129795 -213275 -170618 -192108 -34052 87603 22950 -4982 244744 221932 -149891 -94021
5828 -94021 38316 115714 109518 -484358 -257307 30629 -71387 -68393 24732 -119149 93824 -296206
5815 45647 -9276 -115188 -28065 4427 -134279 -172829 150806 501382 -44812 279115 -136152
5803 110916 -64229 56281 -170012 19571 -364226 163759 226596 108736 -27729 -76985 -321900
5792 -321900 121650 157499 295794 -36539 58417 -56543 -525335 -84883 64766 104076 249910
5781 249910 -2052 -28264 185057 138008 -33448 -208508 73593 -127380 24065 -156870 -213860
5770 -213860 99510 -224235 74080 -98822 35492 178350 -101392 -109444 213095 286784 -50979
5758 126167 165029 261723 -12395 -6810 13271 -222957 308177 -177289 -26722 158389 -88577
5746 213690 86718 -53885 135307 75937 7369 -220077 147371 145383 -172440 -181816 -95664
5735 -95664 300262 12865 110056 -500317 197227 -152936 -175353 -77354 84784 -78254 149198
5723 6524 -30855 420737 2252 120627 306299 116781 -30458 124939 83226 295269 -7240
5711 -197005 239266 -225161 187007 262452 76852 -116153 79528 77452 229969 -138491 -2259
5699 -268390 -241114 -361802 -100008 41377 -86740 9300 -101591 5638 -18929 208353 -241371
5687 -162138 74660 -139921 359245 -106201 -52066 325670 183240 -63851 237911 117581
5676 9619 -98993 80627 -62808 -73062 177736 -123610 217285 367024 -98975 -138339 118214
5664 -91805 50393 -65130 -74245 -131188 208163 211420 -236643 -81734 260517 -1177 -1717 -136809
5652 -136809 85721 -10773 -32804 -249 3978 -318860 78834 14316 74185 107415 -287934 65528
5639 -162223 -30770 -384536 -45430 239925 127544 -189647 -75924 -300794 29954 -76026 -244943
5628 -244943 -99749 -123525 14768 -37942 90090 -54746 -342017 79496 21260 -16055 -193489
5617 -193489 -4290 -143771 -153805 -20348 345028 152930 -93416 91432 -40237 20772 -204549
5605 -157376 167170 -56083 -7687 162036 -154744 -5716 107540 -113604 77801 70979 60865
5594 60865 -260721 77375 -173649 -358211 -143849 -176664 -89560 -106954 -36960 156743 346514
5583 346514 25895 -36744 -159698 271823 256740 -22410 -163319 -267226 38039 -59 -87239
5572 -87239 -172776 136283 -246883 37478 70352 203930 -69669 -12730 -327883 107420 -114345
5560 262394 312547 -146795 -104426 26179 155932 -227528 5732 -27858 -335311 42482 195747
5549 195747 -302535 284323 112505 -254448 -74476 108290 31228 27737 98447 -494756 -20500
5537 -410554 8698 -266547 -364328 226405 -72741 -30047 -337545 326498 86041 317714 7761
5525 328444 -235016 83189 -301570 47722 -60417 -117381 -50879 -185831 -119328 182748 249001
5514 249001 -51591 -160363 -20615 -17013 -161308 228649 262077 61822 -6708 120727 -320109
5502 -267074 -187858 -10662 107195 108546 198350 88850 -118894 167589 -59717 -256658 213623
5490 -45137 1427 -299046 97938 97668 238210 98231 -12003 -126284 136826 -57579 137166
5478 333180 -210513 105729 77654 113011 329545 189577 -111001 -145812 91123 -221997
5467 -100727 -103865 228800 -154719 271808 -74485 -11145 -25716 -285836 -5997 240867 -51029
5455 -153734 -58301 81394 320560 -115897 -350541 135332 -41146 -42682 -71708 13943 -117789
5443 54540 392527 -130730 244910 153051 -326472 -129801 72968 30612 -61914 -380780 22744
5431 -43608 144949 -275250 -13349 113407 -9220 85306 -39439 -81194 339499 -94966 152293
5419 -130876 -200641 -146313 57794 166439 -22148 -231075 66943 -20753 -97546 24039 -356733
5407 -144050 20366 -56515 -111478 172600 347695 -206774 -209706 -179727 92444 113766 -222472
5395 -59581 43172 204066 -178282 -7866 -82871 51067 173397 13127 -208509 -227313 168462
5383 292856 -246446 -214208 85391 -135821 -81445 -26266 -24540 -511565 -13133 -47379 465795
5371 -78443 -196098 172189 280933 -166833 -168776 273984 198827 -9891 22512 147523 125977
5360 125977 -54957 -89516 75285 197195 195216 -45412 176218 -25323 -135554 23124 -5994
5348 -353776 244027 -266861 298108 100677 289766 215690 -67125 -146048 -83174 260911
5337 -105301 134547 -11812 -38465 -48354 -50998 185112 -189790 807 -150986 -85798 -257711
5326 -257711 -270968 -69187 -59829 -104865 -17748 107728 234155 20964 -71236 45510 58613
5315 58613 63893 -17593 160318 256707 -77418 5874 -30363 107018 -171865 -37019 -151445
5304 -151445 3050 -57857 -98654 203598 156484 26883 -49614 -235200 172986 49383 36903
5293 36903 -130145 -146571 174196 -104109 -238844 -86929 -22831 -88521 211279 349330 12320
5281 -53856 191463 148333 -127444 42675 222804 192597 -62381 133427 -155039 -289666 -13672
5269 -45103 118083 -83751 -141330 194364 67494 -17937 -70493 -141180 -13370 103665 199521
5258 199521 45103 259570 144081 -339731 47688 2629 -65161 20759 248765 198168 -97101
5246 -391320 123884 90344 28860 -103789 186510 -68631 153753 32265 133076 -144905
5235 -97969 -107743 -203104 -212662 12307 -231799 -178429 258194 144360 68184 244818 114107
5223 82456 -134595 -133480 -24362 -84357 -87488 85472 44026 91795 101719 -137858 -48958 247
5210 45627 -98262 187209 57675 51194 -31571 171792 -20954 -37656 -47364 -254955 25356 129233
5198 129233 -230563 244760 112739 -68880 -179682 231776 37525 -38260 81346 65574 -90580
5186 -126372 -320467 -25426 -26579 85928 -355748 95546 1459 291038 -191912 -64912 -234092
5175 -234092 -15293 -142627 184855 105239 257382 30513 -100257 -10375 36526 127678 -137759
5163 193502 -62226 -181334 -183397 160381 -124323 -126917 -183589 -146528 73044 -96914 -61531
5152 -61531 1676 -1241 -141345 -233433 11344 -452319 269921 4537 179396 -154963 -30957
5140 42761 192634 -141608 -79778 -133789 61860 -38279 223194 -74341 -98166 -45235 -254711
5129 -254711 -130639 -28902 -12037 -167974 -197751 31714 -33336 -161695 237847 -2359 -72325
5118 -72325 103351 325324 69051 -23120 290904 60288 -198846 39310 -60529 -281624 -109132
5106 -233005 -131889 454393 45892 139809 -75367 -260940 -3842 -11944 363477 -54945 -23628
5094 166124 185965 -264991 -57288 -196805 77560 46500 -76770 58224 -6845 24214 -40842
5082 -7915 -343140 -381850 225968 -109560 135967 92637 208553 147538 63524 -167591 82273
5070 285613 65266 228828 -119768 -240557 -50829 -19989 -218963 119094 -128559 -312052
5060 -312052 -10619 11701 16203 -6805 -30591 -127238 87708 -33576 98765 376460 -46670 59192
5047 82144 518896 -201568 -104566 275866 -300148 67736 -34264 9392 -270716 93495 -171330
5035 121405 -195260 -54294 29176 246735 -441160 282478 86871 -2248 -130059 250764 248607
5024 248607 103435 285638 -116501 291169 -63699 58490 52088 -149387 -100746 -203516 -104704
5013 -104704 40167 -121928 269033 -300184 123614 236972 169726 75204 180259 64815
5002 -41962 -219551 100760 134171 460354 -75930 -134385 -212964 176010 17140 -66029 -13378
4990 91810 260135 141963 430040 -175348 -154769 -184281 240771 -8282 437092 -15679 48624
4978 163253 56713 -52959 138051 -199017 -65202 -205423 223470 67540 26078 -14994 -45426
4967 -45426 -176224 69901 82498 -25243 60650 -132513 -126139 -93670 102642 -281067 107726
4955 -136102 -16089 81508 350096 68458 -155815 -155071 -250149 110925 -61288 -341965 -310500
4944 -310500 -6836 -180930 56528 274813 335592 182872 143266 145338 -110810 -35392 -78900
4933 -78900 74584 132505 -128272 6422 6954 -229531 -102754 -31912 93966 244958 347464
4922 347464 -62624 -13435 19116 -196642 -85605 -137167 -58923 -71463 -144303 -14697 58529
4910 -295498 57890 -88784 45219 109433 -64 -253619 -67296 -52642 32456 -69011 -44337 -153705
4898 -153705 -12000 17322 85976 39914 204662 -20457 -79483 159481 82108 -150677 153565
4886 257747 -92689 -11325 -251692 -110788 151861 -331592 269217 208412 166877 -83484 -20519
4874 -24287 -117009 -125496 125899 -14908 -117156 74744 -27125 109289 365460 1740 -256539
4862 49574 216436 -20656 37011 -59496 154866 -54024 194994 300740 95975 150876 -98559
4850 -31836 208929 81436 -7177 -228062 -234643 116630 10104 -44735 43102 65939 116711 146829
4838 146829 -144319 -77221 -186710 -112642 -20657 -296578 -176313 -82291 125481 64248 -45175
4826 -188752 59425 -68781 146848 72641 -84472 -181382 65662 120132 239586 373186 482491
4815 482491 5962 87993 181567 100152 -314526 242574 180713 89722 -118911 192919 -36776
4803 -208584 -109303 -32389 -42768 152286 285287 8829 -203521 112331 116836 -185364 -40528
4791 -48398 221979 -62754 -211005 -56714 -157739 -198002 136444 -147334 73786 28240 -218116
4779 59101 -269102 171904 -21076 -11842 19003 130342 -22966 94589 161263 -236594 279021
4767 246598 142183 -79164 -203862 -34241 266814 217797 -183468 147168 -15491 -376188
4757 -376188 -112017 82964 -11221 188808 47501 -177453 202504 83037 99975 -223527 -34162
4745 -136756 -61242 19392 -14042 100766 44963 -36669 26704 -110569 188556 13778 -14383
4733 -238884 -51219 214815 223993 -48918 14148 54898 -25203 -147263 353794 936 -120459
4721 -154091 60360 -266419 -106485 114846 -151822 97771 199545 17913 -338979 290775
4710 -78585 16878 36132 -124186 120217 -79929 51892 -153666 -23829 176668 -153580 -84915
4699 -84915 110682 67618 -118795 -51493 -45725 -27630 22500 65338 228049 -27589 -9216 -60428
4687 -60428 -312607 -21564 282006 169697 -48539 -143983 -94242 31407 -173986 242286 227384
4676 227384 -41549 -269372 328799 229429 -147202 13501 199954 264250 -126070 100915
4665 -158778 204673 295530 -54494 28019 232334 19732 -159684 253398 39051 214208 -245565
4653 133492 102546 -295373 139966 -149209 16142 123702 105922 -47413 104012 -144848
4642 -38452 168618 51587 -293804 321770 141914 -62631 -160889 -316653 17921 -195184 -148433
4631 -148433 -7451 -256697 109316 -113328 283551 293217 -70782 -45758 270666 -171816 -395453
4620 -395453 48153 33940 -78638 132039 404963 294531 181974 -252908 191839 -257662
4609 76035 295763 -4471 -200040 -37 63549 121044 6678 173765 108616 65168 -20864 -290015
4597 -290015 3683 -111947 -94380 -7641 85086 -164733 51799 -220738 146389 109690 79720
4586 79720 253249 106868 40232 81875 128619 -72968 36121 65885 114125 -42934 325774
4574 -106076 -353847 -127211 207240 1376 -134135 -192054 -40679 -90986 58115 -323681 -41041
4562 305945 312350 209456 193001 -115713 133162 -343032 -162670 214097 -152556 42966
4551 82716 -95555 91035 69479 73136 -289172 -94876 -82254 -123057 181693 -12807 483527
4539 -169557 -66412 325497 -84929 -82637 232741 -12672 131906 -3114 -42265 -144197 26499
4527 505772 19356 15552 191698 298344 275428 114411 -113751 218230 30964 37337 -315259
4515 176083 -163680 316620 -131215 151956 137526 -273081 192332 28641 -100996 -293914
4505 -293914 153559 84200 -301888 -426059 106236 57412 216932 1162 256109 215099 -14223
4493 162833 209946 252981 -166808 175145 193467 -44453 158330 79424 147176 -32695 163805
4481 70182 -30220 82290 31547 -38164 -268296 105633 -143223 247682 -304290 106189 95069
4470 95069 218702 55967 -66428 84014 45142 -57144 -239460 44713 207343 -157409 -3221
$$ [...]
##END NTUPLES=NMR SPECTRUM
##END=
