##TITLE=AC1456_PAST113262_8026711_zgmu2fensB
##JCAMPDX= 6.0         $$ Bruker NMR JCAMP-DX V2.0
##DATA TYPE= NMR SPECTRUM
##DATA CLASS= NTUPLES
##ORIGIN= BRUKER
##OWNER= Administrator
$$ 1.72 TOPSPIN		Version 2.1
$$ 2013-07-11 15:10:45.259 -0700  Administrator@X
$$ Compression mode = diff/dup
##.OBSERVE FREQUENCY= 400.02188249412
##.OBSERVE NUCLEUS= ^1H
##.ACQUISITION MODE= SIMULTANEOUS (DQD)
##.ACQUISITION SCHEME= undefined
##.AVERAGES= 64
##.DIGITISER RES= 22
##SPECTROMETER/DATA SYSTEM= spect
##.PULSE SEQUENCE= noesygpps1d.comp
##.SOLVENT NAME= COFFEE_meoh
##.SHIFT REFERENCE= INTERNAL, COFFEE_meoh, 1, 14.96109
##AUDIT TRAIL= $$ (NUMBER, WHEN, WHO, WHERE, PROCESS, VERSION, WHAT)
$$ ##TITLE= Audit trail, TOPSPIN		Version 2.1
$$ ##JCAMPDX= 5.01
$$ ##ORIGIN= Bruker BioSpin GmbH
$$ ##OWNER= Administrator
$$ $$ E:\/data/COFFEE/nmr/AC1456_PAST113262_8026711_zgmu2fensB/12/pdata/1/auditp.txt
$$ ##AUDIT TRAIL=  $$ (NUMBER, WHEN, WHO, WHERE, PROCESS, VERSION, WHAT)
(   1,<2013-07-11 15:10:40.337 -0700>,<Administrator>,<X>,<go>,<TOPSPIN 2.1>,
      <created by zg
	started at 2013-07-11 14:59:10.910 -0700,
	POWCHK enabled, PULCHK disabled,
       configuration hash MD5:
       C8 4E 4E 5D D3 5C D8 9E 9F 52 82 E0 59 8A DE 15
       data hash MD5: 64K
       3E 34 45 E6 CE 20 D0 54 CC 23 9D DA D7 97 50 6E>)
(   2,<2013-07-11 15:10:43.337 -0700>,<Administrator>,<X>,<proc1d>,<TOPSPIN 2.1>,
      <Start of raw data processing
       efp LB = 0.3 FT_mod = 6 PKNL = 1 PHC0 = 0 PHC1 = 0 SI = 128K 
       data hash MD5: 128K
       2F 71 87 00 6C B0 56 E0 7D 06 E4 2C EC 8B C8 B5>)
(   3,<2013-07-11 15:10:44.306 -0700>,<Administrator>,<X>,<proc1d>,<TOPSPIN 2.1>,
      <pk PHC0 = -78.75 PHC1 = 0 
       data hash MD5: 128K
       13 96 AE 1A E5 4F A8 45 45 A7 41 DE 5D 40 0B C1>)
(   4,<2013-07-11 15:10:44.712 -0700>,<Administrator>,<X>,<proc1d>,<TOPSPIN 2.1>,
      <abs ABSG = 1 
       data hash MD5: 128K
       07 52 72 65 DA 0F 97 8B 9F EC 06 FE 89 C6 90 50>)
(   5,<2013-07-11 15:10:44.822 -0700>,<Administrator>,<X>,<proc1d>,<TOPSPIN 2.1>,
      <abs ABSG = 2 
       data hash MD5: 128K
       7B 04 41 A5 90 C0 CF F2 D1 E0 CE B5 95 3D 26 12>)
(   6,<2013-07-11 15:10:44.915 -0700>,<Administrator>,<X>,<proc1d>,<TOPSPIN 2.1>,
      <abs ABSG = 3 
       data hash MD5: 128K
       B4 BD DD B6 C3 77 CB 91 9F 72 60 A4 3B 47 87 54>)
(   7,<2013-07-11 15:10:44.993 -0700>,<Administrator>,<X>,<proc1d>,<TOPSPIN 2.1>,
      <abs ABSG = 4 
       data hash MD5: 128K
       11 E1 80 C6 A9 A6 BD 7A 38 F2 A2 9F B0 40 FE EE>)
(   8,<2013-07-11 15:10:45.072 -0700>,<Administrator>,<X>,<proc1d>,<TOPSPIN 2.1>,
      <abs ABSG = 5 
       data hash MD5: 128K
       35 85 BF 05 A0 8D 83 3E 7D A5 43 1D 3C B7 4B 17>)
$$ ##END=
$$ 
$$ $$ hash MD5
$$ $$ 0A AB 9F BE B5 7A DE 8E 86 8B 34 12 34 A9 B1 CE
##$RELAX= 
##$RELAX= 
##$RELAX= 
##$RELAX= 
##$RELAX= 
##$RELAX= 
##$RELAX= 
##$RELAX= 
$$ Bruker specific parameters
$$ --------------------------
##$DU= <E:\>
##$EXPNO= 12
$$ [...]
150 150 150 150 150 150 150 150
##$TP07= 0
##$TPNAME0= <>
##$TPNAME1= <>
##$TPNAME2= <>
##$TPNAME3= <>
##$TPNAME4= <>
##$TPNAME5= <>
##$TPNAME6= <>
##$TPNAME7= <>
##$TPOAL= (0..7)
0.5 0.5 0.5 0.5 0.5 0.5 0.5 0.5
##$TPOFFS= (0..7)
0 0 0 0 0 0 0 0
##$TUNHIN= 0
##$TUNHOUT= 0
##$TUNXOUT= 0
##$USERA1= <user>
##$USERA2= <user>
##$USERA3= <user>
##$USERA4= <user>
##$USERA5= <user>
##$V9= 5
##$VALIST= <valist>
##$VCLIST= <CCCCCCCCCCCCCCC>
##$VD= 0
##$VDLIST= <DDDDDDDDDDDDDDD>
##$VPLIST= <PPPPPPPPPPPPPPP>
##$VTLIST= <TTTTTTTTTTTTTTT>
##$WBST= 1024
##$WBSW= 4
##$XGAIN= (0..3)
0 0 0 0
##$XL= 0
##$YL= 0
##$YMAX_a= 6261824
##$YMIN_a= -12378112
##$ZGOPTNS= <>
##$ZL1= 120
##$ZL2= 120
##$ZL3= 120
##$ZL4= 120
##$ABSF1= 14.96109
##$ABSF2= -5.597092
##$ABSG= 5
##$ABSL= 3
##$ALPHA= 0
##$AQORDER= 0
##$ASSFAC= 0
##$ASSFACI= 0
##$ASSFACX= 0
##$ASSWID= 0
##$AUNMP= <proc_prof1d_extract.lims>
##$AXLEFT= 0
##$AXNAME= <>
##$AXNUC= <1H>
##$AXRIGHT= 0
##$AXTYPE= 0
##$AXUNIT= <>
##$AZFE= 0.1
##$AZFW= 0.1
##$BCFW= 0
##$BC_mod= 0
##$BYTORDP= 0
##$COROFFS= 0
##$CY= 15
##$DATMOD= 1
##$DC= 0
##$DFILT= <>
##$DTYPP= 0
##$F1P= 0
##$F2P= 0
##$FCOR= 0.5
##$FTSIZE= 131072
##$FT_mod= 6
##$GAMMA= 0
##$GB= 0
##$INTBC= 1
##$INTSCL= 1
##$ISEN= 128
##$LB= 0.3
##$LEV0= 0
##$LPBIN= 0
##$MAXI= 10000
##$MC2= 0
##$MEAN= 0
##$ME_mod= 0
##$MI= 0
##$NCOEF= 0
##$NC_proc= -2
##$NLEV= 6
##$NOISF1= 0
##$NOISF2= 0
##$NSP= 0
##$NTH_PI= 0
##$NZP= 0
##$OFFSET= 14.96109
##$PC= 1
##$PHC0= -78.75
##$PHC1= 0
##$PH_mod= 1
##$PKNL= yes
##$PPARMOD= 0
##$PPDIAG= 0
##$PPIPTYP= 0
##$PPMPNUM= 2147483647
##$PPRESOL= 1
##$PSCAL= 4
##$PSIGN= 0
##$PYNMP= <proc.py>
##$REVERSE= no
##$SF= 400.020009600461
##$SI= 131072
##$SIGF1= 0
##$SIGF2= 0
##$SINO= 400
##$SIOLD= 131072
##$SPECTYP= <>
##$SREGLST= <1H.CDCl3>
##$SSB= 0
##$STSI= 131072
##$STSR= 0
##$SW_p= 8223.68421052631
##$SYMM= 0
##$S_DEV= 0
##$TDeff= 65536
##$TDoff= 0
##$TI= <>
##$TILT= no
##$TM1= 0
##$TM2= 0
##$TOPLEV= 0
##$USERP1= <user>
##$USERP2= <user>
##$USERP3= <user>
##$USERP4= <user>
##$USERP5= <user>
##$WDW= 1
##$XDIM= 131072
##$YMAX_p= 441303202
##$YMIN_p= -11141
##$CURPLOT= <Network HP LaserJet P1505>
##$CURPRIN= <$Network HP LaserJet P1505>
##$DFORMAT= <normdp>
##$LAYOUT= <+/1D_H.xwp>
##$LFORMAT= <normlp>
##$PFORMAT= <normpl>
##$SURQMSG= 1
$$ End of Bruker specific parameters
$$ ---------------------------------
##NTUPLES= NMR SPECTRUM
##VAR_NAME=  FREQUENCY,     SPECTRUM/REAL,   SPECTRUM/IMAG
##SYMBOL=    X,             R,               I
##VAR_TYPE=  INDEPENDENT,   DEPENDENT,       DEPENDENT
##VAR_FORM=  AFFN,          ASDF,            ASDF
##VAR_DIM=   131072,        131072,          131072
##UNITS=     HZ,            ARBITRARY UNITS, ARBITRARY UNITS
##FACTOR=    0.0627417313425164, 1,          1
##FIRST=     8223.62146879497, 1722,         -54368
##LAST=      0,             2356,            -54879
##MIN=       0,             -11141,          0
##MAX=       8223.62146879497, 441303202,    0
$$ Real data points
##PAGE= N=1
##DATA TABLE= (X++(R..R)), XYDATA
$$ [...]
63940B237671K06223K15167K23002K28839K30805K27076K16628J99382J76167
63931D160960J48613J18644Q7551N5476K2001j2647m7343q1065j13465j43950
63921D194775j70694j91467k05486k13789k17829k18338k15582k09797k01089
63912B350704j89610j76202j62200j48287j34178j19836j06211r4264q3872p4432
63902A061612o5868n8386n1684m5321l9534l4923l1463k8552k5850k3418k1225
63891F35388j9162j7444j6319j5513j4576j3568j2763j1891j0450q696p378o491
63879D81137n192l170j118M67K115M394O819Q550R654J0899J2524J3947J4703
63866E55729J5009J5267J5527J5620J5417J4739J3444J1786J0403R509Q355O003
$$ y = [2237671, 2443894, 2659061, 2882063, 3110902, 3341707, 3568783, 3785411, 3984793, 4160960, 4309573, 4428217, 4515768, 4571244, 4593245, 4580598, 4533255, 4452190, 4338725, 4194775, 4024081, 3832614, 3627128, 3413339, 3195510, 2977172, 2761590, 2551793, 2350704, 2161094, 1984892, 1822692, 1674405, 1540227, 1420391, 1314180, 1219916, 1136044, 1061612, 995744, 937358, 885674, 840353, 800819, 765896, 734433, 705881, 680031, 656613, 635388, 616226, 598782, 582463, 566950, 552374, 538806, 526043, 514152, 503702, 495006, 487628, 481137, 475945, 472775, 471657, 472124, 474239, 478633, 485452, 494002, 503656, 514555, 527079, 541026, 555729, 570738, 586005, 601532, 617152, 632569, 647308, 660752, 672538, 682941, 692450, 700805, 706808]
63854G06808K553q50l325n054o639q212r604j0942j2515j4277j5982j7577j8951
63841E85433j9580j9135j8322j8234j8854j9029j8087j6614j5406j4493j3720
63830C93959j3336j3332j2922j1541r919r211r429r480q689p426o351n699n390
63817B71234n233m871m013k847j917j539j555j624j539j309j138j266j649j941
63803B38793j933j818j856k043k271k482k511k125j516j254j550j923j933j722
63789B11856j470r76k65mo09j449j648j279r94q84n50m1J99J51K14M15M26K76
63771B03368K68L07M8l44l75j07q8l47l07K15O22L42n51j575k109j511J93J773
63753A99822J805M41o55l68O70J279J210R95R34R60J081J395J819K147K307K368
$$ y = [706808, 709361, 708511, 705186, 700132, 693493, 685281, 675677, 664735, 652220, 637943, 621961, 604384, 585433, 565853, 546718, 528396, 510162, 491308, 472279, 454192, 437578, 422172, 407679, 393959, 380623, 367291, 354369, 342828, 332909, 323698, 314269, 304789, 296100, 288674, 282323, 276624, 271234, 266001, 261130, 257117, 254270, 252353, 250814, 249259, 247635, 246096, 244787, 243649, 242383, 240734, 238793, 236860, 235042, 233186, 231143, 228872, 226390, 223879, 221754, 220238, 218984, 217434, 215511, 213578, 211856, 210386, 209410, 209145, 209141, 208532, 207083, 205435, 204156, 203162, 202278, 201728, 201687, 201886, 202037, 202251, 202666, 203092, 203368, 203636, 203943, 203991, 203647, 203272, 203165, 203077, 202730, 202423, 202638, 203260, 203602, 203051, 201476, 199367, 197856, 198049, 199822, 201627, 202068, 201413, 201045, 201715, 202994, 204204, 205199, 206133, 207093, 208174, 209569, 211388, 213535, 215842, 218210]
63737B18210K460K746L215L506L232K494J748J263J016J064J479K052K508K957
63723B49950L660M436M909N167N541N893N801N347M856M057K430L87j012j638
63709B99784k425l732m758m987n007n222m923l513j735o95l90j30K38N02Q89J677
63693B65573K408K503K329K679L439L780L533L371L520L289K189P82k9n5J81J66
63677B99658j81o05q39p74m17K50J128J714J479P26N85J674L187L833L343K403
63661C17164J386Mj747l222l994m464n191n995o184n445m152k968k384k494k851
63646B67463k679j605k57K78k73r19n61O60J663J959K230L114M154M479M134L971
63630B87811M413N013N278N297N461O071P275Q879J0165J0529J0423J1049J2845
$$ y = [218210, 220670, 223416, 226631, 230137, 233369, 235863, 237611, 238874, 239890, 240954, 242433, 244485, 246993, 249950, 253610, 258046, 262955, 268122, 273663, 279556, 285357, 290704, 295560, 299617, 302047, 302434, 301422, 299784, 297359, 293627, 288869, 283882, 278875, 273653, 268730, 265217, 263482, 262787, 262397, 262267, 262505, 263007, 263896, 265573, 267981, 270484, 272813, 275492, 278931, 282711, 286244, 289615, 293135, 296424, 298613, 299395, 299366, 299311, 299492, 299658, 299477, 298872, 298033, 297259, 296842, 297092, 298220, 299934, 301413, 302139, 302724, 304398, 307585, 311418, 314761, 317164, 318550, 318554, 316807, 313585, 309591, 305127, 299936, 293941, 287757, 282312, 278160, 275192, 272808, 270314, 267463, 264784, 263179, 262922, 263200, 262927, 262008, 261447, 262107, 263770, 265729, 267959, 271073, 275227, 279706, 283840, 287811, 292224, 297237, 302515, 307812, 313273, 319344, 326619, 335498, 345663, 356192, 366615, 377664, 390509]
63617C90509J4949J6429J7429J8653K0301K2112K4039K6288K8817L1214L3037
63606F43777L3897L3411L1295K7417K1805J4878P754J767k586n811q286r607r455
63593G80256q535p929p915q133q717j0486j3851j8089k1877k4255k5047k4583
63581F00839k3304k1521j9481j7452j5545j3521j1119q604o621n403m453l129
63569D50686j294P42K547L858M885O229Q084R643J0035R667R756J0496J0960J1056
63555E47350J2167J5034J8352K0645K2489K5515K9951L4697L9247M3674M6679
63544H55800M5506L8591K7334J4779L388n552j1492j4558j5526j5207j3859j1515
63532H97689q585n916m384m516o294r310j3230j7926k2913k7112k9736l1137l2108
$$ y = [390509, 405458, 421887, 439316, 457969, 478270, 500382, 524421, 550709, 579526, 610740, 643777, 677674, 711085, 742380, 769797, 791602, 806480, 814234, 816001, 813415, 807604, 799318, 789711, 780256, 771721, 763792, 755877, 747744, 739027, 728541, 714690, 696601, 674724, 650469, 625422, 600839, 577535, 556014, 536533, 519081, 503536, 490015, 478896, 470292, 463671, 458268, 453815, 450686, 449392, 450134, 452681, 456539, 461424, 467653, 475737, 485380, 495415, 505082, 514838, 525334, 536294, 547350, 559517, 574551, 592903, 613548, 636037, 661552, 691503, 726200, 765447, 809121, 855800, 901306, 939897, 967231, 982010, 985398, 979846, 968354, 953796, 938270, 923063, 909204, 897689, 889104, 883188, 878804, 874288, 867994, 858684, 845454, 827528, 804615, 777503, 747767, 716630, 684522]
63519F84522l2585l1794k9663k7125k4908k2884k0818j8959j7438j5857j3928
63508D28563j2040j0674r742q891q044p177o045m668l662l517l810l699l035k414
63494C41145k216k114j671r27k48J90M65O12N42L13L69J229K800M200M542L896
63478C53127L196L215L897M722N279N320M622L173J405j22j223k085k872l580
63464C78074m256m988n661n912n555m881m322l916l327k384j334m70K36R62J736
63449C34002K538L582N069O753Q116R021R866J1011J2406J3907J5645J7918K0953
63436D70787K4778K8927L2131L2840L0418K5579J9553J3234P377K966P74P76K476
63423F92616N511R573J4088J8584K3164K8076L2892L6691L8861L9190L7296L2665
$$ y = [684522, 651937, 620143, 590480, 563355, 538447, 515563, 494745, 475786, 458348, 442491, 428563, 416523, 405849, 396107, 387216, 379172, 371995, 365950, 361282, 357620, 354103, 350293, 346594, 343559, 341145, 338929, 336815, 335144, 334217, 333969, 334159, 334624, 335236, 335778, 336091, 336460, 337689, 340489, 344689, 349231, 353127, 356323, 359538, 363435, 368157, 373436, 378756, 383378, 386551, 387956, 387834, 386611, 384526, 381654, 378074, 373818, 368830, 363169, 357257, 351702, 346821, 342499, 338583, 335256, 332872, 331538, 331068, 331304, 332266, 334002, 336540, 340122, 345191, 351944, 360060, 369081, 378947, 389958, 402364, 416271, 431916, 449834, 470787, 495565, 524492, 556623, 589463, 619881, 645460, 665013, 678247, 685624, 688590, 689364, 690140, 692616, 698127, 707700, 721788, 740372, 763536, 791612, 824504, 861195, 900056, 939246, 976542, 1009207]
63411A009207K5513J7088Q891J779m080q694j1862j3162j2479j0579r023r097
63399I83502j1015j4273j8420k3016k7236l0310l2315l3907l5162l5242l3473
63388F89133l0290k6892k4191k2266k0600j8679j6441j4140j1820r201o252l530
63376D84831j522L0J701L527N125O408P671R059J0562J2427J4862J7392J9158
63363E91231K0082K1108K3113K6025K9169L2008L4363L6328L8008L9059L8470
63352I28964L5379L0034K3475J6305Q548P18n836j0100j2226j2847j2274j0907
63340I79233r817j0128j2014j4867j8171k1728k5208k8118l0175l1364l1580l0595
63328G15468k8450k5600k2556j9482j6139j2134p407k670N59O81k845q821j4813
$$ y = [1009207, 1034720, 1051808, 1060699, 1062478, 1058398, 1049704, 1037842, 1024680, 1012201, 1001622, 992599, 983502, 972487, 958214, 939794, 916778, 889542, 859232, 826917, 793010, 757848, 722606, 689133, 658843, 631951, 607760, 585494, 564894, 546215, 529774, 515634, 503814, 494613, 488361, 484831, 483309, 483339, 485040, 488567, 493692, 500100, 507771, 516830, 527392, 539819, 554681, 572073, 591231, 611313, 632421, 655534, 681559, 710728, 742736, 777099, 813427, 851435, 890494, 928964, 964343, 994377, 1017852, 1034157, 1042705, 1043423, 1037587, 1027487, 1015261, 1002414, 990140, 979233, 969416, 959288, 947274, 932407, 914236, 892508, 867300, 839182, 809007, 777643, 746063, 715468, 687018, 661418, 638862, 619380, 603241, 591107, 583700, 581030, 581589, 582270, 579425, 570604, 555791]
63315E55791j8654j9770j9151j8044j6916j5603j4015j2277j0445q562o972o150
63303C89232o186o583o589n673l940k280j710k166k411j609n74p52k257l762m246
63288C38494l916l425k995k664k581k714k709k367j840j270p30n56j090j925k119
63273C05593j367m17rq5l07p14j340j731j400m15Q04J979K887L199K830K236J946
63256C13689K022K210K408K666K894K884K599K318K535L575N103O203O344O128
63242C63578O614Q029R658J0908J1818J2589J3365J4481J6154J7836J8698J8891
63230E22619J9434K0663K1746K2085K2138K2317K2111K1071J9800J9170J9192
63219G52346J9418J9849K0619K1377K1787K2073K2289K1602J9232J5649J1847
$$ y = [555791, 537137, 517367, 498216, 480172, 463256, 447653, 433638, 421361, 410916, 402354, 395382, 389232, 383046, 376463, 369874, 364201, 360261, 357981, 356271, 354105, 351694, 350085, 349511, 348759, 346502, 342740, 338494, 334578, 331153, 328158, 325494, 322913, 320199, 317490, 315123, 313283, 312013, 311283, 310727, 309637, 307712, 305593, 304226, 303809, 303800, 303715, 303408, 302694, 301354, 299623, 298223, 297808, 298612, 300591, 303478, 306677, 309507, 311743, 313689, 315711, 317921, 320329, 322995, 325889, 328773, 331372, 333690, 336225, 339800, 344903, 351106, 357450, 363578, 370192, 378221, 387879, 398787, 410605, 423194, 436559, 451040, 467194, 485030, 503728, 522619, 542053, 562716, 584462, 606547, 628685, 651002, 673113, 694184, 713984, 733154, 752346, 771764, 791613, 812232, 833609, 855396, 877469, 899758, 921360, 940592, 956241, 968088]
63208I68088P822K835l070q851j3766j7947k1624k4574k6603k7871k8570k8700
63196G77169k8232k7063k4891k1632j7921j4689j2203r977p553m907k160O29L372
63183F09942N978Q425J0489J1682J1955J2211J3437J5363J6632J6388J5151J4052
63171G61705J3667J3823J4091J4157J3871J3163J1873R743O627K721j479n359
63159H68603q534j1230j4254j8081k2002k4767k6082k6735k7061k6354k4301k2003
63147F17199k0657j9919j8613j6482j4222j2170j0178q512p733p659p499p030
63135D66525o724o569n872m427k947j974j191k04P24J209J399J604J752J697J702
63120D46704K151K984L722L995L837L577L444L287K763J928J339J363J645J698
$$ y = [968088, 975910, 978745, 975675, 966824, 953058, 935111, 913487, 888913, 862310, 834439, 805869, 777169, 748937, 721874, 696983, 675351, 657430, 642741, 630538, 620561, 613008, 608101, 605941, 606570, 609942, 615920, 624345, 634834, 646516, 658471, 670682, 684119, 699482, 716114, 732502, 747653, 761705, 775372, 789195, 803286, 817443, 831314, 844477, 856350, 866093, 872720, 875441, 873962, 868603, 860069, 848839, 834585, 816504, 794502, 769735, 743653, 716918, 689857, 663503, 639202, 617199, 596542, 576623, 558010, 541528, 527306, 515136, 504958, 496446, 488713, 481054, 473555, 466525, 459801, 453232, 447360, 442933, 439986, 438012, 436821, 436617, 437341, 438550, 439949, 441553, 443305, 445002, 446704, 448855, 451839, 455561, 459556, 463393, 466970, 470414, 473701, 476464, 478392, 479731, 481094, 482739, 484437]
63106D84437J635J792J971J757J332J202J239Q67J29l30l80o10j182j403q53j29
63090D91474M0k24l56k24m4J61M94Q18R48R61J017J060J003J074J660K885M440
63073E07187N701O076N532M865N139O643Q655J0218J0996J1328J1804J2849J4444
63060F21437J6196J7844J9619K1892K4627K7484L0237L2817L5153L7476M0395
63049I25177M4058M7554M9918N1493N3279N5049N5353N3660N1350M9977M9475
63038A486343M8816M7689M6690M6305M6476M6914M7259M6988M5611M2868L8625
63027A990584L2746K5212J6074N264p005j9703l1452m1750n1010n9169o5180o8363
63015A726248o9398o9254o7849o4649n9982n4713m8999m2391l5100k8135k2039
$$ y = [484437, 486072, 487864, 489835, 491592, 492924, 494126, 495365, 496232, 496361, 496031, 495651, 495041, 493859, 492456, 491603, 491474, 491514, 491290, 490934, 490710, 490666, 490827, 491321, 492139, 493087, 494048, 495065, 496125, 497128, 498202, 499862, 502747, 507187, 512888, 518964, 524496, 529361, 534500, 541143, 549798, 560016, 571012, 582340, 594144, 606993, 621437, 637633, 655477, 675096, 696988, 721615, 749099, 779336, 812153, 847306, 884782, 925177, 969235, 1016789, 1066707, 1118200, 1171479, 1226528, 1281881, 1335541, 1386891, 1436868, 1486343, 1535159, 1582848, 1629538, 1675843, 1722319, 1769233, 1816492, 1863480, 1909091, 1951959, 1990584, 2023330, 2048542, 2064616, 2069880, 2062875, 2043172, 2011720, 1969970, 1918960, 1859791, 1794611, 1726248, 1656850, 1587596, 1519747, 1455098, 1395116, 1340403, 1291404, 1249013, 1213913, 1185778, 1163739]
63004A163739j6338j0516m814K82M818R175J3386J7050J9852K1894K3499K4855
62992A266882K5899K6474K6538K6232K5849K5697K5790K5585K4237K1436J7773
62981A538392J3943R843M797j484q714j6580k4754l2432l8659m3258m6848m9762
62969A304484n1709n2517n2397n1276m8825m5444m2280l9717l6912l3473l0465
62958H19469k8853k7845k6056k3567k1512k0152j8793j7389j6664j6536j5834
62947E86268j4080j2374j1867j2239j2359j1846j1239j0989j0897j0487r544q279
62935D50068p085o150n380m719m304m031l371k145j122j178k025k553k365k137
62921D01503k324k520k369k305k770l395l535l218k911k673k201j504j038j089
$$ y = [1163739, 1147401, 1136885, 1132071, 1132353, 1137171, 1146346, 1159732, 1176782, 1196634, 1218528, 1242027, 1266882, 1292781, 1319255, 1345793, 1372025, 1397874, 1423571, 1449361, 1474946, 1499183, 1520619, 1538392, 1552335, 1562178, 1566975, 1565491, 1556777, 1540197, 1515443, 1483011, 1444352, 1401094, 1354246, 1304484, 1252775, 1200258, 1147861, 1096585, 1047760, 1002316, 960036, 920319, 883407, 849934, 819469, 790616, 762771, 736715, 713148, 691636, 671484, 652691, 635302, 618638, 602102, 586268, 572188, 559814, 547947, 535708, 523349, 511503, 500264, 489275, 478378, 467891, 458347, 450068, 442983, 436833, 431453, 426734, 422430, 418399, 415028, 412883, 411761, 410583, 408558, 406005, 403640, 401503, 399179, 396659, 394290, 391985, 389215, 385820, 382285, 379067, 376156, 373483, 371282, 369778, 368740, 367651]
62907C67651j464j759j758j572j483j613j644j162l19K67M18P38J669K591K442
62892C63002J072n42j420j385p72K6N92N70P2k33J96J187K085K422K076J162O2
62875C70172n54k39O46J253J207Q45M83n2q78j577j678j358j080p75j09O32P02
62858C67640J12j35O15J699K038J557J012Q58R29J141J722K604L165K872J856
62843C89685P22j1j30K12O04O69M57L20L71K94j46o42o04J83J341K217K367J794
62825C99703R55M49N83J130J602J761J798J981K301K576K800L123L469L532L293
62810D31056L167L378L523L312L384M621O618P782P317O334O359P406Q296Q474
62796E11027Q507Q903R462J0032J1145J3320J6235J9099K1582K4013K6799L0087
$$ y = [367651, 366187, 364428, 362670, 361098, 359615, 358002, 356358, 355196, 354877, 355144, 355562, 356300, 357969, 360560, 363002, 364074, 363532, 362112, 360727, 359955, 359981, 360573, 361143, 361215, 360982, 361178, 362365, 364450, 366872, 368948, 370110, 370172, 369618, 369379, 370025, 371278, 372485, 373330, 373813, 373761, 372883, 371306, 369628, 368270, 367190, 366415, 366306, 366938, 367640, 367752, 367617, 368232, 369931, 371969, 373526, 374538, 375396, 376325, 377466, 379188, 381792, 384957, 387829, 389685, 390407, 390396, 390266, 390478, 391082, 391751, 392208, 392528, 392899, 393193, 393047, 392405, 391801, 391984, 393325, 395542, 397909, 399703, 400658, 401107, 401690, 402820, 404422, 406183, 407981, 409962, 412263, 414839, 417639, 420762, 424231, 427763, 431056, 434223, 437601, 441124, 444436, 447820, 452441, 459059, 466841, 474158, 480492, 486851, 494257, 502553, 511027, 519534, 528437, 537899, 547931, 559076, 572396, 588631, 607730, 629312, 653325, 680124, 710211]
62784G10211L3901L8281M3149M8219N3227N8185O3356O8948P4801Q0308Q4700
62773A357286Q7411Q8265Q7304Q4406P9150P1201O0836M8856L5796K1608O416
62762B028535q752k2699l5315m7277n8393o7249p2969p6432p8944q0408p9880
62751A400217p7511p4640p1963o8754o4282n9055n4093m9649m5293m0842l6599
62740G57536l2903k9847k7351k5124k2731j9998j7263j5050j3545j2521j1566
62729E29637j0285q521o575m989l928k987j850p87k58k05j73J06O14J458K869
62714D94126M755O630Q140R386J0608J1845J3157J4913J7449K0546K3586K6274
62702F61415K8927L1903L5007L7777M0233M3040M6761N1219N5621N9150O1358
$$ y = [710211, 744112, 782393, 825542, 873761, 926988, 985173, 1048529, 1117477, 1192278, 1272586, 1357286, 1444697, 1532962, 1620266, 1704672, 1783822, 1855023, 1915859, 1964715, 2000511, 2022119, 2028535, 2019783, 1997084, 1961769, 1914492, 1856099, 1788850, 1715881, 1639449, 1560505, 1480097, 1400217, 1322706, 1248066, 1176103, 1107349, 1043067, 984012, 929919, 880270, 834977, 794135, 757536, 724633, 694786, 667435, 642311, 619580, 599582, 582319, 567269, 553724, 541203, 529637, 519352, 510831, 504256, 499267, 495339, 492352, 490502, 489715, 489457, 489252, 489079, 489185, 489799, 491257, 494126, 498881, 505511, 513651, 523037, 533645, 545490, 558647, 573560, 591009, 611555, 635141, 661415, 690342, 722245, 757252, 795029, 835262, 878302, 925063, 976282, 1031903, 1091053, 1152411]
62691A152411O2163O1691O0008N6861N1741M4409L5282K5092J4240K752r161k0770
62679A536719l1265m0262m7717n3494n7407n9627o0751o1207o0731n8782n5442
62668I50034n1566m7936m4524m0887l7025l3431l0372k7628k4989k2585k0490
62657E68601j8401j6029j3604j1651j0447r870r638r490r236q850q385p734o693
62644D28573n392m303l624k964j960q65j51J59L49L79%p38j492k133k711l019
62628D00108k764k135j689j571j351p33Q4Q50J616K430L094L505L809M072M125
62613D13450L929L806M031M496M958N379N801O191O694P710R420J1432J3190J4622
62599E15109J6095J7879J9911K2046K4352K7071L0359L3996L7394M0055M1942
$$ y = [1152411, 1214574, 1276265, 1336273, 1393134, 1444875, 1489284, 1524566, 1549658, 1563898, 1566650, 1557489, 1536719, 1505454, 1465192, 1417475, 1363981, 1306574, 1246947, 1186196, 1124989, 1064258, 1005476, 950034, 898468, 850532, 806008, 765121, 728096, 694665, 664293, 636665, 611676, 589091, 568601, 550200, 534171, 520567, 508916, 498469, 488599, 478961, 469471, 460235, 451385, 443000, 435266, 428573, 423181, 418878, 415254, 412290, 410330, 409465, 409314, 409473, 409822, 410201, 410201, 409463, 407971, 405838, 403127, 400108, 397344, 395209, 393520, 391949, 390598, 389865, 389949, 390799, 392415, 394845, 397939, 401444, 405253, 409325, 413450, 417379, 421185, 425216, 429712, 434670, 440049, 445850, 452041, 458735, 466445, 475865, 487297, 500487, 515109, 531204, 549083, 568994, 591040, 615392, 642463, 672822, 706818, 744212, 784267, 826209]
62588H26209M3161M3330M1675L7913L2624K6568J9999J2895N468j991r434j6750
62576A061667k3305k8387l2057l5047l7714l9524l9857l8894l7381l5696l3586
62565F80219l0848k7886k5384k3509k1773j9626j7042j4458j2296j0736r781r310
62553D57570r073q789q279p423o122m471k887j811j230p46j58K13l4q14j565j773
62537D02608j445j052j016j206j076l63N23J034J245J744K859M322N692O819P815
62522D28503Q890J0227J1813J3356J4684J6149J8316K1215K4334K7317L0256L3153
62510F58213L5612L7274L8152L8331L7718L6320L4311L1608K7821K2916J7495
62499A015771J2043O417N17m963r061j1547j2790j2897j1619r087n879k329J747
$$ y = [826209, 869370, 912700, 954375, 992288, 1024912, 1051480, 1071479, 1084374, 1089842, 1087851, 1078417, 1061667, 1038362, 1009975, 977918, 942871, 905157, 865633, 825776, 786882, 749501, 713805, 680219, 649371, 621485, 596101, 572592, 550819, 531193, 514151, 499693, 487397, 476661, 466880, 457570, 448497, 439708, 431429, 424006, 417884, 413413, 410526, 408715, 407485, 406739, 406581, 406794, 406760, 405946, 404381, 402608, 401163, 400111, 399095, 397889, 396813, 396450, 396973, 398007, 399252, 400996, 403855, 408177, 413869, 420688, 428503, 437393, 447620, 459433, 472789, 487473, 503622, 521938, 543153, 567487, 594804, 625060, 658213, 693825, 731099, 769251, 807582, 845300, 881620, 915931, 947539, 975360, 998276, 1015771, 1027814, 1034231, 1034748, 1029785, 1020724, 1009177, 996387, 983490, 971871, 962784, 956905, 954576, 956323]
62486I56323O414J1181J5445J9065K2425K6019K9949L3479L5096L3413K8281K0922
62474A238012J3038N902j9n218j1011j8612k7824l6781m3298m6594m7709m8378
62462I71508m9461n0320m9699m7201m3724m0281l6789l2574k7886k4006k1577
62451E47990j9626j6811j3225j0216q625p908p077n882m806m228l988l600k658
62438D39340j126N84J842K248J924J331Q10L43k71j104j993k711l204l600m032
62423D30381m449m698m678m388l855l163k605k541l022l593l750l507l259l098
62409C79775k586j377R5R51P07l52j563k287k033o77J179K429K390J533J013J499
62393C80696K572L292L135K363J577J132J046J359K246L595M784N241N201N440
$$ y = [956323, 962737, 973918, 989363, 1008428, 1030853, 1056872, 1086821, 1120300, 1155396, 1188809, 1217090, 1238012, 1251050, 1256952, 1256933, 1251715, 1240704, 1222092, 1194268, 1157487, 1114189, 1067595, 1019886, 971508, 922047, 871727, 822028, 774827, 731103, 690822, 654033, 621459, 593573, 569567, 547990, 528364, 511553, 498328, 488112, 479487, 471579, 464502, 458620, 453814, 449586, 445598, 441998, 439340, 438214, 438798, 440640, 442888, 444812, 446143, 446953, 447296, 447025, 445921, 443928, 441217, 438013, 434413, 430381, 425932, 421234, 416556, 412168, 408313, 405150, 402545, 400004, 396982, 393389, 389639, 386132, 382873, 379775, 377189, 375812, 375907, 376858, 377565, 377213, 375650, 373363, 371330, 370653, 371832, 374261, 376651, 378184, 379197, 380696, 383268, 386560, 389695, 392058, 393635, 394767, 395813, 397172, 399418, 403013, 407797, 413038, 418239, 423679]
62379D23679O251P132P593P793Q088Q420Q563Q718R273J0191J1062J1759J2568
62366E41090J3698J5102J6804J8988K1729K4963K8750L3137L7719M1903M5733
62355H39616M9907N4619N8782O0878O0270N7262N2169M4946L5832K5809J6179
62344A356269P855J012m833j0463j6447k2747k8843l4238l8772m2430m5033m6210
62332A075120m5732m3899m1440l8925l6228l2904k9061k5533k2963k1187j9812
62321G17436j8973j8881j8993j8492j7536j7123j7517j7662j6619j4844j3337
62310E27459j2218j0973r656q876q618q097o900n598m804m349l652k534j199J53
62296D40138J294J868J785J537J843K943M441N701O286O248O193O822Q178R514
$$ y = [423679, 429930, 437062, 444655, 452448, 460536, 468956, 477519, 486237, 495510, 505701, 516763, 528522, 541090, 554788, 569890, 586694, 605682, 627411, 652374, 681124, 714261, 751980, 793883, 839616, 889523, 944142, 1002924, 1063802, 1124072, 1181334, 1233503, 1278449, 1314281, 1340090, 1356269, 1364124, 1365136, 1360303, 1349840, 1333393, 1310646, 1281803, 1247565, 1208793, 1166363, 1121330, 1075120, 1029388, 985489, 944049, 905124, 868896, 835992, 806931, 781398, 758435, 737248, 717436, 698463, 679582, 660589, 642097, 624561, 607438, 589921, 572259, 555640, 540796, 527459, 515241, 504268, 494612, 485736, 477118, 469021, 462121, 456523, 451719, 447370, 443718, 441184, 439985, 440138, 441432, 443300, 445085, 446622, 448465, 451408, 455849, 461550, 467836, 474084, 480277, 487099, 495277, 504791]
62282E04791J0093R946R642R545R612R705R729R601R342R190R297R444R339R040
62268F38316Q822Q774Q864R348J0613J2639J5028J7663K0914K5070K9904L5038
62256H40993M0327M5587N0293N3906N6348N7700N7466N4625M8595L9956L0000
62245A375796J9821J0033J061o795j3682k0212k6835l3418l9568m5035m9550n2591
62233A119025n3814n3580n2595n0988m8310m4417l9905l5555l1734k8449k5506
62222F54172k2529j9321j6321j4148j2636j0997r091p691p109o553n492m691m932
62209E12661n485n014l545k293j798j449p83k9O64J522K446L064L607M660N952
62194E14180O437N987N820O755Q062Q698Q753Q926R375R868J0412J0910J0806
$$ y = [504791, 514884, 524830, 534472, 544017, 553629, 563334, 573063, 582664, 592006, 601196, 610493, 619937, 629276, 638316, 647138, 655912, 664776, 674124, 684737, 697376, 712404, 730067, 750981, 776051, 805955, 840993, 881320, 926907, 977200, 1031106, 1087454, 1145154, 1202620, 1257245, 1305840, 1345796, 1375796, 1395617, 1405650, 1406711, 1399916, 1386234, 1366022, 1339187, 1305769, 1266201, 1221166, 1171616, 1119025, 1065211, 1011631, 959036, 908048, 859738, 815321, 775416, 739861, 708127, 679678, 654172, 631643, 612322, 596001, 581853, 569217, 558220, 549129, 541438, 534329, 527776, 522284, 517593, 512661, 507176, 502162, 498617, 496324, 494526, 493077, 492294, 492265, 492929, 494451, 496897, 499961, 503568, 508228, 514180, 520617, 526604, 532424, 539179, 547241, 555939, 564692, 573618, 582993, 592861, 603273, 614183, 624989]
62181F24989R898R068R278J0248J0890J0689R906Q734P256O155O550Q867J2473
62168G45001J6535K0766K5207K9815L4450L8940M2930M5826M6959M5778M2073
62157A134280L6147K8754K0750J2879N800r5m985r422j3759j8096k2722k7858
62145A141673l2787l6122l7355l7427l7242l6461l4435l1543k8653k5846k2780
62134G81022j9785j7468j5462j2855r773p367o140n342m258k961j570K61K566
62121F80868M744O534Q472J0718J2182J1631R238O301L688J338q16k193k120p48
62107G49837P48Q90j114m806q873j2079j3791j3886j2518j0095p180m246j631
62094F61256L62J573K233K759L289L740M259N207O564P788Q477Q863R435J0368
$$ y = [624989, 634887, 643955, 653233, 663481, 674371, 685060, 694966, 703700, 710956, 717111, 723661, 732528, 745001, 761536, 782302, 807509, 837324, 871774, 910714, 953644, 999470, 1046429, 1092207, 1134280, 1170427, 1199181, 1219931, 1232810, 1238610, 1238515, 1233530, 1224108, 1210349, 1192253, 1169531, 1141673, 1108886, 1072764, 1035409, 997982, 960740, 924279, 889844, 858301, 829648, 803802, 781022, 761237, 743769, 728307, 715452, 705679, 698312, 692172, 686830, 682572, 679611, 678041, 678302, 680868, 685612, 692146, 700618, 711336, 723518, 735149, 744387, 750688, 754376, 755714, 754898, 752705, 750585, 749837, 750585, 751475, 750361, 745555, 736682, 724603, 710812, 696926, 684408, 674313, 667133, 662887, 661256, 661618, 663191, 665424, 668183, 671472, 675212, 679471, 684678, 691242, 699030, 707507, 716370, 725805, 736173]
62080G36173J1458J2463J3274J4021J5079J6764J8900K0891K2302K3180K3754
62069I28259K4120K4247K4078K3629K3234K3614K5245K7628K9630L0588L0522
62058A214794K9181K5611J9225J0937K732l835q511j2047j5363j8872k2333k5372
62046A196147k8124l1081l4343l7412l9848m1571m2371m1758l9734l7250l5263
62035G87392l3699l1854k9526k7067k4577k1743j8539j5476j3022j1197r809q671
62023E42212p564o424n606n515n944o264o346o669p339p683p219o431n909n363
62009D51936m216k889k378k596k200m39J778L191L835M545N418N853N708N442
61995D72988N039L932K217R89Q74J051K97j496l507n125o193o627o584o796p836
$$ y = [736173, 747631, 760094, 773368, 787389, 802468, 819232, 838132, 859023, 881325, 904505, 928259, 952379, 976626, 1000704, 1024333, 1047567, 1071181, 1096426, 1124054, 1153684, 1184272, 1214794, 1243975, 1269586, 1288811, 1299748, 1302480, 1298645, 1290134, 1278087, 1262724, 1243852, 1221519, 1196147, 1168023, 1136942, 1102599, 1065187, 1025339, 983768, 941397, 899639, 859905, 822655, 787392, 753693, 721839, 692313, 665246, 640669, 618926, 600387, 584911, 571889, 560692, 550883, 542212, 534648, 528224, 522618, 517103, 511159, 504895, 498549, 491880, 484541, 476858, 469639, 463208, 457299, 451936, 447720, 444831, 442453, 439857, 437657, 437218, 438996, 442187, 446022, 450567, 455985, 461838, 467546, 472988, 478027, 481959, 484176, 485165, 486039, 487090, 487387, 485891, 482384, 477259, 471066, 464439, 457855, 451059, 443223]
61980D43223r029q944p153m860l517l307l271k635j656j304k144l587m302l585
61966C83929k041p69j62R1K25K45L80R27J697K181K237K051J563O76j9M01J944
61949C95556L595M718N681O869P952Q701R671J1417J3581J5475J7092J8862K0826
61936E39996K2622K4054K4979K5036K4081K2674K1520K0555J9125J6971J4446
61925G76059J1923R419O811L946O73k882o147q611j0326j1479j1777j0761q614
61912G38234o066l543q72K168N539R100J2627J5612J7499J8157J7816J6492J3910
61899H56673R966M998l67n345r205j1850j4024j6419j8734k0122k0413k0177j9643
61886G15338j8493j6826j5412j4579j3656j2142j0736j0493j1411j2505j3004
$$ y = [443223, 434194, 425250, 418097, 413237, 409720, 406413, 403142, 400507, 398851, 397547, 395403, 391816, 387514, 383929, 381888, 381119, 380957, 381048, 381273, 381518, 381898, 382825, 384522, 386703, 388940, 390991, 392554, 393230, 393211, 393612, 395556, 399151, 403869, 409550, 416419, 424371, 433072, 442743, 454160, 467741, 483216, 500308, 519170, 539996, 562618, 586672, 611651, 636687, 660768, 683442, 704962, 725517, 744642, 761613, 776059, 787982, 797401, 804212, 808158, 808831, 805949, 799802, 791191, 780865, 769386, 757609, 746848, 738234, 732168, 728625, 727753, 729921, 735460, 744560, 757187, 772799, 790298, 808455, 826271, 842763, 856673, 866639, 871637, 871270, 865925, 856720, 844870, 830846, 814427, 795693, 775571, 755158, 734981, 715338, 696845, 680019, 664607, 650028, 636372, 624230, 613494, 603001, 591590, 579085, 566081]
61875E66081j2782j1896j0448q897p829p244o526n227l555j970o72M73J723L273
61861D94504N072O794Q224R659J1633J4198J6784J8903K0687K2633K5085K8091
61849F82267L1460L4721L7214L8520L8752L8249L7127L5214L2299K8214K2889
61838A056926J6566R873L385k715q286j2724j5316j6065j5601j4174j1344p005
61826I83520k102K299O262J0527J4923J8012J8530J6536J2884Q100K229m576j1881
61813A075263j9183k5872l1117l4312l5743l6406l6986l7242l6504l4597l2035
61802G15266k9475k7165k4934k2546j9985j7402j4968j2809j1129j0122r682r279
61790E05770q423p239o339o005n773n011l759k635k040j789j624j609j824j965
$$ y = [566081, 553299, 541403, 530955, 522058, 514229, 506985, 500459, 495232, 491677, 489707, 489035, 489508, 491231, 494504, 499576, 506370, 514594, 524253, 535886, 550084, 566868, 585771, 606458, 629091, 654176, 682267, 713727, 748448, 785662, 824182, 862934, 901183, 938310, 973524, 1005823, 1034037, 1056926, 1073492, 1083365, 1086750, 1084035, 1075749, 1063025, 1047709, 1031644, 1016043, 1001869, 990525, 983520, 981418, 983717, 989979, 1000506, 1015429, 1033441, 1051971, 1068507, 1081391, 1089491, 1091720, 1087144, 1075263, 1056080, 1030208, 999091, 964779, 929036, 892630, 855644, 818402, 781898, 747301, 715266, 685791, 658626, 633692, 611146, 591161, 573759, 558791, 545982, 534853, 524731, 515049, 505770, 497347, 490108, 483769, 477764, 471991, 466980, 463221, 460586, 458546, 456757, 455133, 453524, 451700, 449735]
61776D49735j728j417j586k125k191j337k56l4q24j658j505l13J020J565J240
61761D38586Q19R92J541J755J597J883L012M149M184L146J968J109K29q58j777
61746D62335k332k924l777m291l765k432j264r00j118j312j151p69n43o92j015
61731D34050j064o58r7K18K43K50N17J125J929K586K762K488K209K350K858L280
61715D55046L225K710K112J795J745J594J028J33p91j638k477l265l870m336m809
61700D48202n130m869l923k889k593l249m158m263l206j859j559k578l724l804
61686D00398l098k781l165l346k626j438o09m30p74j495k272k568k206j674j482
61671C70434j593j774k017k251k024j047K33J056J144P39J26m60o78k73O05J523
$$ y = [449735, 448007, 446590, 445004, 442879, 440688, 439351, 439095, 439061, 438237, 436579, 435074, 434761, 435781, 437346, 438586, 439405, 440397, 441938, 443693, 445290, 447173, 450185, 454334, 458518, 461664, 463632, 464741, 464970, 464112, 462335, 460003, 457079, 453302, 449011, 445246, 442814, 441550, 440650, 439532, 438220, 437069, 436300, 435757, 435065, 434050, 432986, 432328, 432231, 432449, 432692, 432942, 433459, 434584, 436513, 439099, 441861, 444349, 446558, 448908, 451766, 455046, 458271, 460981, 463093, 464888, 466633, 468227, 469255, 469388, 468597, 466959, 464482, 461217, 457347, 453011, 448202, 443072, 438203, 434280, 431391, 428798, 425549, 421391, 417128, 413922, 412063, 410504, 407926, 404202, 400398, 397300, 394519, 391354, 388008, 385382, 383944, 383335, 382905, 382131, 380636, 378364, 375796, 373590, 371916, 370434, 368841, 367067, 365050, 362799, 360775, 359728, 359961, 361017, 362161, 362900, 363026, 362566, 361888, 361615, 362220, 363743]
61655C63743K100K165J821J494J592J964K115K062K384L194L685L279K550K475
61641C96623L156L964M523M839M749M004K830J716P57l14j536k754m003n291o168
61626D07095o156n526n006m800m491l876l218k684k144j599j198q17k23L50L79
61611C66086o3l25j93l03j214k658l968m788n103m995m718m597m585m279l628
61596C20669l177l338l753l796l421l042k796k360j590q94q20j384k062k368k237
61581B83631j815j128l07P5n75j903k706k307j337p53n37n4O85R91O30K09K71
61564B73070O60R50R80Q03N44M32N64O24K79j63m3O57J243J308J158J088Q87M62
61546B85503K72P10J420J790J713J499J308J089Q43O15L79K59N79J368K078K182
$$ y = [363743, 365843, 368008, 369829, 371323, 372915, 374879, 376994, 379056, 381440, 384634, 388319, 391598, 394148, 396623, 399779, 403743, 408266, 413105, 417854, 421858, 424688, 426404, 427161, 426847, 425311, 422557, 418554, 413263, 407095, 400939, 395413, 390407, 385607, 381116, 377240, 374022, 371338, 369194, 367595, 366397, 365580, 365357, 365707, 366086, 366023, 365698, 365505, 365202, 363988, 361330, 357362, 352574, 347471, 342476, 337758, 333161, 328576, 324297, 320669, 317492, 314154, 310401, 306605, 303184, 300142, 297346, 294986, 293396, 292502, 291682, 290298, 288236, 285868, 283631, 281816, 280688, 280381, 280456, 279881, 277978, 275272, 272965, 271628, 270875, 270338, 270284, 270969, 271960, 272590, 272799, 273070, 273730, 274680, 275660, 276463, 277007, 277439, 278003, 278627, 278906, 278743, 278700, 279357, 280600, 281908, 283066, 284154, 285041, 285503, 285775, 286485, 287905, 289695, 291408, 292907, 294215, 295304, 296147, 296762, 297141, 297400, 297979, 299347, 301425, 303607]
61530C03607J865J744J990K091J531L83q08j554j757j585j215p12k35j01m62r79
61514C03803j161r34o79o71q22r40r44q40o99o94q08o44P2Q25Q12Q6l81OO98Q99
61494B96984N91K63P1j01j13K66Q14J097J143J391J894K129J752J189J110J598
61478C12078K117K215K004J868J946K039J947J626J048K10o09r26o54l88p11j389
61462C24421j664j266o99n41q35j239j406j104l33N13R20P92N56O13R56J333J522
61445C22539J315O25k80q10n40M05J445J959J726J189J121J810K697L090K985
61430C41276K801K646K388K204K360K505K038J147P43J179J832K158K395K872
61416C70544L313L346L077K672J884N31r52j936k294k280k048j714j568j723j822
$$ y = [303607, 305472, 307216, 309206, 311297, 312828, 313211, 312403, 310849, 309092, 307507, 306292, 305580, 305345, 305244, 304782, 303803, 302642, 301708, 301029, 300358, 299536, 298596, 297652, 296812, 296113, 295419, 294611, 293967, 294039, 294864, 295676, 295762, 295381, 295387, 296085, 296984, 297575, 297838, 297909, 297808, 297695, 297961, 298775, 299872, 301015, 302406, 304300, 306429, 308181, 309370, 310480, 312078, 314195, 316410, 318414, 320282, 322228, 324267, 326214, 327840, 328888, 329098, 328489, 327563, 326909, 326521, 325810, 324421, 322757, 321491, 320792, 320251, 319416, 318177, 316771, 315667, 315334, 315847, 316767, 317559, 318115, 318728, 319684, 321017, 322539, 323854, 324479, 324199, 323389, 322849, 323254, 324699, 326658, 328384, 329573, 330694, 332504, 335201, 338291, 341276, 344077, 346723, 349111, 351315, 353675, 356180, 358218, 359365, 360108, 361287, 363119, 365277, 367672, 370544, 373857, 377203, 380280, 382952, 384836, 385367, 384415, 382479, 380185, 377905, 375857, 374143, 372575, 370852, 369030]
61401C69030j467q51n61r28j715k343k299j570p71n26p17p04l16m3j49k59j09
61384C53702n8l97p45n84j1N09P69Q45Q76J114J770K474K498J832J455K048L048
61367C71145L500L280K875K554K395K650L297L709L467L135L424M077M356M281
61353D18145M487N107N802O676Q117R750J0463R701P991O164M669L734L413L305
61339E07524K852K075J475J178P58j8r38j866k943m106m995n468n712n766n481
61324D78569n050m907m990m707l814k775k040j542j138q94o31J64J504K551K652
61309D52952K423L169N326P973R820J0309R749Q731P587O258M529K349Qj950l058
61294E26175l304l207l311l600l681l508l494l770l871l563l433l980m593m143
$$ y = [369030, 367563, 366712, 366151, 365223, 363508, 361165, 358866, 357296, 356525, 355999, 355282, 354578, 354262, 354219, 354070, 353811, 353702, 353644, 353247, 352502, 351918, 351907, 352416, 353185, 354030, 354906, 356020, 357790, 360264, 362762, 364594, 366049, 368097, 371145, 374645, 377925, 380800, 383354, 385749, 388399, 391696, 395405, 398872, 402007, 405431, 409508, 413864, 418145, 422632, 427739, 433541, 440217, 448334, 458084, 468547, 478248, 486239, 492403, 497072, 500806, 504219, 507524, 510376, 512451, 513926, 515104, 515862, 515844, 514906, 513040, 510097, 505991, 500996, 495528, 489816, 484050, 478569, 473519, 468612, 463622, 458915, 455101, 452326, 450286, 448744, 447606, 446712, 446081, 446245, 447749, 450300, 452952, 455375, 458544, 463870, 471843, 481663, 491972, 501721, 510452, 518039, 524297, 528826, 531175, 531183, 529233, 526175, 522871, 519664, 516353, 512753, 509072, 505564, 502070, 498300, 494429, 490866, 487433, 483453, 478860, 474717]
61280D74717k516p38L51Q57J217J574K039K900M208N484O197O320O185N970N539
61265E20304M797M147M437O111Q438J0083J0656J0973J1447J1066Q884N838L870
61252F21051L488L440K731J691Q29j23j531l135m545n735o630o901o569o144n890
61237E86027n618n443n878o773p136o516n641n133m546l417k287j686r88M59J756
61222E27180J473q6j104p62j40k79o02l7J280K259K430K392K739L144K737J170
61206E43794q44k086j888n76J040K447L649M923O563Q705J1167J3516J5518J7262
61192F23190J8742J9468J8805J6578J3226R494O177L884K777K582K907L369L421
61179G44620K539Q27r66k316l493m929o400p261p210o496n678n511o600q622j0288
$$ y = [474717, 472201, 471463, 471814, 472671, 473888, 475462, 477501, 480401, 484609, 490093, 496290, 502610, 508795, 514765, 520304, 525101, 529248, 533685, 539796, 548234, 558317, 568973, 579946, 591393, 602459, 611343, 617181, 621051, 624539, 627979, 630710, 632401, 633230, 633107, 631576, 628441, 623896, 618161, 611531, 604630, 598061, 591917, 586027, 580409, 574966, 569088, 562315, 555179, 548663, 543022, 537889, 533343, 529926, 527639, 525953, 524965, 525424, 527180, 528653, 528567, 527463, 526701, 526561, 526282, 525680, 525643, 526923, 529182, 531612, 534004, 536743, 539887, 542624, 543794, 542950, 540864, 538976, 538400, 539440, 541887, 545536, 550459, 557022, 565727, 576894, 590410, 605928, 623190, 641932, 661400, 680205, 696783, 710009, 719503, 725680, 729564, 732341, 734923, 737830, 741199, 744620, 747159, 747986, 747020, 744704, 741211, 736282, 729882, 722621, 715411, 708915, 703237, 697726, 691126, 682504, 672216]
61164F72216j0648j0172r994j0392j0703j0458r839r082q180p168o121m839l122
61151E61498j268L53J989L973N544N234K634j068m539p389r555j0576j0258r290
61137E27282q468p719o550m993l433j891k50J131J762J955K641M226O148P664
61123E19505Q615R321J0140J1281J2761J4421J6100J7740J9126J9802J9596J9159
61111F97567J9445K0529K1433K1257K0193J9139J8492J7742J6190J3825J1205
61100H97017Q582N481J445l054o884r496j1357j2980j4117j4399j4332j4879j6152
61087G94875j7185j7135j6202j5140j4326j3580j2604j1290r757q269p058o118
61075F46211n232m274l314k434j514l51J105K672M113N367O553P685Q534R021
$$ y = [672216, 661568, 651396, 641402, 631010, 620307, 609849, 600010, 590928, 582748, 575580, 569459, 564620, 561498, 560230, 560583, 562572, 566545, 572089, 577323, 579957, 578889, 574350, 566961, 557406, 546830, 536572, 527282, 518814, 511095, 504545, 499552, 496119, 494228, 493978, 495109, 496871, 498826, 501467, 505693, 511841, 519505, 528120, 537441, 547581, 558862, 571623, 586044, 602144, 619884, 639010, 658812, 678408, 697567, 717012, 737541, 758974, 780231, 800424, 819563, 838055, 855797, 871987, 885812, 897017, 905599, 911080, 912525, 909471, 902587, 893091, 881734, 868754, 854637, 840238, 825906, 811027, 794875, 777690, 760555, 744353, 729213, 714887, 701307, 688703, 677413, 667656, 659387, 652329, 646211, 640979, 636705, 633391, 630957, 629443, 629092, 630197, 632869, 636982, 642349, 648902, 656587, 665121, 674142]
61061F74142R611J0838J2450J3535J3768J3912J4769J6220J7835J9777K2298K4840
61049H63995K6548K7515K8577L0029L1405L2533L3846L5597L7599L9794M2263
61038A229701M4634M6289M7331M8540N0322N2480N4928N7604N9765O0503N9965
61027A812062N8833N6801N3195M9148M7129M7845M9625N1528N4798O0169O6070
61016B407203P1062P6084Q2777R1877J05102J26061J56784J95782K42299K99795
61006C854826L71971M58996N62668O92037Q57515J063132J312071J608966J927931
60997A2710113K166789K164164J811274J168439M55964q9223l52287l50470j50101
60988A9534662J77685N18738O92370N33353K3197o73059j315551j739692j916206
$$ y = [674142, 683753, 694591, 707041, 720576, 734344, 748256, 763025, 779245, 797080, 816857, 839155, 863995, 890543, 918058, 946635, 976664, 1008069, 1040602, 1074448, 1110045, 1147644, 1187438, 1229701, 1274335, 1320624, 1367955, 1416495, 1466817, 1519297, 1574225, 1631829, 1691594, 1752097, 1812062, 1870895, 1927696, 1980891, 2030039, 2077168, 2125013, 2174638, 2226166, 2280964, 2341133, 2407203, 2478265, 2554349, 2637126, 2729003, 2834105, 2960166, 3116950, 3312732, 3555031, 3854826, 4226797, 4685793, 5248461, 5940498, 6798013, 7861145, 9173216, 10782182, 12710113, 14876902, 17041066, 18852340, 20020779, 20476743, 20387520, 20035233, 19684763, 19534662, 19712347, 20231085, 20923455, 21456808, 21480005, 20806946, 19491395, 17751703, 15835497]
60979A5835497j903649j776188j591548j391084j200451j028104q72977p35414
60971E336082o17984n19617m35797l64245l05790k59924k23668j94776j72530
60962B241751j55128j39614j24841j11762j00424q9250p7623o6660n6951m7943
60952A271555m0039l4970l3221l3010l2603l1842l0855k9108k6592k4303k2763
60941I32249k1401k0027j9367j9579j9663j9050j8440j8388j8454j8316j8328
60930G21236j8401j7705j6179j4904j4304j3365j1440r468q428p896p074o093
60918E75979n353m627l778l353l478l180j765M5J162J488J394R09K82L48J338
60903E57411K239K289K203K796L387K801J237j77j072j889k753l496m448o011
$$ y = [15835497, 13931848, 12155660, 10564112, 9173028, 7972577, 6944473, 6071496, 5336082, 4718098, 4198481, 3762684, 3398439, 3092649, 2832725, 2609057, 2414281, 2241751, 2086623, 1947009, 1822168, 1710406, 1609982, 1520732, 1443109, 1376449, 1319498, 1271555, 1231516, 1196546, 1163325, 1130315, 1097712, 1065870, 1035015, 1005907, 979315, 955012, 932249, 910848, 890821, 871454, 851875, 832212, 813162, 794722, 776334, 757880, 739564, 721236, 702835, 685130, 668951, 654047, 639743, 626378, 614938, 605470, 597042, 589146, 582072, 575979, 570626, 565999, 562221, 558868, 555390, 552210, 550445, 550490, 551652, 553140, 554534, 555443, 555725, 556073, 557411, 559650, 561939, 564142, 566938, 570325, 573126, 574363, 574186, 573114, 571225, 568472, 564976, 560528, 554517]
60889E54517p614q213p699o932o578o671p120p853q554q910r028r084q855q104
60875D43302p109o303n726n265m939m570l742k568j774j499q53O57K124K648K823
60860D07206L693M840M926L730K370J645J373J369J891K940M017M717M940M480
60846D54137L196J598N56L76O91J149J529J347J84j564k924l474l669m013m460
60831D44659m716m645m252l606k881k208j603j254j540k444l247l321k951k909
60817D03082l387l880l915l504l019k959l607m564n043m857m678m875m816l885
60803C46093k611j975k002j922j410q24m75m01p48j539k215k111j371p93p83r94
60787C23919q96k46Q35J841K112J548Q61P70J279K036K863L471L354K584K043
$$ y = [554517, 546903, 538690, 530991, 524059, 517481, 510810, 503690, 495837, 487283, 478373, 469345, 460261, 451406, 443302, 436193, 429890, 424164, 418899, 413960, 409390, 405648, 403080, 401306, 399807, 398954, 399611, 401735, 404383, 407206, 410899, 415739, 420665, 424395, 426765, 428410, 429783, 431152, 433043, 435983, 440000, 444717, 449657, 454137, 457333, 458931, 459487, 459863, 460554, 461703, 463232, 464579, 464763, 463199, 460275, 456801, 453132, 449119, 444659, 439943, 435298, 431046, 427440, 424559, 422351, 420748, 419494, 417954, 415510, 412263, 408942, 405991, 403082, 399695, 395815, 391900, 388396, 385377, 382418, 378811, 374247, 369204, 364347, 359669, 354794, 349978, 346093, 343482, 341507, 339505, 337583, 336173, 335349, 334874, 334473, 333725, 332186, 329971, 327860, 326489, 325696, 324913, 323919, 323023, 322777, 323612, 325453, 327565, 329113, 329974, 330744, 332023, 334059, 336922, 340393, 343747, 346331, 348374]
60772C48374K222K381J798J046J056J526J494J043J104J757K082J627Q37K9r80
60757C67396k029k490k225j847j847k151k581k938k767j797o45j92k87K8J025
60742C44653J902J902R53p52k819m335m563m102m281n233n606m551k908j973j907
60727C06380j992j739j167m63J54M95N62M64J88j44k3Q70J928K171J508P64N02
60710C10458N59P44J201J966K768L384L690L476K755K029J615J143M33K83J264
60695C37768K299J912N51MN90P67k47j253j176o42o01p87o31n24j020j643j589
60678C33778r34k97J21M01M12K17K81P09P99J9j192k154k821l326l387k859k293
60661C17474k210k245j727o96K75P95P62K48k82j41O88J371J399J343J929K936
$$ y = [348374, 350596, 352977, 354775, 355821, 356877, 358403, 359897, 360940, 362044, 363801, 365883, 367510, 368347, 368376, 367396, 365367, 362877, 360652, 358805, 356958, 354807, 352226, 349288, 346521, 344724, 344079, 343887, 343600, 343628, 344653, 346555, 348457, 349410, 348658, 345839, 341504, 336941, 332839, 328558, 323325, 317719, 313168, 310260, 308287, 306380, 304388, 302649, 301482, 301019, 301173, 301668, 302230, 302694, 302882, 302738, 302715, 303585, 305513, 307684, 309192, 309956, 310458, 311017, 311761, 312962, 314928, 317696, 321080, 324770, 328246, 331001, 333030, 334645, 335788, 336221, 336504, 337768, 340067, 341979, 342530, 342534, 343124, 343891, 343644, 342391, 341215, 340573, 339972, 339185, 338554, 338030, 337010, 335367, 333778, 332844, 332547, 332668, 333069, 333481, 333698, 333979, 334688, 335487, 335506, 334314, 332160, 329339, 326013, 322626, 319767, 317474, 315264, 313019, 311292, 310596, 310871, 311666, 312428, 312676, 312394, 312253, 312941, 314312, 315711, 317054, 318983, 321919]
60645C21919L552L353K409J037j90p55j002j892l482m459l817k260j162q19o37
60630C11795m26n65j128j711j939j682r91k61m8l12l28K12O95O08L71M92O52L94
60612C05828M6J10L23J98j0K46Q23J237J480J696J496O23j96j60K94J90k74n2
60594C13898R03J495J343J448K485L568L463K324J397J378J762J703J068M63M37
60579C39135Q63J207J254J205J173J049J069J844L472N157O154O626P110P620
60565C84938P955Q361R154R888R764Q661P135N466L420R05j722m024n643o226
60551D38032n646m354l014j833o13P32K076L341M385M917M911M972N885P872J0623
60536D72286J3681J6397J7889J7671J6171J4132J1755Q841N453J911j555m659
$$ y = [321919, 325471, 328824, 331233, 332270, 332080, 331325, 330323, 328431, 324949, 320490, 316673, 314413, 313251, 312432, 311795, 311369, 310804, 309676, 307965, 306026, 304344, 303353, 303092, 303044, 302732, 302404, 302616, 303311, 303919, 304290, 304782, 305434, 305828, 305874, 305984, 306307, 306505, 306495, 306741, 307564, 308801, 310281, 311977, 313473, 314096, 313900, 313740, 314034, 314224, 313950, 313898, 314801, 316296, 317639, 319087, 321572, 325140, 328603, 330927, 332324, 333702, 335464, 337167, 338235, 338698, 339135, 339998, 341205, 342459, 343664, 344837, 345886, 346955, 348799, 352271, 357428, 363582, 370208, 377318, 384938, 392893, 401254, 410408, 420296, 430060, 438721, 445856, 451322, 454742, 455647, 453925, 449901, 444258, 438032, 432386, 428032, 425018, 423185, 422572, 423304, 425380, 428721, 433106, 438023, 442934, 447906, 453791, 461663, 472286, 485967, 502364, 520253, 537924, 554095, 568227, 579982, 588823, 594276, 596187, 594632, 589973]
60524E89973o869p931q261q304p901o932o028n832n909n314m015k782j879q53
60510E11163L91J363J925K606L734N029O251P593R280J1433J4394J8513K3396
60497F17071K8065L2036L5615L9024M1884M3807M4746M4523M2642L9009L4112
60486A042534K8112K0310J0169j512j3039k3230l1929l9253m4857m8169m9034
60475H50102m7940m5593m2438l8737l4966l1715k9071k6440k3309j9958j7043
60464D92892j4803j3026j1568j0342q999p232n381m252m195m770n293n324m742
60451C92965l743k872k589k760k850k617k283k068j943j794j473p80K19R17P19
60436C67048j89j061j510j806k177k407k231j768j305r99q72r07j005j019r24
$$ y = [589973, 583104, 575173, 566912, 558608, 550707, 543775, 537747, 531915, 526006, 520692, 516677, 513895, 512016, 511163, 511554, 512917, 514842, 517448, 521182, 526211, 532462, 540055, 549335, 560768, 575162, 593675, 617071, 645136, 677172, 712787, 751811, 793695, 837502, 882248, 926771, 969413, 1008422, 1042534, 1070646, 1090956, 1101125, 1099613, 1086574, 1063344, 1031415, 992162, 947305, 899136, 850102, 802162, 756569, 714131, 675394, 640428, 608713, 579642, 553202, 529893, 509935, 492892, 478089, 465063, 453495, 443153, 434154, 426922, 421541, 417289, 413094, 408324, 403031, 397707, 392965, 389222, 386350, 383761, 381001, 378151, 375534, 373251, 371183, 369240, 367446, 365973, 365193, 365412, 366329, 367048, 366859, 365798, 364288, 362482, 360305, 357898, 355667, 353899, 352594, 351595, 350723, 349816, 348811, 347792, 346868]
60421C46868p92o54m68k05J72O23R09Q21O70J134K264L114K822J770J062J117
60405C61227J376J261Q34M77L83M98O65Q57J350K403L570L820K817J586J340J973
60389C86437K462K417K402K818L291L281K729J977J499J683K418K999K853K240
60375D21506J840J901K218K597K781K325J246M35O15J261J379J011R61J330J540
60360D44946J622K232L309M016M217M784O060P299Q079R018J0353J1026J0106
60347E27067Q243O569M968K601l74k876m529n990p513q273p610o167n112m622
60333D96382l925k763k081k749m146m782m204l412l213l154k653k235k600l136
60319D51329k592r82M69J188J841K936M129N335P196R860J2245J3338J3425J3280
$$ y = [346868, 346076, 345422, 344954, 344749, 344921, 345544, 346453, 347274, 347944, 349078, 351342, 354456, 357278, 359048, 360110, 361227, 362603, 363864, 364698, 365175, 365558, 366056, 366721, 367578, 368928, 371331, 374901, 378721, 381538, 383124, 384464, 386437, 388899, 391316, 393718, 396536, 399827, 403108, 405837, 407814, 409313, 410996, 413414, 416413, 419266, 421506, 423346, 425247, 427465, 430062, 432843, 435168, 436414, 436849, 437464, 438725, 440104, 441115, 442076, 443406, 444946, 446568, 448800, 452109, 456125, 460342, 465126, 471186, 478485, 486564, 495582, 505935, 516961, 527067, 535310, 541879, 546847, 549448, 549074, 546198, 541669, 535679, 528166, 519893, 512283, 506116, 501004, 496382, 492457, 489694, 487613, 484864, 480718, 475936, 471732, 468320, 465107, 461953, 459300, 457065, 454465, 451329, 448737, 447755, 448224, 449412, 451253, 454189, 458318, 463653, 470849, 480709, 492954, 506292, 519717, 532997]
60305E32997J2843J1677J0164R287R244R132Q025N908L424J081j239m130p899
60292F00514j1879j4738j5645j4943j3556j2033j0383q550o722n260m398l982
60280D78425l577l023k772l289m292m987n007m594l973l165k468k378k843l216
60266D28841l154k957k820k405j600j053j410k343k876k427j255m1O68Q10P85
60251D06763R16R53M51m09q58n49N3M17N18M28j4o93r49l73M57N93o7o34l35O60
60231D07328J539J852K042K852M202N055M624L388K426K051J777J432J481K117
60217D44166K894L563M514N946P121P164O272N603N941O856P271O709N754N253
60203E25027N268N200M838M594M514L917K558J387J311J847J949J610J488J400
$$ y = [532997, 545840, 557517, 567681, 576968, 586212, 595344, 603369, 609277, 612701, 613782, 612543, 608413, 600514, 588635, 573897, 558252, 543309, 529753, 517720, 507337, 498787, 492065, 486805, 482407, 478425, 474848, 471825, 469053, 465764, 461472, 456485, 451478, 446884, 442911, 439746, 437278, 434900, 432057, 428841, 425687, 422730, 419910, 417505, 415905, 414852, 413442, 411099, 408223, 405796, 404541, 404500, 405168, 405978, 406763, 407679, 408632, 409083, 408674, 407816, 407267, 407320, 407737, 408255, 408683, 408669, 407976, 407027, 406654, 407111, 407704, 407637, 407003, 406668, 407328, 408867, 410719, 412761, 415613, 419815, 424870, 429494, 432882, 435308, 437359, 439136, 440568, 442049, 444166, 447060, 450623, 455137, 461083, 468204, 475368, 481640, 487243, 493184, 500040, 507311, 514020, 519774, 525027, 530295, 535495, 540333, 544927, 549441, 553358, 555916, 557303, 558614, 560461, 562410, 564020, 565508, 566908]
60189E66908N48r90k291l056l738m261l982l119k812l447m122m133l744l231k466
60174E22064j820j989k521j992l72M25p44k484l015k582k396k343j508j77L59
60159D98905k18q67o83K64J380K014J733R05O01J229J774J222J56r4O94J651K284
60142E12950K764L042K863K651L282M850O489P516Q079Q526Q830Q758Q163O975
60128E95738N270L401J855J022J046J607J808R22n84j443j230q10q47q42k97J54
60112F06770k90j271j906k119k397k712k666k274j805j240o93q45k000l166l090
60097E78296j886p19k06m3J65N94J508K927M246M887N008M877M218K951J930J833
60081F10586J946J339N79Q39J626J179r38l235m468n002n692o673p790r028j0092
$$ y = [566908, 567456, 566466, 564175, 561119, 557381, 553120, 549138, 546019, 543207, 539760, 535638, 531505, 527761, 524530, 522064, 520244, 518255, 515734, 513742, 513370, 513795, 513051, 510567, 507552, 504970, 502574, 500231, 498723, 498546, 498905, 498687, 497820, 497137, 497401, 498781, 500795, 502528, 503433, 504034, 505263, 507037, 508259, 508415, 508321, 509015, 510666, 512950, 515714, 518756, 521619, 524270, 527552, 532402, 538891, 546407, 554486, 563012, 571842, 580600, 588763, 595738, 601008, 604409, 606264, 607286, 608332, 609939, 611747, 612669, 612085, 610642, 609412, 608602, 607755, 606913, 606616, 606770, 606480, 605209, 603303, 601184, 598787, 596075, 593409, 591135, 589330, 588090, 587397, 586552, 584552, 581386, 578296, 576410, 575691, 575485, 575442, 575607, 576201, 577709, 580636, 584882, 589769, 594777, 599654, 603872, 606823, 608753, 610586, 612532, 613871, 614450, 615289, 616915, 618094, 617156, 613921, 609453, 604451, 598759, 592086, 584296, 575268, 565176]
60066E65176j0410r985r459r049q311p134o127n700n582n509n576n611n041l771
60052D67911k440j481n89N28J547K086K319K701L447M500N606O286O175N455M607
60037E08658L818L081K642K679K706K064Q85j88j056k081l065l418l348l783m879
60022E04715n685n640n405n778o647p471q008q076p394o192n299n040m690l599
60008D19791k252j621j858k230k108j479o97j23Q5Q7J89M30N76M88L11K62N08
59991D10359J180K132K808K839K687L120M072M607M074K803J559P91N15M15M7
59976D44008p07j405j600j469j394j198n50J89L53J10K58R24J405J422J519K037
59960D43902K598K962L435M075M284L721K865K193J447K53j105k080k601k924
$$ y = [565176, 554766, 544781, 535322, 526273, 517962, 510828, 504701, 499001, 493419, 487910, 482334, 476723, 471682, 467911, 465471, 463990, 463401, 463929, 465476, 467562, 469881, 472582, 476029, 480529, 486135, 492421, 498596, 504051, 508658, 512476, 515557, 518199, 520878, 523584, 525648, 526533, 526345, 525289, 523208, 520143, 516725, 513377, 509594, 504715, 499030, 493390, 487985, 482207, 475560, 468089, 460081, 452005, 444611, 438419, 433120, 428080, 423390, 419791, 417539, 415918, 414060, 411830, 409722, 408243, 407546, 407423, 407508, 407595, 407784, 408214, 408790, 409278, 409589, 409851, 410359, 411539, 413671, 416479, 419318, 422005, 425125, 429197, 433804, 437878, 440681, 442240, 443031, 443546, 443961, 444008, 443301, 441896, 440296, 438827, 437433, 436235, 435685, 435874, 436227, 436337, 436595, 437519, 438924, 440346, 441865, 443902, 446500, 449462, 452897, 456972, 461256, 464977, 467842, 470035, 471482, 471735, 470630, 468550, 465949, 463025]
59946D63025l149l244l245l140k827k403k166k187k245k264k434k748k875k596
59932D25502k036j356o20L5N55J228K375L823N140O195O948P020O113M689L407
59917D69018K162N56r75j551j179n72K63J878L868M905M599M019L934L887L503
59902D98315L296L421K962J385l66j181j299j538j887j840j481j235r90l39P05
59887D97928J850K942L731L905L806M370N764O838O714O044N898O191O201N941
59873E68123N911N935N306L848K093O39j0M49J483J747O34p43r79k49K29P8o2
59856E94432J08K47L04O58J275J752K196L143M457N153M504K663J71k412m384
59841F14267n116m597l262j350Q54K306J698r67m103o111o712o513n910m914l568
$$ y = [463025, 459876, 456632, 453387, 450247, 447420, 445017, 442851, 440664, 438419, 436155, 433721, 430973, 428098, 425502, 423466, 422110, 421490, 421525, 422080, 423308, 425683, 429506, 434646, 440841, 447789, 454809, 460922, 465611, 469018, 471180, 471736, 470761, 469210, 468031, 467459, 467722, 469600, 473468, 478373, 482972, 486991, 490925, 494812, 498315, 501611, 505032, 507994, 509379, 509013, 507832, 506533, 504995, 503108, 501268, 499787, 498552, 497562, 497223, 497928, 499778, 502720, 506451, 510356, 514162, 518532, 524296, 531134, 537848, 543892, 549790, 555981, 562182, 568123, 574034, 579969, 585275, 589123, 591216, 591855, 591845, 592294, 593777, 595524, 596158, 595415, 594436, 594187, 594416, 594494, 594432, 594540, 594787, 595091, 595749, 597024, 598776, 600972, 604115, 608572, 613725, 618229, 620892, 621063, 618651, 614267, 609151, 604554, 601292, 599942, 600796, 603102, 604800, 603833, 599730, 593619, 586907, 580394, 574484, 569570, 566002]
59826E66002k125r41l80n99j316j983k328k481k556k487k353k476k954l384l235
59811E34404k485j669j346j612k088k405k621l059l737m188l934l032k009j360
59797D98859j261j642k300k969l351l190k483j649j305j590j951j825j349j004
59783D70990q14m87j57k68p08q90p32p40r30n93M74J444J689J770K429L334L695
59766D79506L628L936M761N378N301M893M729M915N190N328N259M985M519L947
59752E46275L599L986N215O558P043O598O070O073O408O726P034P246O907N895
59738F31633M808M147L624K789J788R93L25m84j339k010k504k812k686k174j858
59723F34240k069k275j858j073o62q59j317j748k057k143k007j805j530r99m48
$$ y = [566002, 563877, 562936, 562556, 561957, 560641, 558658, 556330, 553849, 551293, 548806, 546453, 543977, 541023, 537639, 534404, 531919, 530250, 528904, 527292, 525204, 522799, 520178, 517119, 513382, 509194, 505260, 502228, 500219, 498859, 497598, 495956, 493656, 490687, 487336, 484146, 481663, 480014, 478709, 477119, 475168, 473343, 471994, 470990, 470176, 469689, 469532, 469264, 468556, 467666, 466934, 466194, 465264, 464671, 465145, 466589, 468278, 470048, 472477, 475811, 479506, 483134, 487070, 491831, 497209, 502510, 507403, 512132, 517047, 522237, 527565, 532824, 537809, 542328, 546275, 549874, 553860, 559075, 565633, 572676, 579274, 585344, 591417, 597825, 604551, 611585, 618831, 625738, 631633, 636441, 640588, 644212, 647001, 648789, 649782, 650107, 649623, 648284, 646274, 643770, 640958, 638272, 636098, 634240, 632171, 629896, 628038, 626965, 626303, 625444, 624127, 622379, 620322, 618179, 616172, 614367, 612837, 611838, 611390]
59708F11390m43r01q98k6Q41Q10K26r7j77m14m72K31J351K020K142K201K070J155
59690F21009l74j594k161k592l123l255k700j910j351r92p69r70j775k902l910
59675E90631m587m890m938n032n368n716n678n150m235k978j664r98j316j861
59661E36220j544l81N91P78O66Q27J133J263J417K031L027L714L466K368J160
59646E56736M95K73j14r76k107l315m605n685o022n648n236m979m183k526r22
59631E11186k66j60J65L13o46k444l836m391m845n557n887n335m328l515l068
59616D67386k971l286l719l596k677j547r09p70n54K43J583K826L188K569J720
59601D59486J291R99K78n98p70MJ054J737J971J868J481J054R78J300J627J565
$$ y = [611390, 610947, 610046, 609148, 609122, 609963, 610773, 610999, 610902, 610725, 610311, 609839, 610070, 611421, 613441, 615583, 617784, 619854, 621009, 620635, 619041, 616880, 614288, 611165, 607910, 605210, 603300, 601949, 600957, 600188, 599218, 597443, 594541, 590631, 586044, 581154, 576216, 571184, 565816, 560100, 554422, 549272, 545037, 542059, 540395, 539397, 538081, 536220, 534676, 534295, 534886, 535664, 536330, 537157, 538290, 539553, 540970, 543001, 546028, 549742, 553208, 555576, 556736, 557231, 557504, 557390, 556414, 554307, 550992, 546387, 540702, 534680, 529032, 523796, 518817, 514634, 512108, 511186, 510920, 510760, 510925, 511238, 510592, 508148, 504312, 499921, 495076, 489519, 483632, 478297, 473969, 470454, 467386, 464415, 461129, 457410, 453814, 451137, 449590, 448681, 447911, 447357, 447600, 449183, 452009, 455197, 457766, 459486, 460777, 461776, 462054, 461456, 460686, 460690, 461744, 463481, 465452, 467320, 468801, 469855, 470833, 472133, 473760, 475325]
59585D75325R89Lj041j624j543j232j209j450j689k018k673l488m073m294m159
59570D45824l490k230q49Q6M73L97k34j269k033k053j696j453j183o74l14l18
59554D28984J2J243K591K895K348K073K349K602K810L531M618N383O005P355R289
59539D84088J0745J1868J4458J9238K3694K3762J7546P069l256r702j1470j0379
59527E77661q523o469l982j471L18J536K755L580L086J596N39M09K07q18k245
59512E68179l662n380p367q676q666p933p393p185o985o657o107n244m396m089
59498D78439m152l878l206k760k525j627J28J617J944J647J661J971J985J524
59484D72768P87m8n68j34J288K781L469L385L082K900K918L032K876K278J797
$$ y = [475325, 476314, 476317, 475276, 473652, 472109, 470877, 469668, 468218, 466529, 464511, 461838, 458350, 454277, 449983, 445824, 442334, 440104, 439255, 439341, 439814, 440211, 439977, 438708, 436675, 434622, 432926, 431473, 430290, 429616, 429302, 428984, 428996, 430239, 432830, 435725, 438073, 440146, 442495, 445097, 447907, 451438, 456056, 461439, 467444, 474799, 484088, 494833, 506701, 521159, 540397, 564091, 587853, 605399, 612468, 609212, 599510, 588040, 577661, 569138, 562669, 558687, 557216, 557534, 559070, 561825, 565405, 568491, 570087, 570626, 571035, 571242, 570424, 568179, 564517, 559137, 551770, 543094, 534428, 526495, 519102, 511917, 504932, 498275, 492168, 486924, 482528, 478439, 474287, 470409, 467203, 464443, 461918, 460291, 460419, 462036, 463980, 465627, 467288, 469259, 471244, 472768, 473555, 473507, 472939, 472805, 474093, 476874, 480343, 483728, 486810, 489710, 492628, 495660, 498536, 500814, 502611]
59469E02611K048K538K138Q15k63n40o40q82n60N78J546J678J795K903M636O000
59453E26401O794P374P765P845P760P431O449N096M472M726M212J574k145m771
59439E90983n660n796n816n442m703m271m441m718m697m520m306l773k589p20
59425E29531J502L375M225M298M865O829R519J1638J3113J5057J7948K0919K3292
59412F66111K5864K9524L2676L1263K2434Q117n903j4736j7676j6847j3989r540
59400G37298l726L071J0418J6626J8033J1794j90j2028j9250k1945k2283k1176
59388F96642j8636j5534j2913j0546p749m928k948j612j96J076J378P43k1n46
59374F24210r85j225j053q09r16j095q49m07k88m06m43o12j170j637j489j142
$$ y = [502611, 504659, 507197, 509335, 510150, 509887, 509347, 508707, 507825, 507265, 507843, 509389, 511067, 512862, 515765, 520401, 526401, 533195, 540569, 548334, 556179, 563939, 571370, 577819, 582915, 587387, 592113, 596325, 597899, 595754, 590983, 585323, 579527, 573711, 568269, 563566, 559295, 554854, 550136, 545439, 540919, 536613, 532840, 530251, 529531, 531033, 534408, 538633, 542931, 547796, 554625, 564144, 575782, 588895, 603952, 621900, 642819, 666111, 691975, 721499, 754175, 785438, 807872, 815989, 810086, 795350, 777674, 760827, 746838, 737298, 733572, 736643, 747061, 763687, 781720, 793514, 793324, 781296, 762046, 740101, 717818, 696642, 678006, 662472, 649559, 639013, 631264, 626336, 623388, 621776, 621580, 622656, 624034, 624777, 624756, 624210, 623225, 622000, 620947, 620138, 619222, 618127, 617278, 616871, 616583, 616177, 615734, 615122, 613952, 612315, 610826, 609684]
59358F09684j148q97O66L290N657P172Q359R558J0450J0981J1662J2688J3611
59345G01733J4126J4423J4623J4557J4249J4011J3831J3218J1794R588O782L590
59333H46525M00k434m912p232r385j1198j2564j3315j3186j2306j1387j0994j0939
59320G27073j0778j0532j0413j0226r668q887q271p901p681p575p329o424m783
59307F16605l089j805m26J749M606P611J0553J3100J4056J2043O827m58q012j3871
59293F59489j6559j6230j4740j3736j3025j1573r373p374o017n003m146l440k447
59280E35826p53J159K458L241M263N571O460O809P336Q472R853J1078J2100J2689
59266F26562J2388J1254R972Q958P854O175L968J729k3j050j590k157k968l752
$$ y = [609684, 608536, 607639, 608305, 611595, 617252, 624424, 632783, 642341, 652791, 663772, 675434, 688122, 701733, 715859, 730282, 744905, 759462, 773711, 787722, 801553, 814771, 826565, 836153, 842935, 846525, 846925, 844491, 839579, 832347, 822962, 811764, 799200, 785885, 772699, 760393, 749006, 738012, 727073, 716295, 705763, 695350, 685124, 675456, 666569, 658298, 650397, 642716, 635141, 627812, 621388, 616605, 613516, 611711, 611285, 613034, 617640, 625251, 635804, 648904, 662960, 675003, 681830, 681372, 673360, 659489, 642930, 626700, 611960, 598224, 585199, 573626, 564253, 556879, 550862, 545859, 541713, 538273, 535826, 535073, 536232, 538690, 541931, 546194, 551765, 558225, 565034, 572370, 580842, 590695, 601773, 613873, 626562, 638950, 650204, 660176, 669134, 676988, 683163, 687131, 688860, 688837, 687787, 686197, 684040, 681072, 677320]
59252F77320m333m923n505n495m600l427k631j969r09L98J564K855M648O374P011
59237F66378O467N617N148N139N433N618M883K872M24j314k328l449m940o381
59223F89567p590q672r345r274q994r375j0187j0236r013p339o204n807n834n939
59209E75758n850n568n411n388m849l436j970j487j723j541o08L75R31J198J218
59194E41649Q93O87J300K593L719M318M723N046N059M945N144N467N324M853M806
59179F00526N284N627N603N621N709N275M160K952K087J453J001Q48P37L19j0
59164F47192M33J269J295K46q13j147j263j773k468l062l923n364o966q146q871
59149F06639r293r236q555p569o787o431o437o515o240n452m616m279m325m223
$$ y = [677320, 672987, 668064, 662559, 657064, 652464, 649037, 646406, 644437, 643528, 643926, 645490, 648345, 652993, 659367, 666378, 672845, 678462, 683610, 688749, 694182, 699800, 704683, 707555, 707979, 706665, 704337, 700888, 695948, 689567, 681977, 673305, 663960, 654686, 645692, 636317, 626130, 615894, 606881, 599542, 593338, 587531, 581697, 575758, 569908, 564340, 558929, 553541, 548692, 545256, 543286, 541799, 540076, 538535, 537927, 538302, 539233, 540431, 541649, 542542, 543229, 544529, 547122, 550841, 555159, 559882, 564928, 569987, 574932, 580076, 585543, 590867, 595720, 600526, 605810, 611437, 617040, 622661, 628370, 633645, 637805, 640757, 642844, 644297, 645298, 646146, 646883, 647202, 647192, 647625, 648894, 650189, 650435, 649622, 648475, 647212, 645439, 642971, 639909, 635986, 630622, 623656, 615510, 606639, 597346, 588110, 579555, 571986, 565199, 558768, 552331, 545816, 539576, 534124, 529508, 525229, 520904, 516681]
59135E16681l894l657l511l133k556k111j720r70J88J420K571L619M289M470M730
59120E16416N670O936P726P976Q210Q510Q609Q723R237R804R833R687J0224J1346
59106F38907J2139J2286J2139J1535R929P664N767M424K891J018n06j419k073
59093G14701k322j663o23n31j576k559k801k855k977k515j467j156k521m859o949
59078F77327q357r099r138q857q971r391r110p760o212n222m544l882l600l863
59064E79321m115m018l985m278m481m332m134l952l483k955l080l698l825l328
59050E25657l223l753l747k578j331j037j112n53M05R70J133J306J424J339J409
59035E16309J833K197K305K681L558M293M495M792N800P229Q756J0755J3356J5732
$$ y = [516681, 512787, 509130, 505619, 502486, 499930, 497819, 496099, 495129, 495317, 496737, 499308, 502927, 507216, 511686, 516416, 522086, 529022, 536748, 544724, 552934, 561444, 570053, 578776, 588013, 597817, 607650, 617337, 627561, 638907, 651046, 663332, 675471, 687006, 696935, 704599, 710366, 714790, 717681, 718699, 718193, 716774, 714701, 712379, 710716, 710093, 709562, 707986, 705427, 702626, 699771, 696794, 694279, 692812, 691656, 689135, 684276, 677327, 668970, 659871, 650733, 641876, 632905, 623514, 614404, 606644, 600432, 595210, 590666, 586784, 583184, 579321, 575206, 571188, 567203, 562925, 558444, 554112, 549978, 546026, 542543, 539588, 536508, 532810, 528985, 525657, 522434, 518681, 514934, 512356, 511025, 509988, 508876, 508323, 508728, 509698, 510831, 512137, 513561, 514900, 516309, 518142, 520339, 522644, 525325, 528883, 533176, 537671, 542463, 548263, 555492, 564248, 575003, 588359, 604091]
59021F04091J7231J8347J9700K0829K0812J9328J6452J2260P384L045k72l313
59009G55894o545r095j0070r925r550q872p410n436l580j877j28J375K288K841
58995F89910L235L078K069O28p83k297l978n254n699n621n411n059m847n454o781
58980F47736p638p319o413n463l992j741L73J557K318L355M310M686N012N904
58966F42685O865P153O980O873O661O188O089O711P161O526N173L715J748j129
58952G19399m018n898p227q891j0384j0666j0145j0093j0533j0344r219p959o956
58939F07066n796m359l097k152j307p53q84j401j546j166o79j96M68J051R63J03
58923E86315j085k176k907l064k808k721k995l090k673k273k386k691k736k601
$$ y = [604091, 621322, 639669, 659369, 680198, 701010, 720338, 736790, 749050, 756434, 759479, 759207, 755894, 749349, 740254, 730184, 720259, 710709, 701837, 694427, 688991, 685411, 683534, 683406, 684781, 687069, 689910, 693145, 696223, 698292, 698920, 698137, 695840, 691862, 686608, 680909, 675288, 669877, 664818, 659971, 654517, 647736, 640098, 632779, 626366, 620903, 616911, 615170, 615543, 617100, 619418, 622773, 627083, 631769, 636781, 642685, 649550, 656703, 663683, 670556, 677217, 683405, 689494, 696205, 703366, 709892, 715065, 718780, 720528, 719399, 715381, 709483, 702256, 693365, 682981, 672315, 662170, 652077, 641544, 631200, 621981, 614022, 607066, 601270, 596911, 593814, 591662, 590355, 589602, 588718, 587317, 585771, 584605, 583926, 583730, 584198, 585249, 586212, 586315, 585230, 583054, 580147, 577083, 574275, 571554, 568559, 565469, 562796, 560523, 558137, 555446, 552710, 550109]
58909E50109k163p26J696L633L879L249L536N242P400R113J0170J0576J0456J0199
58895F26369R952R368Q380P616P542P998R051J1230J4221J6546J7426J7756J8210
58882G81665J7776J5479J2333R898Q012N558K657L22j456l575o095q134r232r589
58868H15619r315q511p642o850n573l735k461k516l043l109l394m892o950q251
58854G39377q853r626j0406j0446r939r445q487o457m199k987k627k267k362l887
58840F47389o298q189r472j0918j2170j2185j1282j0619j0039q537o497n303m908
58827E30972m052k758k369l014l228k395j516j182p33J87J038J678K570L378L039
58812E21615J606M42K94N98Q72J231J386P57k45n20pL52L16M27M85k14j192j193
$$ y = [550109, 547946, 547220, 548916, 552549, 556428, 559677, 563213, 568455, 575855, 584968, 595138, 605714, 616170, 626369, 636321, 645689, 654069, 661685, 669227, 677225, 686276, 697506, 711727, 728273, 745699, 763455, 781665, 799441, 814920, 827253, 837151, 845163, 850721, 853378, 853700, 852244, 848669, 842574, 834440, 825208, 815619, 806304, 797793, 790151, 783301, 777728, 773993, 771532, 769016, 765973, 762864, 759470, 754578, 747628, 739377, 730524, 720898, 710492, 700046, 690107, 680662, 672175, 665718, 661519, 658532, 655905, 653638, 651276, 647389, 641091, 632902, 623430, 612512, 600342, 588157, 576875, 566256, 556217, 547680, 541183, 535880, 530972, 526920, 524162, 521793, 518779, 515551, 513156, 511640, 510458, 509725, 509912, 510950, 512628, 515198, 518576, 521615, 523221, 523663, 523957, 524555, 525427, 526658, 528044, 528801, 528556, 528036, 528029, 528381, 528697, 529124, 529609, 529395, 528203, 527010]
58794E27010m02l17j206j687j180p36r43r50k12N86J069J856L055L715L579L784
58778E37021N023O393O941P013P246P400O930N737L797J005k153m718o354p398
58764E73883p806p221o096n384n048m208k826j737r97K25J868K879L082L456M148
58749E48218L996K616J270R70J198J239J353J900K579L202M051M980N337N212
58735E88121N566O703P839Q455Q817Q947Q514Q034Q656J0268J1241J0538Q761
58722G00460O802M936L578L427M312N285O172P638R419J0140R384Q418Q228Q274
58708G96473P675O238L797N5m359p976j0235j1990j3955j5971j7965k0182k2100
58695F89505k2644k1840k0828j9977j8443j5957j3435j1539j0047q880q237p676
$$ y = [527010, 526608, 526291, 525085, 523398, 522218, 521482, 520539, 519589, 519377, 519963, 521032, 522888, 525943, 529658, 533237, 537021, 542044, 548437, 555378, 562391, 569637, 577037, 583967, 589704, 593501, 594506, 592353, 587635, 581281, 573883, 566077, 558856, 552760, 547376, 542328, 538120, 535294, 533557, 532560, 532785, 534653, 537532, 540614, 544070, 548218, 552214, 554830, 556100, 557070, 558268, 559507, 560860, 562760, 565339, 568541, 572592, 577572, 582909, 588121, 593687, 600390, 608229, 616684, 625501, 634448, 642962, 650996, 659652, 669920, 681161, 691699, 700460, 707262, 712198, 715776, 719203, 723515, 728800, 734972, 742610, 752029, 762169, 771553, 779971, 788199, 796473, 804148, 810386, 814183, 814238, 809879, 801903, 791668, 779678, 765723, 749752, 731787, 711605, 689505, 666861, 645021, 624193, 604216, 585773, 569816, 556381, 544842, 534795, 525915, 517678, 510002]
58683E10002o587n610n821o568o135m449l043k288j167J83L10n99m38J457L267
58668D72514L922M732O662Q557R432J0163J1417J2113J1368R945Q364N646J487
58655E76322k317m210m907n603n974n499n006n288n651n354n025n234n192m197
58641E06865k977k358j932j218o67m73R7J103J398O08o3Lj72j002j303o14l75
58624D96920j372k162j591p50p84q56j06M88J77L67K313M671N520N300N518N977
58608E19630N516M285L258K459J543J066J467J898J588J222J481J589P78k25o88
58593E46867j308k496k915j518N02J627K372L825N382O010O373P630R217R842
58579E91410R638R506R410R036Q974R581R855R056Q201Q300Q690Q717R514J2200
$$ y = [510002, 503415, 497805, 491984, 485416, 479281, 474832, 471789, 469501, 468334, 468517, 468827, 468228, 467790, 469247, 472514, 476436, 481168, 487830, 496387, 505819, 515982, 527399, 539512, 550880, 560825, 569189, 574835, 576322, 574005, 569795, 564888, 559285, 553311, 547812, 542806, 537518, 531867, 526513, 521488, 516254, 511062, 506865, 503888, 501530, 499598, 498380, 497713, 497240, 497337, 498440, 499838, 500446, 500383, 500386, 500214, 499212, 497909, 497295, 496920, 495548, 493386, 491795, 491045, 490261, 489405, 489299, 489787, 489964, 490331, 492644, 497315, 502835, 508135, 513653, 519630, 525146, 529431, 532689, 535148, 536691, 537757, 539224, 541122, 542710, 543932, 545413, 547002, 547780, 547555, 546867, 545559, 543063, 540148, 538630, 539132, 540759, 543131, 546956, 552338, 558348, 564721, 572351, 581568, 591410, 601048, 610554, 619964, 629000, 637974, 647555, 657410, 666466, 674667, 682967, 691657, 700374, 709888, 722088]
58565G22088J5810J8954K2103K6152L0167L2706L4052L5095L5231L3466L0350
58554A036174K6764K2039J5440Q339K809r47l931o303p885r462j1591j3316j3888
58541A044242j4552j6735j9783k2321k4399k6418k7504k6935k5714k4695k2843
58530G92343j9427j6117j4598j3729j1609q782o873n681m231l221l638m384m040
58517F76013l535m294n149m111k014j279k064k609k574l065m039m429m280m274
58503F28297l897k486j128j123j563r03K42L51j10K83J166J307J111J635K322
58488F25504K360K891N065P403Q067Q274J0268J3266J4896J5352J6660J8786J9994
58475G68786K0200K0461J9925J6815J1754O921K565k458p529j0959j2955j4656
$$ y = [722088, 737898, 756852, 778955, 805107, 835274, 867980, 902032, 937127, 972358, 1005824, 1036174, 1062938, 1084977, 1100417, 1108756, 1111565, 1110618, 1106687, 1100384, 1092499, 1083037, 1071446, 1058130, 1044242, 1029690, 1012955, 993172, 970851, 946452, 920034, 892530, 865595, 839881, 815186, 792343, 772916, 756799, 742201, 728472, 716863, 708081, 701208, 695527, 691296, 688075, 684437, 680053, 676013, 672478, 668184, 663035, 658924, 656910, 655631, 653567, 650958, 648384, 645319, 641280, 636851, 632571, 628297, 624400, 621914, 620786, 619663, 618100, 617197, 617439, 617790, 617680, 617963, 619129, 620436, 621547, 623182, 625504, 627864, 630755, 635820, 643223, 651290, 659564, 669832, 683098, 697994, 713346, 730006, 748792, 768786, 788986, 809447, 829372, 846187, 857941, 864862, 867427, 864969, 857440, 846481, 833526, 818870]
58463H18870j5251j3470j0854r778r239o521k170P84K013M061P570J0488J1969
58450G88472J3131J3803J2292Q649M705Q40l949q819j1475j1721j1392j0924r368
58437G74244p374o597o327m407j221Q64J693L230N528O711O903Q323J1365J4127
58423H07062J5732J6479J5188J0435M165L4j835m327p927j0131j0284j0478j1349
58410H12764j1268j0140r762j0038q956o722n720o029n221k995j677j679q41J126
58396G32842J976J378J712L582M753M349M023M246L502J869J302J842J520M97
58382G69393R38K492K422P45N28K422L551K716K074K731L244L345M710P060P994
58367H16365P415P780R385R960R373R875J1366J1436J0502J1500J4045J4458J2255
$$ y = [818870, 803619, 790149, 779295, 769517, 760278, 753757, 751587, 752371, 754384, 758445, 766015, 776503, 788472, 801603, 815406, 827698, 836347, 841052, 841892, 837943, 829124, 817649, 805928, 794536, 783612, 774244, 766870, 760273, 753946, 749539, 748318, 749182, 750875, 754105, 759633, 766344, 773247, 781570, 792935, 807062, 822794, 839273, 854461, 864896, 869061, 869095, 867260, 862933, 855006, 844875, 834591, 824113, 812764, 801496, 791356, 781594, 771556, 762600, 755878, 750158, 744129, 738908, 735913, 734236, 732557, 731716, 732842, 734818, 736196, 737908, 741490, 746243, 750592, 754615, 758861, 762363, 764232, 765534, 767376, 768896, 769393, 770331, 772823, 775245, 775990, 776518, 778940, 782491, 785207, 787281, 790012, 793256, 796601, 801311, 808371, 816365, 823780, 831560, 840945, 850905, 860278, 870153, 881519, 892955, 903457, 914957, 929002, 943460, 955715]
58354I55715J0835J0926R441N916L882M366M197K384K012L911M622K903K257M637
58340A028004P277Q161R051J0872J1633J1131J2176J5068J6370J5138J4623J5965
58328A175469J6141J4113J2739J2591J0360N725L151M306N268L891L270N047O130
58315A278201N094N148P627R225Q729R642J2961J4495J2759J2263J5235J7346
58303A408725J5743J4040J5122J6113J4903J4646J7180J8808J7184J5746J7014
58292A585224J8193J7573J8253K1388K2993K1627K1650K4698K5940K3338K2201
58281A823078K5575K8619K7900K7684L1212L4338L3932L4158L8038M1194M0366
58270B186094L9899M3273M6572M6852M8367N3904N8691N9656O1664O7651P2019
$$ y = [955715, 966550, 977476, 986917, 992833, 996715, 1001081, 1005278, 1007662, 1009674, 1013585, 1018207, 1021110, 1023367, 1028004, 1035281, 1043442, 1052493, 1063365, 1074998, 1086129, 1098305, 1113373, 1129743, 1144881, 1159504, 1175469, 1191610, 1205723, 1218462, 1231053, 1241413, 1247138, 1250289, 1254595, 1259863, 1263754, 1267024, 1272071, 1278201, 1283295, 1288443, 1296070, 1305295, 1314024, 1323666, 1336627, 1351122, 1363881, 1376144, 1391379, 1408725, 1424468, 1438508, 1453630, 1469743, 1484646, 1499292, 1516472, 1535280, 1552464, 1568210, 1585224, 1603417, 1620990, 1639243, 1660631, 1683624, 1705251, 1726901, 1751599, 1777539, 1800877, 1823078, 1848653, 1877272, 1905172, 1932856, 1964068, 1998406, 2032338, 2066496, 2104534, 2145728, 2186094, 2225993, 2269266, 2315838, 2362690, 2411057, 2464961, 2523652, 2583308, 2644972, 2712623, 2784642]
58259B784642P1053P0288P3926P6750P4465P2024P3407P3441O8557O5250O8776
58248C572579P3666P4799P7166Q5193R3293R7024J02373J13734J24266J28795
58238D542888J34252J46058J56672J59548J61853J70857J80740J85901J93918
58229F032687K11464K30952K45337K62133K88026L14469L34234L56879L91262
58220H667443M28571M59892M93906N39094N86303O28374O78186P46497Q21879
58211A4050145Q94958R81209J095535J226759J363435J520898J714833J934915
58203B4782687K176501K470951K850906L316672L874490M573419N462316O550091
58195E6058033P857528R465145J1457656J3878352J6804861K0400639K4804297
$$ y = [2784642, 2855695, 2925983, 2999909, 3076659, 3151124, 3223148, 3296555, 3369996, 3438553, 3503803, 3572579, 3646245, 3721044, 3798210, 3883403, 3976696, 4073720, 4176093, 4289827, 4414093, 4542888, 4677140, 4823198, 4979870, 5139418, 5301271, 5472128, 5652868, 5838769, 6032687, 6244151, 6475103, 6720440, 6982573, 7270599, 7585068, 7919302, 8276181, 8667443, 9096014, 9555906, 10049812, 10588906, 11175209, 11803583, 12481769, 13228266, 14050145, 14945103, 15926312, 17021847, 18248606, 19612041, 21132939, 22847772, 24782687, 26959188, 29430139, 32281045, 35597717, 39472207, 44045626, 49507942, 56058033, 63915561, 73380706, 84838362, 98716714, 115521575, 135922214, 160726511]
58188A60726511L0027448L5965499M2156539M7089612M7903603M1622926K7503646
58181D32995784Q307418j1030364k6242962l5581333l9562240l9657916l7344657
58174B51883730l3804073k9855416k5943231k2263398j8934583j6036613j3567324
58167I1479092j1471967r713921q269119p081116o080872n236117m537583l955329
58159C5133068l450209l011384k643886k333494k057744j816594j619333j454036
58151A6746388j299928j157507j038125r35568q35128p40210o63852o03094n45618
58142H927358m92985m54496m26227l97589l70827l53666l40335l19646k94660
58133E476927k75450k59520k37802k13330j95666j82895j66651j49334j39314
$$ y = [160726511, 190753959, 226719458, 268875997, 315965609, 363869212, 405492138, 432995784, 441303202, 430272838, 404029876, 368448543, 328886303, 289228387, 251883730, 218079657, 188224241, 162281010, 140017612, 121083029, 105046416, 91479092, 80007125, 70293204, 62024085, 54942969, 48862097, 43625980, 39088397, 35133068, 31682859, 28671475, 26027589, 23694095, 21636351, 19819757, 18200424, 16746388, 15446460, 14288953, 13250828, 12315260, 11480132, 10739922, 10076070, 9472976, 8927358, 8434373, 7979877, 7553650, 7156061, 6785234, 6431568, 6091233, 5771587, 5476927, 5201477, 4941957, 4704155, 4490825, 4295159, 4112264, 3945613, 3796279, 3656965]
58124C656965j34218j25479j14695j09637j08448j03220r5137r1202q9835q4172
58114B600922p6021p2533p2339o8568o2325n9996o0294n6975n1508n0296n1994
58103A918073n0072m5481m4558m6567m5301m1136l9754m0608l8116l2932l0896
58092A462652l1937l0666k6936k5446k5882k3531j8966j7255j8307j7383j4557
58081A211786j4434j7072j8113j7382j8672k1545k1815j9757j9582k1378k1451
58070A000585k0008k0476k1970k0421j6592j5090j5932j4869j1567r772r734q134
58058H16020n389n469q437j0277j0123j0833j2527j2360j0573j0145j0733r457
58046F99697p181p312q965q165n437n137p492q321o704o015p016o796m997m540
$$ y = [3656965, 3522747, 3397268, 3282573, 3172936, 3064488, 2961268, 2866131, 2774929, 2685094, 2600922, 2524901, 2452368, 2380029, 2311461, 2249136, 2189140, 2128846, 2071871, 2020363, 1970067, 1918073, 1868001, 1822520, 1777962, 1731395, 1686094, 1644958, 1605204, 1564596, 1526480, 1493548, 1462652, 1430715, 1400049, 1373113, 1347667, 1321785, 1298254, 1279288, 1262033, 1243726, 1226343, 1211786, 1197352, 1180280, 1162167, 1144785, 1126113, 1104568, 1082753, 1062996, 1043414, 1022036, 1000585, 980577, 960101, 938131, 917710, 901118, 886028, 870096, 855227, 843660, 833888, 824154, 816020, 810631, 805162, 796725, 786448, 776325, 765492, 752965, 740605, 730032, 719887, 709154, 699697, 692516, 685204, 676239, 668074, 662637, 657500, 650008, 641687, 634983, 628968, 621952, 615156, 610159, 605619]
58032F05619n600n275l766m552p762r621r087r077j0393j0479q953q511r410q755
58018D94378o160m602m879m570l223l185m520m443k630j936l071l615k931l014
58004D41599l919l452j856j718k764k019M60J425M55N35K016J768o52j778n15
57989D29585J1j563k475j304n31j566k199j177o87k071l318l039k956m381n872
57974C96457o259o433o610n328k703j146j484j749r36m10n89R6J829K651K156
57959C69542K281L517L953K994K293K115O66j994l354k761k435l172l050j500
57945C69095n65q99n82Q47J298M23P79L171N036N123N661P951R845R759R408J0252
57929D36602J0682R086O518M224J516j984m923o755q784j1216j2183j1209j0418
$$ y = [605619, 600019, 594744, 590978, 586426, 578664, 569043, 559956, 550879, 540486, 530007, 521054, 512543, 503133, 494378, 488218, 483616, 478737, 474167, 470944, 467759, 463239, 458796, 456166, 454230, 451159, 447544, 444613, 441599, 437680, 434228, 432372, 430654, 427890, 425871, 426331, 427756, 428211, 428746, 430762, 432530, 431878, 430100, 429585, 429596, 428033, 425558, 424254, 423723, 422157, 419958, 418781, 418094, 416023, 412705, 409666, 406710, 402329, 396457, 390198, 383765, 377155, 371827, 369124, 367978, 366494, 364745, 363809, 363399, 362810, 362906, 364735, 367386, 369542, 371823, 375340, 379293, 382287, 384580, 386695, 387361, 385367, 382013, 379252, 376817, 373645, 370595, 369095, 368530, 367631, 367049, 367896, 369194, 369617, 370396, 373567, 378603, 383726, 389387, 397338, 407183, 416942, 426350, 436602, 447284, 456370, 462888, 467112, 468628, 466644, 461721, 454966, 446182, 434966, 422783, 411574, 401156]
57916D01156j0769j0394q252o156n430m823l509k856l407l274j497O2j0m10N5
57901C40486L45m12j271j769k935m552m571k663j072n01J191M544O668N974M933
57886C44395N627O282N010L518L909M897M326K875K124J439k52j823j998j940
57872C78389l040m137l633k499k480l082k914k375k587l084k789j954j251m02
57858C42162P94J669K283L811O036O845N610M546N045N437M273K939K732K121
57844C96303l53k983l445k367j675j441r56r20j872k276q47R17J078L96O33J359
57828C81551J144M10N17J178J215P33N26M52K41N28J357J357O8q69o64j309m315
57811C84120p843r525j0023j1038j1860j0971r344q911r025p653n081l480l405
$$ y = [401156, 390387, 379993, 371741, 365585, 360155, 355332, 351823, 348967, 345560, 342286, 340789, 340851, 340841, 340431, 340486, 340831, 340419, 339148, 337379, 334444, 329892, 325321, 322658, 321586, 321085, 322276, 326820, 333488, 339462, 344395, 350022, 356304, 361314, 364832, 368741, 373638, 377964, 380839, 382963, 384402, 384150, 382327, 380329, 378389, 375349, 371212, 367579, 365080, 362600, 359518, 356604, 354229, 351642, 348558, 345769, 343815, 342564, 342162, 342956, 344625, 346908, 350719, 356755, 363600, 369210, 373756, 378801, 384238, 388511, 391450, 394182, 396303, 395950, 392967, 389522, 387155, 385480, 384039, 383083, 382163, 380291, 378015, 377168, 378085, 379163, 379559, 380192, 381551, 382695, 383105, 383622, 384800, 386015, 386748, 387274, 387726, 387967, 388495, 389852, 391209, 391277, 390408, 389744, 388435, 384120, 376277, 366752, 356729, 345691, 333831, 322860, 313516, 304605, 295580, 287927, 282846, 279366, 275961]
57798B75961l452k884k168j468o86m63j195j808j211m2O23J039J630J623P02M78
57782B66679K151M279N036N144O223P724Q064P497P298P218O281N053M658M488
57768C47793L334J764J056P02o58k703m083m653m950m511k945j627j913k758k341
57753C21507r76q8M50J489K271J593L17J10N65J90p21q41n34j054j789j164L02
57736C21627O30l28r00n27j36lK99K11j077k582k662j664j150j050r4J438K120
57719C14152K058K519L230K761J383Q45J419J721J394J399J700J266L44K84R90
57704C37465R99J56k21Q7o9p62p38J61O34K76P3K55j55j350k361k951l910n254
57686C22335o030o064o047n879m862l427k641k125o10J613L143M220O552J0240
$$ y = [275961, 272509, 269625, 267457, 265989, 265303, 264840, 263645, 261837, 260626, 260584, 261207, 262246, 263876, 265499, 266201, 266679, 268830, 273109, 278145, 283289, 289512, 297236, 305300, 312797, 320095, 327313, 333594, 338647, 343305, 347793, 351127, 352891, 353947, 354649, 353991, 351288, 347205, 342552, 337602, 333091, 330146, 328519, 326606, 323848, 321507, 320531, 320443, 320893, 322382, 324653, 326246, 326563, 326673, 327238, 327428, 326707, 325866, 325332, 324278, 322489, 321325, 321627, 322257, 321929, 321029, 320502, 320366, 320363, 320662, 320873, 319796, 317214, 314552, 312888, 311738, 310688, 310594, 312032, 314152, 316210, 318729, 321959, 324720, 326103, 326948, 328367, 330088, 331482, 332881, 334581, 335847, 336191, 336475, 337465, 338464, 338620, 338399, 338486, 338417, 337655, 336917, 337078, 337712, 337988, 338061, 338316, 338161, 336811, 334450, 331499, 327589, 322335, 316305, 310241, 304194, 298315, 293453, 290026, 287385, 285260, 284650, 286263, 289406, 293626, 300178, 310418]
57672C10418J3457J5616J8470K3407K9938L7434M6194N5640O2939O4151N6033
57661G33697L7421J1042j6179l6968m8687n3331n3316m9596m3464l7141l1628
57650D11850k6237k0871j6750j4317j2418j0243q272o784n286l843l197l145k623
57637B77864j650j386j921j918q33L78J082J596J795J062j16m93k68q39k156k562
57621B69635j682j040j290j226k85K37m62j321j368j246j670k098j938j567j301
57606B51378q20k33j88m79j90L95p2j524k139j107J94M97K08p6o51j480j700j210
57588B40803j057j579j864j685j981k743k497q00P14P98K20k7k68q03r39m38l33
57571B25521j167j997k064j870j817j421p55p93j498j425j27R40R20Q38J318J228
$$ y = [310418, 323875, 339491, 357961, 381368, 411306, 448740, 494934, 550574, 613513, 677664, 733697, 771118, 782160, 765981, 729013, 680326, 626995, 573679, 524083, 480619, 443478, 411850, 385613, 364742, 347992, 333675, 321257, 311014, 302742, 295958, 290672, 286829, 283632, 280487, 277864, 276214, 274828, 272907, 270989, 270156, 270534, 271616, 273212, 275007, 276069, 275953, 275460, 275192, 274353, 272197, 269635, 267953, 266913, 265623, 264397, 264112, 264349, 263887, 262566, 261198, 259952, 258282, 256184, 254246, 252679, 251378, 250558, 250325, 250137, 249658, 249468, 249863, 249791, 248267, 246128, 245021, 245215, 245712, 245920, 245844, 245193, 243713, 242013, 240803, 239746, 238167, 236303, 234618, 232637, 229894, 227397, 226597, 227311, 228109, 228329, 228302, 228034, 227231, 226292, 225854, 225521, 224354, 222357, 220293, 218423, 216606, 215185, 214430, 213637, 212139, 210714, 210587, 211527, 212447, 213285, 214603, 215831]
57555B15831lq34j17P66J64j080j023M59J970K800L128K953K242J508J134R05
57539B30803R11J756L120L455K120M13m41q39j361j389m64M35L81pJ55M64J94
57522B39706l41n49n47l56N76K053K724K143J702K413L256L074K518K559K609
57507B63540J803Q46Q27J292J200Q71J264K074K142J181j53j266j713j074K00
57492B73034P46L1p96p15k99l54m68m3M23L80L12N86M61m81j136n13O26J108J143
57473B74045J442J674J239N21L9n67j439j638p12J22j08l74O08K104K583K161
57457B81700K065K516K796K712K440J770P81M02R96J516J247J164K125L137L081
57442C10448K692L063L469K778J702J569J989J916J902K952M056L420J577P79
$$ y = [215831, 215828, 214994, 214877, 215643, 215807, 214727, 213704, 214163, 216133, 218933, 222061, 225014, 227256, 228764, 229898, 230803, 231714, 233470, 236590, 240045, 242165, 242578, 242137, 241298, 239937, 238548, 238084, 238519, 238900, 238893, 239048, 239512, 239706, 239365, 238816, 238269, 237913, 238489, 240542, 243266, 245409, 247111, 249524, 252780, 255854, 258372, 260931, 263540, 265343, 266189, 267016, 268308, 269508, 270379, 271643, 273717, 275859, 277040, 276887, 275621, 273908, 272834, 273034, 273780, 273811, 273015, 272300, 272001, 271647, 271179, 271136, 271559, 271939, 272251, 272837, 273298, 272817, 271681, 271168, 271794, 272902, 274045, 275487, 277161, 278400, 278921, 278960, 278393, 276954, 275316, 274604, 274726, 274618, 274244, 274852, 276956, 279539, 281700, 283765, 286281, 289077, 291789, 294229, 295999, 296780, 297182, 298178, 299694, 300941, 302105, 304230, 307367, 310448, 313140, 316203, 319672, 322450, 324152, 325721, 327710, 329626, 331528, 334480, 338536, 341956, 343533, 344312]
57428C44312J659K773L170L253L260K969K759L133L398K605J488J504K375K542
57414C81200J784J338J543J517J144J330K190K800K899L039L009J965L38k95M85
57399D06286J344J323R73J061J547K258L258M209M531M393M499M896N046N009
57385D50633N294N615N131L956L231L560M441N261N841O044N807N469N191M452
57371E19926L019J833J849K525K774K795L458M450M649M057L758M132M519M560
57357E68304M484M268L812L654M283N066N173N058N600O370O366N932O177O886
57343F41433O870O079N554N463N083M561M830N761O191N853N597N752N911O281
57329G21219P438Q751Q903P982P330P319P077O467O395O957P287P390Q214R568
$$ y = [344312, 345971, 348744, 351914, 355167, 358427, 361396, 364155, 367288, 370686, 373291, 374779, 376283, 378658, 381200, 382984, 384322, 385865, 387382, 388526, 389856, 392046, 394846, 397745, 400784, 403793, 405758, 406096, 405801, 406286, 407630, 408953, 409926, 410987, 412534, 414792, 418050, 422259, 426790, 431183, 435682, 440578, 445624, 450633, 455927, 461542, 466673, 470629, 473860, 477420, 481861, 487122, 492963, 499007, 504814, 510283, 515474, 519926, 522945, 524778, 526627, 529152, 531926, 534721, 538179, 542629, 547278, 551335, 555093, 559225, 563744, 568304, 572788, 577056, 580868, 584522, 588805, 593871, 599044, 604102, 609702, 616072, 622438, 628370, 634547, 641433, 648303, 654382, 659936, 665399, 670482, 675043, 679873, 685634, 691825, 697678, 703275, 709027, 714938, 721219, 728657, 737408, 746311, 754293, 761623, 768942, 776019, 782486, 788881, 795838, 803125, 810515, 818729, 828297]
57315H28297J0005R176Q472Q738R222R289R423R880J0012R613R423R711R805R574
57301I60640R759J0358J0313R389Q818R281R798R439Q774Q726R185R560R709R612
57287A093361R055Q175P477P000O348N675N529N688N324M527M276M816N442O047
57273A178740P405R642J1911J3855J5921J8023J9425K0266K1621K3584K4924K5071
57261A390388K4877K4941K4824K4408K4458K5144K5567K5364K5311K5724K5824
57250A666830K5297K4929K5029K4747K3748K3065K3387K3948K3927K3716K3921
57239A932544K4343K4646K4920K5029K4590K4124K4744K6183K6681K5529K4142
57228B207475K3756K3636K2561K0746J9204J8376J8291J8984J9925K0111J9461
$$ y = [828297, 838302, 847478, 855950, 864688, 873910, 883199, 892622, 902502, 912514, 922127, 931550, 941261, 951066, 960640, 970399, 980757, 991070, 1000459, 1009277, 1018558, 1028356, 1037795, 1046569, 1055295, 1064480, 1074040, 1083749, 1093361, 1102416, 1110591, 1118068, 1125068, 1131416, 1137091, 1142620, 1148308, 1153632, 1158159, 1162435, 1167251, 1172693, 1178740, 1186145, 1195787, 1207698, 1221553, 1237474, 1255497, 1274922, 1295188, 1316809, 1340393, 1365317, 1390388, 1415265, 1440206, 1465030, 1489438, 1513896, 1539040, 1564607, 1589971, 1615282, 1641006, 1666830, 1692127, 1717056, 1742085, 1766832, 1790580, 1813645, 1837032, 1860980, 1884907, 1908623, 1932544, 1956887, 1981533, 2006453, 2031482, 2056072, 2080196, 2104940, 2131123, 2157804, 2183333, 2207475, 2231231, 2254867, 2277428, 2298174, 2317378, 2335754, 2354045, 2373029, 2392954, 2413065, 2432526]
57217B432526J9038J9384J9827J9964K0393K1381K2249K2728K3457K4426K4573
57206B669946K3689K3124K3659K4273K3992K3366K3045K2514K1381K0437K0182
57195B919608J9787J8761J8166J8778J9534J9272J8691J9056K0116K0944K1736
57184C134449K3203K5041K6507K7761K9253L0530L0980L1010L1208L1121L0092
57173C451155K8549K7258K6041K4451K2946K2151K1659K0782J9820J9411J9290
57162C703513J8818J8127J7607J6958J5827J4757J4269J3686J2104R966Q515Q014
57150C872161P651O890N956N249N045N456O125O449O590P596R916J2559J4408
57137C972051J5639J7158J9321K1784K4015K5411K5749K5815K6618K7613K7013
$$ y = [2432526, 2451564, 2470948, 2490775, 2510739, 2531132, 2552513, 2574762, 2597490, 2620947, 2645373, 2669946, 2693635, 2716759, 2740418, 2764691, 2788683, 2812049, 2835094, 2857608, 2878989, 2899426, 2919608, 2939395, 2958156, 2976322, 2995100, 3014634, 3033906, 3052597, 3071653, 3091769, 3112713, 3134449, 3157652, 3182693, 3209200, 3236961, 3266214, 3296744, 3327724, 3358734, 3389942, 3421063, 3451155, 3479704, 3506962, 3533003, 3557454, 3580400, 3602551, 3624210, 3644992, 3664812, 3684223, 3703513, 3722331, 3740458, 3758065, 3775023, 3790850, 3805607, 3819876, 3833562, 3845666, 3855632, 3864147, 3872161, 3879812, 3886702, 3892658, 3897907, 3902952, 3908408, 3914533, 3920982, 3927572, 3935168, 3945084, 3957643, 3972051, 3987690, 4004848, 4024169, 4045953, 4069968, 4095379, 4121128, 4146943, 4173561, 4201174, 4228187]
57126D228187K4381K1496K0001J9640J9744K0877K3753K7877L2646L8726M7064
57115D524392N7347O8636Q0620R3182J05706J18028J31235J46601J64608J86009
57105E676364K12733K46680K88617L39289M00676M75132N64381O70484P96756
57096I671112R46620J122424J326204J560276J825610K120239K439838K778330
57088B3790653L126409L469848L789481M061776M259594M354939M322149M137357
57080E5312206L776892L224252K486821J608001O61357k69409j111263j816370
57072F3872487k369217k783196l085914l302504l448171l529813l549195l505584
57064C8298893l400347l241214l041236k814361k573588k331538k098801j881096
$$ y = [4228187, 4252568, 4274064, 4294065, 4313705, 4333449, 4354326, 4378079, 4405956, 4438602, 4477328, 4524392, 4581739, 4650375, 4730995, 4824177, 4929883, 5047911, 5179146, 5325747, 5490355, 5676364, 5889097, 6135777, 6424394, 6763683, 7164359, 7639491, 8203872, 8874356, 9671112, 10617732, 11740156, 13066360, 14626636, 16452246, 18572485, 21012323, 23790653, 26917062, 30386910, 34176391, 38238167, 42497761, 46852700, 51174849, 55312206, 59089098, 62313350, 64800171, 66408172, 67069529, 66800120, 65688857, 63872487, 61503270, 58720074, 55634160, 52331656, 48883485, 45353672, 41804477, 38298893, 34898546, 31657332, 28616096, 25801735, 23228147, 20896609, 18797808, 16916712]
57056A6916712j680112j496988j332928j187142j057072r40857q37595p45575
57048G638443o62777n88977n25009m69941m21285l77834l39895l06925k77415
57039C668385k51139k28822k09487j90649j71372j52517j33795j13414r1062o8098
57029B058030m4191j7677Q480K4175J9246p024m4725q0481j04895j15199j14040
57018A581699j06469r6846q7340p8522p0391o2698n5295m8579m3103l8673l4626
57007H59157l0993k8446k7047k5987k4638k3048k1438k0036j9275j9171j8808
56996F00270j7384j5413j3839j2438j0466q343p111o470n063k564J40K794O139
56983E10252J0256J3968J6022J5520J1497L765n709j3896j9328k2383k3352k2109
$$ y = [16916712, 15236600, 13739612, 12406684, 11219542, 10162470, 9221613, 8384018, 7638443, 6975666, 6386689, 5861680, 5391739, 4970454, 4592620, 4252725, 3945800, 3668385, 3417246, 3188424, 2978937, 2788288, 2616916, 2464399, 2330604, 2217190, 2126128, 2058030, 2013839, 1996162, 2004642, 2028817, 2048063, 2041039, 1996314, 1915833, 1810938, 1695739, 1581699, 1475230, 1378384, 1291044, 1212522, 1142131, 1079433, 1024138, 975559, 932456, 893783, 859157, 828164, 799718, 772671, 746684, 722046, 698998, 677560, 657524, 638249, 619078, 600270, 582886, 567473, 553634, 541196, 530730, 522387, 515276, 508806, 503743, 501179, 501319, 504113, 510252, 520508, 534476, 550498, 566018, 577515, 581280, 575571, 561675, 542347, 519964, 496612, 474503]
56971D74503j9512j7138j5257j2888r982p739o418m745j969J225M323P821J2029
56958D04253J6618K1643K7121L1130L0314K3209J1765q67j2505k1531k6590k7769
56946D76791k6753k4812k1886j8084j4503j1668q708m989j229J859M843Q558J2924
56933C72343J7581K2766K8768L5093M0337M2110L7378K4757O973j0396k3215l0841
56921E63654l4251l4287l2307l0240k8717k6517k2959j9390j7316j6377j5364
56910B85929j4035j2865j1941j1122j0507r907q733o955n350m205k797o85J548
56897A88375L416N337P800J0641J3601J6593J9082K0454K1298K3131K6422L0139
56885C86289L3381L5860L6352L2554K3548J1246j357j2152j9798k3450k3703k2492
$$ y = [474503, 454991, 437853, 422596, 409708, 399726, 391987, 385569, 380824, 378855, 380080, 384403, 392224, 404253, 420871, 442514, 469635, 500765, 531079, 554288, 566053, 565186, 552681, 531150, 504560, 476791, 450038, 425226, 403340, 385256, 370753, 359085, 350377, 345388, 344159, 346018, 350861, 359419, 372343, 389924, 412690, 441458, 476551, 516888, 558998, 596376, 621133, 628106, 617710, 594495, 563654, 529403, 495116, 462809, 432569, 403852, 377335, 354376, 334986, 317670, 301293, 285929, 271894, 259029, 247088, 235966, 225459, 215552, 206819, 199864, 194514, 190309, 187512, 186827, 188375, 191791, 197128, 204928, 215569, 229170, 245763, 264845, 285299, 306597, 329728, 356150, 386289, 419670, 455530, 491882, 524436, 547984, 559230, 557873, 545721, 525923, 502473, 478770, 456278]
56873D56278k1098j9170j6244j2837r358n280k88M996J0188J5823K2183K8760
56861D53953L5646M4028N4144O3619O8433O4928N1136K8247J564k1772l7449m5739
56849G60738m8700m7485m2910l6467k9304k1526j3441o029P00Q162J7089K6613
56837E67440L6408M7868O1906P7347R2611J06606J15905J13314R2685N5321J0126
56826A377537l2248o4572q4268r2376r1875q5710p6000o4800n4228m4981l5951
56815F50528k6291j6744p996Q98J1067K2081L3172M5128N9139P3838Q4502Q5085
56803A014407P1231M3185P120k7578n3887p0107p7728p8468p4211o7559o0250
56792F26155n2045m2572l3115k5151j8438j2071o196j083M381J1455J9692K7830
$$ y = [456278, 435180, 416010, 399766, 386929, 377571, 372291, 372003, 376999, 387187, 403010, 425193, 453953, 489599, 533627, 587771, 651390, 719823, 784751, 835887, 864134, 865698, 843926, 806477, 760738, 712038, 664553, 621643, 585176, 555872, 534346, 520905, 514876, 515576, 523738, 540827, 567440, 603848, 651716, 713622, 790969, 883580, 990186, 1106091, 1219405, 1312090, 1367411, 1377537, 1345289, 1280717, 1196449, 1104073, 1012198, 926488, 850488, 785688, 731460, 686479, 650528, 624237, 607493, 599497, 600395, 611462, 633543, 666715, 711843, 770982, 844820, 929322, 1014407, 1085638, 1128823, 1135943, 1108365, 1054478, 984371, 906643, 828175, 753964, 686405, 626155, 574110, 531538, 498423, 473272, 454834, 442763, 436567, 435484, 439865, 451320, 471012, 498842]
56780D98842L5391M1594M3603L8116K4679O275j2901k9169m0047m5142m6220m5242
56768D69779m2648l8357l3386k9139k5854k2964k0274j7715j4826j1717r589r032
56756A94278q784p468n563m318l719l043k414k304k314j908j602j975k401k192
56742A44273k024k730l582l367k319j467r05k40J07l28q69p88p06j327j840j275
56726A20613m36n91j195q71J61O53N84Q51J354J377J319K004K793K460J442J175
56710A33693J556J258K29j78M32J071J277J582J946J578M44n41r51j096r72l65
56694A40963J93Q6r0O26J711J779P86J4k1J6k02l31m54r32j222l73J230K062J482
56675A47323L26m64o27j66P08J329J258R35P93M22m09q15j67O00M95K38Q66J649
$$ y = [498842, 534233, 575827, 619430, 657546, 682225, 688500, 675599, 646430, 606383, 561241, 515021, 469779, 427131, 388774, 355388, 326249, 300395, 277431, 257157, 239442, 224616, 212899, 203310, 194278, 185494, 178026, 172463, 168145, 164426, 161383, 158969, 156665, 154351, 152443, 150841, 148866, 146465, 144273, 142249, 139519, 135937, 132570, 130251, 128784, 127879, 127639, 127746, 127418, 126549, 125761, 125055, 123728, 121888, 120613, 120177, 119586, 118391, 117520, 117681, 118334, 118918, 119769, 121123, 122500, 123819, 125823, 128616, 131076, 132518, 133693, 135249, 136507, 136736, 136558, 136990, 138061, 139338, 140920, 142866, 144444, 144888, 144347, 143396, 142300, 141328, 140963, 141156, 141242, 141152, 141778, 143489, 145268, 146054, 146068, 146047, 146063, 145861, 145530, 145076, 144144, 142922, 142549, 143779, 145841, 147323, 147649, 147185, 146558, 146392, 147100, 148429, 149687, 150622, 151415, 151837, 151428, 150613, 150446, 151046, 151541, 151779, 152645, 154294]
56657A54294J309M47N74J479J705J137Q92J076Q73M83Q18J430J004k20o76j00
56641A66525J64m46j044j118j123j129o81m7P7k0L80P61J25r55j058m21n06j312
56623A58172j435p45n72j089r22K17Q69L58k21j56k23r05j361r85l80j14J06M91
56605A51105O79N39K78k53j129j526p69J98J21k65O24K247K492J150K81Q81J645
56588A58298J506J021O58n8r10p18N01J122M42k32J63Q95J026Q56R19J001R34
56571A67424J110J618K042K436L227M064M168L866M238N314O254P165Q865J0972
56557B32763J2199J2499J2782J2635J0720P517N200M468L918K891K429K775K539
56544C25335J184m6m90j094k191k592j924j665k709l989m535n021o082o948o907
$$ y = [154294, 155603, 156050, 156624, 158103, 159808, 160945, 161837, 162913, 163786, 164269, 165087, 166517, 167521, 167301, 166625, 166525, 166689, 166243, 165199, 164081, 162958, 161829, 161148, 161101, 161178, 161158, 161538, 162299, 162424, 161469, 160411, 159990, 159484, 158172, 156737, 155992, 155420, 154331, 153409, 153626, 154495, 154853, 154632, 154476, 154253, 153348, 151987, 151002, 150622, 150508, 150614, 151105, 151784, 152323, 152601, 152348, 151219, 149693, 148924, 149122, 149243, 148978, 149602, 151849, 154341, 155491, 155772, 156653, 158298, 159804, 160825, 161483, 161425, 160515, 159797, 160298, 161420, 161862, 161630, 161793, 162688, 163714, 164570, 165489, 166490, 167424, 168534, 170152, 172194, 174630, 177857, 181921, 186089, 189955, 194193, 199507, 205761, 212926, 221791, 232763, 244962, 257461, 270243, 282878, 293598, 301115, 306315, 310783, 314701, 317592, 320021, 322796, 325335, 326519, 326473, 325983, 324889, 322698, 320106, 318182, 316517, 313808, 309819, 305284, 300263, 294181, 287233, 280326]
56529B80326o527o421o283n920n715n525m688l597l441m047l875k616j711j847
56515B18113k080k006k433l316l320k250j562j732j477m17Qp41j159m34Q2n64
56499A94712j254j077j059k060l024k756j735q33OO71L53q18j399q38j85Q4P41
56482A79529J622J252l47j125l91j6r23j281Q9J334P16m62k91N74N73O4J84N92
56464A81693N38N94J283J563P18J18J073K421K303J029J93J41J90K79O21O94J19
56447A95570m05k38J28K20M28P81L77q61j525r03j40j58j76M73R72P01M47P26
56429A96417O99l2m69j76j94q67r03K17J123J073J246K206K576J627O65M13k73
56412B05348j535j313J016K792K050N54N00R67K68q36j025j089j915k066k75J739
$$ y = [280326, 273799, 267378, 261095, 255175, 249460, 243935, 239247, 235650, 232209, 228162, 224287, 221671, 219960, 218113, 216033, 214027, 211594, 208278, 204958, 202708, 201146, 199414, 197937, 197520, 197528, 196787, 195628, 195194, 195276, 194712, 193458, 192381, 191322, 189262, 186238, 183482, 181747, 180914, 180920, 181591, 181944, 181126, 179727, 178889, 178704, 178788, 179529, 181151, 182403, 182056, 180931, 180540, 180524, 179601, 178320, 178409, 179743, 180459, 179997, 179706, 180280, 180853, 180917, 181101, 181693, 182231, 182825, 184108, 185671, 186389, 186507, 187580, 190001, 192304, 193333, 193526, 193667, 193857, 194136, 194757, 195451, 195570, 195165, 194927, 195055, 195275, 195703, 196484, 196861, 196000, 194475, 193572, 193432, 193274, 193098, 193571, 194543, 195244, 195691, 196417, 197116, 197084, 196615, 196439, 196245, 195378, 194475, 194692, 195815, 196888, 198134, 200340, 202916, 204543, 205208, 205621, 205348, 203813, 202500, 203516, 206308, 208358, 208912, 209412, 210379, 210647, 209811, 208786, 207697, 205782, 203716, 203441, 205180]
56396B05180J865J005J098J726J531J102J564K033J332N32R72J530O33p06p14
56381B20683J7L7o7Q31J654R30k57p1P97O14j41K1N24m9j006o86N64J286J567
56362B27248K167K431J643J016J655K230J324K70P79J673J186M87J528L065K580
56347B51282O60j90J67N6l66K49J200Q13j90R5J055O73n21k60J440K551K757L357
56329B64828M098L524K071J504J754J507J244K433M267M523L201K122J507K03
56315B98786j303j444o47o71j381j246m62l36l02J163L249L775K884K550L009
56300C07624K957K617L234M131L693K651L007M237M097K603J770J840J400O90
56286C46551J296K843L514L436M136N144M656L152K781L628M003L918M688N634
$$ y = [205180, 207045, 208050, 209148, 210874, 212405, 213507, 215071, 217104, 218436, 218968, 219940, 221470, 222103, 221397, 220683, 220700, 220737, 220670, 221501, 223155, 224085, 223828, 223757, 224554, 225168, 225027, 225048, 225572, 225523, 224517, 223831, 224395, 225681, 227248, 229415, 231846, 233489, 234505, 236160, 238390, 239714, 239984, 240763, 242436, 243622, 244109, 245637, 248702, 251282, 251942, 251752, 251919, 251975, 251609, 251858, 253058, 253871, 253681, 253776, 254831, 255504, 254983, 254723, 256163, 258714, 261471, 264828, 268926, 272450, 274521, 276025, 277779, 279286, 280530, 282963, 287230, 291753, 294954, 297076, 298583, 298786, 297483, 296039, 295392, 294721, 293340, 292094, 291632, 291296, 290994, 292157, 295406, 299181, 302065, 304615, 307624, 310581, 313198, 316432, 320563, 324256, 326907, 329914, 334151, 338248, 340851, 342621, 344461, 345861, 346551, 347847, 350690, 354204, 357640, 361776, 366920, 371576, 374728, 377509, 381137, 385140, 389058, 393746, 399380]
56272C99380M979L486L510M868N377M948N406O705P229P311Q579J0352J0730J0588
56258D93448J2344J5338J6897J7465J9996K4517K8139L0461L4092L9429M3803
56247G75929M6435M9678N4395N8503O0938O3018O5043O5416O3737O1081N6908
56236A421081M9617M0383L2287K5329J6544N397n272j4060k2406l0650l7031m1292
56224A439927m5106m8398m9345m8497m8615m9890m9675m7330m5028m3350m0572
56213I24121l6816l4310l3066l0830k7710k6077k5575k3254j9219j6893j6892
56202F33479j6029j3291j1439j1347j0268p288n262n545n731m387l234k994j934
56189E34730j32l20k727l945k601j391j771j596J71J294P32N60J576J717N99Q43
$$ y = [399380, 404359, 407845, 411355, 416223, 421600, 426548, 431954, 438659, 445888, 453199, 461778, 472130, 482860, 493448, 505792, 521130, 538027, 555492, 575488, 600005, 628144, 658605, 692697, 732126, 775929, 822364, 872042, 926437, 984940, 1045878, 1108896, 1173939, 1239355, 1303092, 1364173, 1421081, 1470698, 1511081, 1543368, 1568697, 1585241, 1590638, 1585366, 1571306, 1548900, 1518250, 1481219, 1439927, 1394821, 1346423, 1297078, 1248581, 1199966, 1150076, 1100401, 1053071, 1008043, 964693, 924121, 887305, 852995, 819929, 789099, 761389, 735312, 709737, 686483, 667264, 650371, 633479, 617450, 604159, 592720, 581373, 571105, 563817, 558555, 553010, 547279, 542892, 539658, 536664, 534730, 534598, 534278, 531551, 527606, 525005, 523614, 521843, 520247, 520418, 521712, 522444, 523004, 524580, 526297, 526896, 527739]
56173E27739L074M370L540L128M418N287M823N158O893P671P101P941J0615J1786
56159F13544J0319R386J0609J1529J1047J1851J4997J7506J7860J8663K1474K4263
56147G93048K6390L0588L7596M4346N0043N8445P1388Q5608R8697J12321J26460
56136A534930J36179J37552J31801J20922J04891Q6157P1080O3249O0095N8512
56126B505368N8102N6525M8433L2792J5546J758r233j8238k3074k4775l0252m4050
56114B568902o3008q2627j02331j20629j31983j33527j29182j22786j12932r8719
56104A471178q4235p2759o2400n1729m3467l8391l2246k3307j6375j4481j3387
56093A018401r356n476m929m750j996M05k56q30J511L702L046K733N514Q155P852
$$ y = [527739, 530813, 535183, 538723, 541851, 546269, 551556, 556379, 561537, 568430, 576101, 583202, 591143, 601758, 613544, 623863, 633249, 643858, 655387, 666434, 678285, 693282, 710788, 728648, 747311, 768785, 793048, 819438, 850026, 887622, 931968, 982011, 1040456, 1111844, 1197452, 1296149, 1408470, 1534930, 1671109, 1808661, 1940462, 2061384, 2166275, 2252432, 2323512, 2386761, 2446856, 2505368, 2563470, 2619995, 2668428, 2701220, 2716766, 2718524, 2709291, 2691053, 2667979, 2643204, 2612952, 2568902, 2505894, 2423267, 2320936, 2200307, 2068324, 1934797, 1805615, 1682829, 1569897, 1471178, 1386943, 1314184, 1251784, 1200055, 1156588, 1118197, 1085951, 1062644, 1046269, 1031788, 1018401, 1009045, 1003569, 998640, 993890, 991894, 992299, 992043, 991213, 992724, 996426, 999472, 1002205, 1007719, 1015874, 1023726]
56078A023726P691J0148J1786J0165R202J1739J3740J1993J0523J2986J5831J5459
56066A164989J5017J7400J8861J6502J4729J7164J9524J7760J5758J7458J9046
56055A354208J6675J4364J6166J8166J6401J4953J7754K0269J8051J5661J8077
56044A540745K1107J9690J7830K0708K4673K4798K4559K8266L1714L0373K8873
56033A813336L2248L5906L4663L3241L7089M1478M0793L9834M4242M8746M7008
56022B248584M4296M7722N2786N2553N1271N5620O1315O1968O2284O8531P5092
56011B882022P4677P2848P7694Q4567Q6002Q7023R4990J04144J06428J07663J16479
56000C894537J27466J32267J36462J47810J59061J61121J61639J71063J82413
$$ y = [1023726, 1031417, 1041565, 1053351, 1063516, 1072718, 1084457, 1098197, 1110190, 1120713, 1133699, 1149530, 1164989, 1180006, 1197406, 1216267, 1232769, 1247498, 1264662, 1284186, 1301946, 1317704, 1335162, 1354208, 1370883, 1385247, 1401413, 1419579, 1435980, 1450933, 1468687, 1488956, 1507007, 1522668, 1540745, 1561852, 1581542, 1599372, 1620080, 1644753, 1669551, 1694110, 1722376, 1754090, 1784463, 1813336, 1845584, 1881490, 1916153, 1949394, 1986483, 2027961, 2068754, 2108588, 2152830, 2201576, 2248584, 2292880, 2340602, 2393388, 2445941, 2497212, 2552832, 2614147, 2676115, 2738399, 2806930, 2882022, 2956699, 3029547, 3107241, 3191808, 3277810, 3364833, 3459823, 3563967, 3670395, 3778058, 3894537, 4022003, 4154270, 4290732, 4438542, 4597603, 4758724, 4920363, 5091426, 5273839]
55991E273839J85377J87859K01688K19707K30119K40567K63673K91808L11819
55982G406456L31558L64918M03998M34191M63182N05587N53285N92054O32697
55973A1687926O92848P63568Q28776R01052J001031J119174J238124J374039J552751
55964B1159289J765831J997777K274691K634629L074853L586417M214255N018866
55956D5726608O009595P189909Q635153J0443473J2654916J5321677J8605263
55949A24586594K2674918K7560445L3197344L9328976M4820884M7042532M2738517
55942C81950210L0442702J2270214o980051k2728769l2832611l7566176l8293836
55935B86261683l6447029l3218833k9483606k5728810k2156182j8886933j6021795
$$ y = [5273839, 5459216, 5647075, 5848763, 6068470, 6298589, 6539156, 6802829, 7094637, 7406456, 7738014, 8102932, 8506930, 8941121, 9404303, 9909890, 10463175, 11055229, 11687926, 12380774, 13144342, 13973118, 14874170, 15875201, 16994375, 18232499, 19606538, 21159289, 22925120, 24922897, 27197588, 29832217, 32907070, 36493487, 40707742, 45726608, 51736203, 58926112, 67561265, 78004738, 90659654, 105981331, 124586594, 147261512, 174821957, 208019301, 247348277, 292169161, 339211693, 381950210, 412392912, 424663126, 417683075, 394954306, 362121695, 324555519, 286261683, 249814654, 216595821, 187112215, 161383405, 139227223, 120340290, 104318495]
55928A04318495j3574478j1486869r721656q269082p081999o084226n237532m538413
55920C8324240l959744l454566l008646k635125k324001k045162j793594j585593
55912A7517809j415838j260135j115092r95808q99175q06305p16920o46650n94096
55903I067790n42861m92304m55217m28688l97094l61001l34788l18196k97290
55894E440351k71289k52208k39798k21829j98085j80269j69112j54061j34802
55885C618898j21614j15303j07401r9062r9519j06564j08130j02731r9666r9786
55875B559122r4604q4147p7668p6488p3053o6882o4976o6543o3472n5940n2041
55864A783308n2056m8421m1206l8427m0805m0869l7439l6745l8939l7538l2601
$$ y = [104318495, 90744017, 79257148, 69535492, 61266410, 54184411, 48100185, 42862653, 38324240, 34364496, 30909930, 27901284, 25266159, 22942158, 20896996, 19103402, 17517809, 16101971, 14841836, 13726744, 12730936, 11831761, 11025456, 10308536, 9661886, 9067790, 8524929, 8032625, 7577408, 7148720, 6751626, 6390625, 6055837, 5737641, 5440351, 5169062, 4916854, 4677056, 4455227, 4257142, 4076873, 3907761, 3753700, 3618898, 3497284, 3381981, 3274580, 3175518, 3075999, 2969435, 2861305, 2758574, 2658908, 2559122, 2464518, 2380371, 2302703, 2226215, 2153162, 2086280, 2021304, 1954761, 1891289, 1835349, 1783308, 1731252, 1682831, 1641625, 1603198, 1562393, 1521524, 1484085, 1447340, 1408401, 1370863, 1338262]
55853A338262l0855l2393l0599k5544k4221k7116k7551k4786k4894k8128k8178
55842A033997k4663k3826k6024k4904j9964j7730j9318j8784j5034j3627j5348
55831H14775j4619j0811r756j2388j2936j0094r093j0929j0447p015o416r883
55819F90388j1732j0079r767j2281j2851j0202r249j1366j1446p595m582m736
55807E74502m189j118Q43L10J009M218O280O181P665J1389J2858J0635Q712Q391
55793F47686N878M66k999k791l547p629j0875j0325r046r786j0608j0229j1287
55780E64908j4864j7669j7587j6430j4808j0337l296K112M649Q082J3764J7295
55768E15819J5229R429K376n917j3974j7936j7345j6365j6892j6082j2793j0374
$$ y = [1338262, 1307407, 1275014, 1244415, 1218871, 1194650, 1167534, 1139983, 1115197, 1090303, 1062175, 1033997, 1009334, 985508, 959484, 934580, 914616, 896886, 877568, 858784, 843750, 830123, 814775, 800156, 789345, 779589, 767201, 754265, 744171, 735078, 724149, 713702, 706687, 700271, 690388, 678656, 668577, 658810, 646529, 633678, 623476, 614227, 602861, 591415, 583820, 579238, 574502, 570313, 569195, 570038, 570348, 571357, 575575, 581855, 588036, 595701, 607090, 619948, 630583, 639295, 647686, 653564, 654030, 651031, 648240, 644693, 637064, 626189, 615864, 606818, 597032, 586424, 576195, 564908, 550044, 532375, 514788, 498358, 483550, 473213, 469917, 472029, 476678, 484760, 498524, 515819, 531048, 540477, 542853, 536936, 522962, 505026, 487681, 471316, 454424, 438342, 425549, 415175]
55756D15175j0479j0184q127p518j0002j2162j1451j0308j1054j1759j0459q789
55744B92883q283p357m930k915k490j936l53M94o5l17j37j663m404m791k323r59
55728B50454k384l395k128j408l124m643l835k715l015k895j102J90k64nK499
55713B22230M777M845M614N840O752N660M005L047J425j338k883k199j831l408
55699B51536m951n079n685p749q778p274n670n825n695l553j453j384j709o32
55685A86099M57K06J96J571K366J311P52K572M678M755M117M607M912L361J336
55670B23296O90N83j94n70K14L99j119k363j790j178k126k905j749k13j71m06
55654B10398O91J954K052K380M247N965N773M968N034M551K087n69j370j623l405
$$ y = [415175, 404696, 394512, 386385, 378867, 368865, 356703, 345252, 334944, 323890, 312131, 301672, 292883, 284600, 277243, 272313, 269398, 266908, 264972, 264619, 265113, 265048, 264731, 264594, 262931, 258527, 253736, 251413, 250454, 248070, 244675, 242547, 241139, 238015, 233372, 229537, 226822, 223807, 220912, 219810, 220000, 219736, 219731, 222230, 227007, 231852, 236466, 242306, 249058, 254718, 258723, 261770, 263195, 261857, 258974, 256775, 254944, 251536, 246585, 241506, 235821, 228072, 219294, 212020, 206350, 200525, 194830, 191277, 189824, 188440, 186731, 186099, 186556, 186762, 186958, 188529, 190895, 192206, 192958, 195530, 200208, 204963, 209080, 213687, 218599, 221960, 223296, 223986, 224569, 224375, 223805, 224019, 224418, 223299, 220936, 219146, 217968, 215842, 212937, 211188, 210975, 210804, 210398, 211089, 213043, 215095, 217475, 221722, 227687, 233460, 238428, 243462, 248013, 250100, 249531, 248161, 246538, 243133]
55639B43133n812o964p368q157q363p094o022o569o966n288l099k786l485l015
55625A62145j867j853k590k522j958k076k411j972j380j431j242j64L66p60k080
55610A38205k023j483j668j726r78r76k673m029l267j975k122k469j201L35k0
55595A11930j306j335n01l81l88P03J688Q29o71n35P24J023M79O68J414J413J007
55578A16761J384K126K260K475L697M896M956N117O803Q705Q852P911P436O634
55564A90013M073J038k94o23k160m654o055o162o351o687o333n880o333o743n742
55549A31107m293m060m251l171j614j501k244j801l77K93M17J540L106L078J498
55534A17727L13L1m40j052p36J08J02n13m44km82j466j545j037j227j610q57J33
$$ y = [243133, 237321, 230357, 222989, 214832, 206469, 199375, 193353, 186784, 179818, 174530, 171431, 168645, 165160, 162145, 160278, 158425, 155835, 153313, 151355, 149279, 146868, 144896, 143516, 142085, 140843, 140679, 141045, 140285, 138205, 136182, 134699, 133031, 131305, 130327, 129351, 126678, 122649, 119382, 117407, 115285, 112816, 111615, 111950, 111930, 110624, 109289, 108788, 108407, 108019, 108722, 110410, 111239, 110568, 110033, 110757, 111780, 112259, 112927, 114341, 115754, 116761, 118145, 120271, 122531, 125006, 128703, 133599, 138555, 143672, 150475, 159180, 168032, 175943, 183379, 190013, 194086, 195124, 194830, 194207, 192047, 187393, 181338, 175176, 168825, 162138, 155805, 149925, 143592, 136849, 131107, 126814, 122754, 118503, 115332, 113718, 112217, 109973, 108172, 107795, 108088, 108505, 110045, 113151, 116229, 117727, 118040, 118071, 117631, 116579, 115843, 115951, 116053, 115540, 115096, 115094, 114612, 113146, 111601, 110564, 109337, 107727, 106870, 107003]
55516A07003o54k664l345k185j177j325j627j507j528j588r46n1K2l42o0L05n30
55499H7801j790j529J29J221J153J012J072O07k4J90O93J17j057j161k88M5l04
55482H7887k69n1o46j358p38M83L72o61m79R22J452P05L25N45j61j660j840l65
55464H4463N78L5l84J40J03j250k227j526l14r3n70q53q66n40N47J829J877O37
55446H1586k10K01Q08O20P4k58n55p64l88K70K11n45r27o74n76p12k77P06J308
55427G9898J362J469J362L01j035j146k21J42k86k03O20R94P95J209K207K240
55411H9708J079M04R34J377R44N77P67N15o19j529j529j388j610j591j208j217
55395H5614j437o73Q87J343N6j231j155n68n42n95p8N13P35J040J468J169J67
$$ y = [107003, 106349, 103685, 100340, 98155, 96978, 95653, 94026, 92519, 90991, 89403, 88457, 88406, 88428, 88086, 88026, 88331, 87801, 86011, 84482, 84611, 85832, 86985, 87997, 89069, 89676, 89652, 89842, 90535, 90652, 89595, 88434, 88146, 88191, 87887, 87618, 87567, 86921, 85563, 84825, 85308, 85680, 85019, 84540, 85462, 86914, 87619, 87944, 88489, 88328, 86668, 84828, 84463, 85041, 85076, 84692, 84832, 84935, 83685, 81458, 79932, 79618, 79525, 78955, 78102, 77236, 76696, 77243, 79072, 80949, 81586, 81376, 81577, 82385, 83005, 83079, 82821, 82266, 81502, 81114, 81384, 81595, 81050, 80123, 79449, 78873, 78161, 77884, 78590, 79898, 81260, 82729, 84091, 84392, 83357, 82211, 81990, 82132, 81846, 81643, 82263, 83257, 84052, 85261, 87468, 89708, 90787, 91191, 92125, 93502, 94446, 95023, 95790, 96305, 95686, 94157, 92628, 91240, 89630, 88039, 86831, 85614, 84177, 83504, 84391, 85734, 85790, 84559, 83404, 82836, 82294, 81699, 81621, 82134, 82869, 83909, 85377, 86546, 86713]
55378H6713j68O42J171L62r04j483j581j680j468q31n14p85q75n04m56q74o67
55361G6098M96J332J034N75Q34J064M04n10o80l07p2oO3o7k80L8Q04J042M06l20
55341H1948o36q67r24j81R16R10l11j035m06K80m7m67M6P09L57o01j097j122j138
55322G6334r43k84K94L82N36J171J570J038R4m09m95n08k63L93R51R82P90P00
55304H2333N17J71L4J07j80q85j305j093o05P9J239K339K230R00l09o78q09r91
55286H3094n59N02R89L39m15l66N3K54M24N13j05j187j345j73R06Q21L15K47R4
55267H4401o15r55j25R12Q30k9l72J10P01Q85O31L8n15n18j10j5l33m22k00l43
55247H3956q34p66M0O45P32J062J714J586L54p70j047j234j750j667o01J95j69
$$ y = [86713, 86545, 87187, 88358, 88720, 87816, 86333, 84752, 83072, 81604, 80773, 80259, 79474, 78599, 78095, 77639, 76765, 76098, 76594, 77926, 78960, 79535, 80369, 81433, 81837, 81327, 80647, 80340, 80268, 80262, 80325, 80258, 79978, 80016, 80820, 81862, 82268, 81948, 81312, 80445, 79521, 79340, 80256, 81166, 80855, 79820, 79414, 79694, 79647, 79180, 79226, 79935, 80292, 79691, 78594, 77472, 76334, 75391, 75107, 75401, 75783, 76319, 77490, 79060, 80098, 80192, 79783, 79288, 78780, 78517, 78910, 79861, 80843, 81633, 82333, 82850, 83021, 83055, 83162, 82982, 82097, 80792, 79699, 79094, 79173, 80412, 82751, 84981, 85881, 85572, 84894, 84085, 83094, 82535, 83037, 84026, 84365, 83950, 83584, 83637, 83891, 84315, 84828, 84723, 83536, 82191, 82018, 82924, 83745, 84060, 84307, 84401, 83786, 82831, 82706, 83618, 84448, 84419, 84047, 84157, 84858, 85743, 86374, 86412, 85897, 85379, 85269, 85254, 84921, 84499, 84299, 83956, 83122, 82356, 82396, 83041, 83773, 84835, 86549, 88135, 88489, 87719, 86672, 85438, 83688, 82021, 81420, 81615, 81446]
55230H1446p76o99n37r05r60Q7J356J643J161P33M65L33P73J522J360O7q39m78
55212H5752o4p04j480j234o08n82n91J02O16j6q48m47P05J230J142J305J513J061
55194H6852M19M88Q72N73k11n81n63p02p61k61L62N45P11J224J268K62o59l18
55176H9520L82j07j288j413l31M50K13l50o95q88p34K5Q09R45R46J665K580K425
55158I4154J233K19j21l69q10j009p42k48L04P73P51K04k06j42k42q63j128k96
55140I1462Q44J157Q10M75o4j126j883j522p53o40q19m42K2k96p41p6J290J855
55122H9553J363P68L48l46j039j026o53q28j347j314q04n57m25J63O90K47o40
55105H4153o56J70P14P78J020J245O68l20o00k72k62k66Q15K472K874J708N58
$$ y = [81446, 80670, 79971, 79434, 78529, 77569, 77656, 79012, 80655, 81816, 82549, 83014, 83347, 84120, 85642, 87002, 87069, 86230, 85752, 85688, 84984, 83504, 82270, 81662, 81080, 80489, 80591, 81207, 81191, 80343, 79896, 80601, 81831, 82973, 84278, 85791, 86852, 87271, 87759, 88631, 89204, 88993, 88412, 87849, 87147, 86386, 86125, 86487, 87032, 87743, 88967, 90235, 90497, 89838, 89520, 89902, 89795, 88507, 87094, 86763, 87213, 87426, 87076, 86381, 85493, 84759, 84784, 85593, 86538, 87484, 89149, 91729, 94154, 95387, 95606, 95485, 95116, 94306, 93297, 92555, 92307, 92611, 93384, 94135, 94339, 94133, 93991, 93749, 92886, 91758, 91462, 92306, 93463, 94273, 94748, 94684, 93558, 91675, 90153, 89400, 88760, 87941, 87499, 87521, 87225, 86484, 86408, 87698, 89553, 90916, 91684, 92032, 91686, 90647, 89621, 88968, 88140, 86793, 85479, 84675, 84118, 83693, 83856, 84546, 84793, 84153, 83497, 83667, 84381, 85159, 86179, 87424, 88092, 87772, 87172, 86900, 86638, 86372, 87187, 89659, 92533, 94241, 94799]
55088I4799K63nn94n39M01Q89J59o93m90K90N66K17k27m78m31j5L76J56m85p16
55068I3443l52k8j2J38O11J050J346J641J563N45r62j761j508r57n82j73J81j2
55050I4171n85p36l41o9j37k6L35L72k4k37m6R8J8J8R4j09m22l61k9J46M15J193
55028I3738J788J074n63j465r68n3M01N44N87L34k5JJ41k97q97m59Q96J558P47
55009I7082m17p53m63k17j17j96p44j546j822j386q13k24Q53K104K329J283L10
54992I5263M73J277J789J858J572P20m14q41k56L05j14j093j687j634j139k05
54976I5874J023J981K334K347K224J679N57p57j730j999j249M01J901K103J220
54961A07909M51K72J27r9K21J066J403P40j97p77j301j969k176j519n42J04L88
$$ y = [94799, 95062, 95057, 94463, 93924, 94325, 95214, 95373, 94680, 94190, 94480, 95046, 95263, 95036, 94558, 94127, 94112, 94488, 94644, 94159, 93443, 93091, 93063, 93051, 93189, 93800, 94850, 96196, 97837, 99400, 99945, 98983, 97222, 95714, 94757, 94175, 94002, 94183, 94171, 93586, 92850, 92509, 92440, 92303, 92277, 92612, 92984, 92960, 92723, 92677, 92775, 92793, 92811, 92905, 92796, 92374, 92013, 91984, 92130, 92545, 93738, 95526, 96600, 96037, 94572, 93604, 93551, 93952, 94496, 95083, 95417, 95392, 95393, 95534, 95237, 94340, 93881, 94777, 96335, 97082, 96665, 95912, 95449, 95232, 95115, 94919, 94175, 92629, 90807, 89421, 88608, 88384, 89237, 91341, 93670, 94953, 95263, 95736, 97013, 98802, 100660, 102232, 102952, 102538, 101697, 101441, 101746, 101632, 100539, 98852, 97218, 96079, 95874, 96897, 98878, 101212, 103559, 105783, 107462, 108019, 107262, 105532, 103533, 102284, 102685, 104586, 106689, 107909, 108360, 108632, 108759, 108660, 108881, 109947, 111350, 112090, 111893, 111116, 109815, 107846, 105670, 104151, 103609, 103713, 104101]
54944A04101L97M5k95R4J098J658J246M86n5n46r77p47K07R55R25P75J274K137
54926A12778K647K614K283J949K021K794L888M676N244N977O335N390L589K474
54912A64659K297J574n57l124n025o263o779n781l380j401j231k018k192j708
54898A29071j510j845k308k790l165k705j040Q80J755J492R89Q68J153J656K018
54883A24519J861J463J636K525L305L467L537L976M442M626M826M986M333K706
54869A72208J117J93p60k323l713m094l984m205m428m009l370l231l211k550j613
54854A32027j350j690j696j075m31k60n77j302k215k829k880k651k359j796j010
54839A07906n52n29k85L21M09l94j003m93L68L96j45k75r8m12j089j291r92r31
$$ y = [104101, 104498, 104543, 104248, 104342, 105440, 107098, 108344, 108830, 108775, 108229, 107252, 106505, 106712, 107667, 108592, 109367, 110641, 112778, 115425, 118039, 120322, 122271, 124292, 127086, 130974, 135650, 140894, 146871, 153206, 158596, 162185, 164659, 166956, 168530, 167973, 164849, 159824, 153561, 146782, 141001, 137621, 136220, 134989, 132971, 130779, 129071, 127561, 125716, 123408, 120618, 117453, 114748, 113708, 114588, 116343, 117835, 118824, 119692, 120845, 122501, 124519, 126380, 127843, 129479, 132004, 135309, 138776, 142313, 146289, 150731, 155357, 160183, 165169, 169502, 172208, 173325, 173518, 172758, 170435, 166722, 162628, 158644, 154439, 150011, 146002, 142632, 139401, 136190, 133640, 132027, 130677, 128987, 127291, 126216, 125785, 125525, 124948, 123646, 121431, 118602, 115722, 113071, 110712, 108916, 107906, 107354, 106825, 106540, 106861, 107270, 106876, 105873, 105380, 105748, 106144, 105999, 105724, 105626, 105214, 104125, 102834, 101842, 100911]
54821A00911j217j232p37j14M10Q68J077Q97O88P56P38K72j25K44J079J504J261
54804A07280O90m3p96j001l59M19N29K95N25J027R40K41j81P4M25K47m23j143
54786A08746j362o52P79K004K302J889J296O00q8j45P34J737J897J404J137J355
54770A23633J725K226L088M149N133O147P206P747P425O783O320N525L770J508
54756A92385n68k718n285p284p434o148n069m790m567m032l647l428k816j920
54742A32679j545j747j656j019o23p95q05j96L64K21k43l31k7L52Q35J543K253
54725A29260K683K958L374L992M619N038N194N277N464N358M047J246j940m006
54711A72564m610m579m618m694m578m223l642k944k516k657l090l249k888k152
$$ y = [100911, 99694, 98462, 97725, 97611, 98021, 98889, 99966, 100863, 101551, 102307, 103045, 103317, 103192, 103436, 104515, 106019, 107280, 107970, 107927, 107131, 106130, 105771, 106190, 106719, 107014, 107539, 108566, 109506, 109747, 109566, 109640, 110065, 110312, 109889, 108746, 107384, 106732, 107511, 109515, 111817, 113706, 115002, 115602, 115514, 115369, 116103, 117840, 119737, 121141, 122278, 123633, 125358, 127584, 130672, 134821, 139954, 146101, 153307, 161054, 168479, 175262, 181582, 187107, 190877, 192385, 191817, 189099, 183814, 176530, 169096, 162948, 157879, 153089, 148522, 144490, 140843, 137415, 134599, 132679, 131134, 129387, 127731, 126712, 126089, 125294, 124489, 124293, 124657, 124878, 124635, 124304, 124277, 124629, 125464, 127007, 129260, 131943, 134901, 138275, 142267, 146886, 151924, 157118, 162395, 167859, 173217, 177264, 178510, 176570, 172564, 167954, 163375, 158757, 154063, 149485, 145262, 141620, 138676, 136160, 133503, 130413, 127164, 124276, 122124]
54697A22124j287o64o35r40p68P4P37N91K08K71L64j91r91j260j229j558j840
54680A13006j152J92Q72M49k73p07r74r61k52Q36J363J084O04K33k13m87j63J94
54662A13651m47j646j639O2J732J801Q38K34J37k11q88j211q71k19L02M73K62
54645A12360n2m5L36P13R09J099J181O84l39j021p55m4K62P7r9j08k71p13j060
54626A13114q87k27M20N87L15M6J9N5jjO3j51o88r27m09M07Q97J243J815K108
54606A17798J355m6q74p69m52l31o1M28N95K84P2K39L60J94N8Nl93j076j233n89
54586A15564mj96o17l39N26J086R41N72N75R81J243P38n39j742j943j162k30L26
54568A15780O92J077J294J158P48J72l95m36M54J694K061J131k02q96q23m45j12
$$ y = [122124, 120837, 120173, 119538, 118598, 117830, 117904, 118641, 119232, 119440, 119711, 120075, 119884, 118893, 117633, 116404, 114846, 113006, 111854, 112046, 112918, 113367, 113094, 112387, 111413, 110452, 110200, 111036, 112399, 113483, 114087, 114320, 114107, 113620, 113457, 113651, 113204, 111558, 109919, 109981, 111713, 113514, 114352, 114586, 114723, 114512, 113624, 112413, 111542, 111323, 111625, 112098, 112360, 112308, 112263, 112599, 113312, 114221, 115320, 116501, 117185, 116846, 115825, 115070, 115026, 115288, 115365, 115266, 115158, 114887, 114174, 113114, 112227, 112000, 112420, 113007, 113322, 113368, 113387, 113442, 113441, 113440, 113503, 113352, 112664, 111737, 111328, 111735, 112632, 113875, 115690, 117798, 119153, 119107, 118233, 117464, 117012, 116681, 116620, 117048, 117643, 117927, 117999, 118238, 118598, 118792, 118850, 118855, 118462, 117386, 116153, 115564, 115560, 115364, 114747, 114408, 114934, 116020, 116961, 117533, 118108, 119089, 120332, 121070, 120531, 118789, 116846, 115684, 115454, 115780, 116472, 117549, 118843, 120001, 120749, 120921, 120526, 120090, 120544, 122238, 124299, 125430, 125228, 124332, 123509, 123064, 122952]
54551A22952N9Q9K15O51J104J062N51R0p2p7J91R51J735J611N23m95o62k92PQ8
54531A30281r1p48j645j983j416n61k4L74Q64J004L64n71r81q08o20o77o95m66
54513A21601j62l9j04o4M10J255J852J585N68n27j194j287p15M11J337J232J89
54496A26348q85j422j482j030N1J174J330N22o6J94N67L11j16K6M97O59O32R80
54478A28290J621J932J654J048M18L2K36J017J733J792J403J175J210J135Q52
54463A45548O75P10N94L6o17o26K54J238J224J93n92k70L10k49j750k541j845
54446A42292p22l78o10n73k03p8l91q17j072j102q85m66OM48P60O24j03q12o74
54427A35244J58O91O20P59J557K213J885J005N68P25R06Q26O71N27K49k27q25
$$ y = [122952, 123011, 123100, 123315, 123966, 125070, 126132, 126683, 126773, 126701, 126624, 126815, 127766, 129501, 131112, 131635, 131140, 130478, 130186, 130193, 130281, 130190, 129442, 127797, 125814, 124398, 123837, 123813, 124187, 125051, 126055, 126419, 125848, 124867, 124059, 123439, 122762, 122067, 121601, 121439, 121400, 121296, 121232, 121642, 122897, 124749, 126334, 126902, 126375, 125181, 123894, 123179, 123590, 124927, 126159, 126348, 125463, 124041, 122559, 121529, 121580, 122754, 124084, 124606, 124540, 124734, 125301, 125612, 125496, 125522, 126019, 126678, 127310, 128290, 129911, 131843, 133497, 134545, 134963, 134995, 135231, 136248, 137981, 139773, 141176, 142351, 143561, 144696, 145548, 146223, 146933, 147527, 147563, 146946, 146320, 146574, 147812, 149036, 149229, 148637, 148367, 148677, 148428, 146678, 144137, 142292, 141570, 141192, 140582, 140009, 139806, 139728, 139337, 138520, 137448, 136346, 135461, 134995, 135001, 135449, 136209, 136833, 136730, 135918, 135244, 135402, 136093, 136713, 137472, 139029, 141242, 143127, 144132, 144700, 145425, 146331, 147157, 147828, 148355, 148604, 148377, 147552]
54410A47552j385j578j141l80P7J39K64M61J60n58o13N52J870J940P95l74p64
54393A47017m70J23O51P65M85K89M30N16K16j32j14L1q4k32k7L36M45M14M93M04
54373A51556k55j162j570j239m58N28J483J927J739J668K408L298L033J610N02
54358A65068O17J020L46j203k181j873j153j148j768k085j767j441j558j738j516
54343A47620j098p79k81N55R85L19p24q24q2J22o00j054m92J19l29j400j893j454
54325A38710n69L04Q30P26L09M43J217J499N50p10r65l30J26M0j39k49n50r22
54307A40320r02m57J6L15M68M00J49J8O9j00n33n15K83R16L83q27j377r57m08
54288A37261k23qO02J364J816J700R98J15k19J96N91J74p89j499j727j662j158
$$ y = [147552, 146167, 144589, 143448, 143068, 143145, 143284, 143548, 144009, 144169, 143611, 142998, 143550, 145420, 147360, 148155, 147781, 147017, 146547, 146670, 147321, 148086, 148571, 148860, 149290, 149806, 150022, 149890, 149776, 149807, 149723, 149491, 149464, 149800, 150245, 150659, 151152, 151556, 151301, 150139, 148569, 147330, 146872, 147400, 148883, 150810, 152549, 154217, 156625, 159923, 162956, 164566, 165068, 165685, 166705, 167051, 165848, 163667, 161794, 160641, 159493, 157725, 155640, 153873, 152432, 150874, 149136, 147620, 146522, 145743, 145462, 146017, 147002, 147321, 146597, 145773, 145691, 145813, 145213, 144159, 143667, 143786, 143457, 142057, 140164, 138710, 138141, 138445, 139275, 140001, 140310, 140753, 141970, 143469, 144019, 143309, 142344, 142014, 142140, 142180, 142041, 141792, 141242, 140320, 139418, 138961, 138977, 139292, 139760, 140160, 140309, 140327, 140396, 140296, 139763, 139248, 139531, 140447, 140830, 140003, 138626, 137669, 137261, 137038, 137030, 137632, 138996, 140812, 142512, 143510, 143625, 143406, 143602, 144193, 144367, 143578, 142079, 140352, 138690, 137532]
54271A37532n4J022J189N25n5k5M31J078J786K146J779J041O71P77Q03M05k29
54254A50822p99r99m97O08J519J611J212Q79M25m30r75l47Q26R75j77j205j058
54237A52390l28p1l19m85l98k73j08K79P88J044P80J21n01p25o63p67j175j468
54219A48121j310r15n74j91K97N08K06j97l27n46j226j845j553l49J068K225K863
54202A46255K559J280k6m37l25o28j204j080j29P31R75R12O65o9j058j444r62
54185A46015l16j8K36P58J253J385J217Q13O5p90j167q60k70K19N26N29R8n05
54167A49188q52r85j141r93m8J205J532O02m82o25n3K37k16r20j014k30O14L14
54149A46133j125k118j362M05J433J237P25M50J26k29j08L54L06l89q36m97J29
$$ y = [137532, 137478, 138500, 139689, 140214, 140159, 140134, 140565, 141643, 143429, 145575, 147354, 148395, 149066, 149843, 150646, 151051, 150822, 150023, 149024, 148527, 149135, 150654, 152265, 153477, 154356, 154781, 154351, 153376, 153029, 153855, 154830, 154653, 153448, 152390, 152062, 151991, 151672, 151187, 150789, 150516, 150408, 150687, 151475, 152519, 153299, 153420, 152919, 152194, 151531, 150764, 149589, 148121, 146811, 145896, 145322, 145131, 145428, 145936, 146142, 145945, 145618, 145072, 143846, 142001, 140448, 140099, 141167, 143392, 146255, 148814, 150094, 150068, 149631, 149306, 148678, 147474, 146394, 146265, 146996, 147971, 148883, 149548, 149479, 148421, 146977, 146015, 145699, 145681, 145917, 146675, 147928, 149313, 150530, 151343, 151408, 150618, 149451, 148591, 148321, 148540, 149066, 149595, 149693, 149188, 148336, 147351, 146210, 145217, 145169, 146374, 147906, 148508, 148026, 147401, 147348, 147585, 147369, 146449, 145435, 145205, 145819, 146133, 145008, 142890, 141528, 141933, 143366, 144603, 145328, 145778, 145904, 145675, 145567, 145921, 146227, 145838, 145002, 144505, 144634]
54132A44634N53R01J186J016M80L12P47J108R55O70N55K95k40n77m99m12m17J9
54114A51286J024J818J828J445J150P94K65K2L16O67O76O87J046J506J912K701
54098A69143M060N257N470M741L590K229O75r20k443l791m463l912k513j393r47
54083A74783m95K88P86P26Q88J752K519K343J584J016O19J19k41m09j061k383
54067A82834l204k581j444j312j944j866p85P8K5k44n3K35J01j44J65J076J948
54050A72885K117J527Q63R63J899K849L114K831K470K174K069K606L853M958N130
54035B12308M820N021N746O040N491M724M357M211L836L189K570K202K121K191
54021B68827K186J995J663J211O14L8k48m40j148k520l849m479m633m854n149
$$ y = [144634, 145187, 146088, 147274, 148290, 148770, 149082, 149829, 150937, 151892, 152562, 153117, 153412, 153172, 152595, 152096, 151684, 151267, 151286, 152310, 154128, 155956, 157401, 158551, 159345, 159610, 159632, 159948, 160615, 161291, 161978, 163024, 164530, 166442, 169143, 173203, 178460, 183930, 188671, 192261, 194490, 195165, 194245, 191802, 188011, 183548, 179636, 177123, 175730, 174783, 174288, 174576, 175362, 176088, 176976, 178728, 181247, 183590, 185174, 186190, 186809, 186928, 186687, 186278, 185217, 182834, 179630, 177049, 175605, 174293, 172349, 170483, 169698, 169776, 169801, 169557, 169504, 169739, 169840, 169696, 169861, 170937, 172885, 175002, 176529, 177392, 178355, 180254, 183103, 186217, 189048, 191518, 193692, 195761, 198367, 202220, 207178, 212308, 217128, 222149, 227895, 233935, 239426, 244150, 248507, 252718, 256554, 259743, 262313, 264515, 266636, 268827, 271013, 273008, 274671, 275882, 276496, 276534, 276286, 275846, 274698, 272178, 268329, 263850, 259217, 254363, 249214]
54006B49214n200n018m750m247l431k766k696k916k828k474k314k381k303k034
53992B03856j836j638j104l27J42J7m43r10j260j457j536j637j738j479p01R3
53976A88042K62q2j87M09J475K500L059K970K500K325K948M112N209O085P111
53961B28738Q532R995J0596R246N467K08m437o787o824n726m615m026l998m025
53947B32344l335j827m64q4k40J42J219K198K639K887L199L308L069K930L348
53932B51333M175M826M830M174L328K938L227L720L869L727L688L767L657L440
53918C04699L663M618N900O850P185P113P029P160P317P052O116M733L281J883
53904C84599M64r51k147k877l033k802k564k491k327j975k055l229n038o205o300
$$ y = [249214, 244014, 238996, 234246, 229999, 226568, 223802, 221106, 218190, 215362, 212888, 210574, 208193, 205890, 203856, 202020, 200382, 199278, 198951, 199093, 199110, 198667, 197757, 196497, 195040, 193504, 191867, 190129, 188650, 187949, 188042, 188304, 188222, 188035, 188444, 189919, 192419, 195478, 198448, 200948, 203273, 206221, 210333, 215542, 221627, 228738, 237270, 247265, 257861, 267107, 272574, 272782, 268345, 261558, 254734, 249008, 244393, 240367, 236369, 232344, 229009, 227182, 226718, 226634, 226394, 226536, 227755, 229953, 232592, 235479, 238678, 241986, 245055, 247985, 251333, 255508, 260334, 265164, 269338, 272666, 275604, 278831, 282551, 286420, 290147, 293835, 297602, 301259, 304699, 308362, 312980, 318880, 325730, 332915, 340028, 347057, 354217, 361534, 368586, 374702, 379435, 382716, 384599, 385063, 384112, 381965, 379088, 376055, 373253, 370689, 368198, 365871, 363896, 361841, 358612, 353574, 347369, 341069]
53889C41069o254o925p932q394q071p259o223n339n113n442n428m563l498k986
53875B57642k776k363k150k854m176n060n004m301l260k057j106p53p78q80j270
53860B18854k073k619k304j706j813k418k445j679r95q87q92o16k58J5L10L71
53844A98845k76j377j970j671j116q53o45k02J86K38K68O52J151J237Q01K55P2
53827A95595M03R31J110P49K66J32K48K57K12M44R26J321J471J406J119Q14J055
53810B08459K016K933K981K430K133K295K628L302M643O031O358N633M990M980
53796B61812M959M422L786L502L311K933K634K641K685K499K158J594N35p98j647
53781B97026j774j905k679l770m469m593m439m221l992l757l446l078k947l213
$$ y = [341069, 334815, 327890, 319958, 311564, 303493, 296234, 290011, 284672, 279559, 274117, 268689, 264126, 260628, 257642, 254866, 252503, 250353, 247499, 243323, 238263, 233259, 228958, 225698, 223641, 222535, 221782, 221004, 220124, 218854, 216781, 214162, 211858, 210152, 208339, 205921, 203476, 201797, 200802, 199915, 199023, 198407, 198149, 198164, 198474, 198845, 198569, 197192, 195222, 193551, 192435, 191582, 190937, 190735, 190921, 191159, 191427, 192079, 193230, 194467, 195268, 195523, 195595, 195998, 196929, 198039, 198788, 199054, 199186, 199434, 199691, 199903, 200347, 201273, 202594, 204065, 205471, 206590, 207404, 208459, 210475, 213408, 216389, 218819, 220952, 223247, 225875, 229177, 233820, 239851, 246209, 251842, 256832, 261812, 266771, 271193, 274979, 278481, 281792, 284725, 287359, 290000, 292685, 295184, 297342, 298936, 299471, 298673, 297026, 295252, 293347, 290668, 286898, 282429, 277836, 273397, 269176, 265184, 261427, 257981, 254903, 251956, 248743]
53767B48743l407k970k252k159k754l102k694k167k241k751l117l130k809k136
53753B11054j317q44r15j166j183q82l40J72O8r27j997j911n78R23J816K166J911
53736B06050O90r37j469m06Q49Q33q6n46o9P93J518J912J849J464J297J598J898
53719B17238J782J551J562J513J027M85N43J208J945K406K546K428K294K517L081
53704B44126L590L923M268M328L459J900R10J123J803K267K918L958M381L400
53690B86354J934J335J414J104L79K5J6l28q29o75k5K2q16j588j644j308r65n68
53672B83837k71m60q92q18k35M6k22l23J16M78K63j59l74n84q80p36N9P05M11
53653B79961m54r09o66k52j11k09k40J20R70J830J889J008J37K72J301K274K574
$$ y = [248743, 245336, 242366, 240114, 237955, 235201, 232099, 229405, 227238, 224997, 222246, 219129, 215999, 213190, 211054, 209737, 208893, 207978, 206812, 205629, 204747, 204407, 204579, 204647, 203720, 201723, 199812, 199234, 200157, 201973, 204139, 206050, 206740, 205803, 204334, 203928, 204777, 205610, 205524, 204978, 204909, 205702, 207220, 209132, 210981, 212445, 213742, 215340, 217238, 219020, 220571, 222133, 223646, 224673, 225158, 225701, 226909, 228854, 231260, 233806, 236234, 238528, 241045, 244126, 247716, 251639, 255907, 260235, 263694, 265594, 266504, 267627, 269430, 271697, 274615, 278573, 282954, 286354, 288288, 289623, 291037, 292141, 292520, 292545, 292561, 292233, 291404, 290729, 290704, 290726, 289910, 288322, 286678, 285370, 284405, 283837, 283566, 283106, 282214, 281396, 281161, 281207, 280985, 280662, 280778, 281256, 281519, 281360, 280986, 280402, 279522, 278786, 278845, 279550, 279961, 279507, 278598, 277932, 277680, 277569, 277360, 277120, 277240, 278210, 280040, 281929, 282937, 283074, 283346, 284647, 286921, 289495]
53636B89495K315J842J343R56Q46J057J528K210L015L729M208M499M640M475L936
53621C30094L294K853K523K029J464J278J610K018K049J900K138K873L528L596
53607C63247L360L532M267M901M792M101L516L372L356L011K253J399Q49P62R03
53592D07621Q25L03m21r27j040q83o53n15o01r05j213j306j174r68q70j083j729
53575C94461k558k999k787k309k044j886j448q77p88j336j908j882j365q66n79
53560C68829k92J59O15P85N91K75J23R6j10n76q72n03M80J574K400K863K858K309
53542C81604J587J360J833K437K602K489K622L073L467L681M061M859N830O559
53528D28064O995P468Q334R635J0999J1862J1964J1771J2067J3015J3902J4089
$$ y = [289495, 291810, 293652, 294995, 295951, 296797, 297854, 299382, 301592, 304607, 308336, 312544, 317043, 321683, 326158, 330094, 333388, 336241, 338764, 340793, 342257, 343535, 345145, 347163, 349212, 351112, 353250, 356123, 359651, 363247, 366607, 370139, 374406, 379307, 384099, 388200, 391716, 395088, 398444, 401455, 403708, 405107, 405956, 406718, 407621, 408446, 408749, 408328, 407401, 406361, 405478, 404825, 404310, 403709, 402804, 401591, 400285, 399111, 398143, 397273, 396190, 394461, 391903, 388904, 386117, 383808, 381764, 379878, 378430, 377553, 376765, 375429, 373521, 371639, 370274, 369408, 368829, 368537, 368696, 369311, 370096, 370687, 370962, 371085, 371181, 371071, 370495, 369623, 369120, 369600, 371174, 373574, 376437, 379295, 381604, 383191, 384551, 386384, 388821, 391423, 393912, 396534, 399607, 403074, 406755, 410816, 415675, 421505, 428064, 435059, 442527, 450861, 460496, 471495, 483357, 495321, 507092, 519159, 532174, 546076, 560165]
53516E60165J3979J4527J5965J7528J8456J8823J9229K0137K1705K3771K5652
53505G69937K6440K5888K4798K4081K3769K3323K2577K1811K1097K0302J9663
53494A023686J9621K0068K0299J9936J9386J9189J9299J9276J8833J8015J7064
53483A234672J6280J5853J5772J6023J6693J7626J8147J7681J6486J5200J3795
53472A414228J1695Q946O476M918L852K503N32k155n668r619j2962j4903j5663
53459A392180j5869j5681j5095j4661j5185j6763j8666k0163k1148k1887k2518
53448A194544k2813k2407k1343k0270j9786j9609j8915j7552j6254j5479j4670
53437I85446j3119j0946q695o559m540k982k184j794j106J21J656L313M994O490
$$ y = [560165, 574144, 588671, 604636, 622164, 640620, 659443, 678672, 698809, 720514, 744285, 769937, 796377, 822265, 847063, 871144, 894913, 918236, 940813, 962624, 983721, 1004023, 1023686, 1043307, 1063375, 1083674, 1103610, 1122996, 1142185, 1161484, 1180760, 1199593, 1217608, 1234672, 1250952, 1266805, 1282577, 1298600, 1315293, 1332919, 1351066, 1368747, 1385233, 1400433, 1414228, 1425923, 1434869, 1441345, 1446263, 1450115, 1452618, 1453150, 1450995, 1445327, 1435708, 1422746, 1407843, 1392180, 1376311, 1360630, 1345535, 1330874, 1315689, 1298926, 1280260, 1260097, 1238949, 1217062, 1194544, 1171731, 1149324, 1127981, 1107711, 1087925, 1068316, 1049401, 1031849, 1015595, 1000116, 985446, 972327, 961381, 952686, 946127, 941587, 938605, 936421, 934627, 933521, 933642, 935298, 938611, 943605, 950095]
53423I50095P680Q817J0207J1768J3226J4498J5656J6800J8227K0224K2342K3511
53411A133051K3453K3355K4417K6208K7401K7791K8536L0456L3024L5284L7016
53400A449992L8648M0576M2837M5250M7649M9986N2186N3853N4550N4533N4767
53389A984827N5821N7163N7973N8113N7756N6623N4392N1509M8750M6190M3422
53378B572539M0556L8144L6111L3614L0087K5823K1427J7255J3307R203M337j549
53366B840854q121j5203k3137l1718l9394m4664m7879n0502n2889n4280n4762
53355B418305n5559n6958n7580n6453n4465n2851n1430m9409m7008m5167m4182
53344A847243m3738m3788m4358m4720m3820m1572l8963l6783l4859l2606k9841
$$ y = [950095, 957775, 966592, 976799, 988567, 1001793, 1016291, 1031947, 1048747, 1066974, 1087198, 1109540, 1133051, 1156504, 1179859, 1204276, 1230484, 1257885, 1285676, 1314212, 1344668, 1377692, 1412976, 1449992, 1488640, 1529216, 1572053, 1617303, 1664952, 1714938, 1767124, 1820977, 1875527, 1930060, 1984827, 2040648, 2097811, 2155784, 2213897, 2271653, 2328276, 2382668, 2434177, 2482927, 2529117, 2572539, 2613095, 2651239, 2687350, 2720964, 2751051, 2776874, 2798301, 2815556, 2828863, 2838066, 2842403, 2840854, 2832733, 2817530, 2794393, 2762675, 2723281, 2678617, 2630738, 2580236, 2527347, 2473067, 2418305, 2362746, 2305788, 2248208, 2191755, 2137290, 2084439, 2033009, 1983600, 1936592, 1891425, 1847243, 1803505, 1759717, 1715359, 1670639, 1626819, 1585247, 1546284, 1509501, 1474642, 1442036, 1412195]
53333A412195k6909k4272k2045j9835j7168j4198j1727j0386j0056j0305j0949
53322A234345j1879j2719j3127j3189j3067j2522j1251r563q210p544p188o516
53310A107570n168l097m93K117L947M398L673K897L390N489Q143J0000J0921J1993
53296A165780J4005J6435J8246J9297K0382K2098K4170K5916K6996K7479K7462
53285A408266K6878K5658K3919K1943K0003J8329J7091J6206J5118J3053R767
53274A616231N834K063j247m228o900r163j1209j3506j6270j9239k2061k4589
53262A495716k6752k8425k9504k9987l0004k9863k9946l0256l0340k9916k9385
53251A171338k9233k9173k8490k7161k6014k5640k5771k5913k6028k6202k6152
$$ y = [1412195, 1385286, 1361014, 1338969, 1319134, 1301966, 1287768, 1276041, 1265655, 1255599, 1245294, 1234345, 1222466, 1209747, 1196620, 1183431, 1170364, 1157842, 1146591, 1137028, 1128818, 1121274, 1114086, 1107570, 1102402, 1099305, 1098812, 1100929, 1104876, 1109274, 1112947, 1115844, 1119234, 1124723, 1132866, 1142866, 1153787, 1165780, 1179785, 1196220, 1214466, 1233763, 1254145, 1276243, 1300413, 1326329, 1353325, 1380804, 1408266, 1435144, 1460802, 1484721, 1506664, 1526667, 1544996, 1562087, 1578293, 1593411, 1606464, 1616231, 1622065, 1624128, 1622881, 1618653, 1611753, 1602590, 1591381, 1577875, 1561605, 1542366, 1520305, 1495716, 1468964, 1440539, 1411035, 1381048, 1351044, 1321181, 1291235, 1260979, 1230639, 1200723, 1171338, 1142105, 1112932, 1084442, 1057281, 1031267, 1005627, 979856, 953943, 927915, 901713, 875561]
53240H75561k5481k4269k3054k2257k1777k1096j9790j7988j6281j4987j3717
53229F54864j1931r769p964p053o969p373p929q331q494q650r030r554j0089j0762
53215E30966j1563j2033j1897j1649j1810j1906j1075r515q366q138q216p950
53203D06848p366o646n804n165n259n991o690p147p769q463q496p727p003o784
53189C10538o455n562m719m566m676m357l730l206k651j957j732k446l410l563
53175B57508k904k185j700j216q33r18j389j797k024k158j986j321n71k48j64
53160B36094J40M60L26oJ03M82L58k81n63j19L54J95l43o98q28r83j163j178r85
53141B31365p24o09q35j318j579j214l71N00J252J931K271J974J380J256J784
$$ y = [875561, 850080, 825811, 802757, 780500, 758723, 737627, 717837, 699849, 683568, 668581, 654864, 642933, 633164, 625200, 618147, 611178, 603805, 595876, 587545, 579051, 570401, 561371, 551817, 541728, 530966, 519403, 507370, 495473, 483824, 472014, 460108, 449033, 439518, 431152, 423014, 414798, 406848, 399482, 392836, 387032, 381867, 376608, 370617, 363927, 356780, 349011, 340548, 332052, 324325, 317322, 310538, 304083, 298521, 293802, 289236, 284560, 280203, 276473, 273267, 270616, 268659, 266927, 264481, 261071, 257508, 254604, 252419, 250719, 249503, 248670, 247752, 246363, 244566, 242542, 240384, 238398, 237077, 236506, 236258, 236094, 236234, 236694, 237020, 237014, 237117, 237599, 237957, 237676, 237113, 236994, 237348, 237543, 237200, 236502, 235674, 234691, 233528, 232350, 231365, 230641, 230032, 229197, 227879, 226300, 225086, 224715, 225215, 226467, 228398, 230669, 232643, 234023, 235279, 237063]
53126B37063K311K241J619Q21J82M5O11J517K024J832J313Q71M74K9l38n67q35
53109B51213j170j256r40n80o72j295k156k859k959k120o40M77L82o46j485j449
53093B31845r12n67m26n4M43K87p68j710j381p4P18K12q01j198q82m35q6L01O64
53074B25176P90P42O95N81L17P1p3l66q59j096q76q25j428k023j716q71o03j012
53056B16624j123n58m2o8k08j03k2K0N94J697K253J531K54m53n41n80n56r6N21
53037B19144O68M28L65M11l4q76j185n50K69L99k6l06j66J73N68J030J399J407
53019B23118J069O85M10J27j71k01K25Q64J278J310J035M52l66q69l79R52J979
53002B31518J825R04K25Jl47r85j310r14j22O34J273J571J017k64j093n93N07
$$ y = [237063, 239374, 241615, 243234, 244055, 244237, 244282, 244893, 246410, 248434, 250266, 251579, 252450, 252924, 252953, 252615, 252048, 251213, 250043, 248787, 247847, 247267, 246595, 245300, 243144, 240285, 237326, 235206, 234566, 235043, 235425, 234779, 233294, 231845, 230933, 230366, 229940, 229886, 230329, 230616, 229848, 228138, 226757, 226683, 227401, 227613, 226812, 225614, 224732, 224297, 224211, 224512, 225176, 225966, 226708, 227403, 227984, 228301, 228372, 228299, 227933, 227074, 225978, 225102, 224277, 222849, 220826, 219110, 218239, 217636, 216624, 215501, 214943, 214901, 214833, 214625, 214522, 214500, 214520, 215114, 216811, 219064, 220595, 220849, 220396, 219855, 219275, 218719, 218623, 219144, 219812, 220240, 220605, 221016, 220982, 220106, 218921, 218371, 218640, 219039, 219013, 218707, 218541, 218714, 219282, 220312, 221711, 223118, 224187, 224872, 225282, 225409, 225238, 225037, 225262, 226126, 227404, 228714, 229749, 230201, 229835, 228966, 228587, 229539, 231518, 233343, 234247, 234472, 234473, 234126, 233141, 231831, 230917, 230795, 231429, 232702, 234273, 235290, 235026, 233933, 233340, 233847]
52985B33847Q18K69J12R44J801J624P28J79L15O80J005J445J941K129J943J702
52969B51482J470R69K76M6N71J188J138O29L64L81R6n81j063j147j396k084k513
52952B49826k024j164j002j633k075j699r60n66n45n16m19n00p73q88n53J21P41
52935B35371R67P06J11n67j069j177q52l66j73m18o88n13o8j4n81j180j154o54
52917B27681l38l52j12P38J641J771J111M20J93J42j66o73j057j226j184p45J58
52900B28002J006J078L31n11q11n64j62O7j3l20n11k89K54Q17J368K019K487K239
52882B36487J254J99l36l56j41Q5R7j99l73J72J249J911J734J373J494J803J655
52865B48108J083N69L94O36J351K089J915O18o45p42j69l03j460k728l513m056
$$ y = [233847, 234665, 234934, 235046, 235990, 237791, 239415, 240143, 240322, 240637, 241317, 242322, 243767, 245708, 247837, 249780, 251482, 252952, 253921, 254197, 254243, 254814, 256002, 257140, 257769, 258133, 258514, 258610, 258029, 256966, 255819, 254423, 252339, 249826, 247802, 246638, 245636, 244003, 241928, 240229, 239269, 238703, 238158, 237642, 237223, 236723, 235950, 235062, 234509, 234630, 235371, 236338, 237044, 237155, 236588, 235519, 234342, 233490, 233124, 232951, 232533, 231845, 231332, 231264, 231250, 230669, 229489, 228335, 227681, 227343, 226991, 226879, 227617, 229258, 231029, 232140, 232560, 232753, 232895, 232729, 232056, 230999, 229773, 228589, 227844, 228002, 229008, 230086, 230417, 229906, 229095, 228531, 228369, 228436, 228423, 228103, 227592, 227303, 227557, 228374, 229742, 231761, 234248, 236487, 237741, 237940, 237604, 237248, 237107, 237192, 237289, 237090, 236717, 236889, 238138, 240049, 241783, 243156, 244650, 246453, 248108, 249191, 249760, 250154, 250790, 252141, 254230, 256145, 256763, 256118, 255376, 255207, 254904, 253444, 250716, 247203, 243147]
52849B43147m432m164l157k126j655j576j547j624j843j855j358n40K29P80R71
52834B19250N77l25j179j451j095l90L80Q73P03j65j148j502j041l31n3k38k33
52817B12632M67J491J959J566Q52M36M79J033K087L020K734R98j004k130k618
52802B24002l188l586l136k189j690j600j063m8N25M04L74P58Q47K99j11J94N82
52785B11374K30o01j065q05K3J195K276K612K066J285Q92Q02O72L42l98j690k844
52768B16366k641r90N46O47j39m79k27k40p50j040o08K58J065J544J538J077N19
52751B16446K29J71K82Q09J801K577K474J865J661K007K174J747J093O74N21N48
52735B37079P80J031R21M13KJ47P33J182R94J07j014j735j836j670j594j504j185
$$ y = [243147, 238715, 234551, 231394, 229268, 227613, 226037, 224490, 222866, 221023, 219168, 217810, 217270, 217499, 218279, 219250, 219827, 219502, 218323, 216872, 215777, 215387, 215767, 216640, 217343, 217178, 216030, 214528, 213487, 213156, 213103, 212865, 212632, 213099, 214590, 216549, 218115, 218967, 219403, 219882, 220915, 223002, 226022, 228756, 229754, 228750, 226620, 224002, 220814, 217228, 214092, 211903, 210213, 208613, 207550, 207502, 208027, 208431, 208805, 209563, 210410, 210709, 210598, 210792, 211374, 211604, 211003, 209938, 209133, 209156, 210351, 212627, 215239, 217305, 218590, 219482, 220284, 220956, 221298, 220900, 219210, 216366, 213725, 212735, 213281, 213928, 213789, 213310, 213083, 212843, 212093, 211053, 210445, 210703, 211768, 213312, 214850, 215927, 216446, 216675, 216846, 217128, 217937, 219738, 222315, 224789, 226654, 228315, 230322, 232496, 234243, 235336, 236010, 236531, 237079, 237859, 238890, 239811, 240224, 240226, 240373, 241106, 242288, 243282, 243389, 242375, 240640, 238804, 237134, 235540, 234036, 232851]
52718B32851q21p59r33j014r66j030j211j188q06k68J62L66L51K75M37Q80J149
52701B27475P50j40p78o50N7P36Q80M30j73l31N2M20L04K5K27R18J406J171M03
52682B33182m17r93j273j325j336j414j348p92J85J028J330J252J172J041M55
52667B30747o52j591j492k63J190J904J799J473J276J070Q63J080J885K735K910
52652B44934K228R89m41j654k173j929j548j659k063k015j269m34k12o78j331
52637B30745j615j303n75J80O91R84J263J783K756M030M831M247K294J52j012
52622B49451j195j231j617k085k145j647q17q3J78L2l5K47N25L42p4n2N57J107
52604B41458R59K18m37n03r6K54J71k35o01p48o72l03L50P78L48p13j263n68P63
$$ y = [232851, 232030, 231271, 230338, 229324, 228358, 227328, 226117, 224929, 224123, 223855, 224017, 224383, 224734, 225009, 225446, 226326, 227475, 228225, 228085, 227307, 226657, 226714, 227450, 228330, 228760, 228587, 228256, 228308, 228728, 229032, 229057, 229284, 230202, 231608, 232779, 233182, 232765, 231772, 230499, 229174, 227838, 226424, 225076, 224284, 224469, 225497, 226827, 228079, 229251, 230292, 230747, 230095, 228504, 227012, 226749, 227939, 229843, 231642, 233115, 234391, 235461, 236324, 237404, 239289, 242024, 244934, 247162, 248151, 247710, 246056, 243883, 241954, 240406, 238747, 236684, 234669, 233400, 232966, 232754, 232076, 230745, 229130, 227827, 227252, 227432, 228123, 229107, 230370, 232153, 234909, 238939, 243770, 248017, 250311, 250463, 249451, 248256, 247025, 245408, 243323, 241178, 239531, 238714, 238631, 238809, 238841, 238806, 239053, 239578, 239920, 239846, 239794, 240351, 241458, 242417, 242635, 242198, 241695, 241599, 241853, 242024, 241789, 241188, 240440, 239768, 239465, 239815, 240593, 240941, 240228, 238965, 238397, 239160]
52585B39160J630J775J715J687J420Q37L53K84M77O30O60N92L11l39j262k033
52569B47897k188j741j226r92n83O02K124K681J766M26j30k1j76q35j411j502
52553B44691j267q74l15K42M59K97M5p7p0k4j02m71r47j005m63K03O14J062J828
52534B43826K412K135J200L20l13r39j304q15L66J207R90Pr37j213o22L94Q66
52517B47580K43p70r60o3J140K025K614K993L081L057L190L186K528J501R60Q86
52501B73191K27j440l081l574l156k787k726k452j694q24l90o04j195j606j474
52486B46415j042p69o04q9Q09J494J572J323J150J020P26K52k64n72k64P90J974
52469B53921K421K092J681J473J107O37Q57K090L451L921L463K642J731Q09R3
$$ y = [239160, 240790, 242565, 244280, 245967, 247387, 248224, 248577, 248861, 249338, 249968, 250628, 251220, 251531, 251192, 249930, 247897, 245709, 243968, 242742, 241750, 241167, 241769, 243893, 246574, 248340, 248766, 248636, 248615, 248439, 247604, 246193, 244691, 243424, 242550, 242235, 242477, 242936, 243233, 243278, 243201, 243131, 243107, 243005, 242534, 241587, 240582, 240119, 240322, 240936, 241998, 243826, 246238, 248373, 249573, 249893, 249580, 248641, 247337, 246522, 246888, 248095, 249085, 249092, 248155, 246942, 246320, 246714, 247580, 247823, 247053, 246093, 246030, 247170, 249195, 251809, 254802, 257883, 260940, 264130, 267316, 269844, 271345, 272305, 273191, 273418, 271978, 268897, 265323, 262167, 259380, 256654, 254202, 252508, 251684, 251294, 250690, 249495, 247889, 246415, 245373, 244604, 244000, 243911, 244720, 246214, 247786, 249109, 250259, 251279, 252005, 252257, 251993, 251421, 251157, 251947, 253921, 256342, 258434, 260115, 261588, 262695, 263332, 264189, 266279, 269730, 273651, 277114, 279756, 281487, 282296, 282389]
52454B82389m71j415k884m044m101l429k980k898k584j937j603j914k282j887
52440B47960o10Q28J474Q88l88j218r64j38K70n8n70o37k65L2j34n62o19K1Q84
52421B46194J203Q91O03Q00J263J637J932K250K520K785L289M071M897N941P810
52406B88086J0499J2815J3467J2272R780O213J567l509p735j0168j0709r834q217
52393C04527o562n255m224l326k634k105j326j07J037J472J293J019P65L35n2
52378B84857J13P77J336J508J610J866K063K141K513L444M486M924M585L902L284
52363C23409K727K027J149K92l90r53j431j579j134l25J75jn40r33r89p00K0J103
52345C21927K141K802L206L572L693L283K632K483L258M684O136P071P274P046
$$ y = [282389, 281918, 280503, 277619, 273575, 269474, 266045, 263065, 260167, 257583, 255646, 254043, 252129, 249847, 247960, 247350, 248178, 249652, 250540, 250152, 248934, 247970, 247832, 248102, 248044, 247474, 246837, 246572, 246604, 246470, 245908, 245289, 245310, 246194, 247397, 248288, 248891, 249691, 250954, 252591, 254523, 256773, 259293, 262078, 265367, 269438, 274335, 280276, 288086, 298585, 311400, 324867, 337139, 346919, 353132, 354699, 351190, 343455, 333287, 322578, 312744, 304527, 297965, 292710, 288486, 285160, 282526, 280421, 279095, 278988, 280025, 281497, 282790, 283809, 284574, 284909, 284857, 284970, 285747, 287083, 288591, 290201, 292067, 294130, 296271, 298784, 302228, 306714, 311638, 316223, 320125, 323409, 326136, 328163, 329312, 329604, 329214, 328261, 326830, 325251, 324117, 323792, 323967, 323966, 323426, 322493, 321504, 320804, 320824, 321927, 324068, 326870, 330076, 333648, 337341, 340624, 343256, 345739, 348997, 353681, 359817, 366888, 374162, 381208]
52331C81208P020P535Q277Q777R068R612J0694J2244J4036J5708J6825J7241J7316
52318E35561J7393J7296J6688J5796J5247J5283J5567J5763J5834J5837J5810
52307G12075J5868J6074J6173J5831J5172J4669J4470J4175J3369J2133J0881
52296H70890R833Q788P331N278K966R40o47k123l726n257o532p692q722r061q293
52281H53973o936n936n428m675l204j447o0Q57J703K837M329O003P569Q766R468
52266H67819R650R431R218R511J0316J1046J1297J1399J1845J2519J3029J3392
52254A000472J3733J3572J2311J0396R095Q867Q752P594N264K304r02m080o744
52241A080634q559r760j0651j1032j0693j0259j0732j2105j3139j2905j1992j1595
$$ y = [381208, 388228, 395763, 404040, 412817, 421885, 431497, 442191, 454435, 468471, 484179, 501004, 518245, 535561, 552954, 570250, 586938, 602734, 617981, 633264, 648831, 664594, 680428, 696265, 712075, 727943, 744017, 760190, 776021, 791193, 805862, 820332, 834507, 847876, 860009, 870890, 880723, 889511, 896842, 902120, 905086, 906026, 905379, 903256, 899530, 894273, 887741, 880049, 871327, 862266, 853973, 847037, 841101, 835673, 830998, 827794, 826347, 826287, 827144, 828847, 831684, 836013, 842016, 849585, 858351, 867819, 877469, 886900, 896118, 905629, 915945, 926991, 938288, 949687, 961532, 974051, 987080, 1000472, 1014205, 1027777, 1040088, 1050484, 1059579, 1068446, 1077198, 1084792, 1090056, 1092360, 1091458, 1087378, 1080634, 1072075, 1062315, 1051664, 1040632, 1029939, 1019680, 1008948, 996843, 983704, 970799, 958807, 947212]
52229I47212j1772j1422j0057q652q226q269p542o051n099n266n524m799l424
52216H51109k259j291k4J297K022K368L195M519N246M638L169J751Q22M29O10
52201H77601J275K190L281M565N678O076N779N399N251N061M726M667N039N174
52187I41762M357K744J048l88j750l219m692n949o838p281p360p254p057o781
52173H91342o528o396o158n411m124k746j656p91J8P55J408K114K888L448L503
52158H71666L095K546K243K422K838K761J749L76l84m84q08j591j742k81K109
52143H86515L715L638K403J009M8k98o1M96J053J612K441L621M837N798O678P992
52127I31497J0058J2644J5199J7413J9423K1392K3118K4286K4948K5400K5656
$$ y = [947212, 935440, 924018, 913961, 905309, 897083, 888814, 881272, 875221, 870122, 864856, 859332, 854533, 851109, 848850, 847559, 847535, 848832, 850854, 853222, 856417, 860936, 866182, 870820, 873989, 875740, 876562, 876991, 877601, 878876, 881066, 884347, 888912, 894590, 900666, 906445, 911844, 917095, 922156, 926882, 931549, 936588, 941762, 946119, 948863, 949911, 949523, 947773, 944554, 939862, 933913, 927075, 919794, 912434, 905180, 898123, 891342, 884814, 878418, 872260, 866849, 862725, 859979, 858323, 857532, 857550, 858305, 859713, 861827, 864715, 868163, 871666, 874761, 877307, 879550, 881972, 884810, 887571, 889320, 889696, 889312, 888828, 888020, 886429, 884687, 884406, 886515, 890230, 893868, 896271, 897280, 897328, 897030, 896969, 897465, 898518, 900130, 902571, 906192, 911029, 916827, 923505, 931497, 941555, 954199, 969398, 986811, 1006234, 1027626, 1050744, 1075030, 1099978, 1125378, 1151034]
52116A151034K5438K4725K3919K3354K2933K2330K1299J9723J7704J5660J4023
52105A382142J2749J1381R623P609N642M000K854K042R52q10k868m716o691r529
52091A414380j2995j5955j7876j9261k0333k0434j9254j7632j6367j5134j3385
52080A225754j1492j0071q836p101m917k754n89J708L594M641N622P619J0191
$$ y = [1151034, 1176472, 1201197, 1225116, 1248470, 1271403, 1293733, 1315032, 1334755, 1352459, 1368119, 1382142, 1394891, 1406272, 1415895, 1423504, 1429146, 1433146, 1436000, 1438042, 1438994, 1438184, 1435316, 1430600, 1423909, 1414380, 1401385, 1385430, 1367554, 1348293, 1327960, 1307526, 1288272, 1270640, 1254273, 1239139, 1225754, 1214262, 1204191, 1195355, 1188254, 1183337, 1180583, 1179994, 1181702, 1185296, 1189937, 1195559, 1203178, 1213369]
$$ [...]
##END NTUPLES=NMR SPECTRUM
##END=
