##TITLE=AC1457_PAST213263_8026755_9Goeyw9t4D
##JCAMPDX= 6.0         $$ Bruker NMR JCAMP-DX V2.0
##DATA TYPE= NMR SPECTRUM
##DATA CLASS= NTUPLES
##ORIGIN= BRUKER
##OWNER= Administrator
$$ 1.72 TOPSPIN		Version 2.1
$$ 2013-07-11 15:44:39.983 -0700  Administrator@X
$$ Compression mode = diff/dup
##.OBSERVE FREQUENCY= 400.02188249412
##.OBSERVE NUCLEUS= ^1H
##.ACQUISITION MODE= SIMULTANEOUS (DQD)
##.ACQUISITION SCHEME= undefined
##.AVERAGES= 64
##.DIGITISER RES= 22
##SPECTROMETER/DATA SYSTEM= spect
##.PULSE SEQUENCE= noesygpps1d.comp
##.SOLVENT NAME= COFFEE_meoh
##.SHIFT REFERENCE= INTERNAL, COFFEE_meoh, 1, 14.961
##AUDIT TRAIL= $$ (NUMBER, WHEN, WHO, WHERE, PROCESS, VERSION, WHAT)
$$ ##TITLE= Audit trail, TOPSPIN		Version 2.1
$$ ##JCAMPDX= 5.01
$$ ##ORIGIN= Bruker BioSpin GmbH
$$ ##OWNER= Administrator
$$ $$ E:\/data/COFFEE/nmr/AC1457_PAST213263_8026755_9Goeyw9t4D/12/pdata/1/auditp.txt
$$ ##AUDIT TRAIL=  $$ (NUMBER, WHEN, WHO, WHERE, PROCESS, VERSION, WHAT)
(   1,<2013-07-11 15:44:34.111 -0700>,<Administrator>,<X>,<go>,<TOPSPIN 2.1>,
      <created by zg
	started at 2013-07-11 15:33:05.905 -0700,
	POWCHK enabled, PULCHK disabled,
       configuration hash MD5:
       C8 4E 4E 5D D3 5C D8 9E 9F 52 82 E0 59 8A DE 15
       data hash MD5: 64K
       0B CE D5 D9 3A 98 26 F3 DA F2 A4 BD 95 3F 54 88>)
(   2,<2013-07-11 15:44:37.526 -0700>,<Administrator>,<X>,<proc1d>,<TOPSPIN 2.1>,
      <Start of raw data processing
       efp LB = 0.3 FT_mod = 6 PKNL = 1 PHC0 = 0 PHC1 = 0 SI = 128K 
       data hash MD5: 128K
       82 CF 0F 23 3A 8C 31 E8 76 7F A8 26 4D A7 90 A0>)
(   3,<2013-07-11 15:44:38.682 -0700>,<Administrator>,<X>,<proc1d>,<TOPSPIN 2.1>,
      <pk PHC0 = -79.7168 PHC1 = 0 
       data hash MD5: 128K
       CC EA DA 1A 17 29 1A 8F 6B BD DB 32 B5 22 71 8A>)
(   4,<2013-07-11 15:44:39.206 -0700>,<Administrator>,<X>,<proc1d>,<TOPSPIN 2.1>,
      <abs ABSG = 1 
       data hash MD5: 128K
       ED 9B 84 67 CD AA BB 67 C6 99 D3 89 3D 92 4F 7D>)
(   5,<2013-07-11 15:44:39.369 -0700>,<Administrator>,<X>,<proc1d>,<TOPSPIN 2.1>,
      <abs ABSG = 2 
       data hash MD5: 128K
       34 5A 9C 9E 96 F2 12 A2 D8 CC 5C AA 3D D0 68 11>)
(   6,<2013-07-11 15:44:39.477 -0700>,<Administrator>,<X>,<proc1d>,<TOPSPIN 2.1>,
      <abs ABSG = 3 
       data hash MD5: 128K
       13 17 CD A2 17 C9 09 83 DD 08 1B 77 E0 59 01 4C>)
(   7,<2013-07-11 15:44:39.585 -0700>,<Administrator>,<X>,<proc1d>,<TOPSPIN 2.1>,
      <abs ABSG = 4 
       data hash MD5: 128K
       52 55 A8 D5 88 57 42 07 D3 AC 55 C9 C2 5A 23 2D>)
(   8,<2013-07-11 15:44:39.712 -0700>,<Administrator>,<X>,<proc1d>,<TOPSPIN 2.1>,
      <abs ABSG = 5 
       data hash MD5: 128K
       E7 BA 6A 6E FC 3D 42 6B 16 8F 3C 3A 9A CB 64 1E>)
$$ ##END=
$$ 
$$ $$ hash MD5
$$ $$ BF E2 BA 74 66 F6 04 61 57 16 D4 A8 78 7E 33 32
##$RELAX= 
##$RELAX= 
##$RELAX= 
##$RELAX= 
##$RELAX= 
##$RELAX= 
##$RELAX= 
##$RELAX= 
$$ Bruker specific parameters
$$ --------------------------
##$DU= <E:\>
##$EXPNO= 12
$$ [...]
150 150 150 150 150 150 150 150
##$TP07= 0
##$TPNAME0= <>
##$TPNAME1= <>
##$TPNAME2= <>
##$TPNAME3= <>
##$TPNAME4= <>
##$TPNAME5= <>
##$TPNAME6= <>
##$TPNAME7= <>
##$TPOAL= (0..7)
0.5 0.5 0.5 0.5 0.5 0.5 0.5 0.5
##$TPOFFS= (0..7)
0 0 0 0 0 0 0 0
##$TUNHIN= 0
##$TUNHOUT= 0
##$TUNXOUT= 0
##$USERA1= <user>
##$USERA2= <user>
##$USERA3= <user>
##$USERA4= <user>
##$USERA5= <user>
##$V9= 5
##$VALIST= <valist>
##$VCLIST= <CCCCCCCCCCCCCCC>
##$VD= 0
##$VDLIST= <DDDDDDDDDDDDDDD>
##$VPLIST= <PPPPPPPPPPPPPPP>
##$VTLIST= <TTTTTTTTTTTTTTT>
##$WBST= 1024
##$WBSW= 4
##$XGAIN= (0..3)
0 0 0 0
##$XL= 0
##$YL= 0
##$YMAX_a= 6184856
##$YMIN_a= -12400117
##$ZGOPTNS= <>
##$ZL1= 120
##$ZL2= 120
##$ZL3= 120
##$ZL4= 120
##$ABSF1= 14.961
##$ABSF2= -5.597181
##$ABSG= 5
##$ABSL= 3
##$ALPHA= 0
##$AQORDER= 0
##$ASSFAC= 0
##$ASSFACI= 0
##$ASSFACX= 0
##$ASSWID= 0
##$AUNMP= <proc_prof1d_extract.lims>
##$AXLEFT= 0
##$AXNAME= <>
##$AXNUC= <1H>
##$AXRIGHT= 0
##$AXTYPE= 0
##$AXUNIT= <>
##$AZFE= 0.1
##$AZFW= 0.1
##$BCFW= 0
##$BC_mod= 0
##$BYTORDP= 0
##$COROFFS= 0
##$CY= 15
##$DATMOD= 1
##$DC= 0
##$DFILT= <>
##$DTYPP= 0
##$F1P= 0
##$F2P= 0
##$FCOR= 0.5
##$FTSIZE= 131072
##$FT_mod= 6
##$GAMMA= 0
##$GB= 0
##$INTBC= 1
##$INTSCL= 1
##$ISEN= 128
##$LB= 0.3
##$LEV0= 0
##$LPBIN= 0
##$MAXI= 10000
##$MC2= 0
##$MEAN= 0
##$ME_mod= 0
##$MI= 0
##$NCOEF= 0
##$NC_proc= -2
##$NLEV= 6
##$NOISF1= 0
##$NOISF2= 0
##$NSP= 0
##$NTH_PI= 0
##$NZP= 0
##$OFFSET= 14.961
##$PC= 1
##$PHC0= -79.7168
##$PHC1= 0
##$PH_mod= 1
##$PKNL= yes
##$PPARMOD= 0
##$PPDIAG= 0
##$PPIPTYP= 0
##$PPMPNUM= 2147483647
##$PPRESOL= 1
##$PSCAL= 4
##$PSIGN= 0
##$PYNMP= <proc.py>
##$REVERSE= no
##$SF= 400.020009635263
##$SI= 131072
##$SIGF1= 0
##$SIGF2= 0
##$SINO= 400
##$SIOLD= 131072
##$SPECTYP= <>
##$SREGLST= <1H.CDCl3>
##$SSB= 0
##$STSI= 131072
##$STSR= 0
##$SW_p= 8223.68421052631
##$SYMM= 0
##$S_DEV= 0
##$TDeff= 65536
##$TDoff= 0
##$TI= <>
##$TILT= no
##$TM1= 0
##$TM2= 0
##$TOPLEV= 0
##$USERP1= <user>
##$USERP2= <user>
##$USERP3= <user>
##$USERP4= <user>
##$USERP5= <user>
##$WDW= 1
##$XDIM= 131072
##$YMAX_p= 421854165
##$YMIN_p= -11496
##$CURPLOT= <Network HP LaserJet P1505>
##$CURPRIN= <$Network HP LaserJet P1505>
##$DFORMAT= <normdp>
##$LAYOUT= <+/1D_H.xwp>
##$LFORMAT= <normlp>
##$PFORMAT= <normpl>
##$SURQMSG= 1
$$ End of Bruker specific parameters
$$ ---------------------------------
##NTUPLES= NMR SPECTRUM
##VAR_NAME=  FREQUENCY,     SPECTRUM/REAL,   SPECTRUM/IMAG
##SYMBOL=    X,             R,               I
##VAR_TYPE=  INDEPENDENT,   DEPENDENT,       DEPENDENT
##VAR_FORM=  AFFN,          ASDF,            ASDF
##VAR_DIM=   131072,        131072,          131072
##UNITS=     HZ,            ARBITRARY UNITS, ARBITRARY UNITS
##FACTOR=    0.0627417313425164, 1,          1
##FIRST=     8223.62146879497, 686,          -54075
##LAST=      0,             1487,            -54060
##MIN=       0,             -11496,          0
##MAX=       8223.62146879497, 421854165,    0
$$ Real data points
##PAGE= N=1
##DATA TABLE= (X++(R..R)), XYDATA
$$ [...]
$$ plain form
61700 466852 463524 460508 457827 454920 451157 446583 441984 438231 435629 433881 432468 430917 428920 426525
61686 426525 424229 422532 421264 419599 417002 413955 411437 409810 408614 407414 406377 405815 405572 405248 404770
61671 404770 404354 403970 403303 402273 401214 400383 399573 398461 397095 395751 394517 393418 392875 393459 394972 396277
61655 396277 396507 396150 396417 397711 399349 400749 402118 403661 404871 405307 405684 407385 410899 415331 419574
61640 419574 423437 427437 431882 436420 440234 442466 442695 441199 438687 435667 432157 428001 423273 418298
61626 418298 413491 409165 405341 401724 398088 394695 392045 390173 388518 386649 384861 383870 384107 385355 386778
61611 386778 387191 385673 382263 377973 373913 370492 367400 363961 359410 353304 346107 339080 333193 328349
61597 328349 323991 320115 317114 314834 312453 309410 305980 302786 300161 298097 296443 294905 293145 291076
$$ packed form
61700D66852l328l016k681k907l763m574m599l753k602j748j413j551j997k395
61686D26525k296j697j268j665k597l047k518j627j196j200j037n62k43l24m78
61671D04770m16l84o67j030j059q31q10j112j366j344j234j099n43N84J513J305
61655C96277K30l57K67J294J638J400J369J543J210M36L77J701L514M432M243
61640D19574L863M000M445M538L814K232K29j496k512l020l510m156m728m975
61626D18298m807m326l824l617l636l393k650j872j655j869j788r91K37J248J423
61611C86778M13j518l410m290m060l421l092l439m551o106p197p027n887m844
61597C28349m358l876l001k280k381l043l430l194k625k064j654j538j760k069
$$ plain form
61583 291076 288899 286762 284634 282595 280901 279545 278102 276276 274376 272889 271786 270636 269328 268203
61569 268203 267381 266388 264782 262879 261526 261151 261329 261288 260605 259426 258247 257631 257844 258554 259080 259252 259808
61552 259808 261559 264187 266391 267351 267616 268267 269560 270803 271373 271394 271460 272021 273096 274347 275442 276554
61536 276554 278406 281551 285580 289311 291845 293195 293889 294277 294398 294286 294114 294026 293983 293816 293436 292952 292525
61519 292525 292041 291114 289538 287634 285920 284551 283349 282309 281635 281237 280648 279679 278734 278181 277700 276697
61503 276697 275194 273825 273037 272765 272893 273486 274360 274881 274637 274048 273883 274285 274705 274803 274909 275433 276224 276914
61485 276914 277639 278976 281139 283609 285661 287058 288108 289239 290678 292401 294215 295875 297154 297804 297581
61470 297581 296507 295127 294233 294151 294477 294626 294538 294667 295403 296634 297794 298246 297743 296676 295788 295534 295788 296206
$$ packed form
61583B91076k177k137k128k039j694j356j443j826j900j487j103j150j308j125
61569B68203q22r93j606j903j353l75J78m1o83j179j179o16K13P10N26J72N56
61552B59808J751K628K204R60K65O51J293J243N70K1O6N61J075J251J095J112
61536B76554J852L145M029L731K534J350O94L88J21j12j72q8m3j67l80m84m27
61519B92525m84r27j576j904j714j369j202j040o74l98n89r69r45n53m81j003
61503B76697j503j369p88k72J28N93Q74N21k44n89j65M02M20R8J06N24P91O90
61485B76914P25J337K163K470K052J397J050J131J439J723J814J660J279O50k23
61470B97581j074j380q94q2L26J49q8J29P36J231J160M52n03j067q88k54K54M18
$$ plain form
61452 296206 296620 297021 297417 297916 298672 299537 300113 300449 301319 303325 305992 308401 310506 313132 316633 320336
61436 320336 323520 326238 328858 331418 333924 336750 340129 343583 346479 348949 351682 354880 357973 360401
61422 360401 362241 363993 366139 368961 372424 376124 379624 382962 386517 390268 393497 395364 395577 394401
61408 394401 392337 389962 387760 385735 383341 380070 376086 372048 368411 365137 362003 358880 355683 352404
61394 352404 349315 346851 345076 343489 341587 339474 337618 336118 334578 332740 330923 329701 329408 330073 331570
61379 331570 333574 335572 337246 338770 340464 342196 343423 343887 344059 344756 346451 348989 351872 354739 357560
61364 357560 360390 363011 365095 366786 368827 371792 375454 379274 383333 388199 393964 400034 406075 412586
61350 412586 420269 429267 439397 450608 462701 474866 486055 495714 503840 510525 515887 520320 524277
$$ packed form
61452B96206M14M01L96M99P56Q65N76L36Q70K006K667K409K105K626L501L703
61436C20336L184K718K620K560K506K826L379L454K896K470K733L198L093K428
61422C60401J840J752K146K822L463L700L500L338L555L751L229J867K13j176
61408C94401k064k375k202k025k394l271l984m038l637l274l134l123l197l279
61394C52404l089k464j775j587j902k113j856j500j540j838j817j222k93O65J497
61379C31570K004J998J674J524J694J732J227M64J72O97J695K538K883K867K821
61364C57560K830K621K084J691K041K965L662L820M059M866N765O070O041O511
61350D12586P683Q998J0130J1211J2093J2165J1189R659Q126O685N362M433L957
$$ plain form
61337 524277 527825 530822 533481 536344 539592 542765 545221 546493 546196 544069 540381 535929 531352 526600
61323 526600 521330 515632 510090 505234 501127 497522 494260 491498 489528 488417 487862 487480 487126 486807 486485
61308 486485 486227 486459 487732 490234 493800 498354 503921 510084 515841 520249 522944 523890 522936 519903 514891
61293 514891 508254 500503 492447 485062 478827 473369 468108 463095 458858 455563 452825 450300 448025 446160
61279 446160 444896 444711 446212 449396 453410 457401 461439 466314 472551 479902 487737 495617 503408 511087
61265 511087 518629 526111 533876 542438 552055 562370 572766 583238 594666 607825 622219 636277
61253 636277 648744 659505 668938 676959 683124 687335 689820 690515 689085 685743 681395 676554 670532 662326
61239 662326 652149 641513 631771 623072 614834 606668 598502 590204 581644 573100 565274 558802 553858 550178
$$ packed form
61337E24277L548K997K659K863L248L173K456J272k97k127l688m452m577m752
61323E26600n270n698n542m856m107l605l262k762j970j111n55l82l54l19l22
61308D86485k58K32J273K502L566M554N567O163N757M408K695R46r54l033n012
61293E14891o637p751q056p385o235n458n261n013m237l295k738k525k275j865
61279D46160j264j85J501L184M014L991M038M875O237P351P835P880P791P679
61265E11087P542P482P765Q562R617J0315J0396J0472J1428J3159J4394J4058
61253F36277J2467J0761R433Q021O165M211K485O95j430l342m348m841o022q206
61239F62326j0177j0636r742q699q238q166q166q298q560q544p826o472m944l680
$$ plain form
61225 550178 547355 545172 543782 543477 544137 545014 545252 544529 543093 541293 539402 537815 537093 537564 539012 540813
61209 540813 542319 543127 543167 542629 541764 540709 539560 538606 538369 539357 541804 545709 551113 558335 567912 580231
61193 580231 595176 612209 630754 650263 669859 688224 704240 717616 728646 737543 744490 750256
61181 750256 756093 762575 768894 773745 776848 779186 781749 784381 786001 785741 783575 779989 775376 769970
61167 769970 764149 758328 752399 745540 736943 726639 715393 703844 692022 679708 666955 654226
61155 654226 642225 631664 622917 615802 609906 605215 602107 600653 600232 600074 599861 599481 598383 595616 590515
61140 590515 583148 574170 564496 555055 546541 539216 532983 527644 523069 519302 516658 515635 516549 519325
61126 519325 523725 529610 536816 545038 554142 564469 576508 590368 605823 622747 641080 660493
$$ packed form
61225E50178k823k183j390l05O60Q77K38p23j436j800j891j587p22M71J448J801
61209E40813J506Q08M0n38q65j055j149r54k37R88K447L905N404P222R577J2319
61193E80231J4945J7033J8545J9509J9596J8365J6016J3376J1030Q897O947N766
61181G50256N837O482O319M851L103K338K563K632J620k60k166l586m613n406
61167G69970n821n821n929o859q597j0304j1246j1549j1822j2314j2753j2729
61155F54226j2001j0561q747p115n896m691l108j454m21j58k13l80j098k767n101
61140E90515p367q978r674r441q514p325o233n339m575l767k644j023R14K776
61126E19325M400N885P206Q222R104J0327J2039J3860J5455J6924J8333J9413
$$ plain form
61114 660493 680551 701236 722841 745235 767780 790153 812763 835985 859371 881974 903080
61103 903080 922150 938388 951073 960318 966901 971156 972462 969984 963618 953988 941806 927519 911375
61090 911375 893602 874507 854560 834325 814214 794436 775214 756821 739255 722134 705227
61079 705227 688919 673784 659804 646393 633226 620640 609162 599053 590501 583812 579074 575902
61067 575902 573848 572779 572521 572440 571975 571442 571818 573693 576941 581317 586792 593207 600239 607948 616802 626902
61051 626902 637773 649268 662047 676610 692409 708662 725676 744518 765516 787977 811460
61040 811460 836577 864211 894549 927135 961445 997040 1033591 1071166 1110355 1151886 1196127
61029 1196127 1242965 1291855 1341889 1392174 1442480 1493484 1546361 1602339 1662686 1728833 1802282
$$ packed form
61114F60493K0058K0685K1605K2394K2545K2373K2610K3222K3386K2603K1106
61103I03080J9070J6238J2685R245O583M255J306k478o366r630j2182j4287j6144
61090I11375j7773j9095j9947k0235k0111j9778j9222j8393j7566j7121j6907
61079G05227j6308j5135j3980j3411j3167j2586j1478j0109q552o689m738l172
61067E75902k054j069k58q1m65n33L76J875L248M376N475O415P032P709Q854J0100
61051F26902J0871J1495J2779J4563J5799J6253J7014J8842K0998K2461K3483
61040H11460K5117K7634L0338L2586L4310L5595L6551L7575L9189M1531M4241
61029A196127M6838M8890N0034N0285N0306N1004N2877N5978O0347O6147P3449
$$ plain form
61018 1802282 1884448 1976550 2079604 2194674 2323589 2469598 2637384 2832815 3063170 3337383
61008 3337383 3665322 4056845 4522382 5074983 5731762 6513686 7444922 8552212 9861968
60999 9861968 11391659 13133219 15029601 16954220 18714511 20099017 20959503 21282753
60991 21282753 21201283 20933403 20693879 20626031 20771582 21063578 21335090 21359563 20931455 19955337
60981 19955337 18486899 16697865 14793967 12943050 11246777 9748359 8452199 7341765
60973 7341765 6393822 5587642 4906752 4335801 3858810 3460840 3129447 2853591 2622288
60964 2622288 2425441 2255535 2107774 1978795 1865747 1766241 1678446 1601024 1533110 1474328
60954 1474328 1424574 1383566 1350385 1323339 1300521 1280716 1263708 1249527 1237722 1227724 1219604 1213928
$$ packed form
61018A802282Q2166R2102J03054J15070J28915J46009J67786J95431K30355K74213
61008C337383L27939L91523M65537N52601O56779P81924R31236J107290J309756
60999I861968J529691J741560J896382J924619J760291J384506Q60486L23250
60991B1282753q1470k67880k39524o7848J45551K91996K71512K4473m28108r76118
60981A9955337j468438j789034j903898j850917j696273j498418j296160j110434
60973G341765r47943q06180o80890n70951m76991l97970l31393k75856k31303
60964B622288j96847j69906j47761j28979j13048r9506q7795p7422o7914n8782
60954A474328m9754m1008l3181k7046k2818j9805j7008j4181j1805r998q120n676
$$ plain form
60942 1213928 1210949 1210424 1212082 1215644 1220426 1225499 1230353 1234931 1239118 1242876 1246798 1251680 1257350 1262723
60928 1262723 1267255 1271461 1275610 1278801 1279968 1279010 1276144 1270827 1262270 1250578 1236339 1219358 1198874
60915 1198874 1175054 1149297 1122818 1095726 1067789 1039382 1011273 984008 957954 933508 910778
60904 910778 889328 868736 849305 831817 816603 803166 790826 779425 769213 760142 751591 742875
60892 742875 733890 724988 716307 707533 698446 689313 680457 671631 662236 652125 641837 631930 622348 612618
60878 612618 602549 592592 583527 575792 569082 562682 556205 549905 544188 539049 534194 529600 525605 522400
60864 522400 519661 516798 513435 509585 505510 501491 497707 494184 490818 487405 483750 479840 475894 472117
60850 472117 468461 464825 461424 458599 456188 453484 450108 446554 443524 440961 438209 434966 431584 428363
$$ packed form
60942A213928k979n25J658L562M782N073M854M578M187L758L922M882N670N373
60928A262723M532M206M149L191J167r58k866n317q557j1692j4239j6981k0484
60915A198874k3820k5757k6479k7092k7937k8407k8109k7265k6054k4446k2730
60904I10778k1450k0592j9431j7488j5214j3437j2340j1401j0212r071q551q716
60892G42875q985q902q681q774r087r133q856q826r395j0111j0288r907r582r730
60878F12618j0069r957r065p735o710o400o477o300n717n139m855m594l995l205
60864E22400k739k863l363l850m075m019l784l523l366l413l655l910l946l777
60850D72117l656l636l401k825k411k704l376l554l030k563k752l243l382l221
$$ plain form
60836 428363 425003 420901 415792 409998 404252 399264 395315 392246 389955 388694 388602 389161 389583 389716 390120 391241
60820 391241 392970 395055 397414 399837 401928 403691 405776 408664 411906 414641 416653 418401 420084 421161
60806 421161 420977 419550 417611 416051 415413 415660 416282 416680 416550 415896 414762 413113 410948 408368 405477 402388
60790 402388 399337 396546 393884 390828 386991 382635 378496 375050 372048 368754 364581 359559 354369 349877
60776 349877 346514 344015 341848 339850 338273 337271 336678 336419 336766 337853 339235 340447 341806 344041 347028
60761 347028 349598 350945 351712 353124 355387 357560 358919 359839 361269 363738 367050 370595 373772 376346 378566
60746 378566 380862 383400 386111 389045 392293 395431 397425 397432 395622 392924 390007 386676 382256 376411 369560
60731 369560 362595 356245 350680 345603 340629 335561 330499 325813 321952 319119 317153 315766 314778 313967 312917
$$ packed form
60836D28363l360m102n109n794n746m988l949l069k291j261r2N59M22J33M04J121
60820C91241J729K085K359K423K091J763K085K888L242K735K012J748J683J077
60806D21161j84j427j939j560o38K47O22L98j30o54j134j649k165k580k891l089
60790D02388l051k791k662l056l837m356m139l446l002l294m173n022n190m492
60776C49877l363k499k167j998j577j002n93k59L47J087J382J212J359K235K987
60761C47028K570J347P67J412K263K173J359R20J430K469L312L545L177K574K220
60746C78566K296K538K711K934L248L138J994Pj810k698k917l331m420n845o851
60731C69560o965o350n565n077m974n068n062m686l861k833j966j387r88q11j050
$$ plain form
60716 312917 311301 309229 307066 304959 302890 301086 299943 299401 298883 298084 297470 297639 298453 299183 299380 299242
60700 299242 299109 298955 298489 297570 296372 295227 294443 294300 295124 297185 300347 303861 306750 308622 310064 312160
60684 312160 315551 319922 324330 328062 331253 334594 338400 342158 345187 347576 350068 353100 356386 359568
60670 359568 362757 366147 369445 372040 373551 373917 373197 371616 369662 367759 365817 363405 360334 356946 353834
60655 353834 351423 349729 348350 346850 345290 344217 343915 343891 343456 342649 342221 342785 344265 346061 347285 346899
60639 346899 344240 339691 334543 329953 326195 322965 320047 317488 315433 313999 313146 312460 311356 309671 307931
60624 307931 306782 306337 306253 306280 306447 306876 307674 308932 310555 312071 312866 312676 311790 310776 310136 310109 310659 311587
60606 311587 312727 313984 315173 316004 316367 316483 316581 316605 316453 316339 316539 316840 316719 316174 315997 316947 318933 321256
$$ packed form
60716C12917j616k072k163k107k069j804j143n42n18p99o14J69Q14P30J97j38
60700B99242j33j54m66r19j198j145p84j43Q24K061L162L514K889J872J442K096
60684C12160L391M371M408L732L191L341L806L758L029K389K492L032L286L182
60670C59568L189L390L298K595J511L66p20j581j954j903j942k412l071l388l112
60655C53834k411j694j379j500j560j073l02k4m35q07m28N64J480J796J224l86
60639C46899k659m549n148m590l758l230k918k559k055j434q53o86j104j685j740
60624C07931j149m45q4K7J67M29P98J258J623J516P95j90q86j014o40k7N50R28
60606C11587J140J257J189Q31L63J16R8K4j52j14K00L01j21n45j77R50J986K323
$$ plain form
60588 321256 323428 325380 326958 327657 327091 325567 324012 323265 323504 324348 325483 327028 329226 331934 334672
60573 334672 337208 339828 342967 346832 351559 357480 364855 373448 382705 392329 402370 412690 422661 431542
60559 431542 438916 444531 447928 448555 446342 442005 436698 431402 426669 422812 420116 418781 418787 420028 422539
60544 422539 426385 431308 436849 442977 450313 459419 470041 481386 492976 504772 516555 527671 537450
60531 537450 545412 550999 553664 553472 551178 547397 542160 535628 528745 522601 517432 512801 508558 505002
60517 505002 502182 499688 497230 494985 493268 492314 492422 493852 496455 499814 503870 509029 515549 523326 532533
60502 532533 543947 558321 575761 596115 619599 646608 677214 711319 748981 789976 833071
60491 833071 876298 917982 956906 991310 1018364 1035205 1040402 1034172 1017430 991109 956343 914846
$$ packed form
60588C21256K172J952J578O99n66j524j555p47K39Q44J135J545K198K708K738
60573C34672K536K620L139L865M727N921P375Q593R257R624J0041J0320R971Q881
60559D31542P374N615L397O27k213m337n307n296m733l857k696j335OJ241K511
60544D22539L846M923N541O128P336R106J0622J1345J1590J1796J1783J1116R779
60531E37450P962N587K665j92k294l781n237o532o883o144n169m631m243l556
60517E05002k820k494k458k245j717r54J08J430K603L359M056N159O520P777R207
60502E32533J1414J4374J7440K0354K3484K7009L0606L4105L7662M0995M3095
60491H33071M3227M1684L8924L4404K7054J6841N197o230j6742k6321l4766m1497
$$ plain form
60479 914846 868842 820797 773286 728664 688283 651952 618594 587698 559934 536197 516329
60468 516329 499163 483636 469396 456353 444236 432872 422500 413431 405575 398569 392225 386514
60456 386514 381312 376459 372074 368430 365504 362935 360510 358394 356779 355508 354246 352872 351534 350408
60442 350408 349542 348888 348326 347734 347172 346946 347271 347777 347595 346139 343755 341405 339756 338780 338214 338053 338392
60425 338392 339001 339420 339422 339163 338880 338653 338457 338240 337932 337560 337342 337461 337806 338184 338746 339819 341282 342557
60407 342557 343437 344444 345961 347335 347496 346379 345248 345389 346878 348773 350174 350941 351600 352918 355402
60392 355402 358851 362341 364902 366384 367560 369382 372196 375699 379353 382663 385284 387286 389312 392078
60378 392078 395546 398899 401478 403473 405423 407369 408913 409955 410933 412350 414354 416730 418994 420595
$$ packed form
60479I14846m6004m8045m7511m4622m0381l6331l3358l0896k7764k3737j9868
60468E16329j7166j5527j4240j3043j2117j1364j0372r069p856p006o344n711
60456C86514n202m853m385l644k926k569k425k116j615j271j262j374j338j126
60442C50408q66o54n62n92n62k26L25N06j82j456k384k350j649r76n66j61L39
60425C38392O09M19Kk59k83k27j96k17l08l72k18J19L45L78N62J073J463J275
60407C42557Q80J007J517J374J61j117j131J41J489J895J401P67O59J318K484
60392C55402L449L490K561J482J176J822K814L503L654L310K621K002K026K766
60378C92078L468L353K579J995J950J946J544J042R78J417K004K376K264J601
$$ plain form
60364 420595 421456 422245 423689 425667 427422 428644 429816 431486 433841 437135 441830 447915 454717 461836 469730
60349 469730 478839 488572 497796 506008 513389 519904 524975 528008 528742 527158 523476 518189 511743 504323
60335 504323 496343 488820 482668 477760 473295 468987 465173 461821 458310 454442 450937 448533 447068 445822
60321 445822 444251 442116 439448 436861 435436 435700 437008 438493 440416 443946 449652 456786 464233 471781
60307 471781 480272 490862 504354 520928 540069 560670 581480 601558 620202 636415 648664 655400
60295 655400 655821 650005 638520 622309 602947 582457 562490 543852 527004 512560 500836 491274
60283 491274 482967 475682 469808 465316 461433 457516 453651 450102 446624 442723 438297 433674 429197 425084
60269 425084 421555 418814 416872 415468 414115 412301 409932 407572 405919 404975 404067 402767 401388 400416 399881
$$ packed form
60364D20595Q61P89J444J978J755J222J172J670K355L294M695O085O802P119P894
60349D69730R109R733R224Q212P381O515N071L033P34j584l682n287o446p420
60335E04323p980p523o152m908m465m308l814l352l511l868l505k404j465j246
60321D45822j571k135k668k587j425K64J308J485J923L530N706P134P447P548
60307D71781Q491J0590J3492J6574J9141K0601K0810K0078J8644J6213J2249O736
60295F55400M21n816j1485j6211j9362k0490j9967j8638j6848j4444j1724r562
60283D91274q307p285n874m492l883l917l865l549l478l901m426m623m477m113
60269D25084l529k741j942j404j353j814k369k360j653r44r08j300j379r72n35
$$ plain form
60254 399881 399537 399264 398952 398307 397198 395984 395103 394503 393820 392965 392216 391855 391994 392594 393356 393792 393762 393799 394506
60235 394506 395742 396819 397453 398105 399363 401372 403912 406681 409426 412088 414947 418352 422238 426136 429732
60220 429732 433109 436405 439544 442456 445273 448107 450904 453770 457238 461907 467828 474410 480890 486732
60206 486732 491703 495851 499547 503409 507971 513287 518849 523989 528436 532440 536307 539925 542912 545171
60192 545171 547018 548681 549903 550236 549561 548107 546060 543414 540260 536937 533749 530672 527527 524311 521129
60177 521129 517866 514267 510445 507004 504385 502273 500028 497668 496013 495644 496013 495894 494637 492742 491243
60162 491243 490756 491149 491876 492435 492612 492500 492391 492552 492979 493404 493687 494172 495429 497511 499758 501589 503346
60145 503346 505928 509636 513828 517848 521848 526416 531702 537380 543307 549848 557506 566484 576497 586737
$$ packed form
60254C99881l44k73l12o45j109j214q81o00o83q55p49l61J39O00P62M36l0L7P07
60235C94506J236J077O34O52J258K009K540K769K745K662K859L405L886L898L596
60220D29732L377L296L139K912K817K834K797K866L468M669N921O582O480N842
60206D86732M971M148L696L862M562N316N562N140M447M004L867L618K987K259
60192E45171J847J663J222L33o75j454k047k646l154l323l188l077l145l216l182
60177E21129l263l599l822l441k619k112k245k360j655l69L69j19j257j895j499
60162D91243m87L93P27N59J77j12j09J61M27M25K83M85J257K082K247J831J757
60145E03346K582L708M192M020M000M568N286N678N927O541P658Q978J0013J0240
$$ plain form
60131 586737 596104 603859 610160 615673 620563 624092 625390 624451 622237 619910 618105 616816 615725 614603
60117 614603 613436 612237 610858 609193 607570 606642 606605 606612 605321 602164 597950 594077 591276 589212 587159 584803
60101 584803 582388 580341 578863 577761 576595 575124 573686 573001 573467 574816 576640 579070 582665 587707 593899
60086 593899 600748 607940 615233 622296 628874 634940 640545 645549 649642 652602 654472 655408 655267 653331 648742
60071 648742 641445 632538 623279 613839 603468 591920 580117 569162 559226 549779 540568 531823 523683
60058 523683 515929 508337 500974 494109 488022 482908 478773 475446 472806 470946 470008 470041 471153 473533 477068
60043 477068 481139 485145 489117 493480 498273 503030 507398 511509 515593 519555 523023 525612 527080 527414
60029 527414 526856 525618 523512 520113 515395 509967 504474 498921 492833 486050 479121 472813 467348 462301
$$ packed form
60131E86737R367P755O301N513M890L529J298r39k214k327j805j289j091j122
60117F14603j167j199j379j665j623r28l7Pj291l157m214l873k801k064k053k356
60101E84803k415k047j478j102j166j471j438o85M66J349J824K430L595N042O192
60086E93899O849P192P293P063O578O066N605N004M093K960J870R36j41j936m589
60071F48742p297q907r259r440j0371j1548j1803j0955r936r447r211q745q140
60058E23683p754p592p363o865o087n114m135l327k640j860r38L3J112K380L535
60043D77068M071M006L972M363M793M757M368M111M084L962L468K589J468L34
60029E27414n58j238k106l399m718n428n493n553o088o783o929o308n465n047
$$ plain form
60015 462301 457303 452638 448883 445991 443090 439418 435201 431322 428262 425669 422925 419849 416821 414421
60001 414421 412952 412170 411482 410619 410020 410405 411972 414199 416353 418024 419310 420705 422743 425499 428552
59986 428552 431645 435132 439366 443820 447396 449603 450868 451611 451653 450845 449656 448626 447585 445950 443578
59971 443578 440908 438438 436496 435400 435309 435896 436550 437069 437857 439384 441664 444343 447019 449412 451471 453474
59955 453474 455838 458575 461041 462390 462265 460973 459049 456818 454350 451688 449032 446700 444865 443262
59941 443262 441297 438610 435518 432673 430271 427937 425497 423537 422805 423284 424303 425445 426809 428312 429422
59926 429422 429963 430698 432598 435771 439591 443650 448050 452868 457977 463473 469746 476892 484474 492033 499496
59911 499496 506847 513747 519795 524967 529495 533465 536811 539579 541889 543648 544561 544542 543953 543312 542782 542006
$$ packed form
60015D62301m998m665l755k892k901l672m217l879l060k593k744l076l028k400
60001D14421j469p82o88q63n99L85J567K227K154J671J286J395K038K756L053
59986D28552L093L487M234M454L576K207J265P43M2q08j189j030j041j635k372
59971D43578k670k470j942j096r1N87O54N19P88J527K280K679K676K393K059K003
59955D53474K364K737K466J349j25j292j924k231k468k662k656k332j835j603
59941D43262j965k687l092k845k402k334k440j960p32M79J019J142J364J503J110
59926D29422N41P35J900L173L820M059M400M818N109N496O273P146P582P559P463
59911D99496P351O900O048N172M528L970L346K768K310J759R13j9n89o41n30p76
$$ plain form
59895 542006 540518 538298 535839 533650 531925 530777 530492 531227 532658 534413 536757 540268 544708 548864 551867
59880 551867 554204 556985 560640 564908 569751 575436 581627 587151 591036 593372 594780 595419 594968 593412 591288
59865 591288 589129 587024 584958 583261 582457 582673 583440 584057 584113 583693 583245 583221 583752 584679 586038 588421 592557
59848 592557 598453 605101 611123 615528 617873 618099 616506 613682 610170 606346 602814 600537 600046 600541 600308
59833 600308 598108 593887 588176 581423 574150 567259 561586 557154 553190 548907 544168 539419 535147 531421
59819 531421 527903 524260 520511 516940 513765 511072 508974 507581 506766 506145 505350 504213 502679 500723 498405
59804 498405 495866 493274 490862 488897 487357 485742 483514 480737 477973 475576 473401 471210 468958 466590
59790 466590 464029 461535 459661 458569 457735 456621 455357 454439 453977 453613 453014 452171 451320 450791 450829 451402 452289
$$ packed form
59895E42006j488k220k459k189j725j148k85P35J431J755K344L511M440M156L003
59880E51867K337K781L655M268M843N685O191N524L885K336J408O39m51j556k124
59865E91288k159k105k066j697q04K16P67O17N6m20m48k4N31R27J359K383M136
59848E92557N896O648O022M405K345K26j593k824l512l824l532k277m91M95k33
59833F00308k200m221n711o753p273o891n673m432l964m283m739m749m272l726
59819E31421l518l643l749l571l175k693k098j393q15o21p95j137j534j956k318
59804D98405k539k592k412j965j540j615k228k777k764k397k175k191k252k368
59790D66590k561k494j874j092q34j114j264r18m62l64n99q43q51n29L8N73Q87
$$ plain form
59773 452289 453469 455141 457172 458880 459753 460238 461402 463843 467209 470709 473786 476325 478555 480905 483778
59758 483778 487291 491198 495090 498811 502802 507864 514260 521144 527288 532401 537223 542255 547112 551492
59744 551492 556048 561548 567639 573324 578478 583974 590158 595995 600083 602033 602526 602349 601705 600304 597873
59729 597873 594650 591435 589002 587457 586354 585379 584634 584183 583682 582687 581142 579343 577487 575378 572587
59714 572587 568897 564610 560371 556696 553775 551757 550972 551623 553422 555732 557938 559567 560350 560509 560721
59699 560721 561379 562115 562490 562942 564365 566747 568954 570086 570425 570704 570981 570746 569813 568574 567509 566854 566684
59682 566684 566920 567250 567368 567344 567503 567747 567317 565488 562403 558849 555169 550829 545439 539851 535485 532572
59666 532572 529840 526324 522786 520608 519807 519046 517405 515240 513282 511804 510891 510688 510943 510960 510510 510289
$$ packed form
59773D52289J180J672K031J708Q73M85J164K441L366L500L077K539K230K350K873
59758D83778L513L907L892L721L991N062O396O884O144N113M822N032M857M380
59744E51492M556N500O091N685N154N496O184N837M088J950M93j77o44j401k431
59729E97873l223l215k433j545j103r75p45m51n01r95j545j799j856k109k791
59714E72587l690m287m239l675k921k018p85O51J799K310K206J629P83J59K12
59699E60721O58P36L75M52J423K382K207J132L39K79K77k35r33j239j065o55j70
59682E66684K36L30J18k4J59K44m30j829l085l554l680m340n390n588m366k913
59666E32572k732l516l538k178q01p61j641k165j958j478r13k03K55J7m50k21
$$ plain form
59650 510289 511018 512524 514189 515885 517879 520042 521716 522289 521542 519572 516748 513604 510428 507066 503462
59635 503462 500120 497632 495956 494699 493977 494370 495928 497714 498625 498295 497047 495207 492769 489618 485850
59620 485850 481862 478110 474760 471642 468601 465737 463183 460776 458257 455686 453397 451620 450436 450028
59606 450028 450611 452125 454271 456880 459864 462803 465024 466272 466907 467263 467232 466854 466864 468110 470525 473187
59590 473187 475366 477103 478669 479967 480691 480801 480533 480082 479473 478683 477643 476120 473781 470460 466417 462390
59574 462390 459297 457595 456712 455308 452435 448480 444796 442365 440996 439847 438399 436744 435185 433897
59560 433897 433003 432654 432945 433834 435226 437006 438960 440808 442447 444124 446191 448694 451359 454066 457194
59545 457194 461312 466555 472539 478934 485911 493905 503247 514316 527891 544796 564916 586586 606903
$$ packed form
59650E10289P29J506J665J696J994K163J674N73p47j970k824l144l176l362l604
59635E03462l342k488j676j257p22L93J558J786R11l30j248j840k438l151l768
59620D85850l988l752l350l118l041k864k554k407k519k571k289j777j184m08
59606D50028N83J514K146K609K984K939K221J248O35L56l1l78J0J246K415K662
59590D73187K179J737J566J298P24J10k68m51o09p90j040j523k339l321m043m027
59574D62390l093j702q83j404k873l955l684k431j369j149j448j655j559j288
59560D33897q94l49K91Q89J392J780J954J848J639J677K067K503K665K707L128
59545D57194M118N243N984O395O977P994R342J1069J3575J6905K0120K1670K0317
$$ plain form
59532 606903 622496 630503 629869 622385 612063 602696 595788 590847 587275 585394 585761 588269 592213 596808
59518 596808 601336 605088 607615 608908 609029 607574 603837 597599 589547 580693 571526 561900 551689 541236
59504 541236 531000 521120 511659 503118 496198 490999 486913 483455 480670 478554 476594 474433 472506 471418
59490 471418 470989 470597 470283 470735 472224 474306 476696 479614 482993 486051 488138 489523 490937 492741 494936
59475 494936 497529 500429 503353 506357 510066 514757 519483 522798 524306 524891 525425 525944 526201 526347 526679 527157
59459 527157 527672 528576 530535 533933 538743 544894 552360 560780 569410 577780 586227 595345 604914 613822 621171
59444 621171 627081 631985 635480 636421 634084 628743 621132 612010 602409 593590 586209 579881 574012 568701
59430 568701 564280 560271 555651 550252 545308 542315 541741 543110 546029 550675 557411 566306 577210 590082
$$ packed form
59532F06903J5593Q007o34p484j0322r367o908m941l572j881L67K508L944M595
59518E96808M528L752K527J293J21j455l737o238q052q854r167r626j0211j0453
59504E41236j0236r880r461q541o920n199m086l458k785k116j960k161j927j088
59490D71418m29l92l14M52J489K082K390K918L379L058K087J385J414J804K195
59475D94936K593K900K924L004L709M691M726L315J508N85N34N19K57J46L32M78
59459E27157N15R04J959L398M810O151P466Q420Q630Q370Q447R118R569Q908P349
59444F21171N910M904L495R41k337n341p611r122r601q819p381o328n869n311
59430E68701m421m009m620n399m944k993n74J369K919M646O736Q895J0904J2872
$$ plain form
59416 590082 605058 622250 641609 663001 686256 711032 736562 761397 783095 798298 803850 798745
59404 798745 785190 767457 749572 734120 722724 716657 716567 721851 730389 738524 741581 735680 720075
59391 720075 697615 672562 648142 626059 607213 591822 579190 568344 558941 551109 544656 539184
59379 539184 534808 532005 530683 530077 529655 529573 530192 531679 534093 537225 540316 542633 544531 547320 551789
59364 551789 557372 562961 568001 572580 577030 581845 587511 594032 600943 608023 615588 623851 632574 641705
59350 641705 651784 663175 675397 687757 700317 713664 727996 742965 758107 772863 786429
59339 786429 798286 808731 818248 826347 831661 833240 831227 826206 818500 808306 796003 782033 766769
59326 766769 750710 734510 718650 703358 689009 676285 665662 656927 649389 642457 635932 629957
$$ packed form
59416E90082J4976J7192J9359K1392K3255K4776K5530K4835K1698J5203N552n105
59404G98745j3555j7733j7885j5452j1396o067r0N284Q538Q135L057n901j5605
59391G20075k2460k5053k4420k2083j8846j5391j2632j0846r403p832o453n472
59379E39184m376k803j322o06m22q2O19J487K414L132L091K317J898K789M469
59364E51789N583N589N040M579M450M815N666O521O911P080P565Q263Q723R131
59350F41705J0079J1391J2222J2360J2560J3347J4332J4969J5142J4756J3566
59339G86429J1857J0445R517Q099N314J579k013n021p706j0194j2303j3970j5264
59326G66769j6059j6200j5860j5292j4349j2724j0623q735p538o932o525n975
$$ plain form
59314 629957 624863 620958 618322 616837 616409 616996 618431 620508 623394 627723 634115 642691 653198 665451
59300 665451 679421 694740 710028 722672 729568 728723 720470 707065 690998 673808 656386 639713
59288 639713 624726 611644 600008 589537 580609 573737 568796 565036 561820 559156 557473 557017 557681 559475
59274 559475 562905 568604 576553 585904 595701 605632 615966 626904 638113 648870 658531 666936 674377
59261 674377 680985 686103 688483 687353 683180 677202 670350 662844 654663 646030 637442 629497 622710 617231
59247 617231 612692 608548 604607 601035 597976 595548 594254 594843 597476 601345 605478 609625 613980 618334
59233 618334 622076 625028 627752 630802 634042 636928 639178 640839 641804 641582 639652 635933 630854 625076 619217
59218 619217 613753 608976 604894 601213 597600 594010 590637 587520 584402 581077 577668 574374 571147 567938
$$ packed form
59314F29957n094l905k636j485m28N87J435K077K886M329O392Q576J0507J2253
59300F65451J3970J5319J5288J2644O896q45q253j3405j6067j7190j7422j6673
59288F39713j4987j3082j1636j0471q928o872m941l760l216k664j683m56O64J794
59274E59475L430N699P949R351R797R931J0334J0938J1209J0757R661Q405P441
59261F74377O608N118K380j130m173n978o852p506q181q633q588p945o787n479
59247F17231m539m144l941l572l059k428j294N89K633L869M133M147M355M354
59233F18334L742K952K724L050L240K886K250J661R65k22j930l719n079n778n859
59218F19217n464m777m082l681l613l590l373l117l118l325l409l294l227l209
$$ plain form
59204 567938 565106 563172 562144 561476 560784 560195 559832 559376 558487 557376 556537 556095 555833 555760 556146 556881 557288 556854
59186 556854 555887 555131 554900 554948 555117 555696 557005 558895 560919 562853 564855 567203 570058 573476 577416 581728
59170 581728 586286 591197 596671 602686 609008 615670 623169 631916 641657 651631 661111 669517 676162 680439
59156 680439 682374 682665 682016 680581 678088 674236 668902 662286 654999 647712 640510 632842 624353 615492 606968
59141 606968 598863 590699 582352 574451 567751 562376 557853 553657 549525 545354 541138 537132 533977 532362
59127 532362 532418 533526 534913 536431 538564 541704 545677 550098 554880 560203 566142 572647 579851 588134 597750
59112 597750 608436 619450 630040 640031 649915 660249 670919 681261 690917 700259 709769 719320 728303
59099 728303 736252 743000 748427 752436 755082 756414 756284 754676 752174 749717 747831 746385 745061 743664
$$ packed form
59204E67938k832j934j028o68o92n89l63m56q89j111q39m42k62p3L86P35M07m34
59186E56854r67p56k31M8J69N79J309J890K024J934K002K348K855L418L940M312
59170E81728M558M911N474O015O322O662P499Q747R741R974R480Q406O645M277
59156F80439J935K91o49j435k493l852n334o616p287p287p202p668q489q861q524
59141F06968q105q164q347p901o700n375m523m196m132m171m216m006l155j615
59127E32362N6J108J387J518K133L140L973M421M782N323N939O505P204Q283R616
59112E97750J0686J1014J0590R991R884J0334J0670J0342R656R342R510R551Q983
59099G28303P949O748N427M009K646J332j30j608k502k457j886j446j324j397
$$ plain form
59085 743664 741894 739213 735231 730046 723998 717228 709543 700639 690406 679175 667707 656788 646786
59072 646786 637663 629356 621894 615218 609193 603825 599117 594668 589779 584216 578633 573980 570648 568296
59058 568296 566283 564081 561519 558950 557010 555937 555133 553661 551151 548099 545314 543257 541826 540608
59044 540608 539343 538246 537795 538080 538556 538679 538633 539083 540313 542045 544147 546963 550687 554877 559138 564005
59028 564005 570532 578952 588314 597682 607283 618158 631062 646121 663267 682343 702674 723071
59016 723071 742503 760487 776610 789969 799408 804235 804568 801186 795264 788074 780584 773300 766520
59003 766520 760615 755907 752509 750506 750129 751466 754140 757563 761379 765268 768432 769788 768918 766474 763428
58988 763428 760127 756238 751325 745150 737572 728585 718578 708356 698629 689568 681049 673342 667268 663431
$$ packed form
59085G43664j770k681l982n185o048o770p685q904j0233j1231j1468j0919j0002
59072F46786r123q307p462o676o025n368m708m449m889n563n583m653l332k352
59058E68296k013k202k562k569j940j073q04j472k510l052k785k057j431j218
59044E40608j265j097m51K85M76J23m6M50J230J732K102K816L724M190M261M867
59028E64005O527Q420R362R368R601J0875J2904J5059J7146J9076K0331K0397
59016G23071J9432J7984J6123J3359R439M827L33l382n922p190p490p284o780
59003G66520n905m708l398k003l77J337K674L423L816L889L164J356q70k444l046
58988G63428l301l889m913o175p578q987j0007j0222r727r061q519p707o074l837
$$ plain form
58974 663431 661451 660314 659517 659490 660799 663341 666583 670243 674362 678981 684224 690512 698211 707025 716169
58959 716169 725105 733678 741522 747805 751792 753348 752748 750207 745703 739091 730331 719799 708333 696704
58945 696704 685116 673527 662332 652248 643506 635703 628595 622528 617837 614318 611538 609295 607421
58932 607421 605542 603429 601304 599476 597943 596619 595585 594779 593761 592284 590704 589311 587514 584429
58918 584429 580264 576429 574008 572601 570931 568280 565116 562551 561484 562123 564082 566797 569887 573205
58904 573205 576816 581131 586883 594601 604098 614720 626078 638212 650908 663230 674096 683281 691613
58891 691613 700269 710061 721435 734807 750590 768866 789212 810879 833016 854659 874754 892443
58879 892443 907283 919049 927437 932194 933451 931608 926851 919057 908206 894681 879167 862601 846217
$$ packed form
58974F63431j980j137p97k7J309K542L242L660M119M619N243O288P699Q814R144
58959G16169Q936Q573P844O283L987J556o00k541m504o612q760j0532j1466j1629
58945F96704j1588j1589j1195j0084q742p803p108o067m691l519k780k243j874
58932F07421j879k113k125j828j533j324j034q06j018j477j580j393j797l085
58918E84429m165l835k421j407j670k651l164k565j067O39J959K715L090L318
58904E73205L611M315N752P718R497J0622J1358J2134J2696J2322J0866R185Q332
58891F91613Q656R792J1374J3372J5783J8276K0346K1667K2137K1643K0095J7689
58879H92443J4840J1766Q388M757J257j843m757p794j0851j3525j5514j6566j6384
$$ plain form
58866 846217 831146 817756 805741 795026 786070 778914 772470 765437 757634 749738 741877 733320 723680
58853 723680 713562 703586 693442 682570 671429 661375 653319 647119 642343 638933 636722 634825 632113
58840 632113 628149 623163 617194 609905 601401 592614 584435 576860 569449 562284 555876 550313 545212 540544
58826 540544 536814 534191 532037 529701 527408 525953 525763 526562 527753 528827 529543 530006 530510 531162 531811 532416
58810 532416 533237 534453 535853 537097 538082 538871 539555 540386 541696 543372 544744 545393 545791 546670 547952 548802
58794 548802 548616 547461 545687 543677 542058 541552 542317 543724 545003 545976 547103 549042 552225 556597 561595
58779 561595 566541 571180 575803 580874 586608 592795 598807 603837 607354 609328 609841 608617 605316 600308
58765 600308 594747 589663 585129 580493 575310 569927 565219 561896 560048 559311 559364 560162 561736 563987 566725
$$ packed form
58866H46217j5071j3390j2015j0715q956p156o444p033p803p896p861q557r640
58853G23680j0118r976j0144j0872j1141j0054q056o200m776l410k211j897k712
58840F32113l964m986n969p289q504q787q179p575p411p165o408n563n101m668
58826E40544l730k623k154k336k293j455j90P99J191J074P16M63N04O52O49O05
58810E32416Q21J216J400J244R85P89O84Q31J310J676J372O49L98Q79J282Q50
58794E48802j86j155j774k010j619n06P65J407J279R73J127J939L183M372M998
58779E61595M946M639M623N071N734O187O012N030L517J974N13j224l301n008
58765F00308n561n084m534m636n183n383m708l323j848p37N3P98J574K251K738
$$ plain form
58750 566725 569757 572785 575539 578197 581390 585396 589505 592662 594774 596989 600601 605901 612177 618558
58736 618558 624784 631352 638985 647860 657349 666723 676056 686196 697804 710638 723789 736294 747451
58723 747451 756874 764517 770582 775267 778734 781442 784343 788477 794281 801360 808963 816629 824310 831945
58709 831945 839109 845130 849480 851844 851961 849628 844887 837893 828508 816326 801258 783871 764945
58696 764945 744910 723923 702326 680780 660097 641033 624008 608780 594625 581157 568837
58685 568837 558419 550037 543031 536511 529846 522866 516019 510247 506335 504308 503577 503540 503861 504405 505299
58670 505299 506931 509629 513407 518204 524144 531258 539250 547899 557458 568182 579589 590673 600680
58657 600680 609220 615775 619710 620842 619553 616344 611688 606253 600741 595424 590261 585454 581377 577927
$$ packed form
58750E66725L032L028K754K658L193M006M109L157K112K215L612N300O276O381
58736F18558O226O568P633Q875R489R374R333J0140J1608J2834J3151J2505J1157
58723G47451R423P643O065M685L467K708K901M134N804P079P603P666P681P635
58709H31945P164O021M350K364J17k333m741o994r385j2182j5068j7387j8926
58696G64945k0035k0987k1597k1546k0683j9064j7025j5228j4155j3468j2320
58685E68837j0418q382p006o520o665o980o847n772l912k027p31l7L21N44Q94
58670E05299J632K698L778M797N940P114P992Q649R559J0724J1407J1084J0007
58657F00680Q540O555L935J132j289l209m656n435n512n317n163m807m077l450
$$ plain form
58643 577927 574540 571003 567723 564993 562466 559721 556941 554679 553207 552449 552389 553178 554791 556775 558455
58628 558455 559460 560007 560526 561000 560980 560405 559997 560501 561870 563654 565889 568968 572821 576899 580992 585497
58612 585497 590789 596843 603529 610722 617943 624347 629240 632352 633670 633452 632315 630770 628692 625760
58598 625760 622332 619213 616555 613805 610829 608219 606234 604298 602068 600269 599909 601217 603959 608264
58584 608264 614476 622389 631180 640011 648434 656522 664904 674311 684695 695056 704479 713038 721416 730055
58570 730055 739143 749128 760682 774238 789902 807689 827537 849261 872815 898521 926752 957402
58558 957402 989700 1022356 1053834 1082821 1108670 1131179 1149865 1163799 1172410 1176161 1176185 1173461 1168412
58545 1168412 1160940 1150666 1137428 1121712 1104352 1085757 1065842 1044709 1022769 1000001 975828
$$ packed form
58643E77927l387l537l280k730k527k745k780k262j472p58o0P89J613J984J680
58628E58455J005N47N19M74k0n75m08N04J369J784K235L079L853M078M093M505
58612E85497N292O054O686P193P221O404M893L112J318k18j137j545k078k932
58598F25760l428l119k658k750k976k610j985j936k230j799l60J308K742M305
58584F08264O212P913Q791Q831Q423Q088Q382R407J0384J0361R423Q559Q378Q639
58570G30055R088R985J1554J3556J5664J7787J9848K1724K3554K5706K8231L0650
58558I57402L2298L2656L1478K8987K5849K2509J8686J3934Q611L751K4k724n049
58545A168412p472j0274j3238j5716j7360j8595j9915k1133k1940k2768k4173
$$ plain form
58534 975828 950191 924201 899205 875671 853585 833562 816796 803941 794497 787305 781373 776350
58522 776350 772534 770359 769688 769710 769646 769285 768734 768022 767208 766480 765834 764918 763500 761797 760073 758222 756028
58505 756028 753485 750601 747227 743425 739709 736586 734067 731910 730003 728286 726575 724800 723135 721740
58491 721740 720674 720205 720804 722643 725508 729313 734119 739573 745099 751015 758619 768707 780777 794297
58477 794297 809848 828084 848151 868167 886862 903802 918292 929102 935287 936569 933047 925258
58465 925258 914448 901988 888526 874340 860434 848431 839268 832630 827860 824891 824158 826100 830915
58452 830915 838404 847825 858114 868307 877603 885221 890583 893602 894487 893273 889848 884423 877747 870870
58438 870870 864804 860254 857546 856958 859134 864831 874194 886715 902067 920542 942591 968544 999011
$$ packed form
58534I75828k5637k5990k4996k3534k2086k0023j6766j2855r444p192n932n023
58522G76350l816k175o71K2o4l61n51p12q14p28o46r16j418j703j724j851k194
58505G56028k543k884l374l802l716l123k519k157j907j717j711j775j665j395
58491G21740j066m69N99J839K865L805M806N454N526N916P604J0088J2070J3520
58477G94297J5551J8236K0067K0016J8695J6940J4490J0810O185J282l522p789
58465I25258j0810j2460j3462j4186j3906j2003r163o638m770k969p33J942M815
58452H30915P489R421J0289J0193R296P618N362L019Q85j214l425n425o676o877
58438H70870o066m550k708n88K176N697R363J2521J5352J8475K2049K5953L0467
$$ plain form
58425 999011 1034757 1075499 1118990 1161325 1197552 1222174 1230819 1222918 1202427 1175138 1145357 1115225
58413 1115225 1085869 1057881 1031247 1006059 983153 963257 945913 930160 915834 903207 891795
58402 891795 880677 869847 860197 852285 846050 841532 838797 837292 836317 836135 837578 840544 843879 846782
58388 846782 849322 851469 852675 852812 852697 853292 854934 857591 861222 865542 869854 873421 875943 877767 879841
58373 879841 883176 888006 893811 900419 908489 918381 929232 939918 950346 961040 972059 983319 995426
58360 995426 1009123 1024279 1040345 1057232 1074592 1090821 1104161 1114422 1122355 1127756 1129768 1128827
58348 1128827 1126723 1124618 1122470 1120472 1119568 1120304 1122424 1125868 1130988 1137658 1145338 1154160 1164800 1177218
58334 1177218 1190685 1205050 1220671 1237131 1253435 1269502 1286008 1302654 1318108 1331821 1344309
$$ packed form
58425I99011L5746M0742M3491M2335L6227K4622Q645p901k0491k7289k9781l0132
58413A115225k9356k7988k6634k5188k2906j9896j7344j5753j4326j2627j1412
58402H91795j1118j0830r650p912o235m518k735j505r75j82J443K966L335K903
58388H46782K540K147J206J37j15N95J642K657L631M320M312L567K522J824K074
58373H79841L335M830N805O608Q070R892J0851J0686J0428J0694J1019J1260J2107
58360I95426J3697J5156J6066J6887J7360J6229J3340J0261P933N401K012r41
58348A128827k104k105k148j998r04P36K120L444N120O670P680Q822J0640J2418
58334A177218J3467J4365J5621J6460J6304J6067J6506J6646J5454J3713J2488
$$ plain form
58323 1344309 1355407 1363994 1369906 1374487 1378605 1381752 1383796 1386064 1389763 1394603 1399907 1405952 1413395 1422373
58309 1422373 1432905 1445231 1459154 1473937 1489343 1505787 1523144 1540611 1558143 1576730 1596677
58298 1596677 1616847 1636230 1655119 1674100 1692974 1711353 1729397 1747517 1766227 1786466 1808921
58287 1808921 1832878 1856980 1881218 1906770 1933876 1961652 1990196 2020873 2054008 2088262 2123000
58276 2123000 2159281 2197744 2237429 2277679 2319314 2362945 2407956 2454298 2503354 2555754 2610056
58265 2610056 2665020 2721682 2781862 2846015 2913719 2984792 3058678 3134109 3210474 3288206 3366966
58254 3366966 3445141 3522097 3599141 3677214 3755537 3833742 3913415 3996259 4082622 4173146 4269848
58243 4269848 4374102 4485422 4603614 4730105 4865690 5009124 5159578 5318466 5487344
$$ packed form
58323A344309J1098Q587N912M581M118L147K044K268L699M840N304O045P443Q978
58309A422373J0532J2326J3923J4783J5406J6444J7357J7467J7532J8587J9947
58298A596677K0170J9383J8889J8981J8874J8379J8044J8120J8710K0239K2455
58287A808921K3957K4102K4238K5552K7106K7776K8544L0677L3135L4254L4738
58276B123000L6281L8463L9685M0250M1635M3631M5011M6342M9056N2400N4302
58265B610056N4964N6662O0180O4153O7704P1073P3886P5431P6365P7732P8760
58254C366966P8175P6956P7044P8073P8323P8205P9673Q2844Q6363R0524R6702
58243D269848J04254J11320J18192J26491J35585J43434J50454J58888J68878
$$ plain form
58234 5487344 5666267 5855930 6058985 6277193 6509557 6755371 7016951 7297318 7597429
58225 7597429 7917861 8261081 8629969 9026323 9452964 9915059 10417461 10963247 11556758
58216 11556758 12205214 12915424 13692421 14543972 15483297 16525151 17683354 18975393 20425814
58207 20425814 22062486 23914584 26018837 28424703 31191816 34390133 38109411 42464745
58199 42464745 47588835 53625503 60736937 69111398 78959991 90520247 104080990 120003712
58191 120003712 138709962 160645078 186236022 215804523 249361082 286258117 324784550
58184 324784550 361893646 393349961 414540493 421854165 414019514 392602009 361333021
58177 361333021 324720874 286763724 250285911 216883344 187195396 161263499 138844231
$$ packed form
58234E487344J78923J89663K03055K18208K32364K45814K61580K80367L00111
58225G597429L20432L43220L68888L96354M26641M62095N02402N45786N93511
58216A1556758O48456P10210P76997Q51551R39325J041854J158203J292039J450421
58207B0425814J636672J852098K104253K405866K767113L198317L719278M355334
58199D2464745N124090O036668P111434Q374461R848593J1560256J3560743J5922722
58191A20003712J8706250K1935116K5590944K9568501L3556559L6897035L8526433
58184C24784550L7109096L1456315K1190532P313672p834651k1417505l1268988
58177C61333021l6612147l7957150l6477813l3402567k9687948k5931897k2419268
$$ plain form
58170 138844231 119605597 103201371 89284838 77520528 67598529 59236432 52177663
58163 52177663 46198946 41116342 36777762 33052744 29832356 27031186 24580864 22422781
58155 22422781 20509360 18806326 17287107 15926610 14703062 13601425 12610144 11716776
58147 11716776 10909860 10181724 9525630 8932542 8393755 7903973 7458610 7050478 6672192
58138 6672192 6319589 5990028 5679757 5385932 5109066 4850458 4608956 4382742 4172268
58129 4172268 3978480 3799724 3633113 3477637 3333544 3199935 3075211 2958670 2849671
58120 2849671 2746435 2647608 2553785 2465818 2383010 2304546 2230968 2162396 2096976 2033131 1971852
58109 1971852 1914658 1860716 1808119 1756742 1707638 1660665 1614862 1570318 1527692 1486641 1446511
$$ packed form
58170A38844231j9238634j6404226j3916533j1764310r921999q362097p058769
58163E2177663n978717n082604m338580l725018l220388k801170k450322k158083
58155B2422781j913421j703034j519219j360497j223548j101637r91281q93368
58147A1716776q06916p28136o56094n93088n38787m89782m45363m08132l78286
58138F672192l52603l29561l10271k93825k76866k58608k41502k26214k10474
58129D172268j93788j78756j66611j55476j44093j33609j24724j16541j08999
58120B849671j03236r8827r3823q7967q2808p8464p3578o8572o5420o3845o1279
58109A971852n7194n3942n2597n1377m9104m6973m5803m4544m2626m1051m0130
$$ plain form
58098 1446511 1407759 1371062 1335942 1301971 1270311 1242195 1216676 1191724 1166879 1143194 1121248
58087 1121248 1100924 1082512 1066342 1051790 1038041 1025206 1013297 1000934 986666 970880 954801
58076 954801 938264 920239 900979 881833 863175 844239 824904 806110 788447 771678 755682
58065 755682 740749 726964 714255 702954 693476 685663 679158 673938 669617 664769 657957 649054 638742
58052 638742 627309 614883 602257 590417 579658 569918 561371 553834 546388 538578 531175 524771 518545
58039 518545 511661 504874 499226 494000 487657 480311 473532 467950 462645 456796 450421 443515 435824 427584
58025 427584 419377 411258 402925 394544 386446 378395 370240 362855 357205 352892 348872 345221 342756 341259
58011 341259 339611 337604 336114 335487 335211 335270 336382 338596 340918 342576 343583 343949 343472 342448 341435 340194
$$ packed form
58098A446511l8752l6697l5120l3971l1660k8116k5519k4952k4845k3685k1946
58087A121248k0324j8412j6170j4552j3749j2835j1909j2363j4268j5786j6079
58076I54801j6537j8025j9260j9146j8658j8936j9335j8794j7663j6769j5996
58065G55682j4933j3785j2709j1301r478p813o505n220m321m848o812q903j0312
58052F38742j1433j2426j2626j1840j0759r740q547p537p446p810p403o404o226
58039E18545o884o787n648n226o343p346o779n582n305n849o375o906p691q240
58025D27584q207q119q333q381q098q051q155p385n650m313m020l651k465j497
58011C41259j648k007j490o27k76N9J112K214K322J658J007L66m77j024j013j241
$$ plain form
57995 340194 338063 335477 333864 333801 334498 335397 337036 339867 343405 347128 351260 356008 360725 364335 366054
57980 366054 365537 362985 359270 355174 350380 344024 336364 328910 322696 317356 312204 307324 303153 299803
57966 299803 297264 295580 294483 293478 292571 292234 292457 292622 292593 293127 294812 297217 299430 300825 301038 299851
57950 299851 297471 294421 290982 287280 283953 281910 281252 281258 281641 282958 285521 288852 292739 297955 305232
57935 305232 314174 323821 333798 344254 355076 365737 375723 384684 392343 398476 402791 404762 403993 400816
57921 400816 396070 390217 383190 375153 366774 358601 350827 343829 338242 334192 331140 328764 327358 327039
57907 327039 327270 327587 328161 329158 330044 330005 328630 325812 321499 315949 309803 303510 297075 290710 285239 281463
57891 281463 279484 278954 279535 280796 282202 283619 285443 287839 290255 292037 293063 293469 293214 292368 291372 290537
$$ packed form
57995C40194k131k586j613o3O97Q99J639K831L538L723M132M748M717L610J719
57980C66054n17k552l715m096m794o356p660p454o214n340n152m880m171l350
57966B99803k539j684j097j005r07l37K23J65k9N34J685K405K213J395K13j187
57950B99851k380l050l439l702l327k043o58OL83J317K563L331L887N216P277
57935C05232Q942R647R977J0456J0822J0661R986Q961P659O133M315J971p69l177
57921D00816m746n853p027q037q379q173p774o998n587m050l052k376j406l19
57907C27039K31L17N74R97Q86l9j375k818m313n550o146o293o435o365n471l776
57891B81463j979n30N81J261J406J417J824K396K416J782J026M06k55q46r96q35
$$ plain form
57875 290537 289611 288184 286163 283573 280401 277070 274574 273574 273643 273922 274219 274975 276454 278509 281076 284341
57859 284341 288386 292908 297269 300779 303219 305213 307758 311161 314711 317508 319226 319928 319715 318880 317894
57844 317894 316748 314750 311455 307392 303321 299147 294217 288482 282692 277416 272495 267584 262795 258511
57830 258511 254816 251394 248044 245187 243623 243678 244786 246203 247928 250451 253745 257108 260117 263079 266305
57815 266305 269455 271882 273130 272792 270478 266321 261096 255379 249033 241947 234890 228969 224506 220954
57801 220954 217848 215338 213768 213076 212683 211957 210910 210367 211174 213195 215529 217712 220122 223037 225982
57786 225982 228471 230834 233693 237065 240501 243860 247415 251461 256237 261987 268576 275232 281062 285716
57772 285716 289328 292131 294435 296586 298430 299137 298048 295446 292084 288217 283605 278262 272621 267075
$$ packed form
57875B90537r26j427k021k590l172l331k496j000O9K79K97P56J479K055K567L265
57859B84341M045M522M361L510K440J994K545L403L550K797J718P02k13q35r86
57844C17894j146j998l295m063m071m174m930n735n790n276m921m911m789m284
57830B58511l695l422l350k857j564N5J108J417J725K523L294L363L009K962L226
57815B66305L150K427J248l38k314m157n225n717o346p086p057n921m463l552
57801B20954l106k510j570o92l93p26j047n43Q07K021K334K183K410K915K945
57786B25982K489K363K859L372L436L359L555M046M776N750O589O656N830M654
57772B85716L612K803K304K151J844P07j089k602l362l867m612n343n641n546
$$ plain form
57758 267075 261800 256864 252095 247015 241392 235765 230933 227058 223763 221087 219807 220576 223012 225821
57744 225821 227793 228762 229701 231756 235088 238779 241868 244134 245832 247153 248212 249186 250125 250910 251550 252163
57728 252163 252543 252259 251437 250823 250735 250539 249612 248202 246780 245199 243144 240816 238472 235837 232794 230115
57712 230115 228500 227325 225387 222619 220004 217882 215519 212419 208959 205495 201780 197717 193914 191076
57698 191076 189372 188641 188684 189085 189310 189274 189365 189679 189672 188794 187073 184863 182384 179707 176933 174257 172105 171112
57680 171112 171606 173242 175582 178964 184198 191527 200575 211380 224779 241625 262265 287035 316629
57667 316629 351567 391663 435983 482545 527556 565433 590319 597976 586939 559060 519439 474884
57655 474884 431115 390916 354720 322413 294213 270274 250246 233459 219398 207945 199165 192733
$$ packed form
57758B67075n275m936m769n080n623n627m832l875l295k676j280P69K436K809
57744B25821J972R69R39K055L332L691L089K266J698J321J059R74R39P85O40O13
57728B52163L80k84q22o14q8j96r27j410j422j581k055k328k344k635l043k679
57712B30115j615j175j938k768k615k122k363l100l460l464l715m063l803k838
57698A91076j704p31M3M01K25l6R1L14pq78j721k210k479k677k774k676k152r93
57680A71112M94J636K340L382N234P329R048J0805J3399J6846K0640K4770K9594
57667C16629L4938M0096M4320M6562M5011L7877K4886P657j1037k7879l9621m4555
57655D74884m3769m0199l6196l2307k8200k3939k0028j6787j4061j1453q780o432
$$ plain form
57643 192733 187647 182787 177820 173314 169961 167939 166988 166664 166439 165942 165277 164805 164599 164402 164144 163992 163796
57626 163796 163004 161333 159120 156814 154532 152341 150520 149151 147806 145999 143836 141922 140785 140548 140934
57611 140934 141410 141416 140615 138945 136575 134054 132298 131933 132644 133492 133876 133803 133397 132775 132358 132591 133166 133195 132339
57592 132339 131100 129832 128264 126360 124748 123686 122330 119839 116677 113967 111977 110123 108238 106861
57578 106861 106176 105532 104376 103082 102438 102535 102475 101181 98398 94918 91815 89513 87768 86444 85824 85985
57562 85985 86329 86171 85524 84967 84886 85226 85787 86394 86881 87236 87648 88163 88449 88252 87957 88304 89622 91553 93390
57543 93390 94388 93954 92091 89787 88535 89119 90900 92439 92843 92474 92332 92810 93352 93452 93564 94484 96012
57526 96012 97013 96898 96286 95879 95457 94564 93580 93386 94272 95755 97191 98043 97952 97213 96899 97862 99777 101827
$$ packed form
57643A92733n086m860m967m506l353k022r51l24k25m97o65m72k06j97k58j52j96
57626A63796p92j671k213k306k282k191j821j369j345j807k163j914j137k37L86
57611A40934M76Oq01j670k370k521j756l65P11Q48L84p3m06o22m17K33N75K9q56
57592A32339j239j268j568j904j612j062j356k491l162k710j990j854j885j377
57578A06861o85o44j156j294o44R7o0j294k783l480l103k302j745j324o20J61
57562H5985L44j58o47n57q1L40N61O07M87L55M12N15K86j97k95L47J318J931J837
57543I3390R98m34j863k304j252N84J781J539M04l69j42M78N42J00J12R20J528
57526I6012J001j15o12m07m22q93r84j94Q86J483J436Q52r1p39l14R63J915K050
$$ plain form
57508 101827 103993 106824 110105 112795 114386 115447 116523 117279 117108 115964 114183 111934 109243 106186 102783
57493 102783 99125 95784 93574 92578 91904 90852 89861 89792 90656 91625 92058 91983 91672 91249 90728 90071 89234 88397
57475 88397 87963 87955 87673 86469 84739 83489 82951 82325 81096 79855 79361 79394 79186 78638 78357 78619 79002 79141
57457 79141 79198 79333 79223 78451 77053 75427 73909 72728 72066 71862 71774 71587 71497 71721 72080 72269 72282 72190 71806
57438 71806 71092 70633 71079 72161 72986 73333 73913 75183 76644 77729 78709 80102 81638 82516 82452 81882 81233
57421 81233 80595 80081 79931 80111 80232 80114 80145 80850 82252 83856 85158 86011 86497 86684 86646 86649 87041 87832 88555
57402 88555 88711 88235 87343 86135 84709 83483 82897 82793 82556 81989 81611 81931 82922 84423 86553 89329 92212
57385 92212 94511 96155 97777 100109 103375 107048 110122 111936 112850 113760 114874 115468 115010 113886 112659
$$ packed form
57508A01827K166K831L281K690J591J061J076P56j71j144j781k249k691l057l403
57493A02783l658l341k210r96o74j052r91o9Q64R69M33p5l11m23n21o57q37q37
57475H8397m34qk82j204j730j250n38o26j229j241m94L3k08n48k81K62L83J39
57457G9141N7J35j10p72j398j626j518j181o62k04q8j87r0K24L59J89J3r2l84
57438G1806p14m59M46J082Q25L47N80J270J461J085R80J393J536Q78o4n70o49
57421H1233o38n14j50J80J21j18L1P05J402J604J302Q53M86J87l8LL92P91P23
57402H8555J56m76q92j208j426j226n86j04k37n67l78L20R91J501K130K776K883
57385I2212K299J644J622K332L266L673L074J814R14R10J114N94m58j124j227
$$ plain form
57370 112659 111291 109680 108392 108093 108620 109370 110393 112274 115049 117985 120510 122683 124680 126441 128066
57355 128066 129997 132565 135645 138904 142039 144691 146508 147468 147919 148198 148372 148310 147775 146505 144564 142565
57339 142565 141220 140675 140579 140759 141437 142737 144347 145805 146907 147807 148862 150325 151992 153292 153921 154196
57323 154196 154551 155018 155576 156679 158860 161952 165283 168476 171511 174203 176346 178359 181041 184506 188009
57308 188009 190999 193745 196682 199768 202806 205924 209352 213026 216728 220397 224138 228100 232336 236546
57294 236546 240128 242906 245685 249491 254311 259238 263870 268760 274351 280345 286488 293176 300736 308764
57280 308764 316792 325085 334193 344102 354429 365093 376170 387422 398479 409267 419705 429210
57268 429210 437077 443214 448079 452035 455230 457920 460426 462829 465153 467705 470850 474579 478726 483464
$$ packed form
57370A12659j368j611j288k99N27P50J023J881K775K936K525K173J997J761J625
57355A28066J931K568L080L259L135K652J817R60M51K79J74o2n35j270j941j999
57339A42565j345n45r6J80O78J300J610J458J102R00J055J463J667J300O29K75
57323A54196L55M67N58J103K181L092L331L193L035K692K143K013K682L465L503
57308A88009K990K746K937L086L038L118L428L674L702L669L741L962M236M210
57294B36546L582K778K779L806M820M927M632M890N591N994O143O688P560Q028
57280C08764Q028Q293R108R909J0327J0664J1077J1252J1057J0788J0438R505
57268D29210P867O137M865L956L195K690K506K403K324K552L145L729M147M738
$$ plain form
57254 483464 489051 495114 500787 505717 510555 516225 522980 530365 537903 545601 553861 563024 573032 583502
57240 583502 594042 604446 614669 624868 635462 646840 658880 671001 682802 694425 706208
57229 706208 718335 730942 744170 757839 771410 784587 797690 811200 825303 840163 856128
57218 856128 873081 889989 905830 920805 936005 951981 968307 984576 1001050 1018058 1035421
57207 1035421 1052873 1070645 1089125 1108251 1127630 1147078 1166610 1185946 1204518 1222136 1239332
57196 1239332 1256810 1274716 1292664 1310353 1327841 1345192 1362276 1379170 1396471 1414836 1434320
57185 1434320 1454535 1475396 1497294 1520472 1544633 1569332 1594426 1619978 1645951 1672139 1698160
57174 1698160 1723479 1747732 1771104 1794076 1816659 1838311 1858792 1878707 1898803 1919016 1938560
$$ packed form
57254D83464N587O063N673M930M838N670O755P385P538P698Q260R163J0008J0470
57240E83502J0540J0404J0223J0199J0594J1378J2040J2121J1801J1623J1783
57229G06208J2127J2607J3228J3669J3571J3177J3103J3510J4103J4860J5965
57218H56128J6953J6908J5841J4975J5200J5976J6326J6269J6474J7008J7363
57207A035421J7452J7772J8480J9126J9379J9448J9532J9336J8572J7618J7196
57196A239332J7478J7906J7948J7689J7488J7351J7084J6894J7301J8365J9484
57185A434320K0215K0861K1898K3178K4161K4699K5094K5552K5973K6188K6021
57174A698160K5319K4253K3372K2972K2583K1652K0481J9915K0096K0213J9544
$$ plain form
57163 1938560 1956827 1973994 1990893 2008435 2026946 2045924 2064601 2082761 2100701 2118497 2135887
57152 2135887 2153005 2170598 2189194 2208576 2228361 2248472 2268617 2288037 2306448 2324741 2344022
57141 2344022 2364296 2384780 2405147 2425721 2446735 2468160 2490072 2512379 2534303 2554909 2574190
57130 2574190 2592954 2611631 2629841 2647149 2663634 2679686 2695886 2713262 2733110 2756391 2783649
57119 2783649 2815456 2852423 2894685 2941822 2993245 3048273 3105957 3165530 3227206 3292330 3362930
57108 3362930 3441667 3532095 3638407 3765000 3916665 4099005 4318306 4581597 4897872 5279143
57098 5279143 5739755 6295034 6961180 7755473 8694838 9794077 11066174 12522981 14172908
57089 14172908 16016898 18046705 20245133 22584932 25028089 27529024 30035689 32478214
$$ packed form
57163A938560J8267J7167J6899J7542J8511J8978J8677J8160J7940J7796J7390
57152B135887J7118J7593J8596J9382J9785K0111K0145J9420J8411J8293J9281
57141B344022K0274K0484K0367K0574K1014K1425K1912K2307K1924K0606J9281
57130B574190J8764J8677J8210J7308J6485J6052J6200J7376J9848K3281K7258
57119B783649L1807L6967M2262M7137N1423N5028N7684N9573O1676O5124P0600
57108C362930P8737R0428J06312J26593J51665J82340K19301K63291L16275L81271
57098E279143M60612N55279O66146P94293R39365J099239J272097J456807J649927
57089A4172908J843990K029807K198428K339799K443157K500935K506665K442525
$$ plain form
57081 32478214 34752039 36721902 38260137 39294473 39824929 39899195 39574661 38898242 37908153
57072 37908153 36642748 35145391 33464051 31646893 29735790 27762640 25752346 23729640
57064 23729640 21723437 19766289 17891118 16127290 14496867 13012511 11678110 10490832
57056 10490832 9442580 8521199 7712510 7002295 6376766 5822606 5328202 4885034 4487040
57047 4487040 4128866 3805600 3513888 3251853 3017462 2807767 2619913 2451947 2302319
57038 2302319 2169446 2052190 1949946 1861765 1786109 1721966 1669492 1629054 1600540 1584494 1582886
57027 1582886 1596640 1621468 1646695 1659029 1648255 1610847 1550100 1473718 1390433 1307293 1228732
57016 1228732 1157051 1093015 1036050 984767 938030 895562 857456 823386 792562 764350 738633
$$ packed form
57081C2478214K273825J969863J538235J034336N30456P4266l24534o76419r90089
57072C7908153j265405j497357j681340j817158j911103j973150k010294k022706
57064B3729640k006203j957148j875171j763828j630423j484356j334401j187278
57056A0490832j048252r21381q08689p10215o25529n54160m94404m43168l97994
57047D487040l58174l23266k91712k62035k34391k09695j87854j67966j49628
57038B302319j32873j17256j02244q8181p5656o4143n2474m0438k8514j6046j608
57027A582886J3754K4828K5227J2334j0774l7408o0747p6382q3285q3140p8561
57016A228732p1681o4036n6965n1283m6737m2468l8106l4070l0824k8212k5717
$$ plain form
57005 738633 715543 694940 676205 658537 641494 625194 609869 595383 581421 568069 555845
56994 555845 545061 535518 527016 519827 514392 510810 508956 508935 510994 515080 520840 528064 536652 545901
56980 545901 554116 559269 560061 556178 547725 534904 518531 500578 483610 469320 457721 447884 439247
56967 439247 431988 426485 423004 421915 423630 428050 434566 442934 453790 467847 484820 503515 522599
56954 522599 540557 554945 562634 561471 551701 535614 516006 495083 474354 454901 437424 422192
56942 422192 409172 398316 389771 383827 380791 380999 384871 392733 404505 419750 438137 459537 483327
56929 483327 507723 530084 547829 558785 560915 552590 533785 506969 476398 446204 418853 394954
56917 394954 374106 355836 340017 326803 316395 308797 303541 299513 295374 290478 285361 281130 278396
$$ packed form
57005G38633k3090k0603j8735j7668j7043j6300j5325j4486j3962j3352j2224
56994E55845j0784r543q502p189n435l582j854k1K059M086N760P224Q588R249
56980E45901Q215N153P92l883q453j2821j6373j7953j6968j4290j1599r837q637
56967D39247p259n503l481j089J715M420O516Q368J0856J4057J6973J8695J9084
56954E22599J7958J4388P689j163r770j6087j9608k0923k0729j9453j7477j5232
56942D22192j3020j0856q545n944l036K08L872P862J1772J5245J8387K1400K3790
56929D83327K4396K2361J7745J0956K130q325j8805k6816l0571l0194k7351k3899
56917C94954k0848j8270j5819j3214j0408p598n256m028m139m896n117m231k734
$$ plain form
56904 278396 276994 276581 277076 278404 280211 282168 284412 287427 291456 296281 301567 307344 314050 322231 332294
56889 332294 344523 359089 375869 394362 413981 434337 454803 473698 488328 496289 496753 490477
56877 490477 479008 464293 448637 434183 422141 412836 406525 403706 404595 408849 416217 427123 442326
56864 442326 462262 487102 517249 553305 595451 642959 694081 745869 793832 832169 855228
56853 855228 859683 846012 818144 781647 741876 703133 668542 639930 617863 602283 593397 591800
56841 591800 597783 610941 630774 657593 692679 737491 792702 857855 931717 1012414 1096366 1176488
56829 1176488 1241995 1281523 1288005 1261633 1208979 1139683 1063269 987207 916237 852737 797719
56818 797719 751616 714494 686174 666557 655710 653500 659435 673111 694688 724728 763726 811697
$$ packed form
56904B78396j402m13M95J328J807J957K244L015M029M825N286N777O706Q181J0063
56889C32294J2229J4566J6780J8493J9619K0356K0466J8895J4630P961M64o276
56877D90477j1469j4715j5656j4454j2042r305o311k819Q89M254P368J0906J5203
56864D42326J9936K4840L0147L6056M2146M7508N1122N1788M7963L8337K3059
56853H55228M455j3671k7868l6497l9771l8743l4591k8612k2067j5580q886j597
56841E91800N983J3158J9833K6819L5086M4812N5211O5153P3862Q0697Q3952Q0122
56829A176488O5507L9528O482k6372n2654o9296p6414p6062p0970o3500n5018
56818G97719m6103l7122k8320j9617j0847k210N935J3676K1577L0040L8998M7971
$$ plain form
56806 811697 867469 927483 985139 1031850 1059486 1062780 1040724 996807 937914 872057 805917 743621
56794 743621 687114 637211 594340 558712 530235 508492 492987 483422 479682 481515 488455 500236
56782 500236 517153 539705 567571 598683 629132 654042 668977 671065 659359 634791 600137 559660
56770 559660 517781 477442 439771 405248 374636 348434 326061 306360 288779 273448 260173
56759 260173 248167 237053 227468 220111 214507 209309 203722 198125 193239 189221 185830 183032 180920 179211
56745 179211 177352 175200 173183 171656 170525 169693 169411 169739 170036 169560 168419 167314 166484 165525 164361 163700
56729 163700 164232 165859 168020 170324 172555 174460 175989 177440 178998 180335 181025 181144 181140 181314 181771 182580
56713 182580 183591 184290 184268 183685 182940 182104 181127 180372 180401 181274 182601 184215 186194 188233 189618 190128 190348
$$ packed form
56806H11697N5772O0014N7656M6711K7636L294k2056m3917n8893o5857o6140o2296
56794G43621n6507m9903m2871l5628k8477k1743j5505r565l740J833O940J1781
56782E00236J6917K2552K7866L1112L0449K4910J4935K088j1706k4568l4654m0477
56770E59660m1879m0339l7671l4523l0612k6202k2373j9701j7581j5331j3275
56759B60173j2006j1114r585p357n604n198n587n597m886m018l391k798k112j709
56745A79211j859k152k017j527j131q32k82L28K97m76j141j105q30r59j164o61
56729A63700N32J627K161K304K231J905J529J451J558J337O90J19mJ74M57Q09
56713A82580J011O99k2n83p45q36r77p55K9Q73J327J614J979K039J385N10K20
$$ plain form
56696 190348 190797 191176 190893 189986 189051 188465 188130 187856 187573 187153 186425 185450 184580 184155 184285 184872 185644 186152 185997
56677 185997 185240 184373 183752 183187 182274 180998 179805 179149 179207 180015 181566 183716 186216 188920 191758 194397
56661 194397 196276 197245 197956 199247 201225 203237 204686 205569 206256 207120 208452 210341 212379 213748 213889 213067
56645 213067 212142 211756 211828 211812 211360 210712 210394 210617 211131 211643 212097 212373 212057 210828 208898 206709 204359 201726
56627 201726 199036 196863 195571 195132 195388 196026 196366 195771 194342 192721 191136 189226 186961 185032 184039 183783
56611 183783 183776 183945 184402 184921 185148 185091 185060 185274 185787 186536 187200 187319 186823 186211 185946 185966 186028 186126 186307 186469 186740
56590 186740 187698 189706 192237 194292 195321 195465 195123 194685 194502 194713 195224 195988 197078 198277 199013 199022 198733
56573 198733 198716 199192 200432 203039 207173 211930 216245 220220 224900 230896 237852 245229 252974 261430 271126
$$ packed form
56696A90348M49L79k83r07r35n86l35k74k83m20p28r75q70m25J30N87P72N08j55
56677A85997p57q67o21n65r13j276j193o56N8Q08J551K150K500K704K838K639
56661A94397J879R69P11J291J978K012J449Q83O87Q64J332J889K038J369J41q22
56645B13067r25l86P2j6m52o48l18K23N14N12M54K76l16j229j930k189k350k633
56627B01726k690k173j292m39K56O38L40n95j429j621j585j910k265j929r93k56
56611A83783pJ69M57N19K27n7l1K14N13P49O64J19m96o12k65K0O2R8J81J62K71
56590A86740R58K008K531K055J029J44l42m38j83K11N11P64J090J199P36Rk89
56573A98733j7M76J240K607M134M757M315L975M680N996O956P377P745Q456R696
$$ plain form
56558 271126 282660 296299 311505 327050 341533 353715 362896 369533 375171 381085 387051 391892 395028
56545 395028 396874 398039 398828 399431 399777 399170 396737 392448 387153 381578 375800 369688 363198 356097 348024
56530 348024 339170 330458 322778 316292 310535 304850 298681 291907 285068 279037 274314 270756 267854 265026
56516 265026 261821 258214 254638 251407 248300 245008 241728 238845 236318 233919 231804 230235 228951 227546
56502 227546 226277 225677 225492 224812 223293 221468 219779 218100 216371 214926 213978 213388 213073 213021 212892 212361 211891
56485 211891 212316 213459 214093 213546 212449 211516 210586 209445 208728 209148 210379 211467 211977 212093 211991 211767 211778
56468 211778 212426 213665 215084 216345 217286 217888 218417 219352 220809 222263 223052 223018 222558 222369 223135 224994 227103
56451 227103 228261 228222 227943 228282 229002 229373 229261 229138 229400 230116 231186 232378 233341 233826 233730 232927 231472 229985
$$ packed form
56558B71126J1534J3639J5206J5545J4483J2182R181O637N638N914N966M841L136
56545C95028J846J165P89O03L46o07k433m289n295n575n778o112o490p101q073
56530C48024q854q712p680o486n757n685o169o774o839o031m723l558k902k828
56516B65026l205l607l576l231l107l292l280k883k527k399k115j569j284j405
56502B27546j269o00j85o80j519j825j689j679j729j445r48n90l15n2j29n31m70
56485B11891M25J143O34n47j097r33r30j141p17M20J231J088N10J16j02k24J1
56468B11778O48J239J419J261R41O02N29R35J457J454P89l4m60j89P66J859K109
56451B27103J158l9k79L39P20L71j12j23K62P16J070J192R63M85r6q03j455j487
$$ plain form
56433 229985 229291 229470 229816 229891 229954 230136 229958 229184 228469 228553 229302 230066 230502 230485 229774 228462 227478 227903 229915
56414 229915 232812 235797 238308 239894 240408 240236 239958 239876 240089 240644 241292 241538 241367 241518 242548 243967 244882
56397 244882 245198 245625 246741 248541 250684 252676 254043 254841 255847 257759 260303 262520 263779 264114 263884
56382 263884 263545 263523 263798 263774 262998 261830 261019 260838 261158 262050 263697 265795 267636 268835 269538 269963 270148 270195
56364 270195 270410 271137 272590 274679 276813 278183 278674 279202 280723 283079 285340 287073 288693 290525 292139
56349 292139 292837 292530 291908 291834 292647 293955 295118 295865 296326 296567 296475 296134 295849 295642 295225 294729 294936 296372
56331 296372 298554 300629 302436 304467 307037 309968 312942 315794 318527 321304 324281 327298 330010 332406
56317 332406 334751 336798 337627 336727 334766 332842 331382 330216 329266 328561 327945 327444 327662 329172 331679 334341
$$ packed form
56433B29985o94J79L46P5O3J82j78p74p15Q4P49P64M36j7p11j312r84M25K012
56414B29915K897K985K511J586N14j72k78q2K13N55O48K46j71J51J030J419R15
56397B44882L16M27J116J800K143J992J367P98J006J912K544K217J259L35k30
56382B63884l39k2K75k4p76j168q11j81L20Q92J647K098J841J199P03M25J85M7
56364B70195K15P27J453K089K134J370M91N28J521K356K261J733J620J832J614
56349B92139O98l07o22p4Q13J308J163P47M61K41r2l41k85k07m17m96K07J436
56331B96372K182K075J807K031K570K931K974K852K733K777K977L017K712K396
56317C32406K345K047Q29r00j961j924j460j166r50p05o16n01K18J510K507K662
$$ plain form
56301 334341 336794 339379 342444 345890 349334 352353 354716 356709 359051 362126 365397 367851 368925 368832 368271
56286 368271 367976 368244 368760 369178 369922 371826 374893 378093 380629 382611 384250 385358 386265 388264 392265 397638
56270 397638 403184 408629 414342 420244 425992 431832 438312 445464 453089 461482 471025 481412 492139 503474
56256 503474 516116 530213 545511 562163 580602 600920 623227 648263 676829 708807 743492
56245 743492 780473 819425 859559 900232 941666 983951 1025712 1064892 1100607 1133085 1161953
56234 1161953 1185846 1203680 1215184 1220093 1217915 1208699 1193180 1172044 1145858 1115735 1083243 1049611
56222 1049611 1015641 982145 949630 917730 885969 854905 825628 798293 772185 747111 723659
56211 723659 702168 682474 664660 648991 635130 622404 610719 600268 590564 580984 572095 565112
$$ packed form
56301C34341K453K585L065L446L444L019K363J993K342L075L271K454J074r3n61
56286C68271k95K68N16M18P44J904L067L200K536J982J639J108R07J999M001N373
56270C97638N546N445N713N902N748N840O480P152P625Q393R543J0387J0727J1335
56256E03474J2642J4097J5298J6652J8439K0318K2307K5036K8566L1978L4685
56245G43492L6981L8952M0134M0673M1434M2285M1761L9180L5715L2478K8868
56234A161953K3893J7834J1504M909k178r216j5519k1136k6186l0123l2492l3632
56222A049611l3970l3496l2515l1900l1761l1064k9277k7335k6108k5074k3452
56211G23659k1491j9694j7814j5669j3861j2726j1685j0451r704r580q889o983
$$ plain form
56199 565112 559997 555429 550707 546358 542758 539578 536832 535096 534333 533820 533619 534727 537257 539868 541658
56184 541658 543388 546053 549315 552188 554329 555838 556582 556563 556390 556730 557746 559502 562300 566195 570753
56169 570753 575708 581266 587481 593970 600570 607634 615339 623294 631137 638994 647183 655993 665833 676950
56155 676950 689008 701594 715109 730459 748002 767659 789814 815068 843259 874019 908391
56144 908391 948653 996360 1051756 1115243 1188171 1271747 1366132 1470655 1583555 1701156 1818444
56133 1818444 1930915 2035120 2127891 2207001 2273211 2330213 2381805 2429886 2474980 2516667 2552719
56122 2552719 2579518 2594619 2598249 2592004 2577282 2555313 2526859 2490757 2443804 2382974 2307078 2216289
56110 2216289 2111940 1997768 1879865 1764124 1654340 1553055 1462595 1384242 1317620 1261830
$$ packed form
56199E65112n115m568m722m349l600l180k746j736p63n13k01J108K530K611J790
56184E41658J730K665L262K873K141J509P44j9j73L40J016J756K798L895M558
56169E70753M955N558O215O489O600P064P705P955P843P857Q189Q810R840J1117
56155F76950J2058J2586J3515J5350J7543J9657K2155K5254K8191L0760L4372
56144I08391M0262M7707N5396O3487P2928Q3576R4385J04523J12900J17601J17288
56133A818444J12471J04205R2771P9110O6210N7002N1592M8081M5094M1687L6052
56122B552719K6799J5101L630o245j4722k1969k8454l6102m6953o0830p5896r0789
56110B216289j04349j14172j17903j15741j09784j01285r0460p8353o6622n5790
$$ plain form
56100 1261830 1216212 1179365 1148864 1122963 1101568 1084846 1072130 1062875 1057190 1054434 1052708 1050772
56088 1050772 1049285 1049211 1050413 1052802 1057353 1064553 1073085 1081343 1089220 1097212 1104967 1112107 1119436 1127936
56074 1127936 1137324 1146827 1156591 1167236 1178756 1190929 1203967 1217864 1231930 1245793 1259957 1274644
56062 1274644 1289187 1303360 1318140 1334269 1351238 1368556 1386736 1406103 1425922 1445627 1465649
56051 1465649 1486169 1506419 1526065 1545813 1565877 1585543 1605136 1626438 1649985 1673973 1697229
56040 1697229 1721275 1747765 1775817 1803833 1832273 1862635 1895062 1928873 1964199 2001344 2039674
56029 2039674 2078756 2119431 2162345 2206758 2252116 2299195 2348364 2398415 2448589 2499962 2553395
56018 2553395 2608176 2664248 2723561 2787423 2854726 2924633 2998615 3077775 3160652 3245970 3335057
$$ packed form
56100A261830m5618l6847l0501k5901k1395j6722j2716r255n685k756j726j936
56088A050772j487p4J202K389M551P200Q532Q258P877P992P755P140P329Q500
56074A127936R388R503R764J0645J1520J2173J3038J3897J4066J3863J4164J4687
56062A274644J4543J4173J4780J6129J6969J7318J8180J9367J9819J9705K0022
56051A465649K0520K0250J9646J9748K0064J9666J9593K1302K3547K3988K3256
56040A697229K4046K6490K8052K8016K8440L0362L2427L3811L5326L7145L8330
56029B039674L9082M0675M2914M4413M5358M7079M9169N0051N0174N1373N3433
56018B553395N4781N6072N9313O3862O7303O9907P3982P9160Q2877Q5318Q9087
$$ plain form
56007 3335057 3429133 3526785 3626835 3731078 3841330 3956384 4075079 4199694 4332818 4473326
55997 4473326 4619203 4771981 4934438 5106098 5285199 5473367 5674224 5888885 6116774
55988 6116774 6359386 6619383 6897494 7194079 7512190 7855503 8225126 8622126 9051058
55979 9051058 9517198 10022779 10570158 11166132 11818902 12533759 13316599 14178767 15133594
55970 15133594 16191911 17367044 18681444 20163126 21840070 23745641 25926999 28442956
55962 28442956 31359981 34760060 38749102 43449456 48989686 55512455 63188362 72213412
55954 72213412 82805013 95223952 109803813 126945131 147077193 170620360 197926267
55947 197926267 229113649 263753031 300455081 336526682 367978251 390197403 399311703
$$ packed form
56007C335057R4076R7652J00050J04243J10252J15054J18695J24615J33124J40508
55997D473326J45877J52778J62457J71660J79101J88168K00857K14661K27889
55988F116774K42612K59997K78111K96585L18111L43313L69623L97000M28932
55979I051058M66140N05581N47379N95974O52770P14857P82840Q62168R54827
55970A5133594J058317J175133J314400J481682J676944J905571K181358K515957
55962B8442956K917025L400079L989042M700354N540230O522769P675907R025050
55954G2213412J0591601J2418939J4579861J7141318K0132062K3543167K7305907
55947A97926267L1187382L4639382L6702050L6071601L1451569K2219152R114300
$$ plain form
55940 399311703 393672759 374549360 345537570 311105045 275207088 240602949 208839314
55933 208839314 180542813 155764150 134278293 115783369 99972177 86531413 75146672
55926 75146672 65524669 57401310 50535668 44713586 39757240 35520749 31878196 28723474
55918 28723474 25976074 23574917 21466212 19602907 17950967 16486088 15184388 14022100
55910 14022100 12981517 12049736 11212507 10455095 9767671 9144074 8576345 8055462 7576078
55901 7576078 7135656 6730125 6354767 6007963 5689549 5396570 5124622 4872043 4638826
55892 4638826 4422764 4220685 4032295 3858892 3699348 3551052 3413755 3288692 3174619
55883 3174619 3068065 2966751 2869550 2774108 2677982 2581692 2487713 2397134 2309988 2227736 2152116
$$ packed form
55940C99311703n638944j9123399k9011790l4432525l5897957l4604139l1763635
55933B08839314k8296501k4778663k1485857j8494924j5811192j3440764j1384741
55926G5146672r622003q123359o865642n822082m956346m236491l642553l154722
55918B8723474k747400k401157k108705j863305j651940j464879j301700j162288
55910A4022100j040583r31781q37229p57412o87424o23597n67729n20883m79384
55901G576078m40422m05531l75358l46804l18414k92979k71948k52579k33217
55892D638826k16062k02079j88390j73403j59544j48296j37297j25063j14073
55883C174619j06554j01314r7201r5442r6126r6290r3979r0579q7146q2252p5620
$$ plain form
55872 2152116 2082131 2015106 1950205 1888241 1828807 1770550 1713728 1659732 1608566 1559447 1513282
55861 1513282 1471716 1434078 1397930 1362331 1328090 1295195 1262698 1230904 1201152 1173514 1147087
55850 1147087 1122272 1100205 1079985 1058998 1036232 1012987 990112 966825 942677 918585 895365
55839 895365 872944 851476 831709 813888 797616 782862 769753 757451 744768 731931 720267
55828 720267 710092 700372 690533 681147 672655 664649 656601 648256 639268 629370 618798 607683 595499
55815 595499 582147 569040 557842 548570 540164 532394 525788 520211 515131 511000 508827 508548 509291 511079
55801 511079 514731 520208 526584 533631 541939 551302 560391 568262 575003 580653 584501 585663 583679 578662
55787 578662 571660 564497 558258 552170 544823 535958 525997 514525 500733 485143 469480 455000 442144
$$ packed form
55872B152116o9985o7025o4901o1964n9434n8257n6822n3996n1166m9119m6165
55861A513282m1566l7638l6148l5599l4241l2895l2497l1794k9752k7638k6427
55850A147087k4815k2067k0220k0987k2766k3245k2875k3287k4148k4092k3220
55839H95365k2421k1468j9767j7821j6272j4754j3109j2302j2683j2837j1664
55828G20267j0175r720r839r386q492q006q048q345q988r898j0572j1115j2184
55815E95499j3352j3107j1198r272q406p770o606n577n080m131k173k79P43J788
55801E11079L652N477O376P047Q308R363R089P871O741N650L848J162j984n017
55787E78662p002p163o239o088p347q865r961j1472j3792j5590j5663j4480j2856
$$ plain form
55774 442144 431603 424323 420549 419990 422782 429026 437420 445424 450684 451486 446585 436156 422655 409234
55760 409234 397245 386316 376339 367736 359960 351537 341912 331967 322543 313673 305390 298073 291848 286593
55746 286593 282484 279526 276890 273889 271319 270375 270543 270095 268529 266846 265378 263104 259418 254980 250417
55731 250417 245657 240973 237342 235161 233694 232177 230471 228391 225571 222271 219311 216929 214658 212362
55717 212362 210383 208799 207732 208165 210927 215011 218600 221788 226369 232565 238016 240816 241788 242731 243971
55702 243971 244697 244453 243160 240661 237165 233284 228939 223273 216282 209389 203653 198551 193408 188816 185579
55687 185579 183317 181337 180051 180283 181825 183765 185806 188249 191053 193811 196366 198713 200613 201958
55673 201958 203189 204682 205966 206055 204388 201142 197026 193018 189887 187690 186101 185215 185359 186124 186574 186655
$$ packed form
55774D42144j0541p280l774n59K792O244Q394Q004N260Q02m901j0429j3501j3421
55760D09234j1989j0929r977q603p776q423r625r945r424q870q283p317o225n255
55746B86593m109k958k636l001k570r44J68m48j566j683j468k274l686m438m563
55731B50417m760m684l631k181j467j517j706k080k820l300k960k382k271k296
55717B12362j979j584j067M33K762M084L589L188M581O196N451K800R72R43J240
55702B43971P26k44j293k499l496l881m345n666o991o893n736n102n143m592l237
55687A85579k262j980j286K32J542J940K041K443K804K758K555K347J900J345
55673B01958J231J493J284Q9j667l246m116m008l131k197j589q86J44P65M50Q1
$$ plain form
55657 186655 187333 188937 190505 191345 192203 194054 196656 199227 201831 205097 209046 213035 216490 219047 220410
55642 220410 220672 220354 219558 217549 213717 208451 202526 196175 189325 182245 175336 168688 162430 157024 152753
55627 152753 149349 146556 144479 142936 141162 138779 136477 135076 134510 134325 134583 135396 136099 135713 134015 131515
55611 131515 128701 125880 123390 121348 119430 117423 115674 114561 113932 113484 113274 113355 113404 113199 112933 112582 111551
55594 111551 109518 107096 105015 103207 101320 99555 98323 97643 97602 98797 101430 104484 106764 108312 109890
55579 109890 111539 112747 113767 115559 118395 121555 124580 127954 132309 137613 143330 148892 153919 158407
55565 158407 162723 167051 170873 173328 173901 172498 169202 164472 159267 154398 149901 145445 140992 136570
55551 136570 131885 126871 122277 118952 116808 115244 114213 113939 113842 112864 110941 109199 108447 108296 108042 107642
$$ packed form
55657A86655O78J604J568Q40Q58J851K602K571K604L266L949L989L455K557J363
55642B20410K62l18p96k009l832n266n925o351o850p080o909o648o258n406m271
55627A52753l404k793k077j543j774k383k302j401n66j85K58Q13P03l86j698k500
55611A31515k814k821k490k042j918k007j749j113o29m48k10Q1M9k05k66l51j031
55594A11551k033k422k081j808j887j765j232o80m1J195K633L054K280J548J578
55579A09890J649J208J020J792K836L160L025L374M355N304N717N562N027M488
55565A58407M316M328L822K455N73j403l296m730n205m869m497m456m453m422
55551A36570m685n014m594l325k144j564j031k74r7r78j923j742p52j51k54m00
$$ plain form
55535 107642 107417 107381 107356 107429 107897 108872 110059 110867 110845 110164 109485 109110 108575 107418 106016 105134 104880 104721 104313
55516 104313 103675 102622 100750 98125 95484 93614 92855 93121 93997 94824 95102 94803 94090 93004 91756 90913
55500 90913 90729 90561 89604 87955 86352 85129 84188 83742 84233 85516 86948 88249 89493 90276 89840 88205
55484 88205 86376 85177 84555 84220 84213 84543 84929 85244 85655 86134 86383 86389 86446 86508 86275 86077 86731 88164 89067 88517
55464 88517 87147 86031 85160 83913 82462 81651 81630 81585 80917 79983 79448 79407 79374 78915 78170 77881 78760 80576 82049
55445 82049 82057 80856 79706 79282 78987 78026 76704 76137 76738 77541 77359 76325 75788 76610 78124 79081 79232 79412
55427 79412 80298 81779 83529 85426 87156 88056 87894 87415 87614 88614 89674 90138 90044 89910 90269 91350 92851
55410 92851 94045 94380 94010 93586 93557 93881 94245 94298 93666 92160 90121 88243 86895 85811 84623 83475 82836
$$ packed form
55535A07642k25l6k5P3M68R75J187Q08k2o81o79l75n35j157j402q82k54j59m08
55516A04313o38j053j872k625k641j870p59K66Q76Q27K78k99p13j086j248q43
55500I0913j84j68r57j649j603j223r41m46M91J283J432J301J244P83m36j635
55484H8205j829j199o22l35pL30L86L15M11M79K49ON7O2k33j98O54J433R03n50
55464H8517j370j116q71j247j451q11k1m5o68r34n35m1l3m59p45k89Q79J816J473
55445H2049Qj201j150m24k95r61j322n67O01Q03j82j034n37Q22J514R57J51J80
55427G9412Q86J481J750J897J730R00j62m79J99J000J060M64r4j34L59J081J501
55410I2851J194L35l70m24k9L24L64N3o32j506k039j878j348j084j188j148o39
$$ plain form
55393 82836 82859 83291 83986 85101 86672 88294 89483 90112 90269 89966 89322 88788 88701 88683 88049 86868 86044 86118 86529
55374 86529 86384 85606 84816 84370 83948 83111 81913 80948 80894 81886 83257 84108 84196 84002 83854 83521 82877 82378 82435
55355 82435 82823 83294 84235 85986 87816 88493 87810 86729 86051 85669 85264 84899 84656 84368 84052 84088 84586 85010
55337 85010 84812 84089 83321 82767 82430 82391 82850 83900 85404 86939 87885 87853 87115 86380 86078 86112 86292 86617 87072
55318 87072 87498 87792 87868 87440 86238 84585 83267 82694 82575 82579 82783 83217 83460 83134 82484 82073 82120 82459 82908
55299 82908 83425 84076 85057 86459 87835 88354 87737 86710 86167 86138 85977 85370 84745 84790 85870 87746 89574 90377
55281 90377 89977 89296 89391 90305 91254 91772 92100 92438 92465 91867 90890 90035 89455 89001 88693 88741 89092 89299 89027 88546
55261 88546 88512 89258 90430 91335 91555 91154 90479 89947 89908 90440 91191 91627 91573 91407 91586 92082 92364 91941 90869
$$ packed form
55393H2836K3M32O95J115J571J622J189O29J57l03o44n34q7j8o34j181q24P4M11
55374H6529j45p78p90m46m22q37j198r65n4R92J371Q51Q8j94j48l33o44m99N7
55355H2435L88M71R41J751J830O77o83j081o78l82m05l65k43k88l16L6M98M24
55337H5010j98p23p68n54l37l9M59J050J504J535R46l2p38p35l02L4J80L25M55
55318H7072M26K94P6m28j202j653j318n73j19MK04M34K43l26o50m11M7L39M49
55299H2908N17O51R81J402J376N19o17j027n43k9j61o07o25M5J080J876J828Q03
55281I0377m00o81R5R14R49N18L28L38K7n98r77q55n80m54l08M8L51K07k72m81
55261H8546l4P46J172R05K20m01o75n32l9N32P51M36n4j66J79M96K82m23j072
$$ plain form
55242 90869 89742 89166 89243 89603 89911 90164 90434 90556 90334 89914 89631 89547 89443 89223 89034 88971 88970 88988 88963 88626 87726
55221 87726 86498 85480 84766 83902 82691 81647 81363 81825 82691 83866 85334 86674 87257 86892 85934 84824
55205 84824 83812 83069 82720 82741 83035 83569 84267 84900 85327 85782 86557 87505 88174 88446 88632 88879 88870 88351 87616 87176
55185 87176 87098 87042 86840 86726 86884 87115 87134 87009 87058 87414 87957 88602 89385 90203 90769 90980 91106 91506 92280 93278
55165 93278 94176 94497 93913 92803 92107 92298 92760 92640 92015 91679 91982 92519 92913 93222 93517 93694 93896 94530 95612
55146 95612 96576 97028 97293 97857 98659 99215 99153 98401 97112 95664 94528 93964 94020 94767 96151 97611 98458 98736
55128 98736 99105 99726 99983 99647 99457 99948 100381 99682 98028 96670 96442 97124 98093 98875 99192 99158 99382 100355 101793
55109 101793 103077 104134 105257 106249 106464 105667 104211 102434 100561 99109 98565 98592 98358 97763 97500 97724 97611
$$ packed form
55242I0869j127n76P7L60L08K53K70J22k22m20k83q4j04k20j89o3jJ8k5l37r00
55221H7726j228j018p14q64j211j044k84M62Q66J175J468J340N83l65r58j110
55205H4824j012p43l49K1K94N34O98O33M27M55P75R48O69K72J86K47rn19p35m40
55185H7176p8n6k02j14J58K31J9j25M9L56N43O45P83Q18N66K11J26M00P74R98
55165I3278Q98L21n84j110o96J91M62j20o25l36L03N37L94L09K95J77K02O34J082
55146I5612R64M52K65N64Q02N56o2p52j289j448j136n64N6P47J384J460Q47K78
55128I8736L69O21K57l36j90M91M33o99j654j358k28O82R69P82L17l4K24R73J438
55109A01793J284J057J123R92K15p97j456j777j873j452n44K7k34n95k63K24j13
$$ plain form
55092 97611 96746 96081 96826 98922 101263 102977 103850 103910 103359 102762 102636 102852 102901 102638 102274 101784 100904 99762
55074 99762 99016 99161 100052 101197 102164 102635 102396 101539 100482 99629 99115 98939 99106 99466 99636 99301 98508 97520
55056 97520 96467 95347 94326 93773 93880 94362 94702 94668 94495 94578 95086 95866 96547 96739 96283 95452 94776 94532 94478
55037 94478 94244 93878 93825 94364 95314 96279 97020 97544 98019 98688 99665 100713 101380 101479 101306 101249 101319 101252 100977 100745
55017 100745 100733 100756 100510 100074 99956 100615 102000 103626 104976 105704 105596 104675 103390 102390 101891 101509 100918 100410
54999 100410 100504 101229 102212 103290 104517 105698 106519 107232 108502 110338 111780 112095 111816 112043 113063 114223
54983 114223 114900 114963 114464 113573 112838 112864 113570 114224 114298 113859 113069 111946 110817 110396 110930 111748 112097 112034 112097 112492
54963 112492 113167 114295 115953 117529 118229 118149 118173 118751 119464 119899 120242 120663 120818 120383 119573 118702 117762 116924
$$ packed form
55092I7611q65o65P45K096K341J714Q73O0n51n97j26K16M9k63l64m90q80j142
55074I9762p46J45Q91J145R67M71k39q57j057q53n14j76J67L60J70l35p93r88
55056I7520j053j120j021n53J07M82L40l4j73Q3N08P80O81J92m56q31o76k44n4
55037I4478k34l66n3N39R50R65P41N24M75O69R77J048O67R9j73n7P0o7k75k32
55017A00745j2K3k46m36j18O59J385J626J350P28j08r21j285j000m99l82n91n08
54999A00410R4P25R83J078J227J181Q21P13J270J836J442L15k79K27J020J160
54983A14223O77O3m99q91p35K6P06O54P4m39p90j123j129m21N34Q18L49o3O3L95
54963A12492O75J128J658J576P00q0K4N78P13M35L43M21J55m35q10q71r40q38
$$ plain form
54945 116924 116858 117835 118875 118660 117170 115639 114936 114802 114745 114828 115221 115755 116369 117430 118999 120231 120194 119098
54927 119098 118130 118172 119147 120573 122208 124052 126112 128411 131062 134249 138233 143252 149119 154975 159785
54912 159785 163153 165349 166506 166163 163851 159859 155095 150329 145801 141498 137448 133674 130085 126605
54898 126605 123424 121023 119857 119906 120544 120947 120766 120346 120216 120472 120814 121077 121475 122269 123418 124716 126130
54881 126130 127807 129843 132193 134778 137519 140317 143180 146359 150109 154296 158407 161971 164773 166625
54867 166625 167259 166624 165038 162789 159799 155961 151650 147564 144101 141176 138597 136298 134195 132175 130323
54852 130323 128880 127872 126969 125883 124711 123784 123319 123304 123530 123637 123282 122431 121355 120278 119113 117688
54836 117688 116073 114536 113277 112311 111588 111048 110571 110005 109327 108740 108557 108929 109691 110527 111274 111946 112504 112791
$$ packed form
54945A16924o6R77J040k15j490j531p03j34n7Q3L93N34O14J061J569J232l7j096
54927A19098r68M2R75J426J635J844K060K299K651L187L984N019N867N856M810
54912A59785L368K196J157l43k312l992m764m766m528m303m050l774l589l480
54898A26605l181k401j166M9O38M03j81m20j30K56L42K63L98P94J149J298J414
54881A26130J677K036K350K585K741K798K863L179L750M187M111L564K802J852
54867A66625O34o35j586k249k990l838m311m086l463k925k579k299k103k020j852
54852A30323j443j008r03j086j172r27m65j5K26J07l55q51j076j077j165j425
54836A17688j615j537j259r66p23n40m77n66o78n87j83L72P62Q36P47O72N58K87
$$ plain form
54818 112791 112766 112570 112276 111838 111452 111610 112464 113413 113765 113619 113597 113884 114149 114375 115066 116411 117804 118540 118575
54799 118575 118395 118494 119205 120597 122216 123274 123421 123054 122646 122121 121191 119927 118641 117492 116552 116052 116177
54782 116177 116851 117968 119551 121395 122901 123733 124375 125604 127549 129662 131431 132756 133841 135166 137364
54767 137364 140690 144742 149102 154017 159898 166316 172163 176934 181202 185598 189669 192052 191681 188699
54753 188699 184294 179656 175058 170072 164617 159368 154881 150844 146716 142744 139701 137781 136449 135306
54739 135306 134421 133777 133012 131888 130498 128940 127309 126152 126307 127984 130375 132425 133697 134423 135149 136483
54723 136483 138726 141538 144330 147147 150683 155215 160005 164064 167116 169454 171202 172093 171713 169741 166171
54708 166171 161583 156825 152216 147399 142297 137759 134778 133345 132603 131956 131501 131418 131500 131421 131129 130786 130495
$$ packed form
54818A12791k5j96k94m38l86J58Q54R49L52j46k2K87K65K26O91J345J393P36L5
54799A18575j80R9P11J392J619J058J47l67m08n25r30j264j286j149r40n00J25
54782A16177O74J117J583J844J506Q32O42J229J945K113J769J325J085J325K198
54767A37364L326M052M360M915N881O418N847M771M268M396M071K383l71k982
54753A88699m405m638m598m986n455n249m487m037m128l972l043j920j332j143
54739A35306q85o44p65j124j390j558j631j157J55J677K391K050J272P26P26J334
54723A36483K243K812K792K817L536M532M790M059L052K338J748Q91l80j972l570
54708A66171m588m758m609m817n102m538k981j433p42o47m55q3Q2p9k92l43k91
$$ plain form
54691 130495 130174 129585 128525 127073 125616 124517 123845 123491 123392 123444 123375 122964 122352 121895 121771 121891 122183 122725
54673 122725 123575 124603 125536 126128 126366 126535 126953 127515 127717 127279 126572 126140 125972 125612 124968 124574 124850 125416
54655 125416 125492 124860 124108 123894 124272 124868 125453 126021 126445 126400 125769 124824 123883 123063 122558 122803 123991 125590 126732
54636 126732 127032 126733 126170 125508 124987 124876 125020 124879 124215 123419 122953 122814 122752 122713 122757 122815 122888 123273 124197 125324
54616 125324 125973 125891 125527 125450 125702 125819 125369 124391 123307 122513 122136 122176 122693 123709 124976 126041 126566 126493 126027
54597 126027 125579 125571 125981 126220 125804 125080 124845 125264 125672 125567 125254 125243 125502 125743 126037 126634 127336 127591 127204 126660
54577 126660 126652 127498 128971 130539 131737 132409 132636 132461 131850 130908 129875 128908 128109 127751 128070 128736 129026 128767
54559 128767 128623 129085 129634 129481 128769 128428 128911 129701 130110 130060 129950 130139 130774 131838 133206 134753 136411 138007
$$ packed form
54691A30495l21n89j060j452j457j099o72l54r9N2o9m11o12m57j24J20K92N42
54673A22725Q50J028R33N92K38J69M18N62K02m38p07m32j68l60o44l94K76N66
54655A25416P6o32p52k14L78N96N85N68M24m5o31r45r41q20n05K45J188J599J142
54636A26732L00k99n63o62n21j11J44j41o64p96m66j39o2l9M4N8P3L85R24J127
54616A25324O49q2l64p7K52J17m50r78j084p94l77M0N17J016J267J065N25p3m66
54597A26027m48qM10K39m16p24k35M19M08j05l13j1K59K41K94N97P02K55l87n44
54577A26660qQ46J473J568J198O72K27j75o11r42j033r67p99l58L19O66K90k59
54559A28767j44M62N49j53p12l41M83P90M09n0j10J89O35J064J368J547J658J596
$$ plain form
54541 138007 139196 139823 140266 141098 142356 143440 143770 143320 142432 141391 140297 139202 138252 137702 137798 138525 139514
54524 139514 140370 141130 142263 144084 146185 147494 147092 145159 143036 142076 142340 142694 142212 141087 140038 139314
54508 139314 138693 138054 137406 136535 135252 133936 133354 133867 135166 136756 138287 139413 139848 139731 139619 139952 140740
54491 140740 141814 142974 143804 143771 142799 141492 140496 139851 139248 138717 138729 139638 141247 143031 144612 145965 147205
54474 147205 148323 149209 149924 150712 151667 152536 153067 153444 154146 155426 157114 158896 160475 161525 161800 161386 160577
54457 160577 159448 157828 155872 154292 153758 154164 154783 155054 155007 154989 155220 155667 156118 156278 155942 155218 154550 154323
54439 154323 154483 154633 154521 154218 153791 153059 151934 150763 149993 149591 149197 148836 149005 149913 151090 151978 152530 152921
54421 152921 153037 152645 151808 150784 149705 148739 148328 148836 150062 151452 152617 153320 153226 152210 150795 149781
$$ packed form
54541A38007J189O27M43Q32J258J084L30m50q88j041j094j095r50n50R6P27R89
54524A39514Q56P60J133J821K101J309m02j933k123r60K64L54m82j125j049p24
54508A39314o21o39o48q71j283j316n82N13J299J590J531J126M35j17j12L33P88
54491A40740J074J160Q30l3r72j307r96o45o03n31J2R09J609J784J581J353J240
54474A47205J118Q86P15P88R55Q69N31L77P02J280J688J782J579J050K75m14q09
54457A60577j129j620j956j580n34M06O19K71m7j8K31M47M51J60l36p24o68k27
54439A54323J60J50j12l03m27p32j125j171p70m02l94l61J69R08J177Q88N52L91
54421A52921J16l92q37j024j079r66m11N08J226J390J165P03r4j016j415j014
$$ plain form
54405 149781 149517 149984 151324 153559 155850 156908 156423 155419 154949 155103 155647 156872 159069 161662 163623 164602
54389 164602 164985 164972 164298 163003 161872 161730 162542 163500 163874 163607 163146 162881 162792 162585 162087 161479 161172 161517 162509
54370 162509 163650 164186 163775 162953 162689 163386 164535 165458 166117 166922 168038 169229 170308 171332 172291 172908 172949
54353 172949 172582 172263 172303 172666 173076 173188 172690 171458 169760 168185 167164 166556 165897 165011 164165 163567 163077 162541
54335 162541 162052 161550 160524 158637 156528 155377 155618 156532 157192 157266 156768 155696 154357 153568 153871 154778 155344
54318 155344 155373 155490 156060 156632 156658 156232 155805 155491 155077 154558 154234 154309 154658 155068 155436 155669 155564 154960 153885
54299 153885 152455 150746 148954 147539 146959 147220 147901 148639 149420 150373 151554 153005 154713 156314 157160 157031
54283 157031 156571 156593 157026 156961 155851 154280 153328 153427 154035 154296 153817 152885 152104 151858 152013 152135 152004 151852 152054
$$ packed form
54405A49781k64M67J340K235K291J058m85j004m70J54N44J225K197K593J961R79
54389A64602L83j3o74j295j131j42Q12R58L74k67m61k65q9k07m98o08l07L45R92
54370A62509J141N36m11q22k64O97J149R23O59Q05J116J191J079J024R59O17M1
54353A72949l67l19M0L63M10J12m98j232j698j575j021o08o59q86q46n98m90n36
54335A62541m89n02j026j887k109j151K41R14O60P4m98j072j339p89L03R07N66
54318A55344K9J17N70N72K6m26m27l14m14n19l24P5L49M10L68K33j05o04j075
54299A53885j430j709j792j415n80K61O81P38P81R53J181J451J708J601Q46j29
54283A57031m60K2M33o5j110j571r52R9O08K61m79r32p81k46J55J22j31j52K02
$$ plain form
54264 152054 152577 152893 152530 151671 151090 151390 152488 153991 155859 158309 161066 163238 164167 164117 163851 163789 163795 163471
54246 163471 162403 160445 158212 156949 157343 158592 159127 158236 156544 155070 154381 154584 155452 156388 156846 156986
54230 156986 157411 158123 158313 157498 156332 155853 156269 156956 157397 157697 158234 159104 160027 160684 161187 162061 163560 165094
54212 165094 165753 165356 164490 163501 162074 160133 158486 158048 158745 159666 160038 159685 158775 157623 156596 155860 155321
54195 155321 155007 155206 155897 156399 156062 155037 153899 152801 151565 150420 149886 149933 149912 149496 149099 149173 149617 150210
54177 150210 151111 152507 154016 154910 154836 154025 152887 151733 150858 150522 150620 150528 149508 147429 145066 143557 143438
54160 143438 144206 144893 145104 145370 146439 148317 150189 151287 151643 151848 152221 152549 152631 152622 152616 152319 151580 150969 151232
54141 151232 152244 153123 153452 153739 154421 155050 154959 154277 153784 154003 154917 156299 157795 158812 158886 158214 157409 156766
$$ packed form
54264A52054N23L16l63q59n81L00J098J503J868K450K757K172R29n0k66o2Ol24
54246A63471j068j958k233j263L94J249N35q91j692j474o89K03Q68R36M58J40
54230A56986M25P12J90q15j166m79M16O87M41L00N37Q70R23O57N03Q74J499J534
54212A65094O59l97q66r89j427j941j647m38O97R21L72l53r10j152j027p36n39
54195A55321l14J99O91N02l37j025j138j098j236j145n34M7k1m16l97P4M44N93
54177A50210R01J396J509Q94p4q11j138j154q75l36R8r2j020k079k363j509j19
54160A43438P68O87K11K66J069J878J872J098L56K05L73L28Q2rok97p39o11K63
54141A51232J012Q79L29K87O82O29r1o82m93K19R14J382J496J017P4o72q05o43
$$ plain form
54123 156766 156139 155528 155273 155497 155799 155762 155546 155706 156573 157973 159536 161052 162507 163866 164971 165720 166249
54106 166249 166738 167076 166885 165992 164673 163398 162525 162344 163043 164361 165531 165885 165484 164952 164823 165245 166058
54089 166058 166849 167099 166672 166131 166233 167147 168402 169612 170926 172734 175197 178205 181618 185401 189521 193772
54073 193772 197868 201893 206495 212218 218535 223978 227392 228661 228066 225583 221345 216214 211159 206345
54059 206345 201552 197204 194146 192468 191370 190254 189214 188294 187168 185890 185203 185610 186650 187602 188459
54044 188459 189725 191637 194100 197122 200780 204896 209128 213293 217323 221129 224869 229074 234047 239234
54030 239234 243643 246947 249769 252889 256526 260424 264240 267617 270189 271816 272808 273710 274886 276304 277652
54015 277652 278542 278654 277828 276155 274017 272028 270781 270511 270903 271283 271136 270562 270201 270565 271381 271655 270412
$$ packed form
54123A56766o27o11k55K24L02l7k16J60Q67J400J563J516J455J359J105P49N29
54106A66249M89L38j91q93j319j275q73j81O99J318J170L54m01n32j29M22Q13
54089A66058P91K50m27n41J02R14J255J210J314J808K463L008L413L783M120M251
54073A93772M096M025M602N723O317N443L414J269n95k483m238n131n055m814
54059B06345m793m348l058j678j098j116j040r20j126j278o87M07J040R52Q57
54044A88459J266J912K463L022L658M116M232M165M030L806L740M205M973N187
54030B39234M409L304K822L120L637L898L816L377K572J627R92R02J176J418J348
54015B77652Q90J12q26j673k138j989j247k70L92L80j47n74l61L64Q16K74j243
$$ plain form
53998 270412 267334 262801 257553 252366 247687 243317 238679 233684 229160 226012 224054 222141 219545 216758
53984 216758 214709 213529 212432 210718 208557 206708 205609 204898 203923 202618 201598 201243 201016 200067 198373
53969 198373 196792 195969 195647 195271 194856 194884 195555 196501 197199 197474 197558 197811 198385 199160 199958 200733 201476 202085 202594
53950 202594 203446 205216 207958 211071 213877 216074 217658 218785 219891 221648 224527 228527 233404 238912
53936 238912 244757 250689 256898 264031 272529 282148 292369 303000 314073 325489 337201 349503 362492
53923 362492 375136 385375 391405 392788 390401 385721 380194 374905 370480 367312 365799 366058 367457 368857
53909 368857 369643 370237 371323 372755 373605 373190 371682 369705 367687 365696 363584 361061 357801 353731 349175
53894 349175 344549 340003 335502 331085 326740 322061 316417 309688 302626 296232 290850 286008 281095 276004
$$ packed form
53998B70412l078m533n248n187m679m370m638m995m524l148j958j913k596k787
53984B16758k049j180j097j714k161j849j099p11r75j305j020l55k27r49j694
53969A98373j581q23l22l76m15K8O71R46O98K75Q4K53N74P75P98P75P43O09N09
53950B02594Q52J770K742L113K806K197J584J127J106J757K879M000M877N508
53936B38912N845N932O209P133Q498R619J0221J0631J1073J1416J1712J2302J2989
53923C62492J2644J0239O030J383k387m680n527n289m425l168j513K59J399J400
53909C68857P86N94J086J432Q50m15j508j977k018j991k112k523l260m070m556
53894C49175m626m546m501m417m345m679n644o729p062o394n382m842m913n091
$$ plain form
53880 276004 271085 266625 262516 258467 254466 250884 248001 245543 242927 239917 236792 233853 231094 228455
53866 228455 226056 223908 221708 219296 217119 215842 215546 215679 215775 215916 216402 217272 218274 219116 219661 219996 220330
53849 220330 220729 220996 220899 220441 219719 218675 217220 215566 214096 212941 211949 211077 210477 210134 209694 208799 207454
53832 207454 205967 204633 203512 202420 201194 200056 199578 200047 200958 201476 201403 201406 202229 203884 205635 206637 206614
53815 206614 206137 206163 207156 208793 210716 213275 217058 221883 226780 230942 234216 236764 238883 241254 244698
53800 244698 249364 254561 259566 264158 268259 271664 274510 277514 281291 285646 289778 292949 294777 295285
53786 295285 294942 294348 293658 292630 291325 290197 289232 287599 284674 280937 277284 273843 270138 266201 262731
53771 262731 260076 257615 254349 249861 244595 239449 235170 231976 229644 227851 226329 224789 223051 221263
$$ packed form
53880B76004m919m460m109m049m001l582k883k458k616l010l125k939k759k639
53866B28455k399k148k200k412k177j277k96J33R6J41M86Q70J002Q42N45L35L34
53849B20330L99K67r7m58p22j044j455j654j470j155r92q72o00l43m40q95j345
53832B07454j487j334j121j092j226j138m78M69R11N18p3LQ23J655J751J002k3
53815B06614m77K6R93J637J923K559L783M825M897M162L274K548K119K371L444
53800B44698M666N197N005M592M101L405K846L004L777M355M132L171J828N08
53786B95285l43n94o90j028j305j128r65j633k925l737l653l441l705l937l470
53771B62731k655k461l266m488n266n146m279l194k332j793j522j540j738j788
$$ plain form
53757 221263 219622 217893 215687 213300 211623 210936 210462 209523 208507 208109 208207 208171 207856 207517 207113 206463 205864
53740 205864 205752 205948 206005 206113 206804 207857 208431 208397 208601 209595 210986 212380 214128 216601 219353 221662 223474
53723 223474 225232 227062 228663 229916 231116 232606 234435 236387 238231 240016 242111 244753 247480 249340
53709 249340 249907 249942 250822 253324 256996 260635 263405 265617 268357 272172 276300 279538 281745 283980 287093
53694 287093 290810 294402 297711 301051 304379 307140 308934 310001 310975 312227 313442 313834 312918 311064 309085
53679 309085 307295 305359 303174 301385 300636 300632 300463 299730 298804 298008 297120 295994 295178 295339 296169 296389 295070
53662 295070 292621 290192 288408 287075 285945 285177 284935 285037 285271 285689 286313 286908 287358 287917 288673 289092 288612
53645 288612 287476 286476 286021 285993 286403 287537 289431 291743 294183 296524 298152 298336 297214 295983 295764 296694
$$ packed form
53757B21263j641j729k206k387j677o87m74r39j016l98R8l6l15l39m04o50n99
53740B05864j12J96N7J08O91J053N74l4K04R94J391J394J748K473K752K309J812
53723B23474J758J830J601J253J200J490J829J952J844J785K095K642K727J860
53709B49340N67L5Q80K502L672L639K770K212K740L815M128L238K207K235L113
53694B87093L717L592L309L340L328K761J794J067R74J252J215L92r16j854j979
53679C09085j790j936k185j789p49mj69p33r26p96q88j126q16J61Q30K20j319
53662B95070k449k429j784j333j130p68k42J02K34M18O24N95M50N59P56M19m80
53645B88612j136j000m55k8M10J134J894K312K440K341J628J84j122j231k19R30
$$ plain form
53629 296694 298387 300764 304024 308079 312451 316563 319913 322241 323836 325468 327743 330676 334048 337857
53615 337857 342156 346734 351385 356289 361770 367780 373961 380172 386639 393567 400784 407845 414320 420036
53601 420036 425054 429385 432688 434434 434532 433691 432967 432924 433267 433214 432190 430220 427729 425060 422354 419890
53585 419890 418099 416932 415495 412902 409418 406223 404062 402624 401249 399623 397632 395259 392906 391225
53571 391225 390223 389052 387155 385108 383871 383610 383757 383774 383369 382404 381309 381158 382585 384749 386174 386470
53555 386470 386501 386944 387551 387954 388312 388848 389466 390248 391758 394303 397297 399884 401998 404363 407608 411706
53539 411706 416154 420388 424115 427591 431546 436574 442610 449171 456064 463590 472093 481617 492098 503599
53525 503599 516110 529277 542611 555965 569561 583540 597761 612223 627396 643853 661695
$$ packed form
53629B96694J693K377L260M055M372M112L350K328J595J632K275K933L372L809
53615C37857M299M578M651M904N481O010O181O211O467O928P217P061O475N716
53601D20036N018M331L303J746R8q41p24m3L43n3j024j970k491k669k706k464
53585D19890j791j167j437k593l484l195k161j438j375j626j991k373k353j681
53571C91225j002j171j897k047j237k61J47J7m05r65j095j51J427K164J425K96
53555C86470L1M43O07M03L58N36O18P82J510K545K994K587K114K365L245M098
53539D11706M448M234L727L476L955N028O036O561O893P526Q503R524J0481J1501
53525E03599J2511J3167J3334J3354J3596J3979J4221J4462J5173J6457J7842
$$ plain form
53514 661695 680638 700573 721626 743667 766282 789452 813833 839951 867352 894903 921833
53503 921833 948185 974388 1000695 1026970 1052707 1077332 1100780 1123736 1146963 1170426 1193440
53492 1193440 1215650 1237444 1259281 1281043 1302343 1323121 1343538 1363418 1382203 1399587 1415945
53481 1415945 1432032 1448451 1465492 1483237 1501428 1519221 1535390 1549087 1560338 1569642 1577139 1582377
53469 1582377 1584825 1584347 1581175 1575630 1567917 1557970 1545501 1530502 1513714 1496249 1478610 1460366 1440935
53456 1440935 1420278 1398680 1376226 1352874 1328770 1304151 1279207 1254330 1230185 1207126 1184800
53445 1184800 1162724 1140997 1119994 1099723 1080212 1062295 1047149 1034888 1024386 1014773 1006448 1000257
53433 1000257 996228 993662 992123 991791 992965 995693 999883 1005441 1012187 1019875 1028448 1038269 1050056 1064438
$$ packed form
53514F61695J8943J9935K1053K2041K2615K3170K4381K6118K7401K7551K6930
53503I21833K6352K6203K6307K6275K5737K4625K3448K2956K3227K3463K3014
53492A193440K2210K1794K1837K1762K1300K0778K0417J9880J8785J7384J6358
53481A415945J6087J6419J7041J7745J8191J7793J6169J3697J1251R304P497N238
53469A582377K448m78l172n545p713r947j2469j4999j6788j7465j7639j8244j9431
53456A440935k0657k1598k2454k3352k4104k4619k4944k4877k4145k3059k2326
53445A184800k2076k1727k1003k0271j9511j7917j5146j2261j0502r613q325o191
53433A000257m029k566j539l32J174K728M190N558O746P688Q573R821J1787J4382
$$ plain form
53419 1064438 1081464 1100565 1121116 1142950 1166129 1190420 1215388 1241034 1267865 1296206 1325810
53408 1325810 1356408 1388343 1422360 1458925 1498006 1539360 1582836 1628452 1676384 1726750 1779318
53397 1779318 1833589 1889301 1946668 2005844 2066311 2127037 2187293 2247232 2307670 2369302 2431903
53386 2431903 2494191 2554626 2612514 2668150 2721787 2772795 2820139 2863472 2903310 2940199 2974028
53375 2974028 3004225 3030260 3051877 3069060 3081905 3090329 3093719 3090918 3080670 3062101 3034896 2999287
53363 2999287 2956047 2906431 2851964 2794143 2734140 2672598 2609678 2545425 2480178 2414620 2349459
53352 2349459 2285239 2222465 2161811 2103986 2049340 1997547 1947622 1898306 1848669 1798583 1748715
53341 1748715 1700075 1653501 1609444 1567975 1528886 1491911 1457085 1424874 1395812 1369994 1347107
$$ packed form
53419A064438J7026J9101K0551K1834K3179K4291K4968K5646K6831K8341K9604
53408A325810L0598L1935L4017L6565L9081M1354M3476M5616M7932N0366N2568
53397A779318N4271N5712N7367N9176O0467O0726O0256N9939O0438O1632O2601
53386B431903O2288O0435N7888N5636N3637N1008M7344M3333L9838L6889L3829
53375B974028L0197K6035K1617J7183J2845Q424L390k801j0248j8569k7205l5609
53363B999287m3240m9616n4467n7821o0003o1542o2920o4253o5247o5558o5161
53352B349459o4220o2774o0654n7825n4646n1793m9925m9316m9637n0086m9868
53341A748715m8640m6574m4057m1469l9089l6975l4826l2211k9062k5818k2887
$$ plain form
53330 1347107 1326966 1309715 1295310 1283007 1271728 1260913 1250671 1240990 1231115 1220084 1207846 1195613
53318 1195613 1184947 1176490 1169621 1163360 1157499 1152716 1149643 1148170 1147850 1148726 1151289 1155727 1161631 1168551
53304 1168551 1176441 1185479 1195839 1207807 1221684 1237292 1253963 1271357 1290015 1310795 1334024 1359497
53292 1359497 1386906 1415841 1445699 1476108 1507179 1538838 1570175 1600023 1627959 1654097 1678181
53281 1678181 1699709 1718898 1736583 1752995 1767317 1778627 1786451 1790242 1789298 1783776 1775066 1764471
53269 1764471 1752014 1737035 1719392 1699374 1676933 1651814 1624267 1594985 1564364 1532260 1498328
53258 1498328 1462303 1424317 1385357 1347014 1310163 1274249 1238413 1202911 1168670 1135857 1103902
53247 1103902 1072761 1043064 1014801 986894 958471 929881 902027 875306 849560 824555 800121
$$ packed form
53330A347107k0141j7251j4405j2303j1279j0815j0242r681r875j1031j2238j2233
53318A195613j0666q457o869o261n861m783l073j473l20Q76K563M438N904O920
53304A168551P890R038J0360J1968J3877J5608J6671J7394J8658K0780K3229K5473
53292A359497K7409K8935K9858L0409L1071L1659L1337K9848K7936K6138K4084
53281A678181K1528J9189J7685J6412J4322J1310P824L791r44n522q710j0595
53269A764471j2457j4979j7643k0018k2441k5119k7547k9282l0621l2104l3932
53258A498328l6025l7986l8960l8343l6851l5914l5836l5502l4241l2813l1955
53247A103902l1141k9697k8263k7907k8423k8590k7854k6721k5746k5005k4434
$$ plain form
53236 800121 776267 753459 732404 713314 695831 679876 665918 654077 643555 633484 623856 615064
53224 615064 606963 598976 590741 582057 572480 561689 550104 538507 527116 515622 504047 492874
53212 492874 482302 472046 462056 452797 444524 436765 428963 421278 414323 408261 402533 396498 390101 383838
53198 383838 378143 372857 367338 361088 354200 347132 340202 333493 327107 321208 315836 310935 306523 302619
53184 302619 299059 295742 293019 291417 290855 290508 289598 288050 286204 284263 282255 280266 278402 276667 275099
53169 275099 273831 272826 271752 270344 268685 266924 264965 262748 260656 259251 258639 258394 258043 257447 256773
53154 256773 256382 256629 257445 258181 258186 257562 257046 257133 257579 257771 257242 255803 253553 250967 248757 247415 246997 247298
53136 247298 248055 248923 249563 249947 250404 251231 252409 253752 255141 256486 257663 258607 259317 259677 259494 258843 258191
$$ packed form
53236H00121k3854k2808k1055j9090j7483j5955j3958j1841j0522j0071r628q792
53224F15064q101p987q235q684r577j0791j1585j1597j1391j1494j1575j1173
53212D92874j0572j0256r990r259q273p759p802p685o955o062n728o035o397o263
53198C83838n695n286n519o250o888p068o930o709o386n899n372m901m412l904
53184C02619l560l317k723j602n62l47r10j548j846j941k008j989j864j735j568
53169B75099j268j005j074j408j659j761j959k217k092j405o12k45l51n96o74
53154B56773l91K47Q16P36No24n16Q7M46J92n29j439k250k586k210j342m18L01
53136B47298P57Q68O40L84M57Q27J178J343J389J345J177R44P10L60j83o51o52
$$ plain form
53119 258191 258040 258552 259596 260908 262065 262570 262243 261411 260543 259838 259272 258842 258509 258082 257430 256678 255991 255281
53101 255281 254364 253295 252304 251445 250542 249412 248016 246479 245096 244163 243600 242934 241832 240499 239313 238412
53085 238412 237886 238027 238833 239554 239399 238652 238411 239198 240475 241663 242888 244383 245820 246789 247455 248131 248526
53068 248526 248029 246603 244824 243091 241307 239365 237507 236019 234854 233705 232360 230931 229887 229739 230569
53053 230569 231915 233314 234767 236417 237943 238730 238667 238326 238241 238354 238344 238158 237890 237363 236240 234553 232845
53036 232845 231634 230876 230087 228999 228001 227784 228592 229890 230891 231224 230969 230280 229416 229060 230049 232448 235238
53019 235238 237217 238063 238230 238126 237834 237525 237531 237842 238013 237823 237729 238359 239799 241569 243110 244034 244185 243871
53001 243871 243856 244645 245776 246242 245693 244805 244364 244379 244325 243848 242936 241709 240439 239635 239748 240859 242849 245653
$$ packed form
53119B58191j51N12J044J312J157N05l27q32q68p05n66m30l33m27o52p52o87p10
53101B55281r17j069r91q59r03j130j396j537j383r33n63o66j102j333j186r01
53085B38412n26J41Q06P21j55p47k41P87J277J188J225J495J437R69O66O76L95
53068B48526m97j426j779j733j784j942j858j488j165j149j345j429j044j48Q30
53053B30569J346J399J453J650J526P87o3l41q5J13j0j86k68n27j123j687j708
53036B32845j211p58p89j088r98k17Q08J298J001L33k55o89q64l56R89K399K790
53019B35238J979Q46J67j04k92l09OL11J71j90r4O30J440J770J541R24J51l14
53001B43871j5P89J131M66n49q88m41J5n4m77r12j227j270q04J13J111J990K804
$$ plain form
52983 245653 249001 252109 254093 254754 254652 254505 254829 256033 258256 260965 263216 264598 265651 267185 269454
52968 269454 272237 275342 278701 282121 285202 287423 288239 287427 285544 283709 282552 281597 279944 277331 274124
52953 274124 270618 266988 263794 261766 260866 260114 258659 256576 254293 251731 248588 245245 242709 241540 241273
52938 241273 241111 240778 240457 240184 239767 239279 239191 239809 240781 241384 241186 240228 238718 236872 235060 233785 233293 233401
52920 233401 233823 234473 235256 235852 236026 236055 236475 237364 238190 238438 238142 237707 237468 237537 237814 237974 237653 236850 236037
52901 236037 235668 235710 235823 235828 235774 235701 235686 236062 237185 238822 240113 240391 239839 239142 238688 238400 238160 238009 237847 237316
52881 237316 236254 235056 234350 234350 234706 234987 235088 235175 235411 235900 236765 238088 239767 241585 243502 245702 248219
52864 248219 250623 252335 253304 254136 255371 256733 257332 256584 254725 252474 250411 248783 247643 246928 246472 246027
$$ packed form
52983B45653L348L108J984O61j02j47L24J204K223K709K251J382J053J534K269
52968B69454K783L105L359L420L081K221Q16q12j883j835j157r55j653k613l207
52953B74124l506l630l194k028r00p52j455k083k283k562l143l343k536j169k67
52938B41273j62l33l21k73m17m88q8O18R72O03j98r58j510j846j812j275m92J08
52920B33401M22O50P83N96J74K9M20Q89Q26K48k96m35k39O9K77J60l21q03q13
52901B36037l69M2J13Nn4p3j5L76J123J637J291K78n52o97m54k88k40j51j62n31
52881B37316j062j198p06%L56K81J01Q7K36M89Q65J323J679J818J917K200K517
52864B48219K404J712R69Q32J235J362N99p48j859k251k063j628j140p15m56m45
$$ plain form
52848 246027 245276 243837 241477 238505 235815 234322 234286 235187 236109 236241 235259 233465 231523 229913 228724 227932
52832 227932 227560 227375 226825 225692 224535 224026 224054 224057 224083 224746 226041 226972 226758 225801 224999 224556 224034 223241 222464
52813 222464 222033 222181 223241 225376 228089 230500 232220 233583 234894 235836 235811 234609 232563 230190 227869
52798 227869 225747 223850 222293 221321 220974 220781 220043 218600 217183 216841 217995 220010 221701 222314 222109 221970
52782 221970 222439 223317 224231 225234 226523 227827 228590 228762 228970 229758 230942 231857 231972 231189 229863 228698 228332
52765 228332 228708 229003 228362 226699 224686 223115 222357 222270 222476 222768 223318 224357 225663 226665 227162 227612 228511
52748 228511 229759 230963 232096 233482 235216 236994 238501 239586 240103 239995 239688 240003 241436 243658 245882
52733 245882 247533 248446 248727 248762 249255 250916 253952 257908 261918 265058 266643 266527 265179 263306 261299 259124
$$ packed form
52848B46027p51j439k360k972k690j493l6R01R22J32r82j794j942j610j189p92
52832B27932l72j85n50j133j157n09K8LK6O63J295R31k14r57q02m43n22p93p77
52813B22464m31J48J060K135K713K411J720J363J311R42k5j202k046k373k321
52798B27869k122j897j557r72l47j93p38j443j417l42J154K015J691O13k05j39
52782B21970M69Q78R14J003J289J304P63J72K08P88J184R15J15p83j326j165l66
52765B28332L76K95o41j663k013j571p58q7K06K92N50J039J306J002M97M50Q99
52748B28511J248J204J133J386J734J778J507J085N17j08l07L15J433K222K224
52733B45882J651R13K81L5M93J661L036L956M010L140J585j16j348j873k007k175
$$ plain form
52717 259124 256643 253880 250992 248244 246077 244893 244571 244344 243399 241572 239353 237357 235966 235302 235205 235192
52701 235192 234752 233822 232826 232142 231679 231155 230654 230642 231378 232555 233707 234895 236615 238954 241091 242063 241876
52684 241876 241422 241243 240962 240215 239507 239457 239637 239023 237545 236321 236130 236471 236573 236578 237076 237961 238514 238416 237987
52665 237987 237498 236899 236328 236310 237214 238802 240455 241672 242371 242932 243981 245834 248175 250497 252713 255011
52649 255011 257098 258111 257447 255423 252977 250918 249507 248475 247343 245933 244607 243854 243661 243599 243475 243504
52633 243504 243800 244100 244177 244147 244248 244662 245723 247829 250850 253928 256243 257684 258451 258406 257308 255524 253924
52616 253924 253008 252534 252046 251432 250822 250245 249580 248753 247911 247440 247729 248732 249840 250383 250316 250240 250709 251674 252652
52597 252652 253314 253833 254650 255933 257270 258082 258324 258566 259178 259747 259634 259001 258785 259549 260793 261627 261840 261975
$$ packed form
52717B59124k481k763k888k748k167j184l22k27r45j827k219j996j391o64r7j3
52701B35192m40r30r96o84m63n24n01j2P36J177J152J188J720K339K137R72j87
52684B41876m54j79k81p47p08n0J80o14j478j224j91L41J02NM98Q85N53r8m29
52665B37987m89n99n71j8R04J588J653J217O99N61J049J853K341K322K216K298
52649B55011K087J013o64k024k446k059j411j032j132j410j326p53j93o2j24K9
52633B43504K96L00P7l0J01M14J061K106L021L078K315J441P67m5j098j784j600
52616B53924r16m74m88o14o10n77o65q27q42m71K89J003J108N43o7p6M69R65R78
52597B52652O62N19Q17J283J337Q12K42K42O12N69j13o33k16P64J244Q34K13J35
$$ plain form
52579 261975 262507 263339 264120 264716 265200 265561 265653 265385 264761 263721 262129 260072 258045 256686 256313 256753 257518
52562 257518 257989 257555 255928 253495 251217 249974 249995 250922 252229 253496 254424 254830 254667 253980 252873 251539
52546 251539 250233 249133 248293 247752 247552 247593 247635 247536 247403 247386 247518 247866 248670 250071 251828 253526 254980 256199
52528 256199 257093 257508 257462 257009 255907 253928 251643 250409 251169 253438 255848 257559 258798 260058 261273 262043
52512 262043 262324 262510 262892 263437 264250 265894 268854 272677 276046 277921 278467 278653 279072 279376 278806 276940 273906
52495 273906 270222 266724 264406 263891 264919 266484 267592 267834 267321 266321 265101 263953 263112 262626 262397 262298
52479 262298 262228 262124 262143 262716 264173 266243 268212 269640 270660 271440 271732 271309 270636 270555 271370 272678 274169
52462 274169 276070 278635 281608 284572 287420 290072 291927 292194 290787 288518 286277 284275 282139 279474
$$ packed form
52579B61975N32Q32P81N96M84L61R2k68o24j040j592k057k027j359l73M40P65
52562B57518M71m34j627k433k278j243K1R27J307J267R28M06j63o87j107j334
52546B51539j306j100q40n41k00M1M2r9j33j7J32L48Q04J401J757J698J454J219
52528B56199Q94M15m6m53j102j979k285j234P60K269K410J711J239J260J215P70
52512B62043K81J86L82N45Q13J644K960L823L369J875N46J86M19L04n70j866l034
52495B73906l684l498k318n15J028J565J108K42n13j000j220j148q41m86k29r9
52479B62298p0j04J9N73J457K070J969J428J020P80K92m23o73q1Q15J308J491
52462B74169J901K565K973K964K848K652J855K67j407k269k241k002k136k665
$$ plain form
52448 279474 276216 272682 269485 267234 266086 265622 265266 264810 264402 264096 263567 262365 260388 258049 255972 254529
52432 254529 253652 253009 252323 251537 250802 250362 250421 251066 252242 253739 255170 256064 256205 255918 255902 256649 258147 260168
52414 260168 262688 265852 269615 273737 278214 283558 290470 299221 309417 320400 331775 343343 354383
52401 354383 363199 367787 367187 362165 354528 345909 337212 328821 320883 313416 306528 300608 296113 293050
52387 293050 290917 289257 288083 287599 287701 288018 288337 288772 289504 290595 292092 294095 296567 299198 301648 303850
52371 303850 305996 308375 311352 315313 320250 325405 329731 332893 335509 338188 340649 342129 342407 341955 341199
52356 341199 340165 338941 338023 337935 338718 339962 341135 341849 342123 342519 343663 345525 347455 349094 350822 353123
52340 353123 356000 359434 363927 369897 376755 383351 389307 395302 401920 408950 416122 423920 433071 443545
$$ packed form
52448B79474l258l534l197k251j148m64l56m56m08l06n29j202j977k339k077j443
52432B54529q77o43o86p86p35m40N9O45J176J497J431Q94J41k87j6P47J498K021
52414B60168K520L164L763M122M477N344O912Q751J0196J0983J1375J1568J1040
52401C54383Q816M588o00n022p637q619q697q391p938p467o888n920m495l063
52387B93050k133j660j174m84J02L17L19M35P32J091J497K003K472K631K450K202
52371C03850K146K379K977L961M937N155M326L162K616K679K461J480K78m52p56
52356C41199j034j224r18q8P83J244J173P14K74L96J144J862J930J639J728K301
52340C53123K877L434M493N970O858O596N956N995O618P030P172P798R151J0474
$$ plain form
52326 443545 454630 465984 478170 492034 507819 524933 542402 559457 575889 592017 608290
52315 608290 624799 641170 656970 672180 687152 702141 717067 731858 746781 762102 777491
52304 777491 792190 805888 819072 832260 845202 857217 868107 878264 887877 896465 903300 907951
52292 907951 910318 910431 908420 904501 898822 891480 882824 873549 864306 855343 846721 838738 831878 826347
52278 826347 821960 818620 816731 816935 819446 823821 829376 835684 842619 850149 858375 867629 878137 889469
52264 889469 900669 911143 921220 931635 942660 953975 965155 975985 986432 996740 1007438
52253 1007438 1018819 1030315 1040773 1049555 1057073 1064017 1070269 1074804 1076568 1075313 1071657 1066477 1060235
52240 1060235 1052803 1043925 1033755 1022793 1011382 999504 987151 974633 962364 950450 938681 926908
$$ packed form
52326D43545J1085J1354J2186J3864J5785J7114J7469J7055J6432J6128J6273
52315F08290J6509J6371J5800J5210J4972J4989J4926J4791J4923J5321J5389
52304G77491J4699J3698J3184J3188J2942J2015J0890J0157R613Q588O835M651
52292I07951K367J13k011l919n679p342q656r275r243q963q622p983o860n531
52278H26347m387l340j889K04K511M375N555O308O935P530Q226R254J0508J1332
52264H89469J1200J0474J0077J0415J1025J1315J1180J0830J0447J0308J0698
52253A007438J1381J1496J0458Q782P518O944O252M535J764j255l656n180o242
52240A060235p432q878j0170j0962j1411j1878j2353j2518j2269j1914j1769j1773
$$ plain form
52228 926908 915357 904542 894885 886419 878868 872081 866235 861506 857696 854484 851995 850762 851021 852348
52214 852348 854151 856271 858871 862017 865649 869876 874861 880376 885706 890165 893617 896442 899129 901976
52200 901976 905084 908365 911523 914191 916282 918133 920219 922779 925871 929675 934352 939570 944528 948676
52186 948676 952098 954912 956661 956727 955154 952531 949127 944598 938567 931071 922395 912986 903660 895384 888548
52171 888548 882789 877716 873400 869901 866801 863801 861488 860892 862242 864677 867309 870126 873574 877570
52157 877570 881307 884060 885860 887276 888757 890407 892277 894463 896728 898414 899095 899183 899548 900619 902196
52142 902196 904024 906062 908108 909718 910720 911415 912026 912365 912475 913273 916021 921196 928207 936242 945167
52127 945167 955652 968633 984604 1003218 1023580 1045038 1067579 1091411 1116330 1141766 1167271
$$ packed form
52228I26908j1551j0815r657q466p551o787n846m729l810l212k489j233K59J327
52214H52348J803K120K600L146L632M227M985N515N330M459L452K825K687K847
52200I01976L108L281L158K668K091J851K086K560L092L804M677N218M958M148
52186I48676L422K814J749O6j573k623l404m529o031p496q676r409r326q276o836
52171H88548n759n073m316l499l100l000k313n96J350K435K632K817L448L996
52157H77570L737K753J800J416J481J650J870K186K265J686O81Q8L65J071J577
52142I02196J828K038K046J610J002O95O11L39J10P98K748N175P011Q035Q925
52127I45167J0485J2981J5971J8614K0362K1458K2541K3832K4919K5436K5505
$$ plain form
52116 1167271 1192725 1218091 1243149 1267448 1290424 1311746 1331645 1350708 1369026 1385792 1399985
52105 1399985 1411313 1420168 1426879 1431510 1434387 1436302 1437973 1439519 1440571 1440590 1438960 1435113 1428878 1420590
52091 1420590 1410611 1398816 1384809 1368637 1351062 1333044 1315154 1297664 1281052 1266066 1253228
52080 1253228 1242567 1233996 1227638 1223471 1220946 1219513 1219445 1221540 1225919 1231725 1238253 1245836 1255150 1266139
52066 1266139 1278154 1290888 1304543 1319171 1334302 1349159 1362881 1374775 1384821 1393856 1402771 1411635
52054 1411635 1419969 1427620 1434602 1440169 1442966 1442479 1439657 1435674 1430559 1423480 1413926 1402066 1388283 1372961
52040 1372961 1356664 1340023 1323390 1306898 1290804 1275446 1260869 1246869 1233468 1221038 1209786
52029 1209786 1199278 1188671 1177370 1165397 1153159 1140950 1128665 1115970 1102777 1089580 1077408
$$ packed form
52116A167271K5454K5366K5058K4299K2976K1322J9899J9063J8318J6766J4193
52105A399985J1328Q855O711M631K877J915J671J546J052J9j630l847o235q288
52091A420590r979j1795j4007j6172j7575j8018j7890j7490j6612j4986j2838
52080A253228j0661q571o358m167k525j433o8K095M379N806O528P583R314J0989
52066A266139J2015J2734J3655J4628J5131J4857J3722J1894J0046R035Q915Q864
52054A411635Q334P651O982N567K797m87k822l983n115p079r554j1860j3783j5322
52040A372961j6297j6641j6633j6492j6094j5358j4577j4000j3401j2430j1252
52029A209786j0508j0607j1301j1973j2238j2209j2285j2695j3193j3197j2172
$$ plain form
52018 1077408 1067278 1059446 1053048 1046665 1039546 1032233 1025753 1020257 1014775 1008304 1000708 992375 983465 973862
52004 973862 963510 952275 939627 925075 909008 892632 876829 861472 846102 830944 816834
51993 816834 804315 793263 783362 774451 766205 757865 748738 738899 729101 719931 711230 702279 692271
51980 692271 680588 667028 652136 637144 623231 610690 598967 587507 576413 566284 557700 551022
51968 551022 546520 544339 544253 545622 547826 550769 554843 560316 566824 573501 579515 584351 587677 589226 588908
51953 588908 586915 583589 579225 574016 568101 561672 555158 549320 544928 542251 541048 541099 542565 545731 550703
51938 550703 557560 566492 577430 589701 602377 614903 627068 638440 648146 655223 658971 659067 655687
51925 655687 649547 641560 632388 622471 612316 602382 592818 583799 576146 571048 568944 569173 571090 575114
$$ packed form
52018A077408j0130p832o398o383p119p313o480n496n482o471p596q333q910r603
52004I73862j0352j1235j2648j4552j6067j6376j5803j5357j5370j5158j4110
51993H16834j2519j1052r901q911q246q340r127r839r798r170q701q951j0008
51980F92271j1683j3560j4892j4992j3913j2541j1723j1460j1094j0129q584o678
51968E51022m502k181q6J369K204K943M074N473O508O677O014M836L326J549l18
51953E88908j993l326m364n209n915o429o514n838m392k677j203N1J466L166M972
51938E50703O857Q932J0938J2271J2676J2526J2165J1372R706P077L748R6l380
51925F55687o140p987r172r917j0155r934r564r019p653n098k104K29J917M024
$$ plain form
51911 575114 582189 592356 604188 615433 623842 627705 626385 620763 612840 604543 596849 589998 584161
51898 584161 579471 575474 571011 564952 556934 547145 535607 522139 507175 492107 478435 466737 456822
51885 456822 448631 442447 438349 436068 435526 436924 440045 444022 448269 453272 459973 468518 478105 487837
51871 487837 497176 505517 511969 515897 517470 517379 516121 513668 509689 504008 496970 489474 482578 476962 472833
51856 472833 470267 469459 470455 472797 475608 478050 479679 480385 480120 478699 475843 471430 465723 459343 452981
51841 452981 447150 442095 437777 433807 429654 425185 421005 418008 416467 415816 415437 415431 416278 417906 419522 420473
51825 420473 420887 421219 421415 420880 419210 416638 413730 410895 408315 406174 404720 404102 404235 404980 406461 409085
51809 409085 413076 417897 422312 425173 426151 425685 424363 422512 420305 418018 416063 414776 414164 413853 413347
$$ packed form
51911E75114P075J0167J1832J1245Q409L863j320n622p923q297p694o851n837
51898E84161m690l997m463o059q018r789j1538j3468j4964j5068j3672j1698r915
51885D56822q191o184m098k281n42J398L121L977M247N003O701Q545R587R732
51871D87837R339Q341O452L928J573r1j258k453l979n681p038p496o896n616m129
51856D72833k566q08R96K342K811K442J629P06k65j421k856m413n707o380o362
51841D52981n831n055m318l970m153m469m180k997j541o51l79oQ47J628J616R51
51825D20473M14L32J96n35j670k572k908k835k580k141j454o18J33P45J481K624
51809D09085L991M821M415K861R78m66j322j851k207k287j955j287o12l11n06
$$ plain form
51794 413347 412417 411161 409715 408023 405978 403621 401150 398823 396922 395527 394247 392500 390349 388768
51780 388768 388641 389623 390379 389950 388520 386904 385765 385487 386360 388593 392258 397367 403905 411732 420584 430174
51764 430174 440081 449649 458308 466033 473082 479140 483048 483650 480768 475218 468134 460425 452646 445076
51750 445076 437858 431132 424954 419143 413434 407962 403405 400540 399706 400669 402801 405415 408267 411887 417235
51735 417235 424835 434352 444971 455820 465891 474009 479311 481830 482471 482467 482867 484194 486279 488366 489479
51720 489479 488711 485403 479512 472003 464566 458638 454734 452634 451853 451708 451360 450245 448478 446667 445397
51705 445397 445036 445860 448116 451844 456599 461273 464401 465061 463568 461059 458468 456289 455161 455870 458400
51690 458400 461558 463939 464898 464303 462000 458121 453479 448962 444744 440601 436757 433797 431934 430928 430608
$$ packed form
51794D13347r30j256j446j692k045k357k471k327j901j395j280j747k151j581
51780C88768j27R82P56m29j430j616j139k78Q73K233L665N109O538P827Q852R590
51764D30174R907R568Q659P725P049O058L908O02k882n550p084p709p779p570
51750D45076p218o726o178n811n709n472m557k865q34R63K132K614K852L620N348
51735D17235P600R517J0619J0849J0071Q118N302K519O41mM00J327K085K087J113
51720D89479p68l308n891p509p437n928l904k100p81j45l48j115j767j811j270
51705D45397l61Q24K256L728M755M674L128O60j493k509k591k179j128P09K530
51690D58400L158K381R59n95k303l879m642m517m218m143l844k960j863j006l20
$$ plain form
51675 430608 430921 431599 432335 433242 434595 436275 438049 440342 444066 449679 456969 465720 475740 485982 494438
51660 494438 499441 500723 498891 494361 487379 478909 470967 465864 465093 468712 475665 484652 494637 504464
51646 504464 512375 516515 515970 511002 502321 490666 477089 463002 449551 437241 426317 417074 409585
51633 409585 403544 398715 395142 392730 391035 389874 389745 391176 393819 396581 398471 399032 398188 396164 393518
51618 393518 390921 388852 387649 387617 388709 390205 391134 391085 390422 389726 389265 388963 388611 388073 387479 387228 387658 388757
51600 388757 390391 392776 396471 401880 408919 417160 426073 435035 443279 449951 454231 455490 453579 449077
51586 449077 443132 436950 431404 427083 424454 423828 425240 428608 434076 442133 453294 467668 484798 503800
51572 503800 523561 542955 561266 578590 595605 612615 628814 642749 653600 661974 669579 678397
$$ packed form
51675D30608L13O78P36R07J353J680J774K293L724N613P290Q751J0020J0242Q456
51660D94438N003J282j832m530o982q470p942n103p71L619O953Q987R985R827
51646E04464P911M140n45m968q681j1655j3577j4087j3451j2310j0924r243p489
51633D09585o041m829l573k412j695j161j29J431K643K762J890N61q44k024k646
51618C93518k597k069j203l2J092J496R29m9o63o96m61l02l52n38n94k51M30J099
51600C88757J634K385L695N409P039Q241Q913Q962Q244O672M280J259j911m502
51586D49077n945o182n546m321k629o26J412L368N468Q057J1161J4374J7130J9002
51572E03800J9761J9394J8311J7324J7015J7010J6199J3935J0851Q374P605Q818
$$ plain form
51560 678397 690237 706701 729128 758278 793846 834105 876014 916013 951104 979517 1000622
51549 1000622 1014478 1021378 1021566 1015100 1001980 982435 957049 926663 892268 854996 816059 776583
51537 776583 737569 700038 665067 633518 605676 581144 559142 539043 520751 504599 490930
51526 490930 479853 471311 465017 460182 455693 451003 446691 443711 442171 441246 440267 439379 439006 439165 439643
51511 439643 440522 442076 444182 446069 446734 445670 443225 440212 437069 433498 429142 424444 420432 417645 415619
51496 415619 413494 410839 407865 405173 403363 402498 401835 400466 398392 396536 395559 395038 394055 392220 389844
51481 389844 387467 385515 384088 382735 380723 377859 374772 372118 369775 367173 364124 360990 358245 356228
51467 356228 355066 354458 353764 352749 351988 352077 352620 352545 351339 349573 348253 348099 349380 351927 355247 358953
$$ packed form
51560F78397J1840J6464K2427K9150L5568M0259M1909L9999L5091K8413K1105
51549A000622J3856O900J88o466j3120j9545k5386l0386l4395l7272l8937l9476
51537G76583l9014l7531l4971l1549k7842k4532k2002k0099j8292j6152j3669
51526D90930j1077q542o294m835m489m690m312k980j540r25r79q88l73J59M78
51511D39643Q79J554K106J887O65j064k445l013l143l571m356m698m012k787k026
51496D15619k125k655k974k692j810q65o63j369k074j856r77n21r83j835k376
51481C89844k377j952j427j353k012k864l087k654k343k602l049l134k745k017
51467C56228j162o08o94j015p61Q9N43p5j206j766j320j54J281K547L320L706
$$ plain form
51451 358953 363117 367964 373374 379180 385844 394289 404931 417327 430891 445464 460933 476571 491013
51438 491013 502701 510396 513725 513552 511572 509272 507226 505262 502863 499197 493146 483909 471817 458542
51424 458542 446312 436568 429094 422513 415857 409648 405235 403180 402644 402383 401985 401984 403103 405566 408995
51409 408995 412734 416272 419430 422144 424231 425581 426442 427189 427814 427978 427607 427141 427084 427626 428838 430908
51393 430908 433972 437892 442454 447692 453899 461416 470486 481176 493438 507431 523834 543719 568036
51380 568036 597293 631619 670801 714336 761771 813025 867870 924816 980719 1031789 1075014
51369 1075014 1108786 1132729 1147251 1152978 1150191 1138790 1118826 1090844 1055659 1014198 967796 918287
51357 918287 867435 816499 766633 719356 676114 637499 603396 573743 548588 527412 509122
$$ packed form
51451C58953M164M847N410N806O664Q445J0642J2396J3564J4573J5469J5638J4442
51438D91013J1688P695L329j73j980k300k046j964k399l666o051r237j2092j3275
51424D58542j2230r744p474o581o656o209m413k055n36k61l98jJ119K463L429
51409D08995L739L538L158K714K087J350Q61P47O25J64l71m66n7N42J212K070
51393D30908L064L920M562N238O207P517R070J0690J2262J3993J6403J9885K4317
51380E68036K9257L4326L9182M3535M7435N1254N4845N6946N5903N1070M3225
51369A075014L3772K3943J4522N727k787j1401j9964k7982l5185m1461m6402m9509
51357I18287n0852n0936m9866m7277m3242l8615l4103k9653k5155k1176j8290
$$ plain form
51346 509122 493031 479326 468148 458570 449061 438870 428511 418894 410479 403379 397744 393521 390053
51333 390053 386460 382494 378728 375783 373650 371865 370041 368088 366165 364622 363749 363347 362822 361952 361295
51318 361295 361506 362563 364032 365774 367863 370065 372124 374439 377644 381488 384890 387259 388940 390129
51304 390129 390239 388947 387069 385608 384472 382916 380816 378622 376294 373288 369670 366328 363879 362000
51290 362000 360141 358350 357072 356614 357126 358725 361252 364111 366711 369010 371451 374508 378389 383004 387916
51275 387916 392318 395293 396318 395716 394638 394355 395325 397000 398700 400492 402939 406180 409643 412653 414854
51260 414854 415991 415719 413839 410534 406279 401740 397687 394535 391838 388710 385021 381742 379766 378817 378003
51245 378003 377120 376731 377068 377583 377784 377859 378070 377945 376666 374140 371209 368678 366577 364597 362871 361871
$$ packed form
51346E09122j6091j3705j1178r578r509j0191j0359r617q415p100n635m223l468
51333C90053l593l966l766k945k133j785j824j953j923j543q73m02n25q70o57
51318C61295K11J057J469J742K089K202K059K315L205L844L402K369J681J189
51304C90129J10j292j878j461j136j556k100k194k328l006l618l342k449j879
51290C62000j859j791j278m58N12J599K527K859K600K299K441L057L881M615M912
51275C87916M402K975J025o02j078k83R70J675J700J792K447L241L463L010K201
51260D14854J137k72j880l305m255m539m053l152k697l128l689l279j976r49q14
51245C78003q83l89L37N15K01P5K11j25j279k526k931k531k101j980j726j000
$$ plain form
51229 361871 361645 361615 361267 360708 360293 360053 359833 359820 360454 361816 363465 365018 366531 368163 369770 371113 372315
51212 372315 373832 376055 379116 382966 387372 391790 395516 398139 399831 401152 402561 404052 405192 405523
51198 405523 404983 404008 403166 402691 402350 401766 400799 399505 397751 395072 391220 386864 383397 381765 381614 381836
51182 381836 381754 381472 381215 380917 380602 380700 381573 382972 384310 385328 386222 387186 388141 388967 389799 390975 392718 394864
51164 394864 396903 398454 399754 401450 403765 406094 407702 408677 409837 411716 413975 415827 416719 416552 415600
51149 415600 414462 413838 413980 414322 413860 411930 408572 404211 399228 393956 388887 384638 381618 379832 379054
51134 379054 379043 379474 379849 379785 379453 379434 380037 380980 381919 383020 384737 387223 390313 393993 398399 403223 407509
51117 407509 410371 411863 413005 414957 418133 421955 425369 427760 429450 431248 433478 435628 437005 437529
$$ packed form
51229C61871k26l0l48n59m15k40k20j3O34J362J649J553J513J632J607J343J202
51212C72315J517K223L061L850M406M418L726K623J692J321J409J491J140L31
51198D05523n40r75q42m75l41n84r67j294j754k679l852m356l467j632j51K22
51182C81836q2k82k57k98l15R8Q73J399J338J018Q94R64R55Q26Q32J176J743K146
51164C94864K039J551J300J696K315K329J608R75J160J879K259J852Q92j67r52
51149D15600j138o24J42L42m62j930l358m361m983n272n069m249l020j786p78
51134C79054j1M31L75o4l32j9O03R43R39J101J717K486L090L680M406M824M286
51117D07509K862J492J142J952L176L822L414K391J690J798K230K150J377N24
$$ plain form
51103 437529 437730 438149 438917 439795 440399 440371 439613 438402 437215 436374 435885 435568 435205 434650 433945 433347 433089 433068 432922
51084 432922 432531 432289 432705 433753 434810 435301 435293 435347 435859 436715 437599 438487 439711 441604 444186 447223 450519
51067 450519 454142 458379 463507 469637 476835 485352 495636 508105 522956 540087 558829 577576 594074
51054 594074 606713 615730 623027 630859 640855 653915 670194 688686 707232 723549 736364 745536
51042 745536 751341 753904 753102 748639 740335 728725 715391 702371 690955 680930 670780 658563 643045
51029 643045 624569 604881 585830 568248 552308 538588 528116 521311 517585 516242 517153 520125 524234
51016 524234 528496 532929 538247 544576 551090 557066 562668 568443 574517 580683 586997 593845 601448 609638
51002 609638 618196 627234 637182 648448 661043 674417 687643 699928 711054 721308 730996 740066
$$ packed form
51103D37529K01M19P68Q78O04k8p58j211j187q41m89l17l63n55p05n98k58k1j46
51084D32922l91k42M16J048J057M91qN4N12Q56Q84Q88J224J893K582L037L296
51067D50519L623M237N128O130P198Q517J0284J2469J4851J7131J8742J8747J6498
51054E94074J2639R017P297P832R996J3060J6279J8492J8546J6317J2815R172
51042G45536N805K563q02m463q304j1610j3334j3020j1416j0025j0150j2217j5518
51029F43045j8476j9688j9051j7582j5940j3720j0472o805l726j343R11K972M109
51016E24234M262M433N318O329O514N976N602N775O074O166O314O848P603Q190
51002F09638Q558R038R948J1266J2595J3374J3226J2285J1126J0254R688R070
$$ plain form
50990 740066 748116 754661 759403 762435 764364 766133 768562 771996 776449 781973 788626 796048 803394 810014
50976 810014 816130 822676 830592 840543 853177 869187 888945 912448 939866 971865 1009057 1051261
50964 1051261 1097650 1147465 1200274 1255567 1312551 1370512 1429072 1487895 1546317 1603429 1658292
50953 1658292 1709792 1756408 1796598 1829617 1855869 1876330 1891681 1902083 1907701 1909233 1907851 1904714
50941 1904714 1900596 1895763 1889833 1881660 1869749 1853286 1832923 1810405 1787321 1764243 1740870 1716680
50929 1716680 1691332 1664697 1636756 1607393 1576153 1542333 1505498 1465799 1423729 1379774 1334647
50918 1334647 1289626 1246122 1204719 1165060 1126967 1091321 1059435 1031727 1007451 985672 966010
50907 966010 948365 932307 917143 902450 888354 875352 863881 853915 844885 836209 827972 820869
$$ packed form
50990G40066Q050O545M742L032J929J769K429L434M453N524O653P422P346O620
50976H10014O116O546P916R951J2634J6010J9758K3503K7418L1999L7192M2204
50964A051261M6389M9815N2809N5293N6984N7961N8560N8823N8422N7112N4863
50953A658292N1500M6616M0190L3019K6252K0461J5351J0402N618J532j382l137
50941A904714m118m833n930q173j1911j6463k0363k2518k3084k3078k3373k4190
50929A716680k5348k6635k7941k9363l1240l3820l6835l9699m2070m3955m5127
50918A334647m5021m3504m1403l9659l8093l5646l1886k7708k4276k1779j9662
50907I66010j7645j6058j5164j4693j4096j3002j1471r966r030q676q237p103
$$ plain form
50895 820869 815324 810900 806802 802684 798697 795016 791792 789450 788513 789055 790703 793225 796713 801023 805409
50880 805409 809079 811972 814849 818688 824061 830906 838747 847198 856262 866067 876530 887636 899919
50867 899919 914145 930445 948286 967448 988526 1012178 1038409 1067093 1098741 1134209 1173941
50856 1173941 1218052 1266958 1321349 1381673 1448214 1521648 1602879 1692254 1789331 1893478 2004235
50845 2004235 2121041 2243132 2369876 2500789 2634869 2770134 2903909 3033306 3155318
50836 3155318 3266752 3364434 3445575 3508174 3551460 3576001 3583219 3574745 3552412 3518572 3475894
50825 3475894 3426889 3374134 3320941 3270997 3226937 3189603 3158818 3134277 3115187 3099510 3084105
50814 3084105 3065525 3040575 3006726 2962765 2908954 2846138 2774675 2694493 2606016 2510639 2410499
$$ packed form
50895H20869n545m424m098m118l987l681l224k342r37N42J648K522L488M310M386
50880H05409L670K893K877L839N373O845P841Q451R064R805J0463J1106J2283
50867H99919J4226J6300J7841J9162K1078K3652K6231K8684L1648L5468L9732
50856A173941M4111M8906N4391O0324O6541P3434Q1231Q9375R7077J04147J10757
50845B004235J16806J22091J26744J30913J34080J35265J33775J29397J22012
50836C155318J11434R7682Q1141O2599M3286K4541P218q474k2333l3840m2678
50825C475894m9005n2755n3193m9944m4060l7334l0785k4541j9090j5677j5405
50814C084105j8580k4950l3849m3961n3811o2816p1463q0182q8477r5377j00140
$$ plain form
50803 2410499 2308110 2206081 2106628 2011262 1921146 1837609 1761941 1694704 1635671 1584571 1541675
50792 1541675 1507577 1482545 1466087 1457012 1453936 1455843 1462091 1471753 1483178 1494477 1504436 1512795 1519755
50779 1519755 1525443 1529641 1531718 1530878 1526787 1519928 1511096 1500610 1488258 1473833 1457318 1438550 1417116
50766 1417116 1392674 1365175 1334868 1302496 1269479 1237406 1207065 1178262 1150766 1125124 1102313
50755 1102313 1082764 1065991 1051148 1037816 1026351 1017589 1012150 1009924 1010247 1012597 1017049 1024134 1034470
50742 1034470 1048554 1066693 1088928 1115078 1144948 1178509 1215955 1257715 1304398 1356491 1413933
50731 1413933 1475955 1541356 1609018 1678275 1748915 1820743 1893078 1964795 2034919 2102921 2168197
50720 2168197 2229408 2284631 2331968 2369683 2395891 2408813 2407676 2393182 2367066 2331556 2289421
$$ packed form
50803B410499j02389j02029r9453r5366r0116q3537p5668o7237n9033n1100m2896
50792A541675l4098k5032j6458r075l076J907O248R662J1425J1299R959Q359O960
50779A519755N688M198K077q40m091o859q832j0486j2352j4425j6515j8768k1434
50766A417116k4442k7499l0307l2372l3017l2073l0341k8803k7496k5642k2811
50755A102313j9549j6773j4843j3332j1465q762n439k226L23K350M452P085J0336
50742A034470J4084J8139K2235K6150K9870L3561L7446M1760M6683N2093N7442
50731A413933O2022O5401O7662O9257P0640P1828P2335P1717P0124O8002O5276
50720B168197O1211N5223M7337L7715K6208J2922j137j4494k6116l5510m2135
$$ plain form
50709 2289421 2244099 2199131 2157185 2119509 2086285 2057533 2033782 2015807 2003619 1995927 1990840 1986941
50697 1986941 1983219 1977961 1968325 1951453 1925881 1891818 1850469 1803417 1752446 1699466 1646355 1594846
50685 1594846 1546479 1502604 1464346 1432459 1407171 1388436 1376613 1372635 1377105 1389448 1408577 1434338
50673 1434338 1467553 1508432 1555696 1607607 1663151 1721483 1780694 1837999 1891152 1939239 1982245
50662 1982245 2020438 2054115 2083373 2108035 2128203 2144920 2159774 2173638 2186007 2195707 2202038 2205216
50650 2205216 2206106 2205751 2205100 2205031 2206586 2210929 2218874 2230594 2246169 2266334 2292230 2324196 2361092 2400944
50636 2400944 2442025 2483211 2523650 2562506 2599070 2632934 2663992 2692410 2718634 2743351 2767066
50625 2767066 2789140 2806699 2814487 2806312 2777570 2727402 2659440 2580909 2500396 2425148 2359338 2304328
$$ packed form
50709B289421m5322m4968m1946l7676l3224k8752k3751j7975j2188p692n087l899
50697A986941l722n258r636j6872k5572l4063m1349m7052n0971n2980n3111n1509
50685A594846m8367m3875l8258l1887k5288j8735j1823l978M470J2343J9129K5761
50673A434338L3215M0879M7264N1911N5544N8332N9211N7305N3153M8087M3006
50662A982245L8193L3677K9258K4662K0168J6717J4854J3864J2369R700O331L178
50650B205216Q90l55o51o9J555M343P945J1720J5575K0165K5896L1966L6896L9852
50636B400944M1081M1186M0439L8856L6564L3864L1058K8418K6224K4717K3715
50625B767066K2074J7559P788q175k8742n0168o7962p8531q0513p5248o5810n5010
$$ plain form
50613 2304328 2260304 2227513 2206127 2195441 2193666 2198611 2208471 2221802 2236670 2249958 2257863 2257347
50601 2257347 2247018 2226559 2195721 2154379 2103417 2044858 1980919 1913328 1843725 1774157 1706620
50590 1706620 1642278 1581574 1524924 1472754 1424834 1380227 1338384 1299979 1266094 1236561 1209647
50579 1209647 1183707 1158847 1136528 1117702 1101901 1088250 1076772 1068281 1063279 1061437 1062015 1064386
50567 1064386 1068172 1073313 1080155 1089260 1101065 1115844 1133874 1155335 1180077 1207818 1238597 1272738
50555 1272738 1310419 1351643 1396564 1445249 1496890 1549748 1602211 1653582 1703590 1751660 1797166
50544 1797166 1840132 1881187 1921067 1960663 2001361 2044665 2091395 2141753 2196203 2255706 2320890
50533 2320890 2391456 2466727 2546541 2631405 2722106 2819366 2923635 3034860 3152506 3275882
$$ packed form
50613B304328m4024l2791k1386j0686j775M945R860J3331J4868J3288P905n16
50601B257347j0329k0459l0838m1342n0962n8559o3939o7591o9603o9568o7537
50590A706620o4342o0704n6650n2170m7920m4607m1843l8405l3885k9533k6914
50579A209647k5940k4860k2319j8826j5801j3651j1478q491n002j842N78K371
50567A064386L786N141O842R105J1805J4779J8030K1461K4742K7741L0779L4141
50555A272738L7681M1224M4921M8685N1641N2858N2463N1371N0008M8070M5506
50544A797166M2966M1055L9880L9596M0698M3304M6730N0358N4450N9503O5184
50533B320890P0566P5271P9814Q4864R0701R7260J04269J11225J17646J23376
$$ plain form
50523 3275882 3404145 3535802 3668450 3799256 3925446 4044139 4152175 4246679 4325590 4387112
50513 4387112 4428843 4448242 4444177 4417366 4369084 4300074 4211240 4104925 3984878 3855309 3720596
50502 3720596 3585630 3455472 3334336 3225360 3131430 3055571 3000042 2965443 2951098 2956016 2979003
50491 2979003 3017951 3069388 3128626 3190003 3247074 3293172 3322240 3329429 3311397 3266713 3196295
50480 3196295 3103348 2992599 2869294 2738372 2603941 2469188 2336738 2208924 2087604 1973869
50470 1973869 1868276 1771328 1683395 1604191 1532812 1468516 1411200 1360895 1317078 1278771 1245256
50459 1245256 1216369 1192114 1172116 1155483 1141137 1128296 1116667 1106156 1096471 1087220 1078338 1070100
50447 1070100 1062626 1055742 1049611 1045116 1043179 1043770 1045988 1049056 1052823 1057332 1062434 1068074 1074549 1082176
$$ packed form
50523C275882J28263J31657J32648J30806J26190J18693J08036R4504P8911O1522
50513D387112M1731J9399m065k6811m8282o9010q8834j06315j20047j29569j34713
50502C720596j34966j30158j21136j08976r3930p5859n5529l4599j4345M918K2987
50491B979003L8948N1437N9238O1377N7071M6098K9068P189j8032m4684p0418
50480C196295r2947j10749j23305j30922j34431j34753j32450j27814j21320j13735
50470A973869j05593r6948q7933p9204p1379o4296n7316n0305m3817l8307l3515
50459A245256k8887k4255j9998j6633j4346j2841j1629j0511r685r251q882q238
50447A070100p474o884o131m495j937N91K218L068L767M509N102N640O475P627
$$ plain form
50433 1082176 1090974 1101082 1113265 1128530 1147205 1168728 1192404 1217959 1245270 1273983 1303743
50422 1303743 1334538 1366426 1399100 1432224 1466224 1502313 1541575 1584402 1630940 1681567 1736534
50411 1736534 1795508 1858048 1924315 1994672 2068497 2143884 2218661 2291291 2360686 2425692 2485182
50400 2485182 2538310 2584211 2621566 2648754 2664390 2667489 2657338 2633542 2596186 2545774 2483286
50389 2483286 2410677 2331170 2248458 2165444 2084085 2006469 1935478 1873896 1823090 1782901 1752814
50378 1752814 1732874 1723504 1724687 1735483 1754098 1778187 1805087 1831937 1855834 1873990 1883866 1883240
50366 1883240 1870433 1844752 1806882 1758834 1703328 1643032 1580173 1516592 1453900 1393374 1335693
50355 1335693 1280922 1228926 1179779 1133649 1090426 1049856 1012158 978219 948850 924032 903199
$$ packed form
50433A082176Q798J0108J2183J5265J8675K1523K3676K5555K7311K8713K9760
50422A303743L0795L1888L2674L3124L4000L6089L9262M2827M6538N0627N4967
50411A736534N8974O2540O6267P0357P3825P5387P4777P2630O9395O5006N9490
50400B485182N3128M5901L7355K7188J5636L099j0151k3796l7356n0412o2488
50389B483286p2609p9507q2712q3014q1359p7616p0991o1582n0806m0189l0087
50378A752814j9940r370J183J0796J8615K4089K6900K6850K3897J8156R876o26
50366A883240j2807k5681l7870m8048n5506o0296o2859o3581o2692o0526n7681
50355A335693n4771n1996m9147m6130m3223m0570l7698l3939k9369k4818k0833
$$ plain form
50344 903199 886182 873469 865482 861945 862112 865332 871232 879506 889712 901038 911977 920324 923819
50331 923819 921086 912125 898149 881072 862902 845227 829006 814742 802746 793158 785863 780572
50319 780572 777037 775136 774860 776266 779343 783732 788753 793943 799574 806349 814516 823489 832458 841155
50305 841155 849866 858847 867929 876628 884454 891213 897190 903074 909477 916463 923665 930870 938278 946069
50291 946069 953895 961113 967517 973589 979961 986867 994423 1003289 1014628 1029014 1045340 1060880 1072521
50278 1072521 1078092 1076927 1069750 1058367 1045307 1033176 1023757 1017423 1013433 1010882 1009421 1009106 1009740 1010630
50264 1010630 1011052 1010792 1010209 1009903 1010443 1012240 1015484 1020249 1026758 1035439 1046523 1059748 1074837 1092345
50250 1092345 1113726 1140415 1172977 1211152 1254386 1302098 1353704 1408586 1465855 1523856 1580169
$$ packed form
50344I03199j7017j2713p987l537J67L220N900Q274J0206J1326J0939Q347L495
50331I23819k733q961j3976j7077j8170j7675j6221j4264j1996r588p295n291
50319G80572l535j901k76J406L077M389N021N190N631O775Q167Q973Q969Q697
50305H41155Q711Q981R082Q699P826O759N977N884O403O986P202P205P408P791
50291I46069P826P218O404O072O372O906P556Q866J1339J4386J6326J5540J1641
50278A072521N571j165p177j1383j3060j2131r419o334l990k551j461l15O34Q90
50264A010630M22k60n83l06N40J797L244M765O509Q681J1084J3225J5089J7508
50250A092345K1381K6689L2562L8175M3234M7712N1606N4882N7269N8001N6313
$$ plain form
50239 1580169 1632537 1679899 1722416 1760814 1795964 1828828 1859989 1888963 1914168 1933600 1945161
50228 1945161 1946393 1934663 1908224 1867204 1813554 1750388 1681399 1610282 1540075 1473030 1411113
50217 1411113 1356111 1308804 1268407 1233283 1201860 1172342 1142130 1108781 1071939 1033649 996433
50206 996433 961555 929306 900122 874625 852864 834209 817968 803737 791241 780241 770672 762504
50194 762504 755415 748823 742287 735700 729111 722561 716099 709795 703675 697783 692322 687629 683926 681056
50180 681056 678478 675554 672055 668440 665462 663464 662270 661847 662665 665097 668692 672508 676014 679328 682673
50165 682673 686115 689882 694477 700276 707320 715587 725101 735664 746890 758816 772111 787288 803915
50152 803915 821022 838130 855406 872803 889506 904465 917272 928378 938624 948711 959024
$$ packed form
50239A580169N2368M7362M2517L8398L5150L2864L1161K8974K5205J9432J1561
50228A945161J232j1730k6439m1020n3650o3166o8989p1117p0207o7045o1917
50217A411113n5002m7307m0397l5124l1423k9518l0212l3349l6842l8290l7216
50206I96433l4878l2249k9184k5497k1761j8655j6241j4231j2496j1000r569q168
50194G62504p089o592o536o587o589o550o462o304o120n892n461m693l703k870
50180F81056k578k924l499l615k978j998j194m23Q18K432L595L816L506L314L345
50165F82673L442L767M595N799P044Q267R514J0563J1226J1926J3295J5177J6627
50152H03915J7107J7108J7276J7397J6703J4959J2807J1106J0246J0087J0313
$$ plain form
50141 959024 969788 981406 994697 1010815 1030932 1056069 1087149 1125098 1170787 1224892 1287845
50130 1287845 1359790 1440482 1529180 1624665 1725335 1829229 1933975 2036869 2135363 2227887
50120 2227887 2314413 2396195 2474867 2551550 2626369 2698150 2764215 2820596 2862777 2886418 2887811
50109 2887811 2864502 2816325 2745893 2657560 2555648 2443712 2325151 2203690 2082795 1964983
50099 1964983 1852132 1746205 1649149 1562034 1484551 1415423 1353214 1296962 1246311 1201134 1161011
50088 1161011 1125305 1093831 1067059 1045235 1027581 1012819 1000287 989950 981473 974033 967235 961475
50076 961475 957028 953327 949554 945484 941219 936511 930953 924635 918034 911321 904263 896790 889200 881764
50062 881764 874444 867020 859253 851050 842809 835473 829819 825663 822173 818879 815995 813837 812460 811892
$$ packed form
50141I59024J0764J1618J3291J6118K0117K5137L1080L7949M5689N4105O2953
50130A287845P1945Q0692Q8698R5485J00670J03894J04746J02894R8494R2524
50120B227887Q6526Q1782P8672P6683P4819P1781O6065N6381M2181K3641J393
50109B887811k3309m8177p0432q8333j01912j11936j18561j21461j20895j17812
50099A964983j12851j05927r7056q7115p7483o9128o2209n6252n0651m5177m0123
50088A161011l5706l1474k6772k1824j7654j4762j2532j0337q477p440o798n760
50076I61475m447l701l773m070m265m708n558o318o601o713p058p473p590p436
50062H81764p320p424p767q203q241p336n654m156l490l294k884k158j377n68
$$ plain form
50048 811892 812174 813124 814583 817039 821418 827966 835883 844320 853269 863122 873876 885208 896959 909058
50034 909058 921288 933515 945863 958251 970188 981514 992963 1005312 1018177 1030281 1040791
50023 1040791 1049784 1057601 1064586 1071531 1079534 1089069 1099729 1111237 1124259 1139946 1159090 1182119
50011 1182119 1209572 1242184 1280583 1325097 1375578 1431078 1489718 1549052 1606621 1660470 1709702
50000 1709702 1754834 1797346 1838653 1879506 1920195 1960545 1999158 2032862 2057328 2068305 2062443
49989 2062443 2037717 1993939 1933025 1858433 1774182 1684257 1592391 1501652 1414072 1330924 1253355
49978 1253355 1182505 1119000 1062695 1013017 969399 931350 898374 869968 845580 824538 806125
49967 806125 789786 775200 762195 750674 740589 731759 723793 716487 710323 706307 705084 706278 708848
$$ packed form
50048H11892K82R50J459K456M379O548P917Q437Q949R853J0754J1332J1751J2099
50034I09058J2230J2227J2348J2388J1937J1326J1449J2349J2865J2104J0510
50023A040791Q993P817O985O945Q003R535J0660J1508J3022J5687J9144K3029
50011A182119K7453L2612L8399M4514N0481N5500N8640N9334N7569N3849M9232
50000A709702M5132M2512M1307M0853M0689M0350L8613L3704K4466J0977n862
49989B062443k4726m3778o0914p4592q4251q9925r1866r0739q7580q3148p7569
49978A253355p0850o3505n6305m9678m3618l8049l2976k8406k4388k1042j8413
49967H06125j6339j4586j3005j1521j0085q830p966p306o164m016j223J194K570
$$ plain form
49954 708848 712020 715791 720679 727198 735540 745498 756442 767388 777335 785718 792477 797649 801105 802891
49940 802891 803640 804109 804110 802302 797341 789048 778138 765095 749882 732726 714706 697265 681323 666968
49926 666968 653837 641701 630791 621626 614438 608888 604520 601404 600019 600537 602567 605556 609029 612373
49912 612373 614973 616986 619542 623763 629778 637084 645549 655476 666806 678889 691149 703508 716074
49899 716074 728860 741876 754932 767105 776920 783528 787433 789681 790650 790006 787468 782967 776225 766899
49885 766899 755277 742229 728354 713689 698466 683518 669511 656196 643010 630156 618508
49874 618508 608570 600042 592466 585789 580134 575397 571398 568257 566378 566116 567519 570315 574134 578818
49860 578818 584519 591366 599117 607442 616564 627271 640004 654100 668197 681316 693358 704599
$$ packed form
49954G08848L172L771M888O519Q342R958J0944J0946R947Q383O759N172L456J786
49940H02891P49M69Jj808m961q293j0910j3043j5213j7156j8020j7441j5942j4355
49926F66968j3131j2136j0910r165p188n550m368l116j385N18K030K989L473L344
49912F12373K600K013K556M221O015P306Q465R927J1330J2083J2260J2359J2566
49899G16074J2786J3016J3056J2173R815O608L905K248R69o44k538m501o742r326
49885G66899j1622j3048j3875j4665j5223j4948j4007j3315j3186j2854j1648
49874F18508r938q528p576o677n655m737l999l141j879k62J403K796L819M684
49860E78818N701O847P751Q325R122J0707J2733J4096J4097J3119J2042J1241
$$ plain form
49848 704599 714968 723870 730595 734838 736872 737274 736427 734187 730011 723399 714373 703653 692395 681607
$$ packed form
49848G04599J0369Q902O725M243K034M02q47k240m176o612r026j0720j1258j0788
$$ [...]
##END NTUPLES=NMR SPECTRUM
##END=
