##TITLE=AC1458_PAST313264_8026666_PJXO6PTAY7
##JCAMPDX= 6.0         $$ Bruker NMR JCAMP-DX V2.0
##DATA TYPE= NMR SPECTRUM
##DATA CLASS= NTUPLES
##ORIGIN= BRUKER
##OWNER= Administrator
$$ 1.72 TOPSPIN		Version 2.1
$$ 2013-07-11 16:18:25.669 -0700  Administrator@X
$$ Compression mode = diff/dup
##.OBSERVE FREQUENCY= 400.02188249412
##.OBSERVE NUCLEUS= ^1H
##.ACQUISITION MODE= SIMULTANEOUS (DQD)
##.ACQUISITION SCHEME= undefined
##.AVERAGES= 64
##.DIGITISER RES= 22
##SPECTROMETER/DATA SYSTEM= spect
##.PULSE SEQUENCE= noesygpps1d.comp
##.SOLVENT NAME= COFFEE_meoh
##.SHIFT REFERENCE= INTERNAL, COFFEE_meoh, 1, 14.96095
##AUDIT TRAIL= $$ (NUMBER, WHEN, WHO, WHERE, PROCESS, VERSION, WHAT)
$$ ##TITLE= Audit trail, TOPSPIN		Version 2.1
$$ ##JCAMPDX= 5.01
$$ ##ORIGIN= Bruker BioSpin GmbH
$$ ##OWNER= Administrator
$$ $$ E:\/data/COFFEE/nmr/AC1458_PAST313264_8026666_PJXO6PTAY7/12/pdata/1/auditp.txt
$$ ##AUDIT TRAIL=  $$ (NUMBER, WHEN, WHO, WHERE, PROCESS, VERSION, WHAT)
(   1,<2013-07-11 16:18:20.497 -0700>,<Administrator>,<X>,<go>,<TOPSPIN 2.1>,
      <created by zg
	started at 2013-07-11 16:06:50.365 -0700,
	POWCHK enabled, PULCHK disabled,
       configuration hash MD5:
       C8 4E 4E 5D D3 5C D8 9E 9F 52 82 E0 59 8A DE 15
       data hash MD5: 64K
       9A 8B 06 68 D2 E4 7E 92 C5 DA E5 2C FE 2D 1D 49>)
(   2,<2013-07-11 16:18:23.544 -0700>,<Administrator>,<X>,<proc1d>,<TOPSPIN 2.1>,
      <Start of raw data processing
       efp LB = 0.3 FT_mod = 6 PKNL = 1 PHC0 = 0 PHC1 = 0 SI = 128K 
       data hash MD5: 128K
       8F 98 D1 D3 CC 07 84 94 1B D5 43 29 BC 6C 6A 54>)
(   3,<2013-07-11 16:18:24.637 -0700>,<Administrator>,<X>,<proc1d>,<TOPSPIN 2.1>,
      <pk PHC0 = -79.43115 PHC1 = 0 
       data hash MD5: 128K
       5D B1 BD A1 48 67 FC DF F5 3E 03 DE 39 2D 89 3A>)
(   4,<2013-07-11 16:18:25.059 -0700>,<Administrator>,<X>,<proc1d>,<TOPSPIN 2.1>,
      <abs ABSG = 1 
       data hash MD5: 128K
       5D AD 77 72 94 F9 EA 43 7B E9 41 18 21 A6 1A A4>)
(   5,<2013-07-11 16:18:25.137 -0700>,<Administrator>,<X>,<proc1d>,<TOPSPIN 2.1>,
      <abs ABSG = 2 
       data hash MD5: 128K
       12 BC D1 26 FC CE D9 95 5F ED CC E2 D7 C8 91 6D>)
(   6,<2013-07-11 16:18:25.262 -0700>,<Administrator>,<X>,<proc1d>,<TOPSPIN 2.1>,
      <abs ABSG = 3 
       data hash MD5: 128K
       61 AB F8 35 D0 7D 77 00 7A DC 04 E5 EB 15 6D 30>)
(   7,<2013-07-11 16:18:25.403 -0700>,<Administrator>,<X>,<proc1d>,<TOPSPIN 2.1>,
      <abs ABSG = 4 
       data hash MD5: 128K
       03 FC 18 1C 46 6C 18 19 C5 89 94 5B DF 65 5E AB>)
(   8,<2013-07-11 16:18:25.481 -0700>,<Administrator>,<X>,<proc1d>,<TOPSPIN 2.1>,
      <abs ABSG = 5 
       data hash MD5: 128K
       CB B4 94 89 DB 15 CD 77 45 1C E7 9C ED DE 34 2D>)
$$ ##END=
$$ 
$$ $$ hash MD5
$$ $$ F4 44 5C 0B 59 FA 37 C0 22 6B AD 01 70 39 FC 6E
##$RELAX= 
##$RELAX= 
##$RELAX= 
##$RELAX= 
##$RELAX= 
##$RELAX= 
##$RELAX= 
##$RELAX= 
$$ Bruker specific parameters
$$ --------------------------
##$DU= <E:\>
##$EXPNO= 12
$$ [...]
##$TP07= 0
##$TPNAME0= <>
##$TPNAME1= <>
##$TPNAME2= <>
##$TPNAME3= <>
##$TPNAME4= <>
##$TPNAME5= <>
##$TPNAME6= <>
##$TPNAME7= <>
##$TPOAL= (0..7)
0.5 0.5 0.5 0.5 0.5 0.5 0.5 0.5
##$TPOFFS= (0..7)
0 0 0 0 0 0 0 0
##$TUNHIN= 0
##$TUNHOUT= 0
##$TUNXOUT= 0
##$USERA1= <user>
##$USERA2= <user>
##$USERA3= <user>
##$USERA4= <user>
##$USERA5= <user>
##$V9= 5
##$VALIST= <valist>
##$VCLIST= <CCCCCCCCCCCCCCC>
##$VD= 0
##$VDLIST= <DDDDDDDDDDDDDDD>
##$VPLIST= <PPPPPPPPPPPPPPP>
##$VTLIST= <TTTTTTTTTTTTTTT>
##$WBST= 1024
##$WBSW= 4
##$XGAIN= (0..3)
0 0 0 0
##$XL= 0
##$YL= 0
##$YMAX_a= 6277949
##$YMIN_a= -12650591
##$ZGOPTNS= <>
##$ZL1= 120
##$ZL2= 120
##$ZL3= 120
##$ZL4= 120
##$ABSF1= 14.96095
##$ABSF2= -5.597232
##$ABSG= 5
##$ABSL= 3
##$ALPHA= 0
##$AQORDER= 0
##$ASSFAC= 0
##$ASSFACI= 0
##$ASSFACX= 0
##$ASSWID= 0
##$AUNMP= <proc_prof1d_extract.lims>
##$AXLEFT= 0
##$AXNAME= <>
##$AXNUC= <1H>
##$AXRIGHT= 0
##$AXTYPE= 0
##$AXUNIT= <>
##$AZFE= 0.1
##$AZFW= 0.1
##$BCFW= 0
##$BC_mod= 0
##$BYTORDP= 0
##$COROFFS= 0
##$CY= 15
##$DATMOD= 1
##$DC= 0
##$DFILT= <>
##$DTYPP= 0
##$F1P= 0
##$F2P= 0
##$FCOR= 0.5
##$FTSIZE= 131072
##$FT_mod= 6
##$GAMMA= 0
##$GB= 0
##$INTBC= 1
##$INTSCL= 1
##$ISEN= 128
##$LB= 0.3
##$LEV0= 0
##$LPBIN= 0
##$MAXI= 10000
##$MC2= 0
##$MEAN= 0
##$ME_mod= 0
##$MI= 0
##$NCOEF= 0
##$NC_proc= -2
##$NLEV= 6
##$NOISF1= 0
##$NOISF2= 0
##$NSP= 0
##$NTH_PI= 0
##$NZP= 0
##$OFFSET= 14.96095
##$PC= 1
##$PHC0= -79.43115
##$PHC1= 0
##$PH_mod= 1
##$PKNL= yes
##$PPARMOD= 0
##$PPDIAG= 0
##$PPIPTYP= 0
##$PPMPNUM= 2147483647
##$PPRESOL= 1
##$PSCAL= 4
##$PSIGN= 0
##$PYNMP= <proc.py>
##$REVERSE= no
##$SF= 400.020009655851
##$SI= 131072
##$SIGF1= 0
##$SIGF2= 0
##$SINO= 400
##$SIOLD= 131072
##$SPECTYP= <>
##$SREGLST= <1H.CDCl3>
##$SSB= 0
##$STSI= 131072
##$STSR= 0
##$SW_p= 8223.68421052631
##$SYMM= 0
##$S_DEV= 0
##$TDeff= 65536
##$TDoff= 0
##$TI= <>
##$TILT= no
##$TM1= 0
##$TM2= 0
##$TOPLEV= 0
##$USERP1= <user>
##$USERP2= <user>
##$USERP3= <user>
##$USERP4= <user>
##$USERP5= <user>
##$WDW= 1
##$XDIM= 131072
##$YMAX_p= 421164987
##$YMIN_p= -13355
##$CURPLOT= <Network HP LaserJet P1505>
##$CURPRIN= <$Network HP LaserJet P1505>
##$DFORMAT= <normdp>
##$LAYOUT= <+/1D_H.xwp>
##$LFORMAT= <normlp>
##$PFORMAT= <normpl>
##$SURQMSG= 1
$$ End of Bruker specific parameters
$$ ---------------------------------
##NTUPLES= NMR SPECTRUM
##VAR_NAME=  FREQUENCY,     SPECTRUM/REAL,   SPECTRUM/IMAG
##SYMBOL=    X,             R,               I
##VAR_TYPE=  INDEPENDENT,   DEPENDENT,       DEPENDENT
##VAR_FORM=  AFFN,          ASDF,            ASDF
##VAR_DIM=   131072,        131072,          131072
##UNITS=     HZ,            ARBITRARY UNITS, ARBITRARY UNITS
##FACTOR=    0.0627417313425164, 1,          1
##FIRST=     8223.62146879497, 1225,         -56447
##LAST=      0,             3510,            -57010
##MIN=       0,             -13355,          0
##MAX=       8223.62146879497, 421164987,    0
$$ Real data points
##PAGE= N=1
##DATA TABLE= (X++(R..R)), XYDATA
$$ [...]
61644D19469M728M321L562L191L258L157K485J543Q02K24o26j949l357m330m801
$$ 419469 424197 428518 432080 435271 438529 441686 444171 445714 446516 446740 446114 444165 440808 436478 431677
61629D31677n117n418n404m802l855l051k509k028j626j644k191k849l110k875
$$ 431677 426560 421142 415738 410936 407081 404030 401521 399493 397867 396223 394032 391183 388073 385198
61615C85198k370j815j355j149j280j693k301l050l780m237m351m339m379m379
$$ 385198 382828 381013 379658 378509 377229 375536 373235 370185 366405 362168 357817 353478 349099 344720
61601C44720m225m032l981m072m198m250m057l488k800k558k904l247l006k368
$$ 344720 340495 336463 332482 328410 324212 319962 315905 312417 309617 307059 304155 300908 297902 295534
61587B95534j855j499j017n94p55j462j933j600o90K09P05N94j26j003j364j059
$$ 295534 293679 292180 291163 290569 289814 288352 286419 284819 284129 284338 285043 285637 285511 284508 283144 282085
61571B82085n80l30j62R4K18J5l14n21o27o14k66L14N86M20M41J029J528J228
$$ 282085 281505 281175 281013 281107 281325 281340 281026 280505 279878 279264 278998 279312 279898 280318 280759 281788 283316 284544
61553B84544O42P94J605J962J345M42K5J00L78P73J118J087P40N73P73J030J256
$$ 284544 285186 285980 287585 289547 290892 291334 291359 291459 291837 292610 293728 294815 295555 296128 296901 297931 299187
61536B99187J794K636L148L027K844L070L207K547J306L10j33l59o66j092j668
$$ 299187 300981 303617 306765 309792 312636 315706 318913 321460 322766 323076 322943 322584 321918 320826 319158
61521C19158k269k412j877j289j464k212k541j985j059l31K47Q41J171Q97K10
$$ 319158 316889 314477 312600 311311 309847 307635 305094 303109 302050 301719 301966 302807 303978 304875 305085
61506C05085l35l79m4K35M9n72j088j015n50k90l93m33j87L3j5j1M19J053J346
$$ 305085 304750 304371 304327 304562 304611 304039 302951 301936 301386 301096 300703 300270 300083 300116 300101 300090 300509 301562 302908
61487C02908J156Q12O33P40J177J797K078J560N44m2K59Q47Q81M19K51O97J156
$$ 302908 304064 304876 305509 306249 307426 309223 311301 312861 313405 313363 313622 314469 315350 315769 316020 316717 317873
61470C17873J046O68O87J063J071L85m43p12l99l6o2m60q59q36l48J30J51lL43
$$ 317873 318919 319587 320274 321337 322408 322793 322350 321638 321239 321203 321141 320681 319822 318986 318638 318768 318919 318916 319259
61451C19259J166J637J332Q88R93J354J318J037J164J766K340K772L364L942L854
$$ 319259 320425 322062 323394 324282 325275 326629 327947 328984 330148 331914 334254 337026 340390 344332 348186
61436C48186L070K513K960M168N314N779N302L994K503J647J590J783J929K355
$$ 348186 351256 353769 356729 360897 366211 371990 377292 381286 383789 385436 387026 388809 390738 393093
61422C93093L209L847L671L020K670K731K611J912Q14l62j476k427l040l213l022
$$ 393093 396302 400149 403820 406840 409510 412241 414852 416764 417578 417216 415740 413313 410273 407060 404038
61407D04038k733k732l271m126m645m360l415k351j666j655k351l412m221m321
$$ 404038 401305 398573 395302 391176 386531 382171 378756 376405 374739 373084 370733 367321 363100 358779
61393C58779l616k238n13Q95J312Q10K21J57L83L85J15j57l47m32j87M83J159
$$ 358779 355163 352925 352412 353307 354619 355429 355650 355807 356190 356575 356690 356533 356186 355754 355567 356050 357209
61376C57209J313R65N79M96Q03J464K219K596K463K342K720L328L527L250K930
$$ 357209 358522 359487 360066 360562 361365 362829 365048 367644 370107 372449 375169 378497 382024 385274 388204
61361C88204K756K555K360K487L055L874M811N850O884P836Q949J0432J1947J2904
$$ 388204 390960 393515 395875 398362 401417 405291 410102 415952 422836 430672 439621 450053 462000 474904
61347D74904J3084J2558J1240R228P359O524O456O051N010M145L874L401J969
$$ 474904 487988 500546 511786 521014 528373 534897 541353 547404 552414 556559 560433 563834 565803
61334E65803J9j523k465l152l664l964m387n225o039o141n580m984m609m166l520
$$ 565803 565822 564299 561834 558682 555018 551054 546667 541442 535403 529262 523682 518698 514089 509923 506403
61319E06403k920k535k300k235k389k449j939r33o0L06M98J067K259M068O280
$$ 506403 503483 500948 498648 496413 494024 491575 489636 488703 488643 488949 489447 490514 492773 496841 503121
61304E03121Q267R110Q314O228L617J063j122k800m114n369o533p105o835o219
$$ 503121 511388 520498 528812 535040 538657 539720 538598 535798 531684 526315 519782 512677 505842 499623
61290D99623n866n538m452k549q87n21j317k197k308j632n61O28J879L154M396
$$ 499623 493757 488219 483767 481218 480331 479810 478493 476296 473988 472356 471795 472423 474302 477456 481852
61275D81852N557O542P209P470P422P277P168P090O991O892O907P152P661Q405
$$ 481852 487409 493951 501160 508630 516052 523329 530497 537587 544578 551470 558377 565529 573190 581595
61261E81595R391J0728J2467J4373J5881J6372J5539J3539J0848P973N202K586
$$ 581595 590986 601714 614181 628554 644435 660807 676346 689885 700733 708706 713908 716494
61249G16494J51j893l344m346n375o753q355r869j1054j1589j1020r340p468o618
$$ 716494 716645 714752 711408 707062 701687 694934 686579 676710 665656 654067 643047 633707 626239 619621
61235F19621p049p856q065p548o652n496m064k629j578q60j22O84J209J258J003
$$ 619621 612572 604716 596651 589103 582451 576955 572891 570262 568684 567824 567702 568386 569595 570853 571856
61220E71856O13N6n38p56l96J68L83J80l6O2M08O75N67j3q80j674k060j815p16
$$ 571856 572469 572525 571987 571231 570835 571003 571386 571566 571530 571592 572000 572675 573242 573229 572349 570675 568615 566800 566084
61201E66084J383M249P217R750J1881J3950J6054J8016J9680K0896K1256K0309
$$ 566084 567467 571716 578933 588683 600564 614514 630568 648584 668264 689160 710416 730725
61189G30725J8090J5164J2171R622P978P397P295O743N605M717M593M528L498
$$ 730725 748815 763979 776150 785772 793750 801147 808442 815185 820790 825507 830100 834628 838126
61176H38126J560l75j932l561n419o821p261p347q151r821j1418j2103j2084j2218
$$ 838126 839686 839311 837379 833818 828399 821578 814317 806970 798819 788998 777580 765477 753393 741175
61162G41175j2998j4140j5057j5438j5198j4104j1931r063o489m838l650k023
$$ 741175 728177 714037 698980 683542 668344 654240 642309 633246 626757 621919 618269 616246
61150F16246J27J988K955L227L122K362M93k312n248p586r070r710r555q671p166
$$ 616246 616373 618361 621316 624543 627665 630027 630520 628208 622960 615374 606304 596594 587039 578368 571202
61135E71202n289l523k386j882j334n6J843L654N010O233P729R434J1086J2756
$$ 571202 565913 562390 560004 558122 556788 556732 558575 562229 567239 573472 581201 590635 601721 614477
61121F14477J4722J6916J8889K0362K1505K2491K3114K3117K2777K2712K3053
$$ 614477 629199 646115 665004 685366 706871 729362 752476 775593 798370 821082 844135
61110H44135K3167K2461K1176K0010J9176J8112J6225J3497J0310O913L280o07
$$ 844135 867302 889763 910939 930949 950125 968237 984462 997959 1008269 1015182 1018462 1017855
61098A017855m516q029j0882j3273j5761j8643k1518k3525k4108k3443k2281k1475
$$ 1017855 1013339 1005310 994428 981155 965394 946751 925233 901708 877600 854157 831876 810401
61086H10401k1469k1945k1973k0877j8905j6874j5219j3726j2170j0732r649q814
$$ 810401 788932 766987 745014 724137 705232 688358 673139 659413 647243 636511 626862 618048
61074F18048p952o909n682m360l206k466j894q80P23K162K568K046J617K148L573
$$ 618048 610096 603187 597505 593145 589939 587473 585579 584699 585422 587584 590152 592198 593815 595963 599536
61059E99536N203O530P567Q477R228R760J0420J1766J3817J5850J7277J8395J9774
$$ 599536 604739 611269 618836 627313 636541 646301 656721 668487 682304 698154 715431 733826 753600
61046G53600K1241K2153K2585K3455K5295K7530K9263L0264L0919L1687L2853
$$ 753600 774841 796994 819579 843034 868329 895859 925122 955386 986305 1017992 1050845
61035A050845L4434L6100L7499L8779M0356M2156M3641M4632M5362M5637M4917
$$ 1050845 1085279 1121379 1158878 1197657 1238013 1280169 1323810 1368442 1413804 1459441 1504358
61024A504358M3628M3458M5787N0407N6386O3281P0889P8594Q6032R3997J04000
$$ 1504358 1547986 1591444 1637231 1687638 1744024 1807305 1878194 1956788 2042820 2136817 2240817
61013B240817J17375J35433J59806J91997K33127K84662L48476M25898N18330
$$ 2240817 2358192 2493625 2653431 2845428 3078555 3363217 3711693 4137591 4655921
61004D655921O29911P67527R36788J139980J377509J640656J888770K034794J976032
$$ 4655921 5285832 6053359 6990147 8130127 9507636 11148292 13037062 15071856 17047888
60995A7047888J666221J167436O24937J83499p7714j46283m7353J60745L70033
$$ 17047888 18714109 19881545 20506482 20689981 20612267 20465984 20418631 20579376 20949409
60986B0949409M40086K68998j37221o66130j171168j548233j761096j821496j762571
$$ 20949409 21389495 21658493 21521272 20855142 19683974 18135741 16374645 14553149 12790578
60977A2790578j624971j448558j263393j085792r22721p77553o51273n42213m48228
$$ 12790578 11165607 9717049 8453656 7367864 6445143 5667590 5016317 4474104 4025876
60968D025876l68823l03895k51579k08890j73862j45691j23330j05088q9463p5509
$$ 4025876 3657053 3353158 3101579 2892689 2718827 2573136 2449806 2344718 2255255 2179746
60958B179746o2712n1047m0840l2029k4071j7008j1948r729r710j0680j2462j5648
$$ 2179746 2117034 2065987 2025147 1993118 1969047 1952039 1940091 1930362 1920652 1909972 1897510 1881862
60946A881862k0027k4318k7574l0082l2664l5644l8680m1340m3565m5594m7473
$$ 1881862 1861835 1837517 1809943 1779861 1747197 1711553 1672873 1631533 1587968 1542374 1494901
60935A494901m8785m9157m8865m8436m7738m6174m3878m1833m0397l8663l5935
$$ 1494901 1446116 1396959 1348094 1299658 1251920 1205746 1161868 1120035 1079638 1040975 1005040
60924A005040l2990l0947k9523k7557k4943k2781k1539k0163j7568j4241j1749
$$ 1005040 972050 941103 911580 884023 859080 836299 814760 794597 777029 762788 751039
60913G51039j0884j0828j0174q498o655n567n075m338l089j837q29L41J772K721
$$ 751039 740155 729327 719153 710655 704000 698433 693358 689020 685931 684094 683265 683606 685378 688099
60899F88099K525J551N80k18j156k285l452m726o079o998p043o542o080n700n279
$$ 688099 690624 692175 692755 692537 691381 689096 685644 680918 674839 667841 660798 654256 648176 642476 637197
60884F37197n300o292p753q582q523q248q089p726p193p094p427p184n771m077
$$ 637197 631897 625605 617852 609270 600747 592499 584410 576684 569491 562397 554970 547786 542015 537938
60870E37938l450m086n077n608n503m822l634k197r73l78o15j606k851l604l491
$$ 537938 534488 530402 525325 519717 514214 509392 505758 503561 502588 502210 501595 499989 497138 493534 490043
60855D90043k808k043j300n21j6k35j003j588j665j697k088k380j931j073q02
$$ 490043 487235 485192 483892 483371 483355 483120 482117 480529 478864 477167 475079 472699 470768 469695 468893
60840D68893j353j921k075k487l622m515l947k375j458j727k002j325j85O41J275
$$ 468893 467540 465619 463544 461057 457435 452920 448973 446598 445140 443413 441411 440086 439901 440542 441817
60825D41817J981K338K117K111K865L353K243J90p60K3R55O16m17q18n16m36q50
$$ 441817 443798 446136 448253 450364 453229 456582 458825 459015 458255 458278 459233 459849 459432 458614 458098 457662 456812
60808D56812j118q92o72r83j589j918j851j769j921k160k319k554l039l541l659
$$ 456812 455694 454802 454130 453147 451558 449640 447789 446020 444099 441939 439620 437066 434027 430486 426827
60793D26827l397l178l324l788m426n035n157m431l250k566k736l150l222l168
$$ 426827 423430 420252 416928 413140 408714 403679 398522 394091 390841 388275 385539 382389 379167 375999
60779C75999l347l474l098k402j882j558j111n29m8L47Q59J494K182K946L594
$$ 375999 372652 369178 366080 363678 361796 360238 359127 358598 358550 358897 359756 361250 363432 366378 369972
60764C69972L713L406L493M364N198N096M377L877L505K683J756J687K397K720
$$ 369972 373685 377091 380584 384948 390146 395242 399619 403496 407001 409684 411440 413127 415524 418244
60750D18244K089J189P16O73R97J749K353J743j77k155l199l699m495n628o640
$$ 418244 420333 421522 422238 422911 423908 425657 428010 429753 429576 427421 424222 420523 416028 410400 403760
60735D03760p274p334o531n180m353m730n699o175n801m862l632k430j796j842
$$ 403760 396486 389152 382621 377441 373088 368358 362659 356484 350683 345821 342189 339759 337963 336121
60721C36121j884j388q78j107j758j783r39o1K30K66N15P24L11p55j852k338k008
$$ 336121 334237 332849 331971 330864 329106 327323 326384 326323 326553 326819 327334 328058 328369 327614 325762 323424 321416
60704C21416j063J10J090J602J697J722J925K120J958J519J279J358J293Q21M92
$$ 321416 320353 320463 321553 323155 324852 326574 328499 330619 332577 334096 335375 336733 338026 338847 339339
60689C39339J003K233L468M306M729M608L924L335L641M648N345N304N008M729
$$ 339339 340342 342575 346043 350349 355078 359686 363610 366945 370586 375234 380579 385883 390891 395620
60675C95620M063K910J963J695J580R32j54j226k267l372m174m258l843l467l230
$$ 395620 399683 402593 404556 406251 407831 408763 408609 407383 405116 401744 397570 393312 389469 386002 382772
60660C82772k895k505k420k801l411l821l678k978k197j818j618q87M85J699K073
$$ 382772 379877 377372 374952 372151 368740 364919 361241 358263 356066 354248 352630 351743 352228 353927 356000
60645C56000J786J334Q03J12o10j339k312l388l809l195k277k030k423k705k499
$$ 356000 357786 359120 359923 360035 359425 358086 355774 352386 348577 345382 343105 341075 338652 335947 333448
60630C33448k008j402p36k61j89k54m6L62O12P18R52J246J228R03P46J039J449
$$ 333448 331440 330038 329302 329041 328852 328598 328552 328914 329526 330244 331196 332442 333670 334573 335319 336358 337807
60613C37807J371N83m73j027p37j12P9j85k45K09P20Q81Q66Q51O38K41J82O87
$$ 337807 339178 339761 339288 338261 337524 337412 337491 337306 337061 337270 337990 338871 339737 340588 341226 341467 341649 342336
60595C42336J225J410J590J957J895J026K08L91J097J131M19p4M8K99N23J128
$$ 342336 343561 344971 346561 348518 350413 351439 351647 352038 353135 354266 354685 354611 354659 354958 355481 356609
60579C56609J988K301J790J107P95P55J017K017L715N293O255P070Q282R586J0374
$$ 356609 358597 360898 362688 363795 364590 365345 366362 368379 372094 377387 383642 390712 398994 408580 418954
60564D18954J0559J0353R717Q597P272N910M169J785p50k699m029n147n874n443
$$ 418954 429513 439866 449583 458180 465452 471362 475531 477316 476566 473867 469838 464691 458817 453374
60550D53374l728j777o66k00O47K250L898M938N666O683P920Q950R987J1651J3768
$$ 453374 449646 447869 447203 447003 447650 449900 453798 458736 464402 471085 479005 487955 497942 509593 523361
60535E23361J5220J5229J4114J2409J0049O935L623P58j736m213o381p528p420
$$ 523361 538581 553810 567924 580333 590382 597317 600940 601698 599962 595749 589368 581840 574420
60522E74420o451n130l947l396l501l528k801j627q32o39o09m51j57M35J495K755
$$ 574420 567969 562839 558892 555496 551995 548467 545666 544039 543207 542568 541959 541508 541351 541786 543281 546036
60506E46036L899N272P475J0350J3154J5671J8445K1856K5651K9441L2971L5963
$$ 546036 549935 555207 562682 573032 586186 601857 620302 642158 667809 697250 730221 766184
60494G66184L8288M0273M2132M3096M1889L8048L2110K4486J5107M248p051j7761
$$ 766184 804472 844745 886877 929973 971862 1009910 1042020 1066506 1081613 1085861 1078810 1061049
60482A061049k7339l5295m1031m4434m6023m6218m4995m2403l8894l4960l0979
$$ 1061049 1033710 998415 957384 912950 866927 820709 775714 733311 694417 659457 628478
60471F28478k7375k4421k1822j9208j6909j5510j4670j3370j1355r389p946o752
$$ 628478 601103 576682 554860 535652 518743 503233 488563 475193 463838 454449 446503 439751
60459D39751n796n573n877n621m496l674l965m448l917k779k317k639k670j873
$$ 439751 433955 428382 422505 416884 412388 408714 404749 400301 396384 393605 391288 388649 385979 384106
60445C84106q42k52j44k70m52n43n42o57r18r85p82q50j502k067j714p58k66n35
$$ 384106 383264 383012 382868 382598 382146 381603 381061 380404 379486 378501 377719 376869 375367 373300 371586 370828 370562 370027
60427C70027p63k99M75P71L35m53j086j291j043m07N56J618K270K161J679J588
$$ 370027 369264 368965 369440 370211 370546 370093 369007 367716 366673 366266 366822 368440 370710 372871 374550 376138
60411C76138J952K008J352N98M03N10L72J20J87M09K93q6k29j6K92P10J445K288
$$ 376138 378090 380098 381450 382048 382451 382961 383333 383453 383640 384049 384342 384256 384027 384011 384303 385013 386458 388746
60393C88746K752K797K749K650K353K188K714L764M410M051K995J892J115Q00
$$ 388746 391498 394295 397044 399694 402047 404235 406949 410713 415123 419174 422169 424061 425176 425976
60379D25976R39J239J375J474J950K782L423L527L305L071K858K588K231J730
$$ 425976 426915 428154 429529 431003 432953 435735 439158 442685 445990 449061 451919 454507 456738 458468
60365D58468J123P91J108J791K123J856J462J374J573K073L240N200P414R144
$$ 458468 459591 460382 461490 463281 465404 467260 468722 470096 471669 473742 476982 482182 489596 498740
60351D98740J0142J0559J0511J0032R224Q144O694M796K537K6k634n206p308q671
$$ 498740 508882 519441 529952 539984 549208 557352 564046 568842 571379 571405 568771 563565 556257 547586
60337E47586r135q483o742m711l599l823m558m780m369l816l384l050k951l209
$$ 547586 538451 529968 523226 518515 514916 511093 506535 501755 497386 493570 490186 487136 484185 480976
60323D80976l425l006j994j084p20o45m45l7N15J297K343L499M769O558R142J2120
$$ 480976 477551 474545 472551 471467 470747 470102 469657 469620 470135 471432 473775 477274 482043 488601 497743 509863
60307E09863J4720J6628J8102J9360K0197K0263J9283J6939J3031Q000K900j648
$$ 509863 524583 541211 559313 578673 598870 619133 638416 655355 668386 676386 679286 677638
60295F77638o084j0923j5408j7915j7797j6140j4459j3261j2191j0958r516p821
$$ 677638 671554 660631 645223 627308 609511 593371 578912 565651 553460 542502 532986 525165
60283E25165o099n082n273o055o282n757n380n688n993n450m358l732l939m363
$$ 525165 519066 513984 508711 502656 496374 490617 485237 479549 473556 468106 463748 460016 456077 451714
60269D51714m335l768k905j955j192r37j166j415j339j120j078j133r69n51r8
$$ 451714 447379 443611 440706 438751 437559 436622 435456 434041 432702 431582 430504 429371 428402 427851 427753
60254D27753L48Q48J110O62l42r71n63L76P60K11o70j133r51k92N83J360J741
$$ 427753 428101 428949 430059 430721 430379 429408 428845 429221 429981 430192 429522 428389 427438 427146 427729 429089 430830
60237D30830J657J283Q02L98L68R74K079L216M006M225L639K302R56N95J339K276
$$ 430830 432487 433770 434572 434970 435338 436312 438391 441607 445613 449838 453477 455779 456735 457330 458669 460945
60221D60945K612K595K910L710M665N579O412O901O739O111N617N621N980O374
$$ 460945 463557 466152 469062 472772 477437 483016 489428 496329 503068 509179 514796 520417 526397 532771
60207E32771O578O401N707M614L544K941K958L291L390K982K449K378K694K568
$$ 532771 539349 545750 551457 556071 559615 562556 565514 568805 572195 575177 577626 580004 582698 585266
60193E85266J464j19j248j626j645j672j769j985k376k789k994l053l237l539
$$ 585266 586730 586611 585363 583737 582092 580420 578651 576666 574290 571501 568507 565454 562217 558678
60179E58678l670l531l382l425l517l388k887k031j078m94n77j022j155p10j17
$$ 558678 555008 551477 548095 544670 541153 537765 534878 532847 531769 531275 530698 529676 528521 527811 527694
60164E27694M8k79o39n11K61J294J882J592P69K46M57J040J405J476J644K127
$$ 527694 527742 527463 526824 526313 526574 527868 529750 531342 532111 532357 532814 533854 535259 536735 538379 540506
60148E40506K650K795K476K025J908K426L555M932O083O834P528Q577R823J0598
$$ 540506 543156 545951 548427 550452 552360 554786 558341 563273 569356 576190 583718 592295 602118 612716
60134F12716J0577J0155R742R027P500N396L501K058O29q92j882j946j555j358
$$ 612716 623293 633448 643190 652217 659717 665113 668614 670672 671301 670409 668527 666581 665026 663668
60120F63668j347j203r70q85q76p90q66j364k045k444k505k535k731l197m045
$$ 663668 662321 661118 660148 659263 658387 657597 656731 655367 653322 650878 648373 645838 643107 639910 635865
60105F35865n015n345m649l682l511m061m211l289j779n12K06N42Q38J494K719
$$ 635865 630850 625505 620856 617174 613663 609602 605391 602102 600323 599811 600017 600559 601397 602891 605610
60090F05610M185N374O204O923P448P430O980O631O523O221N514M636L557J828
$$ 605610 609795 615169 621373 628296 635744 643174 650154 656785 663308 669529 675043 679679 683236 685064
60076F85064m52k364l358m159n748p982r921j1166j2023j2537j2271j1214j0095
$$ 685064 684612 682248 678890 674731 668983 661001 651080 639914 627891 615354 603083 591869 581774
60063E81774r476r073q410p687p448p582p334o362n254m638m248l322j770l45
$$ 581774 572298 563225 554815 547128 539680 532098 524764 518402 513148 508510 504262 500940 499170 498825
60049D98825M13Q63J636K748L745M387M744M862M746M620M729M907M724M049L150
$$ 498825 499238 500101 501737 504485 508230 512617 517361 522223 526969 531589 536318 541225 545949 549998 553148
60034E53148K267J438O90O2n93j519k745m058n324o517p497q017p928p216n994
$$ 553148 555415 556853 557543 557605 557012 555493 552748 548690 543366 536849 529352 521335 513407 506191 500197
60019E00197m663l863l838m122m220m276m548m631l982l011k679l017l073k468
$$ 500197 495534 491671 487833 483711 479491 475215 470667 466036 462054 459043 456364 453347 450274 447806
60005D47806k022k340k806k582j815j099l90O26J625J975J793J750J999K123K120
$$ 447806 445784 443444 440638 438056 436241 435142 434752 435378 437003 438978 440771 442521 444520 446643 448763
59990D48763K598L708M643M594L749K946K627K527K220J568O40m49j451j990j863
$$ 448763 451361 455069 459712 464306 468055 471001 473628 476155 478375 479943 480583 480134 478683 476693 474830
59975D74830j383j192j624k344k704k399j635p78k4N77J039J395J662J851K117
$$ 474830 473447 472255 470631 468287 465583 463184 461549 460771 460747 461324 462363 463758 465420 467271 469388
59960D69388K747L781M733M985M388L244J832L05r60j547j570j603j864j992j861
$$ 469388 472135 475916 480649 485634 490022 493266 495098 495403 494443 492896 491326 489723 487859 485867 484006
59945D84006k066l069m233m391l361k293k332l295m035l840l110k572k245j545
$$ 484006 481940 478871 474638 470247 466886 464593 462261 458966 454931 451091 447981 445409 443164 441619
59931D41619k34J216K329L196M009M420L975L019K583L220M426N343N707N920
$$ 441619 441385 442601 444930 448126 452135 456555 460530 463549 466132 469352 473778 479121 484828 490748
59917D90748O437P240P871P949P610P251O832N877M437L441L528M027L871L132
$$ 490748 497185 504425 512296 520245 527855 535106 541938 547815 552252 555693 559221 563248 567119 570251
59903E70251K746K895K738J846Q00R9n45j413k148k397k278j824p40P35J646J564
$$ 570251 572997 575892 578630 580476 581276 581375 580830 579417 577269 574872 572594 570770 570030 570765 572411 573975
59887E73975J318J694K210K068J645J953K991L845M194M669N575O240N917M665
$$ 573975 575293 576987 579197 581265 582910 584863 587854 591699 595893 600562 606137 612377 618294 622959
59873F22959L073J615M54m63j343k277l017l209k828k137j387q13o57q31q05k99
$$ 622959 626032 627647 628101 627638 626295 624018 621001 617792 614964 612827 611440 610627 609970 609139 608334 608035
59857F08035J82J8m91m41M39J547K503L733N602P486Q156O984M490J802k82j731
$$ 608035 608217 608235 607744 607303 607742 609289 611792 615525 621127 628613 636769 643753 648243 650045 649763 648032
59841F48032k896l835m147l558k354j170n44q32k107l866n150n435n195n229n604
$$ 648032 645136 641301 637154 633596 631242 630072 629528 628696 626589 622723 617573 612138 606943 601714 596110
59826E96110n749n376m811m443m320m302m248m033l588k922k005q81k2j18j135
$$ 596110 590361 584985 580174 575731 571411 567109 562861 558828 555240 552318 550313 549432 549410 549292 548157
59811E48157k002j876j283j337k056k444k031j465j349j423j224q52o33o51r51
$$ 548157 546155 544279 542996 541659 539603 537159 535128 533663 532314 530891 529667 528815 528182 527531 526580
59796E26580j746k901l733l793l513l535l696l306k309j550j673k274k461j999
$$ 526580 524834 521933 518200 514407 510894 507359 503663 500357 498048 496498 494825 492551 490090 488091
59782D88091j514j597k046k203j797j114m52K06Q84J366J548J682J971K176J991
$$ 488091 486577 484980 482934 480731 478934 477820 477368 477574 478458 479824 481372 483054 485025 487201 489192
59767D89192J619J639K320L372M284M706M626M424M522M826M820M482M618N671
$$ 489192 490811 492450 494770 498142 502426 507132 511758 516182 520704 525530 530350 534832 539450 545121
59753E45121O746O661N732N450O341P211O978O243O314P254P842P244N931M801
$$ 545121 551867 558528 564260 569710 576051 583262 590240 596483 602797 610051 617893 625137 631068 635869
59739F35869M067L349K417J448N94k65j183j848j974j838k000k506k813k718k764
$$ 635869 639936 643285 645702 647150 647744 647479 646296 644448 642474 640636 638636 636130 633317 630599 627835
59724F27835l372m094m206l710l160k834k663k689k956l141k994k912l287l532
$$ 627835 624463 620369 616163 612453 609293 606459 603796 601107 598151 595010 592016 589104 585817 582285
59710E82285k720j168k48m26o56r0P05R16Q84J436K495L305L571L484L005K017
$$ 582285 579565 578397 578149 577723 577067 576977 577682 578598 579482 580918 583413 586718 590289 593773 596778 598795
59694E98795R99O27P30M40m86j266j189m87J05K31K5k43l72l54m44r28j680k233
$$ 598795 599794 600421 601151 601591 601105 599839 598650 598163 598268 598499 598524 598281 597909 597555 597111 596183 594503 592270
59676E92270k452k797l649m588m779m099l429l600m298m405l435k198j772k150
$$ 592270 589818 587021 583372 578784 574005 569906 566477 562877 558579 554174 550739 548541 546769 544619
59662E44619k360j860j221j211j681j770j035J01R66J388J706K223K842L168K941
$$ 544619 542259 540399 539178 537967 536286 534516 533481 533582 534548 535936 537642 539865 542707 545875 548816
59647E48816K292J495N72o42j996k908l049k857l048l687m071l594k394j093j96
$$ 548816 551108 552603 553175 552533 550537 547629 544580 541723 538675 534988 530917 527323 524929 523836 523640
59632E23640J25n3m08n17k79j45o16j574k450l000l487l986m059l493k898l037
$$ 523640 523765 523712 523304 522787 522508 522363 521747 520173 517723 514723 511236 507250 503191 499698 496800 493763
59616D93763l730m074l617k788k039j248k17Q33J620K225K787L084K871K347J962
$$ 493763 490033 485959 482342 479554 477515 476267 476050 476883 478503 480728 483515 486599 489470 491817 493779
59601D93779J879J928J899J639J127P29J043K147L277L567K914J800O95m0j23
$$ 493779 495658 497586 499485 501124 502251 502980 504023 506170 509447 513014 515928 517728 518423 518383 518260
59586E18260K32K17o44j773k331k370k585l181l755m033m011l558k697k074k254
$$ 518260 518492 518709 518065 516292 513961 511591 509006 505825 502070 498037 494026 490468 487771 485697 483443
59571D83443k703k446j650j404j927k164j486n93k85l39k37m2Q7M03R01R52M22
$$ 483443 480740 478294 476644 475240 473313 471149 469663 469070 468785 468446 468209 468167 468254 468657 469558 470510 470932
59554D70932L17J473L180M059L853L467L529L864M179M491M918N596O714Q189
$$ 470932 471249 472722 475902 479961 483814 487281 490810 494674 498853 503344 508262 513858 520572 528761
59540E28761R704J1482J4364J8242K0913J9730J4422P371J144l322o079p046o185
$$ 528761 538465 549947 564311 582553 603466 623196 637618 644989 646133 642811 636732 629686 623501
59527F23501m117j775L41K172L676M682N054M770L927K711J239n39k558m482o054
$$ 623501 619384 617609 617950 620122 623798 628480 633534 638304 642231 644942 646181 645642 643084 638602 632548
59512F32548p439q813r823j0040r778r739r831r174p528n918n302n233m584l250
$$ 632548 625109 616296 606473 596433 586655 576916 567085 557911 550383 544465 539163 533930 529346 526096
59498E26096k308k520l327l560k704j202K34J247J826J983J668R78K51j73k02
$$ 526096 523788 521268 517941 514381 511677 510475 510709 511956 513782 515765 517433 518411 518662 518489 518287
59483E18287L0M52J114K000K905L608M103M564N075N427N215M225K771J572J166
$$ 518287 518317 518769 519883 521883 524788 528396 532499 537063 542138 547565 552780 557005 559776 561348 562514
59468E62514J417J648J314N04j55j29N69J530K491L506M613N589O320P153Q480
$$ 562514 563931 565579 566893 567397 567242 567113 567682 569212 571703 575209 579822 585411 591731 598884 607364
59453F07364J0038J1043J1038J0265R160P954O825N923M997L409Q65k184n110
$$ 607364 617402 628445 639483 649748 658908 666862 673687 679610 684607 688016 688881 686697 681587
59440F81587p701r817j0965j0759r675q736q421q234p368n581l415j766j098r45
$$ 681587 673886 664069 653104 642345 632670 623934 615513 607279 599911 594330 590915 589149 588051 587106
59426E87106k71J451L757N896P687R402J1237J3287J5709J8425K0969K3149K5517
$$ 587106 586835 588286 592043 597939 605626 615028 626265 639552 655261 673686 694655 717804 743321
59413G43321K8431L0711L0007K4723J5288L695p482j5827j9833j9636j6629j2015
$$ 743321 771752 802463 832470 857193 872481 876176 868694 852867 833034 813398 796769 784754
59401G84754o066R41P499J1071R643L188o063j4836k0732k3342k3564k2221j9725
$$ 784754 778688 779629 787128 798199 807842 811030 804967 790131 769399 746057 722493 700272 680547
59388F80547j6731j4141j2187j0235p851n479l731k580j761j376j454j399n94
$$ 680547 663816 649675 637488 627253 619402 613923 610192 607612 605851 604475 603021 601622 601028
59375F01028O46J466J673J875K449L039L225L069K806K430J923J488J309J310
$$ 601028 601674 603140 604813 606688 609137 612176 615401 618470 621276 623706 625629 627117 628426 629736
59361F29736J379J611K117K802L542M416N549O862Q153R344J0487J1598J2651
$$ 629736 631115 632726 634843 637645 641187 645603 651152 658014 666167 675511 685998 697596 710247
59348G10247J3719J4877J6014J6868J7316J7509J7589J7380J6427J4419J1471
$$ 710247 723966 738843 754857 771725 789041 806550 824139 841519 857946 872365 883836
59337H83836P944M085N1l759o805q980j0881j3052j5165j6410j6598j6346j5994
$$ 883836 891780 895865 895916 892157 885352 876372 865491 852439 837274 820864 804266 787920 771926
59324G71926j5087j3288j1259r991r579r302q754q137p498o456m951l587k855
$$ 771926 756839 743551 732292 722301 712722 703420 694666 686529 679031 672575 667624 664037 661182
59311F61182k470j926j288r04o09K42K024M432O912R158J1087J2395J2215R548
$$ 661182 658712 656786 655498 654594 653985 654227 656251 660683 667595 676753 687840 700235 712450 721998
59297G21998M316k060p700j1906j5171j7595j8237j6572j3757j1492j0132q825
$$ 721998 726314 724254 716554 704648 689477 671882 653645 637073 623316 611824 601692 592867
59285E92867p087n247l502j712j37O76R41J659L230M937O175P330Q940J0666J1777
$$ 592867 585780 580533 577031 575319 575182 575858 576799 578458 581688 586625 592800 600130 609070 619736 631513
59270F31513J2154J2209J2241J2304J2272J1683R939P174M419K397O57j547l963
$$ 631513 643667 655876 668117 680421 692693 704376 714315 721489 725908 728305 728962 727415 723452
59257G23452n653o306o410o380o231o096o231o454o188n290m291l601k874j547
$$ 723452 717799 711493 705083 698703 692472 686376 680145 673691 667503 662213 657922 654321 651447 649900
59243F49900L35K090L181L762M402N382O344O786O671O393O170N825N211M442
$$ 649900 650235 652325 655506 659268 663670 669052 675396 682182 688853 695246 701416 707241 712452 716894
59229G16894L555K308N92j300l014m463n557o068o077o169o769p539p909p868
$$ 716894 720449 722757 723349 722049 719035 714572 709015 702947 696870 690701 683932 676393 668484 660616
59215F60616p801p790p655p442p291o942o005m769m112m432n134n355m879m101
$$ 660616 652815 645025 637370 629928 622637 615695 609690 604921 600809 596377 591243 585888 581009 576908
59201E76908l378k735k098j558j328j411j487j240o72Q7J142K534L679L731K727
$$ 576908 573530 570795 568697 567139 565811 564400 562913 561673 561001 561088 562230 564764 568443 572174 574901
59186E74901J822J972K895L678L945L925L798L619L591L862M271M730N513O623
$$ 574901 576723 578695 581590 585268 589213 593138 596936 600555 604146 608008 612279 617009 622522 629145
59172F29145P331P094O599O967Q049Q548P914P148P291P895P651O123M167K709
$$ 629145 636476 643570 650169 657136 665185 673733 681647 688795 696086 703981 711632 717755 721922 724631
59158G24631J600j09k920o139q565r762j0317j0853j1285j1275j0871j0259r370
$$ 724631 726231 726122 723202 717063 708498 698736 688419 677566 666281 655006 644135 633876 624506
59145F24506q266p530p599p985p877p315p014p117o934o035m872m026l472k807
$$ 624506 616240 608710 601111 593126 585249 577934 570920 563803 556869 550834 545962 541936 538464 535657
59131E35657j899r32r2O31J429K447L551M426M993N429N637N275M626M771O292
$$ 535657 533758 532826 532734 533365 534794 537241 540792 545218 550211 555640 561277 566552 571178 575949 582241
59116E82241Q356R848J0827J1853J2479J1825J0448J0138J1538J3207J3589J2826
$$ 582241 590597 600445 611272 623125 635604 647429 657877 668015 679553 692760 706349 719175
59104G19175J1997J1489J0909R987Q743P088M842K098p18k992m163m170l710l471
$$ 719175 731172 742661 753570 763557 772300 779388 784230 786328 785610 782618 778455 774285 770575 767104
59090G67104l217k281j012o90j760l074l507l491m235o027q095r690j0557j0590
$$ 767104 763887 761606 760594 759904 758144 755070 751563 748072 743837 737810 729715 720025 709468 698878
59076F98878r853q870q296q178p908p011n708m704m498m866n024m414l366k712
$$ 698878 689025 680155 671859 663681 655773 648762 643054 638350 633852 628986 623962 619548 616182 613470
59062F13470k811l246l499l495l476l674m150m592m326l078j654j243j992k909
$$ 613470 610659 607413 603914 600419 596943 593269 589119 584527 580201 577123 575469 574226 572234 569325
59048E69325l237l140k861k121q11M13Q75P14N00N03Q13J605K721L467L467L389
$$ 569325 566088 562948 560087 557966 557155 557568 558443 559157 559657 560160 560973 562578 565299 568766 572233 575622
59032E75622M178N786P307Q199Q795R607J0696J1841J3017J4508J6520J8741K0309
$$ 575622 579800 585586 592893 601092 609887 619494 630190 642031 655048 669556 686076 704817 725126
59019G25126K0597J9851J8653J6782J3347Q260K891j312m316p021r616j1236j1126
$$ 725126 745723 765574 784227 801009 814356 822616 825507 824195 819879 812858 803242 792006 780880
59006G80880r535p307n000k690m07J548K858L672M501N472N968N392M016K675
$$ 780880 771345 764038 759038 756348 755941 757489 760347 764019 768520 773992 779960 785352 789368 792043
58992G92043J734R24%j049k385m125n779o652o921p499q616r412r249q635q260
$$ 792043 793777 794701 794701 793652 791267 787142 781363 774711 767790 760291 751675 742263 733014 724379 716119
58977G16119p926p049n601l947k156j33J897L589M852N722O159O305O568P081
$$ 716119 708193 701144 695543 691596 689440 689307 691204 694793 699645 705367 711526 717831 724399 731480
58963G31480P542P826Q280R045R569R187P809N742L260O13k042m927q285j1499
$$ 731480 739022 746848 755128 764173 773742 782929 790738 796480 799740 800353 798311 793384 785099 773600
58949G73600j3374j3652j3498j3967j4695j4629j3375j1271q814o612n269m663
$$ 773600 760226 746574 733076 719109 704414 689785 676410 665139 656325 649713 644444 639781
58937F39781l946k779j871j739j847j629j458j669j518l54R22Q40n93k055k805
$$ 639781 635835 633056 631185 629446 627599 625970 624512 622843 621325 620971 621893 622733 622140 620085 617280
58922F17280l163l408l366l107k998k998k765k425k351k322j769p52J86J035K241
$$ 617280 614117 610709 607343 604236 601238 598240 595475 593050 590699 588377 586608 585856 586042 587077 589318
58907E89318L680M665N100N724P048Q782J0400J1566J1964J1487J0711J0485J0920
$$ 589318 592998 597663 602763 608487 615535 624317 634717 646283 658247 669734 680445 690930 701850
58894G01850J1446J1892J2754J4313J6141J7780J9335K1145K3246K5208K6192
$$ 701850 713296 725188 737942 752255 768396 786176 805511 826656 849902 875110 901302
58883I01302K5306K2402J8442J4616J1223P801M050j1m441r169j3548j6841j8969
$$ 901302 926608 949010 967452 982068 993291 1001092 1005142 1005131 1000690 991521 977973 961132 942163
58870I42163k0061j9705j7595j4690j2532j1399j0230q485o915o180n934n766
$$ 942163 922102 902397 884802 870112 857580 846181 835951 827466 820551 814371 808437 802671
58858H02671o081p292q930j0241j1139j1886j2237j1583r837p633n817m872m711
$$ 802671 796590 789298 780368 770127 758988 747102 734865 723282 713445 705812 699995 695123 690412
58845F90412m808m699m536m955o330q269r981j0914j1088j0928j0723j0204q861
$$ 690412 685604 680905 676369 671414 665084 656815 646834 635920 624832 613904 603181 592977 584116
58832E84116o853n183m613m734m596l933l205k724k331j820j121j90P60J222J068
$$ 584116 577263 572080 567467 562733 558137 554204 550999 548275 545944 544124 543003 542813 543573 544795 545863
58817E45863R69J509K212K218J577J025P71M43J39M95J571K552K711K043R24j73
$$ 545863 546832 548341 550553 552771 554348 555373 556144 556587 556726 557221 558792 561344 564055 566098 567022 566849
58801E66849o20j33O19N91k76j035j015m99m4R9k12r85j672j454j71J483K688
$$ 566849 566229 566096 566715 567306 567030 565995 564980 564481 564437 564536 564324 563339 561667 560213 560042 561525 564213
58784E64213L075K790K574L413N325O884O833N883N685O347O336M899L071J876
$$ 564213 567288 570078 572652 576065 581390 588274 595107 600990 606675 613022 619358 624257 627328 629204
58770F29204Q66q39l112n044n981n839n082m504m420m026k448l80N82K97L68J716
$$ 629204 630070 629231 626119 621075 615094 609255 604173 599669 595249 591223 588775 588395 588977 589274 589642 591358
58754E91358L266L815L753L998M374M151L387K656K112J700J767K516L413L898
$$ 591358 594624 598439 602192 606190 610564 614715 618102 620758 622870 624570 626337 628853 632266 636164
58740F36164M252M991N954O678P280Q147R156R990J0850J2183J3847J5191J5786
$$ 636164 640416 645407 651361 658039 665319 673466 682622 692612 703462 715645 729492 744683 760469
58727G60469J5602J4696J3183J1327R270P001M909L872M327N610O726P457Q228
$$ 760469 776071 790767 803950 815277 824547 831548 836457 840329 844656 850266 856992 864449 872677
58714H72677R165R803R647Q638P082N300L309Q57k098n127p932j0897j4444j8008
$$ 872677 881842 891645 901292 909930 917012 922312 925621 926478 924380 919253 911321 900424 885980 867972
58700H67972k0531k1937k3241k4975k6392k6514k5160k2713j9716j6984j5296
$$ 867972 847441 825504 802263 777288 750896 724382 699222 676509 656793 639809 624513
58689F24513j4460j3418j1640r792q639q093p644p037o152m901l646k968k711
$$ 624513 610053 596635 584995 575203 566564 558471 550827 543790 537638 532737 529091 526123 523412
58676E23412k072q68J49N48Q38J468K243L129M617O734Q783J0526J2537J4723
$$ 523412 521340 520472 520621 521169 522007 523475 525718 528847 533464 540198 548981 559507 572044 586767
58662E86767J5828J5131J3497J1822R638O329K650k34k330m203n637o170o286
$$ 586767 602595 617726 631223 643045 652683 659012 661662 661428 659098 654895 649258 643088 636802
58649F36802o781p454p646p421p146o447m881l140k251j990j386m41mq8K84J507
$$ 636802 630021 622567 614921 607500 600354 593907 589026 585886 583635 581645 580259 579818 579814 579726 580010 581517
58633E81517K829L430L158K127N87q36j586j911k343k627k033o29P53J780K910
$$ 581517 584346 587776 590934 593061 593648 592812 591226 589315 586972 584345 582312 581683 582436 584216 587126
58618E87126M300N377N740N747N960O503P143P489P069N695L794J993M42j022
$$ 587126 591426 596803 602543 608290 614250 620753 627896 635385 642454 648149 651943 653936 654378 653356
58604F53356k270k950l084l037k972k836k764l032l582m013l997l487k573j428
$$ 653356 651086 648136 645052 642015 639043 636207 633443 630411 626829 622816 618819 615332 612759 611331
58590F11331k08J117K647M179N388O384P600Q996J0035J0558J0901J1010J0458
$$ 611331 611123 612240 614887 619066 624454 630838 638438 647434 657469 668027 678928 689938 700396
58577G00396R585R467J0186J0389R415Q541R069J0314J0970J1484J3441J7023
$$ 700396 709981 719448 729634 740023 749438 757979 767048 777362 788332 799816 813257 830280
58565H30280K0820K3954K6927L0223L3386L5700L6840L6581L4714L1426K7159
$$ 830280 851100 875054 901981 932204 965590 1001290 1038130 1074711 1109425 1140851 1168010
58554A168010K2106J6368J0530N446J420j910n022q153j1268j4025j6118j7862
$$ 1168010 1190116 1206484 1217014 1222460 1223880 1221970 1216948 1208795 1197527 1183502 1167384 1149522
58542A149522j9905k2199k3997k5156k6359k7662k8003k6862k5178k3718k1825
$$ 1149522 1129617 1107418 1083421 1058265 1031906 1004244 976241 949379 924201 900483 878658
58531H78658j8931j6013j4037j2189r351o318m641l973k687o64O03O31N54R54
$$ 878658 859727 843714 829677 817488 808137 801819 797178 793205 790518 789854 790457 791088 791642 792596
58517G92596R38j10j443k240k688l235l768m058m254m524m806n002m969m444l576
$$ 792596 793534 793424 791981 789741 787053 783818 780050 775992 771738 767214 762408 757406 752437 747993 744417
58502G44417l130l503l952l617k771k224j994j666j402j455j249k11J059J759
$$ 744417 741287 737784 733832 730215 727444 725220 723226 721560 720158 718703 717454 717243 718302 720061
58488G20061K404L941N884P043P620Q877J1009J3076J4873J7057J9465K1052K1497
$$ 720061 722465 726406 732290 739333 746953 755830 766839 779915 794788 811845 831310 852362 873859
58475H73859K1222J9836J6419J1448O614K416k163p291j1421j3472j4253j4883
$$ 873859 895081 914917 931336 942784 949398 951814 949651 942360 930939 917467 903214 888331
58463H88331j5198j4476j2645j0101p232m546k358q5L117O872R746J0936J0744
$$ 888331 873133 858657 846012 835911 828679 824133 821775 821690 824807 831679 841425 852361 863105
58450H63105R503P258M561K124l52l669p363r847j0448r933q898p188n031l205
$$ 863105 872608 879866 884427 886551 886199 882530 875167 865320 854872 844939 836041 828853 823822 820617
58436H20617j751Q3K353M269N707P408R576J1719J4094J7585K1887K5327K6729
$$ 820617 818866 818949 821302 825571 831278 838686 848262 859981 874075 891660 913547 938874 965603
58423I65603K5971K2725J6550Q552J017n043j0253j4542j6608j6327j5504j5356
$$ 965603 991574 1014299 1030849 1039401 1040418 1035375 1025122 1010580 993972 977645 962141 946785
58411I46785j5073j3863j2562j2089j1981j1603j1255j0994r896p597n277l963
$$ 946785 931712 917849 905287 893198 881217 869614 858359 847365 837469 829872 824595 820632
58399H20632l087j767l01O71J373K216K889L023K903K771K305J395M68l55j467
$$ 820632 817545 815778 815477 816148 817521 819737 822626 825649 828552 831323 833628 835023 835491 835136 833669
58384H33669k780l629l975m518n379n931o112o363o106l914L10M925Q641J1388
$$ 833669 830889 827260 823285 818767 813388 807457 801345 794982 788876 784962 785272 790197 798838 810226
58370H10226J2968J2805J1488J0706J1038J1569J2035J3264J5054J5893J5485
$$ 810226 823194 835999 847487 858193 869231 880800 892835 906099 921153 937046 952531
58359I52531J5352J6075J6234J5005J3502J2495J1065Q690O427M815K813J63j459
$$ 952531 967883 983958 1000192 1015197 1028699 1041194 1052259 1060949 1067376 1072191 1075004 1075167 1073708
58346A073708j101j49K78J275L746O187O948O969Q227J0808J3315J4957J5686
$$ 1073708 1072607 1072458 1072736 1074011 1077757 1083944 1090892 1097861 1106088 1116896 1130211 1145168 1160854
58333A160854J5489J4884J4872J5314J4786J2859J0862R515P869N611M083L801
$$ 1160854 1176343 1191227 1206099 1221413 1236199 1249058 1259920 1269435 1277304 1282915 1286998 1290799
58321A290799L292J873J223K514M281M949N222O143P016P205P876R883J1917J2800
$$ 1290799 1294091 1295964 1297187 1299701 1303982 1308931 1314153 1320296 1327312 1334517 1342393 1352276 1364193 1376993
58307A376993J3521J4998J5905J5020J3732J3958J5228J5979J6023J5798J4937
$$ 1376993 1390514 1405512 1421417 1436437 1450169 1464127 1479355 1495334 1511357 1527155 1542092
58296A542092J3547J3088J4154J5247J5425J6027J7969J9735K0038K0043K0914
$$ 1542092 1555639 1568727 1582881 1598128 1613553 1629580 1647549 1667284 1687322 1707365 1728279
58285A728279K1661K1563K2145K4386K6569K7343K8252L0715L3217L4136L4667
$$ 1728279 1749940 1771503 1793648 1818034 1844603 1871946 1900198 1930913 1964130 1998266 2032933
58274B032933L6173L7520L7897L9316M3156M7089M8802M9962N3033N6969N9686
$$ 2032933 2069106 2106626 2144523 2183839 2226995 2274084 2322886 2372848 2425881 2482850 2542536
58263B542536O2069O5726O9329P0967P1620P2590P2209O8911O4991O3276O2754
$$ 2542536 2604605 2670331 2739660 2810627 2882247 2954837 3027046 3095957 3160948 3224224 3286978
58252C286978O1418O0692O2874O6869P0645P5182Q1798Q8539R3599R9251J07857
$$ 3286978 3348396 3409088 3471962 3538831 3609476 3684658 3766456 3854995 3948594 4047845 4155702
58241D155702J17177J24417J31561J41598J52753J61791J69754J79052J88316
$$ 4155702 4272879 4397296 4528857 4670455 4823208 4984999 5154753 5333805 5522121
58232E522121J95765K04156K16463K30201K42169K55047K72905K94091L15225
$$ 5522121 5717886 5922042 6138505 6368706 6610875 6865922 7138827 7432918 7748143
58223G748143L38120L65716L95472M24412M56382M96333N41865N88770O40274
$$ 7748143 8086263 8451979 8847451 9271863 9728245 10224578 10766443 11355213 11995487
58214A1995487P01950P72430Q48627R35159J038625J157777J289895J441209J620077
$$ 11995487 12697437 13469867 14318494 15253653 16292278 17450055 18739950 20181159 21801236
58205B1801236J826523K061208K338742K679927L098990L613037M256209N069510
$$ 21801236 23627759 25688967 28027709 30707636 33806626 37419663 41675872 46745382
58197D6745382O085922P340745Q884382J0769153J3042414J5773793J9064030
$$ 46745382 52831304 60172049 69056431 79825584 92867998 108641791 127705821
58190A27705821K2994507K7574784L2694804L7921542M2113831M3309153L9441543
$$ 127705821 150700328 178275112 210969916 248891458 291005289 334314442 373755985
58183C73755985K9681991J5310079p57441j5418997k6630273l3703658l6923943
$$ 373755985 403437976 418748055 417990614 402571617 375941344 342237686 305313743
58176C05313743l7079866l5143760l2027487k8412266k4727259k1230708j8068766
$$ 305313743 268233877 233090117 201062630 172650364 147923105 126692397 108623631
58169A08623631j5290571j2882204j0818788r079189p627941o417284n410121
$$ 108623631 93333060 80450856 69632068 60552879 52924938 46507654 41097533
58162D1097533m581768l902478l338656k869718k486176k172581j908287j682890
$$ 41097533 36515765 32613287 29274631 26404913 23918737 21746156 19837869 18154979
58154A8154979j495325j338684j200093j074610r65726q72238p86711p06713o36174
$$ 18154979 16659654 15320970 14120877 13046267 12080541 11208303 10421592 9714879 9078705
58145I078705n75289n19293m67356m23280l87336l55975l29170l09564k94733
$$ 9078705 8503416 7984123 7516767 7093487 6706151 6350176 6021006 5711442 5416709
58136E416709k78573k60059k42973k27558k10346j91821j76393j64580j52577
$$ 5416709 5138136 4878077 4635104 4407546 4197200 4005379 3828986 3664406 3511829
58127C511829j39745j29505j22509j15597j07969j02010r7664r2123q5582q1288
$$ 3511829 3372084 3242579 3120070 3004473 2896504 2794494 2696830 2604707 2519125 2437837
58117B437837p9398p6506p1828o8194o6254o3233n8374n4460n2718n0976m7989
$$ 2437837 2358439 2281933 2210105 2141911 2075657 2012424 1954050 1899590 1846872 1795896 1747907
58106A747907m5281m3684m1993l9913l8598l7787l6015l3858l3226l3376l1588
$$ 1747907 1702626 1658942 1616949 1577036 1538438 1500651 1464636 1430778 1397552 1364176 1332588
58095A332588k7964k5592k5523k5532k4252k2781k1658j9897j7566j5985j4943
$$ 1332588 1304624 1279032 1253509 1227977 1203725 1180944 1159286 1139389 1121823 1105838 1090895
58084A090895j3022j0866j0724j2543j4000j4563j6022j8718k0826k1752k2755
$$ 1090895 1077873 1067007 1056283 1043740 1029740 1015177 999155 980437 959611 937859 915104
58073I15104k3769k3175k1242k0243k0466j9657j7135j5023j4401j3605j1511
$$ 915104 891335 868160 846918 826675 806209 786552 769417 754394 739993 726388 714877
58062G14877r322p939o518m866m468n830p300p703p875q588r227r410r714j0054
$$ 714877 705555 697616 691098 686232 681764 675934 668634 660931 653056 644468 635241 625831 616117 606063
58048F06063r455q051p128o814o041n120n622p293p831o526n318n433n715n299
$$ 606063 596608 588557 581429 574615 568574 563454 557832 550539 542708 536182 530864 525431 519716 514417
58034E14417n158n751n742m478l498m088n412o384p373q699r320q502p190o481
$$ 514417 509259 503508 497766 493288 489790 485702 480290 473906 466533 457834 448514 440012 432822 426341
58020D26341o167n755n486n414m901l875l101k621j497L13J527J634J670K244
$$ 426341 420174 414419 408933 403519 398618 394743 391642 389021 387524 387837 389364 390998 392668 394912
58006C94912K646K607L033M182M943M813M780N361N521M562L354K695J993O30
$$ 394912 397558 400165 403198 407380 412323 417136 421916 427277 432798 437360 440714 443409 445402 446032
57992D46032q98k122l331m445m631l887l412l664l687l128l133m305n536n904
$$ 446032 445134 443012 439681 435236 430605 426718 423306 419642 415955 412827 409694 405389 399853 393949
57978C93949o056o633o977o553o056n919n269l623k215k222k980l149k566j788
$$ 393949 387893 381260 374283 367730 361674 355755 350486 346863 344648 342426 339446 336297 333731 331943
57964C31943r82k67p7k43J82J297J905J470J079J456J528K33j648k714k793k403
$$ 331943 330961 330694 330617 330374 330556 331853 333758 335228 336307 337763 339291 339524 337876 335162 332369 329966
57948C29966j635p79q12j907k543j364R63L003M487N877P108Q136R665J1924J3600
$$ 329966 328331 327552 326740 324833 322290 320926 321889 324892 329379 335256 342364 350500 360165 372089 385689
57933C85689J3480J2386J2023J2482J2271J0394P244L726N75j825l730n845q226
$$ 385689 399169 411555 423578 436060 448331 458725 465969 469695 470270 468445 464715 458870 450644
57920D50644r977j0561j0586j0692j0523r604q285o976n386l378j706r45m54O45
$$ 450644 440667 430106 419520 408828 398305 388701 380416 373440 368054 364676 362970 362025 361571 362216
57906C62216K115L144L439L111K181R87K78J42k50j238k009k059k118k725l103
$$ 362216 364331 367475 370914 374025 376206 377193 377471 377613 377363 376125 374116 372057 369939 367214 364111
57891C64111k532j696j505j576j156n84n36p18n66m76j062j892k190k149k375
$$ 364111 361579 359883 358378 356802 355646 355062 354526 353808 353242 352766 351704 349812 347622 345473 343098
57876C43098k729k826k955l388l573l147k871l308l401j942L47J712J882K145
$$ 343098 340369 337543 334588 331200 327627 324480 321609 318301 314900 312958 313305 315017 316899 319044
57862C19044L258M719N892O586O712O500O741P749Q519P952O503N419M814L751
$$ 319044 322302 327021 332913 339499 346211 352711 359452 367201 375720 383672 390175 395594 400408 404159
57848D04159J917L8j227j821k028k580m382p130q862q180o281n469o121o644n996
$$ 404159 406076 406114 404887 403066 401038 398458 394076 386946 378084 369904 363623 358154 352033 345389 339393
57833C39393m682l467k595k317k803l489l520k880k090j129K19J338J481J155
$$ 339393 334711 331244 328649 326332 323529 320040 316520 313640 311550 310421 310640 311978 313459 314614
57819C14614J479K364K766K512K265J765j14l273n981p081p165p188p143o809
$$ 314614 316093 318457 321223 323735 326000 327765 327651 324378 318397 311316 304151 296963 289820 283011
57805B83011o526o564o482n833m748l471k017o43J43M07Q48J700K291K106J625
$$ 283011 276485 269921 263439 257606 252858 249387 247370 246727 246870 247277 248125 249825 252116 254222 255847
57790B55847J670K416L431M275M773N023N353N985O705P095P048O758O486O578
$$ 255847 257517 259933 263364 267639 272412 277435 282788 288773 295478 302573 309621 316379 322865 329443
57776C29443P303Q211Q148O528M188K332J135J31p46j448k603m719o954p926p547
$$ 329443 336746 344957 353105 359633 363821 366153 367288 367419 366673 365225 362622 357903 350949 343023 335476
57761C35476o956o805o838o980p480p876p211n524l993l329l024k460j716j032
$$ 335476 328520 321715 314877 307897 300417 292541 285330 279806 275813 272484 269460 267000 265284 264252
57747B64252l70J90M52O39J181J895K275K460K947L421L104K271K133K941L561
$$ 264252 263882 264072 264524 265163 266344 268239 270514 272974 275921 279342 282446 284717 286850 289791 293352
57732B93352L221K499K034J579R04M70M64J68q53j776j627p07j78n95j554k391
$$ 293352 296573 299072 301106 302685 303589 304059 304523 304691 303838 302062 300435 299728 299550 298955 297401 295010
57716B95010k749k673k563k819l338l659l667l701l932m108m020l690l157k505
$$ 295010 292261 289588 287025 284206 280868 277209 273542 269841 265909 261801 257781 254091 250934 248429
57702B48429j981j641j101k69J26m28j191j219j021j686k805k969k239k245l464
$$ 248429 246448 244807 243706 243437 243563 243135 241944 240725 239704 238018 235213 232244 230005 227760 224296
57687B24296m342l778k737k395k271j398k9J109K219L846N722P314Q898J1066
$$ 224296 219954 216176 213439 211044 208773 207375 207346 208455 210674 214520 220242 227556 236454 247520
57673B47520J3809J6958K0899K5994L1963L8598M6086N3435N7339N4004M2229
$$ 247520 261329 278287 299186 325180 357143 395741 441827 495262 552601 606605 648834
57662F48834K4069L196j6631l2337m2374m7083m7637m4894l9774l3979k9094k5245
$$ 648834 672903 676099 659468 627131 584757 537674 490037 445143 405369 371390 342296 317051
57650C17051k1576j7837j4609j2194j0236q455o916n618m451l521k917k308j325
$$ 317051 295475 277638 263029 250835 240599 232144 225228 219610 215159 211638 208721 206413 205088
57637B05088j73O80J217J633J734J251N39K33L31L16M9j71l00o30j122j399j364
$$ 205088 204915 205595 206812 208445 210179 211430 211969 212202 212533 212849 212898 212727 212427 211797 210675 209276 207912
57620B07912j331j443j486j348j171j024q74q49j123j539j782j809j750j465p60
$$ 207912 206581 205138 203652 202304 201133 200109 199235 198386 197263 195724 193942 192133 190383 188918 188158
57605A88158M6L30L6k54k26l36j039j933k135j372l73o4n79j295j689j868k121
$$ 188158 188204 188534 188570 188316 188090 187754 186715 184782 182647 181275 180902 180838 180259 178964 177275 175407 173286
57588A73286k360k346k269k520k935k864k149j464j429j837k008j612q76l24m64
$$ 173286 170926 168580 166311 163791 160856 157992 155843 154379 152950 151113 149105 147493 146617 146293 145829
57573A45829j343k299k538k080j726j956k431k695k725k497j699m35M24J70p29
$$ 145829 144486 142187 139649 137569 135843 133887 131456 128761 126036 123539 121840 121405 121829 121999 121270
57558A21270j188p61Q5P14R00P96O82P59R90J284J749K452L031K977K384J862
$$ 121270 120082 119321 119406 120120 121020 121816 122498 123257 124247 125531 127280 129732 132763 135740 138124 139986
57542A39986J686J629J689K119K627K380J168k17j137j772k247k027q57N04J174
$$ 139986 141672 143301 144990 147109 149736 152116 153284 153067 151930 150158 147911 145884 145027 145531 146705
57527A46705J156Q21J37q67j525j288n62r3M2J54K30J68K36O54J149J543K099
$$ 146705 147861 148682 148819 147952 146427 145139 144577 144484 144526 144680 144910 145078 145314 145968 147117 148660 150759
57510A50759K733K621J418J28j79K07L89L52N02M27n34j915k565k293j909j836
$$ 150759 153492 156113 157531 157659 157480 157687 158076 158428 158930 159357 158823 156908 154343 152050 150141 148305
57494A48305j790j659j593j392q20l19m28p34n92n09j427k845l183k079q56m25
$$ 148305 146515 144856 143263 141871 141051 140732 140304 139570 138978 138469 137042 134197 131014 128935 128079 127654
57478A27654k26K56L99l74j452j919j765j420r03q2P33J184J379J506J371Q09
$$ 127654 127428 127684 128083 127709 126257 124338 122573 121153 120250 120168 120901 122085 123464 124970 126341 127150
57462A27150J60j50j96l13n33n41p1P85J507J439N19m12m81J34N15K98n9k56n74
$$ 127150 127310 127160 126964 126651 126118 125577 125506 126291 127798 129237 129756 129344 128863 128997 129512 129810 129751 129495 128921
57443A28921j085j215n10O35J397J348O64j22m81l00q6l77j008j320j079o79m63
$$ 128921 127836 126621 126111 126746 128143 129491 130155 130033 129552 129252 129166 128789 127781 126461 125382 124703 124240
57426A24240l61k51j58j1L33P29P75L23m04j094j470j328p87k91k1L82J061J440
$$ 124240 123879 123628 123470 123459 123792 124521 125296 125619 125215 124121 122651 121323 120536 120245 120224 120606 121667 123107
57408A23107J139P06O77M23q24k283k348q69O00R54O04K67l9l92n03l44k45r5
$$ 123107 124246 124952 125629 126052 125228 122945 120597 119728 120328 121282 121886 122153 122114 121722 121219 120875 120630 120535
57390A20535O35J767K337K054J722J872K044J845J633J595J283O20L84R69J649
$$ 120535 121170 122937 125274 127328 129050 130922 132966 134811 136444 138039 139322 139942 140326 141295 142944
57375A42944J756J608J593J312N23p2Q7M03J94o1L49R35P02j95p01m85j80j57
$$ 142944 144700 146308 147901 149213 149736 149664 149751 150154 150348 150287 150636 151571 152273 152078 151377 150892 150712 150555
57357A50555j23J00L31N96J157J862K162J885J487J359J346J064N29K31O17J389
$$ 150555 150432 150532 150863 151459 152616 154478 156640 158525 160012 161371 162717 163781 164310 164541 165158 166547
57341A66547J595P30m58q22l56l5k26l23p5r5n55o24R4P00M79J90P97J848K300
$$ 166547 168142 168872 168414 167592 167236 167201 166975 166652 166577 166482 165927 165303 165397 166097 166576 166766 167563 169411 171711
57322A71711K286K622L149K889J692M62j07o5M69J435K393K874L123L623M052
$$ 171711 173997 176619 179768 182657 184349 184811 184704 184639 185108 186543 188936 191810 194933 198556 202608
57307B02608L664K606J851J767J741J322Q22O39P81J269K181L177L616L373K898
$$ 202608 206272 208878 210729 212496 214237 215559 216381 217020 217801 219070 221251 224428 228044 231417 234315
57292B34315K428J815J194J010J271J478J533J875K530K751K076J093O45Q15J098
$$ 234315 236743 238558 239752 240762 242033 243511 245044 246919 249449 252200 254276 255369 256014 256829 257927
57277B57927J194J125R12O48Q02J931M008O247P706Q075P798P432P020O268N261
$$ 257927 259121 260246 261158 261806 262608 264539 268547 274794 282500 290575 298373 305805 312825 319093 324354
57262C24354M566M497M789N197N945P140Q344R233J0190J1563J2755J2936J2327
$$ 324354 328920 333417 338206 343403 349348 356488 364832 374065 384255 395818 408573 421509 433836
57249D33836J1898J1877J1572J0695R925R900J0375J0775J0906J0807J0442R977
$$ 433836 445734 457611 469183 479878 489803 499703 510078 520853 531759 542566 553008 562985
57237E62985R894J0440J1223J1640J1512J1136J0923J1158J1808J2451J2590J2210
$$ 562985 572879 583319 594542 606182 617694 628830 639753 650911 662719 675170 687760 699970
57225F99970J1820J1933J2592J3413J3939J4018J3984J4336J5188J6169J7042
$$ 699970 711790 723723 736315 749728 763667 777685 791669 806005 821193 837362 854404
57214H54404J7928J8722J8781J7786J6502J5994J6340J6758J6723J6350J5888
$$ 854404 872332 891054 909835 927621 944123 960117 976457 993215 1009938 1026288 1042176
57203A042176J5627J6103J7495J8857J8888J7623J6529J6759J8043J9436K0333
$$ 1042176 1057803 1073906 1091401 1110258 1129146 1146769 1163298 1180057 1198100 1217536 1237869
57192A237869K0460J9707J8503J7792J8117J9056J9821K0066J9902J9610J9525
$$ 1237869 1258329 1278036 1296539 1314331 1332448 1351504 1371325 1391391 1411293 1430903 1450428
57181A450428J9879K0540K1295K2380K4239K6669K8836L0242L1165L1963L2694
$$ 1450428 1470307 1490847 1512142 1534522 1558761 1585430 1614266 1644508 1675673 1707636 1740330
57170A740330L3579L5079L7117L8884L9816M0217M0560M0779M0754M0852M1426
$$ 1740330 1773909 1808988 1846105 1884989 1924805 1965022 2005582 2046361 2087115 2127967 2169393
57159B169393M2238M2930M3676M4817M6174M7275M7991M8552M9124M9700N0214
$$ 2169393 2211631 2254561 2298237 2343054 2389228 2436503 2484494 2533046 2582170 2631870 2682084
57148B682084N0471N0358N0247N0772N1911N2886N3198N3147N2876N1769M9465
$$ 2682084 2732555 2782913 2833160 2883932 2935843 2988729 3041927 3095074 3147950 3199719 3249184
57137C249184M6784M4727M3085M0984L8450L6429L5444L5262L5864L7872M1855
$$ 3249184 3295968 3340695 3383780 3424764 3463214 3499643 3535087 3570349 3606213 3644085 3685940
57126C685940M7918N6006O5871P6540Q6436R4101R8422R8541R4578Q8653Q4252
$$ 3685940 3733858 3789864 3855735 3932275 4018711 4112812 4211234 4309775 4404353 4493006 4577258
57115D577258Q4136Q9227R9250J13482J30583J48895J67644J87578K10195K37017
$$ 4577258 4661394 4750621 4849871 4963353 5093936 5242831 5410475 5598053 5808248 6045265
57105F045265K69638L09630L58007M15773M85428N71166O77150Q06736R63791
$$ 6045265 6314903 6624533 6982540 7398313 7883741 8454907 9132057 9938793 10902584
57096A0902584J153302J379368J643299J943882K277787K638307L015355L398224
$$ 10902584 12055886 13435254 15078553 17022435 19300222 21938529 24953884 28352108
57088B8352108L776040M132963M445048M685256M829226M851121M717634M400173
$$ 28352108 32128148 36261111 40706159 45391415 50220641 55071762 59789396 64189569
57080F4189569L902955L274746K581760J864166J120193L30997n03084j348288
$$ 64189569 68092524 71367270 73949030 75813196 76933389 77264386 76761302 75413014
57072G5413014k149892k854665l428347l862014m166452m359464m455718m464667
$$ 75413014 73263122 70408457 66980110 63118096 58951644 54592180 50136462 45671795
57064D5671795m392946m246246m031162l758509l444860l109406k769362k438498
$$ 45671795 41278849 37032603 33001441 29242932 25798072 22688666 19919304 17480806
57056A7480806k127690j844206j590872j367773j174664j010632q72473p55570
$$ 17480806 15353116 13508910 11918038 10550265 9375601 8364969 7492496 6736926
57048F736926o56399n72806n02287m41828l89477l44455l05607k71182k40257
$$ 6736926 6080527 5507721 5005434 4563606 4174129 3829674 3524067 3252885 3012628
57039C012628k12924j88785j66600j45704j26407j08591r1153p3292n5158l6667
$$ 3012628 2799704 2610919 2444319 2298615 2172208 2063617 1972464 1899172 1844014 1807347
57029A807347j7097K819J8955K5114J6925m955l4624o3862q6352j00151j06502
$$ 1807347 1790250 1793069 1812024 1837138 1854063 1849108 1814484 1750622 1664270 1564119 1457617
57018A457617j07014j02677r4944q6011p7435o9317o1289n3536m6558m0635l5908
$$ 1457617 1350603 1247926 1152982 1066971 989536 920219 858930 805394 758836 718201 682293
57007F82293l2309k9204k5814k2210j9228j7253j5898j4899j4347j3883j2755
$$ 682293 649984 620780 594966 572756 553528 536275 520377 505478 491131 477248 464493
56996D64493j1063r805r238q338o487m498l094j512J215M498P037Q808J0909J3560
$$ 464493 453430 443625 434387 426049 419562 415064 411970 410458 411673 416171 423208 432016 442925 456485
56982D56485J5456J5114J1998O371r28q423j4499j8404k0439k1146k0729j9275
$$ 456485 471941 487055 499053 505424 504496 496073 481574 463170 442731 421585 400856 381581
56970C81581j7054j4375j1481q628o074l826j584J084M471Q521J2797J6876K0823
$$ 381581 364527 350152 338671 330043 323969 320143 318559 319643 324114 332635 345432 362308 383131
56957C83131K4917K8537K9661K6070J7325N429o507j6224k2996k6935k8128k6794
$$ 383131 408048 436585 466246 492316 509641 515070 508563 492339 469343 442408 414280 387486
56945C87486k3830k0505j7431j4343j1007p719m580j002L347P792J1621J5359
$$ 387486 363656 343151 325720 311377 300370 292651 288071 287069 290416 298208 309829 325188
56933C25188K0116K5922L1561L5611L6730L3358K4646J1817k438j5904k7309l5301
$$ 325188 345304 371226 402787 438398 475128 508486 533132 544949 542511 526607 499298 463997
56921D63997l8726l8219l5927l3146k9431k4463j9311j5110j1835r173p332o174
$$ 463997 425271 387052 351125 317979 288548 264085 244774 229664 217829 208656 201324 195150
56909A95150m836l147k192k439k540j273N02J266J216J650K744L644M323N578
$$ 195150 190314 187167 184975 182536 179996 178723 179225 180491 181707 183357 186101 189745 194068 199646
56895A99646P363Q752R652J1172J4037J7746K1531K5110K8313L0785L2206L2036
$$ 199646 207009 215761 225413 236585 250622 268368 289899 315009 343322 374107 406313 438349
56883D38349K9130K2563J3082K908o055j3166j8317k1219k1737k0311j7602j4160
$$ 438349 467479 490042 503124 506032 499977 486811 468494 447275 425538 405227 387625 373465
56871C73465j0458o699k599K204P514J2847J8312K4606L2199M0977N0588O0369
$$ 373465 363007 356308 353709 355913 363427 376274 394586 419192 451391 492368 542956 603325
56859F03325O8720P3016P0507N9475M0239J5753r014k9359m3043n0311n2319n0167
$$ 603325 672045 745061 815568 875043 915282 931035 922021 892662 849619 799308 746989 696822
56847F96822m5007l7992k9792k0778j1622k981N495J4982K6142L8550N1723O5881
$$ 696822 651815 613823 584031 563253 551631 548650 554145 569127 595269 633819 685542 751423
56835G51423Q1303R7230J11494J20424J19049J02823P1009K8781j4780n1536p7688
$$ 751423 832726 929956 1041450 1161874 1280923 1383746 1454755 1483536 1468756 1417220 1339532
56824A339532r3323r9965r9242r3115q3891p3236o1610m9168l6705k5062j3997
$$ 1339532 1246209 1146244 1047002 953887 869996 796760 735150 685982 649277 624215 610218
56813F10218k553R549K1793L4170M7463O1719P5024Q4087Q5398P5979N4695K4115
$$ 610218 607665 617214 639007 673177 720640 782359 857383 941470 1026868 1102847 1157542 1181657
56801A181657r546l9527o1807p5532q1512q1328p7022p0266o1755n1971m2096
$$ 1181657 1172111 1132584 1070777 995245 913733 832405 755383 685117 623362 571391 529295
56790E29295l3352k5801j8607j1162l333M942J3452K1521K8837L5929M2595M6259
$$ 529295 495943 470142 451535 440373 437040 441982 455434 476955 505792 541721 584316 630575
56778F30575M3271L2239J5370l361k0587l4335m3842m9284n1214m9996m6106m0722
$$ 630575 673846 706085 721455 718094 697507 663172 619330 570046 518832 468836 422730 382008
56766C82008l5370l0858k7044k3590k0389j7385j4510j1866r663q021p081o921
$$ 382008 346638 315780 288736 265146 244757 227372 212862 200996 191333 183312 176231 169310
56754A69310p048o528n083l577k837k628k361k114k124k031j589j454k121k767
$$ 169310 162262 155734 150651 147074 144237 141609 139248 137134 135010 132979 131390 129936 127815 125048
56740A25048k388j551j536k213k298j559j110j478j851j552q87k57L57P36M85
$$ 125048 122660 121109 119573 117360 115062 113503 112393 110915 109064 107512 106625 106368 106725 107461 107946
56725A07946kK14J116J593J167O43O33O14Rp60r78o30j44J83J48l01o87l59N73
$$ 107946 107944 108158 109274 110867 112034 112677 113310 113924 113933 113173 112195 111565 111421 111604 111752 111451 110764 110405 110978
56706A10978J286J360J131Q93O26N17Q08J066O08k06l15L16N25j11n11J97J302
$$ 110978 112264 113624 114755 115648 116274 116791 117599 118665 119273 119067 118752 119068 119593 119482 118971 119168 120470
56689A20470J680J328R78R15R30Q85P66N71N08P22P98K64l68J1J386K369K032
$$ 120470 122150 123478 124456 125371 126301 127186 127952 128523 129031 129753 130551 130815 130447 130458 131844 134213 136245
56672A36245J003L38K25L31M51L80l7l13L60J801K759K516J612P41K1l27J68J138
$$ 136245 137248 137586 137811 138142 138593 138973 138936 138623 138983 140784 143543 146059 147671 148412 148433 148106 148274 149412
56654A49412J416P72L83Q88J354R86N49R35J569J519J096J068J140N88k73n99
$$ 149412 150828 151600 151983 152871 154225 155211 155760 156695 158264 159783 160879 161947 163087 163675 163402 162803
56638A62803m39m05m67k57j46p47j652j876j300o80l99k68l00p32j334j608j573
$$ 162803 162364 161959 161492 161235 161089 160342 158690 156814 155514 154834 154435 154167 153867 153135 151801 150193 148620
56621A48620j635j804j746j373q10k5Q29J097L79p45j462j754j911j532j32J556
$$ 148620 146985 145181 143435 142062 141252 141227 142056 143153 143532 142787 141325 139571 137660 136128 135996 137552
56605A37552K137J370M52L17N63L87k66r03j255j425j461j163l17R22J894J920
$$ 137552 139689 141059 141511 141828 142391 142778 142512 141609 140354 138929 137468 136305 135988 136910 138804 140724
56589A40724J024k1m61j80M83J152J501J405J124R96Q50L23k36R0J443K768L157
$$ 140724 141748 141727 141266 141086 141569 142721 144222 145627 146751 147747 148597 148920 148684 148774 150217 152985 156142
56572A56142K838K475K199J906J861K352L244M309N548O860P960Q988J0417J1988
$$ 156142 158980 161455 163654 165560 167421 169773 173017 177326 182874 189734 197694 206682 217099 229087
56558B29087J2639J1976J0941J0376R829Q573O947N746N029M389L863L624L331
$$ 229087 241726 253702 264643 275019 284848 293421 300368 306114 311143 315532 319395 323019 326350
56545C26350K617J757J119M47o28j882k985m040m982n210m633m286m987o123o722
$$ 326350 328967 330724 331843 332290 331662 329780 326795 322755 317773 312563 307930 303644 298657 292534 285812
56530B85812o963p473p862p298o103n437n642o035o122n924n333m255l245k978
$$ 285812 278849 271376 263514 256216 250113 244676 239034 232999 226877 220953 215620 211365 208120 205142
56516B05142l191l065k467j975j801j609j292j125j219j478j890k303k217j491
$$ 205142 201951 198886 196419 194444 192643 191034 189742 188617 187398 185920 184030 181727 179510 178019
56502A78019p92o73p42m43j01k83o95o92l65j52Q6N92R02O02K59M98P30J65n96
$$ 178019 177227 176554 175812 175369 175268 174985 174290 173598 173233 173081 173167 173759 174661 175263 175522 176020 176750 176915 176319
56483A76319m12L94N52N9J20R26J298P49K52M77P62M75J10L01P57Q22M02k28q82
$$ 176319 175907 176301 176853 176912 177032 177958 179256 180005 180257 180734 181496 181971 182081 182382 183139 183961 184363 184135 183253
56464A83253j305j152m83J74M95O42Q03R04Q21M77j77q70r76l16L75L79L1P4M47
$$ 183253 181948 180796 180313 180487 180982 181624 182427 183331 184152 184629 184452 183582 182606 182290 182665 183044 183075 183149 183596
56445A83596O01O33J036J562J419N45k89o06n46j86N33J246J412J078O94L42r4
$$ 183596 184197 184830 185866 187428 188847 189392 189103 188497 187951 187765 188298 189544 190956 192034 192728 193070 192976
56428A92976l18n9J71k71r94j135p16l80j04O39J547J673Q60p6o21r45j044o32
$$ 192976 192658 192599 192770 192499 191505 190370 189654 189274 189170 189809 191356 193029 193889 193813 193192 192247 191203 190571
56410A90571J15P12J160J670J798J066J30N9O12O00j36n50k23J47K62P14J634
$$ 190571 190686 191398 192558 194228 196026 197092 197222 197281 197893 198493 198357 197807 197584 197731 197993 198707 200341
56393B00341K206K008J602J404J134P28P06J177J506J332J056R75Q53N81L87K05
$$ 200341 202547 204555 206157 207561 208695 209423 210129 211306 212812 214144 215200 216175 217028 217609 217996 218201
56377B18201k58p58o96j28L42O14J024J337J031M72N66J167J202M68k3K65P02
$$ 218201 217943 217185 216489 216361 216703 217317 218341 219678 220709 221181 221747 222914 224116 224584 224561 224826 225528
56360B25528Q21J002J484J822J692J264O08k39o89k21M29P4j020j488j096r18
$$ 225528 226349 227351 228835 230657 232349 233613 234221 233982 233293 233072 233501 233575 232555 231067 229971 229053
56344B29053j223r98KO51N13O94J845K944K981K403K020J786J587J908K746L109
$$ 229053 227830 226832 226834 227485 227998 228692 230537 233481 236462 238865 240885 242671 244258 246166 248912 252021
56328B52021K499J874K209L083L540L388K902K100J112M19J17k79q37r50m58l2
$$ 252021 254520 256394 258603 261686 265226 268614 271516 273616 274728 275147 275264 274985 274148 273198 272740 272708
56312B72708L2K97J045J705J868J796J595J100Q60J776L335L768K610J523J752
$$ 272708 272740 273037 274082 275787 277655 279451 281046 282146 283006 284782 288117 291885 294495 296018 297770
56297B97770K386K157J493J470J942K054J738J514J479J469J616J934K019J771
$$ 297770 300156 302313 303806 305276 307218 309272 311010 312524 314003 315472 317088 319022 321041 322812
56283C22812J783K376L052L315L275L093K712K433K744L270L115K492K678L965
$$ 322812 324595 326971 330023 333338 336613 339706 342418 344851 347595 350865 353980 356472 359150 363115
56269C63115N103N262N049N040M948M923O026Q407J0561J1404J1725J2610J3790
$$ 363115 368218 373480 378529 383569 388517 393440 399466 407873 418434 429838 441563 454173 467963
56256D67963J4667J5595J7079J8845K0781K3585K7462L1289L4060L6132L8183
$$ 467963 482630 498225 515304 534149 554930 578515 605977 637266 671326 707458 745641
56245G45641M0105M1716M3294M4594M4628M3237M1478L9625L6336L0801K4158
$$ 745641 785746 827462 870756 915350 959978 1003215 1044693 1084318 1120654 1151455 1175613
56234A175613J7650J0903L314m367j1068j6795k1781k5619k8355l1032l3945l5799
$$ 1175613 1193263 1204166 1207480 1203113 1192045 1175250 1153469 1127850 1099495 1068463 1034518 998719
56222I98719l5887l5496l5743l5577l3612l0564k8127k6595k5241k3945k2864
$$ 998719 962832 927336 891593 856016 822404 791840 763713 737118 711877 687932 665068
56211F65068k1448j9382j7561j6677j5858j4128j2116j0898j0191r145p895o911
$$ 665068 643620 624238 606677 590000 574142 560014 547898 537000 526809 517664 509769 502858
56199E02858n837m343l158k816k476j380k66J5R2P43J231O39k79k71M59J017J523
$$ 502858 497021 492678 489520 486704 484228 482848 482582 482597 482689 483432 484663 485302 485023 484752 485211 486228 487751
56182D87751K444L177K979K318J937J555R76J201K777M295M272L435L413M240
$$ 487751 490195 493372 496351 498669 500606 502161 503137 504338 507115 511410 515682 519117 522530 526770
56168E26770M918N390O128O742O805P120Q372R523R353Q652R068J0617J2161J3447
$$ 526770 531688 537078 543206 549948 556753 563873 572245 581768 591121 599773 608841 619458 631619 645066
56154F45066J4942J6410J7477J8800K1073K3687K5942K8665L3023L8764M5150
$$ 645066 660008 676418 693895 712695 733768 757455 783397 812062 845085 883849 928999
56143I28999N2640O1959P2674Q4240R7231J11650J25059J34177J37493J34911
$$ 928999 981639 1043598 1116272 1200512 1297743 1409393 1534452 1668629 1806122 1941033
56133A941033J26397J12857R7254Q2903P1503O3762O0074N8703N5303M6639L3677
$$ 1941033 2067430 2180287 2277541 2360444 2431947 2495709 2555783 2614486 2669789 2716428 2750105
56122B750105J9328N061q289j8731k5174k9979l6804m7044o0430p7098r6169j13897
$$ 2750105 2769433 2774494 2766205 2747474 2722300 2692321 2655517 2608473 2548043 2470945 2374776 2260879
56110B260879j26337j32870j34636j31224j21983j09113r6076q3814p1477n9693
$$ 2260879 2134542 2001672 1867036 1735812 1613829 1504716 1408640 1324826 1253349 1193656
56100A193656m9937m1686l3442k5825k0565j7185j3655r722o728m847l282k353
$$ 1193656 1143719 1102033 1068591 1042766 1022201 1005016 991361 981639 974911 970064 966782 964429
56088I64429k588k666j063J193K129K200L220N065O304P025Q071Q691P892O952
$$ 964429 961841 959175 958112 959305 961434 963634 966854 971919 978223 985248 993319 1002010 1009902 1016854
56074A016854P631R146R909J0682J2753J4660J4330J2959J3127J4449J4819J4509
$$ 1016854 1024485 1033631 1043540 1054222 1066975 1081635 1095965 1108924 1122051 1136500 1151319 1165828
56062A165828J5111J5843J4990J3720J4351J6026J6185J5130J4934J5159J4027
$$ 1165828 1180939 1196782 1211772 1225492 1239843 1255869 1272054 1287184 1302118 1317277 1331304
56051A331304J2566J3067J4610J4640J3829J4736J6835J7715J8006K0119K3166
$$ 1331304 1343870 1356937 1371547 1386187 1400016 1414752 1431587 1449302 1467308 1487427 1510593
56040A510593K4228K3810K4887K7413K8848K9243L0656L2538L2935L3210L6117
$$ 1510593 1534821 1558631 1583518 1610931 1639779 1669022 1699678 1732216 1765151 1798361 1834478
56029A834478M0237M2009M2091M3837M6690M7398M6702M8154N1079N1615N0225
$$ 1834478 1874715 1916724 1958815 2002652 2049342 2096740 2143442 2191596 2242675 2294290 2344515
56018B344515N1284N5326N8647O0412O3392O7667P0524P2487P6645Q2207Q5617
$$ 2344515 2395799 2451125 2509772 2570184 2633576 2701243 2771767 2844254 2920899 3003106 3088723
56007C088723Q7631R2129R8531J03006J06459J13277J22687J29802J34841J42576
$$ 3088723 3176354 3268483 3367014 3470020 3576479 3689756 3812443 3942245 4077086 4219662
55997D219662J52929J61110J66929J74698J84134J90977J96561K06671K20928
$$ 4219662 4372591 4533701 4700630 4875328 5059462 5250439 5447000 5653671 5874599
55988E874599K33638K45178K61655K83237L04210L24750L50685L81381M10516
$$ 5874599 6108237 6353415 6615070 6898307 7202517 7527267 7877952 8259333 8669849
55979H669849M39251M75453N19331N63784O09601O65656P33099Q05020Q82893
$$ 8669849 9109100 9584553 10103884 10667668 11277269 11942925 12676024 13481044 14363937
55970A4363937R77024J089471J213861J353518J521549J722088J951848K221922
$$ 14363937 15340961 16430432 17644293 18997811 20519360 22241448 24193296 26415218
55962B6415218K556733K970513L469154M078080M843633N805458O994358Q456895
$$ 26415218 28971951 31942464 35411618 39489698 44333331 50138789 57133147 65590042
55954F5590042J0252714J2433212J5060149J8234548K2054634K6543588L1625786
$$ 65590042 75842756 88275968 103336117 121570665 143625299 170168887 201794673
55947B01794673L7009829M1795178M4131368M1684529L3055339J9067674K626397
$$ 201794673 238804502 280599680 324731048 366415577 399470916 418538590 421164987
55940D21164987j2829820k4913714l2775435l6647929l7278406l5624323l2645451
$$ 421164987 408335167 383421453 350646018 313998089 276719683 241095360 208449909
55933B08449909k9091012k5421813k1902104j8694137j5867099j3408286j1285456
$$ 208449909 179358897 153937084 132034980 113340843 97473744 84065458 72780002
55926G2780002r483583p979566o725820n678805m815602m110844l525584l031235
$$ 72780002 63296419 55316853 48591033 42912228 38096626 33985782 30460198 27428963
55918B7428963k620619k285102k002644j757228j549144j376830j227139j091655
$$ 27428963 24808344 22523242 20520598 18763370 17214226 15837396 14610257 13518602
55910A3518602r75070q79311p95158p16677o48789n93539n43116m93153m49651
$$ 13518602 12543532 11664221 10869063 10152386 9503597 8910058 8366942 7873789 7424138
55901G424138m16088l86081l54971l26974l04910k83855k60723k39731k23075
$$ 7424138 7008050 6621969 6266998 5940024 5635114 5351259 5090536 4850805 4627730
55892D627730k06025j86317j68863j56378j44505j30712j18988j11438j04224
$$ 4627730 4421705 4235388 4066525 3910147 3765642 3634930 3515942 3404504 3300280
55883C300280r6159r2392r4906r7811r6664r4417r3714r1420q5590q0221p8024
$$ 3300280 3204121 3111729 3016823 2919012 2822348 2727931 2634217 2542797 2457207 2376986 2298962
55872B298962p5536p0165o5357o3968o2924n9160n4912n2506m9794m5193m1749
$$ 2298962 2223426 2153261 2087904 2023936 1961012 1901852 1846940 1794434 1744640 1699447 1657698
55861A657698m1609m1661l8961l5733l4743l4435l2641l0728l0173k9200k6501
$$ 1657698 1616089 1574428 1535467 1499734 1464991 1430556 1397915 1367187 1337014 1307814 1281313
55850A281313k4288k4257k4534k3718k3806k5910k7233k5663k3449k3051k3208
$$ 1281313 1257025 1232768 1208234 1184516 1160710 1134800 1107567 1081904 1058455 1035404 1012196
55839A012196k2154k1031k0966k0397j8334j6844j7318j7697j6135j4152j3454
$$ 1012196 990042 969011 948045 927648 909314 892470 875152 857455 841320 827168 813714
55828H13714j3031j1932j1457j2035j1484r033p552r027j1238j1635j1212j1634
$$ 813714 800683 788751 777294 765259 753775 744742 737190 728163 716925 705290 694078 682444
55816F82444j1872j0635r163q683q002o227m955n104m555j720J467K888L715N735
$$ 682444 670572 659937 650774 642091 634089 627862 622907 617803 613248 611528 612995 615883 619598 625333
55802F25333P979Q964R664J1353J2775J2292J0604Q781N887J199l456o282q309
$$ 625333 633312 642276 651940 663293 676068 688360 698964 707745 713632 714831 711375 705093 696784
55789F96784j1045j3422j3666j2381j1320j0853j0811j1948j4340j6116j5861
$$ 696784 685739 672317 658651 646270 634950 624097 613286 601338 586998 570882 555021
55778E55021j4523j3120j0676o391j559K726P485J3101J6810J5592J0039L132
$$ 555021 540498 527378 516702 510311 508752 511478 518963 532064 548874 564466 574505 577637
55766E77637l221q436j1799j3036j3094j2638j1223r117p963q189p929o239n058
$$ 577637 574416 565980 554181 541145 528051 515413 504190 495073 487110 478921 470992 464753 459695
55753D59695o205q736j1020j3166j5336j6139j4870j3181j2360j1150q388n516
$$ 459695 453490 444754 433734 420568 405232 389093 374223 361042 348682 337532 329144 323628
55741C23628m132l370k093j441k593m106m188l643l963m342l382j956j579j628
$$ 323628 319496 316126 314033 312592 309999 305893 301705 298062 294099 289757 286375 284419 282840 281212
55727B81212q58j62r65k373k684k395k949l746l179j564m18K27J269K401K892
$$ 281212 280354 280192 279227 276854 274170 271775 268826 265080 261901 260337 259919 260146 261415 263816 266708
55712B66708L427M830N974N296L338J547n9j818k545j384k16j317l748m889m534
$$ 266708 270135 274965 280939 286235 289573 291120 291061 289243 286698 285314 285098 283781 280033 275144 270610
55697B70610m538n293n583n305n362n286l814j607o80j196j324k54R52J455J469
$$ 270610 266072 260779 255196 249891 244529 239243 235429 233822 233142 231946 230622 230368 231320 232775 234244
55682B34244J166O58Q05K169L566L537K674K453K598J770J83q73j516k763l964
$$ 234244 235410 236068 236873 239042 242608 246145 248819 251272 253870 255640 255823 254950 253434 250671 246707
55667B46707l413j395o5k00m87j22J46n9L4P52J432J865K656L926N085N961O721
$$ 246707 243294 241899 241834 241634 241147 241025 241171 241112 241146 241898 243330 245195 247851 251777 256862 262823 269544
55650B69544O875N872M388L426K515N63j920l440m071n339p590r459j0057r855
$$ 269544 276419 282291 286679 290105 292620 293183 291263 287823 283752 278413 270823 261364 251307 241452
55636B41452r291q316p355p033o833n681l924l002l149l161k509j934j812j543
$$ 241452 232161 223845 216490 209457 202624 196943 193019 190017 186868 183707 181198 179264 177452 175909
55622A75909q69l17j35k8m1m45r37j155j579k562l059k029n52n32j685j970q91
$$ 175909 175040 174723 174588 174560 174519 174074 173137 171982 170403 167841 164782 162753 162201 161669 159984 158014 157123
55605A57123o5m72j301j848k446l048k829j732p75l58Q5N51K49p22j263j133j174
$$ 157123 157058 156586 155285 153437 150991 147943 145114 143382 142607 142249 142334 142885 143134 142412 141149 140016 138842
55588A38842j391p04Q66J713J091K77M84J213J534J549J655J673J556J836K643
$$ 138842 137451 136747 137613 139326 140417 140694 141178 142391 143925 145474 147129 148802 150358 152194 154837
55573A54837L328L607M058M987N874O343O584O450N347L393J505k8j783l732m917
$$ 154837 158165 161772 165830 170817 176691 183034 189618 196068 201415 204808 206313 206285 204502 200770 195853
55558A95853n081n178n713n889n107m030l476l309l177l193l284k849j802r73
$$ 195853 190772 185594 179881 173992 168885 164855 161379 158070 154893 151700 148416 145567 143765 142792
55544A42792q68q96m37K33N40L81r4p00r16l10N50O49J14J07Q80J272O16k67n64
$$ 142792 141924 141028 140591 140824 141364 141745 141651 140951 140035 139725 140275 140924 141038 141145 142025 143297 143913 143646 143082
55525A43082o70j157j678j818j940k384k656k300j758j588j537j153o90p11j225
$$ 143082 142412 141255 139577 137759 135819 133435 130779 128479 126721 125133 123596 122443 121753 121042 119817
55510A19817j811k157k060j436o16j31lJ57K75j82j165j894k002j921j885j483
$$ 119817 118006 115849 113789 112353 111737 111606 111603 111760 112035 111853 110688 108794 106792 104871 102986 101503
55494A01503n55L69Q87J168J292J075P55R24J420J338M76k24j23K40K14l3j60
$$ 101503 100948 101317 102204 103372 104664 105739 106494 107418 108838 110176 110652 110428 110305 110545 110759 110726 110566
55477A10566k86l93k5Q41J395J077L03l86j052j792k209k065j719j427r22q9N98
$$ 110566 110280 109887 109862 110703 112098 113175 113478 113092 112040 110248 108039 105974 104255 102828 101906 101817 102415
55460A02415Q12Q19Q45O98L63J84J39k04p36q17m63m80r71r45k9P04L83l23m14
$$ 102415 103227 104046 104891 105589 105952 106136 106275 106071 105335 104518 104055 103575 102604 101659 101630 102334 102717 102394 101980
55441A01980j14j16k41L9M24L41R8L61Q89Q97M09K19N91R50Q70N53K91L0k83m54
$$ 101980 101866 101750 101509 101548 101972 102313 102411 102772 103661 104558 104967 105186 105777 106727 107597 108150 108441 108471 108188 107734
55421A07734k74K15P46R89P92L65J05J89M29N50L22l40j163j534j177o25n61r13
$$ 107734 107460 107675 108421 109410 110202 110567 110672 110861 111290 111840 112162 111822 110659 109125 107948 107323 106762 105849
55403A05849j151j159j144r12j92N88P30L76K33L22J01k85j08N70Q80O60O97J171
$$ 105849 104698 103539 102395 101483 101291 101879 102609 102985 103218 103540 103641 103356 103248 103818 104698 105358 106055 107226
55385A07226J155J92q97j262j049o70p6O95J213J299J168P04l51j316j034K68
$$ 107226 108381 108573 107676 106414 105365 104695 104619 105314 106527 107826 108994 109698 109347 108031 106997 107265
55369A07265R94M74j99j68p5n47j022j040j249j995k311j490m25j26j54J75K94
$$ 107265 108259 108733 108534 108366 108291 107744 106722 105682 104433 102438 100127 98637 98212 98086 97932 98107 98401
55352I8401m22j098o25M23P72N46P74J442J694J461J246Q05l45j449j306l17q2
$$ 98401 97979 96881 96256 96679 97451 97997 98771 100213 101907 103368 104614 105419 105074 103625 102319 102002 101920
55335A01920q83j337o64K82O44P12R42J049P92N96P42P70L08k41l91l96p18j135
$$ 101920 101037 99700 99036 99318 99962 100674 101616 102665 103457 104053 104795 105565 105873 105632 105241 104845 104127 102992
55317A02992r95k22M86M64j79p21o78l34k62n44o82l30L07Q87J317J527J350Q16
$$ 102992 101997 101775 102261 102725 102546 101825 101147 100813 100551 100007 99325 98995 99302 100189 101506 103033 104383 105199
55299A05199J66n81j464j914j052Q97K314J972M63p92j295j463j454j033l52Q1
$$ 105199 105365 104784 103320 101406 100354 101251 103565 105537 106000 105208 103913 102450 100996 99963 99611 99692
55283I9692J86L50P09R22P17K68K1K48O47M38o99j788j411L70J796J571L91k45
$$ 99692 99878 100228 100937 101859 102576 102844 102865 103113 103760 104198 103499 101711 100300 100670 102466 104037 104428 104183
55265A04183K9M85O00L99j7n07p30n47k81j18K01O98P98L11l8K93P27N46J02J04
$$ 104183 104212 104697 105297 105696 105679 105172 104442 103895 103614 103496 103697 104395 105193 105504 105466 105759 106486 107032 107134 107238
55245A07238L77L17N3J01K90M6n40r08r75r77p23J5P03O43O9k01lJ57M9j49m31
$$ 107238 107615 107932 107985 108086 108376 108422 107882 106974 105999 105022 104299 104314 105017 105660 105729 105528 105525 105682 105731 105582 105151
55224A05151p59o01L64J422J594R96M80K63r2o24r07q87q05m81K83Q94N71l68
$$ 105151 104392 103791 104155 105577 107171 108167 108647 108910 108818 108194 107287 106400 105595 105114 105397 106291 106862 106494
55206A06494r52j011j054r62j62R26J073J41n67k26M46N47K89K87M81M36J11k47
$$ 106494 105542 104531 103477 102515 102353 103279 104352 104493 103926 103700 104146 104693 104982 105269 105750 106186 106297 106050
55188A06050m68l49L05J185J519R56j8o80p32k31O02J340J587J387J050O37O3
$$ 106050 105582 105233 105538 106723 108242 109198 109180 108500 107768 107537 108139 109479 111066 112453 113503 114140 114203
55171A14203m18m29j27m8l18n62n66m32j72K22M10O6m72n89l19j39m1L43Q18P41
$$ 114203 113785 113356 113229 113181 112863 112301 111735 111303 111131 111353 111763 111829 111357 110768 110449 110310 110269 110612 111430 112171
55151A12171J38k92l09m09p59q30l92K6mj77j11O7R0l2k35m74m37J49Q02O37l45
$$ 112171 112309 112017 111708 111299 110540 109710 109318 109344 109340 109163 109052 109119 109209 109177 108942 108468 108031 108180 108982 109619 109274
55130A09274j097j004o34o36o33M6J115J585J029K2n99n27l9L65M24K26m6l21
$$ 109274 108177 107173 106539 105903 105270 105316 106431 108016 109045 109067 108468 107941 107902 108267 108691 108917 108871 108550
55112A08550n05l55J51N51M43O9n8Q6J36J5OK66Q17J762K907L442K725J245L8
$$ 108550 108045 107690 107841 108392 108835 108904 108846 108932 109068 109083 109089 109355 110172 111934 114841 118283 121008 122253 122291
55093A22291o34j203j612j261k21N72N42J23j46l51o80q90p04k24L21P95R63O48
$$ 122291 121657 120454 118842 117581 117360 117932 118474 118597 118451 118100 117420 116530 115826 115602 115923 116718 117681 118329
55075A18329J55J7J58m6p57j349j276p34k45n9q6m5L29Q27P34k49j341j585j163
$$ 118329 118484 118501 118659 118613 117856 116507 115231 114497 114252 114193 114107 114062 114391 115218 115952 115703 114362 112777 111614
55056A11614q83p00J08J411K095J645P23q5r99k081k636k156j050J4P71J006M16
$$ 111614 110731 110031 110139 111550 113645 115290 116013 115928 114929 112848 110212 108056 107006 107020 107791 108797 109213
55039A09213o16r54PJ495K302K019J080J40l00j77p2n57j271j283m41N08J203
$$ 109213 108597 107643 107650 109145 111447 113466 114546 114686 114386 114209 114137 113580 112309 111026 110585 111093 112296
55022A12296J990K749K554J074o51j442j196m65L79J016J022M56o7k76n05q01
$$ 112296 114286 117035 119589 120663 120012 118570 117374 116909 117288 118304 119326 119782 119715 119439 118934 118133
55006A18133o74j38O9k46k53M85J213J339J435K006K297J512L22k9M40P11M02
$$ 118133 117459 117321 117390 117144 116891 117376 118589 119928 121363 123369 125666 127178 127500 127471 127911 128622 129024
54989A29024K9p4o4k6J17K36K09K28L40J40n35j081r23m00j28j1L87R17J048O97
$$ 129024 129053 128979 128915 128889 129006 129242 129451 129679 130019 130159 129624 128543 127620 127220 127092 127081 127468 128385 129433 130130
54969A30130J77k44k99K83J174J483R83N84R13J244P44j22m86n18p67p91N7J030
$$ 130130 130307 130063 129764 130047 131221 132704 133687 134271 135184 136428 137172 137050 136564 136046 135279 134488 134545 135575
54951A35575P49o07j472j193p21q10r85p01k74j41j72j47j61j18L51J127J457
$$ 135575 136324 135717 134245 133052 132331 131521 130536 129835 129561 129420 129248 129101 128940 128822 129173 130300 131757
54934A31757R68K03j32N4N18J130J779K268K584K880L178L437L889M798N828O243
$$ 131757 132725 132928 132796 132850 133368 134498 136277 138545 141129 144009 147187 150624 154513 159311 165139 171382
54918A71382N799M932M016K974J653P6j715l513m771n101m929m996n277n089m267
$$ 171382 177181 182113 186129 189103 190756 190832 189117 185604 180833 175732 170803 165807 160530 155441 151174
54903A51174l359k622j744p61l50p48j233j173r00r52j035m90N78J299J130M41
$$ 151174 147815 145193 143449 142688 142338 141590 140357 139184 138284 137332 136297 135807 136385 137684 138814 139255
54887A39255K7L73J311K229K651K679K809L245L737M045M269M530M666M425L779
$$ 139255 139282 139655 140966 143195 145846 148525 151334 154579 158316 162361 166630 171160 175826 180251 184030
54872A84030K871J797N47r70k755m469n456n381m665l960l320k428j481j182j683
$$ 184030 186901 188698 189245 188275 185520 181051 175595 170214 165549 161589 158269 155841 154360 153178 151495
54857A51495k239k193j781j568j590j516j268j029q60p18p03q70j046j112j284
$$ 151495 149256 147063 145282 143714 142124 140608 139340 138311 137451 136733 136030 135160 134114 133002 131718
54842A31718j709k007j702j003o46q68j058o43J22N28L20j62n61p93q36o54m09
$$ 131718 130009 128002 126300 125297 124651 123783 122725 122082 122204 122732 123052 122890 122329 121536 120700 120046 119637
54825A19637l56l92m0Q23J615J777J541J506J633J324M78k20k66PL6j88l50l82
$$ 119637 119281 118889 118849 119672 121287 123064 124605 126111 127744 129068 129546 129326 129060 129067 129103 128915 128565 128183
54807A28183l89k46K08Q02J215J353J218O27m70j547j813j008L71J581K098J773
$$ 128183 127794 127548 127756 128558 129773 131126 132344 132971 132501 130954 129141 128133 128504 130085 132183 133956
54791A33956Q67o5o40q95q96l82P70J976K429K147J886J934J648N68n48m93Q18
$$ 133956 134823 134758 134118 133223 132327 131945 132715 134691 137120 139267 141153 143087 144735 145303 144755 144262 145080
54774A45080K171K578K371K576L545M792N839O620P008O657N648M661M060L308
$$ 145080 147251 149829 152200 154776 158321 163113 168952 175572 182580 189237 194885 199546 203606 206914
54760B06914J857R9j302k576m325o116o752o011n011m532m113l279k554k563k986
$$ 206914 208771 208870 207568 204992 200667 194551 187799 181788 176777 172245 168132 164853 162299 159736 156750
54745A56750l267l513l878l673k222j06J388J847J809J577R01o9n67j36P91J481
$$ 156750 153483 149970 146092 142419 140197 140091 141479 143326 145135 146712 147613 147544 146977 146841 147632 149113
54729A49113J645J564J735K434L401M085M390M785N421N627M806L334K006R34
$$ 149113 150758 152322 154057 156491 159892 163977 168367 173152 178573 184200 189006 192340 194346 195280
54715A95280k78j656k862l866m801n370n145m367l716l338k842k134j572j287
$$ 195280 195002 193346 190484 186618 181817 176447 171302 166935 163219 159881 157039 154905 153333 152046
54701A52046j078r41j073j327j343j185j219j368j196p42n69q81j250j290j032
$$ 152046 150968 150027 148954 147627 146284 145099 143880 142512 141316 140574 140005 139124 137874 136584 135552
54686A35552n42J27N83L51l49p49o02n10r15j421j394q12j39K27K20O3O3K58L17
$$ 135552 135010 135137 135720 136071 135722 134973 134371 133861 132946 131525 130131 129319 129180 129407 129627 129690 129753 130011 130328
54667A30328K5k89k37rK1l2J53L64K29J19P09J704J983J165J17l56m26n45p12
$$ 130328 130353 130064 129827 129818 129839 129807 129960 130324 130553 130672 131381 133085 135068 136233 136350 135994 135568 135023 134311
54648A34311p54o64k57P40J886K143J218J44p4L02M22J68N3K05J97k27p96j089
$$ 134311 133557 132893 132636 133376 135262 137405 138623 138767 138693 138995 139417 139585 139638 139843 140040 139813 139017 137928
54630A37928r32n18k46l14m63l74k28l48m02K86J467J860P81q10j483j000k31
$$ 137928 136996 136478 136232 135918 135455 135081 134853 134505 134103 134389 135856 137716 138497 137687 136204 135204 134973
54613A34973J49J86J20M8K8J05K16L01M18N38N34M89P44J263J322K88j402k497
$$ 134973 135122 135308 135428 135476 135504 135609 135825 136126 136544 137082 137616 138105 138849 140112 141434 141722 140320 137823
54595A37823k200r13K59N78J69l01k97K27R59J512J506P82k73q79p12l43m78r37
$$ 137823 135623 134710 134969 135547 135716 135415 135118 135345 136304 137816 139322 140104 139831 138952 138240 137897 137419 136482
54577A36482r12n4J200K166K367J647L98m99n47k42k59l61M6O36N48j37m85l02
$$ 136482 135570 135516 136716 138882 141249 142896 143294 142795 142248 142006 141747 141386 141432 142068 142616 142479 141994 141692
54559A41692l67q46q48n4N40K36j58L37J266J491Q57R3m21p27n65M29J876K822
$$ 141692 141325 140479 139631 139577 140117 140353 140195 140532 141798 143289 144146 144239 143818 143091 142526 142955 144831 147653
54541A47653K772K048J292R48J079J240Q36j03q32r48r81j527k178k046r25N31
$$ 147653 150425 152473 153765 154713 155792 157032 157868 157765 156933 155985 155004 153477 151299 149253 148328 148859
54525A48859J605J983J670R42K23k72o19p71n42j35r9m73o49m16l94r25j359j126
$$ 148859 150464 152447 154117 155059 155282 155010 154391 153620 153078 152943 152844 152371 151722 151306 150912 149987 148628 147502
54507A47502p63r57j262q18J92Q46R95J329K002K260J542J90j026j527j059J05
$$ 147502 146739 145782 144520 143702 143894 144740 145735 147064 149066 151326 152868 153058 152032 150505 149446 149551
54491A49551J090J168N50J3j15m8J31N50J028J215J181J230J182N81l55p88l91
$$ 149551 150641 151809 152359 152372 152257 152209 152340 152890 153918 155133 156314 157544 158726 159307 158952 158164 157773
54474A57773K48N42N89P15Q71Q92R03J090J276J097M83j61l43L1N85Q96Q89O44
$$ 157773 158021 158563 159152 159867 160738 161630 162533 163623 164899 165996 166479 166318 165975 166006 166591 167487 168376 169020
54456A69020J4j051j898j660n78J3n61j329j211o72q24j462j285K6J209J110K
$$ 169020 169034 167983 166085 164425 163847 163860 163299 161970 160759 160087 159263 157801 156516 156542 157751 158861 158863
54439A58863j088j577j457r23k74J77M32P27J041J107R53R86J373J711J529Q11
$$ 158863 157775 156198 154741 153818 153544 153721 154153 154880 155921 157028 157981 158967 160340 162051 163580 164391
54423A64391r0p98j149j247j303j218n41Q62K250K618J769M77l69m68j13J84J63
$$ 164391 164301 163503 162354 161107 159804 158586 158045 158907 161157 163775 165544 166021 165652 165184 165071 165255 165418
54406A65418J34O04J420J771J349Q88R81J045L46n81o37J04N36K74k3m4k52o63
$$ 165418 165552 166156 167576 169347 170696 171584 172565 173610 173956 173375 172738 172842 173378 173652 173629 173585 173333 172670
54388A72670n13L96J095Q46J62j75k70n21o58k50L63M68J1m03l84j5M85Q34O81
$$ 172670 172157 172553 173648 174494 174656 174481 174211 173690 173032 172782 173145 173613 173624 173221 172837 172822 173307 174141 174822
54369A74822N4m20j84N34J109J408J721J994J775R84K24J18O00J043R13J76p55
$$ 174822 174876 174456 174272 174806 175915 177323 179044 181038 182813 183797 184021 184139 184739 185782 186695 186871 186116
54352A86116j354j326q05k81l40j225k493l213k796j671q37p58q85n19K33N71
$$ 186116 184762 183436 182631 182350 182010 180785 178292 175079 172283 170612 169775 169017 168132 167613 167846 168417
54336A68417N5p72r93l82M11P76Q48R97J018M39n05r91q44p87j117j045JJ227
$$ 168417 168472 167700 166707 166325 166736 167512 168360 169357 170375 170814 170309 169318 168474 167687 166570 165525 165526 166753
54318A66753J530J037N97K73m31j225j246n62j81l68k92L59O83O1p61q37l73j18
$$ 166753 168283 169320 169917 170190 169759 168534 167288 166726 166545 166177 165885 166244 166927 166988 166227 165390 165017 164899
54300A64899j50j18j22m38p67n38J49N95M02j57o01o56l21J42L69K51Rk06m99
$$ 164899 164749 164631 164509 164071 163304 162766 162915 163510 163912 163755 163154 162498 162177 162319 162688 162939 162948 162742 162243
54281A62243q37q81m54J22M25M25L39K87K93L30K72O1l2L10Q83J172J146J203
$$ 162243 161406 160525 160071 160193 160618 161043 161382 161669 161962 162292 162564 162625 162593 162903 163786 164958 166104 167307
54263A67307J358J227R51J162J677J359j03j330j063K2M60J72J37M14O9r56j373
$$ 167307 168665 169892 170843 172005 173682 175041 174938 173608 172545 172567 173027 173199 173336 173750 173819 172863 171490
54246A71490m48Q95J397R80L12l45j050j453j072j44N16N70N10Q04J137Q42j08
$$ 171490 171042 171937 173334 174314 174626 174281 173231 171778 170706 170562 171078 171648 172158 172962 174099 174941 174833
54229A74833r63j140r24r47j218j172n81P2L42M02N92Q13P94O27N25L23k11p66
$$ 174833 173870 172730 171806 170859 169641 168469 167888 167960 168302 168704 169296 170109 170903 171530 172055 172378 172167 171401
54211A71401p17r3K94j74j203j976k047j649j361j550j953j835p40Q76J982K001
$$ 171401 170684 170591 170885 170711 169508 167532 165485 163836 162475 160925 158972 157137 156397 157273 159255 161256
54195A61256J356Q62Q11P97L56m16r07n89L95J256J202J03j340k081j540j45R79
$$ 161256 162612 163474 164285 165082 165438 165022 164115 163526 163921 165177 166379 166482 165142 163061 161521 161376 162355
54178A62355J085N02J30K84M35M9o80j146j000l77L07N91K65l78q25r10q80p82
$$ 162355 163440 163942 164072 164356 164791 164840 164160 163014 162014 161637 161944 162535 162800 162422 161597 160687 159807 159025
54160A59025k87O95J596J730J029j8q13q83j07R53J335O79l08p55o29m19k79l7
$$ 159025 158738 159433 161029 162759 163788 163770 162957 162074 161967 162920 164255 164934 164626 163871 163242 162823 162544 162507
54142A62507K07J40j85l65j71L02Q85J330J343R87Q75J354J818J465N28kK11M72
$$ 162507 162714 162854 162669 162304 162133 162435 163320 164650 165993 166980 167855 169209 171027 172492 173020 173018 173229 173701
54124A73701J86m10p89p45k78N16J240J439J294J380J662J458P00L48R68J669
$$ 173701 173887 173477 172688 171943 171665 172181 173421 174860 176154 177534 179196 180654 181354 181702 182670 184339
54108A84339J273Jq61p26j56K26L83L28r3o50o30J93J014R39J72k50J76Q27P77
$$ 184339 185612 185613 184752 184026 183870 184096 184479 184807 184714 184064 183434 183627 184641 185580 185752 185502 185678 186505 187282
54089A87282o0q20n90P52K548M036M917N364N715O276P171Q043Q087O713M276
$$ 187282 187222 186402 185812 186564 189112 193148 198065 203429 209144 215420 222591 230634 238721 245434 249710
54074B49710J735m21k551m892o717o990n714m072l137k903k767k432k093j886
$$ 249710 251445 251024 248473 243581 236864 229874 224160 220088 216951 214048 211281 208849 206756 204870
54060B04870j666j240o02P5N20N04J02k52j08N64J412K069K420K529K478K313
$$ 204870 203204 201964 201362 201437 201957 202461 202563 202311 202203 202767 204179 206248 208668 211197 213675 215988
54044B15988K079J969K319L241M296M811M724M732N388O332O801O611O240O151
$$ 215988 218067 220036 222355 225596 229892 234703 239427 244159 249547 255879 262680 269291 275531 281682
54030B81682O465P106P769P916P293O415N897N467M264K178P9j398k567l870n107
$$ 281682 288147 295253 303022 310938 318231 324646 330543 336010 340274 342452 342531 341133 338566 334696 329589
54015C29589n952o568p180p518p333o934o680o255n243m053l556l871m265m229
$$ 329589 323637 317069 309889 302371 295038 288104 281424 275169 269926 265873 262317 258446 254181 249952
54001B49952l956l703l363k870k524k563k789k813k457j777j024o48r91j831k453
$$ 249952 245996 242293 238930 236060 233536 230973 228184 225371 222914 221137 220113 219465 218474 216643 214190
53986B14190k399j840j160m89J38M91L84M7j18r4k09n92r32r50p89p31o96l53
$$ 214190 211791 209951 208791 208302 208440 208931 209315 209362 209244 209150 208941 208349 207417 206467 205678 204947 204251 203898
53968B03898K92P82Q28P34R15J244J227P94M06L77M68M22M35P81J257J445J384
$$ 203898 204190 204972 205800 206534 207449 208693 209920 210714 211120 211497 211965 212387 212822 213603 214860 216305 217689
53951B17689J568K202K861L051K875K941L679M864N865O283O272O269O610P523
$$ 217689 219257 221459 224320 227371 230246 233187 236866 241730 247595 253878 260150 266419 273029 280552
53937B80552R304J2050J5107J7166J7182J5161J1890Q132M240M17l015n689p376
$$ 280552 289856 301906 317013 334179 351361 366522 378412 386544 390784 391201 388186 382497 375121
53924C75121q011p655o441m612k513n27J084K255L036L517L877M276M638M699
$$ 375121 367110 359455 353014 348402 345889 345362 346446 348701 351737 355254 359131 363407 368045 372744
53910C72744M493M477M811M822L703J678j47j088j496j943k454k803l025l254
$$ 372744 377237 381714 386525 391347 395050 396728 396581 395493 393997 392054 389600 386797 383772 380518
53896C80518l431l502l583l715l820m132n152o737p773p312n815m671m615n106
$$ 380518 377087 373585 370002 366287 362467 358335 353183 346446 338673 331361 325546 320875 316260 311154
53882C11154n225m738m156m037m366m604m321l662l053k607k213k098k683l747
$$ 311154 305929 301191 297035 292998 288632 284028 279707 276045 272992 270385 268172 266074 263391 259644
53868B59644m408m159l419k762k245j820j741j981j891j150m95p58j576j881j394
$$ 259644 255236 251077 247658 244896 242651 240831 239090 237109 235218 234068 233573 232815 231239 229358 227964
53853B27964q30p68j062j322j315r09k42J27k05q42j052p83o11q15j089j106p84
$$ 227964 227134 226366 225304 223982 222667 221758 221516 221643 221438 220596 219544 218761 218150 217335 216246 215140 214356
53836B14356p1Q40J248O14m60p25J04J005J096O64M12M12K91Lj70j38o3J4K83
$$ 214356 214285 215125 216373 216987 216527 215802 215906 216911 218007 218671 219083 219495 219786 219789 219619 219481 219418 219432 219715
53817B19715Q52J483J730J425R99J116J856K542K610K353K408K863L318L641M067
$$ 219715 220567 222050 223780 225205 226204 227320 229176 231718 234328 236681 239089 241952 245270 248911 252978
53802B52978M685N352O025O656O831O132M841L720L074K560J983J619J612J605
$$ 252978 257663 263015 269040 275696 282527 288659 293500 297220 300294 302854 304837 306456 308068 309673
53788C09673J229N89L9k36l18m26p99j428k001k279k426k719l137l547m023m639
$$ 309673 310902 311491 311530 311294 310976 310550 309751 308323 306322 304043 301617 298898 295761 292214 288191 283552
53772B83552n248n748o158o076m756k410p05r53k298k812k043j192j022j074j003
$$ 283552 278304 272556 266398 260322 255566 253156 252451 251498 249200 246388 244345 243153 242131 241057 240054
53757B40054j260k011k577k484k093j812j542j237j095r33l26L57J96p13j126
$$ 240054 238794 236783 234206 231722 229629 227817 226275 225038 223943 223010 222684 223041 223237 222524 221398
53742B21398n69l9k01k20O60J615J452M19m00p26r14q48k28N20P78Q27J380K282
$$ 221398 220829 220790 220589 220369 221029 222644 224096 224515 224115 223389 222475 221627 221399 221919 222697 223524 224904 227186
53724B27186K711K429J887J398J041J148J856K404J892O60j4M24J285J798J931
$$ 227186 229897 232326 234213 235611 236652 237800 239656 242060 243952 244612 244598 245022 246307 248105 250036
53709B50036J954J933J907K017K303K730L341L989M161L563K678K267K567L437
$$ 250036 251990 253923 255830 257847 260150 262880 266221 270210 274371 277934 280612 282879 285446 288883
53695B88883M827O362O948N788L661K181J853J782J225L88l87j148j721j600r36
$$ 288883 293710 300072 307020 312808 316469 318650 320503 322285 323510 323898 323511 322363 320642 319042 318106
53680C18106p82j705k855l019k149j138n33j46J92K05l31j083j391r79k04L74
$$ 318106 317324 315619 312764 309745 307596 306458 305925 305779 305971 306176 305845 304762 303371 302392 302188 302562
53664C02562N79O15N29J03n98r88o95k20l66j177j946k113j684r09n0N65P60Q02
$$ 302562 303141 303756 304285 304388 303790 302802 302107 301887 301521 300344 298398 296285 294601 293692 293642 294207 294967 295769
53646B95769J094J545J748J608J328R45M37K04P02J570J923J618J459J865K137
$$ 295769 296863 298408 300156 301764 303092 304037 304474 304678 305380 306950 308873 310491 311950 313815 315952
53631C15952J525M09k12M5Q13J723K622L203L095K461K037K372L273M167M766
$$ 315952 317477 317886 317674 317719 318532 320255 322877 326080 329175 331636 333673 336045 339318 343485 348251
53616C48251N232N767O317O717O938P002O827O401O072O259O821P103O783O184
$$ 348251 353483 359250 365567 372284 379222 386224 393051 399452 405524 411783 418604 425707 432490 438674
53602D38674N466M051J544j120k283j459O5O57p5j348k309k707k684k343j703
$$ 438674 444140 448191 449735 448615 446332 444873 444938 445595 445520 444172 441863 439156 436472 434129 432426
53587D32426r10l93n21j121j620j783j992k545l125l301l208l154k906k051q88
$$ 432426 431516 431123 430602 429481 427861 426078 424086 421541 418416 415115 411907 408753 405847 403796 402908
53572D02908k35l87q97j381j858k216k127j646j294j238r85k04O83J111J075R26
$$ 402908 402673 402286 401389 400008 398150 395934 393807 392161 390867 389629 388644 388440 389123 390234 391309 392235
53556C92235Q13O96N92N65O47R69J618K282K416J972J576J725K195K517K630K761
$$ 392235 393048 393744 394336 394901 395548 396517 398135 400417 402833 404805 406381 408106 410301 412818 415448 418209
53540D18209K984L250L598M065M537M910N137N069M628M308M942O616Q306R099
$$ 418209 421193 424443 428041 432106 436643 441553 446690 451759 456387 460695 465637 472253 480559 489658
53526D89658R391J0244J1852J3330J3943J3889J3744J3742J3920J4477J5552J6857
$$ 489658 499049 509293 521145 534475 548418 562307 576051 589793 603713 618190 633742 650599
53514F50599J7936J8774J9832K1370K3068K4427K5385K6189K6796K6786K6015
$$ 650599 668535 687309 707141 728511 751579 776006 801391 827580 854376 881162 907177
53503I07177K5017K4455K4354K4199K3643K2865K2319K2323K2807K3181K2752
$$ 907177 932194 956649 981003 1005202 1028845 1051710 1074029 1096352 1119159 1142340 1165092
53492A165092K1470K0126J9432J9210J8899J8581J8732J9192J9183J8454J7629
$$ 1165092 1186562 1206688 1226120 1245330 1264229 1282810 1301542 1320734 1339917 1358371 1376000
53481A376000J7217J7054J6977J7285J8022J8405J7557J5419J2538R408O475M217
$$ 1376000 1393217 1410271 1427248 1444533 1462555 1480960 1498517 1513936 1526474 1535882 1542357 1546574
53469A546574K612Q42j785m862p462r394j1256j3334j5208j6446j7078j7298j7317
$$ 1546574 1549186 1550028 1548243 1543381 1535919 1526525 1515269 1501935 1486727 1470281 1453203 1435905 1418588
53456A418588j7633j8784k0531k1823k1991k1635k1825k2688k3342k3123k2361
$$ 1418588 1400955 1382171 1361640 1339817 1317826 1296191 1274366 1251678 1228336 1205213 1182852
53445A182852k1708k1224k0506j9469j8448j7494j6081j3863j1312r229p796o594
$$ 1182852 1161144 1139920 1119414 1099945 1081497 1064003 1047922 1034059 1022747 1013518 1005722 999128
53433I99128n383m300l269j836J10J988L271M275N710P694R681J1290J2700J4183
$$ 999128 993745 989445 986176 984340 984450 986438 989709 993984 999694 1007388 1017069 1028359 1041059 1055242
53419A055242J5666J6960J8166J9526K0996K2238K3095K3846K4901K6324K7843
$$ 1055242 1070908 1087868 1106034 1125560 1146556 1168794 1191889 1215735 1240636 1266960 1294803
53408A294803K9233L0528L1868L3390L5263L7550L9954M2082M4059M6427M9216
$$ 1294803 1324036 1354564 1386432 1419822 1455085 1492635 1532589 1574671 1618730 1665157 1714373
53397A714373N1620N3093N4228N5877N7832N9233N9995O0772O1601O1657O0658
$$ 1714373 1765993 1819086 1873314 1929191 1987023 2046256 2106251 2167023 2228624 2290281 2350939
53386B350939N9400N8411N7040N4558N1452M8757M6602M4274M1371L8050L4389
$$ 2350939 2410339 2468750 2525790 2580348 2631800 2680557 2727159 2771433 2812804 2850854 2885243
53375B885243L0296K6013K1996J8208J4120R438M387q87o772j3807k2020l0779
$$ 2885243 2915539 2941552 2963548 2981756 2995876 3005314 3009701 3008814 3002042 2988235 2966215 2935436
53363B935436l9114m6287n2103n6711o0091o2049o2734o2773o2617o2095o0933
$$ 2935436 2896322 2850035 2797932 2741221 2681130 2619081 2556347 2493574 2430957 2368862 2307929
53352B307929n9334n7661n5924n4096n2564n1667n0962m9735m8092m6871m6359
$$ 2307929 2248595 2190934 2135010 2080914 2028350 1976683 1925721 1875986 1827894 1781023 1734664
53341A734664m5817m4493m2485m0264l7888l5124l2041k9079k6597k4570k2633
$$ 1734664 1688847 1644354 1601869 1561605 1523717 1488593 1456552 1427473 1400876 1376306 1353673
53330A353673k0338j7554j4748j2604j1292j0390r711r737j0891j2557j3383j2611
$$ 1353673 1333335 1315781 1301033 1288429 1277137 1266747 1257036 1247299 1236408 1223851 1210468 1197857
53318A197857j0774q968p726o787n735m463l146j988j053j52J114K895M707N830
$$ 1197857 1187083 1178115 1170389 1163602 1157867 1153404 1150258 1148270 1147217 1147065 1148179 1151074 1155781 1161611
53304A161611O283O980Q578J0535J1849J2533J3608J5677J8190K0330K2064K3913
$$ 1161611 1167894 1174874 1183452 1193987 1205836 1218369 1231977 1247654 1265844 1286174 1308238 1332151
53292A332151K6087K8281L0026L0988L1109L0675K9969K8844K7023K4870K3211
$$ 1332151 1358238 1386519 1416545 1447533 1478642 1509317 1539286 1568130 1595153 1620023 1643234
53281A643234K2129K0628J8032J5035J2653J0611P745L760l85l824o675r371j1942
$$ 1643234 1665363 1685991 1704023 1719058 1731711 1742322 1750067 1753827 1753442 1749618 1742943 1733572 1721630
53268A721630j4251j6489j8972k1745k4596k7197k9191l0483l1531l2965l4784
$$ 1721630 1707379 1690890 1671918 1650173 1625577 1598380 1569189 1538706 1507175 1474210 1439426
53257A439426l6263l6780l6462l5820l5110l4294l3326l2216l0968k9679k8607
$$ 1439426 1403163 1366383 1329921 1294101 1258991 1224697 1191371 1159155 1128187 1098508 1069901
53246A069901k7947k7621k7416k7204k6968k6694k6346k5893k5214k4103k2498
$$ 1069901 1041954 1014333 986917 959713 932745 906051 879705 853812 828598 804495 781997
53235G81997k0715j9291j8495j7909j6736j4637j2195j0280r075q096p141o621
$$ 781997 761282 741991 723496 705587 688851 674214 662019 651739 642664 634568 627427 620806
53223F20806o821p387p983q871j0216j1224j0875r431q419q943j0573j2085j2701
$$ 620806 613985 606598 598615 589744 579528 568304 557429 547998 539579 530636 520063 507978 495277
53210D95277j2370j1398j0214r208q410p520o402n382m879m925n218n484n635
$$ 495277 482907 471509 461295 452087 443677 436157 429755 424373 419494 414569 409351 403867 398232
53197C98232n743o008o648p598q438q615p874o430m860l709l132k943l018l402
$$ 398232 392489 386481 379833 372235 363797 355182 347308 340878 336018 332309 329177 326234 323216 319814
53183C19814l884l887l124k128j610j525j342j082j348k286l184l373k936k268
$$ 319814 315930 312043 308919 306791 305181 303656 302314 301232 299884 297598 294414 291041 288105 285837
53169B85837j515q29o63j251k069k283j674p61j97k88r19j644j964j747j324r91
$$ 285837 284322 283493 282830 281579 279510 277227 275553 274792 274595 274307 273388 271744 269780 268033 266709 265718
53153B65718o79l32k82q52j708k052j467l22O99J202J196R23O96P12Q71Q54N29
$$ 265718 265039 264707 264425 263573 261865 259813 258346 258024 258723 259925 261121 262044 262740 263452 264323 265177 265706
53136B65706J54J08M24P11N91J37k05j25K50N45N12J79k61n50m89q4N01J129J660
$$ 265706 265860 265968 266392 267103 267694 267831 267626 267501 267751 268296 268808 268987 268726 268176 267687 267603 268104 269233 270893
53117B70893J758J118Q7m28r4K37l27j284j334l38L54k47j506k295k515k672k571
$$ 270893 272651 273769 273856 273428 273334 273571 273244 271960 270626 270288 270642 270395 268889 266594 264079 261407 258836
53100B58836j572K3Q98L44p97j188n04N09J083J034N37j66p62r70p74m55k17N2
$$ 258836 257264 257287 258185 258529 257732 256544 256040 256549 257632 258666 259203 259037 258275 257305 256531 256076 255859 255911
53082B55911N04R63J046O44O4l23l77j64J72L69J81k89o17o43p86j432k238k454
$$ 255911 256415 257378 258424 259068 259132 258809 258432 258268 258440 258809 258990 258701 258084 257441 256655 255223 252985 250531
53064B50531j903j144o80l94L3N00N37j11j073j578j154j67M84M00J02J82M32
$$ 250531 248628 247484 246804 246410 246443 246943 247480 247369 246296 244718 243564 243397 243881 244281 244383 244565 244997
53047B44997L25O6L48J165J644J307O88L66J58k89p23q18r10j455k040j759n12
$$ 244997 245322 245388 245736 246901 248545 249852 250540 250906 251064 250775 250052 249234 248324 246869 244829 243070 242558
53030B42558P96J373J306J057P87M70K55L24N48O02L98J99K69N55P43O39L48J09
$$ 242558 243354 244727 246033 247090 247877 248347 248602 248926 249474 250076 250474 250673 250942 251497 252240 252879 253227 253336
53012B53336k6j13j19M4K58K61M9k6K99Q36J185J154Q49M83K79L26N02N25K68
$$ 253336 253310 253197 253078 253122 253380 253641 253690 253664 253963 254799 255984 257138 257987 258470 258749 259075 259577 260102 260370
52993B60370j70o18r50r51m38M48J296J837K056J823R53k43q83m25O44J390J417
$$ 260370 260200 259582 258632 257681 257243 257691 258987 260824 262880 264703 265656 265413 264530 264105 264749 266139 267556
52976B67556J008N74L91O36J168J445J104O08P75J627K200J739P03K65Q68J672
$$ 267556 268564 269138 269529 270165 271333 272778 273882 274490 275265 276892 279092 280831 281534 281799 282667 284339
52960B84339J487J28j408k089j925j684j821k086k113j914j656j391j174j124
$$ 284339 285826 285954 284546 282457 280532 278848 277027 274941 272828 270914 269258 267867 266693 265569
52946B65569j186j123r17q07q32p09l41l8Jn4j41n13j149j510j240o35k1O83J350
$$ 265569 264383 263260 262343 261536 260704 259995 259654 259616 259617 259563 259422 258909 257760 256250 255010 254375 254354 255037 256387
52927B56387J344N46j6M60J192R12j32n61m4L17j60q25r58p40n00j26K23r9j034
$$ 256387 257731 258277 258261 258721 259913 260825 260693 260132 260088 260405 260245 259420 258462 257722 257222 257096 257319 257220 256186
52908B56186j387m84N92M39o50j187o35J64M88N27N72L60l14j053j308r41j15
$$ 256186 254799 254315 254907 255346 254696 253509 252874 253038 253526 254053 254625 254985 254671 253618 252310 251369 251254
52891B51254R23J711J700R04P4j47k2k44q67j177o57L49J079J162P30L0o75r80
$$ 251254 252177 253888 255588 256492 256566 256419 256397 256153 255286 254109 253452 253801 254880 256042 256772 256802 256127 255147
52873B55147n50M35J366J816J866J766J626J647K102K836L154K686J987J696J467
$$ 255147 254597 255032 256398 258214 260080 261846 263472 265119 267221 270057 273211 275897 277884 279580 281047
52858B81047M70j170k350k438j975j701j677j712j965k540l035l084k939k995
$$ 281047 281517 280347 277997 275559 273584 271883 270206 268494 266529 263989 260954 257870 254931 251936
52844B51936l044k577j632p78l95m07n78o84m88M6N56O56L95R6o0j3L25P68O67
$$ 251936 248892 246315 244683 243905 243510 243103 242525 241841 241353 241399 241955 242611 243006 243102 243042 243029 243354 244122 244789
52825B44789m07j914k810k689j994j167k39P07J338J613J916K455K916K995K843
$$ 244789 244382 242468 239658 236969 234975 233808 233569 234276 235614 237227 239143 241598 244514 247509 250352
52810B50352K628K113J023l52j373j717j564j352j523k259l133l252k216p89j35
$$ 250352 252980 255093 256116 255764 254391 252674 251110 249758 248235 245976 242843 239591 237375 236586 236451
52795B36451l83n10K43J373J883J688J576J898J929R39n90j475j404j277j731
$$ 236451 236068 235558 235801 237174 239057 240745 242321 244219 246148 247087 246497 245022 243618 242341 240610
52780B40610k091j372N5P99L66j70K56J189J452Q38K46K32L50P7l41m25l71q08
$$ 240610 238519 237147 237202 238001 238367 238197 238453 239642 241094 241932 242178 242410 242760 242837 242496 242071 241700 240892
52762B40892j785k488k149r06L84J027R92O37K67N4K02Q23J604J940J605J111
$$ 240892 239107 236619 234470 233564 233948 234975 235967 236604 236871 236925 237127 237950 239554 241494 243099 244210
52746B44210J143J724K234K226J900J645J455J075N33K58N69J244J645J335N20
$$ 244210 245353 247077 249311 251537 253437 255082 256537 257612 258145 258403 258972 260216 261861 263196 263716
52731B63716q7L3O49J046Q02J42m95j025j623k266k640k490j897j200p61p26q87
$$ 263716 263629 263662 264311 265357 266159 266301 265806 264781 263158 260892 258252 255762 253865 252665 251904 251178 250291
52714B50291q52m98j60j44k25j3L36K72k17l59L27J218J365Q22N64J062J630J434
$$ 250291 249439 248941 248781 248637 248412 248399 248735 249007 248790 248431 248758 249976 251341 252163 252727 253789 255419 256853
52696B56853N76k01n90q26r55o27K04R18R51N31K49J81j3k65o5O21J025O08j03
$$ 256853 257429 257228 256638 255812 254857 254230 254434 255352 256303 256834 257083 257264 257251 256986 256921 257542 258567 259175 259072
52677B59072k47J57L35r5p28j085j097q04k10L62L81j06k72M60J599K227K062
$$ 259072 258825 258982 259317 259222 258494 257409 256312 255508 255298 255660 256041 255935 255663 256123 257722 259949 262011
52660B62011J469P90K32J63Q32J808K315K135J709J322Q00J02l81l83j56j06l75
$$ 262011 263480 264270 264502 264665 265497 267305 269620 271755 273464 274786 275586 275688 275307 274924 274768 274662 274287
52643B74287r81j861k590k528j673q52o51n87O2J035J507J431J542K016K150J680
$$ 274287 273306 271445 268855 266327 264654 263802 263151 262564 262626 263661 265168 266599 268141 270157 272307 273987
52627B73987J393J849K265J618L09l64k60o47k182l675l610k133p35k98l67k17
$$ 273987 275380 277229 279494 281112 281421 281057 280797 280150 277968 274293 270683 268550 267815 267517 267150 266933
52611B66933J71M30M36K61n9m45o65n71k83j0J55J90J56L10Q31J403J446R51N98
$$ 266933 267104 267534 267970 268231 268172 267727 267062 266491 266208 266198 266353 266543 266699 267009 267840 269243 270689 271640 272238
52592B72238P82J011P21K72M36J156J576J273P65N54L85j89r88j380j096m44R1
$$ 272238 273020 274031 274752 275024 275460 276616 278192 279465 280230 280784 281169 280980 279992 278612 277516 277072 277163
52575B77163J84k37q97j262r47j99L45L37K7j73j64q5M9L61P25P37K46k93l31
$$ 277163 277347 277110 276213 274951 274004 273805 274150 274487 274514 274341 274177 274092 274141 274502 275227 275964 276210 275917 275586
52556B75586j3n1p12j375j329o76j28q6l60o25p79q11p17n73m65k78J75P75J116
$$ 275586 275573 275522 274810 273435 272106 271430 271302 271216 270856 270231 269452 268641 267924 267351 266886 266608 266783 267558 268674
52537B68674R87O16L89M96Q73J287J487J349R32L19m86j309j695j338n22K15O98
$$ 268674 269661 270277 270666 271162 272035 273322 274809 276158 277090 277409 276923 275614 273919 272581 272059 272274 272972
52520B72972J085J356J334J162J187J378J362J175J424K452L819M810N064M505
$$ 272972 274057 275413 276747 277909 279096 280474 281836 283011 284435 286887 290706 295516 300580 305085
52506C05085L195J575L16m21j128k059k712k686k488k816l395l340k480j597j319
$$ 305085 308280 309855 310171 309750 308622 306563 303851 301165 298677 295861 292466 289126 286646 285049 283730
52491B83730j443j441j162p72m53k87k06k8K57K98j58p38p96k51L85Q10J185J601
$$ 283730 282287 280846 279684 278912 278459 278172 277966 277938 278195 278493 278335 277597 276801 276550 276935 277745 278930 280531
52473B80531J787J634J494J678J953J920J594J335J419J886K613L267L363K683
$$ 280531 282318 283952 285446 287124 289077 290997 292591 293926 295345 297231 299844 303111 306474 309157
52459C09157J535M07n01j244j853k371k953l620m036l809k996k003j106l80l4
$$ 309157 310692 311099 310598 309354 307501 305130 302177 298557 294521 290712 287716 285713 284607 284227 284193
52444B84193l20r92j312q90j92P9j60m69o17p81j042j178j036p81n21j40L81P38
$$ 284193 283873 282881 281569 280679 280487 280566 280406 279937 279320 278539 277497 276319 275283 274502 273981 273841 274222 274960
52426B74960P02N12N22O18M08q4k85K60J355K383K860K814K730L116M008M994
$$ 274960 275662 276174 276696 277314 277722 277638 277353 277613 278968 281351 284211 287025 289755 292871 296879 301873
52410C01873N891P087Q893J0833J2086J2432J2077J0683P474K613k352n901p868
$$ 301873 307764 314851 323744 334577 346663 359095 371172 381855 389329 391942 389590 383689 375821
52397C75821q961r596r772r568r044p940o138m188k765j854j079m76k52o8N57
$$ 375821 366860 357264 347492 337924 328880 320940 314802 310614 307849 305995 304916 304440 304188 304120 304677
52382C04677J321J495J157J131J606J862J607J518K043K614K695K793L548M542
$$ 304677 305998 307493 308650 309781 311387 313249 314856 316374 318417 321031 323726 326519 330067 334609
52368C34609M858M433L936L556K793J346m43k023k924k795j747o21j97j82L01
$$ 334609 339467 343900 347836 351392 354185 355531 355088 353065 350141 347346 345599 344978 344781 344599 344900
52353C44900J231J543P06m00o27J07J121K057K906L372L043K180J668K014K858
$$ 344900 346131 347674 348380 347980 347353 347460 348581 350638 353544 356916 359959 362139 363807 365821 368679
52338C68679L637M265M897N460N710N709N851O435P415Q545R666J0739J1711J2470
$$ 368679 372316 376581 381478 386938 392648 398357 404208 410643 418058 426603 436269 447008 458719 471189
52324D71189J2963J3331J3843J4593J5342J5734J5683J5409J5088J4678J4218
$$ 471189 484152 497483 511326 525919 541261 556995 572678 588087 603175 617853 632071
52313F32071J4107J4783J6092J7261J7611J7186J6553J6131J5860J5472J4841
$$ 632071 646178 660961 677053 694314 711925 729111 745664 761795 777655 793127 807968
52302H07968J4057J3285J2660J2203J1792J1194J0222Q834P069M972K653L72j580
$$ 807968 822025 835310 847970 860173 871965 883159 893381 902215 909284 914256 916909 917281 915701
52289I15701l100m323n464o590p556q092p936p051n767m614l842l190k279j179
$$ 915701 912601 908278 902814 896224 888668 880576 872640 865589 859822 855208 851366 848176 845897 844718
52275H44718l79m5L71J609L709N891P305P779P789P904Q280Q694Q981R359J0199
$$ 844718 844339 844294 844665 846274 849983 855874 863179 870958 878747 886651 894931 903625 912606 921965 932164
52260I32164J1447J2572J3166J3408J3700J4076J4306J4387J4426J4130J2964
$$ 932164 943611 956183 969349 982757 996457 1010533 1024839 1039226 1053652 1067782 1080746
52249A080746J0926Q639O526M328J709j099l557n402o723p764q895j0365j1794
$$ 1080746 1091672 1100311 1106837 1111165 1112874 1111775 1108218 1102816 1096093 1088329 1079434 1069069 1057275
52236A057275j2366j1927j1363j1467j1876j1759j1124j0584j0215r561q690q219
$$ 1057275 1044909 1032982 1021619 1010152 998276 986517 975393 964809 954594 945033 936343 928124
52224I28124q124p535o034m363l397l040k652j945j027j3R07J447J719K322L460
$$ 928124 920000 912465 906431 902068 898671 895631 892979 891034 890007 889994 890901 892348 894067 896389 899849
52209H99849M373M219L229K397K297K734L356L980M378M338M001L745L737L905
$$ 899849 904222 908441 911670 914067 916364 919098 922454 926434 930812 935150 939151 942896 946633 950538
52195I50538M286M928N609N921N725N147M315L395K637J948O35j753m483o245
$$ 950538 954824 959752 965361 971282 977007 982154 986469 989864 992501 994449 995084 993331 988848 982603
52181I82603o755o994p742q563q656p975p054o196n379m634m005l391k763k342
$$ 982603 975848 968854 961112 952549 943893 935918 928864 922668 917289 912655 908650 905259 902496 900154
52167I00154k130j603l09J403K649K927K421J660J249J710K947L970L739K352
$$ 900154 898024 896421 896112 897515 900164 903091 905512 907172 908421 910131 913078 917048 920787 923139
52153I23139R72M95P88J267J619J747J576J336J552K286K767K296J244N39L47
$$ 923139 924111 924606 925394 926661 928280 930027 931603 932939 934491 936777 939544 941840 943084 943623 943970
52138I43970Po94r71j81J160K108K698L840N921Q276J0237J2044J4194J6417J7975
$$ 943970 943977 943283 942312 942131 943291 945399 948097 951937 957858 966134 976371 988415 1002609 1019026 1037001
52123A037001J8826J9782K1380K3131K4211K4444K4264K3988K3632K3262K3015
$$ 1037001 1055827 1075609 1096989 1120120 1144331 1168775 1193039 1217027 1240659 1263921 1286936
52112A286936K2722K1933K0464J8675J6999J5420J3657J1713J0027R065Q826Q811
$$ 1286936 1309658 1331591 1352055 1370730 1387729 1403149 1416806 1428519 1438546 1447611 1456437 1465248
52100A465248Q420P392N878M029J634j615n576r561j2896j5326j6864j7552j7602
$$ 1465248 1473668 1481060 1486938 1490967 1492601 1490986 1485410 1475849 1462953 1447627 1430763 1413211 1395609
52087A395609j7478j7469j7276j6379j4771j2972j1351r736p867n915m304l144
$$ 1395609 1378131 1360662 1343386 1327007 1312236 1299264 1287913 1278177 1270310 1264395 1260091 1256947
52075A256947k132r37M85K013L637N422P260Q809R837J0537J1295J2156J2737
$$ 1256947 1254815 1253878 1254363 1256376 1260013 1265435 1272695 1281504 1291341 1301878 1313173 1325329 1338066
52062A338066J2806J2677J2831J3296J3687J3738J3476J2868J1715R987Q009O113
$$ 1338066 1350872 1363549 1376380 1389676 1403363 1417101 1430577 1443445 1455160 1465147 1473156 1479269
52050A479269M270K168m40l516o701r488j1530j2874j3691j3914j3404j2453j1740
$$ 1479269 1483539 1485707 1485267 1481751 1475050 1465562 1454032 1441158 1427467 1413553 1400149 1387696 1375956
52037A375956j1644j1944j2294j2630j2922j2945j2742j2907j3965j5590j6874
$$ 1375956 1364312 1352368 1340074 1327444 1314522 1301577 1288835 1275928 1261963 1246373 1229499
52026A229499j7282j6909j6002j4731j3472j2762j2652j2496j1567r808p791o170
$$ 1229499 1212217 1195308 1179306 1164575 1151103 1138341 1125689 1113193 1101626 1091818 1084027 1077857
52014A077857n267m967m839m446l839l634m522o651r476j2178j4206j5488j6259
$$ 1077857 1072590 1067623 1062784 1058338 1054499 1050865 1046343 1039692 1030216 1018038 1003832 988344 972085
52001I72085j6665j6590j5848j4442j2573j0503q592p370p336q551j0426j2029
$$ 972085 955420 938830 922982 908540 895967 885464 876872 869502 862166 853615 843189 831160
51989H31160j2662j2328j1702j1508j1941j2734j3725j4943j6088j6505j6011
$$ 831160 818498 806170 794468 782960 771019 758285 744560 729617 713529 697024 681013
51978F81013j5329j5087j4746j3285j0838q723p667o746m644j372J837M033N336
$$ 681013 665684 650597 635851 622566 611728 603005 595338 588592 583948 582576 584413 588446 593782
51965E93782O265O908O957O306N264M171K892R96j530l973n599o554p571q797
$$ 593782 600047 606955 613912 620218 625482 629653 632545 633541 632011 628038 622439 615885 608314 599517
51951E99517r416q669o874n012l631k450q64J458M395P426R921J1600J2650J3369
$$ 599517 590101 581432 574558 569546 565915 563465 562601 564059 568454 575880 585801 597401 610051 623420
51937F23420J3773J3702J3057J1767R752P143M352J706q19l249n234o407o951
$$ 623420 637193 650895 663952 675719 685471 692614 696966 698672 697853 694604 689370 682963 676012
51924F76012p392p810p693o595m598j985J160M780Q388J1051J1844J0338O831
$$ 676012 668620 660810 653117 646522 641924 639939 641099 645879 654267 665318 677162 687500 694331
51911F94331K168k694p004j0199j1832j1771j0474q769p222n828m492l642m069
$$ 694331 696499 693805 686801 676602 664770 652999 642525 633756 626534 620706 616214 612572 608503
51898F08503o083q948j1425j2854j3546j4066j4401j4134j3147j1747j0120q161
$$ 608503 602420 593472 582047 569193 555647 541581 527180 513046 499899 488152 478032 469871
51886D69871n930l823k059l33J704L931O007P844R478J0780J1640J2205J2413
$$ 469871 463941 460118 458059 457726 459430 463361 469368 477212 486690 497470 509110 521315 533728
51873E33728J1583R140N678K599N07j404m020o918q845r244q717p935o798m885
$$ 533728 545311 554451 560129 562728 563235 561831 557811 550893 542048 532804 524087 516152 509354 504469
51859E04469k383q1J518K601L395L528K528P82o89j545k604m575o791p925p658
$$ 504469 502086 502005 503523 506124 509519 513047 515575 516357 515668 514123 511519 506944 500153 492228 484570
51844D84570o895o351n785m941m322m384m491l571j709k04R4j25L61J682K809
$$ 484570 477675 471324 465539 460598 456276 451892 447401 443830 442121 441917 442011 441886 442247 443929 446738
51829D46738K916K252J513R14J31j032k345l390l831l442k249o94N83J327J809
$$ 446738 449654 451906 453419 454333 454464 453432 451087 447697 443866 440424 438175 437481 438064 439391 441200
51814D41200K284K537K192J249Q9r69j820k344k376j912j220o35l61l56l42j1
$$ 441200 443484 446021 448213 449462 449551 448582 446762 444418 442042 440130 438910 438275 437914 437558 437216 437205
51798D37205N45P49J15j070j961k098j816j665j670j431q28k47j18l80o22o36
$$ 437205 437750 438499 438614 437544 435583 433485 431669 430004 428334 426903 426075 425828 425710 425330 424708 424072
51782D24072o50r54j426j620j256m63M78J409K349L420M806O549Q346R748J0674
$$ 424072 423422 422468 421042 419422 418166 417703 418181 419590 421939 425359 430165 436714 445060 454808 465482
51767D65482J1321J1496J0530Q210N398L150J489l32k519m427n653o696q116r576
$$ 465482 476803 488299 498829 507039 512437 515587 517076 516744 514225 509798 504145 497449 489333 479757
51753D79757j0219r746q661p600o774o089n394m553l485k228q76N60K135L799
$$ 479757 469538 459792 451131 443531 436757 430668 425274 420721 417236 415008 414132 414692 416827 420626
51739D20626N396O810P990Q748Q697P591N700L726K248J348Q07M91M15N71Q17
$$ 420626 426022 432832 440822 449570 458267 465858 471558 475284 477532 478880 479687 480178 480593 481164 481981
51724D81981Q81L82q65k387l233l002k455k512k917k596j412n37q29j647j872
$$ 481981 482862 483244 482379 479992 476759 473757 471302 468790 465873 463277 461865 461328 460499 458852 456980
51709D56980j290k98J118L141N234O416O310N222L398J048j047j883j287L6J531
$$ 456980 455690 455392 456510 459651 464885 471301 477611 482833 486231 487279 486232 484349 483062 483098 484629
51694D84629L083M351M633L683J985k3k260m470o076o873p139o885n791m163k988
$$ 484629 487712 492063 496696 500379 502364 502341 500081 495611 489535 482662 475523 468638 462847 458684 455696
51679D55696k545j849k24J356J427K9j437j998j781j023N01K789N121O710P415
$$ 455696 453151 451302 451078 452434 453861 453890 452453 450455 448674 447651 448152 450941 456062 462772 470187
51664D70187P499O964N517L156M78j644k697k685j729J95K956O014Q834J1266
$$ 470187 477686 484650 490167 493323 493801 492157 489460 486775 485046 485241 488197 494211 503045 514311
51650E14311J2997J2886R762M008k411p706j1422j3774j4824j4849j4584j4292
$$ 514311 527308 540194 549956 553964 551553 543847 532425 518651 503827 488978 474394 460102
51638D60102j3234j0827p789n310l586k064o87R6M23J017K014K586J982M01j271
$$ 460102 446868 436041 428252 422942 419356 417292 416605 416701 417124 418141 420155 422741 424723 425124 423853
51623D23853k165j874q00M9jn75q91q21p79q71r36j167j828k430k115r59P3N27
$$ 423853 421688 419814 419014 419063 419062 418487 417596 416775 415996 415125 414189 413022 411194 408764 406649 405690 405763 406290
51605D06290R25J564J947J854K071L362N337P078Q381R605J0592J0503Q725N467
$$ 406290 407215 408779 410726 412580 414651 418013 423350 430428 438809 448414 459006 469509 478234 483701
51591D83701J502k297n204o811p176o649n580m114k177L79L465O638R525J2136
$$ 483701 485203 482906 477702 470891 463715 457066 451486 447372 445195 445574 449039 455677 465202 477338
51577D77338J4528J6229J6692J6281J6178J7054J8321J8926J8327J6435J3304
$$ 477338 491866 508095 524787 541068 557246 574300 592621 611547 629874 646309 659613
51566F59613R532O619O169Q684J3485J9648K6588L3698L9920M3941M4869M2763
$$ 659613 669145 675764 681933 690617 704102 723750 750338 784036 823956 867897 912766 955529
51554I55529L8528L3197K7217K0487J2959M939l188j1174j8778k5720l1885l7258
$$ 955529 994057 1027254 1054471 1074958 1087917 1092856 1089668 1078494 1059716 1033996 1002111 964853
51542I64853m1528m4135m4824m3900m1842l8994l5705l2291k8705k4679k0397
$$ 964853 923325 879190 834366 790466 748624 709630 673925 641634 612929 588250 567853
51531E67853j6640j3950j2074j0476r018p808o802n870m930l682j731O91K537
$$ 567853 551213 537263 525189 514713 505695 497887 491085 485215 480285 476603 474872 475563 478100
51518D78100L047K640K152J566K34j873l850m887n019m791m604m546m527m445
$$ 478100 481147 483787 485939 487505 487739 485866 482016 477129 472110 467319 462715 458169 453642 449197
51504D49197m329m284m205l787l026k407k264k309k134j902j982k206k005j226
$$ 449197 444868 440584 436379 432592 429566 427159 424895 422586 420452 418550 416568 414362 412357 411131
51490D11131k56N66J114J197O51k34r37j388j916k532k780k405j718j162r54j196
$$ 411131 410875 411441 412555 413752 414403 414169 413232 411844 409928 407396 404616 402211 400493 399331 398377 397181
51474C97181j881k638k946k752k479k367k175j805j628j959k472k534j924r65
$$ 397181 395300 392662 389716 386964 384485 382118 379943 378138 376510 374551 372079 369545 367621 366656
51460C66656m8P76J734K925M022M569M601M683N054N212M827M632N608P618R734
$$ 366656 366608 367384 369118 372043 376065 380634 385235 389918 394972 400184 405011 409643 415251 422869 432603
51445D32603J1787J4390J7202J8429J6761J2919Q623M823J796J04J21Q33L23k313
$$ 432603 444390 458780 475982 494411 511172 524091 532714 537537 539333 539437 539558 540391 540714 538401
51431E38401o170r775j2381j3922j4464j4099j3000j1299r038o462m023k058n50
$$ 538401 532231 522456 510075 496153 481689 467590 454590 443291 434253 427791 423768 421710 421160
51418D21160O14J399J703J547J156Q64R49J361J772J918J817J530R98L61J48O93
$$ 421160 421774 423173 424876 426423 427579 428443 429392 430753 432525 434443 436260 437790 438788 439149 439297 439990
51402D39990J500J691J071L54K55P07J203J514J904K688L858N151O433P885R741
$$ 439990 441490 443181 444252 444606 444861 445568 446771 448285 450189 452877 456735 461886 468319 476204 485945
51387D85945J1909J4122J6570J9867K4215K8950L3402L7797M2781M8236N3253
$$ 485945 497854 511976 528546 548413 572628 601578 634980 672777 715558 763794 817047
51376H17047N7167N9789O0570N8404N2820M4787L5809K6515J6599N816n409j6343
$$ 817047 874214 934003 994573 1052977 1105797 1150584 1186393 1212908 1229507 1235323 1229914 1213571
51364A213571k6426l5361m2983m9061n3210n5166n5196n4007n2006m8927m4449
$$ 1213571 1187145 1151784 1108801 1059740 1006530 951364 896168 842161 790155 741228 696779
51353F96779l9046l3786k9368k5622k2044j8552j5568j3460j2081j0932r725q652
$$ 696779 657733 623947 594579 568957 546913 528361 512793 499333 487252 476320 466595 457943
51341D57943q012p713p317o515n347m045k961k495k732l113k989k505k461l102
$$ 457943 449931 442218 434901 428386 423039 418994 416033 413538 410806 407693 404704 402199 399738 396636
51327C96636l664l405k537j697j005k11N94J114J457J976K619K988L004K982L111
$$ 396636 392972 389567 387030 385333 384328 384117 384711 385825 387282 389258 391877 394865 397869 400851 403962
51312D03962L343L663L836L144J125j330k553k039j114j267k447l536l853l604
$$ 403962 407305 410968 414804 417948 419073 417743 415190 413151 412037 410770 408323 404787 400934 397330
51298C97330l157k642k206k113k424k903l225l194k809k245j593n96J046L002
$$ 397330 394173 391531 389325 387212 384788 381885 378660 375466 372657 370412 368819 368223 369269 372271
51284C72271M356M715M760N320O130O143M937L257K092J646J411R23K44j04L60
$$ 372271 376627 381342 386102 391422 397552 403695 408632 411889 413981 415627 417038 417961 418205 418101 418461
51269D18461J546K772L339L093K391J665J156P77J10j222k851l737l339k409k045
$$ 418461 420007 422779 426118 429211 431602 433267 434423 435200 435310 434088 431237 427500 424161 421752 419707
51254D19707k269k221j674j395j830k309k063j360j018j175j280j113j077j446
$$ 419707 417438 415217 413543 412148 410318 408009 405946 404586 403568 402393 401113 400000 398923 397477
51240C97477j868j903j649j525j597j462q72j92j8m09p94o82k32J03K24L22M13
$$ 397477 395609 393706 392057 390532 388935 387473 386601 386409 386391 385982 385188 384506 384274 384377 384601 384923 385336
51223C85336L61L51P64J519K008J938J777K073K689L134L319L521L752L696L281
$$ 385336 385697 386048 386812 388331 390339 392277 394054 396127 398816 401950 405269 408790 412542 416238 419519
51208D19519K891K835K894K643K037J494J360J420J070j3j462k586l076l192l337
$$ 419519 422410 425245 428139 430782 432819 434313 435673 437093 438163 438150 436688 434102 431026 427834 424497
51193D24497l646l937l894l251k076r13l27l07l34j42O3J85O04J608K764L312
$$ 424497 420851 416914 413020 409769 407693 406780 406453 406146 405812 405670 405733 405918 406522 408130 410894 414206
51177D14206K992K220J575J323J303J078L37o71j370j588j704j864j584n28P83
$$ 414206 417198 419418 420993 422316 423619 424697 425034 424363 422993 421405 419701 417837 416253 415725 416508
51162D16508J600J907K163K402K344K128K139K139J439Lj346k016k229k336k272
$$ 416508 418108 420015 422178 424580 426924 429052 431191 433330 434769 434772 433426 431410 429181 426845 424573
51147D24573k067k139k601k872k510j972j949k278k126j079M42J676K054J410
$$ 424573 422506 420367 417766 414894 412384 410412 408463 406185 404059 402980 403422 405098 407152 408562
51133D08562J23r79j244p65j33K83N86J042J808K850L860M397M327M007L868L982
$$ 408562 408685 407706 406462 405697 405564 405847 406433 407475 409283 412133 415993 420390 424717 428724 432592 436574
51117D36574M194M389M400M019L392L021K939K351O91j232j966j202n8M35M00
$$ 436574 440768 445157 449557 453576 456968 459989 462928 465279 465970 464738 462772 461570 461512 461947 462347
51102D62347M67P90J051R70L85p38k060k925k913k203j215k93K33J29l24m31P2
$$ 462347 462814 463604 464655 465625 466010 465272 463212 460287 457374 455171 453956 453663 453896 454025 453701 453270 453342
51085D53342O85Q66O53K36m12j084j108k79N36N28K60Q83K318L314L295L011L111
$$ 453342 454027 454893 455546 455782 455370 454286 453178 452899 453435 453963 454223 455106 457424 460738 464033 467044 470155
51068D70155L207K972L100M402O554Q639J0498J2632J5006J6706J6850J5289J2570
$$ 470155 473362 476334 479434 483836 490390 499029 509527 522159 537165 553871 570721 586010 598580
51055E98580R798Q344Q988J1244J3986J6511J8460J8965J7109J3372R631P043
$$ 598580 608378 616722 625710 636954 650940 667451 685911 704876 721985 735357 744988 752031
51043G52031M708J114l642p938j0542j1565j1599j0855r549q526q875j0904j3657
$$ 752031 756739 757853 754211 746273 735731 724166 712567 701712 692163 683637 674762 663858 650201
51030F50201j5619j5949j5114j4162j3326j1711q596m665j415M73J593K675L677
$$ 650201 634582 618633 603519 589357 576031 564320 555724 551059 549644 550117 551710 554385 558062
51017E58062M282M659N170N638N550M977M759N527O932Q130Q889R727J0971J2125
$$ 558062 562344 567003 572173 577811 583361 588338 593097 598624 605556 613686 622575 632302 643273 655398
51003F55398J2528J2369J2461J3072J3528J3210J2328J1330J0035Q051N774M125
$$ 655398 667926 680295 692756 705828 719356 732566 744894 756224 766259 774310 780084 784209
50991G84209L216K158M19j255j809j225l00N99J835L597N337O417O875P247P879
$$ 784209 787425 789583 790002 788747 786938 785713 785413 786012 787847 791444 796781 803198 810073 817320 825199
50976H25199Q726R836J1602J4368J7953K1796K5573K9468L3760L8366M2932M7216
$$ 825199 833925 843761 855363 869731 887684 909480 935053 964521 998281 1036647 1079579 1126795
50964A126795N1119N4463N7094N9142O0859O2109O2231O0619N7262N2617M7133
$$ 1126795 1177914 1232377 1289471 1348613 1409472 1471581 1533812 1594431 1651693 1704310 1751443
50953A751443M1071L4718K8548K2983J7987J3026P805L056J14n90k40m82j928
$$ 1751443 1792514 1827232 1855780 1878763 1896750 1909776 1917581 1920637 1920751 1920161 1919921 1919439 1917511
50940A917511m345p732j2158j6622j9374j9913j9746k0495k2073k3433k4412k5788
$$ 1917511 1913166 1905434 1893276 1876654 1857280 1837367 1817621 1797126 1775053 1751620 1727208 1701420
50928A701420k7969l0648l3602l6868m0063m2411m3666m4317m4732m4679m3896
$$ 1701420 1673451 1642803 1609201 1572333 1532270 1489859 1446193 1401876 1357144 1312465 1268569
50917A268569m2565m0893l8674l5593l1726k7543k3664k0696j8883j7827j6863
$$ 1268569 1226004 1185111 1146437 1110844 1079118 1051575 1027911 1007215 988332 970505 953642
50906I53642j5826j5076j4734j4323j3391j2021j0506q926p324n959n030m388
$$ 953642 937816 922740 908006 893683 880292 868271 857765 848839 841515 835556 830526 826138
50894H26138l716k868j843p10L06R24J187J395J595J528J328J724L125M850N895
$$ 826138 822422 819554 817711 817001 817307 818231 819418 820813 822408 823936 825264 826988 830113 834963 840858
50879H40858O173O446P152P913Q262Q315Q515R062R916J1125J2851J5058J7292
$$ 840858 847031 853477 860629 868542 876804 885119 893634 902696 912612 923737 936588 951646 968938
50866I68938J8977K0011K1004K2753K5421K8503L1612L5022L9171M4041M9350
$$ 968938 987915 1007926 1028930 1051683 1077104 1105607 1137219 1172241 1211412 1255453 1304803
50855A304803N5155O1783O9208P6837Q4063R0803R7449J04457J11938J19505J26495
$$ 1304803 1359958 1421741 1490949 1567786 1651849 1742652 1840101 1944558 2056496 2176001 2302496
50844B302496J32388J36896J39573J39684J36579J30043J20067J06646R0231P2019
$$ 2302496 2434884 2571780 2711353 2851037 2987616 3117659 3237726 3344372 3434603 3506622
50834C506622N3279L4497J5736k296j8143l0715l9960m6295m9849n0503m8270
$$ 3506622 3559901 3594398 3610134 3607838 3589695 3558980 3519020 3472725 3422876 3372373 3324103
50823C324103m3327l6079k7571j9582j3918j1539j2384j5830k1251k8333l7107
$$ 3324103 3280776 3244697 3217126 3197544 3183626 3172087 3159703 3143873 3122622 3094289 3057182
50812C057182m7485n8741o9734p9720q8575r6167j01971j05567j07024j06396
$$ 3057182 3009697 2950956 2881222 2801502 2712927 2616760 2514789 2409222 2302198 2195802
50802B195802j03337r7784r0648q3056p5137o6287n6591m7097l8499l0416k2394
$$ 2195802 2092465 1994681 1904033 1820977 1745840 1679553 1622962 1575865 1537366 1506950 1484556
50791A484556j4854q385k683K918Q060J1448J2436J1805J0644R123O890M174J737
$$ 1484556 1469702 1461317 1458634 1461552 1469612 1481060 1493496 1505301 1515945 1525068 1531958 1536132 1537869
50778A537869j96k220m784p472r630j1333j3257j5725j8413k0999k3581k6210
$$ 1537869 1537673 1535453 1530669 1523197 1513567 1502234 1488977 1473252 1454839 1433840 1410259 1384049
50766A384049k8394k9590k9958l0117l0121k9222k6918k3873k1306j9624j8062
$$ 1384049 1355655 1326065 1296107 1265990 1235869 1206647 1179729 1155856 1134550 1114926 1096864
50755A096864j5768j2798r889p544n635l767j666O98L171N516P695J0038J3001
$$ 1096864 1081096 1068298 1058409 1050865 1045230 1041463 1039797 1040495 1043666 1049182 1056877 1066915 1079916
50742A079916J6796K1337K6476L1973L7316M1937M5800M9478N3501N7870O2295
$$ 1079916 1096712 1118049 1144525 1176498 1213814 1255751 1301551 1351029 1404530 1462400 1524695
50731A524695O6509P0130P2591P3700P4021P4242P4212P3107P0410O6181O0392
$$ 1524695 1591204 1661334 1733925 1807625 1881646 1955888 2030100 2103207 2173617 2239798 2300190
50720B300190N2616M2644L0877J7831L768j0718k4104l4575m1340m4894m6038
$$ 2300190 2352806 2395450 2426327 2444158 2447926 2437208 2413104 2378529 2337189 2292295 2246257
50709B246257m4970m1472l5752k8788k1811j5483r765m615o89R88m0l378q491
$$ 2246257 2201287 2159815 2124063 2095275 2073464 2057981 2048216 2043601 2042912 2043900 2043860 2040482 2031991
50696B031991j5136k2952l1103l8751m5556n1227n5023n6300n5379n3132m9849
$$ 2031991 2016855 1993903 1962800 1924049 1878493 1827266 1772243 1715943 1660564 1607432 1557583
50685A557583m5130l8949l2014k4890j7450r557j678N677J2663J9779K7173L4624
$$ 1557583 1512453 1473504 1441490 1416600 1399150 1389593 1387915 1393592 1406255 1426034 1453207 1487831
50673A487831M1880M8493N3641N6699N7805N7375N5346N1471M6242M0741L5541
$$ 1487831 1529711 1578204 1631845 1688544 1746349 1803724 1859070 1910541 1956783 1997524 2033065
50662B033065L0440K5432K1213J8305J6267J4249J1981R714P485N049K476L77
$$ 2033065 2063505 2088937 2110150 2128455 2144722 2158971 2170952 2180666 2188151 2193200 2195676 2196053
50650B196053n89k24J198L312O037R664J4412J9835K4919K9036L2537L6033L9311
$$ 2196053 2195464 2195240 2196438 2199750 2205787 2215451 2229863 2249698 2274617 2303653 2336190 2372223 2411534
50637B411534M1361M1449L9731L6924L3786L0948K8746K7134K6089K5976K6659
$$ 2411534 2452895 2494344 2534075 2570999 2604785 2635733 2664479 2691613 2717702 2743678 2770337
50626B770337K5908J9679N152j6315l9668n9521p2862p9060p8719p3109o4079
$$ 2770337 2796245 2815924 2821076 2804761 2765093 2705572 2632710 2553650 2474931 2401822 2337743
50615B337743n3473m2381l1115j9936r454l64O909J2211J5434J6404J4895J0660
$$ 2337743 2284270 2241889 2210774 2190838 2181384 2181020 2187929 2200140 2215574 2231978 2246873 2257533
50603B257533L550o253j7888k9834m0540m9242n6205o2004o6617o9389o9800o8058
$$ 2257533 2261083 2254830 2236942 2207108 2166568 2117326 2061121 1999117 1932500 1863111 1793311 1725253
50591A725253o4873o0892n6504n1982m7519m3207l9111l5439l2434l0152k8393
$$ 1725253 1660380 1599488 1542984 1491002 1443483 1400276 1361165 1325726 1293292 1263140 1234747
50580A234747k6769k4820k2221j9081j5938j3204j0654p760m517j524Q57L060
$$ 1234747 1207978 1183158 1160937 1141856 1125918 1112714 1102060 1094300 1089783 1088259 1089116 1092176
50568A092176N730Q756J1368J3094J4328J5840J8039K0846K4098K7804L2018L6555
$$ 1092176 1097906 1106662 1118030 1131124 1145452 1161292 1179331 1200177 1224275 1252079 1284097 1320652
50556A320652M0918M4542M7224M9215N0760N1658N1477N0202M8296M6073M3494
$$ 1320652 1361570 1406112 1453336 1502551 1553311 1604969 1656446 1706648 1754944 1801017 1844511
50545A844511M0795L8884L8526L9430M0807M2694M5938N0723N5898O0343O4319
$$ 1844511 1885306 1924190 1962716 2002146 2042953 2085647 2131585 2182308 2238206 2298549 2362868
50534B362868O8798P3890P8853Q3607Q9251R6664J05211J13338J20055J25355
$$ 2362868 2431666 2505556 2584409 2668016 2757267 2853931 2959142 3072480 3192535 3317890
50524C317890J29390J31796J31904J29243J23702J15305J04035Q9847P2907N3688
$$ 3317890 3447280 3579076 3710980 3840223 3963925 4079230 4183265 4273112 4346019 4399707
50514D399707L2783J0629j2405l5643n8099p8958r7846j14372j27644j36490j40118
$$ 4399707 4432490 4443119 4430714 4395071 4336972 4258014 4160168 4045796 3918152 3781662 3641544
50503C641544j38418j31853j21283j07715r1759p3392n2631l0461q679J1332K9295
$$ 3641544 3503126 3371273 3249990 3142275 3050516 2977124 2924493 2894032 2885353 2896685 2925980
50492B925980M5239N8321O6694O8510O2839M9892L0756P085j9160m5861p0917
$$ 2925980 2971219 3029540 3096234 3164744 3227583 3277475 3308231 3315316 3296156 3250295 3179378
50481C179378r2586j09932j22824j31422j35737j35838j32344j26408j19138j11144
$$ 3179378 3086792 2976860 2854036 2722614 2586877 2451039 2318695 2192287 2073149 1962005
50471A962005j02608r3606q4323p5135o6602n9253n3198m7926m2628l6848l0870
$$ 1962005 1859397 1765791 1681468 1606333 1539731 1480478 1427280 1379354 1336726 1299878 1269008
50460A269008k5524k1582j9267j8257j7982j7878j7393j6088j3884j1168q539
$$ 1269008 1243484 1221902 1202635 1184378 1166396 1148518 1131125 1115037 1101153 1089985 1081446
50449A081446o373m674l159j474O19L033N312O945P758P971P906P776P679P762
$$ 1081446 1075073 1070399 1067240 1065766 1066385 1069418 1074730 1081675 1089433 1097404 1105310 1113086 1120765 1128527
50435A128527Q300R598J1697J4178J6456J8409K0449K2780K4858K6027K6467K6950
$$ 1128527 1136827 1146425 1158122 1172300 1188756 1207165 1227614 1250394 1275252 1301279 1327746 1354696
50423A354696K7753K8410K8748K9479L1348L4234L7580M1327M5810N0979N6280
$$ 1354696 1382449 1410859 1439607 1469086 1500434 1534668 1572248 1613575 1659385 1710364 1766644
50412A766644O1270O5757O9487P2139P3656P4108P3270P0853O7067O2487N7304
$$ 1766644 1827914 1893671 1963158 2035297 2108953 2183061 2256331 2327184 2394251 2456738 2514042
50401B514042N1273M4302L6381K6887J4890N09j4778k9605m3748n7194o9015p7960
$$ 2514042 2565315 2609617 2645998 2672885 2687775 2688284 2673506 2643901 2600153 2542959 2473944 2395984
50389B395984q3624q6230q5795q2409p6857o9930o1404n0807l8934k7435j6886
$$ 2395984 2312360 2226130 2140335 2057926 1981069 1911139 1849735 1798928 1759994 1732559 1715673
50378A715673o541L790J3010K0191K5486K8835K9013K5056J7753Q669j673j3444
$$ 1715673 1709132 1712922 1725932 1746123 1771609 1800444 1829457 1854513 1872266 1880935 1879262 1865818
50366A865818k5913l7464m7008n4296n8993o0695o0032n8590n7342n5923n3794
$$ 1865818 1839905 1802441 1755433 1701137 1642144 1581449 1521417 1462827 1405485 1349562 1295768
50355A295768n1193m8524m5549m1942l8029l4319l0609k6267k1272j6333j1902
$$ 1295768 1244575 1196051 1150502 1108560 1070531 1036212 1005603 979336 958064 941731 929829
50344I29829p582k769K387O870R603J0153Q617N105k82o811j2934j7192j9263
$$ 929829 922247 919478 921865 928735 938338 948491 957108 962213 961931 955120 942186 924994 905731
50331I05731j9753j9215j7786j5673j3334j1035q740o523m644l095j552M6J392
$$ 905731 885978 866763 848977 833304 819970 808935 800195 793672 789028 785933 784381 784427 785819
50318G85819K459L679N116O100O203O010O367P244Q018Q592R416J0504J1174J0952
$$ 785819 788278 791957 797073 803173 809376 815386 821753 828997 837015 845607 855023 865527 876701 887653
50304H87653J0143R321Q658P961P125O335N982O338P198P898P920P344O481N406
$$ 887653 897796 907117 915775 923736 930861 937196 943178 949516 956714 964612 972532 979876 986357 991763
50290I91763M282L883M987P114Q548P944N458K156j174m133o199o815n954m204
$$ 991763 996045 999928 1004915 1012029 1020577 1028521 1033979 1036135 1034961 1030828 1024629 1017814 1011860 1007656
50276A007656k233l77J275K764M196N625O837P386O915N430L399J648R92J716
$$ 1007656 1005423 1005046 1006321 1009085 1013281 1018906 1025743 1033129 1040044 1045474 1048873 1050521 1051513 1053229
50262A053229L335M966O066O833P940R829J2306J4866J7462K0721K5167L0327
$$ 1053229 1056564 1061530 1067596 1074429 1082369 1092198 1104504 1119370 1136832 1157553 1182720 1213047
50250A213047L4986L8447M1137M3799M6363M7928M7727M5781M2785L9630L7055
$$ 1213047 1248033 1286480 1327617 1371416 1417779 1465707 1513434 1559215 1602000 1641630 1678685
50239A678685L5373L4365L3499L2156K9563K4681J6699N849o538j9074l1170m2654
$$ 1678685 1714058 1748423 1781922 1814078 1843641 1868322 1885021 1890870 1884332 1865258 1834088 1791434
50227A791434n2720n9766o2567o1359n7560n2552m6965m1044l5410l1186k9402
$$ 1791434 1738714 1678948 1616381 1555022 1497462 1444910 1397945 1356901 1321491 1290305 1260903
50216A260903l0299l3071l6237l8385l8850l7837l5946l3614l0969k7989k4679
$$ 1260903 1230604 1197533 1161296 1122911 1084061 1046224 1010278 976664 945695 917706 893027
50205H93027k1167j7693j4555j1952r959q643q059q014q017p691p138o673o317
$$ 893027 871860 854167 839612 827660 817701 809058 800999 792985 784968 777277 770139 763466 757149
50192G57149n862n312m953m867m759m401l981l773l726l526k988k164j261n43
$$ 757149 751287 745975 741022 736155 731396 726995 723014 719241 715515 711989 709001 706837 705576 705033
50178G05033k29k14o2N24J308J852K110K443L063L815M582N541O704P539P470
$$ 705033 704804 704590 704528 705052 706360 708212 710322 712765 715828 719643 724225 729766 736470 744009 751479
50163G51479O825O765P985R798J0910J0977J0931J1688J3161J4754J6241J7566
$$ 751479 758304 765069 773054 782852 793762 804739 815670 827358 840519 855273 871514 889080
50151H89080J8155J7300J5196J2966J1429J0467R768R568J0249J1784J3990J7043
$$ 889080 907235 924535 939731 952697 964126 974593 984361 993929 1004178 1015962 1029952 1046995
50139A046995K1242K6602L3097M0972N0233O0097O9543P8175Q5871R1856R4944
$$ 1046995 1068237 1094839 1127936 1168908 1219141 1279238 1348781 1426956 1512827 1604683 1699627
50128A699627R4837R2433Q8746Q4292P9764P6391P4874P4453P3587P1141O6309
$$ 1699627 1794464 1886897 1975643 2059935 2139699 2216090 2290964 2365417 2439004 2510145 2576454
50117B576454N7868M4601K6558N325j7142l9356n9931p7283r0341r9359j05397
$$ 2576454 2634322 2678923 2705481 2710806 2693664 2654308 2594377 2517094 2426753 2327394 2221997
50106B221997j09022j09910j07677j02744r6150q8798q1105p3303o5735n8775
$$ 2221997 2112975 2003065 1895388 1792644 1696494 1607696 1526591 1453288 1387553 1328778
50096A328778n2633m7333m2798l8858l5250l1802k8474k5134k1401j7130j2924
$$ 1328778 1276145 1228812 1186014 1147156 1111906 1080104 1051630 1026496 1005095 987965 975041
50085I75041r774p998o846n437l805k716k581k918k876k077r50l96j018k488l718
$$ 975041 965267 957269 950423 944986 941181 938465 935884 932966 930090 928013 927063 926667 925649 923161 919443
50070I19443l898l227k484k125k143k584l553m681n239n022m651m664m782m504
$$ 919443 915545 912318 909834 907709 905566 902982 899429 894748 889509 884487 879836 875172 870390 865886
50056H65886l945l589l445l104k488j928j563j188p13j79P92K859N910Q708J0136
$$ 865886 861941 858352 854907 851803 849315 847387 845824 844636 843923 843744 844536 847395 853305 862013 872149
50041H72149J0407J0625J1323J2122J2677J3284J4287J5449J6226J6481J6511
$$ 872149 882556 893181 904504 916626 929303 942587 956874 972323 988549 1005030 1021541
50030A021541J6501J6220J5365J3982J2468J1219J0390R954R877J0141J0726J1692
$$ 1021541 1038042 1054262 1069627 1083609 1096077 1107296 1117686 1127640 1137517 1147658 1158384 1170076
50018A170076J3211J5373J7997K0956K4689K9926L6564M3106M7767M9984N0444
$$ 1170076 1183287 1198660 1216657 1237613 1262302 1292228 1328792 1371898 1419665 1469649 1520093
50007A520093M9754M7778M4444M0639L7787L6804L7689L9772M1755M1672L7466
$$ 1520093 1569847 1617625 1662069 1702708 1740495 1777299 1814988 1854760 1896515 1938187 1975653
49996A975653K8081J4066k836k0658l7877n3562o7015p7414q3997q6668q6201
$$ 1975653 2003734 2017800 2014964 1994306 1956429 1902867 1835852 1758438 1674441 1587773 1501572
49985A501572q3574p9339p3805o7577o1311n5084m8576m1974l6101l1419k7426
$$ 1501572 1417998 1338659 1264854 1197277 1135966 1080882 1032306 990332 954231 922812 895386
49974H95386k3460j9711j6860j5023j3577j2012j0415r041p846o633n399m315
$$ 895386 871926 852215 835355 820332 806755 794743 784328 775287 767441 760808 755409 751094
49962G51094l481k729j613L32L029N662P438Q587J0029J1950J3245J2842J1102
$$ 751094 747613 744884 743271 743603 746632 752294 759732 768319 778348 790298 803543 816385 827487
49949H27487R287P930O478M533K582J200J22j369l469n712p632r176j0541j1980
$$ 827487 836774 844704 851182 855715 858297 859497 859619 858250 854781 849069 841437 832261 821720 809740
49935H09740j3726j5730j7485j8342j8091j6955j5133j2656r815p359n979n676
$$ 809740 796014 780284 762799 744457 726366 709411 694278 681622 671807 664448 658469 652793
49923F52793n779n479m332k385m8K191L969N060N289M675L706L204L747N243P160
$$ 652793 647014 641535 637203 634818 634770 636961 640930 645990 651279 655954 659660 662864 666611 671854 679014
49908F79014R021J0621J1905J2880J3679J4515J5430J6051J5654J3688J0469P241
$$ 679014 688035 698656 710561 723441 737120 751635 767065 783116 798770 812458 822927 830168
49896H30168N169M168K963N07l008o634r786j2434j4415j5322j5105j4330j3559
$$ 830168 835337 839505 842468 842975 839967 833333 823547 811113 796698 781376 766271 751941 738382
49883G38382j2869j2211j1840j1975j2290j2214j1664j1003j0231q803o507m154
$$ 738382 725513 713302 701462 689487 677197 664983 653319 642316 632085 623282 616775 612621
$$ [...]
##END NTUPLES=NMR SPECTRUM
##END=
