##TITLE=AC1464_TOLI813270_7819174_qUB2r8xD2C
##JCAMPDX= 6.0         $$ Bruker NMR JCAMP-DX V2.0
##DATA TYPE= NMR SPECTRUM
##DATA CLASS= NTUPLES
##ORIGIN= BRUKER
##OWNER= Administrator
$$ 1.72 TOPSPIN		Version 2.1
$$ 2013-05-01 00:16:35.399 -0700  Administrator@X
$$ Compression mode = diff/dup
##.OBSERVE FREQUENCY= 400.02188249412
##.OBSERVE NUCLEUS= ^1H
##.ACQUISITION MODE= SIMULTANEOUS (DQD)
##.ACQUISITION SCHEME= undefined
##.AVERAGES= 64
##.DIGITISER RES= 22
##SPECTROMETER/DATA SYSTEM= spect
##.PULSE SEQUENCE= noesygpps1d.comp
##.SOLVENT NAME= COFFEE_meoh
##.SHIFT REFERENCE= INTERNAL, COFFEE_meoh, 1, 14.96072
##AUDIT TRAIL= $$ (NUMBER, WHEN, WHO, WHERE, PROCESS, VERSION, WHAT)
$$ ##TITLE= Audit trail, TOPSPIN		Version 2.1
$$ ##JCAMPDX= 5.01
$$ ##ORIGIN= Bruker BioSpin GmbH
$$ ##OWNER= Administrator
$$ $$ E:\/data/COFFEE/nmr/AC1464_TOLI813270_7819174_qUB2r8xD2C/12/pdata/1/auditp.txt
$$ ##AUDIT TRAIL=  $$ (NUMBER, WHEN, WHO, WHERE, PROCESS, VERSION, WHAT)
(   1,<2013-05-01 00:16:30.493 -0700>,<Administrator>,<X>,<go>,<TOPSPIN 2.1>,
      <created by zg
	started at 2013-05-01 00:05:00.477 -0700,
	POWCHK enabled, PULCHK disabled,
       configuration hash MD5:
       F7 49 AB AC A2 8D 51 76 73 8D C1 9A A6 38 9F DE
       data hash MD5: 64K
       A0 C4 01 CF 4F 07 50 03 0A 24 36 A3 A7 EF E7 D1>)
(   2,<2013-05-01 00:16:33.383 -0700>,<Administrator>,<X>,<proc1d>,<TOPSPIN 2.1>,
      <Start of raw data processing
       efp LB = 0.3 FT_mod = 6 PKNL = 1 PHC0 = 0 PHC1 = 0 SI = 128K 
       data hash MD5: 128K
       1A 3A EC 1A B6 99 FC D3 F2 44 97 34 00 2A D6 5D>)
(   3,<2013-05-01 00:16:34.399 -0700>,<Administrator>,<X>,<proc1d>,<TOPSPIN 2.1>,
      <pk PHC0 = -79.9585 PHC1 = 0 
       data hash MD5: 128K
       8E DB 99 2D D7 75 F3 CD 7A 03 19 DA DC 98 48 35>)
(   4,<2013-05-01 00:16:34.836 -0700>,<Administrator>,<X>,<proc1d>,<TOPSPIN 2.1>,
      <abs ABSG = 1 
       data hash MD5: 128K
       F8 8C 80 11 09 2E 08 F4 92 A2 E2 DB 0C 76 70 8C>)
(   5,<2013-05-01 00:16:34.946 -0700>,<Administrator>,<X>,<proc1d>,<TOPSPIN 2.1>,
      <abs ABSG = 2 
       data hash MD5: 128K
       B7 2F D9 21 92 FB 60 80 01 0F DE D9 AF 92 67 14>)
(   6,<2013-05-01 00:16:35.039 -0700>,<Administrator>,<X>,<proc1d>,<TOPSPIN 2.1>,
      <abs ABSG = 3 
       data hash MD5: 128K
       D4 F1 E4 94 53 1E DB E6 60 B7 7F CB 8D EB 04 21>)
(   7,<2013-05-01 00:16:35.133 -0700>,<Administrator>,<X>,<proc1d>,<TOPSPIN 2.1>,
      <abs ABSG = 4 
       data hash MD5: 128K
       B3 5C 42 61 A2 F3 BD CF F7 10 56 D1 0D 73 96 00>)
(   8,<2013-05-01 00:16:35.211 -0700>,<Administrator>,<X>,<proc1d>,<TOPSPIN 2.1>,
      <abs ABSG = 5 
       data hash MD5: 128K
       41 BA AD BF 86 1F 4D 43 4D 89 3E F1 FF 99 45 7C>)
$$ ##END=
$$ 
$$ $$ hash MD5
$$ $$ 5E 26 0C E9 C5 4C 5A 87 62 55 53 26 5A 68 68 07
##$RELAX= 
##$RELAX= 
##$RELAX= 
##$RELAX= 
##$RELAX= 
##$RELAX= 
##$RELAX= 
##$RELAX= 
$$ Bruker specific parameters
$$ --------------------------
##$DU= <E:\>
##$EXPNO= 12
$$ [...]
150 150 150 150 150 150 150 150
##$TP07= 0
##$TPNAME0= <>
##$TPNAME1= <>
##$TPNAME2= <>
##$TPNAME3= <>
##$TPNAME4= <>
##$TPNAME5= <>
##$TPNAME6= <>
##$TPNAME7= <>
##$TPOAL= (0..7)
0.5 0.5 0.5 0.5 0.5 0.5 0.5 0.5
##$TPOFFS= (0..7)
0 0 0 0 0 0 0 0
##$TUNHIN= 0
##$TUNHOUT= 0
##$TUNXOUT= 0
##$USERA1= <user>
##$USERA2= <user>
##$USERA3= <user>
##$USERA4= <user>
##$USERA5= <user>
##$V9= 5
##$VALIST= <valist>
##$VCLIST= <CCCCCCCCCCCCCCC>
##$VD= 0
##$VDLIST= <DDDDDDDDDDDDDDD>
##$VPLIST= <PPPPPPPPPPPPPPP>
##$VTLIST= <TTTTTTTTTTTTTTT>
##$WBST= 1024
##$WBSW= 4
##$XGAIN= (0..3)
0 0 0 0
##$XL= 0
##$YL= 0
##$YMAX_a= 6330628
##$YMIN_a= -12854096
##$ZGOPTNS= <>
##$ZL1= 120
##$ZL2= 120
##$ZL3= 120
##$ZL4= 120
##$ABSF1= 14.96072
##$ABSF2= -5.597462
##$ABSG= 5
##$ABSL= 3
##$ALPHA= 0
##$AQORDER= 0
##$ASSFAC= 0
##$ASSFACI= 0
##$ASSFACX= 0
##$ASSWID= 0
##$AUNMP= <proc_prof1d_extract.lims>
##$AXLEFT= 0
##$AXNAME= <>
##$AXNUC= <1H>
##$AXRIGHT= 0
##$AXTYPE= 0
##$AXUNIT= <>
##$AZFE= 0.1
##$AZFW= 0.1
##$BCFW= 0
##$BC_mod= 0
##$BYTORDP= 0
##$COROFFS= 0
##$CY= 15
##$DATMOD= 1
##$DC= 0
##$DFILT= <>
##$DTYPP= 0
##$F1P= 0
##$F2P= 0
##$FCOR= 0.5
##$FTSIZE= 131072
##$FT_mod= 6
##$GAMMA= 0
##$GB= 0
##$INTBC= 1
##$INTSCL= 1
##$ISEN= 128
##$LB= 0.3
##$LEV0= 0
##$LPBIN= 0
##$MAXI= 10000
##$MC2= 0
##$MEAN= 0
##$ME_mod= 0
##$MI= 0
##$NCOEF= 0
##$NC_proc= -2
##$NLEV= 6
##$NOISF1= 0
##$NOISF2= 0
##$NSP= 0
##$NTH_PI= 0
##$NZP= 0
##$OFFSET= 14.96072
##$PC= 1
##$PHC0= -79.9585
##$PHC1= 0
##$PH_mod= 1
##$PKNL= yes
##$PPARMOD= 0
##$PPDIAG= 0
##$PPIPTYP= 0
##$PPMPNUM= 2147483647
##$PPRESOL= 1
##$PSCAL= 4
##$PSIGN= 0
##$PYNMP= <proc.py>
##$REVERSE= no
##$SF= 400.020009747022
##$SI= 131072
##$SIGF1= 0
##$SIGF2= 0
##$SINO= 400
##$SIOLD= 131072
##$SPECTYP= <>
##$SREGLST= <1H.CDCl3>
##$SSB= 0
##$STSI= 131072
##$STSR= 0
##$SW_p= 8223.68421052631
##$SYMM= 0
##$S_DEV= 0
##$TDeff= 65536
##$TDoff= 0
##$TI= <>
##$TILT= no
##$TM1= 0
##$TM2= 0
##$TOPLEV= 0
##$USERP1= <user>
##$USERP2= <user>
##$USERP3= <user>
##$USERP4= <user>
##$USERP5= <user>
##$WDW= 1
##$XDIM= 131072
##$YMAX_p= 459872814
##$YMIN_p= -10971
##$CURPLOT= <Network HP LaserJet P1505>
##$CURPRIN= <$Network HP LaserJet P1505>
##$DFORMAT= <normdp>
##$LAYOUT= <+/1D_H.xwp>
##$LFORMAT= <normlp>
##$PFORMAT= <normpl>
##$SURQMSG= 1
$$ End of Bruker specific parameters
$$ ---------------------------------
##NTUPLES= NMR SPECTRUM
##VAR_NAME=  FREQUENCY,     SPECTRUM/REAL,   SPECTRUM/IMAG
##SYMBOL=    X,             R,               I
##VAR_TYPE=  INDEPENDENT,   DEPENDENT,       DEPENDENT
##VAR_FORM=  AFFN,          ASDF,            ASDF
##VAR_DIM=   131072,        131072,          131072
##UNITS=     HZ,            ARBITRARY UNITS, ARBITRARY UNITS
##FACTOR=    0.0627417313425164, 1,          1
##FIRST=     8223.62146879497, 2923,         -58766
##LAST=      0,             4708,            -58824
##MIN=       0,             -10971,          0
##MAX=       8223.62146879497, 459872814,    0
$$ Real data points
##PAGE= N=1
##DATA TABLE= (X++(R..R)), XYDATA
$$ [...]
63855I00266J7967J5127J1262P122L336m99m908r487j3483j6878k0073k2942k5007
$$ 900266 918233 933360 944622 951744 955080 954581 949673 940186 926703 909825 889752 866810 841803
63842H41803k6316k7328k8155k8572k8644k8727k8865k8713k8044k6914k5432
$$ 841803 815487 788159 760004 731432 702788 674061 645196 616483 588439 561525 536093
63831E36093k3724k2039k0557j9176j7715j6142j4438j2592j0968j0225j0442
$$ 536093 512369 490330 469773 450597 432882 416740 402302 389710 378742 368517 358075
63820C58075j0789j0465r613q797q042p077o067n425n084m651m133l808l565l001
$$ 358075 347286 336821 327208 318411 310369 303292 297225 291800 286716 282065 277932 274124 270559 267558
63806B67558k142j380p85j28M02K24p21j715k066j831j570j759k435l097l040
$$ 267558 265416 264036 263251 263123 263525 263749 263028 261313 259247 257416 255846 254087 251652 248555 245515
63791B45515k185j410j575k400k899k760k571k672k629k010j035j57L85M12j61
$$ 245515 243330 241920 240345 237945 235046 232286 229715 227043 224414 222404 221369 221212 221597 222009 221848
63776B21848q51q57j28L76%o74p11j40K78K32R8J11nm26q62r69q00n65j91N31
$$ 221848 220997 220140 220012 220388 220388 219714 219003 218863 219141 219373 219471 219582 219577 219151 218289 217320 216520 215955 215764 216295
63756B16295J379J637Q92k68p60l09J51k48j013q34O72K418L115K490J186M1k17
$$ 216295 217674 219311 220203 219935 219175 218866 219017 218769 217756 216922 217594 220012 223127 225617 226803 226844 226627
63739B26627P41K355L403L262K656K653L203L340K679J987K102K877L572L922
$$ 226627 227368 229723 233126 236388 239044 241697 244900 248240 250919 252906 255008 257885 261457 265379
63725B65379M308N031N799O168O213O512P431Q623R331R081P946O250M321K487
$$ 265379 269687 274718 280517 286685 292898 299410 306841 315464 324795 333876 341822 348072 352393 354880
63711C54880J028p4j136k415l838n157o132o487n939m599l208k681l260m272m730
$$ 354880 355908 355834 354698 352283 348445 343288 337156 330669 324730 320131 316923 314242 310982 306710 301980
63696C01980m148k735j022N70J799K491K616K495K609K996L046K279J175P79J380
$$ 301980 297832 295097 294075 294645 296444 298935 301551 304046 306655 309651 312697 314976 316151 316930 318310
63681C18310K107K024J232M68L1l56o78l78Q61K523L776M320M467M542M606M640
$$ 318310 320417 322441 323673 324141 324172 323816 323138 322760 323621 326144 329920 334240 338707 343249 347855 352495
63665C52495M709M813M778M371L405J835j24j933l122l768m395n305o273o979
$$ 352495 357204 362017 366795 371166 374571 376406 376282 374349 371227 367459 363064 357759 351486 344507
63651C44507p390p486p016n913m670l818l213k335j217m00K4N90J482K054J818
$$ 344507 337117 329631 322615 316702 312032 308214 305001 302666 301449 301049 301073 301663 303145 305199 307017
63636C07017J390J824L276M781N330M758L772L400M229N846P117P330O923O837
$$ 307017 308407 310231 313507 318288 323618 328376 332148 335548 339777 345623 352740 360070 366993 373830
63622C73830P403Q175Q680Q942R303J0126J1545J3338J5103J6796J8778K1180
$$ 373830 381233 389408 398088 407030 416333 426459 438004 451342 466445 483241 502019 523199
63610E23199K3626K5919K8574L2057L5899L9244M1968M4361M5818M4809M0352
$$ 523199 546825 572744 601318 633375 669274 708518 750486 794847 840665 885474 925826
63599I25826L2937K3815J4126N024k182o637q539q830q522q383q797r659j0684
$$ 925826 958763 982578 996704 1001728 999546 992909 984370 975540 967018 958635 949838 940179 929495
63586I29495j2071j4561j8565k3528k8248l1635l3133l2832l1342k9319k6963
$$ 929495 917424 902863 884298 860770 832522 800887 767754 734922 703580 674261 647298
63575F47298k4170k1127j8324j5962j3825j1727r664p448m797j910N67K354L777
$$ 647298 623128 602001 583677 567715 553890 542163 532499 525051 520254 518344 518911 521265 525042
63562E25042N114O244P144Q057Q946R438R589J0047J1099J2367J3809J6138J9629
$$ 525042 530156 536400 543544 551601 560547 569985 579574 589621 600720 613087 626896 643034 662663
63549F62663K3380K6636L0099L5014M1571M9193N7585O5908P1142O9125N8080
$$ 662663 686043 712679 742778 777792 819363 868556 926141 992049 1063191 1132316 1190396
63538A190396M0394K0689K889j0799j9491k3364k3452k0989j7016j2678r264p537
$$ 1190396 1230790 1251479 1254368 1243569 1224078 1200714 1177262 1156273 1139257 1126579 1117315 1109778
63526A109778p395q618j1491j6323k2675k9525l5943m1198m4591m5766m5086m3283
$$ 1109778 1102383 1093765 1082274 1065951 1043276 1013751 977808 936610 892019 846253 801167 757884
63514G57884m0786l7704l4280l0959k7992k5361k2986k0737j8351j5737j3343
$$ 757884 717098 679394 645114 614155 586163 560802 537816 517079 498728 482991 469648
63503D69648j1714j0672r495p980o788o369o146n330m204l762m232m609l932k397
$$ 469648 457934 447262 437767 429787 422999 416630 410484 405154 400950 397188 392956 388347 384415 382018
63489C82018r10m5K35J64QJ03O19J341K023K783L817M848N348N246N095N444O269
$$ 382018 381108 381063 381298 381462 381470 381573 382192 383533 385556 388339 392156 397004 402352 407598 412693 418137 424406
63472D24406P014O938N588L293J090k71j149k464m386o120o972p052o821o436
$$ 424406 431420 438358 443946 447239 448329 448058 446909 444445 440059 433939 426967 419915 413094 406658
63458D06658n802m812l457j996j026r18j148q02K05J116J568K042K851L616M176
$$ 406658 400856 396044 392587 390591 389565 388647 387499 386697 386902 388018 389586 391628 394479 398095 402271
63443D02271N125O796Q518R670J0791J2760J5457J8223K1195K5257L0894L7870
$$ 402271 407396 414192 422710 432380 443171 455931 471388 489611 510806 536063 566957 604827
63431F04827M5531N2304N5235N1567M1315K7574J4073L058m664q854r645p544
$$ 604827 650358 702662 757897 809464 850779 878353 892426 895484 890820 881966 872321 864777
63419H64777l081L240J0624J8232K5930L4081M2344M9229N3143N3349M9747M2487
$$ 864777 861696 864936 875560 893792 919722 953803 996147 1045376 1098519 1151868 1201615 1244102
63407A244102L2237K0392Q513k155j0518j5601j7223j6381j4612j3129j2685j3803
$$ 1244102 1276339 1296731 1305244 1303089 1292571 1276970 1259747 1243366 1228754 1215625 1202940 1189137
63395A189137j6709k1232k6965l3283l9165m3533m5958m6698m5969m3749m0397
$$ 1189137 1172428 1151196 1124231 1090948 1051783 1008250 962292 915594 869625 825876 785479
63384G85479l6800l3462l0134k6623k3408k0895j8659j6088j3291j0718q271n545
$$ 785479 748679 715217 685083 658460 635052 614157 595498 579410 566119 555401 547130 541585
63372E41585k658j63J803L664N777Q129J0630J3164J5451J7318J9088K1270K3944
$$ 541585 538927 538764 540567 544231 550008 558137 568767 581931 597382 614700 633788 655058 679002
63359F79002K6819K9810L3061L6516L9960M3439M7148N0729N3198N3657N1694
$$ 679002 705821 735631 768692 805208 845168 888607 935755 986484 1039682 1093339 1145033
63348A145033M7035L9378K8965J7100N716l672j0505j4897j7018j6993j5361j3346
$$ 1145033 1192068 1231446 1260411 1277511 1283227 1279555 1269050 1254153 1237135 1220142 1204781 1191435
63336A191435j2301j2888j5062j8755k3951k9972l5423l9350m1933m3556m3794
$$ 1191435 1179134 1166246 1151184 1132429 1108478 1078506 1043083 1003733 961800 918244 874450
63325H74450m1976l8361l3849k8812k3048j6612r817k573M900J0475J0598L454
$$ 874450 832474 794113 760264 731452 708404 691792 681975 679402 684302 694777 705375 708829
63313G08829q737k1196l0037l4083l4150l1703k8117k4368k0904j7790j4974j2419
$$ 708829 700092 678896 648859 614776 580626 548923 520806 496438 475534 457744 442770 430351
63301D30351j0178q468p471o965o491n947n691n853n991n686n134m735m474m114
$$ 430351 420173 411705 404234 397269 390778 384831 379140 373287 367296 361610 356476 351741 347267 343153
63287C43153l757l705l865l732k972j831r16p66j439k388k871k659k211j920j567
$$ 343153 339396 335691 331826 328094 325122 323291 322375 321609 320170 317782 314911 312252 310041 308121 306554
63272C06554p63L27J142J440J401J218R11N45K57Q5J04N33J394K266K755L112
$$ 306554 305791 306118 307260 308700 310101 311319 312230 312775 313032 313117 313221 313754 315148 317414 320169 323281
63256C23281L877M918N478N184M505M055L940M007M295M862N541O120O619P113
$$ 323281 327158 332076 337554 342738 347243 351298 355238 359245 363540 368402 373943 380063 386682 393795
63242C93795P587Q170R241J0951J2822J4148J4767J5202J6100J7715J9821K1923
$$ 393795 401382 409552 418793 429744 442566 456714 471481 486683 502783 520498 540319 562242
63230E62242K3518K4380K4646K4608K4447K4190K3779K3141K2287K1451K1057
$$ 562242 585760 610140 634786 659394 683841 708031 731810 754951 777238 798689 819746
63219H19746K1381K2315K3475K4447K4931K4789K3999K2427J9648J5268R523L313
$$ 819746 841127 863442 886917 911364 936295 961084 985083 1007510 1027158 1042426 1051949 1055262
63207A055262k578q174j3987k0089k5768l0115l2834l4338l5122l5111l3819l1101
$$ 1055262 1052684 1044510 1030523 1010434 984666 954551 921717 887379 852257 817146 783327 752226
63195G52226k7540k3891k0390j6874j3402j0243p262l935j34L538O471Q773J0920
$$ 752226 724686 700795 680405 663531 650129 639886 632624 628689 628555 632093 638564 647337 658257
63182F58257J3055J4945J6375J7258J7591J7610J7789J8311J8729J8462J7545
$$ 658257 671312 686257 702632 719890 737481 755091 772880 791191 809920 828382 845927
63171H45927J6566J6002J5852J5729J5021J3182J0189O584K801j301n976j0950
$$ 845927 862493 878495 894347 910076 925097 938279 948468 955052 957853 956552 950576 939626
63159I39626j5749k0317k4741k8556l0970l1828l1803l1579l1278l0684k9513
$$ 939626 923877 903560 878819 850263 819293 787465 755662 724083 692805 662121 632608
63148F32608k7549k4969k2493k0692j9146j6977j4178j1663r941q494o762m979
$$ 632608 605059 580090 557597 536905 517759 500782 486604 474941 465000 456506 449744 444765
63136D44765l634k755k110j640j251p46k72l11q23j070o72j80k3L44J482K858
$$ 444765 441131 438376 436266 434626 433375 432629 432357 432046 431223 430153 429481 429301 429278 429622 431104 433962
63120D33962L557L644L804M030L744L005K503K406K230J899J897K304K654K910
$$ 433962 437519 441163 444967 448997 452741 455746 458249 460655 462885 464784 466681 468985 471639 474549
63106D74549L478M031L510J904Q25J459K819L055J849M56j12J20Q52J849K610
$$ 474549 478027 482058 485568 487472 488297 489756 492575 495630 497479 497935 497823 497943 498795 500644 503254
63091E03254K608K166K225L044L786L512K093Jk131l576l768k936j937j175k29
$$ 503254 505862 508028 510253 513297 517083 520595 522688 522689 520558 516982 513214 510278 508341 507166 506937
63076E06937J202K610L364L585L844M397N273O613Q314R654J0085J0222J1224
$$ 506937 508139 510749 514113 517698 521542 525939 531212 537825 546139 555793 565878 576100 587324
63063E87324J3236J5152J6097J6496J7504J9853K3438K7509L1094L3700L5813
$$ 587324 600560 615712 631809 648305 665809 685662 709100 736609 767703 801403 837216
63052H37216L8366M1626M5054M8280N1495N4700N7261N8701N9268N9304N8657
$$ 837216 875582 917208 962262 1010542 1062037 1116737 1173998 1232699 1291967 1351271 1409928
63041A409928N7336N6131N5821N6143N6300N6193N6315N6714N6869N6481N5556
$$ 1409928 1467264 1523395 1579216 1635359 1691659 1747852 1804167 1860881 1917750 1974231 2029787
63030B029787N3662M9926M3895L5785K5813J3994O40j3503k7782m1701n4439o5086
$$ 2029787 2083449 2133375 2177270 2213055 2238868 2252862 2253502 2239999 2212217 2170516 2116077 2050991
63018B050991p3333p9253q2399q2187p9304p5565p1765o6752n9386n0535m2128
$$ 2050991 1977658 1898405 1816006 1733819 1654515 1578950 1507185 1440433 1381047 1330512 1288384
63007A288384l4837k7787k0203j2281m612K403Q499J3621J8055K2005K5080K6806
$$ 1288384 1253547 1225760 1205557 1193276 1188664 1191067 1199566 1213187 1231242 1253247 1278327 1305133
62995A305133K7462K7883K8454K8952K9303K9816L0530L0948L0690K9880K8755
$$ 1305133 1332595 1360478 1388932 1417884 1447187 1477003 1507533 1538481 1569171 1599051 1627806
62984A627806K7111K4425K0239J4335O810j846j0914j9853k8552l7140m5533n3048
$$ 1627806 1654917 1679342 1699581 1713916 1720726 1718880 1707966 1688113 1659561 1622421 1576888 1523840
62972A523840n8577o1487o2431o2741o2846o1771n8635n4039m9391m5318m1542
$$ 1523840 1465263 1403776 1341345 1278604 1215758 1153987 1095352 1041313 991922 946604 905062
62961I05062l7948l4770l1820k8500k4852k1785j9868j8522j6909j5171j4236
$$ 905062 867114 832344 800524 772024 747172 725387 705519 686997 670088 654917 640681
62950F40681j4573j5512j5898j5209j3981j3102j2773j2383j1457j0327r609r405
$$ 640681 626108 610596 594698 579489 565508 552406 539633 527250 515793 505466 495857 486452
62938D86452r432r554r667r332q185o579n225m342l736l493l809m244m031l249
$$ 486452 477020 467466 457799 448467 440282 433703 428478 424136 420400 416907 413098 408854 404823 401574
62924D01574k859l319l907l754k935k131j764j776j863j657j035m59n42j149j413
$$ 401574 398715 395396 391489 387735 384800 382669 380905 379129 377266 375609 374574 374115 373573 372424 371011
62909C71011q74j9M72N09L68K04L3k27q81k073l162l203k256j438j348j233k69
$$ 371011 370137 370118 370590 371099 371467 371671 371704 371477 370596 368523 365361 362158 359902 358464 357116 355883 355614
62892C55614J152K098K433K649K819K563J837J053N57M10M93M94J17l74l50R1
$$ 355614 356766 358864 361297 363946 366765 369328 371165 372218 372775 373185 373678 374172 374289 373915 373565 373656
62876C73656j2q76j160K24K159K529J101k79l57O2k37j102j576j409j052p54m37
$$ 373656 373644 372768 371608 371832 373991 376520 377621 377342 376985 377047 376810 375708 374132 372723 371671 370917 370480
62859C70480j65nL48J202K203K604K237J773J845K281K463K169J768J630J712
$$ 370480 370315 370310 370658 371860 374063 376667 378904 380677 382522 384803 387266 389435 391203 392833 394545
62844C94545J804J915K063J925J143J3n82k15M87N82l9n50j04J323K884L568L081
$$ 394545 396349 398264 400327 402252 403395 403408 402826 402611 403098 403680 403641 403091 402987 404310 407194 410762 413843
62827D13843K155J738J941K134K101K339L007L316K590J358O33N68O09N92Q11
$$ 413843 415998 417736 419677 421811 423912 426251 429258 432574 435164 436522 437155 437723 438332 438924 439735
62812D39735J197J445J821K834M077M423L710L198L868N126N849O018O492P593
$$ 439735 440932 442377 444198 447032 451109 455532 459242 462440 466308 471434 477283 483301 489793 497386
62798D97386Q755R500J0090J1045J2372J3511J3961J3990J4660J6879K0355K3872
$$ 497386 506141 515641 525731 536776 549148 562659 576620 590610 605270 622149 642504 666376
62786F66376K6714K9452L3077L7809M3216M9073N5515O2408O9286P5977Q2796
$$ 666376 693090 722542 755619 793428 836644 885717 941232 1003640 1072926 1148903 1231699
62775A231699Q9770R6014J00306J02239J02375J01129R7730R0712P9409O4700
$$ 1231699 1321469 1417483 1517789 1620028 1722403 1823532 1921262 2011974 2091383 2156083
62765B156083M8139L0726J2795n231k2569l8582n3016o5605p5852q3453q8639
$$ 2156083 2204222 2234948 2247743 2242512 2219943 2181361 2128345 2062740 1986888 1903435 1814796
62754A814796r1862r3364r3199r1462q8283q3849p8547p2907o7218o1481n5887
$$ 1814796 1722934 1629570 1536371 1444909 1356626 1272777 1194230 1121323 1054105 992624 936737
62743I36737n0996m7083m3586l9649l5132l0701k6973k3990k1488j9236j7016
$$ 936737 885741 838658 795072 755423 720291 689590 662617 638627 617139 597903 580887
62732E80887j4628j2189j0174q886p987o813n142l467k463k282k397k106j157
$$ 580887 566259 554070 543896 535010 527023 520210 515068 511601 509138 506856 504459 502353 501196
62719E01196J10J193J998K917M335O103P616Q467Q907R630J1094J3148J5350J7557
$$ 501196 501306 502499 504497 507414 511749 517852 525468 533935 542842 552472 563566 576714 592064 609621
62705F09621K0136K3582K7865L2337L6286L9720M3323M7608N2315N6866O1120
$$ 609621 629757 653339 681204 713541 749827 789547 832870 880478 932793 989659 1050779
62694A050779O5238O8941P1551P2829P3139P2414O9596O3775N5435M5787L5098
$$ 1050779 1116017 1184958 1256509 1329338 1402477 1474891 1544487 1608262 1663697 1709484 1744582
62683A744582K2569Q018p260k1690l4767m6641n6974o4975p0412p3752p5295p4840
$$ 1744582 1767151 1775169 1767909 1746219 1711452 1664811 1607837 1542862 1472450 1398698 1323403 1248563
62671A248563p2497o9183o5828o2375n8118n2921m7621m3102l9411l6025l2675
$$ 1248563 1176066 1106883 1041055 978680 920562 867641 820020 776918 737507 701482 668807
62660F68807k9481k6484k3544k0769j8543j6885j5163j2894j0564r097q582q136
$$ 668807 639326 612842 589298 568529 549986 533101 517938 505044 494480 485383 476801 468665
62648D68665p156o124n781n939n734m898m031l473k658j105M90R18J63m09K66
$$ 468665 461509 455385 449604 443665 437931 433033 429002 425529 422871 421766 422256 423174 423337 422928 423194
62633D23194J663K524K395J796J182N04k20p11q64r23r64p45k51N6j31m78m23
$$ 423194 424857 427381 429776 431572 432754 433258 433038 432327 431463 430540 429576 428831 428580 428636 428505 428027 427604
62616D27604K45J415K851M044M355L813L398M008N388O594P304Q010R099J0395
$$ 427604 427849 429264 432115 436159 440514 444327 447725 451733 457121 463715 471019 479029 488128 498523
62602D98523J1709J3165J4820J6447J7964J9759K2293K5700K9830L4359L8681
$$ 498523 510232 523397 538217 554664 572628 592387 614680 640380 670210 704569 743250
62591G43250M2126M4572M6562M8452M9655M9111M6377M1895L6135K8956K0099
$$ 743250 785376 829948 876510 924962 974617 1023728 1070105 1112000 1148135 1177091 1197190
62580A197190J0130L85q187j5823k3312l0768l7410m2437m5617m6994m6626m4943
$$ 1197190 1207320 1207705 1199518 1183695 1160383 1129615 1092205 1049768 1004151 957157 910531 865588
62568H65588m2828m0901l8991l6677l4030l1380k8731k5987k3426k1311j9227
$$ 865588 822760 781859 742868 706191 672161 640781 612050 586063 562637 541326 522099
62557E22099j6529j3381j0664q781p364o219n787o241o841o685n762m828m412
$$ 522099 505570 492189 481525 472744 465380 459161 453374 447133 440292 433607 427845 423017 418605
62544D18605m353m076l143j663l00L88O23J120K105L053L475L383K865J863P60
$$ 418605 414252 410176 407033 405370 405070 405458 406081 407201 409306 412359 415834 419217 422082 423945 424705
62529D24705M81J334K361K594K562L648O059Q480R840J0612J1942J4236J7075
$$ 424705 425186 426520 428881 431475 434037 437685 443744 452224 462064 472676 484618 498854 515929
62516E15929K0060K3056K5900K8509L1248L4650L8577M2077M4243M4987M4781
$$ 515929 535989 559045 584945 613454 644702 679352 717929 760006 804249 849236 894017
62505H94017M3837M1835L8338L3240K6852J9712J2354N132j757q099j3612j8202
$$ 894017 937854 979689 1018027 1051267 1078119 1097831 1110185 1115317 1113560 1105461 1091849 1073647
62493A073647k1973k4738k5744k4385k1109j7048j2771p961k467L091Q156J3078
$$ 1073647 1051674 1026936 1001192 976807 955698 938650 925879 917918 915451 918542 926698 939776
62481I39776J8493K4287K9816L4775L9323M3494M6995M9223M8940M4537L5678
$$ 939776 958269 982556 1012372 1047147 1086470 1129964 1176959 1226182 1275122 1319659 1355337
62470A355337K4668J4970Q008K009n824j6601k9209m1418n1038n6845n9321o0305
$$ 1355337 1380005 1394975 1402983 1404992 1399168 1382567 1353358 1311940 1260902 1204057 1144736 1084431
62458A084431o1394o2647o2972o1417n7885n2987m7569m2201l6885l1461k6272
$$ 1084431 1023037 960390 897418 836001 778116 725129 677560 635359 598474 567013 540741
62447E40741k2002j8759j5916j3109j0757r230q095o758n391m579m310m009l432
$$ 540741 518739 499980 484064 470955 460198 450968 442873 436115 430724 426145 421835 417826 414394
62434D14394k875k503k063j403q33p22j010j326j479j627j951k301k270j725j030
$$ 414394 411519 409016 406953 405550 404717 403995 402985 401659 400180 398553 396602 394301 392031 390306 389276
62419C89276o38o07p77j202j961k659k670j975j272j046j076j012r37j072j331
$$ 389276 388638 388031 387254 386052 384091 381432 378762 376787 375515 374469 373393 372381 371444 370372 369041
62404C69041j533j631j529j046l77j20m56p27k04J054K419L361L640L294K831
$$ 369041 367508 365877 364348 363302 362925 362805 362349 361622 361418 362472 364891 368252 371892 375186 378017
62389C78017K951L548L576K393Q20J76P41J827K932L959M644M787M932N832P266
$$ 378017 380968 384516 388092 390485 391305 391481 392222 394049 396981 400940 405584 410371 415303 421135 428401
62374D28401Q270Q658R277J0501J1417J1177J0410J0504J1917J3888J5712J7597
$$ 428401 436671 445329 454606 465107 476524 487701 498111 508615 520532 534420 550132 567729
62362E67729K0117K3276K6502K9530L3004L7933M4547N1970N9059O5281P0540
$$ 567729 587846 611122 637624 667154 700158 738091 782638 834608 893667 958948 1029488
62351A029488P4464P6393P5898P2850O7042N8271M6884L3912K0596Q041k858j1730
$$ 1029488 1103952 1180345 1256243 1329093 1396135 1454406 1501290 1535202 1555798 1563839 1560981 1549251
62339A549251j9132k6256l3906m1917m9510n5848o0221o2236o2048o0237n7278
$$ 1549251 1530119 1503863 1469957 1428040 1378530 1322682 1262461 1200225 1138177 1077940 1020662
62328A020662n3421m9065m4782m0738l6565l2108k7980k4940k3014k1633k0491
$$ 1020662 967241 918176 873394 832656 796091 763983 736003 711063 688049 666416 645925
62317F45925j9721j9219j8437j7081j5679j4929j4687j3985j2204r820p821o686
$$ 645925 626204 606985 588548 571467 555788 540859 526172 512187 499983 490163 482342 475656
62305D75656o135n728n197m340l054j669q64r85j628k050j857j222o11l82m44
$$ 475656 469521 463793 458596 454256 451202 449533 448669 447684 446056 444006 442149 440927 440316 439934 439490
62290D39490l15K62Q66R95R79J644K913L668L384L082L829N000N099M008L247
$$ 439490 439175 439437 440303 441298 442277 443921 446834 450502 453886 456968 460797 465797 470896 474904 478151
62275D78151L875N218O019O043N997O404P103P730Q233Q950J0291J2311J4612
$$ 478151 482026 487244 493263 499306 505303 511707 518810 526540 534773 543723 554014 566325 580937
62262E80937J6906J9578K3339K8224L3393L8104M2616M7818N4124O0991O7477
$$ 580937 597843 617421 640760 668984 702377 740481 783097 830915 885039 946030 1013507
62251A013507P2954P7122P9373P8491P3363O4038N1778L8045K3827J0011k271
$$ 1013507 1086461 1163583 1242956 1321447 1394810 1458848 1510626 1548671 1572498 1582509 1580238
62240A580238j2306k0542k8166l6031m4268n2513n9974o5555o8628o9570o9005
$$ 1580238 1567932 1547390 1519224 1483193 1438925 1386412 1326438 1260883 1192255 1122685 1053680
62229A053680o6797o2519n6773n1055m6180m1696l7047l2503k8513k4918k1376
$$ 1053680 986883 924364 867591 816536 770356 728660 691613 659110 630597 605679 584303
62218E84303j8083j5460j3437j1549r546p554n785m366l304k407j410k83Q40K063
$$ 584303 566220 550760 537323 525774 516228 508674 502889 498523 495219 492812 491402 491119 491959 494022
62204D94022L634N291O282O397O481P424R008J0344J1159J1928J2753J2915J1866
$$ 494022 497656 502947 509229 515626 522107 529531 538539 548883 560042 571970 584723 597638 609504
62191F09504J0221R174R142R360Q912P729O415N399M720M504M956N734N905M976
$$ 609504 619725 628899 638041 647401 656313 664042 670457 675856 680576 685080 690036 695770 701675 706651
62177G06651L570K481J492j43k193l340k653m45K585O350J1071J6593K2514K8702
$$ 706651 710221 712702 714194 714051 711858 708518 705865 705420 708005 714355 725426 742019 764533 793235
62163G93235L5273M2194M9106N5286N9607O0929N8828N3682M6031L6304K5420
$$ 793235 828508 870702 919808 975094 1034701 1095630 1154458 1208140 1254171 1290475 1315895
62152A315895J4979O218r73p552j4148k0798k7456l4098m0349m5564m9315n1491
$$ 1315895 1330874 1337092 1336119 1328567 1314419 1293621 1266165 1232067 1191718 1146154 1096839 1045348
62140A045348n2035n0942m8487m5078m0988l6475l1985k7791k3619j9133j4701
$$ 1045348 993313 942371 893884 848806 807818 771343 739358 711567 687948 668815 654114
62129F54114j1065q288n676k859k34K025M603Q068J1708J4249J5557J6761J8528
$$ 654114 643049 634761 629085 626226 625992 628017 632620 640688 652396 666645 682202 698963 717491
62116G17491J9932J9450J6638J2322P632L392K56j295j336n15M01P42k22k989
$$ 717491 737423 756873 773511 785833 793465 796857 797113 795818 794482 793967 794368 795110 794888 791899
62102G91899p048j0801j2789j2810j1632r867p520m502j077K203M798O439P333
$$ 791899 784851 774050 761261 748451 736819 726952 719432 714930 713853 716056 720854 727293 734626
62089G34626Q053Q983R948J0576J0862J1050J1220J1311J1480J2013J2940J4087
$$ 734626 742679 751662 761610 772186 783048 794098 805318 816629 828109 840122 853062 867149
62077H67149J5470J7255J9382K1522K3411K4890K5749K5913K5706K5532K5383
$$ 867149 882619 899874 919256 940778 964189 989079 1014828 1040741 1066447 1091979 1117362
62066A117362K5116K5128K6169K8411L1254L4161L7161M0278M2878M3817M2118
$$ 1117362 1142478 1167606 1193775 1222186 1253440 1287601 1324762 1365040 1407918 1451735 1493853
62055A493853L7432L0288K1947J3719O248l45n990j0826j5662k1443k8117l4661
$$ 1493853 1531285 1561573 1583520 1597239 1603487 1603142 1597152 1586326 1570664 1549221 1521104 1486443
62043A486443m0388m5525n0263n4082n6442n7424n7199n5508n2346m8658m5507
$$ 1486443 1446055 1400530 1350267 1296185 1239743 1182319 1125120 1069612 1017266 968608 923101
62032I23101m2819l9609l5379l0688k6388k2848j9919j7250j4618j2258j0740
$$ 923101 880282 840673 805294 774606 748218 725370 705451 688201 673583 661325 650585
62021F50585j0322j0521j0628j0474j0392j0547j0773j0955j1113j1103j0611
$$ 650585 640263 629742 619114 608640 598248 587701 576928 565973 554860 543757 533146
62010E33146r585q413p499o822n962m550k633o36J052K447L806N161O244O879
$$ 533146 523561 515148 507649 500827 494865 490315 487682 487046 488098 490545 494351 499512 505756 512635
61996E12635P162P161O722N809M724L785K891J641k01k466m668o338p370q131
$$ 512635 519797 526958 533680 539489 544213 547998 550889 552530 552329 549863 545195 538857 531487 523356
61982E23356q996r805j0052r684r253r137q910p824n719l269j454q49j192j540
$$ 523356 514360 504555 494503 484819 475566 466429 457519 449695 443976 440707 439253 438404 437212 435672
61968D35672j180l94p7n02r91q63k58K28L12Q0k58l50J62J143J923K068J907J935
$$ 435672 434492 434098 434021 433519 432528 431665 431407 431635 431947 432027 431769 431419 431581 432724 434647 436715 438622 440557
61950D40557K184K556L336M788O484P760Q685J0093J2541J5690J8724K1093K2845
$$ 440557 442741 445297 448633 453421 459905 467665 476350 486443 498984 514674 533398 554491 577336
61937E77336K4462K6353K8352K9794L0234K9885K9145K8059K6586K5098K4017
$$ 577336 601798 628151 656503 686297 716531 746416 775561 803620 830206 855304 879321
61926H79321K3049K1352J8591J5382J2449R561N741N16n301j0290j3665j5540
$$ 879321 902370 923722 942313 957695 970144 979705 985446 985962 980661 970371 956706 941166
61914I41166j6070j5006j2418r241o350l395N85N571J0492J4696J8444K1684K3464
$$ 941166 925096 910090 897672 888431 882081 878686 879271 884842 895334 910030 928474 950158 973622
61901I73622K3100K1001J7705J2977O640l87o876j2562j7715k1879k4241k5074
$$ 973622 996722 1017723 1035428 1048405 1055045 1054658 1047782 1035220 1017505 995626 971385 946311
61889I46311k5712k6813k7579k7013k5366k3769k2851k2178k1068j9572j8422
$$ 946311 920599 893786 866207 839194 813828 790059 767208 745030 723962 704390 685968
61878F85968j8015j7903j7489j6912j6569j6121j4813j2819j1210j0314r178p132
$$ 685968 667953 650050 632561 615649 599080 582959 568146 555327 544117 533803 524625 517493
61866E17493m864l163j598N26K733M115M976O463Q864J1412J3693J6123J9035
$$ 517493 512629 509466 507868 508394 511127 515242 520218 526681 535545 546957 560650 576773 595808
61853E95808K2231K5553K9052L2573L5865L9152M2828M6565M9380N0620N0287
$$ 595808 618039 643592 672644 705217 741082 780234 823062 869627 919007 969627 1019914
61842A019914M8570M5699M2104L7879L2192K4154J4317M471m087j1242j7011k0825
$$ 1019914 1068484 1114183 1156287 1194166 1226358 1250512 1264829 1269300 1265213 1253971 1236960 1216135
61830A216135k2173k1200j8298j3719p951j804M253J0387J6697K2592K7064K9242
$$ 1216135 1193962 1172762 1154464 1140745 1132794 1130990 1135243 1145630 1162327 1184919 1211983 1241225
61818A241225K8581K4938J8708J0554J018r403j9868k9421l7514m3976m8580n1177
$$ 1241225 1269806 1294744 1313452 1324006 1325024 1315621 1295753 1266332 1228818 1184842 1136262 1085085
61806A085085n2084n1749n0147m7099m3054l8937l5336l2348k9984k7961k5436
$$ 1085085 1033001 981252 931105 884006 840952 802015 766679 734331 704347 676386 650950
61795F50950k1908j8258j5917j4985j4208j2823j1386j0576j0204r779r168q329
$$ 650950 629042 610784 594867 579882 565674 552851 541465 530889 520685 510906 501738 493409
61783D93409p185o090n668n897o036n656n011m234l115j909j430j902k567k807
$$ 493409 486224 480134 474466 468569 462533 456877 451866 447632 444517 442608 441178 439276 436709 433902
61769D33902k745k488j770q10m30p50p38J43R56P72K59O49J847K717K835K861
$$ 433902 431157 428669 426899 426089 425659 424909 424171 424314 425270 426042 426301 426950 428797 431514 434349 437210
61753D37210L343M037M341L795K304M92n36l22L00K83k91o23n76q10j633k486
$$ 437210 440553 444590 448931 452726 455030 455522 454986 454664 454964 455247 454956 454333 453757 452947 451314 448828
61737D48828k652k040j169o18m92l32K78R96J125P77Q99J892K953L286L150L083
$$ 448828 446176 444136 442967 442349 441857 441525 441803 442799 443924 444701 445600 447492 450445 453731 456881 459964
61721D59964K948K516K284K733L280L110K569K625L235L449L019K682K690K271
$$ 459964 462912 465428 467712 470445 473725 476835 479404 482029 485264 488713 491732 494414 497104 499375
61707D99375Q89q52k075k634k863k912k855k922l222l466l346k949k591k438k497
$$ 499375 500264 499412 497337 494703 491840 488928 486073 483151 479929 476463 473117 470168 467577 465139 462642
61692D62642k678k780k608k238j949j847j804j801k000k408k707k609k158j635
$$ 462642 459964 457184 454576 452338 450389 448542 446738 444937 442937 440529 437822 435213 433055 431420
61678D31420j299j251j379j379r73k03N96J063J039O45K41J30K10R9k54l77j4
$$ 431420 430121 428870 427491 426112 425139 424936 425532 426595 427634 428279 428520 428650 428860 428959 428705 428328 428314
61661D28314L83K67r4lN30P51M29M01J394K775L155K086N53k62j95J93O37J340
$$ 428314 428697 428964 428870 428867 429397 430148 430577 430978 432372 435147 438302 440388 440941 440679 440484 440677 441314 442654
61643D42654K314L118L423L432L445L412L169K778K275J363j71j955l408m406
$$ 442654 444968 448086 451509 454941 458386 461798 464967 467745 470020 471383 471212 469257 465849 461443
61629D61443n172n651n631n300n084m958m582m085l995m306m339l721k777j783
$$ 461443 456271 450620 444989 439689 434605 429647 425065 420980 416985 412679 408340 404619 401842 400059
61615D00059o29N15R80N15k71p69j104j554j928k142k698l982n432o096n721m759
$$ 400059 399430 399945 400925 401440 401169 400400 399296 397742 395814 393672 390974 386992 381560 375464 369743 364984
61599C64984l648k600j832j548j817k687m036n175n220m160k985k434k293k251
$$ 364984 361336 358736 356904 355356 353539 350852 346816 341641 336421 332261 329276 326842 324549 322298
61585C22298k523l092l278k869k764l569m387m179l518l626m242l979k590j282
$$ 322298 319775 316683 313405 310536 307772 304203 299816 295637 292119 288493 284251 280272 277682 276400
61571B76400p54m07J90M83O7m70n04l07l96p22j041j412j736j409j82J086J221
$$ 276400 275646 275239 275429 275912 275979 275509 275005 274698 274302 273580 272539 271127 269391 267982 267800 268886 270107
61554B70107J45j006j131j89R77J550J407J021Q18P94P65P41Q00Q42Q07R43J463
$$ 270107 270252 269246 268115 267926 268903 270453 271860 272881 273699 274493 275258 275999 276799 277641 278448 279391 280854
61537B80854K118K424K208J597P38j00m24o1M44N08L07K81J33p81k185k933k466
$$ 280854 282972 285396 287604 289201 289939 289839 289415 289354 289798 290306 290613 290894 291027 290246 288061 285128 282662
61520B82662j434o77l17j65k91p90j384j656j403o89J94P21N78J49J05M95P56
$$ 282662 281228 280551 280234 280069 279778 278988 277604 275948 274545 273856 274050 274771 275349 275498 275603 276098 276854
61503B76854O16L40L1n63j328j571r92k46p5l50m73l40k75l14j37L33O82N12r8
$$ 276854 277470 277810 277841 277278 275950 274379 273387 273141 273066 272716 272243 271903 271628 271314 271177 271510 272192 272704 272606
61484B72606o55p14k68K53M03J63j04%O66J746K727L010K575K078J935J652O23
$$ 272606 271951 271237 270969 271222 271625 271788 271684 271684 272350 274096 276823 279833 282408 284486 286421 288073 288696
61467B88696o32q55K67J615K020J487P41J77k45n36o47p60j130j657j866j297
$$ 288696 288064 287209 287476 289091 291111 292598 293339 293516 293271 292735 292088 291328 290198 288541 286675 285378
61451B85378M3J515K166J595M56j23K58J066J712K094K187J763R17L55O32J400
$$ 285378 285421 286936 289102 290697 291153 291030 291288 292354 294066 296160 298347 300110 301027 301382 302014 303414
61435C03414J874J878J926K364K868K996K810K697K754K643K160J636J594K057
$$ 303414 305288 307166 309092 311456 314324 317320 320130 322827 325581 328224 330384 332020 333614 335671
61421C35671K528K633K510K443K528K828L489M315M633M037L012K303J892J117
$$ 335671 338199 340832 343342 345785 348313 351141 354630 358945 363578 367615 370627 372930 374822 375939
61407C75939k48j634k458k746k870l045l219l273l178l121l329l632l459k570
$$ 375939 375691 374057 371599 368853 365983 362938 359719 356446 353268 350147 346818 343186 339727 337157
61393C37157j580j329j855k399k263j362j00Q94J128P43M28N34O10K55j11K5L23
$$ 337157 335577 334248 332393 329994 327731 326369 326269 327163 328291 329034 329462 329996 330606 330861 330750 330775 331098
61376C31098K23J15P88J963K519K165J746J734J597R77M08L95O55P93R71J408
$$ 331098 331321 331436 332224 334187 336706 338871 340617 342351 343948 344925 345333 345728 346383 347176 348147 349555
61360C49555J924K357K844L266L179K642K535L450M924O209P197Q149R107J0081
$$ 349555 351479 353836 356680 359946 363125 365767 368302 371752 376676 382885 390082 398231 407338 417419
61346D17419J1265J2449J2745J1552R446P580O490N992N872O098O556O998P180
$$ 417419 428684 441133 453878 465430 474876 482456 488946 494938 500810 506908 513464 520462 527642
61333E27642O810N623L779J865K93j046k322l394m077m452m700m986n523o244
$$ 527642 534452 540075 543854 545719 546012 544966 542644 539250 535173 530721 526021 521035 515512 509268
61319E09268o442n468l859k919k934k856k118j578j911k198j248N06J741K326
$$ 509268 502826 497358 493499 490580 487646 484790 482672 481094 479183 476985 475737 476243 477984 480310
61305D80310L274M859O206O887P577Q655R177P958N093J729j272l946o552q825
$$ 480310 483584 488443 494649 501536 509113 517768 526945 534903 539996 541725 540453 536507 529955 521130
61291E21130j0082r960q878p606o464n287m110l441l485l619l107k070j243r05
$$ 521130 511048 501088 492210 484604 478140 472853 468743 465302 461817 458198 455091 453021 451778 450873
61277D50873o06J16J297K802M513O127P213P712Q031Q374Q304P292N627M293L937
$$ 450873 450267 450383 451680 454482 458995 465122 472335 480047 488078 496452 504756 512048 517675 521968 525905
61262E25905M219M479M810N974Q286J1042J3251J4483J4717J3904J2238J0477
$$ 525905 530124 534603 539413 545387 553673 564715 577966 592449 607166 621070 633308 643785
61250F43785R295Q469P379O029M890L847K233m9k329m221n988p653q646q753q522
$$ 643785 653080 661549 668928 674957 679847 683694 685927 685878 683549 679328 673340 665687 657041 648288 639766
61235F39766q261p491o047m912n094o156o723o129m821l454k281j376p56k76J07
$$ 639766 631505 624014 617967 613055 607961 601805 595082 588953 584132 580678 578397 577021 576265 575989 576096
61220E76096J4j005k786m473n233m889l927k921j926m83J465K931K660O14j918
$$ 576096 576110 575105 572319 567846 562613 557724 553797 550876 548950 548467 549932 552863 555523 556137 554219
61205E54219l756m718m993m465l087j337K25J513K725M064N809Q134J0668J2939
$$ 554219 550463 545745 540752 536287 533200 531863 532088 533601 536326 540390 546199 554333 565001 577940
61191E77940J5336J8684K2446K4423K3006J9002J4505J0795Q078O523O247O702
$$ 577940 593276 611960 634406 658829 681835 700837 715342 726137 734215 740738 746985 753687
61179G53687P107P371P773P971P226N544L775K577J854J215M16o23j800k856l699
$$ 753687 760794 768165 775938 783909 791135 796679 800454 803031 804885 806100 806516 805893 804093 801237 797538
61164G97538m588n716o906p980r090j0390j1747j3028j4197j4891j4556j3396
$$ 797538 792950 787234 780328 772348 763258 752868 741121 728093 713896 699005 684449 671053
61152F71053j2407j1946j1034q760n644k783l95J811L375L284J268j988n660r025
$$ 671053 658646 646700 635666 626906 621262 618479 618084 619895 623270 626554 627822 625834 620174 611149
61138F11149j1271j2011j1794j1402j0798r435p297m959k858j240m05j98L32J884
$$ 611149 599878 587867 576073 564671 553873 544438 537141 532182 529324 528084 527679 527481 527813 529697
61124E29697L850N165N839O722Q111R610J1160J3051J5044J6565J7778J9432K1556
$$ 529697 533547 538712 544551 551273 559384 568994 580154 593205 608249 624814 642592 662024 683580
61111F83580K3274K4116K4590K5274K6080K6658K6849K6524K5568K4173K2670
$$ 683580 706854 730970 755560 780834 806914 833572 860421 886945 912513 936686 959356
61100I59356K0997J8759J5754J2039P627K645k372o794j0421j3255j5180j6312
$$ 959356 980353 999112 1014866 1026905 1034532 1037177 1034805 1028011 1017590 1004335 989155 972843
61088I72843j7329j8787k0395k1542k2130k2382k2342k2132k2139k2251k1600
$$ 972843 955514 936727 916332 894790 872660 850278 827936 805804 783665 761414 739814
61077G39814j9858j8032j7040j6343j5066j3619j2806j2124j0535q459p195o726
$$ 739814 719956 701924 684884 668541 653475 639856 627050 614926 604391 595932 588737 582011
61065E82011n791m080k599j833j112m4R86J923L205M648N542O047P068Q541R317
$$ 582011 576220 572140 569541 567708 566596 566552 567538 569461 572666 577314 582856 588903 595971 604512 613829
61050F13829R057Q798R291J0193J1220J2747J4794J6712J8366K0295K2414K3859
$$ 613829 622886 631684 640975 651168 662388 675135 689929 706641 725007 745302 767716 791575
61038G91575K4570K5655K7715L0065L2087L4062L6219L8253M0259M2842M5848
$$ 791575 816145 841800 869515 899580 931667 965729 1001948 1040201 1080460 1123302 1169150
61027A169150M8156M9096M8892M7678M5591M3986M4743M8031N2543N8132O6073
$$ 1169150 1217306 1266402 1315294 1362972 1408563 1452549 1497292 1545323 1597866 1655998 1722071
61016A722071P6184Q6012R3739J00032J06569J15268J29533J53244J87294K29956
$$ 1722071 1798255 1884267 1978006 2078038 2184607 2299875 2429408 2582652 2769946 2999902
61006B999902K81634L45909M25246N21180O41037P98660J005719J270316J605197
$$ 2999902 3281536 3627445 4052691 4573871 5214908 6013568 7019287 8289603 9894800
60997I894800K011533K420579K655504K505153J893445R88108J16146m49096o24920
$$ 9894800 11906333 14326912 16982416 19487569 21381014 22369122 22485268 22036172 21411252
60988B1411252m75647r8467L99008Q36029R64778O15853j48743j052061j787272
$$ 21411252 20935605 20837138 21236146 22072175 23036953 23652806 23504063 22452002 20664730
60979B0664730k195859k296727k194601j988443j742882j496726j270148j068203
$$ 20664730 18468871 16172144 13977543 11989100 10246218 8749492 7479344 6411141
60971F411141q89701p35125o05368m97651m07260l31949k71828k26121j92169
$$ 6411141 5521440 4786315 4180947 3683296 3276036 2944087 2672259 2446138 2253969
60962B253969j66752j46836j29806j14434j01030q9887q0067p0343o0463n0863
$$ 2253969 2087217 1940381 1810575 1696141 1595111 1505224 1425157 1354814 1294351 1243488
60952A243488m1850l3717k7123k2793k1039k1509k2920k3410k2025j9679j7706
$$ 1243488 1201638 1167921 1140798 1118005 1096966 1075457 1052537 1029127 1007102 987423 969717
60941I69717j5966j3599j1236j0606j1895j3296j3619j3653j4251j4784j4472
$$ 969717 953751 940152 928916 918310 906415 893119 879500 865847 851596 836812 822340
60930H22340j3918j4099j4780j5064j4737j4178j3498j2585j1540j0419r112p886
$$ 822340 808422 794323 779543 764479 749742 735564 722066 709481 697941 687522 678410 670524
60918F70524p378p535p381o405n322m797m300l104j579m85M30J929L821N159N828
$$ 670524 663146 655611 648230 641825 636503 631706 627406 624302 622723 622238 622668 624597 628418 633577 639405
60903F39405O830Q810J1105J2592J3020J3233J4339J6655J9274K0807K0826K0389
$$ 639405 646235 655045 666150 678742 691762 704995 719334 735989 755263 776070 796896 817285
60891H17285K0859K2393K3985K4838K5172K5627K6369K7046K7407K7664K8138
$$ 817285 838144 860537 884522 909360 934532 960159 986528 1013574 1040981 1068645 1096783
60880A096783K8596K8254K6586K3991K1314J8775J5754J1699O806J668l428q502
$$ 1096783 1125379 1153633 1180219 1204210 1225524 1244299 1260053 1271752 1278558 1280226 1276798 1268296
60868A268296j3475j8057k1945k4972k7069k8236k8478k7858k6649k5442k4806
$$ 1268296 1254821 1236764 1214819 1189847 1162778 1134542 1106064 1078206 1051557 1026115 1001309
60857A001309k4833k5152k5453k5754k6094k6122k5186k2943j9965j7584j6809
$$ 1001309 976476 951324 925871 900117 874023 847901 822715 799772 779807 762223 745414
60846G45414j7278j7639j7143j6386j6196j6360j6094j5328j4728j4595j4550
$$ 745414 728136 710497 693354 676968 660772 644412 628318 612990 598262 583667 569117
60835E69117j4291j3959j3661j3258j2706j2049j1015r261p160n676n232n270
$$ 569117 554826 540867 527206 513948 501242 489193 478178 468917 461757 456081 450849 445579
60823D45579n133m783m333l558k421j550j635k415k868k320j096qN41Q38J338
$$ 445579 440446 435663 431330 427772 425351 423801 422166 419751 416883 414563 413467 413459 414000 414838 416176
60808D16176K009K423K471K639L267L914L929L377K916K832K810K577K236J882
$$ 416176 418185 420608 423079 425718 428985 432899 436828 440205 443121 445953 448763 451340 453576 455458
60794D55458J415Q42L23p9l81m92m45o39j286j866j819j619k229l514m265l994
$$ 455458 456873 457715 458038 457959 457578 457086 456641 456002 454716 452850 451031 449412 447183 443669 439404 435410
60778D35410l632l986m526m485m193m465n153n366m825m119l660l159k281j247
$$ 435410 431778 427792 423266 418781 414588 410123 404970 399604 394779 390660 387000 383841 381560 380313
60764C80313n24k66k56k61l13o53j371k145k519k417k162j973j753j425j119q69
$$ 380313 379789 379523 379267 379006 378693 378040 376669 374524 372005 369588 367426 365453 363700 362275 361156 360287
60748C60287m26L86J433K526L647M766N649O051N881N115L808K289R89J6q27j512
$$ 360287 359861 360247 361680 364206 367853 372619 378268 384319 390200 395315 399123 401412 402401 402417 401590 400078
60732D00078j680j286r47j321k397l593m401m684m580m299l999l763l702l965
$$ 400078 398398 397112 396165 394844 392447 388854 384453 379769 375189 370890 366891 363128 359426 355461
60718C55461m419m564m107l513l474l995m462m530m314l809k887j943j698k103
$$ 355461 351042 346478 342371 338858 335384 331389 326927 322397 318083 314274 311387 309444 307746 305643
60704C05643k212j506o08k92m83p69j157j725k031j615p15N8M73O23N59M63P09
$$ 305643 303431 301925 301317 301025 300542 299773 298616 296891 294860 293245 292530 292588 293061 293684 294243 294706 295415
60687B95415J197J154K71m11L26K130L430L439K891K742L022L266L343L396L413
$$ 295415 296612 297766 298037 297626 297952 300082 303512 306951 309842 312584 315606 318872 322215 325611 329024
60672C29024L272L034K931L132L603M061M141L777L335L163L136K868K254J532
$$ 329024 332296 335330 338261 341393 344996 349057 353198 356975 360310 363473 366609 369477 371731 373263
60658C73263R66P94J232K093K616K209J218M74J68j24m18j47P72J469J144K1j198
$$ 373263 374229 375023 376255 378348 380964 383173 384391 384865 385033 384909 384491 384344 385116 386585 387729 387750 386552
60641C86552k250l181l792l947m145n000o189o636n925m867m406m431m123l039
$$ 386552 384302 381121 377329 373382 369237 364237 358048 351412 345487 340620 336214 331783 327660 324621
60627C24621j510j92L74n7j238k412k884k620k054j448q05k73p8m5K86Q51R85
$$ 324621 323111 322919 323293 323236 321998 319586 316702 314082 312028 310580 309775 309502 309424 309379 309665 310516 311501
60610C11501L78l39m18P3N99R97J395J576J185M89J94N15R43J088J138J350J554
$$ 311501 311879 311540 311122 311195 311794 312791 314186 315762 316947 317436 317630 318145 319088 320176 321314 322664 324218
60593C24218J427R81N03K79L94O32N45l5o53p25l33o2r4p2J55K91K95O20J434
$$ 324218 325645 326626 327129 327408 327802 328434 328979 328944 328291 327566 327233 327171 327077 327005 327160 327451 327746 328366 329800
60574C29800K236K600K850L466M310N022N778P005Q627J0127J1272J2119J2401
$$ 329800 332036 334636 337486 340952 345262 350284 356062 363067 371694 381821 393093 405212 417613
60561D17613J1614R786P646N716L663Q82k521n619p422p537o242m280k556j658
$$ 417613 429227 439013 446659 452375 456038 456920 454399 448780 441358 433821 427579 423299 420743 419085
60547D19085j331n93J273L862O028P187P883Q946J0479J1997J3161J3943J4214
$$ 419085 417754 417161 418434 422296 428324 435511 443394 452340 462819 474816 487977 501920 516134
60534E16134J3700J2262R910O622K581j496m722o744p692p568o324m487l126k907
$$ 516134 529834 542096 552006 558628 561209 559713 554991 548247 540555 532987 526663 522176 519050 516143
60520E16143l541m327m712m363l199j694n93j30J49N43P70O32O19J338K693M112
$$ 516143 512602 508275 503563 499200 496001 494307 493714 493584 493733 494276 495046 495678 496297 497635 500328 504440
60504E04440N341O642Q357J0668J3711J7577K2121K6960L1667L6085M0499M5388
$$ 504440 509781 516423 524780 535448 549159 566736 588857 615817 647484 683569 724068 769456
60492G69456N0557N4591N5591N2602M5952L6249K3724Q816p191k2618l6098m6604
$$ 769456 820013 874604 930195 982797 1028749 1064998 1088722 1097538 1090347 1067729 1031631 985027
60480I85027n3288n5889n5075n1981m7556m2596l7929l4059l0715k7225k3357
$$ 985027 931739 875850 820775 768794 721238 678642 640713 606654 575939 548714 525357
60469E25357j9514j6244j3783j2035j0722r579q468p378o304n363m886n059n448
$$ 525357 505843 489599 475816 463781 453059 443480 435012 427634 421330 415967 411081 406022 400574
60456D00574n315m523l645l079k627k178k176k879l609l446k430j544j534k161
$$ 400574 395259 390736 387091 384012 381385 379207 377031 374152 370543 367097 364667 363123 361589 359428
60442C59428k628k313j170K85J273J302N82k27o44p58j002j631k432k940k934
$$ 359428 356800 354487 353317 353602 354875 356177 356759 356532 355888 355130 354128 352497 350065 347125 344191
60427C44191k541j882r41Q1O74O33M07L99L93J92K96J101J874J607O80M34J056
$$ 344191 341650 339768 338827 338908 339582 340215 340622 341021 341414 341606 341902 343003 344877 346484 347164 347598 348654
60410C48654J261L51p21q71k89L97J247K358L014K479J176K28K13R09J800K324
$$ 348654 349915 350266 349545 348674 348385 348782 350029 352387 355401 357880 359056 359284 359497 360406 362206 364530
60394C64530K129J622J620K106K188J653J518K261K744J962Q00P21J530J934J736
$$ 364530 366659 368281 369901 372007 374195 375848 377366 379627 382371 384333 385133 385854 387384 389318 391054
60379C91054J848K477K842K661K534K687K649K249J868J557J023N84J000K123
$$ 391054 392902 395379 398221 400882 403416 406103 408752 411001 412869 414426 415449 416033 417033 419156
60365D19156K789K408J640J236J107J007J175J808K559L040L310L573L877M398
$$ 419156 421945 424353 425993 427229 428336 429343 430518 432326 434885 437925 441235 444808 448685 453083
60351D53083N451P008Q715J0481J2425J4118J4601J3491J1485R305O734L186j158
$$ 453083 458534 465542 474257 484738 497163 511281 525882 539373 550858 560163 566897 570083 568925
60338E68925n222p956r156r442r507r373q575p171o122o104o411n771m171k943
$$ 568925 563703 555747 546591 537149 527642 518269 509694 502523 496401 490297 483886 478115 473944 471001
60324D71001l057m058m839m756l847k567j595j284j177n38N73J385J570J648K108
$$ 471001 467944 463886 459047 454291 450444 447877 446282 444998 443821 443283 443856 445241 446811 448459 450567
60309D50567K906M091O091Q990J2154J5160J8620K3403K9121L3738L4876L1638
$$ 450567 453473 457564 463655 472645 484799 499959 518579 541982 571103 604841 639717 671355
60297F71355K5343J8215J1077K724p840j8975k7215l0513k9825k7439k4728k1890
$$ 671355 696698 714913 725990 728714 720874 701899 674684 644171 614346 586907 562179 540289
60285E40289j8817j5477j1982q757o363m877l812k861k193j892j772j896k570
$$ 540289 521472 505995 494013 485256 478893 474016 470204 467343 465150 463258 461486 459590 457020
60272D57020l556m037l771l502l806m230m100l513k984k645k468k631l054l083
$$ 457020 453464 449427 445656 442154 438348 434118 430018 426505 423521 420876 418408 415777 412723 409640
60258D09640k368j545j303j232n21N39Q17M9p31o99l40n17j120j272o05K63N69
$$ 409640 407272 405727 404424 403192 402671 403210 404027 404076 403345 402646 402306 401789 400669 399397 398792 399055 399624
60241C99624K68r0j61n6J23N94J440K172K192J597J077J020J219J495K065K980
$$ 399624 399892 399802 399641 399585 399708 400302 401742 403914 406106 407703 408780 409800 411019 412514 414579 417559
60225D17559L663L443K389J317J024J628K548L014K734K131J870K191K837L455
$$ 417559 421222 424665 427054 428371 429395 431023 433571 436585 439319 441450 443320 445511 448348 451803
60211D51803L873M069M199M499M934N143N082N342O252P049O757N707N177N499
$$ 451803 455676 459745 463944 468443 473377 478520 483602 488944 495196 502245 509002 514709 519886 525385
60197E25385N593M701L570L317L884M321M101L460K764K082J275K79o47r19l19
$$ 525385 530978 535679 539249 542566 546450 550771 554872 558332 561096 563178 564453 564732 564085 563166 562847
60182E62847L13k97k320m511n673n811n555n150m584m024l627l302l088l298l845
$$ 562847 563160 562863 560543 556032 550359 544548 538993 533843 529259 525235 521608 518306 515218 511920 508075
60167E08075m001l362k494k112k094j876j374q36k39N22J173J383J296J194J032
$$ 508075 504074 500712 498218 496106 494012 492136 490762 489926 489687 490209 491382 492765 494061 495255 496287
60152D96287P91Q58J394J777J416P57P17J373K049K449K863L411L856M188M637
$$ 496287 497078 497936 499330 501107 502523 503280 503997 505370 507419 509868 512731 516142 519998 524186 528823
60137E28823N205N808O769Q353R963J0641J0411J0118R904Q876O576L829J573
$$ 528823 534028 539836 546605 554958 564921 575562 585973 596091 605995 614871 621447 625276 626849
60124F26849k68k127l702m326m000l323k649j933j207o19j04N02J029J147R27
$$ 626849 626581 624454 620752 616426 612426 609103 606454 604521 603314 602695 602591 603093 604122 605269 606196
60109F06196Q06Q81O84j85j458k428k669k391k187k435k947l205l002k729k776
$$ 606196 607002 607883 608567 608382 606924 604496 601827 599436 597249 594814 591867 588662 585660 582931 580155
60094E80155k844k196o50J094K317L095L893M711N138N173N279N563N528M974
$$ 580155 577311 575115 574465 575559 577876 580971 584864 589575 594713 599886 605165 610728 616256 621230
60080F21230M602N077N847N658M209K587J794J402J65k363n318p589q936r869
$$ 621230 625832 630909 636756 642414 646623 649210 651004 652406 652571 650208 644890 637301 628365 618496
60066F18496j0781j1556j1938j1904j1508j0681r523q559q279q454q387p821p236
$$ 618496 607715 596159 584221 572317 560809 550128 540605 532046 523767 515313 506926 499105 491869
60053D91869p025o950o554n666m283k437n71N80Q95J199K168L439M292M742N218
$$ 491869 484844 477894 471340 465674 461391 458954 458383 458963 459858 461057 463225 466664 470956 475698 480916
60038D80916N711O019O435P231P802P294N965M798M003K945J579O65L28m33k273
$$ 480916 486627 492646 499081 506312 514114 521408 527373 532171 536174 539119 540698 541363 541691 541258 538985
60023E38985m533o267p391q271q945r231r105q470p194n692m779m549m152l093
$$ 538985 534452 528185 520794 512523 503578 494347 485242 476772 469578 463886 459107 454558 450406 447313
60009D47313k022j723k020k294k388k412k199j663j240j294j573j710j819k010
$$ 447313 445291 443568 441548 439254 436866 434454 432255 430592 429352 428058 426485 424775 422956 420946
59995D20946j868j074j01L78M00M61P11J058J680K751L874M421M336M066L892
$$ 420946 419078 418004 417903 418281 418681 419142 419853 420911 422591 425342 429216 433637 437973 442039 445931
59980D45931L714L282K337Q27p26j491j390j342k001k821k937k464k170k267k340
$$ 445931 449645 452927 455264 456091 455365 453874 452484 451142 449141 446320 443383 440919 438749 436482 434142
59965D34142k158j774j031K67J765K781L155L284L447L564L571L490L184K421
$$ 434142 431984 430210 429179 429446 431211 433992 437147 440431 443878 447442 451013 454503 457687 460108
59951D60108J233n6j045j363q97j15K15m0j76K34O39L73k70n72n64q86j746k653
$$ 460108 461341 461285 460240 458877 457980 457865 458080 458040 457864 458098 458737 459110 458840 458268 457704 456818 455072 452419
59933D52419l093k924k263j482j023q12k15R59J933K045J859K336L289L660L069
$$ 452419 449326 446402 444139 442657 441634 440822 440607 441566 443499 445544 447403 449739 453028 456688 459757
59918D59757K243J901K098K680L562M487N179N890P088Q454Q891P746N544L319
$$ 459757 462000 463901 465999 468679 472241 476728 481907 487797 494885 503339 512230 519976 525520 528839
59904E28839J613L89m55q45q01o74r87j823k570k618k162j805j441l65J362K666
$$ 528839 530452 530841 530386 529541 528740 528066 527079 525256 522686 520068 517906 516101 514660 514295 515657 518323
59888E18323K969L018L565M175M200M005M253M625M436M003M241N236O262O943
$$ 518323 521292 524310 527875 532050 536250 540255 544508 549133 553569 557572 561813 567049 573311 580254
59874E80254P293O992N670L726J878N9k185m479n897o340o461o396n700m546l782
$$ 580254 587547 594539 600209 603935 605813 605872 603687 599208 593311 586971 580510 574114 568414 563868 560086
59859E60086l668l625l375l256l301l006k230j350l34J388L951O817R567J1984
$$ 560086 556418 552793 549418 546162 542861 539855 537625 536275 535941 537329 541280 548097 557664 569648
59845E69648J3241J2154Q661M167J85k565l650k671j3K940M795M827K797r05m775
$$ 569648 582889 595043 603704 607871 608056 605491 601841 599170 599157 602097 606892 611719 614516 613611 608836
59830F08836p031p337o877o465n696m286l060k819l180l328l271l644m705o064
$$ 608836 601805 594468 587591 581126 575430 571144 568084 565265 562085 558757 555486 551842 547137 541073
59816E41073p015o875n491l723k725k574k264j305m67n57j301j996k498l044l627
$$ 541073 534058 527183 521692 517969 515244 512670 510406 509101 508634 508077 506776 504780 502282 499238 495611
59801D95611m064m265m087l505l061l455m453m952m408l365k377j333k58K85J26
$$ 495611 491547 487282 483195 479690 476629 473174 468721 463769 459361 455996 453619 452286 452028 452313 452439
59786D52439l9K66N99N44M93P93R97P41N95J177K027K253J714Q88N9n72n47L19
$$ 452439 452400 452666 453265 453809 454302 455095 456092 456833 457428 458605 460632 462885 464599 465487 465546 464974 464427 464746
59768D64746J397J907J784J415J026Q36J139J686J645Q28K33O53J471J757J754
$$ 464746 466143 468050 469834 471249 472275 473111 474250 475936 477581 478409 478642 479295 480766 482523 484277
59753D84277K249L104L609L887M675N920O741O762O490O345O249O168O203O109
$$ 484277 486526 489630 493239 497126 501801 507721 514462 521224 527714 534059 540308 546476 552679 558788
59739E58788N477M481L694L215K632J833J093L61p04j882k370j852r37l11j0K57
$$ 558788 564265 568746 572440 575655 578287 580120 581213 581574 580870 578988 576618 574766 573829 573518 573508 573765
59723E73765N78Q49R22N90j71q89j006o58n64r81j305r76l09l6l25o34m37K15
$$ 573765 574343 575192 576114 576704 576533 575644 574638 573980 573416 572435 571130 570154 569845 569809 569484 568850 568413 568628
59705E68628Q43J116J163J327J645J697J144K94j06L51J374K366L033L496L877
$$ 568628 569471 570587 571750 573077 574722 576419 577563 577857 577751 578102 579476 581842 584875 588371 592248
59690E92248L986L480K261N72j261k898l781l328j738k34J06l90n14K07J027J121
$$ 592248 596234 599714 601975 602547 601286 598388 594607 591279 589541 589307 589413 589023 588509 588716 589743 590864
59674E90864L80j020l010n189o678o909o243n426m896m750m935n093m740l889
$$ 590864 591244 590224 587214 582025 575347 568438 562195 556769 551873 547123 542188 537095 532355 528466
59660E28466l076k613k382k444l005l553k970j126O08J139J148J891L247M083
$$ 528466 525390 522777 520395 517951 514946 511393 508423 507297 507905 509044 510192 512083 515330 519413
59646E19413M017L619L166K277Q70n88j828l033m188m901m977m581l794k567j150
$$ 519413 523430 527049 530215 532492 533362 532774 530946 527913 523725 518824 513847 509266 505472 502905 501755
59631E01755J5Q73J648K196K027J098m2r97j809k437k545k152j889k319l204l879
$$ 501755 501770 502643 504291 506487 508514 509612 509570 508573 506764 504327 501782 499630 497741 495422 492218 488339
59615D88339m040l877l634l360l068k769k326j458j08J290K153K412K620L144
$$ 488339 484299 480422 476788 473428 470360 467591 465265 463807 463699 464989 467142 469554 472174 475318
59601D75318L511K969J591L30q1J41L36K13k1QN06J257J621J205N27N18J280J946
$$ 475318 478829 481798 483389 483719 483638 483779 484115 484328 484307 484315 484821 486078 487699 488904 489431 489949 491229 493175
59583D93175J845J172K74r19k357l491l956m079m220m211l969l931m296m455l945
$$ 493175 495020 496192 496466 495547 493190 489699 485743 481664 477444 473233 469264 465333 461037 456582 452637
59568D52637l346l364l524k821j385m16n57j223j625j563j094j77J003J927K268
$$ 452637 449291 445927 442403 439582 438197 437781 437224 436001 434376 432813 431719 431542 432545 434472 436740
59553D36740K255K337K715L238L588L571L348L316L663M211M782N383N962O402
$$ 436740 438995 441332 444047 447285 450873 454444 457792 461108 464771 468982 473764 479147 485109 491511
59539D91511O976Q322J0856J4583J9456K4786K8081K5877J7134N136m996j0448
$$ 491511 498487 506809 517665 532248 551704 576490 604571 630448 647582 652718 647722 637274
59527F37274j1730j0499p946m967k294QK310M399N548N629N327N062M463L118
$$ 637274 625544 615045 607099 602132 599838 599846 602156 606555 612103 617732 623059 628121 632584 635702
59513F35702J139j242l967o741q966j0332j1094j1517j1567j1262j0905j0671
$$ 635702 636841 635599 631632 624891 615925 605593 594499 582982 571415 560153 549248 538577
59501E38577j0296r386p853o067m645l955l647k943j671o04l54m47j21M09L72
$$ 538577 528281 518895 511042 504975 500330 496375 492728 489785 488114 487510 487156 486709 486588 486997 487369
59486D87369j65l09K91J045J454J744K189K642L020L691M966O663Q375R791J0600
$$ 487369 487204 486895 487186 488231 489685 491429 493618 496260 499280 502971 507937 514600 522975 532766 543366
59471E43366J0499R466P759N589L122P37j135k380l062l036k224j115l40K45J422
$$ 543366 553865 563331 571090 576679 579801 580538 579403 577023 573961 570925 568701 567586 567246 567491 568913
59456E68913L447N646P330Q567R825J1289J2794J4088J4951J5331J5468J5691
$$ 568913 572360 578006 585336 593903 603728 615017 627811 641899 656850 672181 687649 703340
59444G03340J5895J5368J3078Q255J064o956j3524j7170j8147j7590j6207j4207
$$ 703340 719235 734603 747681 755936 757000 750044 736520 719350 701203 683613 667406 653199
59432F53199j2039j0468r961j0397j1225j1633j0919r138o998m837k262P42L279
$$ 653199 641160 630692 620731 610334 599109 587476 576557 567419 560421 555584 553322 554064 557343
59419E57343M911O722R846J3656J6688J8801K1016K3805K7170L1780L7617M1276
$$ 557343 562254 568976 578822 592478 609166 627967 648983 672788 699958 731738 769355 810631
59407H10631L7249K3491M359j2997k4112k8545k7819k3810j8020j0562l51J1920
$$ 810631 847880 871371 875730 862733 838621 810076 782257 758447 740427 729865 729514 741434
59395G41434K1328K1374J0034p655k3583l2607l4719l2738k9191k5285k1516j8241
$$ 741434 762762 784136 794170 786515 762932 730325 695606 662868 633677 608392 586876 568635
59383E68635j5547j3095j0481p736n283l425k119j195n95l16k50j23L74J214J786
$$ 568635 553088 539993 529512 521776 516493 513068 510949 509754 509159 508843 508593 508470 508844 510058 511844
59368E11844J444N07K34J379L148M173M116L694L421L197L072L503M622N909O882
$$ 511844 513288 513795 514029 515408 518556 522729 526845 530539 533960 537157 540229 543732 548354 554263 561145
59353E61145P645Q573R878J1652J3870J6183J8000J8988J9291J9343J9578K0177
$$ 561145 568790 577363 587241 598893 612763 628946 646946 665934 685225 704568 724146 744323
59341G44323K0827K0967K0511J9881J9045J7093J3434Q859M610Q82k857o542r597
$$ 744323 765150 786117 806628 826509 845554 862647 876081 884940 889550 890432 887575 881033 871436
59328H71436j2099j4617j6992j8460j8999j9322j9444j8577j6736j5165j4580
$$ 871436 859337 844720 827728 809268 790269 770947 751503 732926 716190 701025 686445
59317F86445j4215j3238j2072j1499j1222j0256q257n741l359j476j69Q63K127
$$ 686445 672230 658992 646920 635421 624199 613943 605686 599945 596586 595110 594941 595804 597931
59304E97931L802N680P795J0621J4432J8753K2445K3900K1394J4340M408n263
$$ 597931 601733 607413 615208 625829 640261 659014 681459 705359 726753 741093 745501 740238
59292G40238j2337j6263j7319j5974j3411j1339j0392r506p650n363l798l005
$$ 740238 727901 711638 694319 678345 664934 653595 643203 633697 626047 620684 616886 613881
59280F13881k127q32L85J164J753K536L602M745N577N860N949O629Q228J0131
$$ 613881 611754 610922 611307 612471 614224 616760 620362 625107 630684 636544 642493 649122 657350 667481
59266F67481J1441J1840J1556J0777R466P523M918J828j351m361p325j0297j2683
$$ 667481 678922 690762 702318 713095 722561 730084 735002 736830 735479 731118 723793 713496 700813
59253G00813j3724j3489j2811j2177j1404j0353r269q185o784n078l514k240r53
$$ 700813 687089 673600 660789 648612 637208 626855 617586 609401 602617 597539 594025 591785 590832
59240E90832L22J163J697K721M405N731N782M973M355M240M122L571K649J676
$$ 590832 591154 592317 594014 596735 601140 606871 612653 617626 621981 626221 630343 633914 636563 638239
59226F38239Q83J44j075l076n262o639p001p019p091o950o519o232o162n658m313
$$ 638239 639122 639266 638191 635115 629853 623214 616213 609194 602103 595153 588634 582402 576240 570582 566269
59211E66269k596j128n8N00J51j084k416l124l267l229l077k735k232j535o42
$$ 566269 563673 562545 562487 562987 563138 562054 559638 556514 553247 550018 546941 544206 541974 540439 539797
59196E39797Qo4m63j88R54K130K849L555M544N355N651N753N752N134L910L085
$$ 539797 539805 539741 539278 539090 540044 542174 545023 548578 553122 558477 564128 569881 575633 580767 584677 587762
59180E87762L283L809L764L285K910K570K036J540J228O86j32k80R86L007M542
$$ 587762 591045 594854 598618 601903 604813 607383 609419 610959 612187 612873 612741 612461 613447 616454 620996
59165F20996N311N925O810P914R000R608R196P894O565N590M267K016o03k740
$$ 620996 626307 632232 639042 646956 655956 665564 674760 682654 689219 694809 699076 701092 700489 697749
59151F97749m442o158p707q612q919q938q603p750o629n544m502l614l262l409
$$ 697749 693307 687149 679442 670830 661911 652973 644370 636620 629991 624447 619945 616331 613069 609660
59137F09660l481l331l434l732l367k226j509j884k252j422j4N97L79K92N69P09
$$ 609660 606179 602848 599414 595682 592315 590089 588580 586696 584444 583022 583008 583605 583984 584276 584845 585554
59121E85554P57J325K491L746M779N593O182O838Q153J0018J1290J1264J0676
$$ 585554 586311 587636 590127 593873 598652 604245 610427 617265 625418 635436 646726 657990 668666
59108F68666J0446J0316R789R415R809J0258R809R001R019R636R655Q863P958
$$ 668666 679112 689428 699217 708632 718441 728699 738508 747509 756528 766164 775819 784682 792640
59095G92640O768M411J136j572k950l612m029l729k441r19j50m96j774l516n065
$$ 792640 799408 803819 804955 803383 800433 796821 792792 789063 786622 785703 785553 785057 783283 779767 774702
59080G74702o148p298r084j1118j2557j3259j3606j3569j2929j2133j1782j1435
$$ 774702 768554 761256 752172 741054 728497 715238 701632 688063 675134 663001 651219 639784
59068F39784j0069p725n635m656m521m630m689m520m058l666l649l654l192k552
$$ 639784 629715 621990 616355 611699 607178 602548 597859 593339 589281 585615 581966 578312 575120 572568
59054E72568k312k301j968j576j886k811l418l237k670k118j702j773k605l560
$$ 572568 570256 567955 565987 564411 562525 559714 556296 553059 550389 548271 546569 544796 542191 538631
59040E38631l511k290q40J16P81J506K207K745L246L793M309M764N227N793O757
$$ 538631 535120 532830 531990 532106 532887 534393 536600 539345 542591 546384 550693 555457 560684 566477 573234
59025E73234Q473J0643J2373J3394J4627J6827J9386K1304K2550K3473K3587K2146
$$ 573234 581707 592350 604723 618117 632744 649571 668957 690261 712811 736284 759871 782017
59013G82017J9301J5589J0896N236j11l813o273q723j0868j1199r481p146n128
$$ 782017 801318 816907 827803 833039 832928 829115 822842 814119 803251 792052 782571 775425 770297
59000G70297k939k23K354M165N320N900N670M824L949K927J029j642l825m659
$$ 770297 767358 767135 769489 773654 778974 784874 790544 795368 799317 802244 803273 801631 797806 793147
58986G93147m637m791n697p487r929j2226j3568j3957j3894j3307j1701r216o642
$$ 793147 788510 783719 778022 770535 760606 748380 734812 720855 706961 693654 681953 672737 666095
58973F66095m473k686j326k84J138L365N529O450O413O684P559Q214Q405Q719
$$ 666095 661622 658936 657610 657326 658464 661829 667358 673808 680221 686905 694464 702678 711083 719802
58959G19802R109Q720P354N728M025J638j355l902n666p606j0350j3060j4605
$$ 719802 728911 737631 744985 750713 754738 756376 755021 751119 745453 737847 727497 714437 699832
58946F99832j4885j4431j3555j2408j1159r783q181o629n463m429l141k026j818
$$ 699832 684947 670516 656961 644553 633394 623611 615430 608801 603338 598909 595768 593742 591924
58933E91924k247k332j854j464j438j506j748k454l111k886k106j925k507k889
$$ 591924 589677 587345 585491 584027 582589 581083 579335 576881 573770 570884 568778 566853 564346 561457
58919E61457k717k695l130l449l364l176k720j417M19J668K097K595L515M177
$$ 561457 558740 556045 552915 549466 546102 542926 540206 538789 539208 540876 542973 545568 549083 553260
58905E53260M344M721N625O515P247Q487J0441J2352J3624J4217J3812J1981R488
$$ 553260 557604 562325 567950 574465 581712 590199 600640 612992 626616 640833 654645 666626 676114
58892F76114P948P815Q104Q370R491J1997J5221J8512K1851K4692K5747K4646
$$ 676114 684062 691877 699981 708351 717842 729839 745060 763572 785423 810115 835862 860508
58880H60508K2438J9935J6814J2991R316O270L210m24m344q336j2600j6577j8865
$$ 860508 882946 902881 919695 932686 942002 948272 951482 951058 946714 938378 925778 909201 890336
58867H90336j8903j7581j5687j3122j0139p857o874o666o899p961r654j0895j1345
$$ 890336 871433 853852 838165 825043 814904 807047 800173 793507 786608 778647 768993 758098 746753
58854G46753j1977j3358j4796j5704j6302j6340j4808j1754q834p214o240m981
$$ 746753 734776 721418 706622 690918 674616 658276 643468 631714 622880 615666 609426 604445
58842F04445l644k776k458k960m643o636p251o418n909o481o689n544m248m084
$$ 604445 600801 598025 595567 592607 587964 581328 574077 567659 561750 555269 548580 543036 538788 534704
58828E34704m431m257l906l954l924l490l481m235m476l253j632r40p24M6J030
$$ 534704 530273 526016 522110 518156 514232 510742 507261 503026 498550 495297 493665 492725 492001 492047 493077
58813D93077J356J249J409J690J686J580J432P61j43M6J548K623K099J067Q21
$$ 493077 494433 495682 497091 498781 500467 502047 503479 504240 504097 504143 505691 508314 510413 511480 512301
58798E12301Q65N37P45K149L297K624J010K50K05l17j043q17K22J117J956L280
$$ 512301 513166 513703 514448 516597 519894 522518 523528 523778 523983 523666 522623 521806 522028 523145 525101 528381
58782E28381M462M707M860O133P737P958P022O761P726Q607Q291O638L519r40
$$ 528381 532843 537550 542410 548543 556280 564238 571260 578021 585747 594354 602645 609283 612802 611862
58768F11862n248p537p744p337p065o482n579n124n304n398m967m175k947r99
$$ 611862 606614 599077 591333 583996 576931 570449 564870 559746 554442 549044 544077 539902 536955 535956
58754E35956J190K557K759K552K890M130N787O632N635L393J888K192L352M147
$$ 535956 537146 539703 542462 545014 547904 552034 557821 564453 570088 573481 575369 577561 580913 585060
58740E85060M751N699O594P063P750R000R730R177Q565R393J1035J1911J2106
$$ 585060 589811 595510 602104 609167 616917 625917 635647 644824 653389 662782 673817 685728 697834
58727F97834J2885J4213J4800J4197J3023J1378Q893O164M564M481N060N681O479
$$ 697834 710719 724932 739732 753929 766952 778330 787223 793387 797951 802432 807492 813173 819652
58714H19652P561Q737R942J1059J1604J1335J0689R894Q328N522J988j711n681
$$ 819652 827213 835950 845892 856951 868555 879890 890579 900473 908801 914323 916311 914600 908919
58701I08919r738j2953j5196j7807k1521k5027k6936k7792k8568k8542k6544k3265
$$ 908919 899181 886228 871032 853225 831704 806677 779741 751949 723381 694839 668295 645030
58689F45030k0453j8584j6913j5017j2861j0255p655o348o500o341m869l705m485
$$ 645030 624577 605993 589080 574063 561202 550947 543292 536944 530444 524103 519234 515529 511044
58676E11044n980o020m727l502k249k37J556J868J914L791O861Q728R273J0663
$$ 511044 505064 499044 494317 490815 488566 488329 489885 491753 493667 497458 504319 513047 522320 532983
58662E32983J3506J5971J6745J6187J4303J0354M968L40k262l443m005m157m379
$$ 532983 546489 562460 579205 595392 609695 620049 625017 625357 623095 619652 615647 611490 607111
58649F07111n166n804n256m112l900m651n082m949n230o075o628o704o725o197
$$ 607111 601945 596141 590885 586773 582873 578222 573140 568191 562961 556886 550258 543554 536829 530632
58635E30632m293j764k02M80J744L749M993M655L322J547m57j886k061j855k446
$$ 530632 526339 524575 524373 524853 526597 530346 535339 539994 543316 544863 544406 542520 540459 538604 536158
58620E36158l040j949N04K456L499M820O566P603P832Q283Q915Q673P736P255
$$ 536158 533118 531169 531673 534129 537628 542448 549014 556617 564449 572732 581647 590320 598056 605311
58606F05311O886N100K132O4l67n74j409k055k069k251k906l296l292l553l866
$$ 605311 612197 617297 619429 619493 619126 618552 617143 615088 613019 610768 607862 604566 601274 597721 593855
58591E93855l294k186j860k144j442N46K360L305M288N837P457R114J1236J3048
$$ 593855 590561 588375 586515 584371 582929 583475 585835 589140 593428 599265 606722 615836 627072 640120
58577F40120J3091J1587J0164R245P963O616O601P825Q721R137J0583J3398J6251
$$ 640120 653211 664798 674962 684207 692170 698786 705387 713212 721933 731070 741653 755051 771302
58564G71302J8808K2211K6443K9872L2026L4199L6663L7873L7143L5609L3757
$$ 771302 790110 812321 838764 868636 900662 934861 971524 1009397 1046540 1082149 1115906
58553A115906L0441K5141J8983J2848O635Q67l332o343r746j3542j6096j7215
$$ 1115906 1146347 1171488 1190471 1203319 1209954 1210821 1207489 1201146 1191400 1177858 1161762 1144547
58541A144547j8633k0943k2807k3797k5210k7409k9026k9597l0211l0854k9919
$$ 1144547 1125914 1104971 1082164 1058367 1033157 1005748 976722 947125 916914 886060 856141
58530H56141k7205k4510k2366j9109j4335j0261q283o966m863k777j706j034j99
$$ 856141 828936 804426 782060 762951 748616 738355 730072 723106 718243 715466 713760 712726 712527
58517G12527P1l83l23N82P84n44k019k358k119k054j783j138q85j196j333j370
$$ 712527 712598 712215 711892 712474 713258 712714 710695 708337 706218 704164 702381 701243 700358 699162 697829 696459
58501F96459k211l429l417k123j166r36l26M49j46j676j786k43N13k10J6K389
$$ 696459 694248 690819 687402 685279 684113 683177 682851 683300 683154 681478 679692 679449 679962 679752 679768 682157
58485F82157M784N564O098P659R108R660J0897J3914J7168J9163K0651K2418K3323
$$ 682157 686941 692505 698603 706262 715370 725030 735927 749841 767009 786172 806823 829241 852564
58472H52564K2413K0464J7889J3603P478J388l657q723j3965j7345j7861j7207
$$ 852564 874977 895441 913330 926933 934411 935799 932142 923419 909454 892109 874248 857041
58460H57041j6622j5071j2029r091p060m463o20K784M891P284J0662J3032J3055
$$ 857041 840419 825348 813319 804228 797168 792705 792085 794869 799760 807044 817706 830738 843793
58447H43793J1997J0520O979R62m768q122j0248j2181j2365r969p271o065m786
$$ 843793 855790 866310 873289 874251 869483 861361 851113 838932 826567 816598 809327 803262 798476
58434G98476j827J388L235M888P774J0950J3557J7067K2679K9441L7085M6954
$$ 798476 796649 798037 801272 806160 813934 824884 838441 855508 878187 907628 944713 991667
58422I91667N7123O0331N0865L1252R208r612k3216l1023l3834l4178l3627l1362
$$ 991667 1048790 1109121 1159986 1191238 1200446 1190834 1167618 1136595 1102761 1068583 1034956 1003594
58410A003594k7252k3709k2254k1154j8857j6735j5982j5010j2588j0327r383
$$ 1003594 976342 952633 930379 909225 890368 873633 857651 842641 830053 819726 810343
58399H10343p979n021k688k447k098J35K128J893J399K720L905K593M67N8K70
$$ 810343 802364 797343 794655 792208 790110 790245 792373 794266 795665 798385 802290 804883 805350 805408 805678
58384H05678r15k279j983j475k697m128l661k691l323m148k796k22J457K856N270
$$ 805678 804763 802484 800501 799026 796329 792201 788540 785849 782526 778378 775582 775360 776817 779673 784943
58369G84943P281P264O809P997R749J0360J0888J2594J3949J3687J3754J5655
$$ 784943 792224 799488 806297 814294 824043 834403 845291 857885 871834 885521 899275 914930
58357I14930J7197J6475J5520J6138J5914J2562Q541O848N882L093J53l11L65
$$ 914930 932127 948602 964122 980260 996174 1008736 1017277 1024125 1030007 1033100 1033253 1032942 1033307
58344A033307K4K48K918N754O185O066P671Q858P417O282Q795J2529J3616J3456
$$ 1033307 1033331 1033579 1036497 1042251 1048436 1054502 1062173 1071031 1078448 1084730 1093525 1106054 1119670 1133126
58330A133126J5225J7360J6817J5265J5766J6563J4524J1433J0538J0151P226
$$ 1133126 1148351 1165711 1182528 1197793 1213559 1230122 1244646 1256079 1266617 1276768 1283994
58319A283994L954M039N590M679K784L633N662M905K769L563O712Q462R068J1254
$$ 1283994 1287948 1291987 1297577 1302256 1305040 1308673 1314335 1319240 1322009 1325572 1332284 1340746 1349814 1361068
58305A361068J3950J4375J4005J5753J7861J7256J6010J7652K0175J9734J7971
$$ 1361068 1375018 1389393 1403398 1419151 1437012 1454268 1470278 1487930 1508105 1527839 1545810
58294A545810J8496J9602J7966J5957J7400J9820J8992J7422J9762K3577K3664
$$ 1545810 1564306 1583908 1601874 1617831 1635231 1655051 1674043 1691465 1711227 1734804 1758468
58283A758468K1900K3531K7145K7832K7046K9569L3779L4706L3703L5353L7974
$$ 1758468 1780368 1803899 1831044 1858876 1885922 1915491 1949270 1983976 2017679 2053032 2091006
58272B091006L7135L5306L7709M2007M2648M1972M5929N2285N4546N4330N7980
$$ 2091006 2128141 2163447 2201156 2243163 2285811 2327783 2373712 2425997 2480543 2534873 2592853
58261B592853O4155O6839O7534P2007P7959P8602P5590P5545P6876P3319O7447
$$ 2592853 2657008 2723847 2791381 2863388 2941347 3019949 3095539 3171084 3247960 3321279 3388726
58250C388726O6796O9647O8803O6348O9934P7515Q1065Q2558R0443J02938J11078
$$ 3388726 3455522 3525169 3593972 3660320 3730254 3807769 3888834 3971392 4061835 4164773 4275851
58239D275851J15724J24984J37433J44993J49809J60562J74828J83317J88666
$$ 4275851 4391575 4516559 4653992 4798985 4948794 5109356 5284184 5467501 5656167
58230E656167K01071K18362K30392K39917K58150K82745L02232L19100L45380
$$ 5656167 5857238 6075600 6305992 6545909 6804059 7086804 7389036 7708136 8053516
58221H053516L78650M06829M33516M72813N22083N67083O11041O69909P42025
$$ 8053516 8432166 8838995 9272511 9745324 10267407 10834490 11445531 12115440 12857465
58212A2857465Q13138Q88372R86651J106616J232839J372410J548174J759513
$$ 12857465 13670603 14558975 15545626 16652242 17885081 19257491 20805665 22565178
58204B2565178J990554K253582K581314K982178L452730M029297M773603N714167
$$ 22565178 24555732 26809314 29390628 32372806 35825536 39854833 44628436 50342603
58196E0342603O862672Q280641J0064588J2284509J5024247J8463706K2815466
$$ 50342603 57205275 65485916 75550504 87835013 102859260 121322966 144138432
58189A44138432K8192887L4599492M1794149M8644832N2499294M9896079L8857783
$$ 144138432 172331319 206930811 248724960 297369792 349869086 399765165 438622948
58182D38622948K0868401L81465j7849538l1118818l9036894m2393233m2236604
$$ 438622948 459491349 459872814 442023276 410904458 371867564 329474331 287237727
58175B87237727l9668035l5774292l1397488k7022240k2912655j9243191j6083375
$$ 287237727 247569692 211795400 180397912 153375672 130463017 111219826 95136451
58168I5136451j3395320j1124819r249651p729520o484131n449511m603790l921289
$$ 95136451 81741131 70616312 61366661 53637141 47153010 41703499 37099709 33178420
58160C3178420l352676k867025k467467k149284j882402j647817j453301j300386
$$ 33178420 29825744 26958719 24491252 22341968 20459566 18811749 17358448 16058062
58152A6058062j169687j049869r49289q68717p91993p13089o44797n91864n41477
$$ 16058062 14888375 13838506 12889217 12020500 11228507 10515418 9870621 9278757 8737280
58143H737280m87992m42024m07442l73532l37449l11354k99438k89250k73172
$$ 8737280 8249288 7807264 7399822 7026290 6688841 6377487 6078049 5788799 5515627
58134E515627k58239k47921k34063k14022j97148j87294j76278j60826j48946
$$ 5515627 5257388 5009467 4775404 4561382 4364234 4176940 4000662 3839836 3690890
58125C690890j43507j36178j23734j14331j11563j07680r8589r0907q8235q4635
$$ 3690890 3547383 3411205 3287471 3173140 3061577 2953897 2855308 2764401 2676166 2591531
58115B591531p7379p2567p2521p0691o4436o0132o0558n9561n4273n0496n1046
$$ 2591531 2514152 2441585 2369064 2298373 2233937 2173805 2113247 2053686 1999413 1948917 1897871
58104A897871n0513m6400m4028m5611m5666m1832l9344m0399l9889l5952l4025
$$ 1897871 1847358 1800958 1756930 1711319 1665653 1623821 1584477 1544078 1504189 1468237 1434212
58093A434212l5915l5626l0539k6320k6121k5122k0532j7025j7255j6683j2799
$$ 1434212 1398297 1362671 1332132 1305812 1279691 1254569 1234037 1217012 1199757 1183074 1170275
58082A170275j0285j2008j3757j2744j2727j5974j8506j7993j8203k1162k2841
$$ 1170275 1159990 1147982 1134225 1121481 1108754 1092780 1074274 1056281 1038078 1016916 994075
58071I94075k1098j9918k1505k1922j8899j6257j6271j5347j1562q947r807j0212
$$ 994075 972977 953059 931554 909632 890733 874476 858205 842858 831296 822349 812542 802330
58059H02330p571n510o806q402p896q148j1007j3105j2246j1523j2984j3587j1499
$$ 802330 794759 789249 782443 774041 766145 757997 746990 733885 721639 710116 697132 683545 672046
58046F72046r922j0649j0272o891m190m718n449m127l676n965p540n955m260m833
$$ 672046 662124 651475 641203 634312 630122 625404 619955 615828 612152 606187 598647 592692 588432 583599
58032E83599m942k864k293n749r448r620q503r180r903q545p495r003j0351q654
$$ 583599 578657 575793 573500 567751 558303 548683 540180 531000 521097 512552 505057 496054 485703 477049
58018D77049o087n617n804m446l147l777m408l085j703k101k318o49P20j1n45
$$ 477049 470962 465345 459541 455095 451948 448171 443763 440678 438975 436874 434556 433907 434627 434616 434071
58003D34071J037K335J197k5J156K912L008K980M251M272R64k939m289m546o126
$$ 434071 435108 437443 438640 438615 439771 442683 445691 448671 452922 457194 458158 455219 450930 446384 440258
57988D40258p511o385m154l027j909N44K114N22k329l566l797m594m836l410k368
$$ 440258 432747 426362 422208 419181 417272 417816 419930 420452 418123 414557 410760 406166 401330 397920 395552
57973C95552l451m627l791k632l160l744k591j639k885m123k692k79K93Q4J437
$$ 395552 392101 387474 383683 381051 377891 374147 371556 369917 367032 362909 360217 359938 360231 360315 361752
57958C61752L211L021J688J216Q38q98k575k443k004l144m315l419j847j680j603
$$ 361752 364963 367984 369672 370888 371726 370828 368253 365810 363806 360662 356347 352928 351081 349401 347798
57943C47798L00K438K643K513M435O909P308O885Q335J0689J1326J1080J2489
$$ 347798 348098 350536 353179 355692 360127 367036 374344 381229 389564 400253 411579 422659 435148
57930D35148J4721J5011J3601J2686J1860R140N277K667J092j284l895m961n493
$$ 435148 449869 464880 478481 491167 503027 512167 517444 520111 521203 519919 516024 511063 505570
57917E05570p783j0904j1955j0994j0628j1379j1442j0457r741r258p896o214
$$ 505570 497787 486883 474928 463934 453306 441927 430485 420028 410287 401029 393133 386919
57905C86919n586n355m142l000l799n482n441l826k866k816k176j190j389k173
$$ 386919 381333 375978 371836 368836 365037 359555 354114 350288 347422 344606 342430 341240 339851 337678
57891C37678j458N49J663J463J512K247K698K949L799M486L780K762L361M780
$$ 337678 336220 336769 338432 339895 341407 343654 346352 349301 353100 357586 361366 364128 367489 372269
57877C72269M477K276L42n17j348k266k302j861k332l412l598l094l424m503m765
$$ 372269 376746 379022 379364 378847 377499 375233 372931 371070 368738 365326 361728 358634 355210 350707 345942
57862C45942l989l319k815j620j93K19j6N11J703K428K878L957N040M820L787
$$ 345942 341953 338634 335819 334199 334006 334225 334209 334720 336423 338851 341729 345686 350726 355546 359333
57847C59333L266K850J404k83o97n61j636l360l858l568m479o289o682n292m180
$$ 359333 362599 365449 366853 366570 365873 365312 363676 360316 356458 352890 348411 342122 335440 330148 325968
57832C25968m257m353l929l828m109l702k503j377k66J477L151L630L717M980
$$ 325968 321711 317358 313429 309601 305492 301790 299287 297910 297644 299121 302272 305902 309619 314599
57818C14599O768P138O289O136O769O381M547K569N67k642o599r051r187q434
$$ 314599 321367 328505 334794 340930 347699 354080 358627 361196 361763 359121 352522 343471 334284 325850
57804C25850p731o611n163m367m103l177j562m56o7M56J004P33P4J75O44K48m94
$$ 325850 318119 311508 306345 301978 297875 294698 293136 292680 292613 293069 294073 294806 294880 295055 295699 295947 295453
57787B95453q6R49P13o26r81J05R47Q82J069J871K364K699M171O493P699P202
$$ 295453 295367 296316 297029 296403 295422 295527 296474 297356 298425 300296 302660 305359 309530 316023 323722 330924
57771C30924O402N919M875L225K180J844R32p27j908k483l708n600o630o410o118
$$ 330924 337326 343245 348120 351345 353525 355369 356301 355574 353666 351183 347475 341875 335245 328835 322717
57756C22717n965m884l082k164k180j358N97J760J280P46J308J989J824J286O60
$$ 322717 316752 311868 308786 306622 304442 303084 303681 305441 306721 307467 308775 310764 312588 313874 314534
57741C14534o74k436l152k542k049k271k056r52k47p24j455j667j737j673p71
$$ 314534 313860 311424 308272 305730 303681 301410 299354 298402 298155 297431 295976 294309 292572 290899 290128
57726B90128N13N91o78j654j715k018k815k650j220m10j263k202j745p49n75r51
$$ 290128 290641 291232 290554 288900 287185 285167 282352 279702 278482 278072 276809 274607 272862 272113 271538 270587
57710B70587j131j409k146k805l097l605m357m320l146j862j097k66Q46J513J693
$$ 270587 269456 268047 265901 263096 259999 256394 252037 247717 244571 242709 241612 241346 242192 243705 245398
57695B45398K351L468L667K549J407P68n98l215n506o125n778n546n103l937k714
$$ 245398 247749 251217 254884 257433 258840 259608 259010 255795 250289 244164 238386 232840 227737 223800 221086
57680B21086k144j742p95O04K253M318O586Q624J1064J5234K1061K7151L3299
$$ 221086 218942 217200 216405 217009 219262 223580 230166 238790 249854 265088 286149 313300 346599
57667C46599M0996N0653N9883O4848O1817M7871K3280n978l0848m5982n2441n3566
$$ 346599 387595 438248 498131 562979 624796 672667 695947 689969 659121 613139 560698 507132
57655E07132n0973m5596l9378l3759k8361k2924j8641j6073j3710j0287o832m895
$$ 507132 456159 410563 371185 337426 309065 286141 267500 251427 237717 227430 220598 215703
57643B15703m264l906l548l012j609M27J488R21J87M85R84P18M14Q75J308Q18
$$ 215703 211439 207533 203985 200973 199364 199791 201279 202200 202387 202872 203856 204574 204988 205863 207171 207989
57627B07989N6j42k82q84j249r50j027k170l281l329l091l500l839l321k796l112
$$ 207989 208045 207903 207621 206737 205488 204538 203511 201341 198060 194731 191640 188140 184301 180980 178184 175072
57611A75072l240k010l95m3o47p94m43n72j006o05P11J797J907J245K30p09j017
$$ 175072 171832 169822 169427 169384 168737 167943 167500 166928 165922 165317 166028 167825 169732 170977 171207 170498 169481
57594A69481o39l57p82j577k165k479k532k191j820k031k457k054r52m70q63q84
$$ 169481 168842 168485 167703 166126 163961 161482 158950 156759 154939 152908 150451 148397 147445 146975 146112 145228
57578A45228j37P2r08j826j696j295j359j256o78o93j725k356j647q00r85j370
$$ 145228 145091 145163 144255 142429 140733 139438 138079 136823 136145 135452 133727 131371 129724 128924 127939 126569
57562A26569r52m95q82j219m71N99Q86Q76J296J480Q33M64J373K576K811K607
$$ 126569 125617 125122 124240 123021 122550 123149 124035 124911 126207 127687 128520 128984 130357 132933 135744 138351
57546A38351K727K248L93j328j215k33l30j191j098k0P33J039J607J814M89j643
$$ 138351 141078 143326 143719 142391 141176 140943 140613 139422 138324 138304 139037 140076 141683 143497 143986 142343
57530A42343k652k263j828j822j484p32l59m33k51K50N52P63J270J673J412R32
$$ 142343 139691 137428 135600 133778 132294 131562 131203 130770 130519 130769 131321 132084 133354 135027 136439 137371
57514A37371Q76Q43M29M52J518K388J659P2p28q01j170j442n59P74Q53k39r22
$$ 137371 138247 139090 139519 139971 141489 143877 145536 145608 144880 144079 142909 141467 140908 141682 142535 142296 141374
57497A41374q98j251k003j930r42l91p61r81m39J40J28j48l32m48l42J14L82k6
$$ 141374 140476 139225 137222 135292 134350 133959 133198 132217 131778 131918 132046 131898 131566 131118 130776 130890 131272 131246
57479A31246m97k64J14l04r93p37J83L50n32j483k089k727l128k513j175k69o7
$$ 131246 130749 130485 130599 130295 129302 128565 128748 129098 128566 127083 124994 122267 119139 116626 115451 115182 115115
57462A15115J35M31K74j40l0M63M16j66l01L38J071J414J425R77pq41q43m91o01
$$ 115115 115250 115681 115955 115815 115785 116248 116664 116498 116197 116535 117606 119020 120445 121422 121415 120574 119731 119240 118639
57443A18639q34m18K20J12m58m63nL0k43NN64M62k21n76n14o13o33pO15J95o86
$$ 118639 117805 117387 117607 117719 117261 116798 116793 116823 116580 116585 117149 117611 117390 116814 116300 115687 115054 115047 115662 115857 115171
57422A15171n71M28R21P62R97J524J091k45r09m17p8o46j206r21j41O90J584K116
$$ 115171 114600 115028 115949 116711 117708 119232 120323 120078 119169 118752 118674 118028 116822 115901 115760 116450 118034 120150
57404A20150J604M86n1om98j621k157j670j066p93k78M86N81p6l37L42J109J266
$$ 120150 121754 122240 122189 122183 121685 120064 117907 116237 115171 114378 114100 114586 115167 115091 114754 115096 116205 117471
57386A17471J090Q75O25Q40K015L226K964J534P60J155J383Q80P52J439J616L92
$$ 117471 118561 119436 120061 120901 122916 126142 129106 130640 131400 132555 133938 134818 135570 137009 138625 139017
57370A39017j246k189k739l391l647l060k164j498q63k51j73n21m17K49N98N39
$$ 139017 137771 135582 132843 129452 125805 122745 120581 119083 118220 117969 117796 117275 116858 117107 117705 118244
57354A18244J123K492L151K194P44K02M62Q26J294J907K051J462R13R56J072P60
$$ 118244 119367 121859 125010 127204 127948 128150 128612 129438 130732 132639 134690 136152 137065 138021 139093 139853
57338A39853M42M80M13m0k54J76O13M36J6j04o7o7J84P50J002N22l53j222k015
$$ 139853 140295 140775 141188 141148 140894 141070 141683 142119 142135 142031 141964 141897 142081 142831 143833 144355 144002 142780 140765
57319A40765k461k218j763j976k551k212q79j50r80k279k554j723o14J96K69o92
$$ 140765 138304 136086 134323 132347 129796 127584 126705 126555 125575 123296 120742 119019 118405 118601 118870 118178
57303A18178k009k261j105J54L50k20p94j186j199k94J317K347K089J372J218
$$ 118178 116169 113908 112803 112957 113307 113087 112293 111107 109908 109614 110931 113278 115367 116739 117957
57288A17957J547J869K180K418K084J200N84N24K15p47j413q73L32J124J412J818
$$ 117957 119504 121373 123553 125971 128055 129255 129839 130363 130578 129831 128418 127545 127877 129001 130413 132231
57272A32231K556L308L698L439K565J815K078L199M106M210L804L069J902Q66
$$ 132231 134787 138095 141793 145232 147797 149612 151690 154889 158995 163205 167009 170078 171980 172846
57258A72846Q71J685K097J884K167L318M098L517K127P61n90j864k221j286N9
$$ 172846 173717 175402 177499 179383 181550 184868 188966 192483 194610 195371 194781 192917 190696 189410 189469
57243A89469Q66J161J166P19R0K01J174J837J374M68R0K18M10O08P42N77M30J055
$$ 189469 190335 191496 192662 193381 193471 193672 194846 196683 198057 198525 198615 198833 199243 199851 200593 201170 201600 202655
57225B02655K310L051K742K008J319M92k05K6R88J466J216J344K214K686K241
$$ 202655 204965 208016 210758 212766 214085 214577 214372 214398 215386 216852 218068 219412 221626 224312 226553
57210B26553K008K818L852M229M316M523M378L807L728M373M583L849L377L978
$$ 226553 228561 231379 235231 239460 243776 248299 252677 256484 260212 264585 269168 273017 276394 280372
57196B80372M553L995L062K960L501M068M990O501P608P473O933P243Q330R422
$$ 280372 284925 288920 291982 294942 298443 302511 307501 314002 321610 329083 336016 343259 351589 361011
57182C61011J0321J0997J1016J0466J0288J0702J0565R302Q075P900Q104P813
$$ 361011 371332 382329 393345 403811 414099 424801 435366 444668 452743 460643 468747 476560
57170D76560P520P854Q236Q130Q339R639J1456J3138J5169J7751J9709K0324K0833
$$ 476560 484080 491934 500170 508300 516639 526278 537734 550872 566041 583792 603501 623825 644658
57157F44658K2498K4455K5116K4476K3511K2428K1197K0681K1527K2874K3573
$$ 644658 667156 691611 716727 741203 764714 787142 808339 829020 850547 873421 896994
57146H96994K3773K3985K3734K2593K1514K1647K2758K4080K5635K7487K8816
$$ 896994 920767 944752 968486 991079 1012593 1034240 1056998 1081078 1106713 1134200 1163016
57135A163016K9102K9195K9992L1187L2311L3804L5955L8213M0465M3491M7188
$$ 1163016 1192118 1221313 1251305 1282492 1314803 1348607 1384562 1422775 1463240 1506731 1553919
57124A553919N0138N2053N4684N9044O3815O7919P2496P8649Q5397R1612R7998
$$ 1553919 1604057 1656110 1710794 1769838 1833653 1901572 1974068 2052717 2138114 2229726 2327724
57113B327724J05398J13177J21106J30783J43352J58039J74599J94952K20498
$$ 2327724 2433122 2546299 2667405 2798188 2941540 3099579 3274178 3469130 3689628
57104C689628K50491K85055L27266L80160M44669N22722O19336P39087Q83650
$$ 3689628 3940119 4225174 4552440 4932600 5377269 5899991 6519327 7258414 8142064
57095H142064J055185J258349J495904J765742K064597K389781K733589L080762
$$ 8142064 9197249 10455598 11951502 13717244 15781841 18171622 20905211 23985973
57087B3985973L414981L721892L982216M170166M262899M236502M039053L586057
$$ 23985973 27400954 31122846 35105062 39275228 43538127 47774629 51813682 55399739
57079E5399739K820738J794858O73321l58873j196892j834085k310657k666294
$$ 55399739 58220477 60015335 60688656 60329783 59132891 57298806 54988149 52321855
57071E2321855k929735l122618l257261l335402l354578l314108l215709l064004
$$ 52321855 49392120 46269502 43012241 39676839 36322261 33008153 29792444 26728440
57063B6728440k868848k644204k403532k157671j916191j687309j476021j284496
$$ 26728440 23859592 21215388 18811856 16654185 14737994 13050685 11574664 10290168
57055A0290168j114162r65556q36750p24318o25964n40706m67241m03923l49879
$$ 10290168 9176006 8210450 7373700 6649382 6023418 5482712 5015471 4611548 4261669
57046D261669l04511k66354k33776k06187j83249j63743j46441j31321j18680
$$ 4261669 3957158 3690804 3457028 3250841 3067592 2903849 2757408 2626087 2507407
57037B507407j07897r8115q9177q0820p2011o2131n1746m1250k9815j6404q93
$$ 2507407 2399510 2301395 2212218 2131398 2059387 1997256 1945510 1904260 1874445 1858041 1857148
57026A857148J5831L0649L6733K6725K1l4601o5465q5993r5787r6982r2436q5615
$$ 1857148 1872979 1903628 1940361 1967086 1967107 1932506 1867041 1781048 1685261 1588279 1495843 1410228
57014A410228p8933p2352o5187n8333n2994m8572m3802l8984l5108l1824k8240
$$ 1410228 1331295 1258943 1193756 1135423 1082429 1033857 990055 951071 915963 884139 855899
57003H55899k4862k2656k1084j9031j7008j6352j6789j6754j5776j4714j3972
$$ 855899 831037 808381 787297 768266 751258 734906 718117 701363 685587 670873 656901
56992F56901j3146j2190j1372j0333q553o431m604k624L75M050P037Q273P075
$$ 656901 643755 631565 620193 609860 601307 594876 590272 587648 588023 592073 599110 607383 614458
56979F14458K781m246j1791j7422k0611k2180k2441k1286j9438j7924j6569j4467
$$ 614458 617239 612993 601202 583780 563169 540989 518548 497262 477824 459900 443331 428864
56967D28864j1657r027o834m582k151J41K476N440R148J3282J7643K1638K3556
$$ 428864 417207 408180 401346 396764 394613 394754 397230 402670 411818 425100 442743 464381 487937
56954D87937K1490J5018N546m650j3295j8871k1409k2174k2113k1176j9393j7417
$$ 487937 509427 524445 529991 525341 512046 493175 471766 449592 427479 406303 386910 369493
56942C69493j5380j2501q669n139k673k34L291P425J1460J6171K2544K9681L5348
$$ 369493 354113 341612 332943 327804 325131 324897 328188 335613 347073 363244 385788 415469 450817
56929D50817L7718L5298K6667J2321l941j7444k6158l0717l2040l0846k8593k6660
$$ 450817 488535 523833 550500 562821 558880 541436 515278 484561 452521 421675 393082 366422
56917C66422k4768k1831j8124j4933j2529j0178p928o619o238n875n252m844m552
$$ 366422 341654 319823 301699 286766 274237 264059 256131 249512 243274 237399 232147 227303 222751
56904B22751l763k639k021k028k016j745j462j069m50k03p13r26M63L027N330
$$ 222751 218988 216349 214328 212300 210284 208539 207077 206008 205558 205355 204642 203716 204179 207206 212536
56889B12536P297J0094J3944J7780K0955K3328K3547J9465J0998J007p412j3278
$$ 212536 219833 229927 243871 261651 282606 305934 329481 348946 359944 360951 353539 340261
56877C40261j6857j8146j7161j4706j1796q794n667k441R92M953R461J4141J8795
$$ 340261 323404 305258 288097 273391 261595 252801 247134 244693 245685 250638 260099 274240 293035
56864B93035K3649K9037L5407M3514N3646O4215P1507P1260O0735M0340J4161
$$ 293035 316684 345721 381128 424642 478288 542503 614010 685270 746005 786345 800506
56853H00506j1486l1319m3505m9014m9379m5838l9875l3091k6320j9592j2889
$$ 800506 789020 757701 714196 665182 615803 569965 530090 496999 470679 451087 438198
56842D38198o185R58Q994J7766K7041L7419M9914O4846Q1728R9236J13740J18408
$$ 438198 432013 432971 441965 459731 486772 524191 574105 638951 720679 819915 933655 1052063
56830A052063J06219P5471L2223j2981n0741p6276q9416r2602q8704q0099o9045
$$ 1052063 1158282 1233753 1265976 1252995 1202254 1125978 1036562 943960 855256 775157 706112
56819G06112n7880m8071l9378l0574k0965j0894j080Q127J7205K7418L9839N4093
$$ 706112 648232 600161 560783 530209 509244 498350 497270 505397 522602 550020 589859 643952
56807F43952O8278P9805Q5270Q0037O0556K8725p384l8677o0485p2694p6772p4610
$$ 643952 712230 792035 877305 957342 1017898 1046623 1039239 1000562 940077 867383 790611 716001
56795G16001o8836o1657n3484m4185l5031k7684k1847j5764q873k192L737R709
$$ 716001 647165 585508 532024 487839 452808 425124 403277 387513 378640 376448 380185 389894
56783C89894J6635K4678L3381M1242M5343M2898L3270J7915q38j9763l4740m3020
$$ 389894 406529 431207 464588 505830 551173 594071 627341 645256 644418 624655 589915 546895
56771E46895m5375m4544m2049l8057l3463k9758k6938k3771k0114j7048j4738
$$ 546895 501520 456976 414927 376870 343407 313649 286711 262940 242826 225778 211040
56760B11040j2262r666q138p755p131n692m441l914l283k169j506j846k328k128
$$ 211040 198778 189112 180974 173219 166088 160396 155955 152041 148758 146589 145083 143237 140909 138781
56746A38781j537r54j65P26R80M34j51m61j076k060k495k045j632j874k055j384
$$ 138781 137244 136290 136125 136851 137831 138265 138114 137653 136577 134517 132022 129977 128345 126471 124416 123032
56730A23032k35N94R36R59O62J58j93k93k23K84J371K206J812P02L45R88J475
$$ 123032 122797 123391 124327 125286 125948 126106 125913 125620 125397 125681 127052 129258 131070 131772 132117 133105 134580
56713A34580J305J195J331R04j33n50J36P16K71l51k8Q78J295R33J51p68j395
$$ 134580 135885 137080 138411 139315 139182 138632 138768 139484 139755 139404 139376 140254 141549 142482 142633 141865 140470
56696A40470j146j73N44N31L85N27M96K6k35J83P10O76K96O9qo8L1K58K73J19
$$ 140470 139324 139151 139695 140226 140611 141138 141634 141660 141425 141608 142318 142994 143290 143359 143351 143283 143314 143572 143845 143964
56676A43964K49O13N23k56j161j720j906j501k62J154J671J405J535K245K293
$$ 143964 144213 144826 145349 145093 143932 142212 140306 138805 138543 139697 141368 142773 144308 146553 148846
56661A48846J085k43m75K40J183K119K861K925K351J856J676J238L83k55n01j002
$$ 148846 149931 149688 149213 149453 150636 152755 155616 158541 160892 162748 164424 165662 166045 165790 165289 164287
56645A64287j832k127j631j199j221r26J5O67M69K63P88J484J745K021K689L009
$$ 164287 162455 160328 158697 157498 156277 155351 155366 156033 156502 156765 157553 159037 160782 162803 165492 168501
56629A68501K422J640J361J004j06j238j323o93n48j236k130k695k769k303j556
$$ 168501 170923 172563 173924 174928 174822 173584 172261 171568 171020 169784 167654 164959 162190 159887 158331
56614A58331j101j089j095j033j283j559q71P84J934J621P42M77O29N34M82J019
$$ 158331 157230 156141 155046 154013 152730 151171 150300 151084 153018 154639 155381 155858 156487 157021 157503 158522
56598A58522J695J729J253Q26L82l78j123j349j166q94m88j8M2l53m39J81P78
$$ 158522 160217 161946 163199 164025 164407 164029 162906 161557 160391 159497 159009 158991 159033 158680 158241 158422 159200
56581A59200O45J74J07M61R76J766K760L281L017K622K649K638K020J248J172
$$ 159200 159845 160019 160126 160587 161563 163329 166089 169370 172387 175009 177658 180296 182316 183564 184736
56566A84736J930L061M198N107N752O691Q736J1812J4930J7426J9134J9266J6646
$$ 184736 186666 189727 193925 199032 204784 211475 220211 232023 246953 264379 283513 302779 319425
56553C19425J1603O375K889J280R60J606K532K602J654P57L82k34j359k049k041
$$ 319425 331028 337403 340292 341572 342532 344138 346670 349272 350926 351683 352065 351831 350472 348423 346382
56538C46382k560m184n655n934n794o134o414o141o245p406q472q227p293o718
$$ 346382 343822 339638 333983 328049 322255 316121 309707 303566 297321 289915 281443 273216 265923 259205
56524B59205o144n006m161m401m675l764k533k512l305l482l190l685m881n480
$$ 259205 253061 248055 243894 239493 234818 231054 228521 226009 222704 219222 216032 212347 207466 201986
56510B01986n185m891m900m625l854k913j849p47l76j201k246k267j513r82o57
$$ 201986 196801 191910 187010 182385 178531 175618 173769 173022 172646 171445 169199 166932 165419 164437 163780
56495A63780J33J105J354Q98N56O31Q65J206J553J342M73l6N31J352J347Q68Q63
$$ 163780 163913 165018 166372 167270 167826 168457 169322 170528 172081 173423 173896 173860 174391 175743 177090 177958 178821
56478A78821J189J080N30k9n98j028o40M91R61J25n53L48J918K436J916J422J051
$$ 178821 180010 181090 181620 181591 180993 179965 179325 179816 180777 180902 180349 180697 182615 185051 186967 188389 189440
56461A89440M61K90J042J603Q31l12k55N54O17J6j10J00k73p73k22J076J909K312
$$ 189440 189901 190191 191233 192836 193667 193355 193100 193654 194271 194287 194177 194277 194004 193231 193009 194085 195994 198306
56443A98306K978L242K005M7r59j146j764k353j374O32J368L27o00l12K31K86
$$ 198306 201284 204526 206531 206578 205619 204473 202709 200356 198982 199614 200982 201309 200709 200397 200628 200914
56427B00914M22Q40P58R0j70K51M93K68K54N31L73j29J9Q39J135L84n94j099j189
$$ 200914 201336 202176 202934 203024 202854 203105 203598 203866 204120 204651 205024 204895 204914 205753 206888 207272 206678 205579 204390
56408B04390q18J76J173J323Q60N50J58r07j883j428J48J296J529J510J244K72
$$ 204390 203572 203748 204921 206244 207104 207654 207812 206905 205022 203594 203742 205038 206567 208077 209321 209593
56392B09593o02k9J552K355J939J398J102M02m16k64O26Q58L00K24R52J499J594
$$ 209593 208991 208962 210514 212869 214808 216206 217308 217710 217294 217030 217656 218514 218814 219038 219990 221489 223083
56375B23083J856K006J189O7K26J363J639Q82Q11J765K032J027M31J229K101J794
$$ 223083 224939 226945 228134 228201 228427 229790 231429 232311 233122 234887 236919 237946 238377 239606 241707 243501
56359B43501Q60Q0p73j609j510m77J56j34k76L54R58R92J008J222J067O59Q57
$$ 243501 244361 244441 243668 242059 240549 240072 240228 240094 239818 240172 241130 242122 243130 244352 245419 246078 246935
56342B46935J395R71l58r45j78P04R60J256J783J670R37Q07J399J340M17L02J745
$$ 246935 248330 249301 248943 247998 247820 248524 249484 250740 252523 254193 255130 255937 257336 258676 259093 259395 261140
56325B61140L290L697L537L449K951J968J473J616J198j48j169j222j190j411
$$ 261140 264430 268127 271664 275113 278064 280032 281505 283121 284319 284171 283002 281780 280590 279179
56311B79179p80J006K458K476J704Q81j23r40m79J063K114K385L382N457O727
$$ 279179 278399 279405 281863 284339 286043 286924 286801 285861 285382 286445 288559 290944 294326 299783 306510
56296C06510N981M358L083J809K84o09o88j167k384k979k329j565j207j96J573
$$ 306510 312491 316849 319932 321741 322025 321416 320728 319561 317177 314198 311869 310304 309097 308901 310474
56281C10474K296J225J57N64J496J761J889K431K559J872J463J825J818J072J115
$$ 310474 312770 313995 314152 314716 316212 317973 319862 322293 324852 326724 328187 330012 331830 332902 334017
56266C34017K700M257M514M327M482M059K653J829K676M020M732N547P000P912
$$ 334017 336717 340974 345488 349815 354297 358356 361009 362838 365514 369534 374266 379813 386813 394725
56252C94725P685P774R167J0576J0979J1639J3716J6051J7271J7999J9179K0225
$$ 394725 402410 410184 419351 429927 440906 452545 466261 482312 499583 517582 536761 556986
56240E56986K0554K0926K1583K1305J9790J8642J8336J6904J3354R639P175M342
$$ 556986 577540 598466 620049 641354 661144 679786 698122 715026 728380 738019 745194 749536
56228G49536k14m666p020q477j0920j3465j4347j4169j4448j4828j4371j3760
$$ 749536 749322 744656 737636 729159 718239 704774 690427 676258 661810 646982 632611 618851
56216F18851j3732j3290j1867j1128j2151j2970j1587r278q178p702o290m690
$$ 618851 605119 591829 579962 568834 556683 543713 532126 522848 514670 506968 500678 495988
56204D95988m427m765m160l108k780k451j067K87K30k31L96J184N11q14r77j37
$$ 495988 491561 486796 482636 479528 476748 474297 473230 473517 473747 473516 473912 475096 475607 474793 473816 473679
56188D73679M82J020J970K471J906J506K078K245J209Q47K467M016L539K774L997
$$ 473679 474161 475181 477151 479622 481528 483034 485112 487357 488566 489413 491880 495896 499435 502209 506206
56173E06206N799N613M264M133M823M466L671M268N637N963N758O560P653P567
$$ 506206 512005 517618 521882 526015 530838 535304 538975 543243 548880 554843 560601 567161 574814 582381
56159E82381P437R151J1695J2831J2983J3876J4865J4451J3971J5902J9632K2690
$$ 582381 589818 598969 610664 623495 636478 650354 665219 679670 693641 709543 729175 751865
56147G51865K4994K8204L2179L5885M0695M8869N9723P0917Q2504R6064J10870
$$ 751865 776859 805063 837242 873127 913822 962691 1022414 1093331 1175835 1271899 1382769
56136A382769J24355J35210J42354J42417J32466J14714R4997P7592O4554N8182
$$ 1382769 1507124 1642334 1784688 1927105 2059571 2174285 2269282 2346874 2411428 2469610
56126B469610N9462O4625O7155O3034N1641L3603J1659q111k0441k5839k8713
$$ 2469610 2529072 2593697 2660852 2723886 2775527 2809130 2820789 2812678 2792237 2766398 2737685
56115B737685l2400l9270n2747p4191r9137j20937j36714j46189j47494j39415
$$ 2737685 2705285 2666015 2613268 2539077 2439940 2319003 2182289 2036100 1888606 1749191
56105A749191j25667j11492r7455q1629o5910n4369m6737l9341l1560k5714k1547
$$ 1749191 1623524 1512032 1414577 1332948 1267038 1212669 1165932 1126591 1095031 1069317 1047770
56094A047770j6622j1472q765p898n995l495l115l982k657N20K038J747K803N335
$$ 1047770 1031148 1019676 1010911 1003013 997018 993523 990408 986426 983769 984289 986327 988074 990877 996212
56080I96212O178N062N118O944P819P107P091Q107Q162P513Q385J0210J0351R393
$$ 996212 1002390 1007452 1012570 1019514 1027333 1034440 1041531 1049638 1057800 1065313 1073698 1083908 1094259 1103652
56066A103652J0313J2802J3816J3399J4259J6148J6410J5639J6816J9289J9721
$$ 1103652 1113965 1126767 1140583 1153982 1168241 1184389 1200799 1216438 1233254 1252543 1272264
56055A272264J8517J9020K0892K0684J8553J7861J8512J7449J5295J5631J7999
$$ 1272264 1290781 1309801 1330693 1351377 1369930 1387791 1406303 1423752 1439047 1454678 1472677
56044A472677J8577J7476J8289K0808K1488K0724K2119K5014K5529K4609K6872
$$ 1472677 1491254 1508730 1527019 1547827 1569315 1590039 1612158 1637172 1662701 1687310 1714182
56033A714182L1718L3995L3382L4525L7812L8916L7744L8902M2693M4638M4348
$$ 1714182 1745900 1779895 1813277 1847802 1885614 1924530 1962274 2001176 2043869 2088507 2132855
56022B132855M5830M8658M8373M5970M7315N2466N5503N5622N8125O3686O7170
$$ 2132855 2178685 2227343 2275716 2321686 2369001 2421467 2476970 2532592 2590717 2654403 2721573
56011B721573O8112P1633P7868Q1398Q2124Q5656R1942R5132R5647J00264J09154
$$ 2721573 2789685 2861318 2939186 3020584 3102708 3188364 3280306 3375438 3471085 3571349 3680503
56000C680503J15358J18270J24557J34537J41355J45085J53320J66130J75238
$$ 3680503 3795861 3914131 4038688 4173225 4314580 4459665 4612985 4779115 4954353
55991D954353J80089J89245K03860K15924K25141K40517K62642K82086K98306
$$ 4954353 5134442 5323687 5527547 5743471 5968612 6209129 6471771 6753857 7052163
55982G052163L21525L52725L81433M06934M40996M85443N28826N69948O21956
$$ 7052163 7373688 7726413 8107846 8514780 8955776 9441219 9970045 10539993 11161949
55973A1161949O87968P56669Q27531R15067J022341J137426J262290J416192J604433
$$ 11161949 11849917 12606586 13434117 14349184 15371525 16508951 17771241 19187433 20791866
55964B0791866J815824K058372K363003K745022L200894L751809M448143N323227
$$ 20791866 22607690 24666062 27029065 29774087 32974981 36726790 41174933 46498160
55956D6498160O391944P704761R350545J1404782J3948569J7145564K1210965
$$ 46498160 52890104 60594865 69945410 81350192 95298761 112444325 133655290
55949A33655290K6290099L2427032L9470970M6512222N1143514M9801828L9855484
$$ 133655290 159945389 192372421 231843391 278355613 329499127 379300955 419156439
55942D19156439K2004257N70292j8911004l2699706m0021569m2127505m0796976
$$ 419156439 441160696 441730988 422819984 390120278 350098709 307971204 267174228
55935B67174228l7530364l3402052k9088623k4936438k1110795j7717687j4804821
$$ 267174228 229643864 196241812 167153189 142216751 121105956 103388269 88583448
55928H8583448j2341652j0271053q557879p164825o026430n082209m305797l677665
$$ 88583448 76241796 65970743 57412864 50248039 44221609 39139400 34833603 31155938
55920C1155938l159809k719861k351974k052649j800345j576990j385832j230459
$$ 31155938 27996129 25276268 22924294 20871645 19071300 17494310 16108478 14878019
55912A4878019j097398r75037q69185p84831p11416o40122n77894n30929m90884
$$ 14878019 13780621 12805584 11936399 11151568 10440152 9800030 9222136 8691207 8200323
55903H200323m49990m14013l88107l64716l37096l10998k91980k74259k52522
$$ 8200323 7750333 7336320 6948213 6583497 6246401 5935403 5643423 5369164 5116642
55894E116642k32227k18271k05261j88494j73136j63509j54310j41038j28470
$$ 5116642 4884415 4666144 4460883 4272389 4099253 3935744 3781434 3640396 3511926
55885C511926j20432j11718r8600q7472q4659q6671q8026q9788r3147r3503q8255
$$ 3511926 3391494 3279776 3181176 3093704 3009045 2922374 2834348 2744560 2651413 2557910 2469655
55874B469655q2300p9335p5824o9556o5350o6020o6338o2342n8223n7573n6337
$$ 2469655 2387355 2308020 2232196 2162640 2097290 2031270 1964932 1902590 1844367 1786794 1730457
55863A730457n1003m5542m3507m1275l5918l1977l3320l5577l3822l0832l0729
$$ 1730457 1679454 1633912 1590405 1549130 1513212 1481235 1447915 1412338 1378516 1347684 1316955
55852A316955l1059k8327k5246k5448k6657k5731k4992k7065k8838k6919k4034
$$ 1316955 1285896 1257569 1232323 1206875 1180218 1154487 1129495 1102430 1073592 1046673 1022639
55841A022639k3745k3868k1251j8180j7892j8334j6487j4437j5155j6413j4737
$$ 1022639 998894 975026 953775 935595 917703 899369 882882 868445 853290 836877 822140
55830H22140j1555r955r160p432o523q050r338q036o971r317j2711j3413j2612
$$ 822140 810585 800630 791470 784038 777515 769465 760127 752091 745120 735803 723092 709679 697067
55817F97067j3339j4625j3930j2251j1808j1569r748p758p317o737m374k459l080
$$ 697067 683728 669103 655173 642922 631114 619545 609797 602039 594722 587985 583611 581152 578072
55804E78072l844j916R89K166L022N866Q944R502Q858R580J0509R333P364P011
$$ 578072 574228 572312 573301 575467 578489 584355 593299 602801 611659 621239 631748 641081 648445 655456
55790F55456P093N276K694J516N28k297n270n807n495p680j1957j5475j7795k0045
$$ 655456 662549 667825 670519 672035 672563 670266 664996 659189 653694 646014 634057 618582 600787 580742
55776E80742k1226j9679j6590j3848j0321m157L137Q933J3493J7471J7723J0753
$$ 580742 559516 539837 523247 509399 499078 494921 498058 506991 520484 537955 555678 566431
55764E66431j040j1251j6682j8666j8526j6232j2873j0319q620o849n789o666
$$ 566431 565391 554140 537458 518792 500266 484034 471161 460842 452222 445373 439584 432918
55752D32918q354q958r060j0314j2133j2812j2550j2313j1294q668o192n723n747
$$ 432918 424564 415606 406546 396232 384099 371287 358737 346424 335130 326462 320270 314547 308800
55739C08800l764n79J230J497J596J024j324l822l915k243j441j826j853j661
$$ 308800 305036 304457 305687 307184 308780 309804 308480 304658 300743 298500 297059 295233 293380 291719
55725B91719k556l888m035l673m575n971n612l741k572k415j629J00J642K998
$$ 291719 289163 285275 281240 277567 272992 267021 261409 257668 255096 252681 251052 251152 252794 255792
55711B55792M962O823P366P358Q177Q783P245M303K246J008j321m726p329q693
$$ 255792 260754 267577 274943 282301 290478 299261 306506 310809 313055 314063 312742 308016 300687 291994
55697B91994r879j0722j0088q515p585p156n998m567m175m150k797o75J89j98
$$ 291994 282115 271393 261305 252790 245205 238049 232051 227484 223309 219159 216362 215687 215876 215678
55683B15678j33N38N91L96J505L555M597M305M006L862K912J572J162J161j69
$$ 215678 215545 216083 216674 217070 218575 222130 226727 231032 235038 238900 241812 243384 244546 245707 245538
55668B45538k611m235m466m250l614j897K2N78K99Q90K070K198J515J726K802
$$ 245538 242927 238692 234226 229976 226362 224465 224487 225065 225364 226254 228324 230522 232037 233763 236565
55653B36565L217K979L286L715K967J975K782M633M812L254K535L235L068J162
$$ 236565 239782 242761 246047 249762 252729 254704 257486 262119 266931 270185 272720 275955 279023 280185
55639B80185n98j230k205m335o345p559q963j0622j0960r587q115p302o144m533
$$ 280185 279587 278357 276152 271817 265472 257913 248950 238328 227368 217781 209666 202364 196220 191687
55625A91687l967m592m502l010j874k031j884k72J372J398L46n00j041j558j726
$$ 191687 187720 183128 178626 175616 173742 171711 169827 169555 170927 172325 172671 172171 171130 169572 167846
55610A67846j608k001k828k841j736q74j118j656j677j610j919k250k269k012
$$ 167846 166238 164237 161409 158568 156832 155958 154840 153184 151507 149897 147978 145728 143459 141447
55596A41447j177L84J523J036j05Q6J296J308k10j103l50M94L80M44J499K352
$$ 141447 140270 140654 142177 143213 143108 143194 144490 145798 145588 144485 144135 144629 145009 145453 146952 149304
55580A49304K062J594J891K264K111K321L586M999N637O090P176Q599R814J0872
$$ 149304 151366 152960 154851 157115 159226 161547 165133 170132 175769 181859 189035 197634 207448 218320
55566B18320J1451J0511P808M483J452j442m190o070o979p752q595q731q077p628
$$ 218320 229771 240282 248090 252573 254025 252583 248393 242323 235344 227592 218997 210266 202189 194561
55552A94561p679p359o411n657n258m391l141k697l056k703j285m75j235k295
$$ 194561 186882 179523 173112 167455 162197 157806 154665 151968 148912 146209 144924 144449 143214 140919
55538A40919k407k073j874j099O97K405K973K767K317J302j63q57k75L76P8o01
$$ 140919 138512 136439 134565 133466 134163 136568 139541 142308 144625 145927 145764 144907 144632 145008 145086 144485
55522A44485r21j266j957k368k258k483l304l493k257o86j04l26n05m38j02P08
$$ 144485 143564 142298 140341 137973 135715 133232 129928 126435 124178 123492 123388 123062 122557 122119 122017 122725
55506A22725J459R77o91k009k288k604l552l960k974j596q89l07Q18J661J313
$$ 122725 124184 125161 124470 122461 120173 117569 114017 110057 107083 105487 104598 104291 105109 106770 108083
55491A08083M21N4J25J66L87P75M97n59j022q2J038Q89j54r04j119r68j13J255
$$ 108083 108504 108558 108683 108849 109236 110011 110508 109949 108927 108845 109883 110772 110618 109714 108595 107627 107514 108769
55473A08769J758O85o03n67L11O17J99k08o21j445k236k208j476p24j72K07K66
$$ 108769 110527 111212 110609 110042 110353 110970 111169 110961 110340 108895 106659 104451 102975 102251 102079 102286 102552
55456A02552K02O41J429J473N99J96J053J847J119n42j562j619j436j330j278
$$ 102552 102754 103395 104824 106297 106896 107092 108145 109992 111111 110569 109007 107388 105952 104622 103344
55441A03344j551k073j914o12Q74J528J660J943K093J641R86N72l8j115j810j373
$$ 103344 101793 99720 97806 97194 98068 99596 101256 103199 105292 106933 107919 108491 108453 107338 105528 104155
55425A04155l78L17Q47J494J715J136N03M24K78n02j168q80j14L50P50J413J685
$$ 104155 103777 104094 104941 106435 108150 109286 109789 110213 110491 109989 108821 107941 107827 108177 108927 110340 112025
55408A12025J086M44N35O98J34n50n40l96r36j581j444r59r71j106o64p7L2K56
$$ 112025 113111 113555 114090 114788 114922 114372 113832 113436 112500 110919 109475 108516 107545 106439 105775 105698 105730 105986
55390A05986J169J809J140O5J07R77J357J252J524J811J097k09p72o23r13j688
$$ 105986 107155 108964 110104 110169 110276 111253 112610 113862 115386 117197 118294 118085 117313 116690 115777 114089
55374A14089j847j219p78q27p78o71j190k049k101j247o75r50j274q96q4O35J086
$$ 114089 112242 111023 110245 109418 108640 107969 106779 104730 102629 101382 100707 99757 98483 97587 97503 98138 99224
55357I9224J176Q81N56N06L98j11n50l39J48J79j30k22j44j61N3O78Q96M4j023
$$ 99224 100400 101281 101837 102343 102741 102630 102080 101741 101889 102068 101938 101716 101572 101411 101464 102142 103038 103082 102059
55338A02059j086m56l17p77j081j190j476j412l13R90J001p8o22j12M01L28L05
$$ 102059 100973 100517 100200 99423 98342 97152 95676 94264 93951 94941 95942 95864 95242 95130 95531 95859 96164
55321I6164O87Q62N02J34J72M62R00J425J474N73n86r10n66n94j075j096n29k36
$$ 96164 96851 97713 98215 98349 98521 98983 99883 101308 102782 103355 102769 101859 101293 100699 99624 98528 97999 97763
55303I7763m14j80Q21J737J812J249M86l29q98q40m35m25r33j340j273r19m41
$$ 97763 97349 97169 97990 99727 101539 102788 103274 102945 102047 101207 100772 100347 99414 98074 96801 95882 95441
55286I5441N9K69J56L94J339K039J458J84l05K40Q50J067J151Q66k84j668j955
$$ 95441 95500 95769 95925 96319 97658 99697 101155 101339 101034 101274 102124 103191 104342 105208 104924 103256 101301
55269A01301j069l33n18j098j445j399o83P87J994J701L48l76M2N18M22L90P61
$$ 101301 100232 99899 99381 98283 96838 95439 94756 95543 97537 99238 99586 99210 99252 99770 100192 100582 101343
55252A01343Q71M04N1K66O20Q14J062J154M39p97j292n75L91P33O16K96l85j091
$$ 101343 102214 102618 102669 102935 103555 104369 105431 106585 107024 106227 104935 104360 104751 105484 106100 106396 106011 104920
55234A04920r42K1N20j59j176j537j402j343j321j025m71K98J250J861J486M82
$$ 104920 103978 103999 104519 104360 103184 101647 100245 98902 97581 96556 96085 96383 97633 99494 100980 101462
55218A01462l5K07M09K86N65J449J960J409M65Op6k69n79q23j025j055o80k49
$$ 101462 101427 101634 102043 102329 102894 104343 106303 107712 108177 108183 108107 107838 107259 106436 105411 104356 103676 103427
55200A03427l95q25n61M04R34O36M93J014J228L74o95q55l93k26l65k11K48N80
$$ 103427 103032 102207 101646 102050 102984 103620 104113 105127 106355 106729 106034 105179 104786 104560 104195 103984 104232 104812
55182A04812P53R59J071R32P63P08M50j33n38l72k4l2l38n99p67r10r32q23p05
$$ 104812 105565 106524 107595 108527 109290 109998 110448 110315 109777 109405 109381 109349 109011 108412 107645 106735 105803 104980 104275
55163A04275m06L55J213J279L50p65j323j327r34j61N64M84l20q08l88L70Q40
$$ 104275 103869 104224 105437 106716 107066 106301 104978 103651 102717 102556 103120 103604 103284 102476 102088 102458 103298
55146A03298J149J412J245O69M91J031J378P92mJ06Q89J126L40p39j248j088p58
$$ 103298 104447 105859 107104 107773 108264 109295 110673 111465 111461 111567 112456 113582 113922 113183 111935 110847 110089
55129A10089p88j225j508j068j02O23P19M40Q2k81m50k34M4o6k85K6O27O08p2
$$ 110089 109301 108076 106568 105500 105398 106021 106740 107180 107262 106981 106531 106297 106341 106275 105990 106016 106643 107251 107179
55110A07179l58K92J159J462J329J141Q32L59M5N0J61L24O32Q22N37Q6n6l63j495
$$ 107179 106821 107113 108272 109734 111063 112204 113036 113395 113440 113490 113651 113975 114607 115429 115966 116052 115996 115633 114138
55091A14138k625k128j26J390J349P51N29J51p73j310q00j17j73m48k47j3j95
$$ 114138 111513 109385 109259 110649 111998 112749 113278 113429 112656 111346 110546 110429 110256 109808 109561 109548 109353
55074A09353q8P93J374N68p72r61J05J017Q41r1r20r04J37J286J231O0o37j75
$$ 109353 109265 110058 111432 112000 111228 110267 110372 111389 112230 112139 111219 110315 110452 111738 112969 113029 112392 112217
55056A12217J13q50j955j644l21N72Q51J245J561J050K8m69l73m43p77p92m06
$$ 112217 112330 111480 109525 107881 107560 108132 108983 110228 111789 112839 112867 112398 112025 111582 110805 110013 109607
55039A09607KM57J075J355R45N40Q22J202Q11J14O6L88K53R4R03K155K279J057
$$ 109607 109609 110066 111141 112496 113441 113981 114803 116005 116816 116930 116996 117384 117637 117731 118634 120789 123068 124125
55021A24125j57o25q60j065p11N9K56k71m34L44J272J565J376R54O8j125j772
$$ 124125 123968 123343 122483 121418 120707 120766 121022 120751 120317 120661 121933 123498 124874 125828 125896 124771 122999
55004A22999j507j036j001j076p57j75L28P84J219J289Q07J48k82n40q24j062
$$ 122999 121492 120456 119455 118379 117622 117447 117775 118559 119778 121067 121874 122022 121740 121200 120376 119314
54988A19314j062p45m8J035K169K740K362J207j00p79m95J01q3j131j725q49P12
$$ 119314 118252 117507 117459 118494 120663 123403 125765 126972 126872 126093 125598 125699 125616 124485 122760 121911 122623
54971A22623J384Q32K3l65m61l23L25J349K068K073J535P00j85o42l67J16%o28
$$ 122623 124007 124839 124862 124497 124036 123713 124038 125387 127455 129528 131063 131763 131578 130936 130569 130685 130685 130057
54953A30057r31n60J4L92O74R03Q69N91L64K41N6q0J18M91N73L08J7k77q19j463
$$ 130057 129126 128566 128580 128972 129646 130549 131418 132009 132373 132614 132670 132590 132708 133199 133772 134080 134097 133820 133001 131538
54933A31538j665j225n23kJ86J44J44L95O12L07k15J56J697L069L037K258K293
$$ 131538 129873 128648 128125 128123 128309 128453 128597 128992 129604 129911 129696 129852 131549 134618 137655 139913 142206
54916A42206L490N059O605Q126Q897P956N608L118R69j202l131l965l892m162
$$ 142206 145696 150755 157360 165486 174383 182339 187947 191065 192034 190832 187701 183736 179844 175682
54902A75682n149n798n409m617m150l856l483l253l098k465j364o62p89j085r42
$$ 175682 170533 164735 159326 154709 150559 146703 143220 139967 136869 134404 133040 132378 131589 130504 129562
54887A29562n07N8R83J999K164J251K82J16L94N66R02J681K437K819L363M551
$$ 129562 129055 129113 130096 132095 134259 135510 135792 135908 136302 136868 137770 139451 141888 144707 148070 152621
54871A52621N832O505O775O960O422M446J662n41j725k509l196l422l137k955
$$ 152621 158453 164958 171733 178693 185115 189561 191223 190682 188957 186448 183252 179830 176693 173738
54857A73738l292l857m216m265m028l470k785k425k588k873k714k079j536j564
$$ 173738 170446 166589 162373 158108 154080 150610 147825 145400 142812 139939 137225 135146 133610 132046
54843A32046j911j871j186l99j18k34k59j49k67o73j014j048p74j07Q88J532J033
$$ 132046 130135 128264 127078 126679 126561 126327 126068 125919 125652 124979 123965 122917 122143 122036 122924 124456 125489
54826A25489l42j300j055k08J52k48q49j067p31rP77J327J507J300P74K55K41
$$ 125489 125147 123847 122792 122584 122736 122488 121639 120572 119841 119832 120609 121936 123443 124743 125517 125772 126013
54809A26013P09Q50R8r01j077n17k96q46j366j138m19K28P17J135J351J290J156
$$ 126013 126722 127572 127670 126769 125692 125175 124879 124033 122667 121529 121110 121338 122055 123190 124541 125831 126987
54792A26987J077R56Q02P03N03P8j53K91R89J067N66M08Q07R21L48j78m8K73K35
$$ 126987 128064 129020 129822 130525 131028 131106 130953 131244 132233 133300 133866 134274 135081 136002 136350 136172 136124 136397 136632
54773A36632J15K43K78K8J56J175K524L444M066M789N276N110M907N599O871P438
$$ 136632 136747 136990 137268 137296 137452 138627 141151 144595 148661 153450 158726 163836 168743 174342 181213 188651
54757A88651O749N457M187K770Q31j545l961o005p260p466o779n653m468l455
$$ 188651 195400 200857 205044 207814 208645 207100 203139 197134 189874 182408 175629 169976 165508 162053
54743A62053k815k546k329j930j558j484j452r65q2N22L36m24j160j479j416j164
$$ 162053 159238 156692 154363 152433 150875 149391 147939 146974 146892 147414 147750 147326 146166 144687 143271 142107
54727A42107q39m56m6L20P19J381K335L185L493L334L242L608M356N079N299M734
$$ 142107 141268 140812 140766 141086 141805 143186 145521 148706 152199 155533 158775 162383 166739 171818 177117 181851
54711A81851L564K208P09j246l387m618m368l588l518l954l805l014k552k650
$$ 181851 185415 187623 188332 187086 183699 179081 174713 171125 167607 163653 159848 156834 154282 151632
54697A51632k440j574q25p45q95q83r60j134q42r8J85l60q58p07o09j152j526
$$ 151632 149192 147618 146793 146048 145153 144270 143310 142176 141334 141236 141421 141061 140203 139496 138887 137735 136209
54680A36209p52O16J279J023N95K96j06m38l12nj84p68j000n98l4K94M66O63R01
$$ 136209 135457 136073 137352 138375 138970 139266 139160 138722 138410 138405 138221 137453 136453 135855 135821 136115 136581 137244 138145
54661A38145J103J016K82r76j936j894j010J09J079J559J102j53j184j277r37
$$ 138145 139248 140264 140546 139570 137634 135740 134730 134839 135918 137477 138579 138426 137242 135965 135028
54646A35028q36n57N71J894K049R78M0O2M31L83J16J60M63N90L43k31r80j516
$$ 135028 134192 133635 134206 136100 138149 139127 139167 139229 139660 140043 140159 140319 140782 141372 141715 141484 140504 138988
54628A38988j363n47K80N31K74m1j81l17o63j070j000j49R77J403Q58J22k4K13
$$ 138988 137625 137078 137358 137889 138163 138122 137941 137624 136961 135891 134891 134742 135719 137122 137980 138102 138078 138291
54610A38291J71k10n03o12q43j178j169o32O6M74M96L16J56J37K08K26K28M04
$$ 138291 138462 138252 137749 137137 136294 135116 133947 133315 133381 133855 134351 134667 134823 134960 135168 135394 135622 136026
54592A36026P28Q45N33Jm25n43k02O10J404J529J086Q37Q95M05r66k013j387N57
$$ 136026 136754 137599 138132 138133 137708 137165 136963 137573 138977 140506 141592 142429 143324 143729 142763 140750 139363 139920
54574A39920K196K500J647K26j155j751j158J7P32P56O76Q11Q82P05M60K17j73
$$ 139920 142116 144616 146263 146489 145334 143583 142425 142442 143174 143930 144606 145417 146299 147004 147464 147681 147508
54557A47508o04p03l77O9L75N34N92N77N44M07o1p20r26l29N72J094J223J275
$$ 147508 146904 146201 145824 145893 146268 146802 147394 147971 148515 148922 148861 148141 147215 146886 147458 148552 149775 151050
54539A51050J201Q39M96N34P74Q69R71J264J305O50k60o45m91k65qM64P60M28
$$ 151050 152251 153090 153586 154120 154894 155763 156734 157998 159303 159953 159693 159048 158557 158292 158284 158748 159508 159936
54521A59936j27k74l42r56j604j233j12M42K21L63J198J473M00j030j568j314
$$ 159936 159809 159535 159193 158237 156633 155400 155288 155730 155951 156314 157512 158985 159385 158355 156787 155473
54505A55473j000p03k56j8k30l47J19O28M24k34n44m10l25k66L08J372K074J751
$$ 155473 154473 153770 153514 153496 153266 152919 153038 153666 154090 153856 153312 152902 152577 152311 152619 153991 156065 157816
54487A57816P76J52M30J142J241K64j060j603j181o18n02n22j95L56P84J125J567
$$ 157816 158592 158744 159174 160316 161557 161821 160761 159158 157977 157359 156857 156335 156140 156496 157280 158405 159972
54470A59972K043K403K693K864K574J637M67l07m50j58K14L09j5l84k20M43Q66
$$ 159972 162015 164418 167111 169975 172549 174186 174653 174346 173896 173738 173952 174261 174246 173862 173642 174085 174951
54453A74951N78Oj76J02M69P01P23M27q2l64k21j33o43j547k175k259k037j642
$$ 174951 175529 175535 175359 175461 175930 176631 177354 177781 177699 177335 177114 176981 176338 174791 172616 170357 168320 166678
54435A66678r79j81L03K47q5l08k64j4L03M45K25k17m98m89m84o53n78K78J587
$$ 166678 165699 165518 165821 166068 165983 165675 165411 165397 165700 166145 166370 166153 165655 165166 164682 164029 163451 163729 165316
54416A65316K237J616M45j65j55l81j157j753j573j018o54k95M62J286J456R09
$$ 165316 167553 169169 169614 169449 169294 168913 167756 166003 164430 163412 162758 162463 162925 164211 165667 166576
54400A66576K57l7J52R03J991K552J915O78J52O76J355J485J344J344J296R18
$$ 166576 166833 166796 166948 167851 169842 172394 174309 174987 175139 175815 177170 178655 179999 181343 182639 183557
54384A83557L92Pk56m64n77p34j191j711j590o48L71O96L92L3L4N22J342J896
$$ 183557 183949 183956 183700 183236 182659 181925 180734 179023 177433 176785 177156 177852 178244 178277 178311 178833 180175 182071
54366A82071J533M18m37l97O8K00n4l53o44r41q33J0J108J522R51k1o81q19o30
$$ 182071 183604 184022 183585 183188 183256 183456 183402 183049 182405 181464 180631 180641 181749 183271 184222 184201 183520 182701 182071
54347A82071l66j81r9j03k83p63j403j763j586j123q52r24j043p55M6Q89J048
$$ 182071 181705 181524 181425 181322 181039 180276 178873 177110 175524 174401 173549 172625 171582 170827 170873 171762 172810
54330A72810L28o19j029q70o53o45p60r88j272j134k21Q57J078M96K06O64R93
$$ 172810 173138 172519 171490 170620 169967 169322 168562 167574 166302 165168 164947 165804 166882 167378 167584 168248 169241
54313A69241M33m24n85o4L97M48K71l5m60p37o11k60K9K69M89M17m1l84j87J59
$$ 169241 169674 169250 168665 168601 168998 169446 169717 169682 169222 168485 167874 167614 167643 167912 168401 168818 168777 168393 168206 168365
54293A68365Ln47q30o43l31o9K28L26k10j165j582r30J40N10j83j278j873j575
$$ 168365 168368 167821 166991 166348 166017 165948 166176 166502 166292 165127 163545 162615 162755 163265 163082 161804 159931 158356
54275A58356o12M87J241J388R55K58k77m24k66N8N52J107J323R48L78K91P70J279
$$ 158356 157744 158231 159472 160860 161815 162073 161796 161372 161106 161164 161716 162823 164146 165094 165472 165763 166533 167812
54257A67812J469J498J500J275P25J07k85m04k79KJ04k26o23m51J76L94j38p48
$$ 167812 169281 170779 172279 173554 174279 174386 174101 173697 173418 173420 173524 173298 172675 172224 172400 172794 172656 171908
54239A71908q02n49m94n69m65k64j66q0K6j28n86q13m66rk4l46m25j42L24R68
$$ 171908 171106 170557 170063 169494 169029 168765 168599 168519 168545 168417 167831 167018 166552 166543 166519 166173 165748 165606 165930 166898
54219A66898J758K284K237J837J294M05q00j511j137k96k1l39n45n26p41j079
$$ 166898 168656 170940 173177 175014 176308 176713 175913 174402 173265 172969 172948 172609 172064 171538 170797 169718
54203A69718q27J23R60J068O83K82j1k07k35j43j04j41k10m72j000j347j031l90
$$ 169718 168891 169014 169974 171042 171725 172007 171996 171789 171554 171411 171307 171166 170956 170484 169484 168137 167106 166716
54185A66716k28o42r02n79q8Q6l0k32m19l50K28R01P64l31j303j112r1N78L45
$$ 166716 166488 165846 164944 164365 164277 164363 164333 164101 163682 163332 163560 164461 165225 164894 163591 162479 162388 162966 163311
54166A63311k77o06n15l30l72p20j177j371j018k33M53M82j94r59j062m18L39
$$ 163311 163034 162428 161913 161583 161211 160491 159314 157943 156925 156692 157145 157627 157433 156474 155412 154994 155333
54149A55333O24N04L36J67r8k79j33J24J05k3L26J197J859J724J027L46j10m06
$$ 155333 155957 156461 156797 156964 156866 156587 156454 156578 156683 156660 156986 158183 160042 161766 162793 163139 163029 162623
54131A62623m36k5O10R15O08Rl10j37K01K79R2M1M17J103J772K188K197J709R24
$$ 162623 162187 162162 162772 163687 164295 164304 163994 163857 164058 164337 164429 164470 164887 165990 167762 169950 172147 173856 174780
54112A74780L24J94L04K92J14q0l22p31j198j486j511j229n00N56J309J253P98
$$ 174780 175104 175298 175602 175894 176008 175928 175606 174875 173677 172191 170680 169451 168951 169507 170816 172069 172867
54095A72867Q50J592K131J620K56r80j386j093o99n82n74k94L45J037J530J837
$$ 172867 173717 175309 177440 179060 179316 178336 176950 175857 175158 174576 174002 173708 174053 175090 176620 178457
54079A78457J930J578P30j90o79o75m15l3M09P82J033J230J261Q51J94P1Q07J633
$$ 178457 180387 181965 182695 182505 181826 181151 180736 180703 181112 181894 182927 184157 185418 186269 186463 186534 187341 188974
54061A88974J740J558K127L563N008O006O962Q140R096R309Q536O450K859j399
$$ 188974 190714 192272 194399 197962 202970 208976 215938 224078 233174 242483 251019 257469 260328 258929
54047B58929m588n701n367m713l999k889j462j99P58J645K531L247L750M119M317
$$ 258929 254341 248640 243273 238560 234561 231672 230210 230011 230769 232414 234945 238192 241942 246061 250378
54032B50378M289M211M305M470M430M161L885L645L212K415J389N06J01K28N63
$$ 250378 254667 258878 263183 267653 272083 276244 280129 283774 286986 289401 290790 291296 291397 291625 292188
54017B92188O56L66r3o35j485k677l664l846l392l079l343l875m230m402m570
$$ 292188 292844 293210 293117 292482 290997 288320 284656 280810 277418 274339 270996 267121 262891 258489 253919
54002B53919m616m274l575k801k110j519j214j414j914k162j955j691j663j609
$$ 253919 249303 245029 241454 238653 236543 235024 233810 232396 230482 228320 226365 224674 223011 221402
53988B21402j248q22o04l45J35K07q04k256k649j605l81m2k04j00Qn14j297j302
$$ 221402 220154 219332 218728 218383 218518 218725 217921 215665 213016 211411 211030 210988 210784 210684 210692 210178 208881 207579
53970B07579k77J031J967K477K603K254J644J351J723K586L535M283M747N083
$$ 207579 207302 208333 210300 212777 215380 217634 219278 220629 222352 224938 228473 232756 237503 242586
53956B42586N502N783N255L612J512j15j027j513j604j185o46o48j219j673j485
$$ 242586 248088 253871 259126 262738 264250 264135 263108 261595 259991 258806 258160 257512 256293 254620 253135
53941B53135p10M50J851L096L655L526L292L420L750L844L449K634J710J043P32
$$ 253135 252425 252875 254726 257822 261477 265003 268295 271715 275465 279309 282758 285392 287102 288145 288877
53926B88877N91O95J583L439N345O060N423M430L991M248N017O208P617Q862R687
$$ 288877 289468 290163 291746 295185 300530 306590 312013 316443 320434 324682 329699 335907 343524 352386 362073
53911C62073J0037R961R771J0080J1148J2433J3410J4487J6081J6948J4670Q264
$$ 362073 372110 382071 391842 401922 413070 425503 438913 453400 469481 486429 501099 509363
53899E09363m26q273j3287j5355j5445j4703j3919j3328j2831j2348j1762j0858
$$ 509363 508937 500664 487377 472022 456577 441874 427955 414627 401796 389448 377686 366828
53887C66828r782r226r494r669q667o877n725n549n220m050k904k747l203l316
$$ 366828 357046 347820 338326 328657 319990 313113 307388 301839 296619 292569 289665 286918 283715 280399
53873B80399k995k836l036l285l396l455l461l301k851k012r32k75o31j578k022
$$ 280399 277404 274568 271532 268247 264851 261396 257935 254634 251783 249771 248839 248564 247933 246355 244333
53858B44333j675j357j549j583r42l48p16j657k049j735j629k217k896k847k029
$$ 244333 242658 241301 239752 238169 237227 236879 236163 234506 232457 230722 229093 226876 223980 221133 219104
53843B19104j086o30p56j039j020p25n27m93k98J55N01N58O65R98J100N28l83
$$ 219104 218018 217388 216632 215593 214573 213848 213321 212828 212530 212685 213186 213744 214409 215407 216507 217035 216652
53826B16652r09q21m66j89p2j11k46k97p1M88J234J780J726J217J052J710K487
$$ 216652 215743 214922 214456 214267 214195 214084 213838 213541 213470 213958 215192 216972 218698 219915 220967 222677 225164
53809B25164K424J847J948K901L610L630L923N077O027N622M446L932M353M877
$$ 225164 227588 229435 231383 234284 237894 241524 245447 250524 256551 262173 266619 270551 274904 279781
53795B79781N012M937M697M202L763L643L305K103N55r5M24J081J025M99P7k55
$$ 279781 284793 289730 294427 298629 302392 306035 309340 311443 311998 311903 312327 313408 314433 314932 315009 314754
53779C14754q89j945l093l870m077m076m440n144n444m891m077l822m050m105
$$ 314754 313865 311920 308827 304957 300880 296804 292364 287220 281776 276885 272808 268986 264936 260831
53765B60831l828l516l083k111q02m9l84j387k298k730k662k244j754j434j229
$$ 260831 257003 253487 250404 248293 247491 247442 247058 245671 243373 240643 237981 235737 233983 232549 231320
53750B31320q94l97O7L49M20K93J14J84N66Q42N20m06j483k219k302j746j060
$$ 231320 230426 230029 230096 230445 230865 231158 231272 231456 232022 232864 233384 232978 231495 229276 226974 225228 224168
53733B24168q34r46o03M95J615J973J774J642J606J302P57L72L68Q54J966L385
$$ 224168 223334 222388 221785 222280 223895 225868 227642 229284 230890 232192 232949 233321 233689 234543 236509 239894
53717B39894M195L926L297L071K802J641P0m23P11K468L662M028L825L273K633
$$ 239894 244089 248015 251312 254383 257185 258826 258896 258473 259184 261652 265314 269342 273167 276440 279073
53702B79073K202K047K137K615L492M218M288L990L860L700K980K000J613J875
$$ 279073 281275 283322 285459 288074 291566 295784 300072 304062 307922 311622 314602 316602 318215 320090
53688C20090J978J597J238J185J103Q72Q62J086J001N01J58J34k49j359k451k606
$$ 320090 322068 323665 324903 326088 327191 328063 328925 330011 331012 331513 331671 331805 331556 330197 327746 325140
53672C25140j898j109p46q06j065j191r23m26j75l91r13j606k379k827k520j740
$$ 325140 323242 322133 321387 320581 319516 318325 317402 316976 316801 316410 315497 313891 311512 308685 306165 304425
53656C04425j186r02k77P31J271Q11j20q40j322j615j341l58O62J090J196J537
$$ 304425 303239 302337 302060 302791 304062 304873 304753 303913 302591 300976 299635 299277 299939 301029 302225 303762
53640C03762J920J715R05J93J63P78J571J967J669R83O32R79J682K226K480K523
$$ 303762 305682 307397 308302 308495 308658 309436 311007 312974 314643 315626 316258 317237 318919 321145 323625 326148
53624C26148K398K236K285K513K656K786L335M263M841M654M302M573N339N830
$$ 326148 328546 330782 333067 335580 338236 341022 344357 348620 353461 358115 362417 366990 372329 378159
53610C78159N706N293N021N033N247N417N234M645L949L454L241L349L776M167
$$ 378159 383865 389158 394179 399212 404459 409876 415110 419755 423704 427158 430399 433748 437524 441691
53596D41691L994L334L011L536M356M525L817K679J454R1j470l092m565n679o304
$$ 441691 445685 449019 452030 455566 459922 464447 468264 470943 472397 472488 471018 467926 463361 457682 451378
53581D51378o494o392n985n209m324l740l480l248l033l054l041k388j260o48
$$ 451378 444884 438492 432507 427298 422974 419234 415754 412506 409473 406419 403378 400990 399730 399082
53567C99082r25j151n56J11l11j518k068j352k34L83O41J107J748K005J587Q49
$$ 399082 398157 397006 396450 396561 396250 394732 392664 391312 391078 391461 392102 393209 394957 396962 398549 399398
53551C99398M09N28R17J179J365J799K462K913K924K809K935L363M052M955N718
$$ 399398 399807 400335 401252 402431 403796 405595 408057 410970 413894 416703 419638 423001 427053 432008 437726
53536D37726N899N745O121P300Q523R229R933J1174J2379J2699J2477J2769J3723
$$ 437726 443625 449370 455491 462791 471314 480543 490476 501650 514029 526728 539205 551974 565697
53523E65697J4483J4644J4797J5473J6413J7142J7605J8019J8602J9645K1332
$$ 565697 580180 594824 609621 625094 641507 658649 676254 694273 712875 732520 753852
53512G53852K3392K5281K6797K8123K9271L0016L0278L0199K9787K9030K8284
$$ 753852 777244 802525 829322 857445 886716 916732 947010 977209 1006996 1036026 1064310
53501A064310K7983K7902K7338K6151K5048K4608K4550K4282K3730K3271K3031
$$ 1064310 1092293 1120195 1147533 1173684 1198732 1223340 1247890 1272172 1295902 1319173 1342204
53490A342204K2669K1804K0528J9525J9484K0307K0981K0692J9856J9617K0313
$$ 1342204 1364873 1386677 1407205 1426730 1446214 1466521 1487502 1508194 1528050 1547667 1567980
53479A567980K0950K0339J8315J5646J3132J1091R377P576N266K352q59m025p158
$$ 1567980 1588930 1609269 1627584 1643230 1656362 1667453 1676830 1684406 1689672 1692024 1691165 1687140 1679982
53466A679982j0527j4160j7467j9510j9902j9352j9061j9495k0163k0690k1572
$$ 1679982 1669455 1655295 1637828 1618318 1598416 1579064 1560003 1540508 1520345 1499655 1478083
53455A478083k3394k5799k7753k8659k8620k7903k6794k5842k5474k5371k4813
$$ 1478083 1454689 1428890 1401137 1372478 1343858 1315955 1289161 1263319 1237845 1212474 1187661
53444A187661k3658k2395k1149j9360j6661j3494j0609q425p030o254n504m083
$$ 1187661 1164003 1141608 1120459 1101099 1084438 1070944 1060335 1051910 1044880 1038626 1033122 1029039
53432A029039j944J82J734K961M408O192Q079R937J1790J3670J5610J7577J9389
$$ 1029039 1027095 1027277 1029011 1031972 1036380 1042572 1050651 1060588 1072378 1086048 1101658 1119235 1138624
53419A138624K0960K2567K4360K5734K5979K5628K6201K8252L0624L2299L3937
$$ 1138624 1159584 1182151 1206511 1232245 1258224 1283852 1310053 1338305 1368929 1401228 1435165
53408A435165L6575L9608M1432M1857M2497M4668M8053N1652N5036N8171O0823
$$ 1435165 1471740 1511348 1552780 1594637 1637134 1681802 1729855 1781507 1836543 1894714 1955537
53397A955537O2773O4167O5256O6142O7000O8065O9080O9373O8764O7835O6825
$$ 1955537 2018310 2082477 2147733 2213875 2280875 2348940 2418020 2487393 2556157 2623992 2690817
53386B690817O5003O1791N7955N4818N2612N0383M7457M3964M0029L5367L0080
$$ 2690817 2755820 2817611 2875566 2930384 2982996 3033379 3080836 3124800 3164829 3200196 3230276
53375C230276K5024K0863J7275J3501R206M220k122j0668k1385l3056m4086n3440
$$ 3230276 3255300 3276163 3293438 3306939 3316145 3320365 3318243 3307575 3286190 3253134 3209048 3155608
53363C155608o0838o6417p0303p2479p3069p2703p2239p1957p1310o9691o7231
$$ 3155608 3094770 3028353 2958050 2885571 2812502 2739799 2667560 2595603 2524293 2454602 2387371
53352B387371o4517o1854n9249n6858n5047n3990n3594n3663n3766n3143n1306
$$ 2387371 2322854 2261000 2201751 2144893 2089846 2035856 1982262 1928599 1874833 1821690 1770384
53341A770384m8655m6029m3670m1163l8344l5587l3043l0288k6964k3256j9524
$$ 1770384 1721729 1675700 1632030 1590867 1552523 1516936 1483893 1453605 1426641 1403385 1383861
53330A383861j5979j3076j1568j1730j2868j4071j5002j5553j5195j3431j0699
$$ 1383861 1367882 1354806 1343238 1331508 1318640 1304569 1289567 1274014 1258819 1245388 1234689
53319A234689q188o707o254o431o718o364m764k234J16J587K618M045N930P586
$$ 1234689 1226501 1219794 1213540 1207109 1200391 1194027 1189263 1187029 1187145 1188732 1191350 1195395 1201325 1208911
53305A208911Q616R490J1006J3384J6102J8434K0008K0989K1956K3599K6173K9168
$$ 1208911 1217527 1227017 1238023 1251407 1267509 1285943 1305951 1326940 1348896 1372495 1398668 1427836
53293A427836L1666L3254L4293L5178L5680L5396L4454L3179L1388K8766K5818
$$ 1427836 1459502 1492756 1527049 1562227 1597907 1633303 1667757 1700936 1732324 1761090 1786908
53282A786908K3592K2208K0576J7786J4051R895N267K03m359p387r079j0598j2707
$$ 1786908 1810500 1832708 1853284 1871070 1885121 1895016 1900283 1900486 1896127 1888740 1879661 1869063 1856356
53269A856356j5405j8638k2506k6665l0276l2774l4267l5130l5643l6098l6779
$$ 1856356 1840951 1822313 1799807 1773142 1742866 1710092 1675825 1640695 1605052 1568954 1532175
53258A532175l7733l8806l9905m0906m1330m0575l8549l5807l3119l1134l0199
$$ 1532175 1494442 1455636 1415731 1374825 1333495 1292920 1254371 1218564 1185445 1154311 1124112
53247A124112l0079l0012k9544k9138k9459l0231l0513k9990k9163k8248k6785
$$ 1124112 1094033 1064021 1034477 1005339 975880 945649 915136 885146 855983 827735 800950
53236H00950k4595k2227k0025j7528j4466j1638j0000r298q517p451o952p548
$$ 800950 776355 754128 734103 716575 702109 690471 680471 671173 662656 655205 648253 640705
53224F40705q653r415r807j0398j1382j2350j2904j3119j3305j3553j3714j3616
$$ 640705 632052 622637 612830 602432 591050 578700 565796 552677 539372 525819 512105 498489
53212D98489j3137j2101j0467q665p469p258p567p616p207o806o813p075p204
$$ 498489 485352 473251 462784 454119 446650 439392 431825 424209 417002 410196 403383 396308 389104
53199C89104p093o946o947p064p121p052o995p128p318p161o482n557m687l774
$$ 389104 382011 375065 368118 361054 353933 346881 339886 332758 325440 318279 311797 306240 301553 297779
53185B97779k665j687j289j320j182p88p15j206j603j224l70R3r8m27n40p16j218
$$ 297779 295114 293427 292138 290818 289636 288848 288133 286927 285324 284100 283730 283823 283725 283298 282758 282042 280824
53168B80824j641j358m44K86L09P5L37R99J059q0j734k714k723k437k354k173
$$ 280824 279183 277825 277381 277667 277976 278051 278388 279387 280446 280366 278632 275918 273195 270758 268404 266231
53152B66231j507o79l90q24j494j825j656j185p41n05l66m7M70P72N05m5k43J03
$$ 266231 264724 264045 263655 262831 261337 259512 257856 256671 255930 255425 255059 255012 255482 256254 256759 256714 256471 256574
53134B56574N24O08N20N79O34K88l57o90l85K01N91P03O46L82K9J13R67K054K452
$$ 256574 257098 257706 258226 258805 259439 259727 259370 258680 258295 258496 259087 259790 260436 260818 260847 260960 261927 263981 266433
53115B66433J973J272Q58N78K16PK52P71J072Q32O9r18j670j978k173k647l106
$$ 266433 268406 269678 270536 271114 271330 271337 271589 272360 273432 274264 274333 273415 271745 269767 267594 264947 261841
53098B61841k874k013j382j347j259n89K00N39P29J235J675J372N29j04l32m35
$$ 261841 258967 256954 255572 254225 252966 252377 252577 253116 253845 255080 256755 258127 258656 258552 258220 257785
53082B57785k51N55J544J777J093K27l52p76r91o36J11M53J01l60m52l52k28J25
$$ 257785 257534 258089 259633 261410 262503 262730 262378 261602 260611 259975 260086 260539 260640 260280 259828 259476 259248 259373
53064B59373N68M24n06j458j742j571j393j082m94j85o84j446j359j68J243J917
$$ 259373 259941 260365 259859 258401 256659 255088 253695 252613 252119 251934 251250 249804 248445 248277 249520 251437
53048B51437J656Q91J93j26j99m05q32j137j116j011j002p95j84L45J54n91j049
$$ 251437 253093 253984 254177 254051 253852 253447 252615 251478 250362 249351 248349 247554 247370 247715 247869 247278 246229
53031B46229q16m09n18j127j573j322n06L21Q97J417J925J861P92n90r73n0R80
$$ 246229 245413 245004 244486 243359 241786 240464 239958 240279 241176 242593 244518 246379 247171 246581 245608 245558 246538
53014B46538R29k5q89j066n47N14J648J905P89p34r90M60K255K762J743L73r4
$$ 246538 247467 247442 246553 245487 244940 245454 247102 249007 249796 249062 248072 248532 250787 253549 255292 255665 255571
52997B55571M81J055N31r10j853j280J31Q83N67J61M32R18Q28K79J0K57N59N93
$$ 255571 256052 257107 257638 256728 254875 253595 253726 254609 255176 255337 255769 256687 257515 257794 257804 258061 258620 259213
52979B59213N97R13J491K028K315K256J804J110O26P66J474K269K742K779K397
$$ 259213 259810 260723 262214 264242 266557 268813 270617 271727 272353 273119 274593 276862 279604 282383 284780
52964B84780J685J014R63J658K414K359J346l8j164j752j781j465j324j730k447
$$ 284780 286465 287479 288442 290100 292514 294873 296219 296181 295017 293265 291484 290019 288695 286965 284518
52949B84518k916l029l115l200k868k037j313j253j668j961j802j267o21j83p6
$$ 284518 281602 278573 275458 272258 269390 267353 266040 264787 263119 261158 259356 258089 257468 257285 257209
52934B57209ML79P27L05r11k031k400k347k334k119j388n98l80m69j33O62J280
$$ 257209 257213 257592 258319 258624 257713 255682 253282 250935 248601 246482 245094 244496 244116 243647 243514 244176 245456
52917B45456J468J493J336O43l91r61o74p3K66M41P60J046Q74K54l49m97j35L60
$$ 245456 246924 248417 249753 250396 250005 249044 248370 248297 248563 249004 249764 250810 251684 251938 251589 251092 250957 251317
52899B51317L96k86j193j482r90m16l31l95k5N56N56j54p05l76L71M27n41j662
$$ 251317 251713 251427 250234 248752 247762 247346 247015 246620 246595 247151 247707 247553 246848 246472 246843 247270 246729 245067
52881B45067j896j195l37R8K73N79R66J000M65l13p02l05O74J602K027K159K602
$$ 245067 243171 241976 241639 241737 242010 242589 243555 244555 245020 244707 244005 243700 244374 245976 248003 250162 252764
52864B52764L519M267M092K976J603N24l35j216j874j752p87K72O55M24K10J28
$$ 252764 256283 260550 264642 267618 269221 269745 269410 268194 266320 264568 263781 264053 264708 265132 265342 265470
52848B65470m30j699k863l011k379k032k477l276l913m275m199l382j999q57m78
$$ 265470 265040 263341 260478 257467 255088 253056 250579 247303 243390 239115 234916 231534 229535 228678 228200
52833B28200n42n03k66L9N09J178J734J892J786J583J117K73n96j082j258j385
$$ 228200 227658 227155 226889 226928 227437 228615 230349 232241 234027 235610 236727 237000 236404 235322 234064 232679
52817B32679j391j080o11l08j60O1L90P40J152J588J718J395J138J528K249K279
$$ 232679 231288 230208 229597 229289 229129 229190 229580 230320 231472 233060 234778 236173 237311 238839 241088 243367
52801B43367J144m32j262r22r8J51m96j350j628j474j592k021k049j475j049j213
$$ 243367 244511 244079 242817 241895 241797 241948 241452 240102 238474 237000 235408 233387 231338 229863 228814 227601
52785B27601j252m51O26R20M42J10L71R24J527K099K198J407K30m12n20q77j512
$$ 227601 226349 225898 226524 227444 227886 227996 228367 229291 230818 232917 235115 236522 236752 236340 235820 234943 233431
52768B33431j445k79R53J121L99l21o45p06m81J40Q49J069O08k05r57j406j424
$$ 233431 231986 231707 232660 233781 234180 233859 233214 232508 232027 232167 233016 234085 234693 234488 233531 232125 230701
52751B30701r13R8J293K068J878Q73L1K35J277K139K207J825J567J519J457J300
$$ 230701 229788 229886 231179 233247 235125 235998 236029 236264 237541 239680 241887 243712 245279 246798 248255 249555
52735B49555J195J288J585J841J691J170Q97J404K384L009K910K275J214k69j694
$$ 249555 250750 252038 253623 255464 257155 258325 259222 260626 263010 266019 268929 271204 272418 272149 270455
52720B70455k324k078j662j547j552j546j799k292k489k231k105k402k377j335
$$ 270455 268131 266053 264391 262844 261292 259746 257947 255655 253166 250935 248830 246428 244051 242716
52706B42716R9O36J1q19r98o36k84k05l23m49l74j3L92M96L07K53O57J308J638
$$ 242716 242815 243451 243462 242643 241645 241009 240725 240520 240197 239748 239374 239361 239753 240249 240556 240809 241466 242774 244412
52687B44412J308N59J0Q6O77J300J539J244N32j60k45M30J186J094K1j207j716
$$ 244412 245720 246279 246289 246375 247052 248352 249891 251135 251667 251507 251262 251692 252878 253972 253993 252786 251070
52670B51070j333m52M03P56L86l67p87m98J87P18Q08M52j31m23R2J268K313K664
$$ 251070 249737 249285 249688 250444 250830 250463 249676 249178 249365 250083 250891 251343 251212 250789 250881 252149 254462 257126
52652B57126K583K607K782K773K369J571L60j169k624l528l625k862j352M07J579
$$ 257126 259709 262316 265098 267871 270240 271811 272171 271002 268378 264850 261225 258363 257011 257418 258997
52637B58997J656R98L85J44kl33p05p46k60N88J387J764J672J436J385J491J354
$$ 258997 260653 261651 262036 262180 262178 261845 261140 260394 260134 260722 262109 263873 265545 266981 268366 269857 271211
52620B71211O14o46j808k236j973j694j847k080j831j169o01k31K42P94J025Q79
$$ 271211 271825 271179 269371 267135 265162 263468 261621 259541 257710 256541 255940 255709 255951 256745 257770 258649
52604B58649P69Q14O44K12J28O98J247R55l4p80o38K84J497K497K882K484J458
$$ 258649 259418 260232 260876 261088 261216 261914 263161 264116 264082 263302 262664 262948 264445 266942 269824 272308 273766
52587B73766J38j030j466q46L17R13M64k27k6J108K066J790L23j252j723q19N29
$$ 273766 273904 272874 271408 270562 270879 271792 272256 272029 272003 273111 275177 276967 277290 276038 274315 273496 274025
52570B74025J135Q41M72N81Q32P52M37J30k94r16j320j143p08n66o87o93o30q65
$$ 274025 275160 276001 276473 277054 277886 278638 279075 279205 278911 277995 276675 275532 274824 274258 273571 272878 272248 271383
52552B71383j373j669j450r28n55o59j164j481r69K03R98P46l7m16k61j10j68
$$ 271383 270010 268341 266891 265963 265408 264749 263585 262104 261135 261338 262336 263082 263045 262629 262368 262258 262090
52535B62090k23k47l71l74J03Q49J199R36N40N08Q81J425J804J597O71m69j110
$$ 262090 261867 261620 261249 260875 260978 261827 263026 263962 264502 265010 265891 267316 269120 270717 271388 270919 269809
52518B69809j084p19j82N62J271J560J579J871K490K869K761K673L073L715M032
$$ 269809 268725 268006 267824 268386 269657 271217 272796 274667 277157 280026 282787 285460 288533 292248 296280
52503B96280L739K777J122r01k477k960k569k094k041k295k512k518k344k112
$$ 296280 300019 302796 303918 303017 300540 297580 295011 292917 290876 288581 286069 283551 281207 279095
52489B79095j947j896j866j645j024p0P32Q43L25o4K61R77J306J062P77P90P52
$$ 279095 277148 275252 273386 271741 270717 270647 271379 272222 272547 272483 272744 273721 275027 276089 276866 277656 278408
52472B78408K70l34k71P45K072K720K319J457R92J182J636K007K307K516K388
$$ 278408 278678 278344 278073 278818 280890 283610 285929 287386 288378 289560 291196 293203 295510 298026 300414
52457C00414J922J565J515J231K06j144k020k366k739l180l111k399j716j535
$$ 300414 302336 303901 305416 306647 306853 305709 303689 301323 298584 295404 292293 289894 288178 286643
52443B86643j472j039m87m39j044j887k454k431j820j054p21r07j086q83n55m60
$$ 286643 285171 284132 283645 283206 282162 280275 277821 275390 273570 272516 271795 270888 269802 268919 268364 267904
52427B67904m12l3N05O40K83K3L79J143J688J689J392J246J435J779J983J986
$$ 267904 267492 267459 267964 268604 268887 268910 269289 270432 272120 273809 275201 276447 277882 279661 281644 283630
52411B83630K055K603L828N440O890P984R243J1371J4198J6432J6593J4069R229
$$ 283630 285685 288288 292116 297556 304446 312430 321673 333044 347242 363674 380267 394336 403565
52398D03565K975l514q913j2279j3516j3133j1735r936q358p136n678l518j291
$$ 403565 406540 403026 394113 381834 368318 355185 343450 333514 325156 318020 312342 308824 307533
52385C07533j64k95o34l92R0K53L33Q79J740K291K375K475K929L485L723L598
$$ 307533 307369 307074 306440 306048 306138 306391 306724 307603 309343 311634 314009 316484 319413 322898 326621 330219
52369C30219L477L748M402M994N069M630M006L281K156N38j077k047k200j778
$$ 330219 333696 337444 341846 346840 351909 356539 360545 363826 365982 366520 365443 363396 361196 359418
52355C59418j064l01J96K54P5lR3K55N30J025J542J759J763K062K863L690L998
$$ 359418 358354 358053 358249 358503 358578 358575 358668 358923 359453 360478 362020 363779 365542 367604 370467 374157 378155
52338C78155L969M253N066N963O599P293Q448R777J0581J0781J1111J2170J3759
$$ 378155 382124 386377 391443 397406 404005 411298 419746 429523 440104 450885 461996 474166 487925
52325D87925J5410J7019J8581J9714K0127K0353K1286K2885K3910K3294K1381
$$ 487925 503335 520354 538935 558649 578776 599129 620415 643300 667210 690504 711885
52314G11885J9530J8734J8889J9199J8974J8081J6848J5685J4810J4238J3905
$$ 711885 731415 750149 769038 788237 807211 825292 842140 857825 872635 886873 900778
52303I00778J3686J3351J2682J1609J0230Q793P551O550N469L946K075J75j894
$$ 900778 914464 927815 940497 952106 962336 971129 978680 985230 990699 994645 996720 996895 995001
52290I95001m581p539r459r634r137r502j0677j1233j0406q886p524o342n080
$$ 995001 990420 982881 973422 963788 954651 945149 934472 923239 912833 903947 896423 890081 885001
52277H85001l714k025M73L642O499Q393R711J1004J2157J3045J4203J5916J7240
$$ 885001 881287 879262 879735 883377 889876 898269 907980 918984 931141 944186 958389 974305 991545
52264I91545J6926J5115J3197J2181J1915J1814J1560J1041J0299R667R424R308
$$ 991545 1008471 1023586 1036783 1048964 1060879 1072693 1084253 1095294 1105593 1115260 1124684 1133992
52252A133992Q857Q121P484O883N897M500K937Q89k285o208r340j0782j1460j2763
$$ 1133992 1142849 1150970 1158454 1165337 1171234 1175734 1178671 1179560 1177275 1171067 1161727 1150945 1139485 1126722
52238A126722j4594j5651j5313j4341j3692j3449j3139j2530j1782j1046j0232
$$ 1126722 1112128 1096477 1081164 1066823 1053131 1039682 1026543 1014013 1002231 991185 980953
52227I80953r128p690o329n679n807n854m863k954j170j57M52J230K165L009L794
$$ 980953 971825 964135 957806 952127 946320 940466 935603 932649 931479 931322 931774 933004 935169 938178 941972
52212I41972M518M803M526M437N368P017Q192Q233P494O442N128L695K585J924
$$ 941972 946490 951293 955819 960256 965624 972641 980833 989066 996560 1003002 1008130 1011825 1014410 1016334
52198A016334J356Q46R23J717K484K672K717L144L552L372L039L405M273M653
$$ 1016334 1017690 1018536 1019459 1021176 1023660 1026332 1029049 1032193 1035745 1039117 1042156 1045561 1049834 1054487
52184A054487M249L658L044J805k50k413m215o059q249j0130j0897j0660j0073
$$ 1054487 1058736 1062394 1065438 1067243 1066993 1064580 1060365 1054306 1046057 1035927 1025030 1014370 1004297
52171A004297r353q284o842n247l618k029p02K39R96J736K300K641L226M424N686
$$ 1004297 994944 986660 979818 974571 970953 968924 968222 968461 969457 971193 973493 976134 979360 983784 989470
52156I89470N901M675K799J369P13L40k50q16o12N89J849J923P89j79J66J404
$$ 989470 995371 1000046 1002845 1004214 1004927 1005267 1005017 1004201 1003589 1004178 1006027 1007950 1008739 1008560 1008726 1010130
52140A010130K244K162J789J845K323K762K880K742K653L041M225O129Q339J0559
$$ 1010130 1012374 1014536 1016325 1018170 1020493 1023255 1026135 1028877 1031530 1034571 1038796 1044925 1053264 1063823
52126A063823J2906J5703J8987K2345K5291K7810L0313L2887L4815L5276L4366
$$ 1063823 1076729 1092432 1111419 1133764 1159055 1186865 1217178 1250065 1284880 1320156 1354522
52115A354522L2990L1639K9868K7237K4202K1569J9421J7134J4333J1250Q177
$$ 1354522 1387512 1419151 1449019 1476256 1500458 1522027 1541448 1558582 1572915 1584165 1592342
52104A592342N062J876j012l049m056m358m435m547m726n063n780o827p685p908
$$ 1592342 1597404 1599280 1598268 1595219 1591163 1586805 1582370 1577823 1573097 1568034 1562254 1555427 1547742 1539834
52090A539834p907q684j0675j3251j5541j7375j8988k0112j9941j8042j4902j1445
$$ 1539834 1531927 1523243 1512568 1499317 1483776 1466401 1447413 1427301 1407360 1389318 1374416 1362971
52078A362971q166m854j167K648N688P275P799Q429R967J2164J4239J5720J6693
$$ 1362971 1354805 1349951 1348784 1351432 1357120 1364395 1372194 1380623 1390590 1402754 1416993 1432713 1449406
52065A449406J7488J8320J8975J8835J7502J5444J3599J2265J0853Q955P011N526
$$ 1449406 1466894 1485214 1504189 1523024 1540526 1555970 1569569 1581834 1592687 1601642 1608653 1614179
52053A614179M200K502O57p02j680l137n528q331j0832j2981j5245j7916k0741
$$ 1614179 1618379 1620881 1621538 1620836 1619156 1616019 1610491 1602160 1591328 1578347 1563102 1545186 1524445
$$ [...]
##END NTUPLES=NMR SPECTRUM
##END=
