##TITLE=AC1467_PERAH13298_8011979_n90bSVSN3g
##JCAMPDX= 6.0         $$ Bruker NMR JCAMP-DX V2.0
##DATA TYPE= NMR SPECTRUM
##DATA CLASS= NTUPLES
##ORIGIN= BRUKER
##OWNER= Administrator
$$ 1.72 TOPSPIN		Version 2.1
$$ 2013-07-05 19:59:03.071 -0700  Administrator@X
$$ Compression mode = diff/dup
##.OBSERVE FREQUENCY= 400.02188249412
##.OBSERVE NUCLEUS= ^1H
##.ACQUISITION MODE= SIMULTANEOUS (DQD)
##.ACQUISITION SCHEME= undefined
##.AVERAGES= 8
##.DIGITISER RES= 22
##SPECTROMETER/DATA SYSTEM= spect
##.PULSE SEQUENCE= zg30
##.SOLVENT NAME= COFFEE_meoh
##.SHIFT REFERENCE= INTERNAL, COFFEE_meoh, 1, 14.98509
##AUDIT TRAIL= $$ (NUMBER, WHEN, WHO, WHERE, PROCESS, VERSION, WHAT)
$$ ##TITLE= Audit trail, TOPSPIN		Version 2.1
$$ ##JCAMPDX= 5.01
$$ ##ORIGIN= Bruker BioSpin GmbH
$$ ##OWNER= Administrator
$$ $$ E:\/data/COFFEE/nmr/AC1467_PERAH13298_8011979_n90bSVSN3g/10/pdata/1/auditp.txt
$$ ##AUDIT TRAIL=  $$ (NUMBER, WHEN, WHO, WHERE, PROCESS, VERSION, WHAT)
(   1,<2013-07-05 19:58:55.696 -0700>,<Administrator>,<X>,<go>,<TOPSPIN 2.1>,
      <created by zg
	started at 2013-07-05 19:57:49.227 -0700,
	POWCHK enabled, PULCHK disabled,
       configuration hash MD5:
       C8 4E 4E 5D D3 5C D8 9E 9F 52 82 E0 59 8A DE 15
       data hash MD5: 64K
       C4 DE 8B D2 9E FC 94 2A AD 6F C8 68 E8 E3 BB DB>)
(   2,<2013-07-05 19:58:58.930 -0700>,<Administrator>,<X>,<proc1d>,<TOPSPIN 2.1>,
      <Start of raw data processing
       efp LB = 0 FT_mod = 6 PKNL = 1 PHC0 = 0 PHC1 = 0 SI = 32K 
       data hash MD5: 32K
       3E 06 15 DC 0D 6E 29 1F 0C 7B 0E DF A9 88 2B 1F>)
(   3,<2013-07-05 19:58:59.274 -0700>,<Administrator>,<X>,<proc1d>,<TOPSPIN 2.1>,
      <pk PHC0 = 92.70264 PHC1 = 0 
       data hash MD5: 32K
       C4 7F 73 F0 4E 4B E7 B2 59 74 14 FD D7 16 D3 9F>)
(   4,<2013-07-05 19:58:59.446 -0700>,<Administrator>,<X>,<proc1d>,<TOPSPIN 2.1>,
      <abs ABSG = 1 
       data hash MD5: 32K
       C8 E2 F8 DC E5 F4 72 C1 E6 9C D9 AF 7C FC 3A A3>)
(   5,<2013-07-05 19:58:59.524 -0700>,<Administrator>,<X>,<proc1d>,<TOPSPIN 2.1>,
      <abs ABSG = 2 
       data hash MD5: 32K
       65 C6 83 DB 62 19 13 B6 DD 50 80 46 A2 B2 13 F5>)
(   6,<2013-07-05 19:58:59.618 -0700>,<Administrator>,<X>,<proc1d>,<TOPSPIN 2.1>,
      <abs ABSG = 3 
       data hash MD5: 32K
       6A BD DA 82 59 C2 E3 79 A2 7D 46 3A 32 7E 38 A5>)
(   7,<2013-07-05 19:58:59.680 -0700>,<Administrator>,<X>,<proc1d>,<TOPSPIN 2.1>,
      <abs ABSG = 4 
       data hash MD5: 32K
       8D DE 19 66 0A E2 77 64 D2 CE 23 E8 D1 A2 64 95>)
(   8,<2013-07-05 19:58:59.727 -0700>,<Administrator>,<X>,<proc1d>,<TOPSPIN 2.1>,
      <abs ABSG = 5 
       data hash MD5: 32K
       4D FA BB DF 84 6F 4B 7C 41 57 49 8C D6 3E 1C DE>)
$$ ##END=
$$ 
$$ $$ hash MD5
$$ $$ 3C 80 50 88 B3 D9 00 6D C3 20 BB 49 3B E4 9D 79
##$RELAX= 
##$RELAX= 
##$RELAX= 
##$RELAX= 
##$RELAX= 
##$RELAX= 
##$RELAX= 
$$ Bruker specific parameters
$$ --------------------------
##$DU= <E:\>
##$EXPNO= 10
##$NAME= <AC1467_PERAH13298_8011979_n90bSVSN3g>
$$ [...]
150 150 150 150 150 150 150 150
##$TP07= 0
##$TPNAME0= <>
##$TPNAME1= <>
##$TPNAME2= <>
##$TPNAME3= <>
##$TPNAME4= <>
##$TPNAME5= <>
##$TPNAME6= <>
##$TPNAME7= <>
##$TPOAL= (0..7)
0.5 0.5 0.5 0.5 0.5 0.5 0.5 0.5
##$TPOFFS= (0..7)
0 0 0 0 0 0 0 0
##$TUNHIN= 0
##$TUNHOUT= 0
##$TUNXOUT= 0
##$USERA1= <user>
##$USERA2= <user>
##$USERA3= <user>
##$USERA4= <user>
##$USERA5= <user>
##$V9= 5
##$VALIST= <valist>
##$VCLIST= <CCCCCCCCCCCCCCC>
##$VD= 0
##$VDLIST= <DDDDDDDDDDDDDDD>
##$VPLIST= <PPPPPPPPPPPPPPP>
##$VTLIST= <TTTTTTTTTTTTTTT>
##$WBST= 1024
##$WBSW= 4
##$XGAIN= (0..3)
0 0 0 0
##$XL= 0
##$YL= 0
##$YMAX_a= 587178
##$YMIN_a= -499555
##$ZGOPTNS= <>
##$ZL1= 120
##$ZL2= 120
##$ZL3= 120
##$ZL4= 120
##$ABSF1= 14.98509
##$ABSF2= -5.573092
##$ABSG= 5
##$ABSL= 3
##$ALPHA= 0
##$AQORDER= 0
##$ASSFAC= 0
##$ASSFACI= 0
##$ASSFACX= 0
##$ASSWID= 0
##$AUNMP= <proc_prof1d_extract_pilot.lims>
##$AXLEFT= 0
##$AXNAME= <>
##$AXNUC= <1H>
##$AXRIGHT= 0
##$AXTYPE= 0
##$AXUNIT= <>
##$AZFE= 0.1
##$AZFW= 0.1
##$BCFW= 0
##$BC_mod= 0
##$BYTORDP= 0
##$COROFFS= 0
##$CY= 15
##$DATMOD= 1
##$DC= 0
##$DFILT= <>
##$DTYPP= 0
##$F1P= 0
##$F2P= 0
##$FCOR= 0.5
##$FTSIZE= 32768
##$FT_mod= 6
##$GAMMA= 0
##$GB= 0
##$INTBC= 1
##$INTSCL= 1
##$ISEN= 128
##$LB= 0
##$LEV0= 0
##$LPBIN= 0
##$MAXI= 10000
##$MC2= 0
##$MEAN= 0
##$ME_mod= 0
##$MI= 0
##$NCOEF= 0
##$NC_proc= -8
##$NLEV= 6
##$NOISF1= 0
##$NOISF2= 0
##$NSP= 0
##$NTH_PI= 0
##$NZP= 0
##$OFFSET= 14.98509
##$PC= 1
##$PHC0= 92.70264
##$PHC1= 0
##$PH_mod= 1
##$PKNL= yes
##$PPARMOD= 0
##$PPDIAG= 0
##$PPIPTYP= 0
##$PPMPNUM= 2147483647
##$PPRESOL= 1
##$PSCAL= 4
##$PSIGN= 0
##$PYNMP= <proc.py>
##$REVERSE= no
##$SF= 400.02
##$SI= 32768
##$SIGF1= 0
##$SIGF2= 0
##$SINO= 400
##$SIOLD= 32768
##$SPECTYP= <>
##$SREGLST= <1H.CDCl3>
##$SSB= 0
##$STSI= 32768
##$STSR= 0
##$SW_p= 8223.68421052631
##$SYMM= 0
##$S_DEV= 0
##$TDeff= 65536
##$TDoff= 0
##$TI= <>
##$TILT= no
##$TM1= 0
##$TM2= 0
##$TOPLEV= 0
##$USERP1= <user>
##$USERP2= <user>
##$USERP3= <user>
##$USERP4= <user>
##$USERP5= <user>
##$WDW= 1
##$XDIM= 32768
##$YMAX_p= 468473899
##$YMIN_p= -652812
##$CURPLOT= <Network HP LaserJet P1505>
##$CURPRIN= <$Network HP LaserJet P1505>
##$DFORMAT= <normdp>
##$LAYOUT= <+/1D_H.xwp>
##$LFORMAT= <normlp>
##$PFORMAT= <normpl>
##$SURQMSG= 1
$$ End of Bruker specific parameters
$$ ---------------------------------
##NTUPLES= NMR SPECTRUM
##VAR_NAME=  FREQUENCY,     SPECTRUM/REAL,   SPECTRUM/IMAG
##SYMBOL=    X,             R,               I
##VAR_TYPE=  INDEPENDENT,   DEPENDENT,       DEPENDENT
##VAR_FORM=  AFFN,          ASDF,            ASDF
##VAR_DIM=   32768,         32768,           32768
##UNITS=     HZ,            ARBITRARY UNITS, ARBITRARY UNITS
##FACTOR=    0.250966925370066, 1,           1
##FIRST=     8223.43324360094, -186510,      -133873
##LAST=      0,             41079,           -214526
##MIN=       0,             -652812,         0
##MAX=       8223.43324360094, 468473899,    0
$$ Real data points
##PAGE= N=1
##DATA TABLE= (X++(R..R)), XYDATA
$$ [...]
19561a94838F8116d8729m3939A02895c6968B10825B1603q669b10702g5435A00516
19549b34360c8183k08863g9121G311c89449C27437q5376A01636h3080A31635i6417
19537a15116j94588f704j91599C25463j38734b44652H2486b13714e5670a9152
19526b61648f474B30914a32725K0872D4790J50377o7077h2190B76420A3043J28191
19515A41234e1567j99765f7052k57925D04780j85625A9243h5021j24737A64982
19504b53348K1196C347d3029E1514c43546j3608J63965L5846C3378b18501o9874
19493b88375F536L7668c95848H7719a7094B18825o2149i1349A5964a87541m7559
19482b35100E2740b87789a38522M8319m8216G2565b26775L9261E5328J67428c8592
$$ plain form
19561 -194838 68116 -48729 -92668 102895 -36968 210825 21603 12934 -210702 -75435 100516
19549 -234360 -38183 -247046 -79121 7311 -389449 327437 242061 101636 -83080 131635 -96417
19537 -115116 -309704 -6704 -198303 325463 186729 -244652 82486 -213714 -55670 -19152
19526 -261648 -6474 230914 -132725 -111853 44790 195167 128090 -82190 276420 13043 141234
19515 141234 -51567 -251332 -67052 -324977 404780 219155 19243 -85021 -209758 164982
19504 -253348 -232152 3347 -43029 51514 -343546 -357154 -193189 -157343 33378 -218501 -288375
19493 -288375 6536 44204 -395848 87719 -17094 218825 156676 -91349 15964 -187541 -235100
19482 -235100 52740 -287789 -138522 -90203 -138419 72565 -226775 -187514 55328 222756 -38592
19470B17156B0481c8632G7427K64265b19139A5930g3229A47740a34695A17129
19459a08218e714j95339O9176M1738C27398a07856L1598K3653k26394O1229B1045
19447B45390b15777o5440c3133j41573d5029j47587C4449c2138j86036C865L5556
19436C9421J8567k8818b42298A3028d1115A78520o870b1332j26228A21370R7606
19425B18976b53766c6469o9348B0395R5189m1361a21103L4595j94014d6753l7084
19414h3837C78423a91325O6217K4744c9039j15607j7866g1020k68998J21165J05193
19403a13660C85192b02017A5147b27692B73761a94790j65740a60790B7551Q448
19393C5999a51296A64563J35237b14688p6290F294c1214j32604A26251e428l73087
$$ plain form
19470 217156 20481 -38632 77427 341692 -219139 15930 -73229 147740 -134695 117129
19459 -108218 -5714 -201053 -131877 -90139 327398 -107856 -76258 -52605 -278999 -217770 21045
19447 245390 -215777 -281217 -33133 -174706 -45029 -192616 34449 -32138 -218174 3865 39421
19436 39421 57988 29170 -242298 13028 -41115 178520 171650 -21332 -147560 121370 218976
19425 218976 -253766 -36469 -105817 20395 115584 74223 -121103 -86508 -280522 -46753 -83837
19414 -83837 378423 -191325 -125108 -100364 -39039 -154646 -172512 -71020 -340018 -218853 -113660
19403 -113660 385192 -202017 15147 -227692 273761 -194790 -360530 -160790 27551 35999
19393 35999 -151296 164563 299800 -214688 -290978 6294 -31214 -163818 126251 -5428 -378515
19382c78515A82647d00584J25987J14025j5669k8662A26695E4374a04277G0293
19371b57104k0420N2256L5768A4556N4674c3381Q423k29542D9151L27541A28085
19359H8131i4063j12905A3471j065K3036b5825B71472A20380b22124d4000A10794
19347I5965b2585a0092j62714f8325l44513B9845c1896k23731b3719B29945i3092
19335e8868k79577B53274a82008B41084c76755a43506n5472h4144j79204d3959
19324a64546p744r5888g0156A90347n6171b31448j79594C2814g2839J9490j90521
19313b43870g0899E40004a78186A34732c67366b6166A63622G3543a57817m3980
19303b01797K713N4565l8414A1446f6609n7603d2329j16561m5037A15232M1397
$$ plain form
19382 -378515 182647 -400584 -274597 -160572 -176241 -204903 126695 54374 -104277 70293
19371 -257104 -277524 -225268 -189500 14556 69230 -33381 -24958 -254500 49151 376692 128085
19359 88131 -94063 -206968 13471 12406 35442 -25825 271472 120380 -222124 -44000 110794
19347 95965 -22585 -10092 -172806 -68325 -412838 29845 -31896 -255627 -23719 229945 -93092
19335 -58868 -338445 253274 -182008 241084 -376755 -143506 -198978 -84144 -263348 -43959
19324 -164546 -172290 -268178 -70156 190347 134176 -231448 -411042 32814 -72839 -53349 -243870
19313 -243870 -70899 540004 -178186 134732 -367366 -26166 163622 73543 -157817 -201797
19303 -201797 -199084 -144519 -182933 11446 -66609 -124212 -42329 -158890 -203927 115232 156629
19292A56629E6814A2363a44927e0955H5390b34803P8620k1954A10326j9473e0607
19280C2161J14950a12608j39503j846J02373J4710j97335a37666A11003b99616
19269c842D4440f4934A5260a35056N7982l00298J39690Q9907O4248D914f7308
19257a07091k7464C9632b7790A06401e2989j11454D6449J37415a76172C32392
19246b56417F7970M155b90786I5987e8187b1617I5752J75323D4819f2985k1381
19235h4366j9111l02138b7176p8873j88782a23938B35825a5500B29044I1141h7596
19223a13526j55201P7638A06060a12322J3060l9199n5994A50730B056a23570b7742
19211a5547k66166l221J28296C96092b31029B64765d80073a24102j74675A16657
$$ plain form
19292 156629 56814 12363 -144927 -50955 85390 -234803 -156183 -178137 110326 90853 -50607
19280 32161 147111 -112608 -252111 -253957 -151584 -136874 -334209 -137666 111003 -299616
19269 -3842 44440 -64934 15260 -135056 -77074 -377372 -237682 -147775 -83527 4914 -67308
19257 -107091 -134555 39632 -27790 106401 -52989 -164443 46449 183864 -176172 332392
19246 -256417 67970 72125 -290786 95987 -58187 -21617 95752 271075 44819 -62985 -84366
19235 -84366 -103477 -405615 -27176 -106049 -294831 -123938 235825 -15500 229044 91141 -87596
19223 -113526 -268727 -191089 106060 -112322 -99262 -138461 -194455 150730 2056 -123570 -27742
19211 -15547 -281713 -284934 -156638 396092 -231029 264765 -480073 -124102 -298777 116657
19200a78805A75967e7277A52185Q0499B1151J51964a92346G5848a98801I5481
19189A13046f2470j57525f2056B91337j20727m0889h2143k14916C3247a09504
19178C34463r1883j02000C9127b34220F7627h3841a3398H5400I726M2729e2139
19166A83764p492d79158a45794j85487e2393A0690Q3536g3670o9702l0250m7137
19155b20759D8112f7109j28560c1594l70336e7085E9066k0245h217j09102B45790
19143c05490J05522C4714b30951n881A68814B8347b44882B17302n3536J27292
19133B91058a68248A18675a97020m6161i8295J751A33495d19024h9347a8624j38860
19122a57484A4219h3850D624J29050H971c40029a59386j18415N8099l4983J20117
$$ plain form
19200 -178805 175967 -57277 152185 232684 21151 173115 -192346 75848 -198801 95481
19189 113046 -62470 -219995 -62056 291337 170610 129721 -82143 -297059 33247 -109504
19178 334463 242580 140580 39127 -234220 67627 -83841 -13398 85400 9726 52455 -52139
19166 183764 176272 -479158 -145794 -331281 -52393 10690 94226 -73670 -143372 -173622 -220759
19155 -220759 48112 -67109 -195669 -31594 -401930 -57085 59066 38821 -8217 -117319 245790
19143 -305490 -199968 34714 -230951 -236832 168814 28347 -244882 217302 163766 291058
19133 291058 -168248 118675 -197020 -243181 -98295 -96544 133495 -419024 -89347 -18624 -157484
19122 -157484 14219 -83850 4624 133674 8971 -340029 -159386 -277801 -219702 -254685 -134568
19111a34568F8960e3168B01711H5179J21635M2733o9087b35406J03334B84467
19100A4573i576C11050H1209l5276b6688j81301j98102F558Q9102b26884E573
19088A17466D6044Q2871a83875j47327F556Q9760c16822E9123J46456b13439d8174
19076B4223M768J03145i0004E2224a86488O6030E8906J01701b61043P7760H1637
19064c24501F5018j2827a77268j95633a39410a3989k06891e3686j45738A61291
19053A1435a49781M0398A01132e4578b7224A97546C9690b25394F0005g0465A60116
19041b42810A12548f7128H050J6749Q2379D2763b66587B06190j4217j8254G6171
19029e1339K5619B34865a11239a3671A95580b791m1257B897K56563F6188R3663
$$ plain form
19111 -134568 68960 -53168 201711 85179 206814 249547 180460 -235406 -132072 284467
19100 14573 -9576 311050 81209 45933 -26688 -207989 -406091 6558 95660 -226884 5573
19088 117466 46044 128915 -183875 -331202 6556 96316 -316822 59123 205579 -213439 -48174
19076 24223 28991 132136 -90004 52224 -186488 -120458 58906 160607 -261043 -183283 81637
19064 -324501 65018 52191 -177268 -372901 -139410 -13989 -220880 -53686 -199424 161291
19053 11435 -149781 -109383 101132 -54578 -27224 197546 39690 -225394 60005 -70465 160116
19041 -242810 112548 -67128 8050 24799 107178 42763 -266587 206190 191973 173719 76171
19029 -51339 -25720 234865 -111239 -13671 195580 -2791 -44048 2897 259460 66188 159851
19018A59851i9713A95654b8088I0857a55603j1547e0222k17202P5790e0849A26836
19006b07440B7552a88660j3519A65143a02528l59830i7861b4186m5526j34975
18996b04687a687m3135A23668B5134R5258a93463C7098J24060c23724C75215a61135
18984B75790a33441A73668L04991c5319m3279B9208K7857d274k2832A07286c37501
18972f0703I8874f2293p1836l0846O7144l8231K2285b3837F7987J76223a39015
18960a82227J0028c2975o4881g193A5541Q316a80503A24630b37052B20927e9589
18948b5755B8822M5260b855j46405C65837c0308j02869L9275J5550j12043d6858
18936b89453i6048G8735C005a24549J2411I5435d94856J59238B48236F3214a08127
$$ plain form
19018 159851 -99713 195654 -28088 90857 -155603 -167150 -50222 -267424 -191634 -50849 126836
19006 -207440 27552 -188660 -202179 165143 -102528 -462358 -97861 -24186 -69712 -204687
18996 -204687 -1687 -44822 123668 25134 120392 -193463 37098 161158 -323724 375215 -161135
18984 275790 -133441 173668 478659 -35319 -78598 29208 57065 -4274 -27106 107286 -337501
18972 -60703 98874 -62293 -134129 -164975 -97831 -136062 -113777 -23837 67987 244210 -139015
18960 -182227 -172199 -32975 -97856 -7193 15541 23857 -180503 124630 -237052 220927 -59589
18948 -25755 28822 74082 -2855 -149260 365837 -30308 -133177 -93902 -78352 -190395 -46858
18936 -289453 -96048 78735 3005 -124549 -112138 95435 -494856 -335618 248236 63214 -108127
18924g5982F8397b02362l3084j9793d2587k00610A41b54654g6119d611q5742k8427
18912a18780d1805j53253k70166a06382A72467a60208A9775f0760a1440A14289
18901c27490a60506j46491a02807j99019J16206m4555C96803b09757a3595l42163
18891c55758H6096c37803a56075O1250b7183B9878a12842E0125b74124d4106l4154
18880g8260A08469b60267D3471j6694a33963k21174h7490C5656i0209A09269A5585
18868b10168A7628a48619E3643i9923J1461o6969B3611b17292A23691a80591k8201
18857b08792f6053J5605q4256q525f8173D5204b57685j7313c1380D3822b33587
18845A98540a89188H46a00651A93117b23371J1776g5025L0502B9996J35886e5258
$$ plain form
18924 -75982 68397 -202362 -235446 -255239 -42587 -243197 141 -254654 -76119 -4611 -90353 -118780
18912 -118780 -41805 -195058 -465224 -106382 172467 -160208 19775 -60760 -11440 114289
18901 -327490 -160506 -306997 -102807 -301826 -185620 -230175 396803 -209757 -13595 -355758
18891 -355758 86096 -337803 -156075 -94825 -27183 29878 -112842 50125 -274124 -44106 -78260
18880 -78260 108469 -260267 43471 26777 -133963 -355137 -87490 35656 -90209 109269 15585
18868 -210168 17628 -148619 53643 -99923 -88462 -155431 23611 -217292 123691 -180591 -208792
18857 -208792 -66053 -50448 -134704 -143229 -68173 45204 -257685 -274998 -31380 43822 -233587
18845 198540 -189188 846 -100651 193117 -223371 -211595 -75025 -44523 29996 165882 -55258
18833a73517k08712I3295b61318I7029a03076K2545A42122J00125l9369D0190
18822a51097A72912E2741a68068D2038f3365k18852e7710A20046P5076p3341Q2883
18811B04664i0250J9791B43039A15131H964b69538i4353B4149b40972D13321j93750
18800B19571J93036j40520j6340b23386A20226c34646O4948J16113d6274j65074
18790b11348G5088a70870A76336a9087o2546A2384a30441c3518j32106k75298
18780d40922A68023a67142G0932J62572p8981c67112a11362B39334h4305m4022
18770a28327l0331j24537A97943I5454K6706b0343k8152A36056f5327b1553r8466
18759a20019B5483h9555J2317j56358a4852k29438B98184a22464G4734d996n6899
$$ plain form
18833 -173517 -382229 93295 -261318 97029 -103076 -80531 142122 242247 202878 40190
18822 -151097 172912 52741 -168068 42038 -63365 -282217 -57710 120046 195122 121781 204664
18811 204664 -90250 -70459 243039 115131 8964 -269538 -94353 24149 -240972 413321 219571
18800 219571 412607 272087 255747 -223386 120226 -334646 -269698 -153585 -46274 -211348
18790 -211348 75088 -170870 176336 -19087 -81633 12384 -130441 -33518 -165624 -440922
18780 -440922 168023 -167142 70932 233504 154523 -367112 -111362 239334 -84305 -128327
18770 -128327 -158658 -283195 197943 95454 122160 -20343 -48495 136056 -65327 -21553 -120019
18759 -120019 25483 -89555 -77238 -233596 -14852 -244290 298184 -122464 74734 -4996 -61895
18748f1895A31730o0052N764H761J47576c9122j40188l09705c0645k54617b6402
18736H6425A861b02833L6503k85768b3883n5207r9588Q1311D4688c03447C4498
18724a00756k5765j41724M4710C1684g1220C5852L5678c7155k05434G6714a40858
18712b45227g4763F1980a71534f7869C3060b74632a11329m7254j39796k7917A60869
18700I5657c9271A51204F496M7865c85770g1223k20113Q3758l7881J12285B38900
18688a33377J2275J9314K3118k71221I0102c7216k62902a11910j74424A90899
18677a24623c7968A02247D9438d0575m8995j65662b919k26167a07510d185j76349
18666a80534l05195b08715a02169k9004C69751b75302A33238a57838N2938l0222
$$ plain form
18748 -61895 131730 71678 77442 8761 156337 -39122 -179310 -489015 -30645 -285262 -26402
18736 86425 1861 -202833 -166330 -452098 -23883 -79090 -178678 -97367 44688 -303447 34498
18724 -100756 -126521 -268245 -223535 31684 -71220 35852 71530 -37155 -242589 76714 -140858
18712 -245227 -74763 61980 -171534 -67869 33060 -274632 -111329 -158583 -298379 -326296 160869
18700 95657 -39271 151204 6496 54361 -385770 -71223 -291336 -207578 -245459 -133174 238900
18688 -133377 -121102 -101788 -78670 -349891 90102 -37216 -300118 -111910 -286334 190899
18677 -124623 -37968 102247 49438 -40575 -89570 -255232 -2919 -229086 -107510 -4185 -180534
18666 -180534 -485729 -208715 -102169 -131173 369751 -275302 133238 -157838 -104900 -135122
18656a35122d1224A94779f8467B38577a73860n3249A6551i2805j6467A39869c923
18644e68019i3692r5681h6932c9039k65455A96629D3399b77813a27047O3274A58460
18632C5792R179L7755N5416F6844b76322M3012h2486L7492k61208a45196K2704
18621a22492j78451B78642d9932H218M4267b00109l0069A4531a94213F1683B0341
18609a01869a1436j02598M161D52976k18640r5019Q98a56713r468M6510B60390
18597f215r6105A01641K16717a6736C19695f3035k81741a50279K2903n3287H4786
18585b8363A56762m3770b6509B27844d9166j80464D9716c60279J54718m7025A02303
18573d8952l01422B25136g0724b9934k68152f0898E1544a21230j72816g8843k4925
$$ plain form
18656 -135122 -41224 194779 -68467 238577 -173860 -227109 16551 -92805 -109272 139869 -3923
18644 -568019 -93692 -189373 -86932 -39039 -304494 196629 43399 -277813 -127047 -63773 158460
18632 35792 44971 82726 138142 66844 -276322 -233310 -82486 -44994 -306202 -145196 -122492
18621 -122492 -300943 278642 -49932 8218 52485 -200109 -230178 14531 -194213 61683 20341
18609 -101869 -11436 -114034 -109873 452976 234336 139317 140215 -156713 -166181 -119671 260390
18597 -6215 -102320 101641 318358 -16736 319695 -63035 -344776 -150279 -127376 -180663 84786
18585 -28363 156762 112992 -26509 227844 -49166 -229630 49716 -360279 -205561 -252586 102303
18573 -48952 -350374 225136 -70724 -29934 -298086 -60898 51544 -121230 -294046 -78843 -103768
18562a03768A70736M8482E5308J96888r7870c27347a51398a5928A06670H866K62203
18551B71069d3745A0310g8365j2977j09264k03140A96226c1265k05139I0495f2570
18539A89305i0826A05549d97177G648b5867A53223p1436b21398A54424a8250k47847
18528b66097D9767a61104j76052J26834b6167B7015r054p627a08807F125J3867
18517A9992c4878B83743j34266k7007b6250H1435c6177j05401N1020B942b25267
18505A75552d83k97598B06083C944b94386A78163b46491b1638j0203E2543J73327
18494B25870a45551j11808J01181b3642C4766M0971c0648m89040a59265o0072
18484b19337o0534f153j53942k3283a8082j27650G9490b69874B09373g8857I726
$$ plain form
18562 -103768 170736 219218 55308 252196 154326 -327347 -151398 -15928 106670 8866 271069
18551 271069 -43745 10310 -78365 -91342 -200606 -403746 196226 -31265 -236404 90495 -62570
18539 189305 -90826 105549 -497177 7648 -25867 153223 81787 -221398 154424 -18250 -266097
18528 -266097 49767 -161104 -337156 -210322 -26167 27015 17961 10334 -108807 6125 19992
18517 19992 -34878 283743 149477 122470 -26250 81435 -36177 -141578 -90558 2942 -225267
18505 175552 -483 -298081 206083 3944 -294386 178163 -246491 -21638 -31841 52543 225870
18494 225870 -145551 -257359 -156178 -23642 34766 75737 -30648 -519688 -159265 -219337
18484 -219337 -279871 -6153 -160095 -183378 -18082 -145732 79490 -269874 209373 -78857 9726
18472a85655g7404L817K7252p0575h169B3583L2334J45047B3818J1609b91186
18460G3216c04349a49287b5662E7898a65561j10529E686a24304M6377A15037h9431
18448E4258M4520K000J64211m6639i1201F3586A9331b25113A53729o2498K04523
18437B95754C9952a61142p1854d634H3216N3813c0709P960q6167r1386K0918k26376
18425d05760C1214M2874l0381i0696L8096j5891j276B33845e5035n8879D411b46850
18412D45785d8979F2407a62951G3850Q4473b19762d5205B11860n2506b42777c4277
18400a97143b2856A16445c84516a75480j57449j74140a27406e2979b5181k96571
18390c21752I0186J044a9458k05981b5623D0260Q7123c94048J9132A86677q953
$$ plain form
18472 -185655 -77404 -73587 -46335 -116910 -8169 23583 55917 200964 23818 35427 -291186
18460 73216 -304349 -149287 -25662 57898 -165561 -276090 5686 -124304 -77927 115037 -89431
18448 54258 98778 100778 264989 218350 -91201 63586 19331 -225113 153729 91231 295754
18437 295754 39952 -161142 -232996 -4634 83216 137029 -30709 -22749 -108916 -200302 -179384 -405760
18425 -405760 31214 74088 43707 -90696 -52600 -68491 -69767 233845 -55035 -113914 4411 -246850
18412 445785 -48979 62407 -162951 73850 158323 -219762 -45205 211860 159354 -242777 -34277
18400 -197143 -22856 116445 -384516 -175480 -332929 -507069 -127406 -52979 -25181 -321752
18390 -321752 90186 91230 -19458 -225439 -25623 40260 127383 -394048 -374916 186677 177724
18379A77724a37167j43047a28159j93199E9177f5534b688k28129R3408e626B27263
18367C54725a6210j26811B8470J2519J8691q773L05309a35172D17245f9278m3231
18356a12509O779c6557E6408N4114Q6136b79518a6354l63407e1622D6798a20826
18344H5520a9782A08520D7626L35932A28598a90346e802A5694J68184b47956A14957
18332A28811E987c9473o279l35861A03423m7587J03540n0932b20185r0842a32997
18320A36294a66806N2782l6563a2727N24o0854k7666b7243A31410D4573c23385
18308b06703d2791j95975H4369h40m21439I8280b52314B177J2721a71849A19014
18296a86853A055b5090j86594k0866E6578g7179k43563B5383n372J38518j9604
$$ plain form
18379 177724 -137167 -280214 -128159 -321358 59177 -65534 -2688 -230817 -137409 -5626 227263
18367 354725 -16210 -143021 28470 40989 59680 50907 356216 -135172 417245 -69278 -112509
18356 -112509 -105730 -36557 56408 110522 196658 -279518 -16354 -379761 -51622 46798 -120826
18344 85520 -19782 108520 47626 383558 128598 -190346 -5802 15694 183878 -247956 114957
18332 128811 5987 -39473 -45752 -381613 103423 55836 159376 108444 -220185 -311027 -132997
18320 136294 -166806 -114024 -150587 -12727 -12203 -73057 -100723 -27243 131410 44573 -323385
18308 -206703 -42791 -238766 84369 -840 -422279 98280 -252314 2177 14898 -171849 119014
18296 -186853 1055 -25090 -211684 -232550 56578 -77179 -320742 25383 20011 158529 138925
18285A38925b8521A43828a72105r3708h2635D502b15498g0198E1623K3451L251
18274G8325C2420a62673f7206C73139b46260L4863A46596a59586r3695J07236
18264a46045j59349J780D1377p465L6967j0887c19814F3335b72445b0104k65432
18253b85536C26832j29214c0028k12362b5812k02480P5590f4676k14887g7009
18242a99311J8433B16353D4878c07316e5627n2910H26a47018c0664m9876C48724
18230i6406L0622p2788O1728A07164f8603k4633K0197j76372p602c8078D5074
18218a02568o5261h1019q6496A89312b75248J01894E1326d4503k1559j4492a3657
18206A13803b3009j26659A78408M3300F372L6693b25997B1749a23907J8208A36819
$$ plain form
18285 138925 -28521 143828 -172105 -265813 -82635 4502 -215498 -70198 51623 75074 78325
18274 78325 32420 -162673 -67206 373139 -246260 -211397 146596 -159586 -253281 -146045
18264 -146045 -305394 -303614 41377 33912 70879 59992 -319814 63335 -272445 -20104 -285536
18253 -285536 326832 197618 -30028 -242390 -25812 -228292 -152702 -64676 -279563 -77009
18242 -199311 -180878 216353 44878 -307316 -55627 -108537 826 -147018 -30664 -80540 348724
18230 -96406 -65784 -138572 -76844 107164 -68603 -93236 -73039 -249411 -257013 -38078 45074
18218 -102568 -167829 -81019 -167515 189312 -275248 -173354 51326 -44503 -66062 -80554 -13657
18206 113803 -23009 -149668 178408 221708 6372 43065 -225997 21749 -123907 -105699 136819
18194a93120e0395j71505F9977a40120A09653b82266N6705A1834c5354C7082K9296
18183F6378a53049B9445N9473O376f1701G2167a81072N6712D2913a48029k92j03400
18171b51721A65183L46804a54141E539J17606l0212a84795B62774F0017a80426
18160c78963a55865C8320N4332i0909p548B85726b10486j931k16087E8693M1663
18149A00356J58231a41190k72425e0612H2479L39261e9625p7291B18619c09163
18138H0169b35750B17002e3705B78287a65648A29530f899l52143B0292f2809n8881
18127a21690j94589D5416J93746a92539p7424A22148c8981A73710b76384e7193
18116a95181G675J70295d00724J80333D7337J08880k584B3915a5081B2260a86347
$$ plain form
18194 -193120 -50395 -221900 69977 -140120 109653 -282266 -225561 11834 -35354 37082 66378
18183 66378 -153049 29445 88918 95294 -61701 72167 -181072 -124360 42913 -148029 -148321 -251721
18171 -251721 165183 511987 -154141 5539 123145 92933 -184795 262774 60017 -180426
18160 -378963 -155865 38320 92652 -90909 -98457 285726 -210486 -212417 -428504 58693 100356
18149 100356 258587 -141190 -413615 -50612 82479 421740 -59625 -136916 218619 -309163
18138 80169 -235750 217002 -53705 278287 -165648 129530 -6899 -359042 20292 -62809 -121690
18127 -121690 -316279 45416 239162 -192539 -269963 122148 -38981 173710 -276384 -57193
18116 -195181 7675 177970 -400724 -220391 47337 156217 153633 23915 -15081 22260 -186347
18104g9797b1375j29382J8376A94409a18011l8629A88931a64353C31535a27130
18093H2819a70813A77195b18746i437D76009a41720j60201k4619c6413m3427A56681
18081b72247n9146B7339h0320o7676E0654K4156a35072a6386n8253G201O3108
18070G0309M2248a33106F5832L9263M2916h2933f71q2908l3740k574I2633A6290
18057A50486h4893A08977a03710L7504b0933j27025o5506j44665b2872A54609
18046a67568f9447E5275i5598A41434O7498N4359A21573K0637c32694B08940B5977
18034A775O2439K7345l8735b92491J43179j0067O7561l0853C3552a47339A221
18022a01633B18231E2912O5544j6052f423l51457a47356b7644d570A306L7741
$$ plain form
18104 -79797 -21375 -150757 -132381 194409 -118011 -156640 188931 -164353 331535 -127130
18093 82819 -170813 177195 -218746 -9437 476009 -141720 -301921 -326540 -36413 -79840 156681
18081 -272247 -331393 27339 -80320 -147996 50654 74810 -135072 -16386 -74639 7201 70309
18070 70309 112557 -133106 65832 105095 148011 -82933 -671 -83579 -117319 -119893 92633 16290
18057 150486 -84893 108977 -103710 -66206 -20933 -147958 -213464 -358129 -22872 154609
18046 -167568 -69447 55275 -95598 141434 208932 263291 121573 142210 -332694 208940 25977
18034 1775 64214 91559 52824 -292491 -149312 -159379 -91818 -122671 33552 -147339 1221
18022 -101633 218231 52912 118456 102404 -6423 -357880 -147356 -27644 -4570 1306 39047
18011C9047c97264C28973g2441L1359j19413K3276m741F5801a22859B13104b50469
17999b74946B9885F331g0751D1404a88670A63032A6094J50894J34232A11741L7642
17988A49383C0679a89225A07849a15552c4025n02068F7673a47435j93635H3410
17977a90554g672A52416J96663c84654E8697g3204k17799O8186A48334m6548k0590
17966H1196b89580B9614a74979f8611n8762E4167J0716c29693A16525c06996J50176
17955a56820j07069A65772D2501N2928c012j47676d2482k67431g7052r2556f3239
17943a35533M5126q2532d0017k23631b7610j83984A58286J97422F4356c08267
17932G7110J5585a4503p8117l7415k08719L110a27216G7087c9385D8026h6889
$$ plain form
18011 39047 -397264 328973 -72441 -41082 -160495 -137219 -141960 65801 -122859 213104 -250469
17999 -274946 29885 6331 -70751 41404 -188670 163032 16094 166988 301220 111741 149383
17988 149383 30679 -189225 107849 -115552 -34025 -536093 67673 -147435 -341070 83410
17977 -190554 -7672 152416 349079 -384654 58697 -73204 -291003 -222817 148334 101786 81196
17966 81196 -289580 29614 -174979 -68611 -127373 54167 64883 -329693 116525 -306996 -156820
17955 -156820 -263889 165772 42501 95429 -3012 -150688 -42482 -309913 -77052 -169608 -63239
17943 -135533 -90407 -172939 -40017 -263648 -27610 -211594 158286 355708 64356 -308267
17932 77110 92695 -14503 -92620 -130035 -338754 -335644 -127216 77087 -39385 48026 -86889
17920D2412B070a80446N3298O0579l436E2734b6690A24928Q764f0227C089N3164
17908E6253a82820O4949k6734B22452k0417b27849J02474A77573c18738J12081
17898b06657B02490J46777A13142N044L6217n7296j6080c08077a49402F4963K9939
17887I4902i2588m5123A10338f303j3842l4821A11677B9153b47667P8519I5040
17875A04547J67878K12261B17499N3813a64668N9242r6580a0701B95681b8513
17864d9500A92550D5909b03697j635j2585h3299B240J16535C8538b72773a0875
17852I9404g4151A52729L192d3064F0966L0102a5640j08332G0756a2273k92206
17841c04479j41285K07652c9654A04120c07817E79905A38455a5853A05445a51239
$$ plain form
17920 42412 2070 -180446 -127148 -66569 -70005 52734 -26690 124928 133692 -60227 3089 56253
17908 56253 -182820 -117871 -144605 222452 202035 -227849 -125375 177573 -318738 -206657
17898 -206657 202490 349267 113142 118186 154403 97107 81027 -308077 -149402 64963 94902
17887 94902 -92588 -137711 110338 -6303 -20145 -54966 111677 29153 -247667 -169148 95040
17875 104547 272425 484686 217499 271312 -164668 -105426 -202006 -10701 295681 -28513
17864 -49500 192550 45909 -203697 -205332 -217917 -83299 2240 118775 38538 -272773 -10875
17852 99404 -74151 152729 155921 -43064 60966 91068 -15640 -123972 70756 -12273 -304479
17841 -304479 -445764 -238112 -39654 104120 -307817 579905 138455 -15853 105445 -151239
17830I5166R0484b79728R2391G2453b18727Q0758C03631j38820a59381c9832A49141
17818E2996J29317b4202A00133c23615G9982J296K49457a80573F206b42025f8449
17806F0422K54815k6119f3547j28270a5908A26418a01614C77440c3498A1933b66041
17794C51a1816H5420c33843C13192d7416I0407a57911f023m816A29498m7151K15744
17782B98091d7978d858p4880j36584D65671A72943B8254a72921B73462i269C5886
17770A0503g4305e471H0272P573K9845C8022i3352A78915f8463B37582E2244J45555
17758A97799a8590A35960P8740c04702A38668A2759O088a16093A96563a7042A76568
17746A10496a95128A17282J04815J29864a67041D1478b0915F6714h9719m06020
$$ plain form
17830 95166 185650 -279728 -187337 72453 -218727 -137969 303631 164811 -159381 -39832 149141
17818 52996 182313 -24202 100133 -323615 79982 81278 330735 -180573 6206 -242025 -68449
17806 60422 315237 289118 -63547 -191817 -15908 126418 -101614 377440 -33498 11933 -266041
17794 351 -11816 85420 -333843 313192 -47416 90407 -157911 -6023 -10839 129498 82347 298091
17782 298091 -47978 -4858 -79738 -216322 465671 172943 28254 -172921 273462 -9269 35886
17770 10503 -74305 -5471 80272 87845 117690 38022 -93352 178915 -68463 237582 52244 197799
17758 197799 -18590 135960 214700 -304702 138668 12759 18847 -116093 196563 -17042 176568
17746 110496 -195128 117282 222097 351961 -167041 41478 -20915 66714 -89719 -495739
17736d95739B09098c56856a10515j02743B1445K69279k3619b84722B6438b40194
17725b20248j6705Q5413D7650j3033J6077L4174D2078a7484a089A08573l4888
17714G3685c23427G0147J05808D5466K80333b88339c2854k05566h5519A25375
17703B61489a41124A52409a96592A31679c2324A45628a03741K3073F9006b21838
17692a8504F8915p848b92947J4078C6780N4982d98851A01843J07441i5235H2720
17680a3773B02215f3962A33567B7266a00190J3124r9725l0059F5028f465B82889
17668A20350e0096C45811e4817A92702D3860b75581A86165a8324j22878l42290
17658d83492A92104a72930j98150A21782c36733G1368j0560N141K59985A47449
$$ plain form
17736 -495739 209098 -356856 -110515 -213258 21445 290724 267105 -284722 26438 -240194
17725 -220248 -236953 -151540 47650 34617 50694 84868 42078 -17484 -1089 108573 73685
17714 73685 -323427 70147 175955 45466 325799 -288339 -32854 -238420 -85519 125375
17703 261489 -141124 152409 -196592 131679 -32324 145628 -103741 -80668 69006 -221838
17692 -18504 68915 61067 -292947 -278869 36780 91762 -498851 101843 209284 -95235 82720
17680 -13773 202215 -63962 133567 27266 -100190 -87066 -186791 -216850 65028 -6465 282889
17668 120350 -50096 345811 -54817 192702 43860 -275581 186165 -18324 -141202 -483492
17658 -483492 192104 -172930 -371080 121782 -336733 71368 60808 65949 325934 147449
17647E9937M0167c03669a35905r2246c7017A48097a12870j377d3374A0130L56712
17636C66842H9913k5559J24532h1888D8364J73323f516j7597m4j60375O6182B47661
17623A10033m997A2439J61327J16589E5898h6920A98530b3443H0316k6362N6950
17612A10904b97166h2705A07471B2916a70481a1211A93444p9360J97401a30698
17601g455A19051m2013d4842k3080b085j69824b8695A4835r00L4080a63432B58571
17588B22438j04323l0827a23006B9985a8077A53866b6118j13402A56304b0850
17577b40010G4687a62974G1459a12137A52878a02265G8086a64127r5323C97181
17566a17184C5331J53791B3674K0286b19562a02520j55772F51321A98706a2372
$$ plain form
17647 59937 100104 -303669 -135905 -228151 -37017 148097 -112870 -114247 -43374 10130 366842
17636 366842 89913 64354 188886 -81888 48364 221687 -6516 -24113 -24157 -184532 -118350 247661
17623 110033 105036 12439 173766 290355 55898 -86920 198530 -23443 80316 53954 110904
17612 110904 -297166 -82705 107471 22916 -170481 -11211 193444 114084 311485 -130698
17601 -7455 119051 77038 -44842 -67922 -2085 -171909 -28695 14835 13935 48015 -163432 258571
17588 222438 118115 87288 -123006 29985 -18077 153866 -26118 -139520 156304 -20850
17577 -240010 74687 -162974 71459 -112137 152878 -102265 78086 -164127 -259450 397181
17566 -117184 35331 189122 23674 43960 -219562 -102520 -258292 651321 198706 -12372
17555A08827a19077B24715G984J24441A4515f7372B9328g0394c2179E05894a61030
17543B57880c15836f8423G4967J9938a94438d299G3009p242e3802E3018a669A67557
17530A93196H7767K26733i3032G1543f0030B3581L98372a31386r1648D6276O8832
17519A15108L7682K0633R8441K54198k28224b08469a717m5304l20012a38283A48249
17507H3266P3272O8907p7814J18193f8966A07524d8324C22373A7898O0202f6396
17495a10110B74922K5521F2245L70002C4256K01521L4052q0401A3135P6143a4917
17483B92034k826a3702C35492B8715J30989O2264G4650N6135b0829D22543A70940
17471H3031P4542m9356c1414C81449j18127F3870b91628J28699A54640o1515O9371
$$ plain form
17555 108827 -119077 224715 7984 132425 14515 -67372 29328 -70394 -32179 505894 -161030
17543 257880 -315836 -68423 74967 94905 -194438 -4299 73009 65767 -53802 53018 -1669 167557
17530 193196 87767 314500 -93032 71543 -60030 23581 421953 -131386 -223034 46276 115108
17519 115108 152790 173423 271864 526062 297838 -208469 -1717 -47021 -367033 -138283 148249
17507 83266 156538 225445 147631 265824 -68966 107524 -48324 322373 17898 78100 -66396
17495 -110110 274922 300443 62245 432247 34256 235777 269829 189428 13135 89278 -14917
17483 292034 289208 -13702 335492 28715 159704 221968 74650 130785 -20829 422543 170940
17471 83031 157573 108217 -31414 381449 263322 63870 -291628 -162929 154640 93125 162496
17460A62496p1770Q6562g4033A97233F951N77339E0221M32653J9545c0672H7025
17448a9055A64224J56746l7928Q1190q0204A11661J01703M4257N2458F7573K18354
17437B85927H2947K54376i8047A25276a09272E9653M14698B36146p5290e0084
17426H2581C4449A5710J45872L69298j85696A17402O5202H7957K96573j42745
17416B41785R5420l2326j06366M4037A12911L12299A16972l0715L53338j39117
17406C00478G2597J61724A8677J35903a5416I2184A0684J74127J46638A11166
17395C09674O6033j86558G5115J8582J19679b17999A49013J00561r7049M29577
17385E82102B62225a00920E2066K40947J9885a51888j35D9137J51691a94849R6348
$$ plain form
17460 162496 90726 177288 -74033 197233 6951 584290 50221 482874 502419 -30672 87025
17448 -19055 164224 320970 283042 364232 284028 111661 213364 257621 310079 67573 285927
17437 285927 82947 337323 -98047 125276 -109272 59653 474351 236146 160856 -50084
17426 82581 34449 15710 161582 530880 345184 117402 182604 87957 384530 241785
17416 241785 337205 304879 198513 242550 112911 425210 116972 86257 439595 300478
17406 300478 72597 234321 18677 154580 -15416 92184 10684 184811 331449 111166
17395 309674 375707 189149 75115 93697 213376 -217999 149013 249574 152525 582102
17385 582102 262225 -100920 52066 293013 312898 -151888 -152023 49137 200828 -194849 -98501
17374i8501b8100A75154A6405J6435J86517l4076m6524i3760B05143J35734A70159
17362B25520A02596J05344a60473B28013c3596B31907b97964I292J19414F0113
17351a2860B04881I0739l142b22140h2536A08416L16739J11271b12437C60892
17340H4184K25168j12985b5705H5910A1037M5747J85098K066I8379c15850A98681
17328A3233K46450b01996Q0196B71287F8696O5354K5430F4734b1552j5021B77942
17316D2133J42102p1333n4547c50484A41619Q3824a57347C46466k3261k9768E0749
17304G2600a90270C17047f1473j14319A08835C9479a67588d2515B32305J28959
17294C61264A72729J28686m6885j19780J59577a15576J0098A46874M8661J82388
$$ plain form
17374 -98501 -28100 175154 16405 32840 219357 185281 138757 -93760 205143 340877 170159
17362 225520 102596 207940 -160473 228013 -33596 231907 -297964 9292 128706 60113
17351 -12860 204881 90739 87597 -222140 -82536 108416 425155 536426 -212437 360892
17340 84184 309352 196367 -25705 85910 11037 56784 241882 243948 98379 -315850 198681
17328 13233 259683 -201996 -121800 271287 68696 134050 159480 64734 -21552 -36573 277942
17316 42133 184235 112902 58355 -350484 141619 225443 -157347 346466 323205 293437 50749
17304 72600 -190270 317047 -61473 -175792 108835 39479 -167588 -42515 232305 361264
17294 361264 172729 301415 254530 134750 294327 -115576 -105478 146874 195535 377923
17284C77923H42M64874B9927L12476A38653B9276A0539L10874j40528f8472D81515
17272D0874J59337q30O8341J44968A11135a44966A75309O0867o8252q661J69633
17261C28896B8258J48725p2974k0040J64009a41748C04744A0511L67824i1606
17250F86534l18332n3040F6589M2600A1505K460K6637R1435O9436o216a57028
17238C43530j15959a40596B55642O909j7619e6805A44562J44421G5398K85020
17228C60418K66422A46563a6154A88710j7980D1724J89281K49633A88503K1996
17218B10499J85854H5075H602K86437j27974f5525A4024N3185J57098K81943D9101
17206A40725K14895j10334O2679K88441b1059B33602C50K91779A37286k136O0520
$$ plain form
17284 377923 842 465716 29927 342403 138653 29276 10539 321413 180885 -68472 481515
17272 40874 200211 199381 267722 412690 111135 -144966 175309 236176 167924 159263 328896
17261 328896 28258 176983 104009 83969 247978 -141748 304744 10511 378335 -91606
17250 686534 368202 315162 66589 109189 11505 13965 40602 132037 201473 195257 -157028
17238 343530 227571 -140596 255642 262551 244932 -56805 144562 288983 75398 360418
17228 360418 626840 146563 -16154 188710 170730 41724 231005 480638 188503 210499
17218 210499 396353 85075 8602 295039 167065 -65525 14024 67209 224307 506250 49101
17206 140725 355620 245286 307965 596406 -21059 233602 350 292129 137286 135150 195670
17195A95670K11134M8878B19342H0224D764L11746J24658j70324J41955A44747
17184D24670B12306h3166A07668c5665C18415J2594K8234P1024A87611k7755M7143
17173B06999r1172J61677E730K73295G9927M4681K28753F287N0494J31534K31899
17162D20214j45611k236A19043K67585F4128O8329d19G1888L43251E22N54364
17151E54886g2515D77046C691J64802m5554J98769J32782j56883A38612J08745
17141B47357G7866K44154j20379K34944l7699j7871j58345l2842J94695A24196
17130C35395m919o3528Q0069j03883L92855l00979R9779I8919J79010O3820M907
17119C46656p7982K60275k39129P0994H7690N06714j84532j57404q8475K93276
$$ plain form
17195 195670 406804 455682 219342 80224 4764 316510 441168 270844 412799 144747
17184 424670 212306 -83166 107668 -35665 318415 331009 359243 430267 187611 159856 206999
17173 206999 115827 277504 5730 279025 79927 124608 353361 6287 56781 188315 420214
17162 420214 274603 272367 119043 386628 64128 132457 -419 71888 415139 522 554886
17151 554886 -72515 477046 3691 168493 122939 321708 454490 297607 138612 247357
17141 247357 77866 322020 201641 436585 398886 381015 222670 189828 384523 124196
17130 335395 330476 266948 347017 243134 635989 335010 434789 98919 277929 341749 346656
17119 346656 268674 528949 289820 360814 87690 594404 409872 252468 163993 457269
17109D57269j00129j01890K56217L6136I6594J44636J85614p7495j06829J30893
17099C73413L18805C15889J23990A79984K19072k9364N22858A83326G0279M04166
17089D74445j73893P1372o7053j12256L30401j37217R8450M06826k20325k74493
17079C96257A75883Q1153J11397J38366J777J27185r6443j24890q7332j37273
17069A89823J43827L65096j80033J87422k70434k9646P8286A40791J60403J85222
17059D86416R3641j93709J68705p8491j17191K02761k18660K94698M2025l12618
17049C67577o550K15746j24627j78718J76288j73421M6477L81417C03686K92231
17039E95917j82074J43554p4669J9311K20864j25629J99181B71408M21876j75374
$$ plain form
17109 457269 357140 255250 511467 547603 96594 241230 426844 349349 242520 373413
17099 373413 692218 315889 439879 179984 399056 369692 892550 183326 70279 474445
17089 474445 300552 371924 304871 192615 523016 385799 484249 891075 670750 396257
17079 396257 175883 257036 368433 506799 508576 635761 539318 414428 327096 189823
17069 189823 333650 698746 518713 706135 435701 406055 484341 140791 301194 486416
17059 486416 580057 386348 555053 476562 359371 562132 343472 638170 680195 367577
17049 367577 361027 576773 452146 273428 449716 276295 322772 704189 303686 595917
17039 595917 413843 557397 482728 502039 722903 597274 796455 271408 693284 517910
17029E17910J01841p3619K22749k62289J33381j02661j24086k0859J0954K06285
17019F09606N7996B68446L27747q9309K35627C54213K55831R4977K5051m5727
17009F84345R7249K755j44500J48334o3027L4557p8279J23052J65957j96585j65093
16998F08765K44877k81568q6952O8320K23406J62145B71954N93206k7021j90907
16988F47232L73974k04557j19126R724J13991j43436L02255j37037C77162M13704
16978G90866q3216M4609N8346K10999l37043m4847K14799J40958k10164J31319
16968I16626j78029Q4358K44546j18898N6544O3617M9050k17719j34617k7245
16958G38233k0670K01826J21923j58914j6682n9033r4251N35196l74722J66959
$$ plain form
17029 517910 619751 546132 768881 506592 639973 537312 413226 392367 403321 609606
17019 609606 667602 268446 596193 506884 742511 354213 610044 705021 730072 684345
17009 684345 781594 784349 639849 788183 725156 759713 681434 804486 970443 773858 608765
16998 608765 853642 572074 485122 553442 776848 938993 271954 865160 838139 647232
16988 647232 1021206 816649 697523 707247 821238 677802 980057 843020 377162 790866
16978 790866 707650 752259 810605 1021604 684561 639714 854513 995471 785307 916626
16968 916626 738597 822955 1067501 948603 1005147 1068764 1117814 900095 765478 738233
16958 738233 717563 919389 1041312 882398 865716 806683 712432 1247628 872906 1039865
16948A039865k98551K24690J29565R1728k97673K35402J22261n1120L54826m36459
16938A114534L08211m62161Q5412M8660J51553l6413K97565m28257J58286m8089
16928A189301j63125K48890n8971O2969N4999J15413q1134P4164P7855k28376
16918A291985M248J08113Q6190l92k29488L71509j36930J2292l6878K15328J05526
16907A791503j11041K76642p17415K80901l1473L78051l19770J41200K18126k79030
16897A627694K57081P3085j60190M8727j0719J85434m10862J86774O9927m8671
16887A818280K94821p9176k16240J82231M8494o2850n9419K77672R4108k50222
16877B047699L89596k17135k9061O1596J02923K6882j00723L8566J95245j99191
$$ plain form
16948 1039865 741314 966004 1095569 1187297 889624 1125026 1247287 1196167 1550993 1114534
16938 1114534 1422745 960584 1045996 1094656 1246209 1209796 1507361 1079104 1237390 1189301
16928 1189301 1026176 1275066 1216095 1279064 1334063 1449476 1368342 1442506 1520361 1291985
16918 1291985 1296233 1404346 1490536 1490144 1260656 1632165 1495235 1507527 1470649 1685977 1791503
16907 1791503 1680462 1957104 1239689 1520590 1489117 1867168 1547398 1688598 1906724 1627694
16897 1627694 1884775 1957860 1797670 1846397 1835678 2021112 1610250 1797024 1866951 1818280
16887 1818280 2113101 2033925 1817685 1999916 2048410 1985560 1926141 2203813 2297921 2047699
16877 2047699 2437295 2220160 2191099 2252695 2355618 2382500 2281777 2320343 2515588 2316397
16867B316397M31005k07277j44203J70641J16737K6066k32113K35593M6541k187
16857B757200M53593m94658j30336L76319J79382J60034j45109J80279k90181
16848C046523M52450k3158n2885L2507n8332J3292K99884l14330L37248K38008
16838C971207k237j11283L78260j97114K89637J79288k40297K03722J21565P7996
16828D670744L1872M2659q8217J10748K78404O1196R5685K61968j9691k06678
16818E238690O06767K8985K01193l0402R6202K91966K04918K15998l38601J49642
16808F665358L95901L35069L67853k68598M27598k6802J45462J75429L64517Q0361
16798H662148L55977K45742Q6925L81780j27639K67113Q71067j08168K59984M36768
$$ plain form
16867 2316397 2747402 2540125 2395922 2566563 2683300 2709366 2477253 2712846 2759387 2757200
16857 2757200 3210793 2716135 2585799 2962118 3141500 3301534 3156425 3336704 3046523
16848 3046523 3498973 3475815 3422930 3455437 3397105 3410397 3710281 3395951 3733199 3971207
16838 3971207 3968970 3857687 4235947 4038833 4328470 4507758 4267461 4471183 4592748 4670744
16828 4670744 4702616 4745275 4657058 4767806 5046210 5107406 5203091 5465059 5445368 5238690
16818 5238690 5845457 5874442 6075635 6045233 6141435 6433401 6638319 6854317 6515716 6665358
16808 6665358 7061259 7396328 7764181 7495583 7923181 7896379 8041841 8217270 8581787 8662148
16798 8662148 9018125 9263867 9350792 9732572 9604933 9872046 10743113 10634945 10894929 11331697
16788A1331697R2064L83816K01033P04309J30607N60536N08868L31176O19542
16779A4863648K86925N89900M58497M93645L24834Q77447K78712Q77947M28074
16770A9479629J161820M71467P15847N29315J285158J227018P20893J081581R47381
16761B7620109R40626J693337J173485J377018J397904J435012J867899J797250
16753C9302640J766294K088367K041744K371023K106828K666057K675413K705156
16745E7723522L287838L226441L587668L292867L952789M291217M591719M438392
16737H8392453M681587M628082N682245N258738N475990N396228N750497N353248
16729A30619068N368023M985132M459441M344208L513568K951473K546339J053901
$$ plain form
16788 11331697 11423761 11807577 12008610 12712919 12843526 13404062 13912930 14244106 14863648
16779 14863648 15150573 15740473 16198970 16692615 17017449 17894896 18173608 19051555 19479629
16770 19479629 20641449 21112916 21828763 22358078 23643236 24870254 25591147 26672728 27620109
16761 27620109 28560735 30254072 31427557 32804575 34202479 35637491 37505390 39302640
16753 39302640 41068934 43157301 45199045 47570068 49676896 52342953 55018366 57723522
16745 57723522 61011360 64237801 67825469 71118336 75071125 79362342 83954061 88392453
16737 88392453 93074040 97702122 103384367 108643105 114119095 119515323 125265820 130619068
16729 130619068 135987091 140972223 145431664 149775872 153289440 156240913 158787252 159841153
16721A59841153M70527k71797r71139k060037k894377l100301m046835m790001
16713A42177193m532390n202980n381847n724859n404762n497978n364609n120172
16705I9947596n382639m667738m937475m550876l966579m151610l760030l594690
16697F4935959l114374l017757l257640k860673k495189k447877k187647j964424
16689D3590378k220410j918298j995161j398394j548738j427886j304457j635469
16681C0141565p47999j594270j293553p49771r53662j062252j007513q06633n86389
16672B1339523j181840l50454q15369m64868n20551p56924l77249n76526p43198
16663A5552544l90450o76934l02743m74227m68896l85844j52670o63739p5532
$$ plain form
16721 159841153 160311680 160039883 159068744 157008707 154114330 151014029 146967194 142177193
16713 142177193 137644803 132441823 127059976 121335117 115930355 110432377 105067768 99947596
16705 99947596 94564957 89897219 84959744 80408868 76442289 72290679 68530649 64935959
16697 64935959 61821585 58803828 55546188 52685515 50190326 47742449 45554802 43590378
16689 43590378 41369968 39451670 37456509 36058115 34509377 33081491 31777034 30141565
16681 30141565 29393566 27799296 26505743 25755972 24802310 23740058 22732545 21925912 21339523
16672 21339523 20157683 19807229 18991860 18526992 18006441 17249517 16872268 16295742 15552544
16663 15552544 15162094 14485160 14182417 13708190 13239294 12853450 12700780 12037041 11961509
16654A1961509l86976m51699l80868K38884k74380o48837j19830n91902j29129
16645I216772k68793j53585j63755m10069K87557j97635l46768n55171j1484p6972
16635G320097j53304k7392m54384q5665p9526p7600k24618l17496K39841m7165
16625F092788J11468n45588k86119K10179k25393k88370J14319j5201l76244n279
16615D786560J1930J85973n48900L34725m35084j11175J800l29756L36179K13740
16605D445992l78581l90663M43587m39219K31701M7340n12054K25996l39344J32389
16595C467144l31740K38489j74623m6748J87866k53523n9887O2827j66051q8822
16585B834932n0091K52880n0848k47107O1320l4284K85519p14785M29532l73086
$$ plain form
16654 11961509 11574533 11122834 10741966 10980850 10706470 10057633 9937803 9345901 9216772
16645 9216772 8947979 8794394 8630639 8220570 8508127 8310492 7963724 7408553 7397069 7320097
16635 7320097 7166793 7139401 6685017 6599352 6519826 6442226 6217608 5900112 6139953 6092788
16625 6092788 6204256 5658668 5372549 5582728 5357335 5068965 5183284 5168083 4791839 4786560
16615 4786560 4798490 4984463 4435563 4770288 4335204 4224029 4225829 3896073 4232252 4445992
16605 4445992 4067411 3676748 4120335 3681116 3912817 3960157 3448103 3674099 3334755 3467144
16595 3467144 3135404 3373893 3199270 3152522 3340388 3086865 3026978 3089805 2923754 2834932
16585 2834932 2784841 3037721 2986873 2739766 2801086 2766802 3052321 2337536 2767068 2393982
16575B393982J51186j47471j4121K66125m33242K09460j75778l11K20754k33372
16565B237212P2663k8631j17752j11471K5439J48053j56660J34348k7678l08070
16555A867453L057K3018K04441l30238R8245J47023K1l64681L9059p6675m4776
16544A565947o9074M74559l30401L73512k75753P7715j22056j00432N3601L04619
16534A952237m99739P2566P3945j0963j82628K44894k01054q7965L44184m61815
16524A243662O5195j24266M3185K24065j70464n3481J74057j53739p747L37857
16514A578324m71030n1747M0027o2382q7353K26637p3657K35868k55307n3800
16504A025580n017J92025k49761J25103L46708m53782L30129k3159j6167p2418
$$ plain form
16575 2393982 2545168 2397697 2383576 2649701 2216459 2425919 2250141 2249830 2470584 2237212
16565 2237212 2309875 2281244 2163492 2052021 2077460 2225513 2068853 2203201 2175523 1867453
16555 1867453 1870510 1893528 2097969 1767731 1865976 2012999 2013020 1648339 1687398 1610723 1565947
16544 1565947 1496873 1971432 1641031 2014543 1738790 1816505 1694449 1594017 1647618 1952237
16534 1952237 1452498 1525064 1599009 1588046 1405418 1650312 1449258 1361293 1705477 1243662
16524 1243662 1308857 1184591 1227776 1451841 1281377 1227896 1401953 1248214 1240467 1578324
16514 1578324 1107294 1055547 1095574 1033192 945839 1172476 1098819 1334687 1079380 1025580
16504 1025580 1020563 1212588 962827 1087930 1434638 980856 1310985 1287826 1271659 1199241
16494A199241q4722J02823k31230l890j63027Q6334k06315N28324M4291l68316
16484I03513J62879l72433K55541k58730N51830r0590K9112q3219l51291R4430
16474H41042J09910k27948K68363Q5638l56947J30730P9538j04791M517L10157
16464A140209k22985D49728M12154l03463J79155J16507l2316J67542D39667N69792
16454A009459j82844l63458M48161O1664k40844k22968J0947J12081k4439O4675
16444F72434K4136j22379j56141l8266J42265j12949K32582k95648K23615K36475
16434H06124j87274K23010Q0982j29765q0495J3955J22053m05277L12973k91991
16424D64295J7248J78180J05542j55955j08376L00873j24289j16997Q7462k88489
$$ plain form
16494 1199241 1114519 1217342 986112 982222 819195 905529 699214 1227538 1271829 903513
16484 903513 1066392 693959 949500 690770 1242600 1152010 1181122 1097903 746612 841042
16474 841042 950952 723004 991367 1077005 720058 850788 930326 825535 830052 1140209
16464 1140209 917224 449728 861882 558419 737574 854081 821765 989307 439667 1009459
16454 1009459 826615 463157 911318 972982 732138 509170 520117 632198 607759 672434
16444 672434 696570 574191 418050 379784 522049 409100 641682 346034 569649 806124
16434 806124 618850 841860 922842 793077 712582 726537 848590 443313 756286 464295
16424 464295 481543 659723 765265 609310 500934 801807 677518 560521 647983 359494
16414C59494N49632o1095l76766M093J29606A74798K68037q3914Q1254L90973
16404H31148k70635n4267L24298k57126j14430K21435Q449j96504K5105p5994
16394D41479J54959k22467N9209J00469j45379J32602B16339L73891K15084C55772
16383F72561C05026J41789J06987j55121e8099E57495N3222B10612K94535j12320
16373C92827J45176j79505j49236J09034c290D04373N1334j42275J70691L13866
16363G97989B26131k2679J95875L02431k72743A16625K42649G7976P7235a67211
16352c1416F41261C00167O8730p5184K0679J94843A26498J88180M32640B93637
16341F65761B57633L40866k27948J32835j38803J06025K50528k49685A51219n3085
$$ plain form
16414 359494 909126 848031 471265 475358 604964 174798 442835 358921 440175 831148
16404 831148 560513 506246 830544 573418 458988 680423 688872 492368 517473 441479
16394 441479 596438 373971 433180 533649 388270 520872 216339 590230 805314 355772
16383 672561 305026 446815 553802 398681 -58099 557495 610717 210612 505147 392827
16373 392827 538003 358498 209262 318296 -3290 404373 455707 313432 484123 797989
16363 797989 226131 203452 399327 701758 429015 116625 359274 77976 155211 -167211
16352 -31416 641261 300167 368897 293713 314392 509235 126498 314678 747318 293637
16341 665761 257633 598499 370551 503386 364583 470608 721136 471451 151219 98134
16331I8134L99862p0705l8588e2712C31226L50346j1576C14050J68273L9873A58678
16319F96819A79107M07456j76663j30489F7267J95838L32015E0199L00926m2561
16309C08564j3023N7565J61740k32424A36749K71237j57310J66341A97935J54337
16299C52272J50632K1560j1164I9258J71802F4288J75484L5870j1496n5984J67627
16288C75789j41908A08360L10077n9031P8203K6619q6619A6758K06392L55511
16278E78661B39124K14263b17299B85181A9852L56737m8006D1313J72713j3316
16268B00710K95172k17378J35525j3000g7284C5662K38325j21849E999N16384
16258E22383A82465a6058A31533i3329C70811G7371K02696d2204B91103b45959
$$ plain form
16331 98134 497996 427291 388703 -52712 331226 681572 669996 314050 482323 522196 158678
16319 696819 179107 586563 409900 279411 67267 263105 595120 50199 351125 308564
16309 308564 295541 353106 514846 282422 136749 407986 250676 417017 197935 352272
16299 352272 502904 524464 513300 99258 271060 64288 239772 275642 264146 208162 375789
16288 375789 233881 108360 418437 359406 437609 464228 377609 16758 223150 578661
16278 578661 239124 453387 -217299 285181 19852 376589 328583 41313 214026 200710
16268 200710 495882 278504 414029 401029 -77284 35662 273987 152138 5999 522383
16258 522383 182465 -16058 131533 -93329 370811 77371 280067 -42204 291103 -245959
16247A32567C2159J99079N6131n8226o5888Q4261Q5080E9041K02871j28377a16622
16235b76443B35125r8323i1528D11962A87534R0178D3085b55279C97649h8583
16224D6138A3237L25096k4798A30751K06487i4969A05271a45649I1617J98859
16214B90476A43473P6557J95600G2157L9608c2477A67703o0694M6656a30668B22835
16202C10081F2947R9469E5243K09169H5347a2718G1255L02229j25818a73115A19495
16190A63148N2045K63402b6433B76732c2868C65754A25947K9271a3137A21188
16179A78564e2981j10671d9577I2685f7037E28566j33653A89860A0293J49560
16169A59853o0964l7863K26248F2351b50738A50754a83799I9958h5802b4037A70816
$$ plain form
16247 132567 32159 231238 287369 229143 163255 247516 332596 59041 261912 133535 -116622
16235 -276443 235125 136802 -91528 411962 187534 277712 43085 -255279 397649 -88583
16224 46138 13237 338333 313535 130751 337238 -94969 105271 -145649 91617 290476
16214 290476 143473 220030 415630 72157 111765 -32477 167703 107009 153665 -130668 222835
16202 310081 62947 162416 55243 264412 85347 -12718 71255 373484 247666 -173115 119495
16190 163148 215193 478595 -26433 276732 -32868 365754 125947 155218 -13137 121188
16179 178564 -52981 -163652 -49577 92685 -67037 528566 394913 189860 10293 159853
16169 159853 98889 61026 287274 62351 -250738 150754 -183799 99958 -85802 -24037 170816
16157D43511o1074a8775A39676o8495L1721q010a6248B36742B2853H855L26535
16146C35390A60078K5033A2537a546A06397l4235O7297a9353A57102c0291E5825
16134A54509R5851a76583B55448a7070A30015J71295J8326j56852o1133L41470
16124D43121k15060b51200B59162o6905g388B67191P6450I0119b13323f5212k5146
16113i0358I6790K33578a39610N8115A28035E3780O8882b17776A59269E5003K12271
16102B67274b26187D60551G2290O1915e9629A17750a62655C0174A670a28163N1987
16091g6176J4652A67442K9332C920J83256F0566M4294P3563m5873R815a37086
16079A20046J78640b13068D45371C1220a17716D0603D573L85609I7768c36253
$$ plain form
16157 443511 382437 -18775 139676 71181 102902 94892 -16248 236742 22853 8855 335390
16146 335390 160078 185111 12537 -1546 106397 72162 139459 -19353 157102 -30291 55825
16134 154509 250360 -176583 255448 -17070 130015 301310 319636 162784 101651 443121
16124 443121 228061 -251200 259162 192257 -7388 267191 343641 90119 -213323 -65212 -90358
16113 -90358 96790 330368 -139610 -81495 128035 53780 122662 -217776 159269 55003 267274
16102 267274 -226187 460551 72290 134205 -59629 117750 -162655 30174 1670 -128163 -76176
16091 -76176 -61524 167442 196774 3920 187176 60566 104860 178423 132550 142365 -137086
16079 120046 298686 -213068 445371 31220 -117716 40603 4573 390182 97768 -336253
16068a00254j3152I5175h7057j17944C9970f1623K2965B3412b23843g107k69307
16057b76414B18942E4574c4024A26141d1275D1640K35311b61129g1187A49083
16046E8328g2481K8360k40945B58596E2862J56642q7430a17088J1004A25619a102
16034a67016A62549e6794j22743k9713C27755i0144j2643j05932J7089A35685
16023b1443B9078d64749E17606b95998A9951J56488b17943a5177k8404B32102
16012B32385a03375L2813B2643J7587K06829d7124j73915d1846B55818A02792
16001A84406g0639a2753k30796I6672L03661A62908J78578A4361j988a70099d9811
15989C05847Q8846e6162b1047E9187J23167a84182E45966A34084J04426a61869
$$ plain form
16068 -100254 -113406 95175 -87057 -205001 39970 -61623 -38658 23412 -223843 -7107 -276414
16057 -276414 218942 54574 -34024 126141 -41275 41640 276951 -261129 -71187 149083
16046 58328 -72481 -44121 -285066 258596 52862 209504 122074 -117088 -106084 125619 -1102
16034 -167016 162549 -56794 -179537 -209250 327755 -90144 -102787 -208719 -191630 135685
16023 -21443 29078 -464749 517606 -295998 19951 176439 -217943 -15177 -43581 232102
16012 232385 -103375 -70562 22643 40230 247059 -47124 -221039 -41846 255818 102792
16001 184406 -70639 -12753 -243549 96672 400333 162908 341486 14361 12373 -170099 -49811
15989 305847 394693 -56162 -21047 59187 182354 -184182 545966 134084 238510 -161869
15978A76967b6341D18a67752j40018j1291a58758F0559J10321b73989a1577D1338
15966A02959j445J90977I4895i2504B37430E7514c38337B55148E0086k0922a3106
15954B63435f7631K4363k5298A36791a28926B7899g4532r2921P3692F9481K41707
15943C11188e7834A07337A9545K09667A06289c54528a63222H2510d4371j96484
15933b40855A05177b33255A68916q0063a45677O5048A08526J39312d4463G3915
15922D6279J31366N0188k6877e6640F934c06203h7007A2575J09650a65097B38311
15910a30535C8641c44989a36571I387J02038a61493j2064E8313A16d099l4237
15899c8336L528r4138j3543K5014A14796D7469K09111d9373A17354L4395B2396
$$ plain form
15978 176967 -26341 418 -167752 -307770 -319061 -158758 60559 170880 -273989 -11577 41338
15966 102959 101514 292491 94895 -92504 237430 57514 -338337 255148 50086 29164 -13106
15954 263435 -67631 -43268 -68566 136791 -128926 27899 -74532 -167453 -93761 69481 311188
15943 311188 -57834 107337 19545 229212 106289 -354528 -163222 82510 -44371 -240855
15933 -240855 105177 -233255 168916 88853 -145677 -80629 108526 247838 -44463 73915
15922 46279 177645 227833 200956 -56640 6934 -306203 -87007 12575 122225 -165097 238311
15910 -130535 38641 -344989 -136571 9387 111425 -161493 -173557 58313 116 -4099 -38336
15899 -38336 -34808 -128946 -142489 -117475 114796 47469 256580 -49373 117354 151749 22396
15887b82252h9849k02625R1432g7828n8362m84E1152J79218D6173b6354l2345
15876e8699n3378J5369m4275n9420g2238L572R300B18058F6874e3864C4452d8537
15863H9926e0731A96501h3115j80009C9104N7094a69250b0672A56909a9745j24536
15852a44281p227k8267j6778A6037a67504j51859H0943l7372K10554B3734J31252
15841A54986c43640F3259B0944o255K53617g378k56763b3210j28175g3024j00957
15830a73981c9894H1718l2364b616n5922n3639A93495L5599m2365b00536e0556
15818b0762C8928d0503k2145C07215D1952a52600k1641J3180K3485c3840j38301
15807a72141b5336n57I6928l3915d12126B0071b32439D6542P3226b77307O4063
$$ plain form
15887 -282252 -89849 -292474 -201042 -77828 -136190 -136674 51152 230370 46173 -26354 -58699
15876 -58699 -112077 -96708 -140983 -200403 -72238 -68666 -59366 218058 66874 -53864 34452 -48537
15863 89926 -50731 196501 -83115 -263124 39104 96198 -169250 -20672 156909 -19745 -144281
15852 -144281 -151508 -179775 -196553 16037 -167504 -319363 80943 43571 254125 23734 154986
15841 154986 -343640 63259 20944 14689 268306 -7378 -264141 -23210 -151385 -73024 -173981
15830 -173981 -39894 81718 49354 -2616 -58538 -112177 193495 229094 186729 -200536 -50556
15818 -20762 38928 -40503 -62648 307215 41952 -152600 -174241 -161061 -137576 -33840 -172141
15807 -172141 -25336 -25893 96928 63013 -412126 20071 -232439 46542 119768 -277307 -213244
15796b13244D63920e9978b9193C0252A2689c31759a46720B08686D3227L8816a42312
15784b11059C2920b77791c3813B0415K97826i9411k19729h100I2910L91216h5242
15772B14894k7396a76267D9601f1418A2906J46877d5183F809L1764a87460B37913
15760f0747j70150b287B73162A36214J37300d3808q5815M1888j86835C12083A946
15748f0949B8658a05569J64B94985b74925G2280a5394j31936H5289g7399J0287
15737f7112G3234a82252f5631j50462A15751J98476j37628B9300L11473i4050
15726b65579D7752a27292I6778K398D4305O0460A5333N08337B01416C4295P0343
15715A04638k4788k6812j7932b39865F3337Q6644F5918L9624f3044A73420g8591
$$ plain form
15796 -213244 463920 -59978 -29193 30252 12689 -331759 -146720 208686 43227 82043 -142312
15784 -211059 32920 -277791 -33813 20415 318241 -99411 -319140 -8100 92910 484126 -85242
15772 214894 187498 -176267 49601 -61418 12906 159783 -45183 6809 38573 -187460 237913
15760 -60747 -230897 -2287 273162 136214 273514 -43808 -129623 -87735 -274570 312083 1946
15748 -60949 28658 -105569 -105405 294985 -274925 72280 -15394 -147330 85289 -77399 -67112
15737 -67112 73234 -182252 -65631 -216093 115751 314227 176599 29300 340773 -94050
15726 -265579 47752 -127292 96778 99176 44305 104765 15333 523670 201416 34295 104638
15715 104638 79850 53038 35106 -239865 63337 149981 65918 105542 -63044 173420 -78591
15703b56079R2223c8467A42156c47626B4614a35497B7540K44406j35924a63696
15692C1931h5013A56057a23615A83541a30604F3155M9789a09664e1311k38188
15682b89499J41661a6479B4079c44345C60813G1308A0925c33631I3053B7925b0551
15670f3865M738C8570A6431a22714j924j94153b8086l3740j54354r4073a2572
15658d5111a7988k13486R1860F9263P2139b44765O3688a8498n8583f70j0485B79315
15645b01270B37150B3264a07441j41594J23691E5878a85581D1433a27903F3719
15634f670j82380J4351b0389H4794a94555A36311b84903e4376C06890f5856A50737
15622E1317f4668A77764a56392e1290k36797f6923B1475J193d9857l1720l3829
$$ plain form
15703 -256079 -163856 -38467 142156 -347626 24614 -135497 27540 271946 136022 -163696
15692 31931 -85013 156057 -123615 183541 -130604 63155 112944 -109664 -51311 -289499
15682 -289499 -147838 -16479 24079 -344345 360813 71308 10925 -333631 93053 27925 -20551
15670 -63865 -59127 38570 16431 -122714 -124638 -318791 -28086 -61826 -216180 -310253 -12572
15658 -45111 -17988 -231474 -139614 69263 141402 -244765 -181077 -18498 -77081 -670 -11155 279315
15645 -201270 237150 23264 -107441 -249035 -125344 55878 -185581 41433 -127903 63719
15634 -6670 -189050 -174699 -20389 84794 -194555 136311 -284903 -54376 306890 -65856 150737
15622 51317 -64668 177764 -156392 -51290 -288087 -66923 21475 22668 -49857 -81577 -115406
15611a15406l2818e3444k4967a5752A3206J6352a85359j06913E862P2412a35674
15599B16669E3322J21405g0809B27355j10275a23939g398o2206C40485G8633a53482
15587A06128m1616J89292k8465r4918h3420A26496a21126a5036A07957b25162
15576a25950A70032j3863A7500a38540B64347A0701J13550L13747a17609d8160
15565c31628A5893h382p8020j26196A03426h3189D6956i3942k83428J18938e7527
15553e0452A36403a70656D6061a64703C6743b40740n4850f2033D4956J3533a69287
15541B23221j11584d17667A3036b0892l6928l0913c2331k50823D8241a76225e3583
15529c4928A09734J96719a78306h8428B16033J20201Q542a46407j04635E5859
$$ plain form
15611 -115406 -148224 -53444 -78411 -15752 13206 29558 -185359 -292272 5862 78274 -135674
15599 216669 53322 174727 -70809 227355 117080 -123939 -7398 -69604 340485 78633 -153482
15587 106128 64512 253804 225339 130421 -83420 126496 -121126 -15036 107957 -225162
15576 -125950 170032 156169 17500 -138540 264347 10701 124251 437998 -117609 -48160
15565 -331628 15893 -8382 -86402 -212598 103426 -83189 46956 -93942 -377370 -258432 -57527
15553 -50452 136403 -170656 46061 -164703 36743 -240740 -295590 -62033 44956 58489 -169287
15541 223221 111637 -417667 13036 -20892 -57820 -88733 -32331 -283154 48241 -176225 -53583
15529 -34928 109734 306453 -178306 -88428 216033 336234 344776 -146407 -251042 55859
15518d7888k56750a51049C07469d1544B66426b36856C524J08234i91r680B48988
15506c0726k55411h2859A61296M5464l5620o7511A311a36965a4990A95200G1142
15494C61461a2107A0472J0267J8158K2542j1712a03192B19433b07262g1480j76113
15483b47593o3343Q5867A5403H32f1387j95070f0200k019B36941g4062j31946
15472b06008B2320m433J00459a56012l4060B54208A12888a73345m260D0723g4014
15460C9043O4941R110Q8066I2409N5575D3418h693C8903e4776A06461E950a43508
15447C93486A12347g1411B12342a3709I2329M22254a204m0011B01234h112j34945
15436a43057A62448g2882j79697A72555a70135A91878p9697L3068f9693p9726
$$ plain form
15518 -47888 -304638 -151049 307469 -41544 266426 -236856 3524 111758 -991 -10671 248988
15506 -30726 -286137 -82859 161296 206760 171140 103629 1311 -136965 -14990 195200 71142
15494 361461 -12107 10472 20739 38897 61439 49727 -103192 219433 -207262 -71480 -247593
15483 -247593 -310936 -225069 15403 832 -61387 -256457 -60200 -62219 236941 -74062 -206008
15472 -206008 22320 17887 118346 -156012 -190072 254208 112888 -173345 -177605 40723 -74014
15460 39043 103984 113094 201160 92409 147984 43418 -8693 38903 -54776 106461 5950 -143508
15447 393486 112347 -71411 212342 -13709 92329 514583 -1204 -41215 201234 -8112 -143057
15436 -143057 162448 -72882 -252579 172555 -170135 191878 112181 145249 -69693 -149419
15426a49419A84024p6121b00985i275r6452L2838A85716H0131i3211r2446K5870
15415a59787G7489b78684D48146b26330A99284j1285a52458A61679p6833a52669
15404g2261G6944a14223B01112h9711B92487a44368B8280b33571d2042A7758K12889
15393B30647i4760B24908b64125L3613e5962j76420i1514C44324A27630H704d2246
15381a50711A56943f5506j8772A6288N8353o081A5132a10988o6460C30130A25539
15369a68385A06947b91883d5223G8603J83833I6025K6427e0311B61469G3141F075
15357G9634A339d33168e0723F4340c12563a31282c9568J2297k39022B02620a94308
15345C29845a06081b0354H1263d2769D5295J88098e8307a5391A54602R5899b6469
$$ plain form
15426 -149419 184024 107903 -200985 -9275 -105727 -72889 185716 80131 -93211 -185657 -159787
15415 -159787 77489 -278684 448146 -226330 199284 187999 -152458 161679 84846 -152669
15404 -72261 76944 -114223 201112 -89711 292487 -144368 28280 -233571 -42042 17758 230647
15393 230647 -94760 224908 -264125 -230512 -55962 -232382 -91514 344324 127630 8704 -42246
15381 -150711 156943 -65506 -84278 16288 74641 68560 15132 -110988 -177448 330130 125539
15369 -168385 106947 -291883 -45223 78603 262436 96025 122452 -50311 261469 73141 6075
15357 79634 1339 -433168 -50723 64340 -312563 -131282 -39568 -27271 -266293 202620 -194308
15345 329845 -106081 -20354 81263 -42769 45295 233393 -58307 -15391 154602 250501 -26469
15333C9244b20B21560l1851n7439M3436H4861B5840a34113A88732G1675b30660
15321b07126H0146a06158j03667E936L0027O4031a30273A5766M27124f8131j99046
15310b67177h8554B72225J01321b7210A28610J03001p1225K15794A16440N056
15300A21496J85153c8215o2512p4078a1728o0930C05833C646a94711A43285c93250
15288A62609b1983m98567A35998J77764E1303J09021o4228K02172L480a8573i37
15276G0119K21229h2161H3815k385J16993g1268k78188I3356J63694p358a77733
15264D5014O0634b8826A78847a18319J7482R45a650A40497D3838J60613D1768
15252G9855K69298A66933L04319L60222K02315M20664n45849K16150D24828j19366
$$ plain form
15333 39244 -220 221560 189709 132270 175706 84861 25840 -134113 188732 71675 -230660
15321 -207126 80146 -106158 -209825 5936 35963 99994 -130273 15766 442890 -68131 -267177
15310 -267177 -88554 272225 373546 -27210 128610 231611 160386 376180 116440 121496
15300 121496 306649 -38215 -100727 -174805 -11728 -72658 305833 3646 -194711 143285 -393250
15288 162609 -21983 -520550 135998 313762 51303 160324 96096 298268 301748 -18573 -937
15276 70119 291348 -82161 83815 81430 198423 -71268 -349456 93356 257050 249692 -177733
15264 45014 105648 -28826 178847 -118319 -100837 -99892 -1650 140497 43838 204451 41768
15252 79855 349153 166933 471252 831474 1033789 1454453 908604 1124754 424828 305462
15242C05462j32561a15154A07184a07727o557G9967J31944n652J4610r9866b4391
15230b53964g4441j18328A28815C1764Q7666K82971A15309Q1662b55147f9756
15219G3765a60400A74995a25577D6572J74119a00320j43390B63854d9722k21914
15209b71636B62616B3378J06879A0666b21741A18584K42933j13737j10466K00483
15199C37797A52767D9899L6897b00538E9424f3985C08488c04527A83677a17377
15188F5144A521h3980A41376n6638a0804F8673j6124b7138C31373b18015j608
15177b19623E978c18103A26625A3697a41427d9688J9658j22237F0754K0036J06526
15166A87316J9829J23568B8765R7644L70330j62865n0653A02766a09779A94956
$$ plain form
15242 305462 172901 -115154 107184 -107727 -114284 79967 211911 206259 220869 121003 -24391
15230 -253964 -74441 -192769 128815 31764 119430 402401 115309 196971 -255147 -69756
15219 73765 -160400 174995 -125577 46572 220691 -100320 -243710 263854 -49722 -271636
15209 -271636 262616 23378 130257 10666 -221741 118584 361517 247780 137314 337797
15199 337797 152767 49899 86796 -200538 59424 -63985 308488 -304527 183677 -117377
15188 65144 1521 -83980 141376 84738 -10804 68673 52549 -27138 331373 -218015 -219623
15177 -219623 5978 -318103 126625 13697 -141427 -49688 -30030 -152267 60754 80790 187316
15166 187316 207145 330713 28765 126409 496739 333874 283221 102766 -109779 194956
15155B9423R5056iG9352l6211c5276j5877l2940B3181N9554J71985B5321c6379
15142A29483K31747H6700J21009O1051a53270e8789D2242K01942f6758I8564J35945
15131B34509Q3427b27044A85266O5839L474A06400J05923B9773f1551B08753H847
15119a31295B46730K11710d3954D1372L14278c8262H9215k0573K09579q6721J98783
15108C90283A30551h0818j51066B6208J8375e35B19769b10227B51777c30011c4368
15096d6188A77570A543a81144A2746J23391a58936n2626B5379M9012h1137a395
15084E3316c8037a5342A98364a83108B53940r1358M6283k7515n2660l3850a10475
15072b08310C7820M6551L32618b62483C64394a10997E07544A6615B993i2178H738
$$ plain form
15155 29423 124479 -9 79352 43141 -35276 -51153 -84093 23181 82735 254720 25321 -36379
15142 129483 361230 86700 207709 268760 -153270 -58789 42242 244184 -66758 98564 234509
15131 234509 317936 -227044 185266 251105 254579 106400 212323 29773 -61551 208753 8847
15119 -131295 246730 458440 -43954 41372 355650 -38262 89215 68642 278221 191500 390283
15108 390283 130551 -80818 -231884 26208 44583 -535 219769 -210227 251777 -330011 -34368
15096 -46188 177570 1543 -181144 12746 136137 -158936 -211562 25379 74391 -81137 -1395
15084 53316 -38037 -15342 198364 -183108 253940 162582 208865 181350 128690 94840 -110475
15072 -208310 37820 84371 416989 -262483 364394 -110997 507544 16615 2993 -92178 8738
15060a58501A10875L06378b02246A12257b82B22690a58084C47458A31110K46058
15050C77168m3649r7729o1788l5293f0412b980H0620J95988J34102G7055B2185
15038H6880J03857o9672m4676J88701b593A39217a10237G7086K76494A12435g6202
15026G6449J82959J89611B14088K64007B26451m893q6487L57910B37177e486C35926
15014D6285L24322B3899J31547E5164K16837r5459H015K03842q8577D994h4811
15002B45352f5858C34910c68266A27406j1721P5140A9521R5400A1257a14005C7966
14990C03597c42763A68533d3811C36539f7060F4179h0010A59984k179B5248M06249
14979D31497A63436p3810b71054a33448B34687c8338C20000A51211J86098A49625
$$ plain form
15060 -158501 110875 417253 -202246 112257 -282 222690 -158084 347458 131110 377168
15050 377168 333519 235790 174002 138709 -60412 -2980 80620 276608 410710 77055 22185
15038 86880 190737 121065 76389 265090 -2593 139217 -110237 77086 353580 112435 -76202
15026 76449 259408 449019 214088 478095 226451 221558 135071 492981 237177 -5486 335926
15014 46285 370607 23899 155446 55164 272001 176542 8015 211857 123280 4994 -84811
15002 245352 -65858 334910 -368266 127406 115685 190825 19521 114921 11257 -114005 37966
14990 303597 -342763 168533 -43811 336539 -67060 64179 -80010 159984 157805 25248 431497
14979 431497 163436 89626 -271054 -133448 234687 -38338 320000 151211 337309 149625
14968E05271H5527J10271O6131e8037j96433B22484J14531q4710o6552p8585M7828
14957A54996K35341C1173L12255J26625j59670m964d2789q2998A07141a02849
14946C27335r8934a63492A28477K18083j30764j07388J09011J30102M9885j26264
14936B71142j32824K235o5708Q9462L23639A5604J04347Q5960L4440N9720J14131
14925D14202E2275L82783j60861c0310B42785A09338L42053B13868J94858o3178
14915C45548j12364Q9149A15497J48899j06841O816J46981r8677N9415p4221p7526
14904A20343d7514C65222B7560K17986J94644j51829I9681K45156K24096A3286
14893E58764A53739J31099G1833K63943n1822k5061J28915j59597L58590k66123
$$ plain form
14968 505271 85527 195798 261929 -58037 -254470 222484 337015 252305 185753 107168 154996
14957 154996 390337 31173 343428 470053 310383 305419 -42789 -125787 107141 -102849
14946 327335 228401 -163492 128477 346560 215796 108408 217419 347521 397406 271142
14936 271142 138318 140553 74845 164307 487946 15604 119951 205911 240351 300071 414202
14925 414202 52275 435058 274197 -30310 242785 109338 451391 213868 408726 345548
14915 345548 233184 322333 115497 264396 157555 164371 311352 212675 272090 197869 120343
14904 120343 -47514 365222 27560 245546 440190 288361 99681 344837 568933 13286
14893 558764 153739 284838 71833 335776 283954 258893 387808 228211 586801 320678
14883C20678a01090A41825J42661J41639B05829L0403J73237j97691F687J17865
14873A24552n3954J44795J07792n3085P1176A12365P3625K39568j88649H2818
14862B17746M8532l1764P2821P813r0113K9422q6363K17505J77697B07857m1884
14851A65973L35631n446A16927M09791A16352J03353J94250A60919L98979A95242
14840B35125K95401N3886k46904j5054n0608K40428B33501J98747P5666r8316
14830D09598j22487j017o0523A10656D8842L07333J0307j08336L05I0691J62917
14819B53608N60001f2663D23113J62317Q946k47150a95B88717J23988j04295J24791
14808D33201j12153N1097K01278B31625L68753B50667J5230J75668J15702j57711
$$ plain form
14883 320678 -101090 141825 284486 426125 205829 236232 409469 211778 6687 124552
14873 124552 70598 215393 323185 270100 341276 112365 185990 425558 236909 82818
14862 217746 266278 234514 307335 315148 225035 254457 168094 385599 563296 207857 165973
14851 165973 501604 496158 116927 526718 116352 219705 413955 160919 559898 195242
14840 235125 530526 584412 337508 322454 271846 512274 233501 432248 507914 409598
14830 409598 287111 286094 225571 110656 48842 356175 366482 258146 258451 90691 253608
14819 253608 813609 -62663 423113 585430 594376 347226 -195 288717 412705 308410 433201
14808 433201 321048 372145 573423 231625 600378 250667 265897 441565 557267 399556
14798C99556o2768B4947K23907O2965A32465L03785A46533L23501k8740M0698
14788D81992j74532N8914m5247K95826k55217K49517J06742j64746A93317q1923
14778A11394J94774J79351M07459k87119q2400j12103J88957r384B93147N27913
14768H21060l10547q9576L0750r0262K36639K01246j15176k25689n2458J07926
14758E13913O2771j49027L15505C61220L09487p2140r4169A46379M01481O1921
14748F09781k03079L30992l40185O894P8587J17834o0995J37441J65725l74566
14738D68429o8911r2597o5428M59283K18040j72333l11294j1818J23148K74411
14728H20930J8214l99252k0665K32168A93548K92593K74671J46929n5034n896
$$ plain form
14798 399556 336788 24947 248854 311819 132465 436250 146533 470034 441294 481992
14788 481992 307460 366374 321127 616953 361736 611253 717995 553249 193317 111394
14778 111394 306168 485519 892978 605859 523459 411356 600313 590929 293147 821060
14768 821060 510513 420937 451687 361425 598064 799310 684134 458445 405987 513913
14758 513913 576684 427657 743162 361220 670707 598567 504398 146379 547860 609781
14748 609781 406702 737694 397509 404403 482990 600824 539829 677270 842995 468429
14738 468429 399518 306921 241493 700776 918816 746483 435189 423371 546519 820930
14728 820930 839144 439892 419227 651395 193548 486141 760812 907741 852707 846811
14718H46811l83086j93907K38404j08292M82979p3715j21060l42189L78566P7284
14708H01795l33446M28661k26030L2988M4127N8993k32706M3165J26027k15158
14698E28416K06800m1723M04791l00893j03114B15960M90034J28546R6271k21681
14688G09130K46779k31588n2839K86691J42461m26052K47527r1577n2564K53216
14678A031184k77109K61680l34891J4745j97556N08594j42957K08439m84005K56641
14668H44765m2397k68899L76630J6937j8779o1331j67396J50126K14932k81580
14658G63008P2292P2246o3951R9762j20291J8794j40722R3701K10776K68823k95556
14647I78882o8121k1736j37318r926K87863p8856J0054J34526M1692m77138N24721
$$ plain form
14718 846811 463725 269818 508222 399930 882909 809194 688134 345945 724511 801795
14708 801795 468349 897010 670980 703968 748095 807088 574382 617547 743574 528416
14698 528416 735216 693493 1098284 797391 694277 215960 705994 834540 930811 709130
14688 709130 955909 724321 671482 958173 1100634 674582 922109 830532 777968 1031184
14678 1031184 754075 1015755 680864 695609 498053 1006647 863690 1072129 588124 844765
14668 844765 802368 533469 910099 927036 908257 846926 679530 829656 1044588 763008
14658 763008 835300 907546 843595 943357 823066 841860 701138 794839 1005615 1274438 978882
14647 978882 910761 889025 751707 741781 1029644 950788 960842 1095368 1137060 659922 1184643
14636A184643m63232L37020k1768K52315k66372Q0907j13501J38738J1701p9094
14626A061357J57595R0577l08847k12018J42060J34416M2333j78673N99180j70858
14616A357122k44690j87043M47912l93757L24123J24767k38222j51030L40200
14607A379382R8638k97297j67996r3080L33339J42963j41780n9245R3284p9979
14597A208229J54438k64720J59091K02265l28213K3091L06470L3932k9776j31690
14587A333117o4585L09432j15395j47482L48467k24048K14681R332O1235n0256
14577A674498N1736O4627k26570j30302O31717l51455m9432K9155J31213l9423
14567A785764J43798J15280k94677L08352K36546j15753j13643L13778l26807
$$ plain form
14636 1184643 721411 1058431 1036663 1288978 1022606 1103513 990012 1128750 1140451 1061357
14626 1061357 1218952 1309529 1000682 788664 930724 1065140 1107473 928800 1527980 1357122
14616 1357122 1112432 925389 1373301 979544 1303667 1428434 1190212 1039182 1379382
14607 1379382 1478020 1180723 1012727 919647 1252986 1395949 1254169 1194924 1288208 1208229
14597 1208229 1362667 1097947 1257038 1459303 1131090 1154181 1460651 1494583 1464807 1333117
14587 1333117 1268532 1577964 1462569 1315087 1663554 1439506 1654187 1663519 1724754 1674498
14577 1674498 1726234 1790861 1564291 1433989 2065706 1714251 1664819 1693974 1825187 1785764
14567 1785764 1929562 2044842 1750165 2058517 2295063 2179310 2065667 2379445 2052638
14558B052638q0315L89272J62808k805O9585O83227K75714N80297Q66674K137426
14548G134521O700438J4542877K641067r11334q140384A0647470m848858k758463
14540C040149j245954k991k48365J00816j90455L79817k22079J01388J65842k96280
14530A581888L76871l2801M46145n91353K66858j23706k6229j96130J66378J44946
14520B012867K52573k60936j89481P1373O48275l65824J19993j52331L37749j32681
14510B341577j01659r684p645K30296R0220j70143K67121k29920o6792R2244L11840
14499B747455K12425k07520K00976j16197J03366p7455l1232l54527N71077l41110
14489B707258L21443m18591N41474k29042n5269N2041L52897l22956N7383L29803
$$ plain form
14558 2052638 1972323 2361595 2524403 2521598 2591183 3274410 3550124 4130421 4997095 7134521
14548 7134521 13834959 28377836 31018903 30107569 21967185 10647470 5798612 3040149
14540 3040149 1794195 1791204 1542839 1643655 1453200 1833017 1610938 1712326 1878168 1581888
14530 1581888 1958759 1925958 2372103 1780750 2047608 1923902 1897673 1701543 1867921 2012867
14520 2012867 2265440 2004504 1815023 1886396 2534671 2168847 2288840 2136509 2474258 2341577
14510 2341577 2239918 2230234 2222589 2452885 2543105 2372962 2640083 2410163 2343371 2435615 2747455
14499 2747455 2959880 2752360 2953336 2837139 2940505 2863050 2831818 2477291 3048368 2707258
14489 2707258 3028701 2610110 3151584 2922542 2867273 2919314 3272211 2949255 3006638 3336441
14479C336441o4559O195l25746J90337K02673j19033j066J38997J13586j96200
14469C281625M49801j77659N2564j10597L45460M6517k1246L49101j09970k07129
14459C898467r3717J94556J97103K7503l8944m25021M86818p9760j33649L79425
14449D412781O622j49359J53032J21171L57796M0043l12223N5706L24096K1589
14439E031254j85167K97681L7368q5471K94430K82821Q1732m63619O01465J37158
14429F029652j86854N7811n6345K55258k14683N13751r600p0592L07403k76312
14419F349489J52250O07917m6909J2418o9518K66642j74888K02534J03002J06766
14409G509703R7853J92369M44567k14986k61301N06477N1891K19081q862K76937
$$ plain form
14479 3336441 3271882 3278077 2952331 3142668 3345341 3226308 3225242 3364239 3477825 3281625
14469 3281625 3731426 3553767 3606331 3495734 3841194 3887711 3866465 4215566 4105596 3898467
14459 3898467 3804750 3999306 4196409 4223912 4184968 3759947 4246765 4167005 4033356 4412781
14449 4412781 4419403 4270044 4423076 4544247 4902043 4942086 4629863 4685569 5009665 5031254
14439 5031254 4846087 5143768 5181136 5095665 5390095 5672916 5754648 5291029 5892494 6029652
14429 6029652 5842798 5900609 5844264 6099522 5884839 6398590 6388990 6318398 6625801 6349489
14419 6349489 6501739 7109656 7062747 7075165 7005647 7272289 7097401 7299935 7402937 7509703
14409 7509703 7607556 7799925 8244492 8029506 7768205 8274682 8326573 8545654 8536792 8813729
14399H813729P4898K75299J55020J53845R3446q8074O05537o75685M59069M32106
14389A0299190l5767O03023k93613M51035L17341l008J47837K52120M44871J76756
14379A2359785L53167Q9634L99683J89200K60749J08814J45224P43101P4060L94957
14369A5118374j83367K41840Q05302L65903K18304L40619O18703O5436K87500
14360A7878614Q60194K50647K34093L90061L36353P09409N13972M66920P02387
14351B2342650J05482P90709P58063M82053N83552O71546M67491R59866R67764
14342B8129176N00785P12325O32123J058503N90564J132212R83233R57095R29766
14333C5625782J231744J245560J543180O61599J493444J419416J160017J344023
$$ plain form
14399 8813729 8888627 9163926 9318946 9472791 9566237 9478163 10083700 9408015 9867084 10299190
14389 10299190 10263423 10866446 10572833 11023868 11341209 11338201 11486038 11738158 12183029 12359785
14379 12359785 12712952 12802586 13202269 13391469 13652218 13761032 13906256 14649357 14723417 15118374
14369 15118374 14935007 15176847 15982149 16348052 16566356 16906975 17525678 17591114 17878614
14360 17878614 18738808 18989455 19223548 19613609 19949962 20659371 21173343 21640263 22342650
14351 22342650 22448132 23238841 23996904 24478957 25062509 25734055 26201546 27161412 28129176
14342 28129176 28629961 29342286 29974409 31032912 31623476 32755688 33738921 34696016 35625782
14333 35625782 36857526 38103086 39646266 40307865 41801309 43220725 44380742 45724765
14325D5724765K104011J726001J383991K014021J678648K086039K191980J945036
14317F0854492K669284K378335K699264K849249L262295K794474L314142L738243
14309H4559778L569483M007204M145711M669493M761998M854029N471079N966421
14301A22005196O183188O517669O809451P214406Q051250Q378184R244234R657724
14293A84061302J0115528J1170574J1287030J2628512J3143150J3539178J4878693
14286B70823967J5135164J5697169J6566825J6794562J7026081J7405853J6803913
14279C86253534J6811537J5639035J4323970J3030746J0759571Q030625L624881
14272D68473899k755605j1291286r148752J103248l567193l114467o510510q336687
$$ plain form
14325 45724765 47828776 49554777 50938768 52952789 54631437 56717476 58909456 60854492
14317 60854492 63523776 65902111 68601375 71450624 74712919 77507393 80821535 84559778
14309 84559778 88129261 92136465 96282176 100951669 105713667 110567696 116038775 122005196
14301 122005196 128188384 134706053 141515504 148729910 156781160 165159344 174403578 184061302
14293 184061302 194176830 205347404 216634434 229262946 242406096 255945274 270823967
14286 270823967 285959131 301656300 318223125 335017687 352043768 369449621 386253534
14279 386253534 403065071 418704106 433028076 446058822 456818393 464849018 468473899
14272 468473899 465718294 454427008 445278256 446381504 442814311 439699844 433189334 424852647
14264D24852647j0929410j5428680j7257943j7917077j7331837j7594625j7071537
14257C11321538j6648851j5274440j5152792j3834705j3837983j2828481j2170388
14250B11573898j1374019j0917734j0023061r370451q652960q402532p567633
14243A45265508p056147o713604o529515n983697n736799m851843m605502n104117
14235I8684284m155364m284681l819008l331221l163512l293038l273623k827801
14227G0536036k575409k810597k543105k282232k351804j681190j525963k466439
14219E2299297j662711j983290j277697j427590j451080j375510j498728j064354
14211D0558337j436004j025905j197680j176806m32808q88407j346500j050185
$$ plain form
14264 424852647 413923237 398494557 381236614 363319537 345987700 328393075 311321538
14257 311321538 294672687 279398247 264245455 250410750 236572767 223744286 211573898
14250 211573898 200199879 189282145 179259084 169888633 161235673 152833141 145265508
14243 145265508 138209361 131495757 124966242 118982545 113245746 108393903 103788401 98684284
14235 98684284 94528920 90244239 86425231 83094010 79930498 76637460 73363837 70536036
14227 70536036 67960627 65150030 62606925 60324693 57972889 56291699 54765736 52299297
14219 52299297 50636586 48653296 47375599 45948009 44496929 43121419 41622691 40558337
14211 40558337 39122333 38096428 36898748 35721942 35289134 34400727 33054227 32004042
14203C2004042q84501q95518o69206o91771q44596n75500j100868n91948o15681
14194B5134453m62624m16387r29444m29469o63067m50688o79997m40026m77912
14185B0184839n80515l33310l82049m58575j61381n02254o55568k06106m06388
14176A6498693j91794m16088j71860m02340k54450k95811l69316j17729n39723
14167A3739582j90504n66139L42080j38309m65503l18856P8169j9794p91940j77492
14157A1491294l3041l95819j46412N6852p641m47536j98211J06758l08392j47120
14147I970732q2230m45926P3381l70959P2161j59104R0953m22533p8732n05729
14137H142014M21280k51379p5296k68979O9202j12386n11943L64726l01619K951
$$ plain form
14203 32004042 31119541 30224023 29554817 28863046 28018450 27442950 26342082 25750134 25134453
14194 25134453 24671829 24255442 23325998 22896529 22233462 21782774 21102777 20662751 20184839
14185 20184839 19604324 19271014 18888965 18430390 18269009 17766755 17111187 16905081 16498693
14176 16498693 16306899 15890811 15718951 15316611 15062161 14766350 14397034 14279305 13739582
14167 13739582 13549078 12982939 13325019 13186710 12721207 12402351 12480520 12460726 11668786 11491294
14157 11491294 11458253 11062434 10916022 10972874 10965233 10517697 10319486 10426244 10117852 9970732
14147 9970732 9888502 9442576 9515957 9144998 9217159 9058055 9149008 8726475 8647743 8142014
14137 8142014 8563294 8311915 8236619 7967640 8036842 7924456 7412513 7777239 7475620 7478571
14127G478571k05696j2501j90885m18449M33124m40341j20076n0918L42242n00579
14117F314492Q9123k17193n3143l12712L03679j19377j67605m2620j44073n4617
14107E595954N9178R2030R6371o26884K55002k12340l6302k0594k22055L59545
14097E339905o32775J08928j68879j37361M19754o32095L2222L64555l73045N01127
14087D822336m43443j03653j2521J68037l11962Q8829p5403Q5096o57807M91415
14077D050924j26940K57519r6832m74089J08581j88138N0204J16823m7948k17674
14067C432430j522P8060j65126J28653m1572K9269J44202m03946N0670Q0728M8028
14056C379874p6609j70031r7508J89491o8829j47480J00633j70605O117k00715
$$ plain form
14127 7478571 7272875 7260374 7069489 6651040 7084164 6643823 6523747 6472829 6815071 6314492
14117 6314492 6403615 6186422 6133279 5820567 6124246 6004869 5837264 5794644 5650571 5595954
14107 5595954 5655132 5747162 5843533 5216649 5471651 5259311 5223009 5202415 4980360 5339905
14097 5339905 4707130 4816058 4647179 4509818 4929572 4297477 4329699 4694254 4321209 4822336
14087 4822336 4378893 4275240 4262719 4430756 4118794 4207623 4132220 4217316 3559509 4050924
14077 4050924 3923984 4181503 4084671 3610582 3719163 3531025 3581229 3698052 3650104 3432430
14067 3432430 3430908 3508968 3343842 3472495 3430923 3460192 3604394 3200448 3251118 3331846 3379874
14056 3379874 3303265 3133234 3035726 3225217 3156388 3008908 3109541 2938936 2945053 2744338
14046B744338K47997K33333m00415k86233N55873l79505j68002M16206j83278
14037B780314k91163r802p4585j26756Q2552M77671j90640p3022J07369J07207
14027B789145j44560j75118O8091j48344j56500M4354K15871m04772K34263k429
14017B320001k39404q6726M39201K8562l08690j52771m4598J45707J34778k00010
14007B036050j83058K47163j86742q8309R363l44581O10982k95392j93654J71979
13997A783801j59872Q5002j92996L7419K30436O6203K02161K30214J146780M391699
13987G820847J4630027N015723K107002m975935j0235652o024875k249867j741111
13979D346159r41793m02698k90069N527k97100J21442k42908j95887J3034j7987
$$ plain form
14046 2744338 2992335 3225668 2825253 2539020 3094893 2715388 2547386 2963592 2780314
14037 2780314 2489151 2479349 2404764 2278008 2360560 2838231 2647591 2574569 2681938 2789145
14027 2789145 2644585 2469467 2537558 2389214 2232714 2277068 2492939 2088167 2322430 2320001
14017 2320001 2080597 1993871 2433072 2461634 2152944 2000173 1955575 2101282 2236060 2036050
14007 2036050 1852992 2100155 1913413 1825104 1834467 1489886 2100868 1805476 1611822 1783801
13997 1783801 1623929 1708931 1515935 1553354 1783790 1849993 2052154 2282368 3429148 7820847
13987 7820847 22450874 27466597 29573599 24597664 14362012 8337137 6087270 4346159
13979 4346159 3404366 3001668 2711599 2717126 2420026 2541468 2298560 2102673 2115707 2097720
13969B097720J25967l92435J23910j39896O4791J19753J30574j50282k27530J09481
13959A862053k80670K74547j23592j21958R4907J00511l49619J56027K44187k39019
13949A617374R2684j06114J06681j60708J7591J9119L24911k46909m7787Q2576
13939A699418J01473k09550j17925j7225J68982m971n22895M24254j13943K2860
13929A430478N5849j03651j86946J39966l7607k59811N72724m90919J41963j39940
13919A122106K08308j1385l67658M48037j14162m3550j69451K57223J8224Q054
13909A355746j95884M9111p4823J59627n1449J5896l12054K40790m20193N11337
13899A278104r6484K73890l12476J03384j65243J11058P3567j43038j43350K78165
$$ plain form
13969 2097720 2223687 1831252 1955162 1815266 1880057 1999810 2130384 1980102 1752572 1862053
13959 1862053 1581383 1855930 1732338 1610380 1705287 1805798 1456179 1612206 1856393 1617374
13949 1617374 1710058 1603944 1710625 1549917 1567508 1586627 1911538 1664629 1616842 1699418
13939 1699418 1800891 1591341 1473416 1456191 1625173 1620202 1097307 1521561 1407618 1430478
13929 1430478 1486327 1382676 1195730 1335696 1298089 1038278 1611002 1120083 1262046 1122106
13919 1122106 1330414 1319029 951371 1399408 1285246 1241696 1072245 1329468 1347692 1355746
13909 1355746 1159862 1208973 1134150 1293777 1242328 1258224 946170 1186960 766767 1278104
13899 1278104 1181620 1455510 1143034 1246418 1081175 1192233 1265800 1122762 979412 1257577
13889A257577j16741J53639m85491M8816o6141J88698K71389j24686J76231m68995
13879H34296J28947j63318J12668K47863m16275J67402K30542j20258m37640M08590
13869I92817N9303k49688K8513K65715j19521J39434J15591k29222J3810j27927
13859H88825K11960M0523E00565L80426k2007j87560K02431O7583N7042j83028
13849H15452l0649K41128l54279J81351p7081K8714M38446m90656k38869L16171
13839H29728m0157J49979m45074K75384R52M4057K6215R2039k52572o1071O4882
13828F84362j55625L49903k66672J9188R1018M328j25459P0542L79102k47864
13818H02823J98316C10307K60238J14128O7349M67290l18650k45916j15689J57091
$$ plain form
13889 1257577 1140836 1294475 808984 857800 791659 980357 1251746 1127060 1303291 834296
13879 834296 963243 799925 912593 1160456 744181 911583 1142125 1021867 584227 992817
13869 992817 1052120 802432 830945 1096660 977139 1116573 1232164 1002942 1016752 888825
13859 888825 1100785 1141308 500565 880991 858984 671424 873855 941438 998480 815452
13849 815452 784803 1025931 671652 853003 775922 804636 1243082 752426 513557 829728
13839 829728 789571 939550 494476 769860 770812 814869 841084 933123 680551 619480 684362
13828 684362 528737 878640 611968 631156 722174 726502 601043 671585 1050687 802823
13818 802823 1001139 310307 570545 684673 752022 1219312 900662 654746 539057 696148
13808F96148L84000D59841K47414j38976J80834l73642j8176K85956r2723j14584
13798D35944P7844j32626K16639J28980j58772J97313k0571B66448K52508R0092
13788F09048k78919N81240l82713K57865k606k29118k17420K26551M7343K72723
13778H83994j98576p2615B9128M05089J46532J00227J07908j55948k17760J60436
13768E75612J40329P5090j56528k48883L7629L32349j31901K54305l92784K3295
13758E08513R5074j88779K58499B69459L74368j43095m1142p0147q2409J67414
13748D74448k8232K25098C26595K39953J00392o57r3153N2049N4504P335K3269
13737G10287j70103k026j23223j86986J97259L79163l01728j59865K8142J52974
$$ plain form
13808 696148 1080148 459841 707255 568279 749113 375471 357295 643251 550528 435944
13798 435944 513788 381162 597801 726781 568009 765322 744751 266448 518956 609048
13788 609048 330129 911369 528656 786521 783915 554797 337377 563928 611271 883994
13778 883994 685418 612803 29128 434217 580749 680976 788884 632936 415176 575612
13768 575612 715941 791031 634503 385620 423249 755598 623697 878002 485218 508513
13758 508513 603587 414808 673307 269459 643827 500732 459590 389443 307034 474448
13748 474448 446216 671314 326595 566548 666940 666283 573130 625179 679683 687018 710287
13737 710287 540184 538158 414935 227949 425208 804371 502643 342778 370920 523894
13727E23894B53250M50722L5834l59637K88764k58487M6024J7752P2385j43126
13717D03481J41018J00075k11B91175o7937J65312K8590k1002J70140B34101L18652
13706E52753k36527L36035k82316J99500G8057L66701M07072M2270k07026B40163
13695D53658Q4188B56655K53797j45221K16939R8899j55497j30426N6493p5777
13685C75862N7585J62205B97784N8532a66841E24831k17348J77260o140j18051
13675C60552j05407J51302j26990J78224J3113J90786k95597M6713p4036J11823
13665D50483O6780j5421J24582k53317M3863J22246E4616M00317L51785C87711
13654G83918k87870B21438H4971K32751r4229J22656o7633K36745q234A44296
$$ plain form
13727 523894 253250 703972 739806 380169 668933 410446 456470 474222 546607 403481
13717 403481 544499 644574 644363 291175 223238 388550 417140 396138 566278 234101 552753
13706 552753 316226 652261 369945 569445 78057 444758 851830 894100 687074 240163
13695 453658 537846 256655 510452 365231 582170 681069 525572 395146 451639 375862
13685 375862 433447 595652 297784 356316 -166841 524831 307483 484743 478603 360552
13675 360552 255145 406447 279457 457681 470794 661580 365983 412696 338660 450483
13665 450483 517263 501842 626424 373107 416970 539216 54616 454933 806718 387711
13654 783918 496048 221438 84971 317722 223493 346149 278516 515261 507027 144296
13643B26218j703J15624D1488K94593A34351J63665J91100J3335j99599J61832
13633D64684J44500k85374J26924J0086A99184B0430O64421B16062K47111A47641
13622D6796K31395k2184K53508P8286B45752K28290k26331J23182l6197j45663
13612A89033L05878Q9578B04157K05626r7679J67327r3745E3108O9998N04163
13602F27269l03620l1075H9289M30373B55109J98940E0128K18018K14443l5632
13592D46957G9087J63557j20839a9911A49683N51906k06766K3078j03490j14647
13582B99764Q5238K33910k60345J11414j07330J78259j21236B03604K77241A42365
13571E55685B73970n574o6541L10731r7978J69024B41280i7796B89566K27963
$$ plain form
13643 226218 224515 340139 41488 336081 134351 298016 489116 502451 302852 464684
13633 464684 609184 323810 450734 460820 199184 20430 684851 216062 463173 147641
13622 46796 278191 256007 509515 587801 245752 474042 247711 370893 334696 189033
13612 189033 494911 584489 204157 409783 312104 479431 385686 53108 123106 627269
13602 627269 323649 292574 89289 519662 255109 454049 50128 268146 482589 446957
13592 446957 79087 242644 121805 -19911 149683 701589 494823 517901 414411 299764
13582 299764 385002 618912 358567 469981 362651 540910 419674 203604 480845 142365
13571 555685 273970 268396 201855 512586 414608 583632 241280 -97796 289566 517529
13561E17529k27259P8535O7114J99418k38296a21381C51674G8126b13759B16370
13550A85326p7633K12996m7231J54733F2617P4764L77705j85695J32456A49956
13539C59672J06622k7748A83817L98664k13862p6638A24207L19126j51190k5425
13529B66718l2658e1087C92204A74503K00995D7732h4852A28003J23047J42851
13519C93901A87239J05044B9173g609C51933A37773B6174L99131A46055J09032
13509B55087R4372K4654j67550R3416N2292B4189K49984J93085A87419F6413N6173
13498A22586P0467K54094A16806K93081A81834J51525e4761D74465C6243M21617
13488D57860j38902k4066a20471B37116p8192L26170B31522j1269I6230R3201
$$ plain form
13561 517529 290270 368805 435919 635337 397041 -121381 351674 78126 -213759 216370
13550 185326 107693 320689 273458 428191 62617 137381 515086 329391 461847 149956
13539 359672 466294 438546 183817 582481 368619 291981 124207 443333 292143 266718
13529 266718 234060 -51087 392204 174503 375498 47732 -84852 128003 251050 393901
13519 393901 187239 292283 29173 -7609 351933 137773 26174 425305 146055 255087
13509 255087 349459 374113 206563 299979 352271 24189 274173 467258 187419 66413 122586
13498 122586 193053 447147 116806 409887 181834 333359 -54761 474465 36243 457860
13488 457860 318958 294892 -120471 237116 158924 485094 231522 220253 96230 189431
13478A89431n1809K16328o635A55150E8825J61209l5220f7000A13116K01428n0808
13467B63736j18466K01596Q8364j8757D69J94672J00549K75865A61559j4780a28416
13455E9993L76189g7386m431C41676F0544J37480H6668l7405L63161q6135A31141
13443e4773B36566p010J08324A7736G300J1739J37713F5728Q4781Q3914J37584
13432C72007A04904b51769D561L33168d2846A11483O1092M9276E0156J03361F5273
13420A89062J26575I2061A206J53902P5615G3289P8106a66470C37649D2578c4355
13408D88326k09640J3425k8434o5030J34032C4380i143F540J42976J08391B7737
13396B55437J77780d1313B19371F9593K714j8986M38268H3292a77898G9141c2105
$$ plain form
13478 189431 137622 353950 347315 155150 58825 220034 184814 -67000 113116 314544 263736
13467 263736 145270 346866 435230 416473 469 195141 295690 571555 161559 146779 -128416
13455 59993 436182 -77386 -81817 341676 60544 198024 86668 49263 412424 326289 131141
13443 -54773 236566 229556 337880 17736 7300 19039 156752 65728 150509 234423 372007
13432 372007 104904 -251769 4561 337729 -42846 111483 172575 221851 50156 153517 65273
13420 189062 315637 92061 1206 155108 230723 73289 151395 -166470 337649 42578 -34355
13408 488326 278686 292111 263677 198647 332679 34380 -9143 6540 149516 257907 27737
13396 255437 433217 -41313 219371 69593 72307 53321 491589 83292 -177898 79141 -32105
13384A71046D3431a14072A07778a1232B8141a05253A39502P7183m1599h6472B79901
13372a15444A88302L48921e8111B12882H6779N1590D1044O659P1149L35251b14413
13360A20489M78198g8792H6561J35128L9074p9334e0946F07717B55663R7081l1617
13349C21127P0334j09340J78589r0301N4193B02735M4523J12244P2610A00976
13338D08880p9601O5476H0304k6542J43851O4329p5402q8159K33975l1732j24545
13327A76079D0958M67281j23625r8461K02935a1327A60664L01195l0656A7605
13316B64199C8051a12792C09813E4677L12396j18550L9101A25627B6965J86132
13306B13097o8274M0285Q9567g9145b8094A36957D7993b13965A36063k7454J21030
$$ plain form
13384 171046 43431 -114072 107778 -11232 28141 -105253 139502 216685 175086 -86472 279901
13372 -115444 188302 537223 -58111 212882 86779 138369 41044 47703 118852 454103 -214413
13360 120489 598687 -78792 86561 221689 260763 181429 -50946 607717 255663 352744 321127
13349 321127 391461 282121 460710 370409 424602 202735 247258 359502 432112 100976
13338 408880 329279 394755 80304 53762 197613 261942 186540 98381 332356 300624 176079
13327 176079 40958 508239 384614 286153 489088 -11327 160664 461859 431203 17605
13316 264199 38051 -112792 309813 54677 367073 248523 287624 125627 26965 213097
13306 213097 144823 185108 274675 -79145 -28094 136957 47993 -213965 136063 108609 229639
13295B29639A8011k00K40665A9009a40268l8334A84280R6501r6464K10647P4988
13284D69952A03449J58732F0952N73053a9896A99067i9120A96532a02178A56566
13273C4401A6539M6663d8728k0994b4126E7972P0604L07499A94720J27420A03497
13261c1851B47873b9743D66666a03154A37034a80447C38601b17853A48668a10022
13250D99497p6543A2792J81257k0298R4831F9433b79829A64312J6088F773K5496
13239C2269R4678J03623P730J1070M2865B2820J63825a78980F1360b3309j05357
13228a28666C33897q576j47324J15063a3992A21767a12334A50829C9672a7657
13217C91266j58580h0359m5732D17119D013K16740i7207B33143a7868H8804J40528
$$ plain form
13295 229639 18011 17811 258476 19009 -140268 -178602 184280 280781 184317 394964 469952
13284 469952 103449 262181 60952 634005 -19896 199067 -99120 196532 -102178 156566
13273 34401 16539 63202 -48728 -69722 -24126 57972 128576 436075 194720 322140 103497
13261 -31851 247873 -29743 466666 -103154 137034 -180447 338601 -217853 148668 -110022
13250 499497 422954 12792 194049 173751 268582 69433 -279829 164312 180400 6773 32269
13239 32269 126947 230570 238300 249370 292235 22820 186645 -178980 61360 -23309 -128666
13228 -128666 333897 325321 177997 293060 -13992 121767 -112334 150829 39672 -17657
13217 391266 232686 -80359 -126091 417119 4013 220753 -97207 233143 -17868 88804 229332
13206B29332r8746J13702a81594I218f6198A69710D7909b32549B05565b14430
13195e0671A20488a34136A95826a6912J897H1295J08872K26581A03441c4035A41830
13183E7507M47840j13661L0553G6028K40421j14240a49989A03899b4009q4975
13173a08984A73843n8239P1335f7130j31660C44937H3064M9098B4797P3198P6185
13162A74180c20733A01639B9499M70912c3632A36024b42305i9132A43430J47951
13152B91381b1611j00979l3540O9919C1517a1247L840n8771B15511G475f1935
13140C27951f1122A19505a11628A26137o815J78434g7154B6396e6545B17575C041
13128G8788J37849a14043d293o3391l15122B83587a19444C5731P4703a28275d2349
$$ plain form
13206 229332 130586 244288 -181594 9218 -66198 169710 47909 -232549 205565 -214430
13195 -50671 120488 -134136 195826 -16912 -15015 81295 190167 416748 103441 -34035 141830
13183 57507 505347 391686 422239 76028 316449 202209 -149989 103899 -24009 -108984
13173 -108984 173843 115604 186939 -67130 -198790 344937 83064 132162 24797 97995 174180
13162 174180 -320733 101639 29499 500411 -33632 136024 -242305 -99132 143430 291381
13152 291381 -21611 -122590 -156130 -86211 31517 -11247 -7407 -66178 215511 7475 -61935
13140 327951 -61122 119505 -111628 126137 119322 297756 -77154 26396 -56545 217575 3041
13128 78788 216637 -114043 -4293 -67684 -382806 283587 -119444 35731 110434 -128275 -42349
13116f2224A98118a66051A38503i5638M1686A03103c8099j19580B01206J64837
13106C66043a13330K4519B31968l2733B0177J40684J5681a15380B67985r268C3080
13094c34725A8960K79076j04426b00391R1817M7825k2601A52216r254b20990A0712
13082B89691A12947O15d6356C9401L3089R0212J61307a06037b8870j28517E0832
13070a09792k08615M9913h7833M0021E10580f9873H8245D0024A5784M7045B5561
13058B47079G3526e3229j26842C6713Q844j1170L4071l0383b28840A41385k3467
13047A17918D1228c8925H887Q9827f265C39748A09995k3268J81108C6637J00510
13036A37147J32916J25594A69999J43212a18611B26552I1591a3750D1117O4988
$$ plain form
13116 -62224 198118 -166051 138503 -95638 -53952 103103 -38099 -157679 201206 366043
13106 366043 -113330 -88811 231968 199235 20177 160861 176542 -115380 267985 258717 33080
13094 -334725 18960 298036 193610 -200391 -108574 -60749 -83350 152216 142962 -220990 10712
13082 289691 112947 113562 -46356 39401 72490 162702 324009 -106037 -28870 -157387 50832
13070 -109792 -318407 -268494 -87833 -47812 510580 -69873 88245 40024 15784 62829 25561
13058 247079 73526 -53229 -180071 36713 45557 34387 68458 38075 -228840 141385 117918
13047 117918 41228 -38925 8887 98714 -6265 339748 109995 86727 267835 36637 137147
13036 137147 270063 395657 169999 313211 -118611 226552 91591 -13750 41117 106105
13026A06105b6491A43521J6557P9451j5435j04094m6789C3437J37969e3696A6737
13014f3247B62322f2582A50755b70638A69117J83757C7013d8199j12272A11044
13003B24324H0167a1265B5411K32972C5658A073a39944M8339A2070N2209J21609
12992A85888J3988O9485c04267A85807J6084J83357A15732J3058C1079a59673
12981A76615o6333c1432j7138k20183a0151j06092H9754b3258G452b81864I519
12969A09630c1927A37601N3353M6348m3424k1103a19855F1417a06984j72002H9464
12957A24448j0252k2548r610N701b2082B09687Q4007F252K63830b5115m55252
12946d80367D4516K41979g7658D4941J5740K3628N0769e8664p4294A22704O2357
$$ plain form
13026 106105 -26491 143521 160078 239529 224094 120000 73211 33437 171406 -53696 16737
13014 -63247 262322 -62582 150755 -270638 169117 352874 37013 -48199 -160471 111044
13003 224324 80167 -11265 25411 258383 35658 1073 -139944 -91605 12070 64279 185888
12992 185888 199876 269361 -304267 185807 201891 385248 115732 128790 31079 -159673
12981 176615 110282 -31432 -48570 -268753 -10151 -116243 89754 -23258 7452 -281864 9519
12969 109630 -31927 137601 190954 237302 193878 172775 -119855 61417 -106984 -278986 89464
12957 124448 114196 91648 82038 87739 -22082 209687 293694 6252 270082 -25115 -480367
12946 -480367 44516 286495 -77658 44941 60681 84309 135078 -58664 -132958 122704 185061
12935A85061J94568h8357E62a09152N3820a0512I905b11163F0824A1333c23697
12923a85158f3520A70983i3407m9585m0023l2641A57914k613N382G6158P6679
12912A52837i4480A63304F2849J18608B1841J94838r5833D2336a08671K5867C78303
12900G5948J67823a1740j49913n8865A48514a31936I2513L20918B02275a58032
12889D44577f6272K6202l5233E1005R1180a9754B1505d07719c1910G5454L7045
12878A12499m0151k3333L04144A42218b2248B96545k0708b7316A96324Q4749b24003
12866b05532D2465c1770C3453a78464A2163a51263B81085A15194c54409d5165
12855a46126E3554R2291a34097e8018m4056B66684b7643A02744j0382a94671I5390
$$ plain form
12935 185061 379629 -88357 562 -109152 -55332 -10512 9905 -211163 60824 11333 -323697
12923 -185158 -63520 170983 -93407 -142992 -183015 -215656 157914 155301 160683 76158 152837
12912 152837 -94480 163304 62849 181457 21841 216679 120846 42336 -108671 -82804 378303
12900 75948 243771 -11740 -161653 -220518 148514 -131936 92513 413431 202275 -158032
12889 444577 -66272 -40070 -75303 51005 142185 -19754 21505 -407719 -31910 75454 112499
12878 112499 72348 49015 353159 142218 -22248 296545 275837 -27316 196324 281073 -224003
12866 -205532 42465 -31770 33453 -178464 12163 -151263 281085 115194 -354409 -45165
12855 -146126 53554 145845 -134097 -58018 -102074 266684 -27643 102744 92362 -194671 95390
12843a57215D8507J97335A7241c1912A23323a89963N5608M580K4392K0455b4594
12831b0636A70341a92643H2306r517N3951d35464I3050F804a39959L9119C0336
12819a71236f5271j31852A11826J47795l5094G2434M1246A1982J05999m2257a99356
12807E43019C2266i6489I7067e4369B25764b39045k4098a08906E6869b37079a0994
12795B06681j2033e8411l27996a23403k16870A44745R1235j10810D0501b1883
12784a46015A27844b70168C0953M8083j2278R0485a51977A64689a80705J7100
12774a63605D3845J03293c422E9886L6984a19454C51288A437c4372k58305B12376
12762E3043J61833a26430C20415b36932A22502K45434j50884I8568n60h186o167
$$ plain form
12843 -157215 48507 245842 17241 -31912 123323 -189963 -134355 -129775 -105383 -84928 -24594
12831 -20636 170341 -192643 82306 72789 126740 -435464 93050 6804 -139959 -100840 30336
12819 -171236 -65271 -197123 111826 259621 224527 72434 113680 11982 117981 75724 -199356
12807 543019 32266 -96489 97067 -54369 225764 -239045 -263143 -108906 56869 -237079 -10994
12795 206681 194648 -58411 -386407 -123403 -340273 144745 235980 125170 40501 -21883
12784 -146015 127844 -270168 30953 79036 66758 157243 -151977 164689 -180705 -163605
12774 -163605 43845 147138 -3422 59886 96870 -119454 351288 1437 -34372 -292677 212376
12762 53043 214876 -126430 320415 -236932 122502 367936 217052 98568 98008 -8186 -14353
12751a4353A41951a04187C10842a40161H6728J32287A3228K73421B9898K1820
12741E1718P179k1983L4914Q5570a43701C69777A22752b52630C82782A7953a79036
12729A67756D8674h6706A56561J551f7105B654L7436N4839g0806r8235I455L0044
12717C9499N683a53332d7235m6647j532A24911K38315M8338A79375R1054n6011
12706B14418N4613k3609K69390l8417c6257C35723M6057F2508N0343n3422K6844
12695H6273J30997k6421a93513F783N3700f3892e532j4736I0557c41243d3551
12683B648K54809i3603B39427P4778A27339m1813d2150A01900J06895e5637K5574
12672c0063j10250A23218d92r0941l51733h7867A70585k6538g0246B89328E3544
$$ plain form
12751 -14353 141951 -104187 310842 -140161 86728 219015 13228 286649 29898 51718
12741 51718 58897 36914 71828 157398 -143701 369777 122752 -252630 382782 17953 -179036
12729 167756 48674 -86706 156561 158112 -67105 2654 40090 94929 -70806 -169041 9455 39499
12717 39499 45182 -153332 -47235 -93882 -95414 124911 363226 411564 179375 270429 214418
12706 214418 269031 245422 514812 476395 -36257 335723 381780 62508 112851 59429 86273
12695 86273 217270 190849 -193513 6783 60483 -63892 -5532 -20268 90557 -341243 -43551
12683 2648 257457 -93603 239427 314205 127339 85526 -42150 101900 208795 -55637 -30063
12672 -30063 -140313 123218 -492 -91433 -443166 -87867 170585 144047 -70246 289328 53544
12660B46577J510F2512O7032L9359a0745G4789K35631Q7537j84619j5421D2785
12648A64501n0002M1365c9104A20250i8559c0726C49501j02279A6421K75379B4169
12636a73256A90739J25146a22553l2348G8488L9921J82865i2558A32120A8518
12625B57034n7428p3151O1609K5445b2081B07857a50453c0045A79524b40093A93778
12613A20287f943D483a43272k7515C17171A30996E353a26498r1876k28477A01067
12601a34932N0971l0568D19218B2295Q994J61755H3426P052J7605c25454A90724
12589g6776A75658a32479E0907A1689i7701A38596a32312m5186A27359E1584K89466
12578C41050g4477C77425G8860b3769I4094k412L7001C2182b26183n6608C13008
$$ plain form
12660 246577 248087 62512 129544 168903 -10745 74789 310420 397957 213338 197917 42785
12648 164501 114499 155864 -39104 120250 -98559 -30726 349501 247222 16421 291800 24169
12636 -173256 190739 315885 -122553 -154901 78488 118409 301274 -92558 132120 18518
12625 257034 199606 126455 188064 213509 -22081 207857 -150453 -30045 179524 -240093 193778
12613 120287 -6943 4483 -143272 -170787 317171 130996 5353 -126498 -218374 -446851 101067
12601 -134932 -83961 -114529 419218 22295 31289 193044 83426 90478 108083 -325454 190724
12589 -76776 175658 -132479 50907 11689 -97701 138596 -132312 -177498 127359 51584 341050
12578 341050 -74477 377425 78860 -23769 94094 91682 128683 32182 -226183 -282791 313008
12566C9057J69716G1630J76918J10951A12964a29645M7640A17942g4858A257K7385
12555B8642M9793Q07d6611A86609a97243h6855A97896G2703c62836c5188j47481
12544a82669C6264c813j89380L6398A59361B1079i4211k2645A36028F452J55499
12533A61951a10828j16479C7678L11540l7084b5066B32348A1216P898J11647E2588
12521B6654a63425q2024A00886J36072K07852D1340J12583Q2574E9569G291J09731
12510A17022a06078a8106B33781J47692G8305L87620N8703a75204I9688O9919
12500A69607J50671b74048A02143j7949b40225a04119B02867F2598P101L3258
12490A02957R7262d3950j45040g4900R494q9359C46453a62020A20963K44716a79653
$$ plain form
12566 39057 208773 71630 248548 359499 112964 -129645 -82005 117942 -74858 1257 28642
12555 28642 78435 79242 -46611 186609 -197243 -86855 197896 72703 -362836 -35188 -182669
12544 -182669 36264 -3813 -193193 -156795 159361 21079 -94211 -116856 136028 6452 161951
12533 161951 -110828 -227307 37678 349218 312134 -25066 232348 11216 19114 130761 52588
12521 26654 -163425 -245449 100886 236958 444810 41340 153923 236497 59569 7291 117022
12510 117022 -106078 -18106 233781 381473 78305 465925 524628 -175204 99688 169607
12500 169607 320278 -274048 102143 84194 -240225 -104119 202867 62598 69699 102957
12490 102957 200219 -43950 -188990 -74900 -65406 -154765 346453 -162020 120963 365679 -179653
12478A56066R517C9676M87980J20964A929P9300a35379j78555B38526o1428i0855
12466A56148b32237d3475j76008b4105E8455J20336Q9706q4572q7537a8697A62800
12454A17184c25967D30502A83203b58259D06937j21453d2928k23980f1166k1418
12444h2584k4566A15843b33661B19571a52707l665g0063A08892a37735k94559
12434d32294a02777D5907j299c6076B50636H2127j8477J2535b8176B7747a67931
12422f2298p2063B0441a09932A49952B2588a93644A07960J59025a64056h0593
12411B06603l3364b70795a79A14920F174K3673a17858L1197A46741a91383H2449
12399C26904r3556a05027I9057a20588k0756B60798b25330A93169c15785e1151
$$ plain form
12478 156066 165583 39676 527656 648620 1929 81229 -135379 -313934 238526 177098 -90855
12466 156148 -232237 -43475 -219483 -24105 58455 178791 268497 183925 96388 -18697 162800
12454 117184 -325967 430502 183203 -258259 406937 285484 -42928 -266908 -61166 -82584
12444 -82584 -107150 115843 -233661 219571 -152707 -156372 -70063 108892 -137735 -432294
12434 -432294 -102777 45907 44608 -36076 250636 82127 63650 76185 -28176 27747 -167931
12422 -62298 -134361 20441 -109932 149952 22588 -193644 107960 266985 -164056 -80593
12411 206603 173239 -270795 -179 114920 6174 29847 -117858 -86661 146741 -191383 82449
12399 326904 233348 -105027 99057 -120588 -141344 260798 -225330 193169 -315785 -51151
12388b33039e3510B75544a12979m6315j18473k58954A05895K29710a0215j57768
12378a67983d096B04695b98712d6003j41815g2826C12594b1517p2899A705b92098
12366b05945c478A17285c73839a43304O8083B56854n0707B6310b79997f4760B40691
12354A05416D5932R1044E5094h1718A83188a91698r6974G0199b84385Q9538K3424
12343a71423p4287C33985Q5177A90497b46357I8548b71190D6629K25448a2525
12332F1156a31803c0221L227k99676C9195N9955a88118C45636I0859a68373C73569
12320D4880c75163A07556c69054G7037K3000a7983k31898A17183E5387K26307
12310B81694a65147F4022a55483C11597a2072l25132A36153b8371n8638o2493
$$ plain form
12388 -233039 -53510 275544 -112979 -159294 -277767 -536721 105895 335605 -10215 -167983
12378 -167983 -4096 204695 -298712 -46003 -187818 -72826 312594 -21517 -94416 1705 -292098
12366 -205945 -3478 117285 -373839 -143304 -75221 256854 206147 26310 -279997 -64760 240691
12354 105416 45932 136976 55094 -81718 183188 -191698 -288672 70199 -284385 -194847 -171423
12343 -171423 -245710 333985 419162 190497 -246357 98548 -271190 46629 272077 -12525
12332 61156 -131803 -30221 -26994 -326670 39195 99150 -188118 345636 90859 -168373 373569
12320 44880 -375163 107556 -369054 77037 100037 -17983 -249881 117183 55387 281694
12310 281694 -165147 64022 -155483 311597 -12072 -337204 136153 -28371 -87009 -149502
12300a49502E5527A3919L51592A55751l7431a25943D4803J88001r0668l9137f0701
12288C7775i5284d5418B81027A29579F1019L46176a20736A79249m9113f5919A33048
12276A19261J14038o0400L1444f5234K8080K19M780B89025A03457g7189B31391
12264B55829L1817h8758J456B2642D022f4099A37677J26107j14899M2357F3591
12252B12005M9992i130E6348L50798a13755j14233B02281a71397A57861L986c2345
12240A08593K80836A41715f8588A21634c92407a6751p8503D53020A22687D042
12229H4051l2423P2713k8242l2757L66261P4966f8915D65728A77977p4234J66086
12218B69829j01749K36004A74664B2757L79446j61262L2991J4399j3561q6983
$$ plain form
12300 -149502 55527 13919 365511 155751 118320 -125943 44803 232804 142136 102999 -60701
12288 37775 -95284 -45418 281027 129579 61019 407195 -120736 179249 130136 -65919 133048
12276 119261 233299 172899 204343 -65234 -37154 -36935 -32155 289025 103457 -77189 231391
12264 255829 287646 -88758 -87302 22642 4022 -64099 137677 263784 148885 191242 63591
12252 212005 261997 -9130 56348 407146 -113755 -227988 202281 -171397 157861 161847 -32345
12240 108593 389429 141715 -68588 121634 -392407 -16751 -95254 453020 122687 4042
12229 84051 51628 124341 96099 63342 429603 504569 -68915 465728 177977 103743 269829
12218 269829 168080 404084 174664 22757 402203 240941 273932 288331 274770 187787
12208A87787r1282j2974J60977k9942f2198B45340j097H1352J70606O6373A39352
12196A94392J19403j50877K9817R8492p7124P2223E2021a9368r8031B21894b7953
12184a52125A04332M4742F757b0726A88319q2323K41853j24669k165j9584P8901
12173B80332a04505A60372d6149A90520a19354B71506D5587K30574a45690C33016
12162A62014N2072e4069A05366p532j8017J35184N6771b1126j36233I4443L04482
12151C98925A68662b0449A07774J21666a52802O6446H1052K393a85188A31759
12140A09319J31016c0012C23560c01367C94089j51963e0793k00857D3003J13905
12130A56908O8661p6822e8067A10539i2726C69615A42741n6014a28652D5235g6684
$$ plain form
12208 187787 96505 83531 244508 214566 -62198 245340 244243 81352 251958 318331 139352
12196 194392 313795 162918 192735 291227 214103 286326 52021 -19368 -117399 221894 -27953
12184 -152125 104332 149074 6757 -20726 188319 105996 347849 223180 221015 201431 280332
12173 280332 -104505 160372 -46149 190520 -119354 271506 45587 276161 -145690 333016
12162 162014 214086 -54069 105366 97834 79817 215001 271772 -21126 -157359 94443 398925
12151 398925 168662 -20449 107774 229440 -152802 -86356 81052 83445 -185188 131759
12140 109319 240335 -30012 323560 -301367 394089 242126 -50793 -251650 43003 156908
12130 156908 225569 148747 -58067 110539 -92726 369615 142741 86727 -128652 45235 -76684
12118B13572d3270g446j3437l4308C60673a85773a8375A14734M4728C2915Q2252
12107A15167L1621J74216E1424c21221a15512E248b42626p541G7475b17358I9702
12095a60063f8439K3469A00274C876c90837a66572B36773d1187m6723j0229j08820
12084b06959E4790Q102k0170a92985f3732B55161F3316a45849F8486b54908o527
12073b61435a28414l9275f8113A75438a22913A6208i5513B08026b93576R4965
12063a98611A73783e5647B350J59679l0748J79587b92666A50755R1547H3724B5243
12051H5577b25652B93869H0693K66530K55779K41515J33245m31689C4492b5758
12040C14380E0953M0982k5856j6733a49675n6575j33607j08619h7378B61313b98275
$$ plain form
12118 213572 -43270 -7446 -20883 -55191 360673 -185773 -18375 114734 159462 32915 115167
12107 115167 146788 321004 51424 -321221 -115512 5248 -242626 -250167 77475 -217358 99702
12095 -160063 -68439 -44970 100274 3876 -390837 -166572 236773 -41187 -87910 -98139 -206959
12084 -206959 54790 62892 42722 -192985 -63732 255161 63316 -145849 68486 -254908 -261435
12073 -261435 -128414 -167689 -68113 175438 -122913 16208 -95513 208026 -293576 -198611
12063 -198611 173783 -55647 2350 162029 131281 310868 -292666 150755 242302 83724 25243
12051 85577 -225652 293869 80693 347223 603002 844517 977762 546073 34492 -25758
12040 314380 50953 91935 66079 49346 -149675 -206250 -339857 -448476 -87378 261313 -298275
12028D7904j7325e0829C38464h4251A93981o2016a25957e5444A20152b34334C94500
12016g439l7804l0530B48363l8286C3771K5199b60239A96798p4151b35433B09060
12004b76266B47823A9586a90436P7969A01409a17544n07524a89447A2885c59661
11993A6736J17557l7490e4552C965J46977g4061j33296d2830B05352C0921K2428
11982E3349l602g0570H354R5104b3916p1212B810a24558A98406m3822m4131c5199
11969A9692d3957j82448N4514C9218a23521c5906f513A5256h2326A42642h8143
11957B71589F8965a29943B84414a61357B63571n6480J28654a03190r4732G2800
11946B76880A03591c4211n403d824j4574H7283a41250B51459a56002F0011a00398
$$ plain form
12028 47904 30579 -50829 338464 -84251 193981 131965 -125957 -55444 120152 -234334 394500
12016 -7439 -45243 -75773 248363 210077 33771 58970 -260239 196798 122647 -235433 209060
12004 -276266 247823 19586 -190436 -112467 101409 -117544 -625068 -189447 12885 -359661
11993 16736 134293 96803 -54552 3965 150942 -74061 -207357 -42830 205352 30921 53349
11982 53349 49747 -70570 8354 103458 -23916 -95128 2810 -124558 198406 154584 110453 -35199
11969 19692 -43957 -226405 -171891 39218 -123521 -35906 -6513 15256 -82326 142642 -88143
11957 271589 68965 -129943 284414 -161357 263571 207091 335745 -103190 -197922 72800
11946 276880 103591 -34211 -39614 -4824 -19398 87283 -141250 251459 -156002 60011 -100398
11934a17927O132a6319o9104n5942L5443A60182b48347C01342I354K93185a62526
11922a98880p7461N0234b8108B58202d6275A49020a74027c3224C38744C7315a96849
11910a06807A65290h7148B11683b09506A75345L1668a07699n6603G3858h3663
11899B4371K10950a43409B23766a72207F5271a18819N8688C3918Q3026A2456J63643
11888A76099a04978K9714k2189L3679g826j59656D6177N7374b01764l6158J06481
11877a31441e5704B65036d7516F4150d9537B0859g4687L1057l7819A7494L5059
11866E2553b11039B80770f0857A24654c73901B24337A05333k9067A4599L6457
11856E1056a49703j47013f5249A06469i7642F156J70359h5517A99644b26473c2968
$$ plain form
11934 -117927 -111795 -16319 -85423 -141365 -105922 160182 -248347 301342 9354 302539 -162526
11922 -198880 -276341 -226107 -28108 258202 -46275 149020 -174027 -33224 338744 37315 -196849
11910 -106807 165290 -87148 211683 -209506 175345 207013 -107699 -164302 73858 -83663
11899 24371 235321 -143409 223766 -172207 65271 -118819 -60131 33918 116944 12456 176099
11888 176099 -104978 -75264 -97453 -63774 -7826 -167482 46177 103551 -201764 -237922 -131441
11877 -131441 -55704 265036 -47516 64150 -49537 20859 -74687 -43630 -81449 17494 52553
11866 52553 -211039 280770 -60857 124654 -373901 224337 105333 76266 14599 51056
11856 51056 -149703 -296716 -65249 106469 -97642 6156 176515 -85517 199644 -226473 -32968
11844H1349N75262a20568A7318K58668n2526a08209A65902a96653B03029A2629
11833B43478b19770K495e0286j87102A14187e3637q7384g712r6690j31510j85784
11822d21696a84599F3153O3262b06742o4707p531E24198A09864M1307d3941k33779
11811b77720g6758j0740A77426n3547j9743c16304J13429P7381C9360a1909k23315
11800b35224A14356l1257a69947P2814h779k82812P6206a5315H6368B6662J32604
11789A59266a14405r6861f2784J260j61741H3321J28024o3125a12158A44867a5394
11777b884q1694m2585A29412D6072K6c55685E03375I9744a61408E1866Q3164a3577
11764a38992N2855k6854j04113A02735b49689c0621p792j6280a4834j69420B0101
$$ plain form
11844 81349 656611 -120568 17318 275986 223460 -108209 165902 -196653 203029 12629
11833 243478 -219770 -217275 -50286 -237388 114187 -53637 -141021 -7712 -104402 -235912 -421696
11822 -421696 -184599 63153 126415 -206742 -271449 -278980 524198 109864 151171 -43941 -277720
11811 -277720 -76758 -87498 177426 123879 104136 -316304 -202875 -125494 39360 -11909 -235224
11800 -235224 114356 83099 -169947 -97133 -8779 -291591 -215385 -15315 86368 26662 159266
11789 159266 -114405 -211266 -62784 -61524 -223265 83321 211345 148220 -112158 144867 -15394
11777 -2884 -84578 -127163 129412 46072 46098 -355685 503375 99744 -161408 51866 135030 -13577
11764 -138992 -86137 -112991 -217104 102735 -249689 -30621 -38413 -54693 -14834 -184254 20101
11752i2074A02066B6444a25189I5061m1607K4350b22303M1613c2630j0093q7633
11741a30356A12235A2359K01130A5518e3726J9310n2397C87131b36053g5092B91102
11729A67377G3342O3665l1323j3875C710Q3293c79820i5547D35322j60085j35685
11718A39552a08818A80219a23240B12093q1609a15847A9853O9503J41849C8494
11707B74334e6306A35323O5335L69956B04017R9291j21053g152A97635B7480a62669
11695H6476J19952a16906j58923g4380B20262i618I9694n570J19061C4816J66295
11684B01111o7666N7662a4098l8243j79861c936C7925a12496D70253a88F0681
11672G7150P3896j218Q6450a84923K0627A0101b16222l5790C7514O8928L5842
$$ plain form
11752 -92074 102066 26444 -125189 95061 53454 77804 -222303 -180690 -32630 -42723 -130356
11741 -130356 112235 12359 213489 15518 -53726 -34416 -86813 387131 -236053 -75092 291102
11729 167377 73342 137007 105684 91809 3710 87003 -379820 -95547 435322 275237 139552
11718 139552 -108818 180219 -123240 212093 130484 -115847 19853 89356 231205 38494
11707 274334 -56306 135323 200658 570614 204017 303308 182255 -7152 197635 27480 -162669
11695 86476 206428 -116906 -275829 -74380 220262 -9618 99694 94124 213185 34816 201111
11684 201111 133445 191107 -14098 -52341 -232202 -3936 37925 -112496 470253 -188 60681
11672 77150 151046 149828 236278 -184923 -164296 10101 -216222 -252012 37514 106442 142284
11661A42284a59221f2911C41660H9657N012c03434G6294k5259b36413J07334D5532
11649B69674e4432j07902K6626I8867b42902F6659b40227H3144q045e4545C0292
11637c50711d0635B53452b37168A4319J45855J57396m0889j22482j9977b37027
11626D8132b7555A64216g1979l0512B02201d8497l4170j78589B15233I4535a46474
11614H1373B4593J41688l7877K59977F132a19063M7989I1411A1084d631F9860
11602d8744C63497a45871K1432E1389J57727E396b02373D93984c8866C0031J77849
11591B07880h1103H7966O4269J593l1253j1940g7689k07429C88114A86617J9253
11580B05870A6064K61053a79305C03554e847r757B83989A2349Q3443L9828m221
$$ plain form
11661 142284 -159221 -62911 341660 89657 94669 -303434 76294 51035 -236413 -129079 45532
11649 269674 -54432 -162334 -135708 98867 -242902 66659 -240227 83144 75099 -54545 30292
11637 -350711 -40635 253452 -237168 14319 160174 317570 276681 154199 134222 -237027
11626 48132 -27555 164216 -71979 -102491 202201 -48497 -82667 -261256 215233 94535 -146474
11614 81373 24593 166281 128404 388381 6132 -119063 -71074 91411 11084 -4631 69860
11602 -48744 363497 -145871 -124439 51389 209116 5396 -202373 493984 -38866 30031 207880
11591 207880 -81103 87966 152235 153828 122575 110635 -77689 -285118 388114 186617 205870
11580 205870 16064 277117 -179305 303554 -5847 -15604 283989 12349 95792 135620 131399
11569A31399a4176B17547a4394A55155c4961r3247m3320A94092a29526C45135
11558A53034F4751h2175B80326B129b75878B41213D3627N5502a1388p2333A49439
11546a05349B59867a71818b7884k04057h942E0576R1786M7725D2714B46P8175
11535G8421h2653A00961a24597A73045K4388O9646a03582A84167M3560A11081
11524C19921H4452e2160q4772e5426j86965E1825Q6494J79185a43205a3610D62735
11512a71892D83898j62526E0584J3836P2467R0835o7151Q2938D4055K20705P1650
11501C36410j13641J17402g81A51760J34355b91995B98630A06714L0703g7960
11490D77585q2654N5934A9264a12252E58936A25098D7769c40246B40124K1988
$$ plain form
11569 131399 -14176 217547 -14394 155155 -34961 -128208 -171528 194092 -129526 345135
11558 153034 64751 -82175 280326 2129 -275878 241213 43627 99129 -11388 -83721 149439
11546 -105349 259867 -171818 -27884 -231941 -8942 50576 142362 190087 42714 246 78421
11535 78421 -82653 100961 -124597 173045 197433 267079 -103582 184167 227727 111081
11524 319921 84452 -52160 -136932 -55426 -242391 51825 138319 317504 -143205 -13610 462735
11512 -171892 483898 321372 50584 64420 136887 227722 160571 243509 44055 264760 336410
11501 336410 222769 340171 -781 151760 286115 -291995 298630 106714 137417 -77960
11490 477585 394931 450865 19264 -112252 558936 125098 47769 -340246 240124 262112
11480B62112J17719b53653c511I2923k0745c6000B78040A26638k524C0962L56470
11469C87432e3101C94834r3996j44277J18716J41713J08732A55133Q2524j8942
11459B18715p5487J50768j04203A8431c2225F2357O8473N8006b1607A87232j1234
11448A75998h3032A10116K25472p9957K3592I4529M9581K46858D6106N47029C0739
11436C6618h5874F5431i1823k04072g969o9062B74772j22241J0147k240F420d0075
11423A67318h3092M0517H5600c086A50799n3668R4363G617g0248G9573g8693A53960
11410b2226E7555g9830A0855a45043A57658i69I3625J00706a9238d992C37403
11398B61167n8227G783L4543a34592l2997j05261R5917e2744f232A02997k6588
$$ plain form
11480 262112 379831 -253653 -3511 92923 72178 -36000 278040 126638 124114 30962 387432
11469 387432 -53101 394834 300838 156561 275277 416990 525722 155133 237657 218715
11459 218715 143228 293996 189793 18431 -32225 62357 130830 188836 -21607 187232 175998
11448 175998 -83032 110116 335588 255631 279223 94529 144110 390968 46106 593135 30739
11436 36618 -85874 65431 -91823 -295895 -7969 -77031 274772 152531 162678 160438 6420 -40075
11423 167318 -83092 -42575 85600 -3086 150799 97131 191494 7617 -70248 79573 -78693 153960
11410 -22226 57555 -79830 10855 -145043 157658 -969 93625 194331 -19238 -4992 337403
11398 261167 202940 7783 42326 -134592 -167589 -272850 -176933 -52744 -6232 102997 76409
11387G6409b7337D86675E2541a83281D5230J62504d20045J04769J33459C9975
11376c8108D8367b29565a13105A6702b54217h4971G8070K09870c46774J45400
11366b01374L8031c1149J1298C08198j41718c6593A04932A2674K8973A9794b52180
11354c0792D7786J81311D1717a23831F7349f4322k11761c7907A95345I0026J01663
11343A91689b27070E25298D7612K28213a55485b5545C4822L7489e7220j6651F5450
11331a06566k3215B33508b17891R8320K2820A7016g7705A8826J15826i636m2800
11320e2436D1260f6542E4965b75208B05005O6509c43759a26659j21382C74666
11309I9778a36964H8073a76538A32040B6386e3329q4811A52254L8792r4373i3367
$$ plain form
11387 76409 -27337 486675 52541 -183281 45230 207734 -420045 -315276 -181817 39975
11376 -38108 48367 -229565 -113105 16702 -254217 -84971 78070 287940 -346774 -201374
11366 -201374 -163343 -31149 -19851 308198 166480 -36593 104932 12674 41647 19794 -252180
11354 -30792 47786 229097 41717 -123831 67349 -64322 -276083 -37907 195345 90026 191689
11343 191689 -227070 525298 47612 275825 -155485 -25545 34822 72311 -57220 -73871 65450
11331 -106566 -129781 233508 -217891 -119571 -96751 17016 -77705 18826 134652 -9636 -52436
11320 -52436 41260 -66542 54965 -275208 205005 271514 -343759 -126659 -248041 374666
11309 99778 -136964 88073 -176538 132040 26386 -53329 -138140 152254 191046 96673 -93367
11297A07156J83791g5222A06078k7945b1713j4112A38126b04920P8475I9466J30962
11286B30428C7139K07191c63377A24418k5510k2398g5449K8820j77154A22675
11275i9575k2973B22700E3874a01959j52992A15460a4551o9779b4190j01428J1035
11264a14583A2457b81796B6653d74461a4975A84112d6085k36519a1418I3083m3047
11253E0036a86283P2327c3579a3765j23876l8442c03A17028d3896l00069h8629
11241a65567j55822J50518p0176l9252A33255d0531M143n7550A16374c1643F6027
11229a53326H5822a14002E7875a28229o9495l7118A23003b7661l40249C9323b10298
11217g5363L4574F2551J82367H4322L46137h7336L9297m5995A25232J59572b05376
$$ plain form
11297 107156 290947 -75222 106078 78133 -21713 -35825 138126 -204920 -126445 99466 230428
11286 230428 37139 244330 -363377 124418 98908 76510 -75449 -46629 -223783 122675
11275 -99575 -122548 222700 53874 -101959 -254951 115460 -14551 -84330 -24190 -125618 -114583
11264 -114583 12457 -281796 26653 -474461 -14975 184112 -46085 -282604 -11418 93083 50036
11253 50036 -186283 -113956 -33579 -13765 -137641 -176083 -303 117028 -43896 -343965 -88629
11241 -165567 -321389 -170871 -241047 -280299 133255 -40531 -36388 -93938 116374 -31643 66027
11229 -153326 85822 -114002 57875 -128229 -197724 -234842 123003 -27661 -367910 39323 -210298
11217 -75363 -40789 62551 244918 84322 430459 -87336 -48039 -94034 125232 284804 -205376
11205B54797G0149k1590b40547A59442b97598B21086h5799d1153F5809a25186
11194A62654c34784J12077D6430b07676b2096I3831a70723I2746d6198l04138
11184c50336b1619m2114k79865C09111b69081A88445A316J14791o269B9686J72825
11173B02511g6911a9141l207j02983q1015j60935C46694a12614I0558k3868a26811
11161b8561F5435M0533b87625G588c9249M349j28521g947G9017i4879D0451K354
11149D2805b86475G2953A7906a05346e2591m0779D7487a85771B14413A02412j5948
11138H6464a65092k172j1967f2658m5291F8416b20287A21530a9712j46943B5483
11126g1579l13185h6467D14141k01823J86879a6267j21042E1256a51421B11230
$$ plain form
11205 254797 70149 48559 -240547 159442 -297598 221086 -85799 -41153 65809 -125186
11194 162654 -334784 -222707 46430 -207676 -22096 93831 -170723 92746 -46198 -350336
11184 -350336 -21619 -63733 -343598 309111 -269081 188445 1316 116107 109838 29686 202511
11173 202511 -76911 -19141 -22348 -125331 -206346 -367281 346694 -112614 90558 66690 -126811
11161 -28561 65435 105968 -287625 7588 -39249 -34900 -163421 -7947 79017 -94879 40451 42805
11149 42805 -286475 72953 17906 -105346 -52591 -93370 47487 -185771 214413 102412 86464
11138 86464 -165092 -167264 -179231 -62658 -107949 68416 -220287 121530 -19712 -166655 25483
11126 -71579 -384764 -86467 414141 212318 399197 -16267 -137309 51256 -151421 211230
11115B35498O1923G607C108M76550j64589A37832b55423B16909L8740r9573K35376
11104C91452j92350K41463j26844A29760J89388l1359O7966C7209K61749L62l9837
11093B59483j2789G3630M23085A30991K1622J3054J68339Q5252j0209F9729J50404
11082B20133n9674k5036P9847K51907H2866L48553j98645j05706Q2254J41691
11072C51013k3185K7574K34060k44017K66627j27570p3861J1069L4792k17555
11062B38947M13900O8941K72568j70786k93216J16059k03457K48300K63160l19431
11052F34985K19320k46430N31047j72345j07296K42462l4803m93844O74083l97514
11042H49665k47641L06600k07084K87196J68254D73509K55738k6367L04225j99904
$$ plain form
11115 235498 297421 7607 3108 479658 315069 137832 -255423 216909 255649 156076 391452
11104 391452 199102 440565 313721 129760 319148 287789 355755 37209 298958 299320 259483
11093 259483 246694 73630 496715 130991 152613 165667 334006 419258 409049 69729 220133
11082 220133 160459 135423 215270 467177 82866 431419 232774 127068 209322 351013
11072 351013 327828 355402 589462 345445 612072 484502 410641 421710 456502 238947
11062 238947 652847 721788 994356 823570 530354 646413 442956 691256 954416 634985
11052 634985 854305 607875 1138922 966577 859281 1101743 1066940 573096 1247179 849665
11042 849665 602024 908624 701540 988736 1156990 473509 729247 702880 1007105 807201
11032H07201j53360L41080m6681j69062j67241J53368l5221j42115K94967k265
11022H80671r9360R317j4343j6084r0104J61721j18758K52737k78167j8508J15317
11011G84439k12193J39891K19083j58787L6058k52249M23797k32770N339k66511
11001D86097O43881j83365J79331m89749J08151L73761k51621k4715k19422J02580
10991G24929K38671l01122O1091J23964J6757K26838k87146K99335L50797k72489
10981A181625K99071l9850L32773p6476J38421N57549Q7899N9917L88057J96352
10971C125338O04197N4331J11771N9640j04881o7355n85572n49524j94572m26180
10961B027193K03130k65705m7046m13189M89959q6596k61575l21265N9852j6767
$$ plain form
11032 807201 653841 994921 948240 779178 611937 765305 730084 587969 882936 880671
11022 880671 781311 790628 776285 760201 670097 831818 713060 965797 687630 669122 784439
11011 784439 572246 712137 931220 772433 808491 556242 980039 747269 752608 486097
11001 486097 1129978 946613 1125944 636195 744346 1118107 866486 841771 622349 724929
10991 724929 963600 662478 723569 847533 864290 1091128 803982 1103317 1454114 1181625
10981 1181625 1480696 1440846 1773619 1697143 1835564 2393113 2481012 2540929 2928986 3125338
10971 3125338 3729535 3783866 3895637 3955277 3850396 3783041 3197469 2647945 2453373 2027193
10961 2027193 2230323 1964618 1917572 1504383 1994342 1907746 1646171 1324906 1384758 1367991
10951A367991p3696j87472l81599J19233C26458J53410j72051M0448M5645q9662
10941C04248j2199O3225A24828L63488b072F0920J9882k5949j1958K58291o5698
10930B35488C0572N42362I5944K21730j30626n4202i5658B3574Q7320P0449I161
10918B44956h480G4160c71161a70704D2804a56547b5221q4802D9939d98996H1123
10906C1955f5240l2378L5325j46034B31813B1989e2605A13071d99041A9879J0895
10895C0774O1480b7288p6808m2897n8799A39786B9098A0103b0387k29347J18748
10884a30986B00115a5126C7286d886j11889j37456B55328A02599f1057A91614
10873H0093f7890A64666D1191R9039i1765B31988b55189B51817I1698J5671L1340
$$ plain form
10951 1367991 1294295 1106823 725224 844457 326458 479868 307817 348265 393910 304248
10941 304248 292049 355274 124828 488316 -2072 60920 80802 54853 42895 301186 235488
10930 235488 30572 572934 95944 317674 187048 132846 -95658 23574 110894 181343 9161
10918 244956 -8480 74160 -371161 -170704 42804 -156547 -25221 -110023 49939 -498996 81123
10906 31955 -65240 -97618 -62293 -208327 231813 21989 -52605 113071 -499041 19879 30774
10895 30774 92254 -27288 -104096 -146993 -205792 139786 29098 10103 -20387 -249734 -130986
10884 -130986 200115 -15126 37286 -4886 -116775 -254231 255328 102599 -61057 191614
10873 80093 -67890 164666 41191 140230 -91765 231988 -255189 251817 91698 107369 138709
10862A38709I198g0472m7203c9646A1514K59917d95142A97395J86911a84699e3939
10850c199A66180i5349A17986h6599A86506d73960d9549j16871C0378d1980k85780
10839c27760G9902K6371J87751r3641f9468B1823K92013B3092M72737A51937M0057
10828A91994C6512J04771b85688J35678F6971O3124g9901j88574B72823j16173
10818A56650D4534a63182j79359J55876j33648e756j29717A0368b87865A54575
10807E5838J40883b3052l0025A88442B7023J931a37316d7208D8122J02552a21931
10795c91103f3283F4302M0750a70960A32816P2731M0585h3940k36752C16325E8709
10783f7290A66141b28352a6791E6481b55049k34743A66619Q504k2328E9247b1223
$$ plain form
10862 138709 9198 -70472 -117675 -39646 11514 271431 -495142 197395 384306 -184699 -53939
10850 -3199 166180 -95349 117986 -86599 186506 -473960 -49549 -166420 30378 -41980 -327760
10839 -327760 79902 106273 294024 200383 -69468 21823 313836 23092 495829 151937 191994
10828 191994 36512 141283 -285688 -150010 66971 130095 -79901 -268475 272823 156650
10818 156650 44534 -163182 -342541 -186665 -320313 -5756 -135473 10368 -287865 154575
10807 55838 196721 -23052 -53077 188442 27023 28954 -137316 -47208 48122 150674 -121931
10795 -391103 -63283 64302 105052 -170960 132816 205547 246132 -83940 -320692 316325 58709
10783 -67290 166141 -228352 -16791 56481 -255049 -489792 166619 175123 152795 59247 -21223
10771g1624A8372d4506O975A37335b3886n0551J0021j10644I0297L15111A03483
10759H6707L54664a84482Q6911d1507k46052B4404a76315B72692a42646A70340
10748a1150j02397q1655g8436c1011A96332h3941J0135q9265A21883c036j45620
10737a48656j39737A89455d1062G0361a1A9275a67356G1663J51055m6611e0687
10725a81194g7216j79363C40046b79978f0860I2772a03260p2508B22826b42134
10714B49094a42125L0670N5346j5728A28482a76646j33510C04455B8163a93580
10703b07564i5044F6684a86871a9709A6316c32287M5589J39549j09951G7715a43938
10691f0247f902k57501n9647a52975j1767A16163J54124I6722a68171j57548H9752
$$ plain form
10771 -71624 18372 -44506 -37531 137335 -23886 -74437 -64416 -175060 90297 405408 103483
10759 86707 441371 -184482 -97571 -41507 -287559 24404 -176315 272692 -142646 170340
10748 -11150 -113547 -195202 -78436 -31011 196332 -83941 -73806 -163071 121883 -3036 -148656
10737 -148656 -288393 189455 -41062 70361 -11 19275 -167356 71663 222718 176107 -50687
10725 -181194 -77216 -256579 340046 -279978 -60860 92772 -103260 -175768 222826 -242134
10714 249094 -142125 -111455 -56109 -71837 128482 -176646 -310156 304455 28163 -193580
10703 -207564 -95044 66684 -186871 -19709 16316 -332287 -286698 -147149 -257100 77715 -143938
10691 -60247 -6902 -264403 -324050 -152975 -164742 116163 270287 96722 -168171 -325719 89752
10679b3678q1275B4178b00544a4246j42325j95525i8494k17569D6350J0252a69993
10667H7948a48883n7484h0650q1342a9510A04460a43905h940j45503m0184C82357
10655b64687J30894E3261b53211A5959h7971A87920c99569G0005d3348B16383
10644f9457j80080g5517B8224c01049d5901A27283P0761a83883C14305j24216
10634A90089m7253a52893J2229L9615I8851b1257j29179j9578o5987I7631d22534
10622c68209A44791a76344l3047i0212B84153c25706J24162A38773i0723j9993
10612a10716j80022J22444D6509a46156P0637E8144i8875k0477j05499g5064c0653
10600b24113A78986a12166r0509j00023F4193a73160B21960a23574k54456f8876
$$ plain form
10679 -23678 -104953 24178 -200544 -14246 -156571 -352096 -98494 -316063 46350 56602 -169993
10667 87948 -148883 -206367 -80650 -161992 -19510 104460 -143905 -8940 -154443 -194627 382357
10655 -264687 -133793 53261 -253211 15959 -87971 187920 -399569 70005 -43348 216383
10644 -69457 -249537 -75517 28224 -301049 -45901 127283 198044 -183883 314305 190089
10634 190089 142836 -152893 -140664 -101049 98851 -21257 -150436 -170014 -236001 97631 -422534
10622 -368209 144791 -176344 -209391 -90212 284153 -325706 -201544 138773 -90723 -110716
10612 -110716 -290738 -168294 46509 -146156 -75519 58144 -98875 -119352 -224851 -75064 -30653
10600 -224113 178986 -112166 -202675 -302698 64193 -173160 221960 -123574 -378030 -68876
10589c31239B03017A2716a24014A39318b5505C6075a56620A07228a20845O0240
10579f0605k34086J33892A25462d5353k46685Q6370e0468k52580B4464J55897
10569A80361l54c7025Q668k35089f9561k4457L0095J0862B7340c54319a36653
10557I1928J38644r4508e1556E4680J82205j14742E181a8016k29822a9198B39639
10545b70836A36845p941a33131B85979A07238Q886A5368K23594h9455A69602G7738
10533b59503J05532H6622i9634A25718a9706k14763a0199C147a8365o7136j95637
10522b81138A64529b08896b5683j93777C0202K6804f434p1547j64729h6139n0905
10511a37044E02158a29352G1350O4032g8817M800F7438c4744Q214o895j43593
$$ plain form
10589 -331239 203017 12716 -124014 139318 -25505 36075 -156620 107228 -120845 -60605
10579 -60605 -294691 -160799 125462 -45353 -292038 -205668 -50468 -303048 24464 180361
10569 180361 180007 -37025 -28357 -263446 -69561 -94018 -63923 -53061 27340 -354319 -136653
10557 91928 230572 136064 -51556 54680 236885 122143 5181 -18016 -247838 -19198 239639
10545 -270836 136845 128904 -133131 285979 107238 116124 15368 238962 -89455 169602 77738
10533 -259503 -153971 86622 -99634 125718 -19706 -234469 -10199 3147 -18365 -85501 -281138
10522 -281138 164529 -208896 -25683 -219460 30202 57006 -6434 -77981 -242710 -86139 -137044
10511 -137044 502158 -129352 71350 135382 -78817 -74017 67438 -34744 -26530 -33425 -177018
10500a77018A13177d6075C2077J26994f3295a0021A7220a25651N469q887J739
10489a27330j41040j4720F655P0522J38022a54065f9685B36236N2386f2114D47231
10477A85121p2064n1133M7250c06904A86929B7352M50157G0503a47491k14608
10467c62099r8287H9034J10738c33916G2828c30963B4973j2019a07656A0288K43280
10456B53568J7486g3892B31843a53904c980H5937K57870a84543i1651F6705O585
10445G3290J48871f4546A6986O9489R228d52317b6893H4227J1806a50033L6417
10434a13616d5354C37226B3101K15178q3851c2825C3349g6883c7453r825a9882
10422B54438f474l4711j92884h2003A43511n3458f2300j14143A06652g3218D5096
$$ plain form
10500 -177018 113177 -46075 32077 159071 -63295 -10021 17220 -125651 -120182 -129069 -127330
10489 -127330 -268370 -283090 6655 77177 215199 -154065 -69685 236236 288622 -62114 447231
10477 185121 113057 61924 109174 -306904 186929 27352 477509 70503 -147491 -362099
10467 -362099 -460386 89034 199772 -333916 72828 -330963 24973 12954 -107656 10288 253568
10456 253568 271054 -73892 231843 -153904 -3980 85937 343807 -184543 -91651 66705 73290
10445 73290 222161 -64546 16986 86475 95703 -452317 -26893 84227 96033 -150033 -113616
10434 -113616 -45354 337226 23101 238279 154428 -32825 33349 -76883 -37453 -47278 -19882
10422 254438 -6474 -41185 -234069 -82003 143511 90053 -62300 -176443 106652 -73218 45096
10410C14624b49048a537l6952h138A88228k7337a95932C24698r4456H4511N8844
10399A43355J07966L0078a95713F8848k9915R5055n1912P4209Q5751N1832J03795
10388C97663a6604A1553a29341A6964J04241a58078c404k8405F8171a0891C00815
10376B3656K48157J88615I6200Q6197J05121J88500B06568L55769j17520M6374
10366D91191k7176A61249N51138k12995R809A14210O4659K43791p8562b3125B68231
10354B68864J93757k26684K71465K45723m1420k54634o3522J13472O8384K8702
10344F04107A93381J09129O8495K3006j22508a7289B87528L9470N67a4422A26496
10332B96346A07188R5015i2786A99520a40998C2172R4189N6516b8366B68574J80310
$$ plain form
10410 314624 -249048 -1537 -38489 -8138 188228 160891 -195932 324698 230242 84511 143355
10399 143355 251321 281399 -195713 68848 38933 133988 82076 156285 242036 293868 397663
10388 397663 -16604 11553 -129341 16964 121205 -158078 -3404 -31809 68171 -10891 300815
10376 23656 271813 460428 96200 182397 287518 476018 206568 562337 444817 491191
10366 491191 464015 161249 712387 499392 509201 114210 178869 422660 344098 -23125 268231
10354 268864 462621 235937 507402 753125 711705 457071 393549 507021 575405 604107
10344 604107 193381 302510 371005 394011 271503 -17289 287528 326998 327565 -14422 126496
10332 296346 107188 202203 -92786 199520 -140998 32172 126361 182877 -28366 268574 448884
10321D48884K84625l09579F7234i356q6975A67002g2570B66234C1791J36740J85428
10310C53959F1717K49957F6117b63027A02269O2714b23021E874a04351n8210d781
10298G1455k3733K07268L9604P9934b17560C1657g2255B09040c2406k78535a5772
10286I7597B2965R6036a57732J6170Q204a5800J516j42045N635m3602C67039a8220
10273b67150C6029a23164A84169a85829A59522I845K2422M1834c07157d3439C1056
10261C72525G0774J33484n1408M74865B67689j00317P1211j02287A3196a30067
10250B63080M6684C2653a93190C61531j54274c7152A56756d8849j46491q4524
10240b79864I5588A8490b32710A26898d21922A10667h1696c1553k2459k32981
$$ plain form
10321 448884 733509 423930 67234 -9356 -96331 167002 -72570 266234 31791 168531 353959
10310 353959 61717 311674 66117 -263027 102269 164983 -223021 5874 -104351 -162561 -4781
10298 71455 47722 254990 294594 374528 -217560 31657 -72255 209040 -32406 -310941 -15772
10286 97597 22965 119001 -157732 -141562 -133358 -15800 -14284 -156329 -150694 -194296 367039 -18220
10273 -267150 36029 -123164 184169 -185829 159522 9845 32267 74101 -307157 -43439 31056
10261 372525 70774 204258 152850 627715 267689 167372 238583 136296 13196 -130067
10250 263080 309764 32653 -193190 361531 207257 -37152 156756 -48849 -195340 -279864
10240 -279864 95588 18490 -232710 126898 -421922 110667 -81696 -31553 -54012 -286993
10230b86993N0029j9574a06001D2785b9553k26615B55669a86095M0160E7303a43858
10218C73029i7094G3735b10481i3438G2438b11935J2181m2908A10235a07280k21038
10207c28318f6082l2401C24729g3207C15541a46850l4986A28491h8334C7219K50540
10196B87759e8632k3596L6787E1937d2056a6409F061e4678A41508K3404F3203
10184b4302a269m16048h514j61475j70860A07940c34136a24943k34009C91920
10173b76700C6033i9399A36199g6762B4678d74115A42883a07685c239B47971j05673
10162A42298b4704o4000l4253k18238A33915c02499B35236n3292k9893h3106C52599
10150H9507J05914h7769l14018B3595h8301A52715m3484a71796j58043A07714
$$ plain form
10230 -286993 -236964 -256538 -106001 42785 -29553 -256168 255669 -186095 -145935 57303 -143858
10218 373029 -97094 73735 -210481 -93438 72438 -211935 -199754 -242662 110235 -107280 -328318
10207 -328318 -66082 -98483 324729 -73207 315541 -146850 -181836 128491 -88334 37219 287759
10196 287759 -58632 -82228 -45441 51937 -42056 -16409 6061 -54678 141508 164912 63203
10184 -24302 -1269 -417317 -8514 -169989 -340849 107940 -334136 -124943 -358952 391920
10173 -276700 36033 -99399 136199 -76762 24678 -474115 142883 -107685 -3239 247971 142298
10162 142298 -24704 -88704 -122957 -341195 133915 -302499 235236 181944 152051 -83106 352599
10150 89507 195421 -87769 -401787 23595 -88301 152715 109231 -171796 -329839 107714
10139a85682A82562a37270n1270r0604a35902A76501a13709j18485I531b06808
10128d3019I3897b62692o0274a20294F3697b78998a12792A64557c9973H1580j1300
10117G0280a96563p8624e066n8900a2589l5716k3786a7248j56035A40463f658
10105b42597J00299j67045G9054b07286F0577M9300a9762A06686a53922q2647
10095b36569j64326a79486h9448A09444a5369k3153j47579F0180a06420G3523
10084a04349B16756B4391f0221f171k55407Q1849f4224o8489l2143B18134i7018
10072c7643k99157B1608K5948K4085b97093A15820i1348B88671b18759A50390
10061G3840A2517c20028A1861b5231N290A75798e8301l51263a51243E637g3767
$$ plain form
10139 -185682 182562 -137270 -188540 -279144 -135902 176501 -113709 -232194 9531 -206808
10128 -43019 93897 -262692 -322966 -120294 63697 -278998 -112792 164557 -39973 81580 70280
10117 70280 -196563 -275187 -5066 -63966 -12589 -48305 -72091 -17248 -173283 140463 -6658
10105 -242597 -142298 -309343 79054 -207286 60577 109877 -19762 106686 -153922 -236569
10095 -236569 -400895 -179486 -89448 109444 -15369 -38522 -186101 60180 -106420 73523
10084 -104349 216756 24391 -60221 -6171 -261578 -179729 -64224 -132713 -164856 218134 -97018
10072 -37643 -336800 21608 47556 71641 -297093 115820 -91348 288671 -218759 150390
10061 73840 12517 -320028 11861 -25231 -19941 175798 -58301 -409564 -151243 5637 -73767
10049a75855J6639e1966l0838B39133b53707Q9770j24335R2325B5227R1705d14634
10037b88827I0186l4911Q5354a11466A33549b57974D90269e1008j29775A8059
10026a3903C2698c48686A34733A2717j429a57467n9650L4053c7457j25294c2695
10014e7738a3699r5218O326M0178A826c8619j80182C8837a4802p0613j87490H9171
10001f9879E3399a37920B95101D951O8118b94733C578R6711Q5252a66256b7899
9989B05702a88985j95398a46760f6889A21523c88515e6459j89191c3920k20060
9979b53980C2289d0696j68322g0053a5305j09827e9204G3784i2438l5401e1543
9967B25148a02056j93008J04944G9043a67781l5257C4580L5619G640K8367b37565
$$ plain form
10049 -175855 -159216 -51966 -82804 239133 -253707 -163937 -288272 -195947 25227 116932 -414634
10037 -288827 90186 55275 140629 -111466 133549 -257974 490269 -51008 -180783 18059
10026 -13903 32698 -348686 134733 12717 11288 -157467 -217117 -183064 -37457 -162751 -32695
10014 -57738 -13699 -108917 -102591 -62413 1826 -38619 -218801 38837 -14802 -85415 -272905 89171
10001 -69879 53399 -137920 295101 4951 73069 -294733 3578 100289 185541 -166256 -27899
9989 205702 -188985 -384383 -146760 -66889 121523 -388515 -56459 -245650 -33920 -253980
9979 -253980 32289 -40696 -209018 -70053 -15305 -125132 -59204 73784 -92438 -127839 -51543
9967 225148 -102056 -295064 -190120 79043 -167781 -203038 34580 70199 7640 36007 -237565
9955a52409A72392a05918k62642J25037m8053A81215e0973A18424a7944j99490
9945b17434J9089j07509o532a13630K4409b2827r3906B9610L4823B459a82717
9933b47732N7077B2320J21934K2206h4423c320j44814D6079e86261A00966P4923
9922A75889a71561E4858M447d4098j4630r3673A33089i8136c974l56277D5936
9910C10687A0295R1767g2969K7776j89018A52824a41555j76397J07116A9122a02470
9898b58882e0657F5530h9465j10020k56691b27144h4783F246J48287b76472O3780
9887b12692f9811C1483e9347E2418J3788j29c31132q2946J47349c3616j13575
9876a47191G385J34944b84813a35632d5623j22442C8182e7447H166Q3654c8808
$$ plain form
9955 -152409 172392 -105918 -368560 -243523 -291576 181215 -50973 118424 -17944 -217434
9945 -217434 -198345 -305854 -312386 -113630 -89221 -22827 -116733 29610 64433 2459 -182717
9933 -247732 -190655 22320 144254 166460 -84423 -3320 -148134 46079 -586261 100966 175889
9922 175889 -171561 54858 59305 -44098 -58728 -152401 133089 -98136 -3974 -360251 45936
9910 310687 10295 102062 -72969 -45193 -234211 152824 -141555 -317952 -210836 19122 -102470
9898 -258882 -50657 65530 -89465 -199485 -456176 -227144 -84783 6246 154533 -276472 -212692
9887 -212692 -69811 31483 -59347 52418 66206 66077 -331132 -414078 -266729 -33616 -147191
9876 -147191 7385 142329 -284813 -135632 -45623 -168065 38182 -57447 8166 91820 -38808
9864d15233A34758a2942B5703i9622L1147b4813j86749f0079k08218a18836A36108
9852f2043o0622e260j84855A17328O083n2735a99741A16494d35936K13563D8469
9840a81408P5394A43571R9676A11624E2018c94074a50884K9644A36814C547b34715
9828A34212J2236o8275a39771b585B05228H9287J9888e9902B7360N5364a68401
9816A34642b59213f9053l13717e2140j05353g555j86710b8305A26155K6864J78932
9805C31951o3620b2516I5421J68248I4042a58374G0102a22380j93620J50771j05351
9794b70580R7532Q0727q3016Q2292B9640Q7738g5908B01795o8108l3284f6062
9782i6349B0209l274F019J03129a73335j51835B21181p7560a02292j62101k89997
$$ plain form
9864 -415233 134758 -12942 25703 -99622 -68475 -24813 -211562 -60079 -268297 -118836 136108
9852 -62043 -122665 -5260 -190115 117328 123411 70676 -199741 116494 -435936 -222373 48469
9840 -181408 -106014 143571 243247 111624 52018 -394074 -150884 -121240 136814 3547 -234715
9828 134212 146448 78173 -139771 -2585 205228 89287 109175 -59902 27360 82724 -168401
9816 134642 -259213 -69053 -382770 -52140 -157493 -7555 -194265 -28305 126155 153019 331951
9805 331951 268331 -22516 95421 263669 94042 -158374 70102 -122380 -316000 -165229 -270580
9794 -270580 -173048 -92321 -175337 -93045 29640 117378 -75908 201795 133687 100403 -66062
9782 -96349 20209 16935 6019 109148 -173335 -325170 221181 143621 -102292 -264393 -554390
9771e54390J58032D0127b09077B2025a00463C17532E6235P594a36159Q839k19224
9760c46544E9965j4292k1056J13582C0127c1540k47165F9049e7191E8193d66931
9748C42585a35956e063k17656A4844b61023i6772k23257B15367a54228p1770a11273
9736b62593M6094B2153I930J1047L5148J24656l9989d25847a28170j03566e8704
9724H6957d40907b4693p618A19812b26292G199P2807b67613J9016J6057O7121
9713a65419k96973C5119a41618j51561B8198e76407J63806J79351D7J10367F412
9701a29055A64774a2256G1570d15802i8720o2414k57761B08973o3125a46648B31042
9689a99250E4958b35759B01101e1012k6310n8113J8965B75a57602l4770C1222
$$ plain form
9771 -554390 -396358 40127 -209077 22025 -100463 317532 56235 63829 -136159 -127320 -346544
9760 -346544 59965 45673 24617 138199 30127 -31540 -278705 69049 -57191 58193 -466931
9748 342585 -135956 -5063 -222719 14844 -261023 -96772 -320029 215367 -154228 -225998 -111273
9736 -262593 -216499 22153 9930 20977 56125 180781 140792 -425847 -128170 -231736 -58704
9724 86957 -440907 -24693 -32311 119812 -226292 7199 80006 -267613 -248597 -232540 -165419
9713 -165419 -462392 35119 -141618 -293179 28198 -576407 -412601 -233250 47 110414 6412
9701 -129055 164774 -12256 71570 -415802 -98720 -161134 -418895 208973 145848 -146648 231042
9689 -199250 54958 -235759 201101 -51012 -77322 -135435 -116470 275 -157602 -192372 31222
9677a03883j33396R6909j16557L8142M3573k715K3743a2600o3180c3927N193H880
9664A69045c18352g900B58249a73129A85068g8231A54113a83155F258a65115g1544
9652b36210a11282q0485d9569p5900k46133j47166i5128p5177O0217A06532K00252
9641C06784b00552B10003b13015j23479a43625I5509c25400A07162B3240g1644
9630c89642a93474L5967q8228B25836a28495A48967a96170G0163b25455a467k34735
9619b36202J05702j9087d9441E051b42257P7444J9206I1691b1044m3716l0700
9608i5460M7216G5095a31262A04077b32024P2251r7156c1818k05996Q426N4062
9597a75326r4492j27325e8351a2221F5310a11726d3160B51275c26722g2969D582
$$ plain form
9677 -103883 -237279 -140370 -256927 -218785 -175212 -177927 -154184 -12600 -75780 -33927 -28734 8880
9664 169045 -318352 -7900 258249 -173129 185068 -78231 154113 -183155 6258 -165115 -71544
9652 -236210 -111282 -191767 -49569 -125469 -371602 -518768 -95128 -170305 -110088 106532 306784
9641 306784 -200552 210003 -213015 -336494 -143625 95509 -325400 107162 23240 -71644
9630 -389642 -193474 -157507 -245735 225836 -128495 148967 -196170 70163 -225455 -1467 -236202
9619 -236202 -130500 -149587 -49441 5051 -242257 -164813 -145607 91691 -21044 -64760 -95460
9608 -95460 -48244 75095 -131262 104077 -232024 -159773 -256929 -31818 -237814 -229388 -175326
9597 -175326 -269818 -397143 -58351 -12221 65310 -111726 -43160 251275 -326722 -72969 4582
9585A25859f3169A86884a67169D0489j3373a87445q7052h993A90824c79981A11182
9573A4325c27728J43345M8413b796p7204j30939J0967B47085I3483h2655j03214
9562a85869G7240d53754b8877k8751j13676d5794j82301P6190I0970a33027A96762
9550a07353k91618B90150A41332a59995B5310J23897A7364a72749D8741L8742
9540H7483e4889A46695b18150A32889a85882E7719c65465j17722B68973B7540
9529A23680m4125N7323b1246j06460k7341D74142a90925g6922r6837M8539c0771
9517e8388r1513A44802C2204a80908B63187c1053J1179C5800e7622J0816o2617
9506a09423l6162O5542a7416A33089m5190a97208k29388L329n350B73116h6463
$$ plain form
9585 125859 -63169 186884 -167169 40489 27116 -187445 -274497 -8993 190824 -379981 111182
9573 14325 -327728 -184383 -135970 -2796 -80000 -210939 -199972 247085 93483 -82655 -185869
9562 -185869 77240 -453754 -28877 -57628 -171304 -45794 -228095 -151905 90970 -133027 196762
9550 -107353 -398971 290150 141332 -159995 25310 149207 17364 -172749 48741 87483
9540 87483 -54889 146695 -218150 132889 -185882 57719 -365465 -483187 268973 27540
9529 123680 79555 136878 -21246 -127706 -155047 474142 -190925 -76922 -173759 -125220 -30771
9517 -58388 -149901 144802 32204 -180908 263187 -31053 -19874 35800 -57622 -46806 -109423
9506 -109423 -145585 -80043 -17416 133089 87899 -197208 -426596 -423267 -428617 273116 -86463
9494D10168f1986l53561M6279f3672A07676i6673d0780q7124D0425a67343j97787
9483c65130B66261a87435A70482e035j12052J4662o8560B985g943j24101H9091
9471A01392g6448c271o3644I6763K23846I5084P5570q3126a34728B28175q1225
9460A46950n3132a77823H9566l3504d1076j4517B16473h4728j05016e1940g404
9448E2434Q5315g7268D3620c48275a30155K1963i430E7721L8432g0781H1628b02513
9435B50010a09982r901A54312b14730g8006a7816l8923o2074j5261N2664e327
9423C0065h5124q7671o7002C534d6832B82827A35463m8541d2674j80803O9590
9412a53887E4581a56384E5424g9873A49012a18208Q041N1048k84468b743E944
$$ plain form
9494 410168 -61986 -415547 -369268 -63672 107676 -96673 -40780 -127904 40425 -167343 -365130
9483 -365130 266261 -187435 170482 -5035 -117087 -102425 -170985 2985 -7943 -132044 89091
9471 101392 -76448 -3271 -66915 96763 320609 95084 170654 87528 -134728 228175 146950
9460 146950 93818 -177823 89566 56062 -41076 -55593 216473 -84728 -189744 -51940 -7404
9448 52434 137749 -77268 43620 -348275 -130155 -108192 -9430 57721 96153 -70781 81628 -202513
9435 250010 -109982 -119883 154312 -214730 -78006 -17816 -56739 -118813 -134074 -81410 -5327
9423 30065 -85124 -172795 -239797 3534 -46832 282827 135463 86922 -42674 -223477 -153887
9412 -153887 54581 -156384 55424 -79873 149012 -118208 -110167 -59119 -343587 -2743 5944
9400I8277b99279d1470H3949d5778C76107i7903J0456r7433a6615k33361C20433
9388a93848P2894r0190i5953K9805k12343A0950c11046N2014E9011A7020J12637
9377A29657J05207b71382I8155l9295L436c29726a58283a9679C3947K3804j6473
9366D1278a01144B11791Q8320a32438l5937g7643f660C5663K71492E1095A0835
9354a62314n9278a06221k56224a11778N3093K7090j98434C10883A36001I754a23692
9342E8052B7403c25958J26495A07862D493L45128a78717L3274A68003i8999j57757
9331b56756A94938c57620e1134A019a84013J9424N4765M8802A16424a96070E319
9319b83222Q1557G5718O5096a72949a1865n249j35825j62754j37854B32421A05364
$$ plain form
9400 98277 -299279 -41470 83949 -45778 376107 -97903 -87447 -184880 -16615 -249976 320433
9388 -193848 -120954 -211144 -95953 -66148 -278491 10950 -311046 -259032 59011 17020 129657
9377 129657 234864 -271382 98155 58860 62296 -329726 -158283 -19679 33947 57751 41278
9366 41278 -101144 211791 300111 -132438 -168375 -77643 -6660 35663 307155 51095 10835
9354 -162314 -221592 -106221 -362445 -111778 -58685 -31595 -230029 310883 136001 9754 -123692
9342 58052 27403 -325958 -199463 107862 4493 349621 -178717 -145443 168003 -98999 -256756
9331 -256756 194938 -357620 -51134 1019 -184013 -164589 -109824 -61022 116424 -196070 5319
9319 -283222 -201665 75718 140814 -172949 -11865 -17114 -152939 -315693 -453547 232421 105364
9307a05706C4641A619e9216b5876l54641C28987h4398j44943b1589k23714C724
9295A20654n1690J28369c03865c6547H3602E779a41913p6303F9423c20643B24018
9283b45900P3165P1998K6270A79515a54213k34805a15919j54757m3092B47667
9272c6181G1677c77453d5494B0677J34497m7872h488r5985E4007a51267j2270
9261a63537b2919n2899O675k80155a51522M0896N177j9454E0839a26907B30903
9249b11580b5218A11813c31542a32581c2643k48473l0288q5222a40191O6246k27844
9238c01789a13201N1558p7772D2993b95412J03909E3057i1846j27516Q7109O2807
9227f9446A29608l2281b73989G9832g2957k1043B6757c182r6786A4883b3865k10671
$$ plain form
9307 -105706 34641 1619 -59216 -25876 -380517 328987 -84398 -229341 -21589 -245303 3724
9295 120654 68964 197333 -303865 -36547 83602 5779 -141913 -218216 69423 -320643 224018
9283 -245900 -172735 -100737 -74467 179515 -154213 -389018 -115919 -270676 -313768 247667
9272 -36181 71677 -377453 -45494 20677 155174 107302 -8488 -104473 54007 -151267 -163537
9261 -163537 -22919 -75818 -69143 -349298 -151522 -110626 -105449 -124903 50839 -126907 230903
9249 -211580 -25218 111813 -331542 -132581 -32643 -281116 -311404 -396626 -140191 -73945 -301789
9238 -301789 -113201 -61643 -139415 42993 -295412 -191503 53057 -91846 -219362 -132253 -69446
9227 -69446 129608 97327 -273989 79832 -72957 -94000 26757 -3182 -99968 14883 -23865 -234536
9215b34536C9280B337c79045A08831f6582o6311o7832c5481m2029k9536A22884
9203E8303c7860J6304H4147a05903d9300j59607Q6513j45560A37692b47958h7068
9191a68663J3309H0108Q075b95549a36821q5881B5048K5431c4781l62669f7621
9179h0662C7871c0368A53721M7960c9923o0100q6190I5134k2789a5681C85519
9167b74233A09591a48808e1518b3683D2195k0429a97094B01355l6689C1113K12367
9156B43480a68789e4916a0289k37228O0725N4054k38948D061b60982H6341e7291
9144B49931F2417f2849A3242K14631h0858F2323a7985m8755B65703e25975B70990
9132b05793K8244C2185a27176j7279A89736f1172j50841k35303A49353b9374H9886
$$ plain form
9215 -234536 39280 2337 -379045 108831 -66582 -132893 -200725 -35481 -77510 -107046 122884
9203 58303 -37860 -21556 84147 -105903 -49300 -208907 -122394 -267954 137692 -247958 -87068
9191 -168663 -155354 80108 88183 -295549 -136821 -222702 25048 50479 -34781 -397450 -67621
9179 -80662 37871 -30368 153721 201681 -39923 -100023 -186213 95134 72345 -15681 385519
9167 -274233 109591 -148808 -51518 -23683 42195 21766 -197094 201355 164666 31113 243480
9156 243480 -168789 -54916 -10289 -247517 -186792 -132738 -371686 4061 -260982 86341 -57291
9144 249931 62417 -62849 13242 227873 -80858 62323 -17985 -66740 265703 -525975 270990
9132 -205793 -177549 32185 -127176 -144455 189736 -61172 -212013 -447316 149353 -29374 89886
9120E6043a42321A9445a00244n5786H5876g3232m17625A07431J0877g9048j09133
9109a88181m3630L8373j34594D2114f7752A66686B8718j0676i5649j16769A01593
9097a22134j8891A1186i9041E2707c21877B35504c6265o5410A06861K24193A4707
9085A73289g6396H7018a52857L8268m1573p682A61269B8493g3356p2074j15769
9074b61199c6016k91568A84523a02797j5671E6056a8568A65207i7284n0186g311
9062a19655d2276l15100i5179A62352f9150o5131j43470D1654h8814C275L54309
9051C57584a97826l2151D081J44118h3496k1336E0320J3236a64639f1344j33402
9040a94746B80315a359q7756N33F608a23311j58711g2427j89013J08986B43934
$$ plain form
9120 56043 -142321 19445 -100244 -156030 85876 -73232 -490857 107431 118308 -79048 -188181
9109 -188181 -231811 -193438 -328032 42114 -67752 166686 28718 18042 -95649 -212418 101593
9097 -122134 -141025 11186 -99041 52707 -321877 235504 -36265 -101675 106861 331054 14707
9085 173289 -76396 87018 -152857 -114589 -156162 -163844 161269 28493 -73356 -145430 -261199
9074 -261199 -36016 -327584 184523 -102797 -118468 56056 -18568 165207 -97284 -147470 -7311
9062 -119655 -42276 -357376 -95179 162352 -69150 -134281 -277751 41654 -88814 3275 357584
9051 357584 -197826 -229977 4081 148199 -83496 -104832 50320 63556 -164639 -61344 -194746
9040 -194746 280315 -1359 -89115 -88582 6608 -123311 -282022 -72427 -261440 -152454 243934
9028b19134A617a12956j18330i0699p0562J0059A81481a62257A3281J02364c19147
9016b7718A62720a21300j0440j2713f2405E2425J54085m2932a71931j04691a01257
9004A94916q5077d14537A3234C249J09525J07994b11524d6401k11682C3442b6897
8992i4842B09497c31023a35208e3800F9443k5845K38870b79276A7272J47265a26174
8980F9603a69199k65354a27752j4243j5418C73838a24738k0608D5526K2783C86
8968i2129b8253A93512H0088Q3451a67683p8562B70800G1969A8043a16129A13677
8956C9783a51505k5872h4755m3496J7134B2905a63072j05919B29136I3247a53503
8944E4525A3508c26830e0840j64085c3556F3108a42134k8772P8759k81630B2491
$$ plain form
9028 -219134 1617 -112956 -231286 -90699 -161261 -151202 181481 -162257 13281 115645 -319147
9016 -27718 162720 -121300 -131740 -144453 -62405 52425 206510 163578 -171931 -276622 -101257
9004 194916 109839 -414537 13234 3249 112774 220768 -211524 -46401 -258083 33442 -26897
8992 -94842 209497 -331023 -135208 -53800 69443 43598 282468 -279276 17272 164537 -126174
8980 69603 -169199 -434553 -127752 -141995 -157413 373838 -124738 -145346 45526 68309 386
8968 -92129 -28253 193512 80088 163539 -167683 -246245 270800 71969 18043 -116129 113677
8956 39783 -151505 -177377 -84755 -128251 -111117 22905 -163072 -268991 229136 93247 -153503
8944 54525 13508 -326830 -50840 -214925 -33556 63108 -142134 -170906 -92147 -373777 22491
8932A03766a44000j2110g2178b6887j42427F7624A3511J10710a18434G93993C46961
8920G12212j47031a74018A39510a46948E4063a1826F2566M5422D5420A4975g8590
8908b86453a09339B4243i171j23023A0138N2983b10589f0178o3356j84241b49
8896a09188b3401o9926C17830a76655c0689C89080a31334j45714k07929A42406
8885b64913a7001B9514b84136A62973a2161j18404r1210B1577b10499R5963j15490
8874b30026k73729a93314A13727n0452J7965b64625b3206L665A18373a2024k28532
8863b40556h9015j73214g2187j44548M0222c5704a5756k49596d3448r3418A84141
$$ plain form
8932 103766 -144000 -156110 -72178 -26887 -169314 67624 13511 124221 -118434 793993 346961
8920 712212 565181 -174018 139510 -146948 54063 -11826 62566 107988 45420 14975 -78590
8908 -286453 -109339 24243 -9171 -132194 10138 63121 -210589 -60178 -123534 -307775 -249
8896 -109188 -23401 -93327 317830 -176655 -30689 389080 -131334 -277048 -484977 142406
8885 -264913 -17001 29514 -284136 162973 -12161 -130565 -221775 21577 -210499 -114536 -230026
8874 -230026 -503755 -193314 113727 63275 81240 -264625 -23206 -19541 118373 -12024 -240556
8863 -240556 -89015 -262229 -72187 -216735 -176513 -35704 -15756 -265352 -43448 -136866 184141
$$ [...]
##END NTUPLES=NMR SPECTRUM
##END=
