##TITLE=AC1468_PERAH13299_8011891_WHFlqu7wzJ
##JCAMPDX= 6.0         $$ Bruker NMR JCAMP-DX V2.0
##DATA TYPE= NMR SPECTRUM
##DATA CLASS= NTUPLES
##ORIGIN= BRUKER
##OWNER= Administrator
$$ 1.72 TOPSPIN		Version 2.1
$$ 2013-07-05 17:17:59.234 -0700  Administrator@X
$$ Compression mode = diff/dup
##.OBSERVE FREQUENCY= 400.02188249412
##.OBSERVE NUCLEUS= ^1H
##.ACQUISITION MODE= SIMULTANEOUS (DQD)
##.ACQUISITION SCHEME= undefined
##.AVERAGES= 8
##.DIGITISER RES= 22
##SPECTROMETER/DATA SYSTEM= spect
##.PULSE SEQUENCE= zg30
##.SOLVENT NAME= COFFEE_meoh
##.SHIFT REFERENCE= INTERNAL, COFFEE_meoh, 1, 14.98509
##AUDIT TRAIL= $$ (NUMBER, WHEN, WHO, WHERE, PROCESS, VERSION, WHAT)
$$ ##TITLE= Audit trail, TOPSPIN		Version 2.1
$$ ##JCAMPDX= 5.01
$$ ##ORIGIN= Bruker BioSpin GmbH
$$ ##OWNER= Administrator
$$ $$ E:\/data/COFFEE/nmr/AC1468_PERAH13299_8011891_WHFlqu7wzJ/10/pdata/1/auditp.txt
$$ ##AUDIT TRAIL=  $$ (NUMBER, WHEN, WHO, WHERE, PROCESS, VERSION, WHAT)
(   1,<2013-07-05 17:17:51.906 -0700>,<Administrator>,<X>,<go>,<TOPSPIN 2.1>,
      <created by zg
	started at 2013-07-05 17:16:45.812 -0700,
	POWCHK enabled, PULCHK disabled,
       configuration hash MD5:
       C8 4E 4E 5D D3 5C D8 9E 9F 52 82 E0 59 8A DE 15
       data hash MD5: 64K
       D6 60 66 6D AC 7B 0C 6C FF 29 07 31 92 15 7F A1>)
(   2,<2013-07-05 17:17:54.937 -0700>,<Administrator>,<X>,<proc1d>,<TOPSPIN 2.1>,
      <Start of raw data processing
       efp LB = 0 FT_mod = 6 PKNL = 1 PHC0 = 0 PHC1 = 0 SI = 32K 
       data hash MD5: 32K
       30 61 12 1B 42 66 EE 31 86 E5 EC 35 9D 82 4C F2>)
(   3,<2013-07-05 17:17:55.265 -0700>,<Administrator>,<X>,<proc1d>,<TOPSPIN 2.1>,
      <pk PHC0 = 95.29541 PHC1 = 0 
       data hash MD5: 32K
       42 8C 47 FB D4 C0 74 7A 5E D7 FF 3B 17 A8 C7 BB>)
(   4,<2013-07-05 17:17:55.437 -0700>,<Administrator>,<X>,<proc1d>,<TOPSPIN 2.1>,
      <abs ABSG = 1 
       data hash MD5: 32K
       A1 08 C0 1B 37 4A 71 A6 15 80 B4 88 39 F8 C9 F8>)
(   5,<2013-07-05 17:17:55.515 -0700>,<Administrator>,<X>,<proc1d>,<TOPSPIN 2.1>,
      <abs ABSG = 2 
       data hash MD5: 32K
       F3 19 04 81 12 76 2C FF 43 71 56 75 4A 91 7B D5>)
(   6,<2013-07-05 17:17:55.656 -0700>,<Administrator>,<X>,<proc1d>,<TOPSPIN 2.1>,
      <abs ABSG = 3 
       data hash MD5: 32K
       12 C8 BB E3 85 1C 20 D8 B5 28 87 00 7A 76 BE E9>)
(   7,<2013-07-05 17:17:55.765 -0700>,<Administrator>,<X>,<proc1d>,<TOPSPIN 2.1>,
      <abs ABSG = 4 
       data hash MD5: 32K
       DF 40 1C 11 B7 FA 12 57 56 44 6D D3 8D 39 0B 60>)
(   8,<2013-07-05 17:17:55.906 -0700>,<Administrator>,<X>,<proc1d>,<TOPSPIN 2.1>,
      <abs ABSG = 5 
       data hash MD5: 32K
       78 24 A9 9C 47 40 BC 2B EF 58 48 D4 FF 65 72 E4>)
$$ ##END=
$$ 
$$ $$ hash MD5
$$ $$ 22 F5 95 54 F0 F0 38 DB 8B AB 07 EE D2 D1 95 20
##$RELAX= 
##$RELAX= 
##$RELAX= 
##$RELAX= 
##$RELAX= 
##$RELAX= 
##$RELAX= 
$$ Bruker specific parameters
$$ --------------------------
##$DU= <E:\>
##$EXPNO= 10
##$NAME= <AC1468_PERAH13299_8011891_WHFlqu7wzJ>
$$ [...]
##$TP= (0..7)
150 150 150 150 150 150 150 150
##$TP07= 0
##$TPNAME0= <>
##$TPNAME1= <>
##$TPNAME2= <>
##$TPNAME3= <>
##$TPNAME4= <>
##$TPNAME5= <>
##$TPNAME6= <>
##$TPNAME7= <>
##$TPOAL= (0..7)
0.5 0.5 0.5 0.5 0.5 0.5 0.5 0.5
##$TPOFFS= (0..7)
0 0 0 0 0 0 0 0
##$TUNHIN= 0
##$TUNHOUT= 0
##$TUNXOUT= 0
##$USERA1= <user>
##$USERA2= <user>
##$USERA3= <user>
##$USERA4= <user>
##$USERA5= <user>
##$V9= 5
##$VALIST= <valist>
##$VCLIST= <CCCCCCCCCCCCCCC>
##$VD= 0
##$VDLIST= <DDDDDDDDDDDDDDD>
##$VPLIST= <PPPPPPPPPPPPPPP>
##$VTLIST= <TTTTTTTTTTTTTTT>
##$WBST= 1024
##$WBSW= 4
##$XGAIN= (0..3)
0 0 0 0
##$XL= 0
##$YL= 0
##$YMAX_a= 639874
##$YMIN_a= -541002
##$ZGOPTNS= <>
##$ZL1= 120
##$ZL2= 120
##$ZL3= 120
##$ZL4= 120
##$ABSF1= 14.98509
##$ABSF2= -5.573092
##$ABSG= 5
##$ABSL= 3
##$ALPHA= 0
##$AQORDER= 0
##$ASSFAC= 0
##$ASSFACI= 0
##$ASSFACX= 0
##$ASSWID= 0
##$AUNMP= <proc_prof1d_extract_pilot.lims>
##$AXLEFT= 0
##$AXNAME= <>
##$AXNUC= <1H>
##$AXRIGHT= 0
##$AXTYPE= 0
##$AXUNIT= <>
##$AZFE= 0.1
##$AZFW= 0.1
##$BCFW= 0
##$BC_mod= 0
##$BYTORDP= 0
##$COROFFS= 0
##$CY= 15
##$DATMOD= 1
##$DC= 0
##$DFILT= <>
##$DTYPP= 0
##$F1P= 0
##$F2P= 0
##$FCOR= 0.5
##$FTSIZE= 32768
##$FT_mod= 6
##$GAMMA= 0
##$GB= 0
##$INTBC= 1
##$INTSCL= 1
##$ISEN= 128
##$LB= 0
##$LEV0= 0
##$LPBIN= 0
##$MAXI= 10000
##$MC2= 0
##$MEAN= 0
##$ME_mod= 0
##$MI= 0
##$NCOEF= 0
##$NC_proc= -8
##$NLEV= 6
##$NOISF1= 0
##$NOISF2= 0
##$NSP= 0
##$NTH_PI= 0
##$NZP= 0
##$OFFSET= 14.98509
##$PC= 1
##$PHC0= 95.29541
##$PHC1= 0
##$PH_mod= 1
##$PKNL= yes
##$PPARMOD= 0
##$PPDIAG= 0
##$PPIPTYP= 0
##$PPMPNUM= 2147483647
##$PPRESOL= 1
##$PSCAL= 4
##$PSIGN= 0
##$PYNMP= <proc.py>
##$REVERSE= no
##$SF= 400.02
##$SI= 32768
##$SIGF1= 0
##$SIGF2= 0
##$SINO= 400
##$SIOLD= 32768
##$SPECTYP= <>
##$SREGLST= <1H.CDCl3>
##$SSB= 0
##$STSI= 32768
##$STSR= 0
##$SW_p= 8223.68421052631
##$SYMM= 0
##$S_DEV= 0
##$TDeff= 65536
##$TDoff= 0
##$TI= <>
##$TILT= no
##$TM1= 0
##$TM2= 0
##$TOPLEV= 0
##$USERP1= <user>
##$USERP2= <user>
##$USERP3= <user>
##$USERP4= <user>
##$USERP5= <user>
##$WDW= 1
##$XDIM= 32768
##$YMAX_p= 466237309
##$YMIN_p= -740556
##$CURPLOT= <Network HP LaserJet P1505>
##$CURPRIN= <$Network HP LaserJet P1505>
##$DFORMAT= <normdp>
##$LAYOUT= <+/1D_H.xwp>
##$LFORMAT= <normlp>
##$PFORMAT= <normpl>
##$SURQMSG= 1
$$ End of Bruker specific parameters
$$ ---------------------------------
##NTUPLES= NMR SPECTRUM
##VAR_NAME=  FREQUENCY,     SPECTRUM/REAL,   SPECTRUM/IMAG
##SYMBOL=    X,             R,               I
##VAR_TYPE=  INDEPENDENT,   DEPENDENT,       DEPENDENT
##VAR_FORM=  AFFN,          ASDF,            ASDF
##VAR_DIM=   32768,         32768,           32768
##UNITS=     HZ,            ARBITRARY UNITS, ARBITRARY UNITS
##FACTOR=    0.250966925370066, 1,           1
##FIRST=     8223.43324360094, -66132,       6605
##LAST=      0,             54703,           -125361
##MIN=       0,             -740556,         0
##MAX=       8223.43324360094, 466237309,    0
$$ Real data points
##PAGE= N=1
##DATA TABLE= (X++(R..R)), XYDATA
$$ [...]
19520b01888A97557b9867j13072c2784k6204A801a79069D5127a23844F6120b24797
19508a46642A0943K09842a67277L2704B31232C3823i7366R112j78082k5115a0669
19496a04502j19296R1118D6107d2354A82433q1829d22765j35256c8876j19218
19486a58094M2106j24026C21169b48676G1289a82451Q6085E3254f2716j01725
19476a64441A35884a70018L0765O5863A17677b50043g4700j44301a02104j30665
19466b32769a13764k06140D48857c3802j83377A57846b14664A81397b74364J5436
19456b58928A57407e4719I3647C4316f4191j65831a04187n316B23731G8888K79771
19445C58659A39987c25102A88808a30618j58318D8520a81350L4113A77900H1184
$$ plain form
19520 -201888 197557 -29867 -142939 -32784 -58988 1801 -179069 45127 -123844 66120 -224797
19508 -146642 10943 220785 -167277 -134573 231232 33823 -97366 -88254 -266336 -291451 -10669
19496 -104502 -223798 -132680 46107 -42354 182433 100604 -422765 -558021 -38876 -158094
19486 -158094 -115988 -240014 321169 -248676 71289 -182451 -96366 53254 -62716 -164441
19476 -164441 135884 -170018 -139253 -73390 117677 -250043 -74700 -219001 -102104 -232769
19466 -232769 -113764 -319904 448857 -33802 -217179 157846 -214664 181397 -274364 -258928
19456 -258928 157407 -54719 93647 34316 -64191 -230022 -104187 -109503 223731 78888 358659
19445 358659 139987 -325102 188808 -130618 -288936 48520 -181350 -147237 177900 81184
19434A80522D6699b4516A13127a47260F5991a47925j42957e6452j44761b9915
19423H0205c12299G6072e8437o2097o3141J3935f8468H7108a14885L0666A35146
19411a285N73m42289J69357I8295c68536a36135m4201Q4129o5834c9666B4274
19399A37474F153a9975k92562B5650c09689J07531A42602e14645K41029B99679
19388A32734M7110R2431B9914h6925j79209B51689i8473A02646a24025I0921L9166
19377A30087a8233D1824M5177a32975B77016j18312c9439F0816a86273A16463
19366F0061N3467a43258k000A90917H1637h8608I9474K4389m6277J09599L8115
19355B25300a37366m9950L0851A71446p8346e9761j43203k16667h2890F6485A1248
$$ plain form
19434 180522 46699 -24516 113127 -147260 65991 -147925 -290882 -56452 -201213 -29915
19423 80205 -312299 76072 -58437 -120534 -183675 -169740 -68468 87108 -114885 -84219 135146
19411 -1285 -712 -443001 -273644 98295 -368536 -136135 -180336 -96207 -162041 -39666 24274
19399 137474 6153 -19975 -312537 25650 -309689 -202158 142602 -514645 -273616 299679
19388 132734 179844 272275 29914 -86925 -266134 251689 -98473 102646 -124025 90921 130087
19377 130087 -18233 41824 87001 -132975 277016 158704 -39439 60816 -186273 116463
19366 60061 113528 -143258 -145258 190917 81637 -88608 99474 123863 77586 187185 225300
19355 225300 -137366 -187316 -156465 171446 93100 -59761 -202964 -419631 -82890 66485 11248
19343a22486A93559e9891d986D6408O1663a7492r2284j53535i7755j90926H9257
19331B52297b45557h7265b6033C7437M70g6569m68055d2954k3482j1923p4043
19320a52402l9745A3708R2782f0195C390J67098J28559b02106A25541K91d56391
19308a35407f5761B76873b35107G2158c53433f7635b7354r1370r729k22713h930
19296B7586e5023a6939o0979A69225a34524j23334I53J03408d52395f0364j75999
19285b36363k5647B75673F3983J49479E3133K4412b70353C09118b45762j63984
19275d09746N0466c0831d49r1355F4783a58837f5453n5699A21211L5867a52072
19263a62745D77846k29765a30777B43904a55206A46151E0220a88062N8633k3482
$$ plain form
19343 -122486 193559 -59891 -4986 46408 108071 -17492 -109776 -263311 -97755 -288681 89257
19331 252297 -245557 -87265 -26033 37437 37907 -76569 -544624 -42954 -66436 -78359 -152402
19320 -152402 -192147 13708 106490 -60195 3390 170488 299047 -202106 125541 125832 -456391
19308 -135407 -65761 276873 -235107 72158 -353433 -67635 -27354 -118724 -128453 -351166 -8930
19296 27586 -55023 -16939 -77918 169225 -134524 -257858 953 104361 -452395 -60364 -236363
19285 -236363 -262010 275673 63983 213462 53133 77545 -270353 309118 -245762 -409746
19275 -409746 -359280 -30831 -449 -91804 64783 -158837 -65453 -121152 121211 157078 -152072
19263 -162745 477846 248081 -130777 243904 -155206 146151 50220 -188062 -129429 -152911
19253a52911a0986k12665C7569c78731j71428K34252p1728g4565c4261A4423a1056
19241B7252O9653A4775b8878m28313n120p0863b26488B2931O6859O8704J10020
19230B68514H5579g7344B51004j12680h2696I5436b74427g7289R03D8229a86622
19218A7331L42675d056l52358c5376o3419k1701a1971A01040O6228a87507A97598
19206C32600f7733l5110A50903g1013r6134B88475a28373b6333A71504a8030k21498
19195b39528H456N1445a27357L2824b4470A04948c50135q7341b1312D47184C4310
19183f4372J5247B47291D4911a94146B5135J03700H284a70086g4572A01630a21976
19171c40617C722J14159a43183L2555j84128B7530J40609G8365a78768A11551
$$ plain form
19253 -152911 -10986 -223651 37569 -378731 -550159 -315907 -387635 -74565 -34261 14423 -11056
19241 27252 96905 14775 -28878 -457191 -462311 -533174 -226488 22931 89790 158494 268514
19230 268514 85579 -77344 251004 138324 -82696 95436 -274427 -77289 -76386 48229 -186622
19218 17331 360006 -4056 -356414 -35376 -98795 -120496 -11971 101040 167268 -187507 197598
19206 332600 -67733 -102843 150903 -71013 -167147 288475 -128373 -26333 171504 -18030 -239528
19195 -239528 8456 59901 -127357 -94533 -24470 104948 -350135 -437476 -21312 447184 34310
19183 -64372 -49125 247291 44911 -194146 25135 128835 8284 -170086 -74572 101630 -121976
19171 -340617 3722 117881 -143183 -110628 -294756 27530 168139 78365 -178768 111551
19160A86819f0904J9587A19182d1675j36940r960g4489f905m28035a2296F1090
19148i4473j17848A89794b45411p829B15229J15879a57946b3280k49570P2865
19138a99985a7971H8088O814M7407a92353r1998g0889C6837J68460H0487K03049
19127B83536b87491J7158H4180a78076o9999h7001k67230A52650f0636G9013J32004
19116B11017b25856J2974i8626k2589j65339c5702n3964C679b34335a01390E5106
19104F4280J03702E2262b09766h3350j78103E7608a57658m5628j16503q721A29884
19092H0214G396g3692j42523D2749f5021K6258A39210b58535B06617E82a81651
19080e07487a12627B9695j4629a88291E3099b72971d9220a4932H5742e309k19220
$$ plain form
19160 186819 -60904 -41317 119182 -41675 -178615 -188575 -74489 -6905 -434940 -12296 61090
19148 -94473 -212321 189794 -245411 -253240 215229 331108 -157946 -23280 -272850 -199985
19138 -199985 -17971 88088 94902 142309 -192353 -284351 -70889 36837 205297 80487 283536
19127 283536 -287491 -270333 84180 -178076 -248075 -87001 -354231 152650 -60636 79013 211017
19116 211017 -225856 -212882 -98626 -121215 -286554 -35702 -89666 3679 -234335 -101390 55106
19104 64280 167982 52262 -209766 -83350 -261453 57608 -157658 -203286 -319789 -328510 129884
19092 80214 7396 -73692 -216215 42749 -65021 -38763 139210 -258535 206617 582 -181651
19080 -507487 -112627 29695 15066 -188291 53099 -272971 -49220 -14932 85742 -5309 -224529
19069b24529j05653a0795A31734b43165b5287A33828b6568r6339D1853a42193
19058d2716j62620l1960J7610C390J8579e03836J83982a08276I2640C1564e6620
19046a58979M5038E4596e1961E2667b34284C8163L91509F9669L5643e0609a528
19034b9536j20739j04373e6318B99630A3495b42772B74974O700P0866C6361Q7829
19023A24190f2025B34619p7876D9692K27864p1988e4509k44512J09957A88384
19012b33724B99318A19792k186b92853i8995q5191f3260A80834G9791f3660A09453
19000b5201p4258j34235B3248J72798p7024c94590J39794k061E307J65457f2442
18988e1969j20960c1033B25814a73604c4288D08591G0148e5944b7262j22037g3426
$$ plain form
19069 -224529 -330182 -10795 131734 -243165 -25287 133828 -26568 -122907 41853 -142193
19058 -42716 -205336 -237296 -219686 3390 21969 -503836 -319854 -108276 92640 31564 -56620
19046 -158979 -113941 54596 -51961 52667 -234284 38163 429672 69669 105312 -50609 -1528
19034 -29536 -150275 -254648 -56318 299630 13495 -242772 274974 281674 352540 36361 124190
19023 124190 -62025 234619 156743 49692 277556 205568 -54509 -299021 -189064 188384
19012 -233724 299318 119792 117606 -292853 -98995 -184186 -63260 180834 79791 -63660 109453
19000 -25201 -99459 -233694 23248 196046 119022 -394590 -254796 -256857 5307 170764 -62442
18988 -51969 -172929 -31033 225814 -173604 -34288 408591 70148 -55944 -27262 -149299 -73426
18976A55324k1101a69418A47846e9192I5909K27287D0970b0202l20362J27525
18966b13039k2572f7653l5549c8611F5829a55079A1240g9953k52487k40458a76600
18954C6730b16124e3127p0669f1690b379k27986F7699B5887g0445j18903A20651
18942a98804H382h919E6553Q9530f6390P778b6758k56606A680J18775j8154k0179
18930H2122b63764a03187l06384A17335a05994A10052L4347c9406B59628a35625
18919g7956k2714o8607E436e2562q4596l41791c9359j73118A56083a96253D9057
18907a66159H2784J21403J11765a15974l31070J15307A62732P0886C9605a28300
18896B04429D2641a22745A21493N0293d41714e63p0901j40199p7765A07998m2796
$$ plain form
18976 155324 134223 -169418 147846 -59192 95909 323196 40970 -20202 -340564 -213039
18966 -213039 -235611 -67653 -103202 -38611 65829 -155079 11240 -79953 -332440 -572898 -176600
18954 36730 -216124 -53127 -123796 -61690 -2379 -230365 67699 25887 -70445 -189348 120651
18942 -198804 8382 -8919 56553 146083 -66390 -58612 -26758 -283364 1680 120455 102301 82122
18930 82122 -263764 -103187 -409571 117335 -105994 110052 144399 -39406 259628 -135625
18919 -77956 -100670 -169277 5436 -52562 -137158 -478949 -39359 -212477 156083 -196253 49057
18907 -166159 82784 204187 315952 -115974 -447044 -331737 162732 233618 39605 -128300
18896 204429 42641 -122745 121493 171786 -441714 -563 -71464 -211663 -289428 107998 65202
18885F5202M1117e6436j3783A43353b91928f873p0295B3811b04055A74157a10616
18873A14840a03962d0009j01587B02247e9557j81715h5414d0765m7992L6918C68115
18861E3938a9925l69409g9026a4717A59126e9332p9624G6642L33844a86879k29200
18850d16079A62356D1740K25057A770e2225a5921m0240j23045h1228a5428D2082
18838a59543q4133E9574a43553d5221k78662g7797E6351P4121a07474r8288B5727
18826E0404R6244c84373G2815a16034P158A37272K71939b30950A08446C8920J57124
18815A96044r4487f5003A79997q5806J21937G5400J49828k4915D5040P0972E1796
18803h5567B8459J5509b08859L4950F7263b57839B08875g8737p3022e9342n0062
$$ plain form
18885 65202 106319 -56436 -70219 143353 -291928 -6873 -77168 23811 -204055 174157 -110616
18873 114840 -103962 -40009 -141596 202247 -59557 -241272 -85414 -40765 -88757 -51839 368115
18861 53938 -19925 -389334 -79026 -14717 159126 -59332 -138956 76642 410486 -186879 -416079
18850 -416079 162356 41740 266797 1770 -52225 -15921 -56161 -179206 -81228 -15428 42082
18838 -159543 -243676 59574 -143553 -45221 -323883 -77797 56351 130472 -107474 -205762 25727
18826 50404 146648 -384373 72815 -116034 -108876 137272 409211 -230950 108446 38920 196044
18815 196044 101557 -65003 179997 94191 216128 75400 225228 200313 45040 116012 51796
18803 -85567 28459 43968 -208859 -173909 67263 -257839 208875 -78737 -151759 -59342 -109404
18792a09404N0961q965B49519c68974E3892K31255j30836F6921b6316j17113j87958
18781c31387e5574K385k2242j93386N9661R6276A67726f9781B9435a04578B198
18769i0242k06656c8622A93289b51401I3246B0323h7846E2204c9692D0588M8234
18758H8822b90430o3160B01068m9264O6865b89651h9199j61059e4694A09434R4613
18747B04047b54287A29569b00950B3272b14402H2370a76502O1451J620A02860
18736B94039a20844L170m4448P6116K5170J1538j76742O6109D0360Q9975i4082
18724B01580A0799b61107C4251L9991c20491F58d09052e9324n0505B76322d8197
18712B48409a80341l15626h7062B55354a70388B24731d9747j91589A63764O7896
$$ plain form
18792 -109404 -58443 -67408 249519 -368974 53892 285147 154311 66921 -26316 -143429 -331387
18781 -331387 -55574 -53189 -75431 -268817 -209156 -112880 167726 -69781 29435 -104578 2198
18769 -90242 -296898 -38622 193289 -251401 93246 20323 -87846 52204 -39692 40588 88822
18758 88822 -290430 -353590 201068 151804 218669 -289651 -89199 -250258 -54694 109434 204047
18747 204047 -254287 129569 -200950 23272 -214402 82370 -176502 -115051 -113431 102860
18736 294039 -120844 -117674 -162122 -86006 -60836 -49298 -226040 -159931 40360 130335 -94082
18724 201580 10799 -261107 34251 74242 -320491 658 -409052 -59324 -109829 276322 -48197
18712 248409 -180341 -495967 -87062 255354 -170388 224731 -49747 -241336 163764 231660
18702B31660e0295l03650G5351e85367A12356C2695J18331a08997L8502j30793
18692b01288A25162E8263a48646J1532k16534F1500K6784a17799o8818D1329a39033
18680a07205B65763b0794r6307k6119d4617A67191a19020j93144a53811L3107
18670a20704o7813a5754j30017f5512D5976J18297o3956c21312a53451q4024M9365
18659a88110q8543h0536j63096J15553e6563j37403j28971c6482j00984e3587
18648c9034l60874c7888B4797c22478B8671b4840m7155J1968Q136C8212i3224
18636F0368a02239J1991j82517J00872d6316A49360a06425J6211B06648a65521
18625I307K5926a84672j8434H2295H650a82666A12772a38085J3340J5518b8642
$$ plain form
18702 231660 -50295 -353945 75351 -585367 112356 32695 151026 -108997 -70495 -201288
18692 -201288 125162 58263 -148646 -137114 -353648 61500 88284 -117799 -186617 41329 -139033
18680 -107205 265763 -20794 -117101 -143220 -44617 167191 -119020 -312164 -153811 -120704
18670 -120704 -188517 -15754 -145771 -65512 45976 164273 100317 -321312 -153451 -237475 -188110
18659 -188110 -276653 -80536 -243632 -128079 -56563 -193966 -322937 -36482 -137466 -53587
18648 -39034 -399908 -37888 24797 -322478 28671 -24840 -71995 -60027 -51891 38212 -93224
18636 60368 -102239 -90248 -272765 -171893 -46316 149360 -106425 -90214 206648 -165521
18625 9307 35233 -184672 -203106 82295 8650 -182666 112772 -138085 -124745 -109227 -28642
18613I2894R7447d3763D2562a67330P4380l4370B4557R8385P8683G7983J25231
18602B03214A1167g6145I6581K0454D397a8119l31258J69313A24595a6541j18499
18591a35040D5212d4054n3447F3643J67858c19423B43916a27955C38561a91767
18580d1929H1378l7908f3688A81821e5175j30734D3662a15847j36003d4616k77030
18569c21646C20621d1731l9402p0720j35731a1451j86086H5714b63158A16689
18558c7688j6609k15157J02289k50003H7599b63399a16708B7441K43566E8742
18547G2482d6139H7687b83461A60927M725e351E6484c9643B5271J50647a99691
18535B29730I99c24309B75622j02109a43300l18808a68969j46590a20080e1079
$$ plain form
18613 92894 190341 -43763 42562 -167330 -92950 -127320 24557 122942 201625 77983 203214
18602 203214 11167 -76145 96581 117035 4397 -18119 -349377 -180064 124595 -16541 -135040
18591 -135040 45212 -44054 -97501 63643 231501 -319423 243916 -127955 338561 -191767
18580 -41929 81378 43470 -63688 181821 -55175 -185909 43662 -115847 -251850 -44616 -321646
18569 -321646 320621 -41731 -81133 -151853 -287584 -11451 -197537 85714 -263158 116689
18558 -37688 -54297 -269454 -167165 -417168 87599 -263399 -116708 27441 271007 58742
18547 72482 -46139 87687 -283461 160927 165652 -5351 56484 -39643 25271 175918 -199691
18535 229730 999 -324309 275622 173513 -143300 -462108 -168969 -315559 -120080 -51079
18524e3053A0729a82600j55433f1998A07923a1973p3452b3967B16657b00012a4332
18512e0574C120f7040l8472l5739A66070b9402j13562j0635K7771N6441r0973
18501a60360B5616J947a2595d800F1389a11434A22778O2596b93486e5575j86043
18490b41618c7786l9592K0368j92582C5396b39538D6196L4486C3193b01153B42084
18478a87193j12132j6141H7857j7261d74624J67740a49942k91230g0303A13937
18467A46380c4010D7857a28169A04970i7073H6999b40047b7655C17323k3465a03802
18455H7155J50997f2321o1745G1349k961f8803D7310q046b237A89954a95917j0733
18443b06650P4364A72421F9487d22109A42418a16841H7559a07414A39272a09127
$$ plain form
18524 -53053 10729 -182600 -338033 -61998 107923 -11973 -85425 -23967 216657 -200012 -14332
18512 -50574 3120 -67040 -105512 -141251 166070 -29402 -142964 -153599 -125828 -69387 -160360
18501 -160360 25616 27563 -12595 -4800 61389 -111434 122778 185374 -293486 -55575 -241618
18490 -241618 -37786 -77378 -57010 -249592 35396 -239538 46196 80682 33193 -201153 242084
18478 -187193 -299325 -315466 87857 70596 -474624 -306884 -149942 -441172 -70303 113937
18467 146380 -34010 47857 -128169 104970 -97073 86999 -240047 -27655 317323 293858 -103802
18455 87155 238152 -62321 -124066 71349 68388 -68803 47310 39264 -2237 189954 -195917 -206650
18443 -206650 -132286 172421 69487 -422109 142418 -116841 87559 -107414 139272 -109127
18432H0553J6095b46264H8063c60801J13500c2899C0123a07370n1450j46158B8318
18420H1595b48137B37966c0777G6432L2927b36708N4606k520e1348m05651H5332
18408H4738k8956a69355a3600j15501f13k84567B32425c1104D8221K66712c09998
18396A12768f2186A25407J04003a25339e02k15393P0512F0929c8934A34652f9502
18384A63187b52206l5305a07571a6754j68620e1737K245B12294a29671j0559A9633
18372f111j03955l95822B09121a45744C592Q3984N29229B74331F7890K5619c17233
18360b79654b2150j27541D68479B31851a02654C43000e07681e4097I8044h179
18349b77701i2705E350J83559q9834d8876k67201A23055J34383P9936A07147a45094
$$ plain form
18432 80553 96648 -246264 88063 -360801 -247301 -32899 30123 -107370 -158820 -304978 28318
18420 81595 -248137 237966 -30777 76432 109359 -236708 -182102 -184622 -51348 -456999 85332
18408 84738 55782 -169355 -13600 -129101 -613 -285180 232425 -31104 48221 314933 -309998
18396 112768 -62186 125407 229410 -125339 -502 -215895 -145383 60929 -38934 134652 -69502
18384 163187 -252206 -287511 -107571 -16754 -185374 -51737 -49492 212294 -129671 -140230 19633
18372 -6111 -110066 -505888 209121 -145744 3592 87576 616805 274331 67890 93509 -317233
18360 -279654 -22150 -149691 468479 231851 -102654 343000 -507681 -54097 98044 -8179
18349 -277701 -92705 5350 188909 99075 -48876 -316077 123055 257438 337374 107147 -145094
18337a35696K1125j27368l3738F4334a37098N2841k18790f7705D903a69754B58561
18325a35940A87383P6078C9215J55808M5203j09079a79224C210K62224I5324a6323
18313a06042b6922A56991K21350g0630j3179I5645a55660O8438b1162A8509b53603
18301a63048C59085a78209N3798l825J7662B08512C593a42383e0378E606e1910
18289e5576H5481h796B11296A04739g0280C89308c83966A01905a24802G959b35756
18277a56493e5437C0532a40512A51639j230p3203K07332b56236a09542E2063k1189
18266C0874b47088M0350N4231k25394A21485a26483G1723a66593H958d02782d878
18254B53662a68160C84903A60400f3807A1066d112A00115O2542J38094e361r6907
$$ plain form
18337 -135696 -114571 -241939 -275677 64334 -137098 -84257 -303047 -67705 4903 -169754 258561
18325 -135940 187383 263461 39215 195023 240226 131147 -179224 3210 265434 95324 -16323
18313 -106042 -26922 156991 378341 -70630 -83809 95645 -155660 -87222 -21162 18509 -253603
18301 -163048 359085 -178209 -124411 -128236 -110574 208512 3593 -142383 -50378 5606 -51910
18289 -55576 85481 -8796 211296 104739 -70280 389308 -383966 101905 -124802 7959 -235756
18277 -156493 -55437 30532 -140512 151639 150409 77206 284538 -256236 -109542 52063 30874
18266 30874 -247088 -206738 -152507 -377901 121485 -126483 71723 -166593 8958 -402782 -4878
18254 253662 -168160 384903 160400 -63807 11066 -4112 100115 162657 300751 -5361 -102268
18243a02268c4863A21038b95648a05217P555k91322b0807G3654b38830j7375N7507
18232a98698b389G6411N3995M721b32426j14074B11959A04533c41550L5314B6304
18220B0553i3419A89822b27662f1921C63018a48885H4897e1254A00390a46814
18209C7403b40115a07949F6472g6453q542k5031k23625a5903o9013o1447F5339
18197D9288J69967a75977F8822J18679a67275K5313d5195a5640F3666R872a45490
18185a59128l2198d7613I244J79492F572e33565D2283a90185C3121e54417a30357
18173B56943a42521C5248b09804M2688I6939P5371a74856j61132A75079q0526
18163I4553a91241n5635O6644l1546N2274o5697d3030B95049a57401j1791D2036
$$ plain form
18243 -102268 -34863 121038 -295648 -105217 -97662 -388984 -20807 73654 -238830 -256205 -198698
18232 -198698 -2389 76411 130406 135127 -232426 -346500 211959 104533 -341550 -306236 26304
18220 20553 -93419 189822 -227662 -61921 363018 -148885 84897 -51254 100390 -146814
18209 37403 -240115 -107949 66472 -76453 -84995 -110026 -333651 -15903 -84916 -146363 65339
18197 49288 219255 -175977 68822 187501 -167275 -141962 -45195 -15640 63666 73538 -145490
18185 -159128 -191326 -47613 9244 188736 6572 -533565 42283 -190185 33121 -554417 -130357
18173 256943 -142521 35248 -209804 -167116 96939 172310 -174856 -335988 175079 94553
18163 94553 -191241 -246876 -180232 -211778 -159504 -225201 -43030 295049 -157401 -169192 42036
18151b98079A98824B7188b1396A22966Q2614a03465C27705b21236p463B75487
18140B24729a80360j52798l34A38576J52818C4072M18168C8874f2425n7148d8550
18128h4356K3777J562j00961B78782h3878J2256q8803A49809b34410p786N2327
18117a89869D5555L14674a44797C2531b36141A11182f5588B80577r2152J41253
18107C29678C5016R3966J00310b77946E3990A5520a98989i2664j1198j35713i2477
18095A55488L821C177a71250P448n164h3482A1700M9656d18193J42340j9720f1135
18082C27530f697l21485f0534B50345a51481d4524o8899c09A25734J48045I4332
18070C58949D9876K91260q5008c85081a77568A31460a98419N7340k96099D405
$$ plain form
18151 -298079 198824 27188 -21396 122966 205580 -103465 327705 -221236 -228699 275487
18140 224729 -180360 -333158 -333492 138576 291394 34072 452240 38874 -62425 -119573 -48550
18128 -84356 -60579 -59017 -159978 278782 -83878 -71622 -160425 149809 -234410 -242196 -189869
18117 -189869 45555 360229 -144797 32531 -236141 111182 -65588 280577 188425 329678
18107 329678 35016 128982 229292 -277946 53990 15520 -198989 -92664 -103862 -239575 -92477
18095 155488 159309 3177 -171250 -163802 -168966 -83482 11700 61356 -418193 -275853 -295573 -61135
18082 327530 -6697 -328182 -60534 250345 -151481 -44524 -113423 -309 125734 273779 94332
18070 358949 49876 341136 256128 -385081 -177568 131460 -198419 -141079 -437178 4405
18059B17157C0902J5320a08014A6114i2136A29155E1518a26664h777r228k81657
18048b99662e2416C34757a1666n0222l95454A50489g4737C62040o4687c43077
18037h0948q2943A36446a82655e8901D7483D609K52215a39738A25240E1820Q1459
18026A33279K6405c04588J10453A92293J1329a04509r0920I3262b23310P6630
18016a46680d8020r67E9068b36148j8613l294Q9473B03650C7157b07646G0946
18004g6743A70539J13249c3069A24152K23866a1960l68563e3847A95184a48848
17993E4527J7236k5818C958c46835A1777K2789a68788h829r5859M9907C43747
17981A44869O9611a22970b3509k39209A20242E9092J70401c3747k69884K5992
$$ plain form
18059 217157 30902 46222 -108014 16114 -92136 129155 51518 -126664 -8777 -18005 -299662
18048 -299662 -52416 334757 -11666 -61888 -457342 150489 -74737 362040 297353 -343077
18037 -80948 -163891 136446 -182655 -58901 47483 4609 256824 -139738 125240 51820 133279
18026 133279 159684 -304588 -194135 192293 203622 -104509 -195429 93262 -223310 -146680
18016 -146680 -48020 -48987 59068 -236148 -254761 -258055 -168582 203650 37157 -207646 70946
18004 -76743 170539 283788 -33069 124152 348018 -11960 -380523 -53847 195184 -148848
17993 54527 71763 45945 3958 -346835 11777 34566 -168788 -8829 -104688 -54781 343747
17981 144869 214480 -122970 -23509 -262718 120242 59092 229493 -33747 -303631 -277639
17971b77639B94516g4948A25161a48746A6548c09240i291A01673J4029b13514
17960c12198H5069P9645a40568j07226B33638a71353m8993E4856f4632c299k0950
17949b4249l96642A1534M57140C1512i4427j96391J45111H9187O7817Q8224d2154
17937B41486d17472F1343a18427q2224A69123n2675M3505c53800B7715e576C76970
17925A08915b24810G3425J41787k2190B1698h5727E5456K470a26068k0069k08958
17914c55095H7853K22921c47710a11779F3188g1684o2087e7671r6405e3041m8674
17903a01715l5488p4701E52061A45613K5108b81688j29097C64608b26132B0186
17892g760G5294d41376A3637L61526b1143D4662M4074a18308h48j05983C05942
$$ plain form
17971 -277639 294516 -74948 125161 -148746 16548 -309240 -9291 101673 115702 -213514
17960 -312198 85069 164714 -140568 -247794 233638 -171353 -220346 54856 -64632 -3299 -24249
17949 -24249 -420891 11534 468674 31512 -94427 -290818 -145707 89187 157004 245228 -42154
17937 241486 -417472 61343 -118427 -200651 169123 116448 159953 -353800 27715 -5576 376970
17925 108915 -224810 73425 215212 193022 21698 -85727 55456 57926 -126068 -146137 -355095
17914 -355095 87853 310774 -347710 -111779 63188 -71684 -133771 -57671 -154076 -53041 -101715
17903 -101715 -137203 -211904 552061 145613 170721 -281688 -410785 364608 -226132 20186
17892 -7760 75294 -441376 13637 375163 -21143 44662 88736 -118308 -848 -106831 305942
17880B64517a47060e7040G7254a19135b959r9685B61071Q5862l8843b49783a17135
17868H6290e6497j8339A73608E1825L5070j7320h5659B14445c5579k05880A177
17856b5457j34474a8578C55246a15275J9536c6724j72838h4215H0126b82420G2317
17844e1276r3890j29188a7979l12590E2097d277A34357K0458i853H2457a74884
17832H9143K97502a49218A45176a44498p837I2600c41204a41262N3109H7865a34082
17820B5400J07829a80296B23216a04603A36607P2322G7038K40810n9551a5943
17809I6905k1095g1460A03802B9490J35351i2704H4076b26420C20381b4096j85436
17798b09532h7827o7140A2976J9794a43854A33796J80816I8596J9356a51963c7183
$$ plain form
17880 264517 -147060 -57040 77254 -119135 -2959 -102644 261071 346933 308090 -249783 -117135
17868 86290 -56497 -74836 173608 51825 86895 69575 -85659 214445 -35579 -241459 1177
17856 -25457 -159931 -18578 355246 -115275 -95739 -36724 -209562 -84215 80126 -282420 72317
17844 -51276 -145166 -274354 -17979 -330569 52097 -4277 134357 154815 -9853 82457 -174884
17832 89143 386645 -149218 145176 -144498 -152335 92600 -341204 -141262 -88153 87865 -134082
17820 25400 133229 -180296 223216 -104603 136607 208929 77038 317848 258297 -15943
17809 96905 75810 -71460 103802 29490 164841 -92704 84076 -226420 320381 -24096 -209532
17798 -209532 -87827 -154967 12976 32770 -143854 133796 314612 98596 117952 -151963 -37183
17786B67868H7895a76956j18458e6581A48475a87659B25779n1771n3641c2236
17775B26789a8305j20051b4789H3011b88722C099P4537e7596D10981F8269L36339
17764D04608A29963a27610B89292l8665B4150r487b46016B0295a10055B50006
17753A41482a34958M4752A20813l579b01662C8568K05479f5090j41961L1254j49893
17742c25690J32753A16852J45415I4032a8277j17731e8063k1j15531L076k5337
17731a95876A80510Q6859b9278C49153C0013O0820P7422i2854l37131B27973k2751
17720B05222M9500j21590b025l9847C56467A525b8721B25000f430B96568A6143
17708a24575p785F9856e7391p8870I6868c76822A13861K96767a62159E0909J15939
$$ plain form
17786 267868 87895 -176956 -295414 -56581 148475 -187659 225779 174008 120367 -32236
17775 226789 -18305 -138356 -24789 83011 -288722 3099 77636 -57596 410981 68269 404608
17764 404608 129963 -127610 289292 250627 24150 14663 -246016 20295 -110055 250006
17753 141482 -134958 -90206 120813 117234 -201662 38568 244047 -65090 -207051 -175797 -325690
17742 -325690 -192937 116852 262267 94032 -18277 -136008 -58063 -58084 -173615 -170539 -195876
17731 -195876 180510 267369 -29278 349153 30013 90833 168255 -92854 -429985 227973 205222
17720 205222 254722 133132 -2025 -41872 356467 1525 -28721 225000 -6430 296568 16143
17708 -124575 -132360 69856 -57391 -136261 96868 -376822 113861 410628 -162159 50909 166848
17697A66848e369j08248h162B34680b6027j70059A161K4160N390b58799F2199
17685B44296h2782A19268K90948a57488q5907N6526C08219A01237A4871K20196
17675B35067J26880j28739e7567j53739h2407j0142A36624l3241a46133N1143
17665i4990A9790J55192B0775b2268A0000e8397I2778R3737e4104F0594N9775
17654A20369A2564b27992A30944j3708h0639e932j17276o0397A26660a05570F9475
17642C78905g0156I1594m296L9784b98906n908B94817A36944a05650A49165F0009
17630B62452o5980e185B67895a67077Q984A5414a11897G5378i308G5140L1058
17619A06198L4528b80893r6123J55086j32136J63361A61445a44701c1690o6606
$$ plain form
17697 166848 -5369 -113617 -8162 234680 -26027 -196086 1161 25321 30711 -258799 62199
17685 244296 -82782 119268 410216 -157488 -243395 -186869 308219 101237 14871 235067
17675 235067 361947 233208 -57567 -211306 -82407 -92549 136624 103383 -146133 -94990
17665 -94990 19790 174982 20775 -22268 10000 -58397 92778 186515 -54104 60594 120369
17654 120369 12564 -227992 130944 117236 -80639 -5932 -123208 -183605 126660 -105570 69475
17642 378905 -70156 91594 87298 127082 -298906 -304814 294817 136944 -105650 149165 60009
17630 262452 196472 -5185 267895 -167077 -158093 15414 -111897 75378 -9308 75140 106198
17619 106198 140726 -280893 -377016 -221930 -354066 -190705 161445 -144701 -31690 -98296
17609i8296m5663A42282a50831N1676B23632b8405a703r9254l164K0840j91355
17598b74636h2823A64664c6048A90112A4957J07134a06782J7483A05975D5879
17587a61577g6942c6404n8770C72844b7880A92446a16699A45566K59286j78970
17577B25882a0265B45937b5478b186k32724O7445P5321L2429j27865N6540a9355
17565a55014I3242Q8616f0542k3663H7399c8612m9005F3234q858a40968A84847
17553C09261o5756a08712A32551F0117k4327L51289j92403c01675A28980o3441
17543F5539K66813b34313A34205c6758C17517A17093B3790J68584h4171B49547
17532A56914J19349Q4547c1601j0538A01156c57285B8676J52183F8302I088q54
$$ plain form
17609 -98296 -143959 142282 -150831 -99155 223632 -28405 -1703 -100957 -104121 -83281 -274636
17598 -274636 -82823 164664 -36048 190112 14957 122091 -106782 -89299 105975 45879
17587 -161577 -76942 -36404 -95174 372844 -27880 192446 -116699 145566 404852 225882
17577 225882 -10265 245937 -25478 -2186 -234910 -167465 -92144 -59715 -187580 -131040 -19355
17565 -155014 93242 181858 -60542 -84205 87399 -38612 -87617 63234 54376 -140968 184847
17553 309261 243505 -108712 132551 60117 35790 387079 194676 -301675 128980 65539
17543 65539 332352 -234313 134205 -36758 317517 117093 23790 192374 -84171 249547
17532 156914 276263 360810 -31601 -42139 101156 -357285 28676 180859 68302 9088 8234
17521H234K22551E7238K64098j40859k7899B5858J00222J04145o4508L5169D116
17509A75654C1614L44884A78691d6181l9888I6611A6803a34329L1711c6693l1702
17498f8395G5116a6688m8504D1967A7070K2474p275a49822E435M42523j73207
17487B74751I0585O2985b13018E1759J80452i7741C68030D7319J21431J6907f0130
17475G3442a47738C68547E8701J7390l4017c4570k7557E625J42979c47268B9029
17463B30012d7965B16193i4642A71621j9423N3338H8648D3354g0394F6421e5790
17451B24534l6695P8425K56156k21171O7263J60943A42775m8425P8618J28894
17441C01862a81059G46540C02381K51885k62678r6276N7757H5150K45839q6879
$$ plain form
17521 8234 230785 57238 321336 180477 152578 25858 126080 230225 165717 200886 4116
17509 175654 31614 376498 178691 -46181 -86069 96611 16803 -134329 -102618 -36693 -68395
17498 -68395 75116 -16688 -65192 41967 17070 39544 32269 -149822 5435 447958 274751
17487 274751 90585 153570 -213018 51759 232211 -97741 368030 47319 168750 185657 -60130
17475 73442 -147738 368547 58701 76091 42074 -34570 -62127 5625 148604 -347268 29029
17463 230012 -47965 216193 -94642 171621 152198 205536 88648 43354 -70394 66421 -55790
17451 224534 187839 266264 522420 301249 368512 529455 142775 94350 172968 301862
17441 301862 -181059 746540 302381 554266 291588 195312 253069 85150 330989 244110
17431B44110p3848L77642r2286C9373L36967K876I1666J68763Q6037j08409p106
17420B30951l076J04472o72A48070C2352A2653J75503O3491j3124n1575f8052
17408A79214B9260J09085O4275L9816L0997K42135f9168C67358A08708M00358
17398E09066E9531J81132f0694A91217K3354c38936C6612J73903E0750N915J24501
17387A81166K52910I0249L3561e0583A17702K01872A02493J55469J8495c7576
17376i28m4508A91516f3541B31144E1716j2098L28597C5669b29825B02339R4132
17365B96471m9908K5100a05422B24979q603o8678L2237a04929B25034e7584k14699
17354b72283H6492K73645a00895H9056a21504C11345e671D36392a000B53763o3520
$$ plain form
17431 244110 170262 547904 455618 39373 376340 379216 91666 260429 346466 238057 230951
17420 230951 227875 332347 331675 148070 32352 12653 188156 251647 238523 186948 -68052
17408 179214 29260 138345 202620 242436 273433 515568 -69168 367358 108708 509066
17398 509066 59531 240663 -60694 191217 214571 -338936 36612 210515 50750 56665 181166
17387 181166 434076 90249 123810 -50583 117702 319574 102493 257962 276457 -37576
17376 -928 -45436 191516 -63541 231144 51716 39618 368215 35669 -229825 202339 296471
17365 296471 246563 271663 -105422 224979 216376 147698 179935 -104929 225034 -57584 -272283
17354 -272283 86492 360137 -100895 89056 -121504 311345 -5671 436392 -1000 253763 190243
17343A90243K5413o233r1163L82943A28446o3720J23503C0036J96653a59041B70675
17331B72632j1504a86974H3667k9627k3115K96742I3646M989J28030l4239f2094
17319D22998B03651m4134K11814A65432a36045A60342a02777C95159j39649j22718
17309A32792J91866A33351J79656D7970j8517N12223A37583G101K62577r7806
17299A71872m9215N9780M1143l3730B610K48626j08842i8705A02526O6844J50777
17288C20147A57006b9423B00446d4278A28125n3870L2219l8517R730P4854p4320
17277G8221L54562j57766p7659R2155A7814K42194K957A04201K29802B9280L64014
17266C93294i5007A12547K02506f559B86740G007g2223B84675D1297L08921A14265
$$ plain form
17343 190243 215656 209423 118260 501203 128446 64726 188229 30036 226689 -159041 270675
17331 272632 261128 -186974 83667 54040 30925 327667 93646 98635 226665 192426 -62094
17319 422998 203651 159517 371331 165432 -136045 160342 -102777 395159 255510 132792
17309 132792 324658 133351 313007 47970 29453 541676 137583 7101 269678 171872
17299 171872 122657 182437 223580 189850 2610 251236 142394 -98705 102526 169370 320147
17288 320147 157006 -29423 200446 -44278 128125 74255 106474 67957 77687 152541 78221
17277 78221 432783 275017 197358 289513 17814 260008 262965 104201 334003 29280 393294
17266 393294 -95007 112547 315053 -6559 286740 7007 -72223 284675 41297 350218 114265
17254B38941p2114j8057J13035a96749G9626a64051A71109J48439j06451a21579
17243B63228J41170F8818L95278A84814c6484B21454K05103A82677b691C6305
17232C02172J45070j22712j41278J7324H535K06376n6445E909b27515B25715G9824
17220A61272a91199A72276K33368L3186j43575l7973E9728Q3368J19950A22092
17209A00282J80193n4905l618c8698A07695J18251N0701B8854m399L24292J36869
17198D85616M7587I8130b40490H6986J59650o9451b9975B39996K89277H1217L11979
17187C93196J5369A55939N7384b0107A51108P7547b1272D71016B05116J63306
17177C68422N989l0772m3274a4496C40696A69919J72295A60079K17432A61240
$$ plain form
17254 238941 166827 148770 261805 -196749 79626 -164051 171109 319548 213097 -121579
17243 263228 404398 68818 464096 184814 -36484 221454 426557 182677 -2691 36305
17232 302172 447242 324530 183252 200576 8535 214911 158466 5909 -227515 225715 79824
17220 161272 -191199 172276 405644 438830 295255 257282 59728 143096 263046 122092
17209 100282 280475 225570 221952 -38698 107695 225946 276647 28854 24455 348747 485616
17198 485616 533203 98130 -240490 86986 246636 177185 -29975 239996 529273 81217 393196
17187 393196 408565 155939 213323 -20107 151108 228655 -21272 471016 205116 368422
17177 368422 374411 343639 300365 -14496 340696 169919 342214 160079 377511 161240
17166C14337J92629k45463P7031L58234l45941A62109E7016K63250j26886F4029
17155B69668A31928J6085R3781K5067J92770j33946J76678n9569A35622K54384
17145C90006n5252Q760j07070r6267K74060A59546K19438A77801k7303J49080
17135B99578R0951O8888O3584L531K52845k07514k18258R5361P1876j45924O7622
17124D42540r6266o5843M9137R3219A42653L81160k56074n0448J17631j58069
17114A76853J87229A73243K38534J24904R703B03964K25566M549B09362J72583
17104C81945A07439J5410L05470B09792L38252B58528O5194H9940M10273N3170
17094E53383A63586M44258k50560N7770K07420A90628F2522P1298L02990R0103
$$ plain form
17166 314337 506966 261503 338534 696768 350827 162109 57016 320266 193380 64029
17155 269668 131928 148013 241794 266861 459631 325685 502363 442794 135622 390006
17145 390006 334754 343514 236444 140177 414237 159546 378984 177801 150498 299578
17135 299578 390529 459417 523001 526532 779377 571863 353605 448966 520842 374918 442540
17124 442540 346274 280431 329568 422787 142653 523813 267739 217291 334922 176853
17114 176853 364082 173243 411777 536681 546384 203964 429530 434079 209362 381945
17104 381945 107439 122849 428319 209792 548044 258528 323722 89940 500213 553383
17094 553383 163586 607844 357284 415054 622474 190628 62522 133820 436810 526913
17084E26913p3723j92185M20004j60673k20590Q4110O2911Q5661j91241K10049
17074E51236J38470j91199m5551A71213J68510J76045R1757k08007m2829K59475
17064F16164p1412J37165n616R1026l82355K91901j07794J19549k15682J40141
17054F13087j40889K41880r0295A90088M60689n4059B97974K33934k40665L87556
17044F78799k2085O6521k0195k58027J94366J87778k50379B59622L11200n1068
17034E19754M3418L61503C48587K93376M23912k60792J49329k30069B03567O75581
17024H79148C13602N10196l4334k50578O0170n899N99102C69983J90744j4816
17014E45911J36853M52200l33357l20289M32206k26659j2145R0814n2327j07881
$$ plain form
17084 526913 453190 261005 681009 520336 299746 383856 446767 532428 341187 551236
17074 551236 689706 498507 452956 171213 339723 515768 607525 399518 356689 616164
17064 616164 544752 681917 676301 767327 384972 676873 569079 688628 472946 613087
17054 613087 472198 714078 623783 190088 650777 596718 297974 531908 291243 678799
17044 678799 656714 723235 703040 445013 639379 827157 576778 259622 570822 519754
17034 519754 563172 924675 348587 641963 1065875 805083 954412 724343 203567 879148
17024 879148 313602 823798 789464 538886 599056 593157 1192259 369983 560727 545911
17014 545911 682764 1134964 801607 481318 913524 686865 674720 765534 713207 605326
17004F05326q0963P5995M31735m39966n301P2053l00689L60247R9453L5845N0681
16993I04416P5439k73484J86868m9039j50026J90337J92764l18143n2342J44716
16983H51506L6059J2372L972k67896L74627D79280L74072J99459k19616j35092
16973F98103k136L13822p356k38469K63234k1469K52150P5341n01704R696K45277
16962A086489J07785m7189J14273l40590J65353l25426M42014k0311r1746l7436
16952A053216J33693j98110m0321M08691m69870L85700k32699L446P5051K0769
16942A139566J08684k96961M18019L32920n59732Q8371R453q30j6895K99602r7192
16931A425005k14090P8175M3658K36449J16200l60482J4782n434N32972m86771
$$ plain form
17004 605326 524363 600358 1032093 592127 586826 658879 358190 718437 817890 853735 904416
16993 904416 979855 706371 893239 844200 694174 884511 1077275 759132 706790 851506
16983 851506 887565 899937 903909 636013 1010640 479280 853352 1052811 833195 698103
16973 698103 695967 1009789 1002433 763964 1027198 1005729 1257879 1333220 831516 841212 1086489
16962 1086489 1194274 1147085 1261358 920768 1086121 760695 1202709 1182398 1090652 1053216
16952 1053216 1186909 988799 948478 1357169 887299 1272999 1040300 1043746 1118797 1139566
16942 1139566 1248250 951289 1369308 1702228 1142496 1230867 1240320 1239490 1222595 1522197 1425005
16931 1425005 1210915 1289090 1332748 1569197 1685397 1324915 1339697 1334263 1867235 1380464
16921A380464m8401J16141k70000J64556J05502K94801k58393K34078l3426j31538
16911A553784K63130l28106N7764J86281J1775k52223K79190q6820K09421J1809
16901A906005k23375J60380P2056K07689l47355P07905n89382K40856j56064N5243
16891B033958j67483k2389O72713l88245k2256O396j01590L25828k30709J70414
16881B276637J87998j22299K37443j27003J12082O2523l9606j55967L52306J64899
16871B949013o79891K55924J55079r1701J20315J67901r4351j16021J90765J65113
16861C022146j93680J21079r5303M63921m76077K50587K72173L8415k6112J64882
16851C542031J9675k9635k48684N72249O8672n54724M20303j8525K8746R1141
$$ plain form
16921 1380464 1332063 1448204 1178204 1342760 1448262 1743063 1484670 1718748 1685322 1553784
16911 1553784 1816914 1488808 1546572 1732853 1744628 1492405 1771595 1684775 1894196 1906005
16901 1906005 1682630 1843010 1915066 2122755 1775400 2483305 1893923 2134779 1978715 2033958
16891 2033958 1866475 1844086 2516799 2128554 2106298 2112694 2011104 2336932 2106223 2276637
16881 2276637 2464635 2342336 2579779 2452776 2564858 2627381 2587775 2431808 2784114 2949013
16871 2949013 2269122 2525046 2680125 2588424 2708739 2876640 2782289 2666268 2857033 3022146
16861 3022146 2828466 2949545 2854242 3318163 2842086 3092673 3364846 3403261 3377149 3542031
16851 3542031 3561706 3532071 3283387 3855636 3924308 3369584 3789887 3771362 3800108 3891249
16841C891249J02893J79543l6991J47109P5459L6720P0468K51930J65996m08137
16831D476239M33625q7370J20739O5904J57345p1569O93462j29283L15399k78060
16821E696431J94766J88867j78813L59999J90987j91537L79655k09456L06816
16812F737715o1488O55620j45357K16809K63526M998J89025j24206R74486l54778
16802H356350J9024J95251M75304J81962K92796M50904K41590K80673N5506R7898
16792A0647258K10747L46763K38989O59829J3264N49575J95565O01084M57315
16783A3920389K33945L49019L00846P41064N78285K47439L79399P87393M43325
16774A7981104Q36139O25141R59048L25136J000857Q91469K45323J129272M63418
$$ plain form
16841 3891249 3994142 4173685 4136694 4283803 4359262 4395982 4466450 4718380 4884376 4476239
16831 4476239 4909864 4822494 4943233 5009137 5166482 5094913 5788375 5659092 5974491 5696431
16821 5696431 5891197 6080064 5901251 6261250 6452237 6260700 6640355 6430899 6737715
16812 6737715 6676227 7331847 7186490 7403299 7666825 7671823 7860848 7736642 8711128 8356350
16802 8356350 8375374 8570625 9045929 9227891 9520687 9971591 10213181 10493854 10549360 10647258
16792 10647258 10858005 11204768 11443757 12103586 12116850 12666425 12861990 13463074 13920389
16783 13920389 14154334 14503353 14804199 15545263 16123548 16370987 16750386 17537779 17981104
16774 17981104 18817243 19442384 20401432 20726568 21727425 22618894 22864217 23993489 24456907
16765B4456907J318452J161605R04355J334531J031902J034111J353276J281207
16757C3876346J439947J655667K054413J493487J609511K029922K094904J981341
16749D8235538K702622K654394K435570K913827K881310L074985L681116L353222
16741G1932584L865422L965460M341487M396068M632503M722725N216720N528464
16733A08601433N326510N594937N930392N618393N342698N794423N068512N567418
16725A52844716M579536L383817L655065K619262J659042J245774m3274n51579
16717A69392359j804540k744049l220097m102292m581961m892772n380980n375966
16709A37289702n992797n710243n853444n842403n426057n304120n744847m937412
$$ plain form
16765 24456907 25775359 26936964 27841319 29175850 30207752 31241863 32595139 33876346
16757 33876346 35316293 36971960 39026373 40519860 42129371 44159293 46254197 48235538
16749 48235538 50938160 53592554 56028124 58941951 61823261 64898246 68579362 71932584
16741 71932584 75798006 79763466 84104953 88501021 93133524 97856249 103072969 108601433
16733 108601433 113927943 119522880 125453272 131071665 136414363 142208786 147277298 152844716
16725 152844716 157424252 160808069 164463134 167082396 168741438 169987212 169943938 169392359
16717 169392359 167587819 164843770 161623673 157521381 152939420 148046648 142665668 137289702
16709 137289702 131296905 125586662 119733218 113890815 108464758 103160638 97415791 92478379
16701I2478379m394477m836116l883116m170320m105648l655284l434139l248903
16693F0750376k889844k851729k124916k803930k611339k116738j978341j715500
16685D1658039k034888j676630j777380j288445j529339j525447j598346r26501
16677B9301063j185032j138132n23608j418725r52161o01272o74337r90567p39018
16668B1078211q39983p31627o60549o61096p38504q6848r14637j01333o39891
16659A5703743p97218l19237l99845K3958o93370k40484m36012j16268q76348
16650A1848919k99103J02921l15478m44783l23204l78273j81966L63779r11031
16641I461781L16683n59214l55815j55334k02560j43337j06357j09745l07315
$$ plain form
16701 92478379 88083902 83247786 79364670 75194350 71088702 67433418 63999279 60750376
16693 60750376 57860532 55008803 52883887 50079957 47468618 45351880 43373539 41658039
16685 41658039 39623151 37946521 36169141 34880696 33351357 31825910 30227564 29301063
16677 29301063 28116031 26977899 26454291 25035566 24083405 23482133 22807796 21817229 21078211
16668 21078211 20238228 19506601 18846052 18184956 17446452 17359604 16444967 16343634 15703743
16659 15703743 14906525 14587288 14187443 14211401 13518031 13277547 12841535 12725267 11848919
16650 11848919 11549816 11652737 11337259 10892476 10569272 10190999 10009033 10372812 9461781
16641 9461781 9778464 9219250 8863435 8708101 8505541 8362204 8255847 8146102 7838787
16632G838787N8137n18981R0577n06831K80963k21649j27034k94754m57397J29648
16622F271466p8281l7296k81154j52895K65505m80503q1064Q1015k50736K0767
16612E276824j02090J01821j95166k11445m2313l46177J0322j11337n6619k36209
16602D087611M22373m02745K35157r3450l57658l2805K16005j31914l68641J88442
16592C762375K18799k88866j87557O3411K6360K22704n15644N13m1325j54639
16582C106131j275L35985n94809J77252o215o4205l47020P1938L83631j17476
16572B943937j43710P4401k43271J90577j24371j76107o694Q7647j06512l074
16562B492823K73362n07335j52265J9904K41956o6829k24561L84460l31035j52107
$$ plain form
16632 7838787 7896924 7377943 7468520 6961689 7242652 7021003 6893969 6599215 6141818 6271466
16622 6271466 6193185 6155889 5874735 5721840 5987345 5506842 5425778 5506793 5256057 5276824
16612 5276824 5174734 5276555 5081389 4869944 4827631 4481454 4491776 4380439 4323820 4087611
16602 4087611 4509984 4107239 4342396 4248946 3891288 3858483 4074488 3942574 3573933 3762375
16592 3762375 3981174 3692308 3504751 3568162 3594522 3817226 3301582 3302095 3260770 3106131
16582 3106131 3104856 3440841 2846032 3023284 3017069 2952864 2605844 2677782 3061413 2943937
16572 2943937 2800227 2874628 2631357 2821934 2697563 2521456 2514762 2602409 2495897 2492823
16562 2492823 2766185 2258850 2106585 2126489 2368445 2301616 2077055 2461515 2130480 1978373
16552A978373j06821K45627J63376j44538J17024l82721l3518J26920r6100J45781
16542B013403j27096k40209J37099K52128m05380K26678k03987K01401k54799
16533A599238j77973K29652K20991l62720J10262R9280P0944j18225o1348k81633
16523A328468J45698R9070M2038j55561j48294J93941j10413J46862k23071J73702
16513A492440l02317J35000N6698j09029K42609J16835j23351p7399k47885L49634
16503A533235l50875Q6759r2152J55936N947k38955o064J92447j45974J99506
16493A339810o2800k06491o2236L75731j96303K61590l63541k34080J89387J7283
16483A058350k00592R9073j60460N40131k02178N6918J66282l70089J09385K6280
$$ plain form
16552 1978373 1871552 2117179 2280555 2136017 2253041 1870320 1836802 1963722 1867622 2013403
16542 2013403 1886307 1646098 1783197 2035325 1629945 1856623 1652636 1854037 1599238
16533 1599238 1421265 1650917 1871908 1509188 1619450 1718730 1789674 1671449 1610101 1328468
16523 1328468 1474166 1573236 1615274 1459713 1311419 1505360 1394947 1541809 1318738 1492440
16513 1492440 1190123 1325123 1381821 1272792 1515401 1632236 1508885 1431486 1183601 1533235
16503 1533235 1182360 1269119 1176967 1332903 1338850 1099895 1093831 1286278 1140304 1339810
16493 1339810 1277010 1070519 1008283 1384014 1187711 1449301 1085760 851680 1041067 1058350
16483 1058350 857758 956831 796371 1336502 1134324 1191242 1357524 987435 1096820 1123100
16473A123100j27637M54036l10365k31491R4609n3252l21165L67206k11223J56461
16463I40279M5278k11369L0553K91642l18434k4285R9074L94579n35067L18697
16453A030947k45824K83936j2090j31295j26206J11696J6532J21927j63921q3316
16443H02386J28770l1030l17848N22318j63086j48212l62538J73853N5322P5934
16433G35869M4627L02449k17308l8689K17199D48232L25489j1628J03557l74258
16423D91392M44490l26750p1989J34513K73720l98701J4417M6462j83851N13271
16413I36974r3920j40289o8713r51O5720j3642C04335L40658J41889j32250n0717
16402F03915n0379N3385L1382j49884L22986r8629K3099r6570K85077j69069J4691
$$ plain form
16473 1123100 995463 1449499 1139134 907643 1002252 949000 627835 995041 783818 940279
16463 940279 985557 774188 804741 1096383 777949 753664 852738 1247317 712250 1030947
16453 1030947 785123 1069059 1056969 925674 799468 911164 927696 1049623 885702 802386
16443 802386 931156 900126 582278 1104596 941510 793298 430760 604613 659935 735869
16433 735869 780496 1082945 865637 826948 1044147 448232 773721 762093 865650 491392
16423 491392 935882 609132 537143 671656 945376 546675 561092 607554 423703 936974
16413 936974 843054 702765 634052 633101 698821 685179 304335 644993 786882 654632 603915
16402 603915 553536 606921 638303 488419 811405 712776 735875 639305 924382 755313 770004
16391G70004l19054M44742j20347m1695J13294j71667Q1762j42012j41251L54037
16381H27813l02343J14716k0335q004k17110m8403l3014L09432k82965J40119
16371D79906j30543J74285k15839J71951L01626l85365L07542k07345L38821l1828
16361H03211l67349J0981K60665k16834k9088K65045o556k51764p3241J64892
16351E59962p0175j64297r5411N84691A56273M35200J21099l38241K87858j05584
16341E56605k48083L60969A91828J90309J61122k38250j7266K7522J85975j58313
16331C42927j1871N32570B90290K81511j85498j15914M89860j77644k05948j2033
16321C64624m3342J06228j92020l0696Q0377j5735K3995J8367l8624M66731l00765
$$ plain form
16391 770004 450950 895692 775345 733650 846944 675277 757039 615027 473776 827813
16381 827813 525470 640186 619851 611847 394737 346334 313320 622752 339787 479906
16371 479906 349363 523648 307809 479760 781386 396021 703563 496218 835039 803211
16361 803211 435862 446843 707508 490674 461586 726631 720075 468311 395070 559962
16351 559962 489787 325490 230079 814770 156273 591473 712572 374331 662189 556605
16341 556605 308522 669491 191828 382137 543259 305009 287743 315265 501240 342927
16331 342927 331056 863626 290290 571801 386303 270389 760249 582605 376657 364624
16321 364624 321282 427510 235490 204794 285171 269436 293431 311798 273174 739905 439140
16310D39140j47525N12083B65511Q9567L21070j57176j94573M2172p7800J4586
16300C03357a16794D28861j59093J14414J76480R2953k10950J29579k09914r433
16290C52897j4760J07889j41327p5154K69334J08040k19807L7944B11864K23391
16280D35255j36423M9541J304j25503P6239J93354j84024j20783Q277r7466K72267
16269C72038j59773K87495k08959M1415q7599J69323K43533A86272M01692H6443
16258C25928p2136K33958B10539Q4474K39592k57010K35717B06077J94476I9504
16247E06734P938A67016M5381J76258E3505N4999M8745A8387R1477P2101a7643
16235h3904A7853M67575j73250j6880D8782R4415b0339A33518J06202M412P9088
$$ plain form
16310 439140 291615 803698 265511 355078 676148 518972 324399 366571 288771 303357
16300 303357 -116794 428861 269768 384182 560662 653615 442665 572244 362330 352897
16290 352897 338137 446026 304699 229545 498879 606919 387112 425056 211864 435255
16280 435255 298832 348373 349677 224174 300413 493767 309743 188960 197237 99771 372038
16269 372038 212265 499760 290801 332216 244617 413940 657473 186272 587964 86443
16258 325928 253792 487750 210539 295013 534605 277595 513312 206077 400553 99504
16247 506734 514672 167016 212397 388655 53505 108504 157249 18387 109864 181965 -17643
16235 -83904 17853 485428 312178 295298 48782 143197 -20339 133518 239720 244132 323220
16224C23220j0791K47746k33713i5258A81406J18060M4283A68043m2327K46897
16214C72613N0501j06003K7630j49045Q8367A00306O0550B0007L11594j48109
16204A83492L3634I8888C2956M39880p942j88477L6326m1891J04765J3501J10464
16193D99582j09440F5940N05115j09005b6807D16285D6413Q0747K19991A1795
16182C21578A05312J32703c46008D46264D7433P6492a9479B48371m9324k913a21161
16170E21429A94793L4536M7092o9355B7710j3058d15369E923Q8591l1380K91873
16159C55007A53373R900K7666A6039N1156M3661c9129B19536L5071j3840r3180
16148A47587M48402A8532J1966d0621A09523Q1038J23855A14028j5086h2148A39088
$$ plain form
16224 323220 312429 560175 326462 -95258 181406 299466 343749 168043 125716 372613
16214 372613 423114 317111 344741 195696 284063 100306 160856 20007 331601 183492
16204 183492 217126 98888 32956 472836 464894 276417 312743 270852 375617 389118 499582
16193 499582 390142 65940 571055 462050 -26807 416285 46413 127160 347151 11795
16182 321578 105312 238015 -346008 446264 47433 123925 -19479 248371 199047 196134 -121161
16170 521429 194793 229329 276421 207066 27710 14652 -415369 5923 94514 63134 355007
16159 355007 153373 163273 190939 16039 67195 110856 -39129 219536 254607 240767 147587
16148 147587 595989 18532 30498 -40621 109523 190561 314416 114028 98942 -82148 139088
16136A91322C6378J61712d3841B53162a61872H4070j0220b54534g5577B63099
16125a12314L2744A9006L4147Q2968a44854B0542L16063A49388b4146C82922j4704
16114C68218i5480H4030J7821B317L19739A22429J40339a91765L8043A10912i0361
16102A34921J50465k3689f572A3068M8206c2906G228M0111K88437j45640B5935
16090A26504B0693d16829G0832L443c09525D6624J4648a28246A06447K17354F0792
16078A24352M46008c0262l7038k0350A00810l5538J95453b23459A95067b14536
16067A84021a25053B93847j29551e6105j43404A33174B4262h2604j585A67122
16056H7626a49146B61034f5911A63855h8571I7802a81516C68072M1499i2361j19161
$$ plain form
16136 191322 36378 198090 -43841 253162 -161872 84070 73850 -254534 -75577 263099
16125 -112314 -79570 19006 53153 136121 -144854 20542 336605 149388 -24146 382922 368218
16114 368218 -95480 84030 101851 2317 322056 122429 262768 -191765 -153722 110912 -90361
16102 134921 285386 261697 -6572 13068 61274 -32906 7228 47339 335776 190136 25935
16090 126504 20693 -416829 70832 74275 -309525 46624 61272 -128246 106447 323801 60792
16078 124352 570360 -30262 -67300 -87650 100810 65272 260725 -223459 195067 -214536
16067 184021 -125053 293847 164296 -56105 -199509 133174 24262 -82604 -84189 167122
16056 87626 -149146 261034 -65911 163855 -88571 97802 -181516 368072 409571 -92361 -211522
16045b11522m4103L1639F1081k7814J48036G6806c25641a47262A10287J11656
16035B21943e9533B11422b35002a05652j61660B60090c30814c1151A77373K3863
16025B01236M9462b58536D7468J08536D7513K47392H3025k2172B0722b28880D56917
16013A53730a22461j97285C9005Q7370m5551a02386A09882K32668a53866H8052
16002B68823A6102J65176o9201b2373H0273F138M9574J00842G4286B515J17940
15991A20455i7243D97380p9936f2410F3790a49937A53147N27493a19452A8848
15980G9312f0577B8592K7436a90116C0916L9800a7740j54687E0722A9518K27075
15969B46593c15854a4294I4379L13116F6301n778R6570K49260j68009b53372B065
$$ plain form
16045 -211522 -255625 -223986 61081 33267 181303 76806 -325641 -147262 110287 221943
16035 221943 -59533 211422 -235002 -105652 -267312 260090 -330814 -31151 177373 201236
16025 201236 250698 -258536 47468 156004 47513 294905 83025 60853 20722 -228880 456917
16013 153730 -122461 -319746 39005 126375 80824 -102386 109882 342550 -153866 88052
16002 268823 16102 181278 112077 -22373 80273 6138 55712 156554 74286 2515 120455
15991 120455 -97243 497380 417444 -62410 63790 -149937 153147 680640 -119452 18848
15980 79312 -60577 28592 56028 -190116 30916 70716 -17740 -172427 50722 19518 246593
15969 246593 -315854 -14294 94379 407495 66301 60523 157093 406353 238344 -253372 2065
15957i6039A1561a71569G9808a3000j51998A0475a28832j8763n7371A035P508
15946H543b22969h3078c9415K916B38235i6359B00976J21195G7658J07421f2987
15934C0967a59969e2002B98615A45087E3586d3796G3528A6261b92364A93159d9697
15922C850d44480g3338C8449a41669A92638b6814l7509B12824b39137J17443G2865
15910A65376N4234b47626A24645b53A03506m2748B0896K43573b41859C67957d5855
15898a24746D0997a4322j19488F0880i7396m8864D1809a63552C85685a48548A63386
15886D85914A7708b31725h0636L0199F1136B163g8373A50891L8046J02660C525
15874F0158a08645A86910a13193j82200E2464N2308a20178B63098a5215H8490
$$ plain form
15957 -96039 11561 -171569 79808 -13000 -164998 10475 -128832 -147595 -204966 1035 8543
15946 8543 -222969 -83078 -39415 -36499 238235 -96359 200976 322171 77658 185079 -62987
15934 30967 -159969 -52002 298615 145087 53586 -43796 73528 16261 -292364 193159 -49697
15922 3850 -444480 -73338 38449 -141669 192638 -26814 -64323 212824 -239137 -121694 72865
15910 165376 219610 -247626 124645 -253 103506 60758 20896 264469 -241859 367957 -45855
15898 -124746 40997 -14322 -133810 60880 -97396 -146260 41809 -163552 385685 -148548 163386
15886 485914 17708 -231725 -80636 -50437 61136 2163 -78373 150891 188937 291597 3525
15874 60158 -108645 186910 -113193 -295393 52464 104772 -120178 263098 -15215 88490
15863b94148a1917o0107o8467A26018m7562K15807b35709P8686c5906J5829l8597
15852e8674C7670h2733j75647f7908G8565a93267A87469B4561a20187i261A82010
15840D4422L3512d41220f7827j74700k02322H1585d1715E6105R3544l0893A990
15828A27288b14325A57670B1357a72908E048n67P4635B79a35727e7697j8557B11345
15815a44965A8606c00153g636I5162a69838A22209L8893J35771a49287A26188
15804c00169E4335O7870d20843A84370D2160a71837A86f5382A2737L0485J75745
15793B18967a53229f0715J6295j50028k59002C80018a93696b4749k47655j1984
15783b84388N119B48117a82544A72255a50088q3196Q8446G6478K8581B6434b91090
$$ plain form
15863 -294148 -11917 -72024 -140491 126018 78456 294263 -235709 -157023 -35906 -20077 -58674
15852 -58674 37670 -82733 -258380 -67908 78565 -193267 187469 24561 -120187 -9261 182010
15840 44422 77934 -441220 -67827 -242527 -444849 81585 -41715 56105 149649 118756 1990
15828 127288 -214325 157670 21357 -172908 5048 4481 79116 279 -135727 -57697 -76254 211345
15815 -144965 18606 -300153 -7636 95162 -169838 122209 161102 296873 -149287 126188
15804 -300169 54335 122205 -420843 184370 42160 -171837 186 -65382 12737 43222 218967
15793 218967 -153229 -60715 -44420 -194448 -453450 380018 -193696 -24749 -272404 -284388
15783 -284388 -279269 248117 -182544 172255 -150088 -233284 -144838 76478 105059 26434 -291090
15771i2967B73610A35696a091k8476A75727n6819i7186K0807j18061c288A84249
15759G4919H343d1698k67530F0220j7515g9360D3103c9906l67246F6927C0261
15747a26252A10984B3028L08189h7734B71503e9335j9120o9902f3718j31492J433
15736a93777i2391A63836b05075B13354a19207I6246e1120b3416D7162c86341
15725A9522N7536a88954h318C01331a29340o2533G4943O3893b04287A3221P689
15714B0910J10272b43688A5994J1433J8784F988c38322D8862b57357d2925l12037
15703c54962n1609i1927c9994A23365a21818A10749b00407M1028L8082G5913h2189
15691f6131B5204m430K57648e6870H4469I647L05287b02766l368C8700J75789
$$ plain form
15771 -92967 273610 135696 -1091 -29567 175727 118908 -97186 -76379 -194440 -3288 184249
15759 74919 8343 -41698 -309228 60220 42705 -79360 43103 -39906 -407152 66927 30261
15747 -126252 110984 23028 331217 -87734 271503 -59335 -78455 -148357 -63718 -195210 -193777
15736 -193777 -92391 163836 -205075 213354 -119207 96246 -51120 -23416 47162 -386341
15725 19522 77058 -188954 -8318 301331 -129340 -191873 74943 138836 -204287 13221 20910
15714 20910 131182 -243688 15994 27427 46211 6988 -338322 48862 -257357 -42925 -354962
15703 -354962 -406571 -91927 -39994 123365 -121818 110749 -200407 -159379 -121297 75913 -82189
15691 -66131 25204 20774 278422 -56870 84469 9647 314934 -202766 -206134 38700 214489
15680B14489J5255a75298b119C1948m996K09436r0778a55791A57713a39362B31568
15668B7488K2045i0180p5929B52477h7153c8669B25422c98913h1165K9005j43157
15657a95317k0362g0544J7066B66474A07475b26684Q1512j7273m617k1777Q5028
15646a03811A36760c09316Q6145R7554E1541a25047b8086B06207c7375j52902
15636a90277A00083i6985q7354A33837O3754a02094n5615c723A5191a94173E7097
15624a37984A59389f9438A96521I2623J26741K256l2867i7538B17931a84048J7395
15613a66653B50855A09166i3600E9411a70034k6661d3647j9825A03359h2695J4213
15602f8482m4056j17963l8533P5340j42636A33790a94919B89569b9514m49008
$$ plain form
15680 214489 229744 -175298 -2119 31948 26952 236388 145610 -155791 157713 -139362 231568
15668 27488 49533 -90180 -166109 252477 -87153 -38669 225422 -398913 -81165 -52160 -195317
15657 -195317 -215679 -70544 -53478 266474 107475 -226684 -145172 -162445 -167062 -188839 -103811
15646 -103811 136760 -309316 -223171 -125617 51541 -125047 -28086 206207 -37375 -190277
15636 -190277 100083 -96985 -184339 133837 197591 -102094 -157709 -3723 15191 -194173 57097
15624 -137984 159389 -69438 196521 92623 219364 221620 188753 -97538 217931 -184048 -166653
15613 -166653 250855 109166 -93600 59411 -170034 -196695 -43647 -63472 103359 -82695 -68482
15602 -68482 -112538 -230501 -269034 -193694 -336330 133790 -194919 289569 -29514 -478522
15592d78522a92843c0293G7346B5742G03b58320P3592A00668l2858Q7815h8347
15580C4022K04521a25718o1025A22010i9713n830j4838A19771a85626f4910A3569
15568H795f57768a85950h1040J0182K2796D5101L09733B0867O3074f7364Q053
15557e9311o6866p1795A24842m575B5793O957P152a69513B58773c7817m67535
15546e05352B39308j5528a31287c8633C3914a12484c2535G7156A7123N0175c7878
15534b36901J03798g055I9100A5236J20645e3015l7069c2176C5198a14838A65518
15522b91504B0779b85002B59394b43014J18562A69955a63770D50634c8592j18545
15512a57137B2239J01162k5129b73408Q2577J8165l8394J5619B01235E6823c2619
$$ plain form
15592 -478522 -192843 -30293 77346 25742 703 -258320 -184728 100668 67810 155625 -88347
15580 34022 238543 -125718 -186743 122010 -99713 -105543 -120381 119771 -185626 -64910 13569
15568 8795 -657768 -185950 -81040 -70858 -48062 45101 354834 20867 83941 -67364 -59311
15557 -59311 -126177 -197972 124842 120267 25793 32750 39902 -169513 258773 -37817 -505352
15546 -505352 239308 223780 -131287 -38633 33914 -112484 -32535 77156 17123 67298 -37878
15534 -236901 -133103 -7055 99100 15236 135881 -53015 -90084 -32176 35198 -114838 165518
15522 -291504 20779 -285002 259394 -243014 -124452 169955 -163770 450634 -38592 -157137
15512 -157137 22239 123401 98272 -273408 -190831 -172666 -211060 -195441 201235 56823 -32619
15500A73198K9350J21949f0456n2344I254O7155b17294A72645e5386j66854C9755
15488b89917B54992h7200A58331D5867b95477I4102R6420A264L632b00484N6418
15477a44066B21358B7138a12594N1750A2700e195m0937j69679P0400D39967i6002
15465a91093P0346C78688A58887m1612J4040a8578n1364B1252F105J74846m1068
15454A39883P4053p6137J56065i5394j49227M6936R1007K4767A10530B8884b10289
15442a38347j30183H133b96507e1925A5345l062c7924A78899J43960j23330a85506
15430H1159A2970J24477m3859a10711m7062D63660I4206J10382A6295e6108F1646
15418H44K48685j20584a34764B7224J56904b47795B26691c12215d5831B55413
$$ plain form
15500 173198 202548 324497 -60456 -112800 9254 76409 -217294 172645 -55386 -222240 39755
15488 -289917 254992 -87200 158331 45867 -295477 94102 190522 1264 4896 -200484 -144066
15477 -144066 221358 27138 -112594 -60844 12700 -5195 -46132 -215811 -145411 439967 -96002
15465 -191093 -120747 378688 158887 117275 131315 -18578 -69942 21252 6105 180951 139883
15454 139883 213936 137799 293864 -95394 -244621 -197685 -106678 -81911 110530 28884 -210289
15442 -138347 -268530 8133 -296507 -51925 15345 12283 -37924 178899 322859 199529 -185506
15430 81159 12970 137447 93588 -110711 -157773 463660 94206 204588 16295 -56108 61646
15418 844 249529 128945 -134764 27224 184128 -247795 226691 -312215 -45831 255413
15407B09485H0039a17051d3776E5507K32025n1843b29511e6043l0118A18503L3903
15396A52406A1708e2906k08698A50077N8907c9486j54384i0766r2402C6264j5325
15385B0939J34627D5259e186n3112j94014a6622k5812k5413j19205d2618A24823
15373c15685a43561M8534Q344Q768l0298m1601f0079A2988g6539A46194b33960
15361A57334a94413R3788B46668A07448d686A36412b57794C7590K44921A21490
15350A92313a59709D3612J67868B7767a44246G6604k207A3101a898j66551e6718
15338g0067A2789a76989L7660H2518a30267O2796A71228p6316a41047D3874J76848
15327B20722K9123g7765A49765N6057o2939f3519k2303j48600i0341J6984k32041
$$ plain form
15407 209485 80039 -117051 -43776 55507 287532 235689 -229511 -56043 -86161 118503 152406
15396 152406 11708 -52906 -261604 150077 208984 -39486 -193870 -90766 -183168 36264 20939
15385 20939 155566 45259 -5186 -58298 -252312 -16622 -42434 -67847 -187052 -42618 124823
15373 -315685 -143561 -95027 -86683 -77915 -108213 -149814 -60079 12988 -76539 146194 -233960
15361 157334 -194413 -100625 246668 107448 -4686 136412 -257794 37590 282511 121490
15350 192313 -159709 43612 211480 27767 -144246 76604 74397 13101 -1898 -168449 -56718
15338 -70067 12789 -176989 -139329 82518 -130267 -67471 171228 94912 -141047 43874 220722
15327 220722 249845 -77765 149765 205822 142883 -63519 -85822 -234422 -90341 -73357 -305398
15316c05398O1093B36015p9881a02686G7645H523K31952A9707I101K39001a22997
15304A47499A1226E483b15912D5045N7291J54183j19780k5271Q8182i6034H1675
15292i9349M7621a0154B21243C237R1937J0427J70681J22946q8479b1930H1117
15280E3784f166K636q3402C54756G0420K66513o2187C9990e8536F1304e7581A13381
15267g0613j74189A22082i0653A38050K29969F5210b36600I5813a87711I0549
15256a02412b0897j37939B82439q5792E8169J65946J62325P76184M97702o14196
15246A046130K75791n71647C14310D3953d8727C22094r2512b01225A07685b23070
15235b22676A61107F5952L60989A05150B5263O6826B642f8403e946j01812F8010
$$ plain form
15316 -305398 -244305 236015 156134 -102686 77645 8523 240475 19707 9101 248102 -122997
15304 147499 11226 5483 -215912 45045 102336 256519 136739 111468 199650 -96034 81675
15292 -99349 -51728 -10154 221243 3237 95174 105601 276282 399228 310749 -21930 81117
15280 53784 -6166 -3530 -86932 354756 70420 336933 274746 39990 -58536 61304 -57581 113381
15267 -70613 -244802 122082 -90653 138050 368019 65210 -236600 95813 -187711 90549
15256 -102412 -20897 -158836 282439 196647 58169 224115 386440 1162624 1660326 1046130
15246 1046130 1321921 750274 314310 43953 -48727 322094 229582 -201225 107685 -223070
15235 -222676 161107 65952 426941 105150 25263 92089 2642 -68403 -5946 -107758 68010
15223B20347L7878A02732J9834a11206H4464J8760J11837K5923j6195h2650c2556
15211h6291B68177h2597R906A97304o6838O479B17L07724A01777J07255M6210
15200B55242a22521A25677D3260K69341j23175a89965B49240o783b45716I7872
15189A20163L43638j83333j14297E9491R0395d4551E0739B1466O4922N3561Q1552
15178B21501d38014A47504a44481A12041J03455i7173E7983j4949K05605P1460
15168C20099b63200C78153j12588J32956j36509D6255J23908J73713j34680J45860
15158C55056d06859i2446A50691K44219E2337A4338L09904A1165a08367A72844
15147C53564M8945C4754M5953O9713E1574K45052D6155c028A47734i2292B33231
$$ plain form
15223 220347 258225 102732 122566 -111206 84464 103224 215061 240984 224789 -82650 -32556
15211 -86291 268177 -82597 -72691 197304 130466 136945 217 307941 101777 209032 255242
15200 255242 -122521 125677 43260 312601 189426 -189965 249240 242457 -245716 97872
15189 120163 463801 280468 166171 59491 149886 -44551 50739 21466 86388 139949 221501
15178 221501 -438014 147504 -144481 112041 215496 -97173 57983 43034 248639 320099
15168 320099 -263200 378153 265565 398521 262012 46255 170163 343876 209196 355056
15158 355056 -406859 -92446 150691 394910 52337 14338 324242 11165 -108367 172844
15147 353564 402509 34754 80707 150420 51574 296626 46155 -3028 147734 -92292 233231
15135C1049a30514C21764o6209b04257C7443O6223N3555m0955E5695A4967b3733
15123a22115b7937C89513d0333B32163m4346l2999R5905a58302D00940j96055
15113B04885j6670a35664J0387A01573K52415A05676C5258J94361D7778Q6804
15103A34582D7814K53183H5637b49j12829B8320L35142H7655a03198B36523G7377
15091b35430A51685C3773K93036o8427Q1885A62815j2105R1593a08752A96270
15080A06176J15912J61924j26550J05220J5829A68049E3440K27190K58503A77148
15069b25761h3141H1276Q0322f4584B99893F7119e4226A09432g5996B7468b80418
15057A99593j3827a96604B94281O5469P6960q4561c3788B01512f2254C41439a60992
$$ plain form
15135 31049 -130514 321764 255555 -204257 37443 103666 157221 116266 55695 14967 -23733
15123 -122115 -27937 389513 -40333 232163 187817 154818 250723 -158302 400940 204885
15113 204885 188215 -135664 -125277 101573 353988 105676 35258 229619 47778 134582
15103 134582 47814 300997 85637 -249 -113078 28320 363462 87655 -103198 236523 77377
15091 -235430 151685 33773 326809 258382 340267 162815 150710 242303 -108752 196270
15080 106176 222088 384012 257462 362682 378511 168049 53440 280630 539133 177148
15069 -225761 -83141 81276 161598 -64584 299893 67119 -54226 109432 -75996 27468 -280418
15057 199593 185766 -196604 294281 359750 436710 352149 -33788 201512 -62254 341439 -160992
15045A01297J38086J30931E1610a0658A22850J74425F8670K91035I0214i7979
15034E96145k48259a1955L514I358O9522j6803J56577N1599b7644A99000j8065
15023A80935b8457n6103I6009B9202J72862L9775N3129p3029A10470K00661J36299
15012D47430A80752J0561A1831L30449j32576a58156g825D74848A46195g4269
15001A85037o7250K95591G9063L4447b90B37145q3419J60913j05935F4654J46738
14990B11392Q9956n1105P4443J09138N7314B23800J41137A29400J44037j18091
14980A55346C7430c3644R853C45617E6643L91340A90346a9751E7828M94433A49288
14968C69292A01568N8739K27813b0555E7616K34732J0621j29972j9528F5139K36767
$$ plain form
15045 101297 239383 370314 51610 -10658 122850 297275 68670 359705 90214 -97979
15034 596145 347886 -11955 -8441 9358 78880 62077 218654 270253 -27644 199000 180935
15023 180935 -28457 -84560 96009 29202 202064 241839 294968 221939 110470 311131 447430
15012 447430 180752 191313 11831 342280 209704 -158156 -7825 474848 146195 -74269
15001 185037 117787 413378 79063 113510 -290 237145 153726 314639 208704 64654 211392
14990 211392 301348 250243 324686 433824 491138 223800 364937 129400 273437 155346
14980 155346 37430 -33644 -23791 345617 56643 447983 190346 -19751 57828 552261 149288
14968 369292 101568 160307 388120 -20555 57616 292348 302969 172997 153469 65139 301906
14957C01906g5042B69083j8379P5733j3086D2072K73809A08917K46515i136j95829
14946b04965a8425B43371J52780j51322K8256q8920c5129C75552J6486c2003D12873
14934f23H09742g4391B46082r7479g8192C49891K69913B31158L04888A95861K58269
14923D54130A31615j3008Q1074J12078E76K5416O69020E2100M39599j87707A14332
14911A53936R0688m054J80801A23606O2148L5118l2473L03933A94278k3936L90460
14900E60802B46946L79542E7249Q2567K46362J2503p8732J15757j75645j19542
14890A40519K15920M9457q2524K01807m2736k11293K66784K359j36226n4944R1569
14879D40692i6273D78720q7324q3477k5480J25798j63219R6313J03121K66541
$$ plain form
14957 301906 -75042 269083 250704 326437 313351 42072 315881 108917 355432 -9136 -204965
14946 -204965 -18425 243371 396151 244829 273085 184165 -35129 375552 392038 -32003 412873
14934 -623 809742 -74391 246082 148603 -78192 349891 619804 231158 536046 195861 454130
14923 454130 131615 118607 199681 311759 576 25992 695012 52100 491699 303992 114332
14911 153936 244624 240570 421371 123606 185754 220872 188399 492332 194278 170342 560802
14900 560802 246946 626488 57249 139816 386178 398681 319949 435706 260061 140519
14890 140519 356439 405896 323372 525179 482443 271150 537934 540293 404067 349123 440692
14879 440692 -96273 478720 391396 307919 282439 408237 245018 341331 444452 710993
14869G10993j94072N1958n6093J24812k60828m2901N83224m41178j69228O297
14859C12984J18335J78544k78747J26225k6417M3392k5457j74349J01508P3168
14849D49186j58312P2284M3827k6173j58738G7483N44845j49796A17593M32145
14839E49738B62328K7066J98537O1440A38435L41438J70681k51072q8201J91025
14829E02306r0324J1500A45087M25556A83516L27379O0916J41055k01390L6391
14819E47867J5658N2889j71690o8755j65079M98388L2616j53335B04403K89949
14809D94352J01208n9871r6875K20548k5342j70535R9653k00776J77873K00657
14799G40892l22367N5604M48444I3223N40381k98544J65995j08785K00564j82468
$$ plain form
14869 710993 516921 568879 512786 637598 376770 333869 917093 475915 306687 312984
14859 312984 431319 609863 331116 457341 430924 474316 448859 274510 376018 449186
14849 449186 290874 363158 406985 380812 222074 77483 622328 472532 117593 549738
14839 549738 262328 289394 487931 549371 138435 479873 650554 399482 311281 502306
14829 502306 411982 423482 145087 570643 183516 510895 571811 712866 511476 547867
14819 547867 563525 616414 444724 375969 210890 709278 741894 588559 204403 494352
14809 494352 595560 535689 438814 659362 634020 463485 563138 362362 540235 740892
14799 740892 418525 474129 922573 93223 633604 335060 501055 392270 592834 410366
14789D10366J65920J42808p0664n4965k2244j18281R4247q8711A35723J37536
14779B73259L47736j46821J72030k19269M44690l48596j54396J59670k34530M66200
14769G59973K74036A82146Q11633m37891K7621K67194r7293L6727l67020J39226
14759E62343q9528K56267B88492M45095j0569L34312l82008k63428K00384J63085
14749G75363k48670r5112N85738m52726j0770M10997l54644B12502L41886J31156
14739F85544k07633J65792k15776M40751k33496j8574N0803o1511K56566o6049
14729G96417m3241M3103k08728K76461j17009k57068L55149q6273J85106j01925
14719H41992P2026M8357l55076n9000P6324K53313l12967J62288j85775M2531
$$ plain form
14789 410366 576286 719094 648430 593465 571221 452940 547187 458476 135723 273259
14779 273259 620995 474174 646204 426935 871625 523029 368633 528303 293773 759973
14769 759973 1034009 182146 993779 555888 583509 850703 753410 790137 423117 562343
14759 562343 472815 729082 288492 733587 723018 1057330 675322 411894 612278 775363
14749 775363 526693 431581 1017319 564593 553823 964820 610176 212502 554388 685544
14739 685544 477911 643703 427927 868678 635182 616608 667411 605900 862466 796417
14729 796417 753176 796279 587551 864012 747003 489935 845084 758811 943917 841992
14719 841992 914018 962375 607299 548299 624623 877936 564969 727257 541482 584013
14709E84013K02674k18518J74780q7906L31844J55551j13325l94560K81245M157
14699I19955k5112K6903k77736L08866j64051J85049j32555J1295r80J50363J34895
14688A136892j37750K41742k47225J52016m25480M30928k46665P0757k62550L34793
14678A047458j79553K94716l492j34322j2752K76820k19195J07605m26366J71120
14668I22039J05711J32199l8770k03185K61036k60024J40707k30112M5939L19769
14658A195309r566j98348M8671L6107o5677J01378J09469J61051l76320K41672
14648A243746K563j57491K92663k11153K69731j38795L7146K55347j93243j62214
14638A238300L4173p3952j65428L06297j69147K03602k26617J79768m48694M76648
$$ plain form
14709 584013 786687 568169 742949 655043 986887 1142438 1029113 634553 915798 919955
14699 919955 894843 921746 644010 952876 788825 973874 841319 852614 851634 1001997 1136892
14688 1136892 999142 1240884 993659 1145675 720195 1151123 904458 975215 712665 1047458
14678 1047458 867905 1162621 1159129 1024807 1012055 1288875 1069680 1177285 750919 922039
14668 922039 1027750 1159949 1121179 917994 1179030 919006 1059713 829601 875540 1195309
14658 1195309 1185743 987395 1036066 1072173 1006496 1107874 1217343 1378394 1002074 1243746
14648 1243746 1246309 1088818 1381481 1170328 1440059 1301264 1338410 1593757 1400514 1238300
14638 1238300 1272473 1198521 1033093 1339390 1170243 1373845 1147228 1326996 878302 1354950
14628A354950Q6702k12789J03227O1892j42651l1529o1643J60558J67287k42792
14618A243212L40560j73808j09186n2951o7190L00600L0314l44364K11067j36632
14608A241622L60365L5123k95700j64729L89674K03663k49642K16055k78886P4635
14598A532180j35981M47600j93290O8805j05944J89495q4993O6276m67642O70419
14588A986925O6944j27112q5696K4673j21295k7858O7020O0267P6406p6491L22828
14577B166611j94988p2175J14486j60161M94830n44971J83078K51676k03478M18076
14567B452984m4295n2234J49790M5743K39383j22139Q0484O1549j81041J71975
14557B802199N2559N65851n37822N01096K93709M06817R56063Q40340J887079
$$ plain form
14628 1354950 1441652 1228863 1332090 1393982 1251331 1219802 1158159 1318717 1486004 1243212
14618 1243212 1583772 1409964 1300778 1247827 1180637 1481237 1511551 1167187 1378254 1241622
14608 1241622 1601987 1637110 1341410 1176681 1566355 1770018 1520376 1736431 1457545 1532180
14598 1532180 1396199 1843799 1650509 1719314 1613370 1802865 1717872 1784148 1316506 1986925
14588 1986925 2053869 1926757 1841061 1865734 1744439 1716581 1783601 1843868 1920274 1843783 2166611
14577 2166611 1971623 1899448 2013934 1853773 2348603 1803632 1986710 2238386 2034908 2452984
14567 2452984 2408689 2356455 2506245 2551988 2791371 2669232 2749716 2811265 2630224 2802199
14557 2802199 2854758 3420609 2882787 3383883 3677592 4084409 5040472 5880812 7767891
14548G767891M283444J0774567K0023588k172495A9166219H203543D028957j089346
14540B939611n83273j17511k56327j7677J39452j17177R9428j27445j65J81098
14530B140014k25243N00970l81397J89798k8469k48188K03079L63381L7871m73116
14520B078700P80123l59986j47598j58217L53885j03518L41730j23405k6150J17508
14510B753072J57504j0168J58272L2164j65247j23554j3241L82135l62901M57796
14500C265832l47162R8884K57325L2854j41987L62263o7781j07262j45417k8045
14490C179504Q0186K97162K8233J6431j59558R8530J73862j23844O185K87196
14480C883887l7008J79328j66403r430J85672m965J94202N634j14853q9608M04649
$$ plain form
14548 7767891 12051335 22825902 42849490 40676995 19166219 8203543 4028957 2939611
14540 2939611 2356338 2238827 1982500 1964823 2104275 1987098 2086526 1959081 1958916 2140014
14530 2140014 1914771 2415741 2034344 2224142 2195673 1947485 2150564 2513945 2551816 2078700
14520 2078700 2858823 2498837 2351239 2193022 2546907 2443389 2785119 2661714 2635564 2753072
14510 2753072 2910576 2900408 3058680 3090844 2925597 2802043 2788802 3170937 2808036 3265832
14500 3265832 2918670 3017554 3274879 3307733 3165746 3528009 3460228 3352966 3207549 3179504
14490 3179504 3259690 3556852 3585085 3601516 3441958 3540488 3714350 3590506 3596691 3883887
14480 3883887 3846879 4026207 3859804 3850374 4036046 4031081 4225283 4230917 4116064 4026456 4431105
14469D431105J5783P7905j26547Q0605J51366n9810N3052p3749J05264J18237
14459D773211J10455j65941J67327K5709J23050L22227k47532N8252L6115J8156
14449E221029J24794J93469j28890J95161j38019K14374N2743K93639K85975l80172
14439E934103M35024j83118j2201N5507J08012M03023l28117L20349k15604L73116
14429F890094k48468L21912j47497N80079k42522J67127M00664J894n61344O72673
14419G834612j93208J07777K68545L94797j97144J11586M28148q0405J89397l9182
14409H824923J64955L00247p614L1292P0053M17238l1985l3911M67761J38310
14399A0341269Q2606L46986O2051J78771N23714m13036L79265N28472j95291L62032
$$ plain form
14469 4431105 4446888 4524793 4398246 4478851 4630217 4570407 4623459 4549710 4654974 4773211
14459 4773211 4883666 4717725 4885052 4910761 5033811 5356038 5108506 5166758 5202873 5221029
14449 5221029 5345823 5539292 5410402 5605563 5467544 5681918 5734661 6028300 6314275 5934103
14439 5934103 6369127 6186009 6173808 6229315 6337327 6740350 6412233 6732582 6516978 6890094
14429 6890094 6641626 6963538 6816041 7396120 7153598 7320725 7721389 7723283 7161939 7834612
14419 7834612 7641404 7749181 8017726 8412523 8215379 8326965 8755113 8674708 8864105 8824923
14409 8824923 8989878 9290125 9282511 9313803 9383856 9801094 9769109 9735198 10202959 10341269
14399 10341269 10423875 10770861 10832912 11011683 11535397 11122361 11501626 12030098 11834807 12196839
14389A2196839K17318o3305O37303K02507m9595K89072L29791K14876J41119K82691
14379A4398616O35253J8339K29748J87137K03620P12158j17046M73486N29569
14370A7270880J63195J5187Q03010K57590L81468L33335M84876M30654M11596
14361B0551791M54300N14457M36736O32938K36801O23604O44074N28443L95982
14352B5019126J010979L78808P86282O35888Q36278R80121R8993R47699J079068
14343C1773242O11190J074562L40633J212106R03245R80098Q17489J482060J402975
14334D0597600P46353J675899J238255J183523J433539J890963J497723J516844
14326E1780699J766233K046508J714786J782851K172900K093252K659585K217566
$$ plain form
14389 12196839 12414157 12350852 12988155 13190662 13141067 13430139 13759930 13974806 14115925 14398616
14379 14398616 15033869 15052208 15281956 15469093 15672713 16384871 16267825 16741311 17270880
14370 17270880 17434075 17449262 18252272 18509862 18891330 19224665 19709541 20140195 20551791
14361 20551791 21006091 21520548 21957284 22590222 22827023 23450627 24094701 24623144 25019126
14352 25019126 26030105 26408913 27195195 27831083 28667361 29647482 29746475 30694174 31773242
14343 31773242 32384432 33458994 33799627 35011733 35914978 36895076 37712565 39194625 40597600
14334 40597600 41343953 43019852 44258107 45441630 46875169 48766132 50263855 51780699
14326 51780699 53546932 55593440 57308226 59091077 61263977 63357229 66016814 68234380
14318F8234380K725807K499796L311724K559246K997895L229840L941536L617415
14310I3117639L816688L723630M468112M792862M878515M883385N291387N885646
14302A30857864O010666O467721P166168P098894P749756P930881Q885949Q989372
14294A91157271R844890J0318437J0614497J1278410J1798839J2646854J3373390
14287B71032588J3037233J4260453J4282767J5040814J4938290J5291959J5094811
14280C72978915J4809404J4581919J4317602J2717001J2223260R994840Q589887
14273D60212828M939364J085117o66568k268154l189616l920078m285890o810795
14265D45096208r473097j2024547j3854667j5069343j5666965j6029809j6340050
$$ plain form
14318 68234380 70960187 73459983 76771707 79330953 82328848 85558688 89500224 93117639
14310 93117639 96934327 100657957 105126069 109918931 114797446 119680831 124972218 130857864
14302 130857864 136868530 143336251 150502419 157601313 165351069 173281950 182167899 191157271
14294 191157271 201002161 211320598 221935095 233213505 245012344 257659198 271032588
14287 271032588 284069821 298330274 312613041 327653855 342592145 357884104 372978915
14280 372978915 387788319 402370238 416687840 429404841 441628101 451622941 460212828
14273 460212828 465152192 466237309 465570741 463302587 460112971 456192893 451907003 445096208
14265 445096208 435623111 423598564 409743897 394674554 379007589 362977780 346637730
14258C46637730j6355962j5858745j4803770j4297674j4516409j3566497j3503185
14251B43735488j2347336j1852438j0862694j0310187j0234874r653075q284573
14244A70190311q019353p624987p885944o785548o290827o174623n435385m963081
14236A17010563n511900m637663m775738m130229m019144k840371l811851l538303
14228H3745364l752111l075763k688446k579591k496923k786685j952898k518281
14220F1894666k066759k153386k035456j486409j748883j832000j293695j076902
14212D8201176j569704j836024j220684j229981j140088l01384j321907j424623
14204C8156781j182091p76761r72118q77927p45954r77191j249939p57162n71642
$$ plain form
14258 346637730 330281768 314423023 299619253 285321579 270805170 257238673 243735488
14251 243735488 231388152 219535714 208673020 198362833 188127959 178474884 170190311
14244 170190311 162170958 154545971 146660027 139874479 133583652 127409029 121973644 117010563
14236 117010563 111498663 106861000 102085262 97955033 93935889 91095518 87283667 83745364
14228 83745364 79993253 76917490 74229044 71649453 69152530 66365845 64412947 61894666
14220 61894666 59827907 57674521 55639065 54152656 52403773 50571773 49278078 48201176
14212 48201176 46631472 44795448 43574764 42344783 41204695 40903311 39581404 38156781
14204 38156781 36974690 36197929 35225811 34347884 33601930 32624739 31374800 30617638 30045996
14195C0045996j059647m10475p61899p39288o79023m83552m03028q43404q46867
14186B3818813k14776o95732m69967o3084n16526r12241l29886m20298k84398
14177A9911905o74249m69387o11360k49088o0784n47686P1833p45505j09174m81380
14167A6035125j03934p29521k75830L21677o98979K8413j67930j76821q43904
14158A3388296K12620l87296j15519j7926o45075J12215m51370k96737J58058
14149A1957266o50559J32748j61263l02429K2492j98436l7070l12291l8085m71261
14139I941112n533l03073J67209k82124j42724p0468k21495j42120k76205P1929
14129H736508q1172k73813l81375j189k28903K02595m15088K06731K6295j8429
$$ plain form
14195 30045996 28986349 28575874 27813975 27074687 26395664 25912112 25509084 24665680 23818813
14186 23818813 23604037 22908305 22438338 22375254 21858728 20946487 20616601 20196303 19911905
14177 19911905 19237656 18768269 18156909 17907821 17847037 17299351 17371184 16625679 16516505 16035125
14167 16035125 15931191 15201670 14925840 15247517 14548538 14576951 14409021 14232200 13388296
14158 13388296 13600916 13213620 13098101 13080175 12435100 12547315 12095945 11799208 11957266
14149 11957266 11306707 11439455 11278192 10975763 10998255 10799819 10762749 10450458 10412373 9941112
14139 9941112 9935579 9632506 9799715 9517591 9374867 9304399 9082904 8940784 8664579 8736508
14129 8736508 8655336 8381523 8000148 7998959 7770056 7972651 7557563 7764294 7790589 7772160
14119G772160j20756m46126O4692l25054L3143J05827l75566j65032K98427l82090
14109F459625L08116k77366k52208k15299K78619n53952L67097j02924o2660k14022
14099E735026q5741n3821j08142L4392j43786J54116j20558j20412p0439p8867
14089E141768k55747l1384M4840r5626k9565J10715R8492J37909m84488J71168
14079D808082k05536O1622m12522L57630k69985L8499m0134k37837o5852Q6487
14069D120454p663j76445J17981J39766l36187K27440m03914J23582o2716J06325
14059C848623O1025p7345k97197J04593j62529k2710o6722R7240R5170l82036
14049C198112R7669n7670J36384q4552J27766k95804J8137j82474j30704J90116
$$ plain form
14119 7772160 7651404 7205278 7269970 6944916 6978059 7083886 6708320 6543288 6841715 6459625
14109 6459625 6767741 6490375 6238167 6022868 6301487 5747535 6114632 6011708 5949048 5735026
14099 5735026 5649285 5595464 5487322 5521714 5377928 5532044 5411486 5291074 5220635 5141768
14089 5141768 4886021 4854637 4899477 4803851 4774286 4885001 4983493 5121402 4636914 4808082
14079 4808082 4602546 4664168 4251646 4609276 4339291 4377790 4337656 4099819 4033967 4120454
14069 4120454 4112791 3936346 4054327 4194093 3857906 4085346 3681432 3805014 3742298 3848623
14059 3848623 3909648 3832303 3535106 3639699 3477170 3454460 3387738 3484978 3580148 3198112
14049 3198112 3295781 3238111 3374495 3289943 3417709 3121905 3140042 2957568 2826864 3016980
14039C016980L40015m4353m53511O3700J15116r7698J06161p5024l0076Q3004
14029C024314l32415J69456J18640k74298P018l5028m37157L37033M1640k8161
14019B591042j65736Q7665Q3073j85031J02423J80805n20487L5967r575K78716
14009B478862l57596k9326L54457j57368Q9737j94947m4240m58691N57281l14162
13999A924007Q5895l1452O6571J9879k83366K17268J20864L57479j66024M96620
13989B807741P29198L345152P970498K0351238O658315j7738164j1440187m992515
13981G691276k286269m50972j275038k41162O7792n63712r7000k04761N0777j79632
13971B511299O9705r2781L3069k30904k37635L72187m061j53607k87310K09093
$$ plain form
14039 3016980 3356995 3312642 2859131 2922831 3037947 2940249 3046410 2971386 2941310 3024314
14029 3024314 2691899 2861355 2979995 2705697 2712715 2677687 2240530 2577563 2619203 2591042
14019 2591042 2425306 2512971 2596044 2411013 2513436 2694241 2173754 2209721 2200146 2478862
14009 2478862 2121266 2091940 2446397 2289029 2378766 2183819 2139579 1680888 2238169 1924007
13999 1924007 2009902 1978450 2045021 2064900 1781534 1998802 2119666 2477145 2311121 2807741
13989 2807741 3536939 6882091 14852589 35203827 41862142 24123978 12683791 7691276
13981 7691276 5405007 4954035 3678997 3437835 3505627 2941915 2844915 2640154 2690931 2511299
13971 2511299 2581004 2488223 2521292 2290388 2052753 2424940 2420879 2267272 1979962 2189055
13961B189055j99928k3402K40934r7000j48371K9828J72450J04658p22484L74917
13951A920657j29863j79760J49801J79149j68122J71676j52766l91751N15692
13942A914713j90796j15486j27437L03052j60657J89743l74583J0J26102m4209
13932A520452j3068K09375m75981K99387J07958l25750J59801j76623M45429l26610
13922A424370j02170L63190j58133R1654l09529j32777q0457K70081q631L94101
13912A751699k37849l2221r0802r1709K33573m4458l13434J69030K26638j77959
13902A392508k7332j09997l08456Q9301J26447O13060o46565N7158j44646J78478
13892A219956k42598M24413j04725j46226M1712q2161J24302k6829m28008L62036
$$ plain form
13961 2189055 1989127 1965725 2206659 2109659 1961288 1991116 2163566 2268224 1545740 1920657
13951 1920657 1790794 1611034 1760835 1939984 1771862 1943538 1790772 1399021 1914713
13942 1914713 1723917 1608431 1480994 1784046 1623389 1813132 1438549 1438559 1564661 1520452
13932 1520452 1507384 1716759 1240778 1540165 1648123 1322373 1482174 1305551 1750980 1424370
13922 1424370 1322200 1685390 1527257 1618911 1309382 1176605 1096148 1366229 1357598 1751699
13912 1751699 1513850 1481629 1390827 1299118 1532691 1488233 1174799 1343829 1570467 1392508
13902 1392508 1365176 1255179 946723 1036024 1162471 1775531 1128966 1186124 1041478 1219956
13892 1219956 977358 1401771 1297046 1150820 1192532 1110371 1234673 1207844 779836 1141872
13882A141872R51Q7785K33012m58048L52620j32677j60647J38634J58027q2074
13872A279455l05369J34923J0084l50922P7069J18789K64388l0453j30375p789
13862A059800K04824l16279M41147m65903M5939k13407M58723m01892M3005Q1369
13852I37326j22308J44658L92j44845J3271K07338J09439k91617R126N6739k46653
13841F72866M2724L79661k90370k1535l11519O16956j7491m34938L27988J48081
13831A112423k66317J87965J26171l63965P42987m98559m4754j43403L30169l50118
13821H32599k88976J15055J86832j89745k47116P58612j09522l32396Q3809l34552
13811D74600L94036j26524J8956J75161j90467R4098l23642M75751m23528K25555
$$ plain form
13882 1141872 1142823 1230608 1463620 1005572 1358192 1225515 1064868 1203502 1361529 1279455
13872 1279455 974086 1109009 1119093 768171 845240 964029 1228417 1197964 1067589 1059800
13862 1059800 1264624 948345 1389492 923589 969528 756121 1214844 812952 855957 937326
13852 937326 815018 959676 960068 815223 828494 1035832 1145271 853654 862780 919519 672866
13841 672866 715590 1095251 804881 783346 471827 1088783 1071292 636354 964342 1112423
13831 1112423 846106 1034071 1160242 796277 1539264 1040705 995951 852548 1182717 832599
13821 832599 543623 658678 845510 655765 408649 1167261 1057739 725343 809152 474600
13811 474600 868636 742112 761068 936229 745762 839860 516218 991969 568441 793996
13801G93996K30116l28065L42567J69221k82834l6353k11992J72089k24112p7560
13791E47073J55946J32619l73609J70231K17695p1350n9577j20787K00006k29177
13781E69070M8947k01057K22167J61082M4310j08303j73221j39543K09592K17877
13771H50921C62944K67543J2893k42377K53201j74764K43076C41045J57442l9392
13761D59095L16170J6470C70243M22210j22147j16315J49212J81972j10947l74591
13751C99637K90549p1144j04830M7749q0253R3012j26783M24788j1613k42299
13741F18813N684j84928M25941m16923p2545J82522j03977K239q4359Q8803K73596
13730G34866j547k96160K29420k35955M119K70266k80815q2897J43586N6613j79605
$$ plain form
13801 793996 1024112 696047 1038614 1207835 925001 888648 676656 848745 624633 547073
13791 547073 703019 835638 462029 632260 849955 778605 719028 598241 798247 569070
13781 569070 618017 416960 639127 800209 844519 736216 562995 423452 633044 850921
13771 850921 362944 630487 643380 401003 654204 479440 722516 341045 498487 459095
13761 459095 775265 791735 370243 792453 670306 553991 703203 885175 774228 399637
13751 399637 690186 619042 514212 561961 481708 574720 447937 872725 861112 618813
13741 618813 624497 439569 865510 448587 376042 558564 454587 456826 372467 461270 734866
13730 734866 733319 437159 666579 430624 434743 705009 424194 341297 484883 541496 361891
13719C61891L601J45217j61836J18913J90898j29937B24293o672N6336k999N64863
13708H35821D02122J12916O862k17737K46408J55527k26660r8360j67161J82516
13698C96433o1484K37056k57460R0065o9553L25141m747j3057j92935j46987J02215
13687D04687N2053k478A21111J39933K67390A80655N56900B56893m2396K22647
13677D37144j0458K10976B53086l3770L57055K05368k90541M4684L8077k67960
13667C05999J03144Q1567L4676o2469J01201q7146R8300k39622K49789k34561
13657C50878i0501E76035L9631C05651m0183M51330k66137N9070j68170J53134
13647D94695j85289K9462j46801L01472A74863J5318L20704n6346n9742j5612
$$ plain form
13719 361891 365492 510709 348873 467786 658684 528747 224293 217621 273957 270958 835821
13708 835821 402122 515038 521900 304163 550571 706098 479438 381078 213917 396433
13698 396433 334949 572005 314545 404610 335057 660198 655451 642394 449459 302472 404687
13687 404687 456740 454262 121111 261044 528434 180655 737555 256893 214497 437144
13677 437144 426686 637662 253086 219316 576371 781739 491198 535882 573959 305999
13667 305999 409143 490710 525386 462917 564118 476972 575272 335650 585439 350878
13657 350878 -90501 576035 615666 305651 265468 716798 450661 509731 341561 494695
13647 494695 309406 338868 192067 493539 174863 190181 510885 454539 394797 379185
13637C79185K33455k02018R1483j81468L34783B51162J50675K13222B27270M55405
13627F82675B05143J29319q7135K41128A15726K65240j59840J5954R0704n4202
13617B73582J18446M6707g388C87370k2031j43927K14703B07089L9603L2295A21818
13605B43649J77757k4607j1666L1223j05721j23537M11581c471E12123j88604
13595C23519l9353j04571O4005K07376l7247J08763a14260B77048R8355K52302
13585F27705B41776N2094I2822M616L78978j16536o1374Q5752j40787P6598K17822
13574E37891k16563M6629g6771E86567k70244J005r2796J43692c00301C71733
13563A53497K22772A79795k2066J31139i402E05413B30222A13428L40881A03918
$$ plain form
13637 379185 612640 410622 502105 320637 655420 251162 401837 615059 227270 682675
13627 682675 205143 334462 247327 488455 115726 380966 221126 237080 327784 273582
13617 273582 392028 438735 -7388 387370 365339 221412 436115 207089 246692 278987 121818
13605 243649 421406 396799 385133 416356 310635 187098 598679 -3471 512123 323519
13595 323519 284166 179595 243600 450976 413729 522492 -114260 277048 375403 627705
13585 627705 241776 293870 92822 97438 476416 359880 298506 384258 243471 320069 537891
13574 537891 321328 367957 -76771 586567 316323 317328 224532 368224 -300301 371733
13563 153497 376269 179795 157729 288868 -9402 505413 230222 113428 454309 103918
13552C04988R4479A29054J67270j13218O4568d9534A71205p6277K44497n2864
13542B86561p7508M6726J75396a41027O3486C07754n2997k6861o2730J14074r468
13531B69772E8438J21979L17889A34076N3946P2241p8521m2909E8509K41854l6793
13520B63570n0382m5373k6068M02966A45047j8272L8359L09592l773k13636M71619
13509G28936B72480J12096j08904J18877H1561N49005B10312M8562l4606K38171
13499D62439k22972Q7302K18948k01000n5305n045A13133d7546B89365J98605
13489D87970o8909j31560J57416k06467p8728g8485A59210B0680J87418J22208
13479C30306j34812J05757N9607n173q3385C8353J97473D7953L15904G8870c0588
$$ plain form
13552 304988 399467 129054 296324 183106 247674 -49534 171205 94928 339425 286561
13542 286561 209053 255779 431175 -141027 -77541 307754 254757 227896 165166 279240 269772
13531 269772 58438 180417 498306 134076 188022 260263 181742 138833 58509 300363 263570
13520 263570 213188 167815 141747 544713 145047 126775 165134 474726 470953 257317 728936
13509 728936 272480 384576 275672 394549 81561 630566 210312 258874 224268 462439
13499 462439 239467 326769 545717 344717 289412 284367 113133 -47546 289365 487970
13489 487970 419061 287501 444917 238450 159722 -78485 159210 20680 208098 330306
13479 330306 195494 301251 360858 355685 272300 38353 235826 47953 363857 78870 -30588
13467C05893B9837d1883E0879J08289J88623e896A01330K67087j24662j03914
13457A39841r04M17821B32619E4564K99851A63949K13002A85684l8295O8114R0700
13446C06203r2607A03504J11493m5048K17877C3399K75330n7797k5298D1058K79415
13435C20473j06202K22186j86173r9766K59411a0340F790R2066K67263j30782
13425B35337p3353Q6607k283q459j7825j08584J62748a2577G3595k1524m227K52266
13413C00110F8164L03756A75902a86312a2577D00834A89862Q7997j37213J29804
13403B70450C9031P4j756J01734Q960l9541a04407A01927K54823I8203J59524
13392B57727I2433K525a47788G3367K2326b221j074H5122L56170c3613A17133
$$ plain form
13467 305893 29837 -41883 50879 159168 347791 -5896 101330 368417 243755 139841
13457 139841 138937 556758 232619 54564 354415 163949 376951 185684 147389 215503 306203
13446 306203 213596 103504 214997 169949 387826 33399 308729 250932 225634 41058 320473
13435 320473 214271 436457 250284 150518 409929 -10340 6790 98856 366119 235337
13425 235337 161984 248591 246308 237849 220024 111440 274188 -12577 73595 52071 47844 300110
13413 300110 68164 371920 175902 -186312 -12577 400834 189862 277859 140646 270450
13403 270450 39031 39105 37349 139083 148043 108502 -104407 101927 356750 98203 257727
13392 257727 92433 94958 -147788 73367 95693 -2221 -3295 85122 441292 -33613 117133
13380e8461k5940f594k68611A78296g7410F9210J73060I5688J39186E638J84240
13369A89878P9774a1759C55496k6980M1749r4204j13745J07281j26621d1892B51939
13357D30891A25041O7032a04994I0309L6138K67570H608J75799K72648A0492J15273
13346A25765r71K66176A35965K23401p8894j18249J38932o882J29704j26687q3013
13335B14277O2098a06919i740B90257n3253E1165L02418g42D11483r8332a69903
13323A22719C0417J28411o4629c4636D5904k2565K0525R7326b88525e086C40547
13311A72776J97406B2713F100M5944K6717J59778b5323A57916j8071K59657g8533
13299C46259j58156G5685J6325A6876K92546P7644p1451p8468l1772Q0542l5432
$$ plain form
13380 -58461 -84401 -6594 -275205 178296 -77410 69210 242270 95688 234874 5638 189878
13369 189878 269652 -11759 355496 328516 370265 276061 162316 269597 142976 -41892 251939
13357 430891 125041 192073 -104994 90309 126447 394017 8608 184407 457055 10492 125765
13346 125765 124794 390970 135965 359366 280472 162223 301155 294273 423977 297290 214277
13335 214277 276375 -106919 -9740 290257 237004 51165 353583 -742 411483 313151 -169903
13323 122719 30417 158828 94199 -34636 45904 23339 43864 141190 -288525 -5086 340547
13311 172776 370182 22713 6100 52044 78761 238539 -25323 157916 139845 399502 -78533
13299 346259 188103 75685 92010 16876 309422 387066 315615 237147 205375 285917 250485
13288B50485c26055A06920I621J0395L30179A43051b37885j3547g2475C37663
13277A95824M3177m3777E2401e6867A79761F2288k8401K77178C6090b5311F139
13265A8122N46316A95431a81500B19113b41320B7705J32874f5040p1313g782C00916
13253C14864j31210A7838R9637l1768J37222b29939B42561m9489a80045M594B66810
13241I9856J47763j18544f805B15939R1471b24608j11109A55703F1150h220B59768
13229a13549p4577C08365A07650J53011g0668A92854a53089C33511A62689L3874
13219A96563H9193M4729a8055E3508M6890a94149H7448b9882A48638R9436F2990
13207g82B80480A16463e9937B25156b09085I840M17884q7969a82917e1386I728
$$ plain form
13288 250485 -326055 106920 9621 20016 350195 143051 -237885 -251432 -72475 337663
13277 195824 239001 195224 52401 -56867 179761 62288 33887 311065 36090 -25311 6139
13265 18122 564438 195431 -181500 219113 -241320 27705 160579 -65040 -136353 -7782 300916
13253 314864 183654 17838 117475 85707 222929 -229939 242561 193072 -180045 -175451 266810
13241 99856 247619 129075 -6805 215939 307410 -224608 -335717 155703 61150 -8220 259768
13229 -113549 -188126 308365 107650 260661 -70668 192854 -153089 333511 162689 196563
13219 196563 89193 133922 -18055 53508 100398 -194149 87448 -29882 148638 248074 62990
13207 -782 280480 116463 -59937 225156 -209085 9840 427724 339755 -182917 -51386 9728
13195C27244a30207A57511p4358J64479H2618P3521o9892a45725O6333m3991M2405
13184h0978B39633c33095d2554m6036k69191D5950K10674F6219B8596b94227A52453
13172e9036B44396a65217C074a51266A52866a21554B40360J40557c0671n1777
13162h2448n4284C84993j20173d18176C634a76237B15646E1616Q7784A6244J77928
13151A94172D1791K4852K857h4243B87628f2890a5811C4493K20093Q2412A31781
13139C36683A07406J87129I6209O1764n8617J817J24425B491K34864I3069L4395
13128A27464b09616A58470E5467a16931B70048E9325b6101n370I6840a07861C37139
13116C31291C4392a48264n1731o5101B01341K40215A14273A0458M9131M6513M3598
$$ plain form
13195 327244 -130207 157511 83153 247632 82618 156139 86247 -145725 -79392 -123383 -80978
13184 -80978 239633 -333095 -42554 -88590 -357781 45950 256624 66219 28596 -294227 152453
13172 -59036 244396 -165217 3074 -151266 152866 -121554 240360 380917 -30671 -82448
13162 -82448 -136732 384993 264820 -418176 3634 -176237 215646 51616 139400 16244 194172
13151 194172 41791 66643 69500 -84243 287628 -62890 -15811 34493 254586 336998 131781
13139 336683 107406 294535 96209 157973 99356 101173 225598 2491 237355 93069 127464
13128 127464 -209616 158470 55467 -116931 270048 59325 -26101 -31471 96840 -107861 337139
13116 331291 34392 -148264 -199995 -265096 201341 441556 114273 10458 59589 106102 149700
13105A49700D8971M8550b6166C5909b067n4666l9865j05816A50552Q0556H9256
13093C73255A57103R3602F6478L8233M2110m1480J6359J3114b37119A33342J76317
13082C09659C2039J48269i568G8824a62052f4392n2805F14048b00818H624a32718
13070g3184A7456R7421J58548n2398O9855d2867C48153a02006C26100c2875A75066
13058A68311k0991a35509a3490B85444a20301e0654A19182a4434c915C06426A47541
13046B07469k3488B1270A0530b02937C5668P4396h3612L1312o0256F7015J3122
13035H0137N3908J39217P551j13417P2190C4751K7313J91984J25103D0836J97750
13024B38586J7835b71225A15348J03162a93780A87825a12847F7564K44562q2820
$$ plain form
13105 149700 48971 97521 -26166 35909 -2067 -56733 -96598 -202414 150552 231108 89256
13093 373255 157103 250705 66478 104711 146821 105341 121700 134814 -237119 133342 309659
13082 309659 32039 180308 -9568 78824 -162052 -64392 -117197 614048 -200818 8624 -132718
13070 -73184 17456 114877 273425 221027 290882 -42867 348153 -102006 326100 -32875 175066
13058 168311 147320 -135509 -13490 285444 -120301 -50654 119182 -14434 -3915 306426 147541
13046 207469 183981 21270 10530 -202937 35668 110064 -83612 -52300 -112556 67015 80137
13035 80137 134045 273262 280813 167396 239586 34751 62064 254048 379151 40836 238586
13024 238586 256421 -271225 115348 218510 -193780 187825 -112847 67564 312126 229306
13014B29306J62143Q9869H9404a46659A7124K79095c7436B17128r5688a95867
13003A95444o8938R8750A02224g5679B50514B6959J75279n0317P4249O7099G589
12991a8263B34297d7305j6567E6634J15378J19254D851c5416B06828G7622J37259
12980B14881k2642D1138h4464k53940A41478J90199A3732J65683b89034i5807
12969b31044O5135c0647p3948F1315a75399D1812r347c4640a3868k1452H8317
12957e2614r7379J038B53009F4481J28235K77609A0647a5702k0895j73378F0006
12945B90604d30951R3046G9452c23091F5133J91080A04844f5564A0795a88986
12934a9342H1097J0593g7224B53663p0512f8633K9385B87487k5966E6873c28885
$$ plain form
13014 229306 391449 481318 89404 -146659 17124 296219 -37436 217128 121440 -195867
13003 195444 126506 225256 102224 -75679 250514 26959 202238 151921 226170 293269 7589
12991 -18263 234297 -47305 -63872 56634 172012 291266 4851 -35416 206828 77622 214881
12980 214881 192239 41138 -84464 -338404 141478 331677 13732 179415 -289034 -95807
12969 -231044 -165909 -30647 -104595 61315 -175399 41812 32465 -34640 -13868 -35320 88317
12957 -52614 -149993 -148955 253009 64481 192716 470325 10647 -15702 -36597 -209975 60006
12945 290604 -430951 -337905 79452 -323091 65133 256213 104844 -65564 10795 -188986
12934 -19342 81097 91690 -77224 253663 183151 -68633 -39248 287487 261521 56873 -328885
12922a4854C24391b27752c730A15853J25857c14981J46246l3386a6504D8491J92672
12911B41163a95361h2459B49987M0650j36134Q9852r8869e0156A34697N3148d430
12899A71303G2053c06470C6703b13006A36621f982m3760B96062A31279E1871K68675
12888C20546a30114D4767j7757M3167O5467a40332d146B29900F0883e6691l5964
12877i2655C05706I2505L3199K44029f4596B027b48018J00365k80452a20446A08212
12865b28978B67760j14984M3307d2202A93529B0904J19976J53579j15279n1415
12855A27765a18405j76552k40104D9438J44632A9338a40677B33684A14824b96087
12844B60857j01108J39024l2052A02023J98697b11553E4375e4507F659J87287
$$ plain form
12922 -14854 324391 -227752 -3730 115853 241710 -314981 -168735 -202121 -16504 48491 241163
12911 241163 -195361 -82459 249987 290637 154503 244355 145486 -50156 134697 187845 -4430
12899 171303 72053 -306470 36703 -213006 136621 -6982 -50742 296062 131279 51871 320546
12888 320546 -130114 44767 27010 70177 135644 -140332 -4146 229900 60883 -56691 -92655
12877 -92655 305706 92505 125704 369733 -64596 2027 -248018 -147653 -428105 -120446 108212
12865 -228978 267760 152776 196083 -42202 193529 20904 140880 294459 179180 127765
12855 127765 -118405 -294957 -535061 49438 194070 19338 -140677 233684 114824 -296087
12844 260857 159749 298773 266721 102023 300720 -211553 54375 -54507 6659 193946
12834A93946b26719A53579D2217a6646B41562b74509B26867g9899J0493C120i6921
12822e9517A594b45658m3240h1751k0738J9626A3337a67566N930g6626j20748
12811a97374b153r639k14223i3890A34317f9748H3500K32788H0480a26070M6215
12800g9855m5661j2132A18886b9862l50300B19938C2488K245f041j11952A74981
12788B032a79963A86855k6858J65964B3132J7668O0264d9185k87089J44320I8979
12776e9931D4055f8562A59694C7826h6705j13591j94962F5149b02021o1785B055
12764A94429b68610O4178B19354D1208J38121K415h8864j86480C6973J10561b84154
12752a32905A3962c45608h1208j97537D8522R0087R2611a85124m2406A39069b64753
$$ plain form
12834 193946 -226719 153579 42217 -16646 241562 -274509 226867 -79899 -69406 3120 -96921
12822 -59517 1594 -245658 -288898 -81751 -102489 -82863 13337 -167566 -161636 -76626 -197374
12811 -197374 -2153 -11792 -226015 -93890 134317 -69748 83500 316288 80480 -126070 -79855
12800 -79855 -125516 -137648 118886 -29862 -380162 219938 32488 34733 -6041 -117993 174981
12788 2032 -179963 186855 159997 325961 23132 40800 101064 -49185 -336274 -191954 98979
12776 -59931 44055 -68562 159694 37826 -86705 -200296 -395258 65149 -202021 -263806 2055
12764 194429 -268610 -204432 219354 41208 179329 181744 -88864 -275344 36973 147534 -284154
12752 -132905 13962 -345608 -81208 -278745 48522 138609 231220 -185124 -227530 139069 -264753
12740f0949B04914L6111E4796L37927j85572H3190d1695C96082j56427n3077m5897
12729A40681J40189i5900B7318a41608A48166N308J09886O7605F8553N71b50711
12717A3688J87037j4871a24918E6629b04271H0755G555R4487J18758b57740B3998
12705f565A33493f117A30946d9081p8091j52875A0754a16269A33185K9718F2171
12693I6443C2001J16751k9336a17899b1988j05958l47291a13520A70387G0026
12682B01759q9990C2535K18934C0780b4480C46548o1066f6024j3413D68650a6057
12670b45418b9552D33613i562D6470a75423A13351a75520B73950m0368m5532K3937
12659B11987d31160a42666F1364M05988k29077I1173J47588d2988B6904J91692
$$ plain form
12740 -60949 204914 241025 54796 392723 207151 83190 -41695 396082 239655 186578 140681
12729 140681 280870 -95900 27318 -141608 148166 153474 263360 330965 68553 69124 -250711
12717 13688 200725 185854 -124918 56629 -204271 80755 7555 102042 220800 -257740 23998
12705 -6565 133493 -6117 130946 -49081 -127172 -280047 10754 -116269 133185 162903 62171
12693 96443 32001 148752 119416 -117899 -21988 -127946 -475237 -113520 170387 70026
12682 201759 111769 32535 251469 30780 -24480 346548 285482 -66024 -79437 468650 -16057
12670 -245418 -29552 433613 -9562 46470 -175423 113351 -175520 273950 233582 188050 211987
12659 211987 -431160 -142666 61364 467352 238275 91173 238761 -42988 26904 218596
12649B18596d2407A38831l977b6251F0840R9084m1956a06318J4556A02756h5029
12637B143i7397A99328K89964I3732j5714d991G2201k0924J90219n3939K07326
12626C94883G6183J20609i4785B31034e5942o7200a8450n6052j58723J7616C9470
12614a22037B9210h0070f137m83754A02293B3562L24501n7535f6128A15823E3028
12602C23077P4510q8431E1114J16442b28203N9582d2333j4392F5830Q2181E0005
12590c2497E1089K06489b2136j38767a9865k60168a7811A97857i3737F9560h9364
12578I8281a47035H7691a07459G5878O2770P4286a87255l3028E1946f9665r898
12567g9563c4495B45758B9592L1902c34419d4530q9527B3553L3171g7742r7540
$$ plain form
12649 218596 -42407 138831 134854 -26251 60840 159924 117968 -106318 -91762 102756 -85029
12637 2143 -97397 199328 489292 93732 78018 -4991 72201 51277 241496 187557 394883
12626 394883 76183 196792 -94785 231034 -55942 -123142 -18450 -74502 -233225 -215609 39470
12614 -122037 29210 -80070 -6137 -489891 102293 23562 348063 290528 -66128 115823 53028
12602 323077 397587 309156 51114 167556 -228203 -168621 -42333 -56725 65830 148011 50005
12590 -32497 51089 257578 -22136 -160903 -19865 -280033 -17811 197857 -93737 69560 -89364
12578 98281 -147035 87691 -107459 75878 138648 212934 -187255 -220283 51946 -69665 -79563
12567 -79563 -34495 245758 29592 61494 -334419 -44530 -134057 23553 56724 -77742 -175282
12556a75282B97766c15337c7067j16687A06464a13928B36204O6704a64877E3457
12545a23839L5166n9287A1575M19679A7564J58315a33548B1285e1421C32259n5442
12534B76817r898C0756K27372A01169h880k8904A97765L4811i0371A46901L71958
12523E18859H7657a1233m029k32700A83494a47323H15J31130n8981a71041A60233
12511b35709Q8163g2575j08474j5129A78337J27878b3456H3860b95352P2048B38834
12499A0408e6019C19207m3853J50122L64920D9297J81432a49415O1545B77064
12488a04682j53619a2154j84750A26472m4763i1651k4428l9883j18929a14628
12477b50738I3436a46796q4592C2667K6744c64041a3392j78819A07886O5201d868
$$ plain form
12556 -175282 297766 -315337 -37067 -153754 106464 -113928 236204 302908 -164877 53457
12545 -123839 -88673 -147960 11575 431254 17564 175879 -133548 21285 -51421 332259 276817
12534 276817 266919 30756 258128 101169 -8880 -37784 197765 232576 -90371 146901 518859
12523 518859 87657 -11233 -15262 -247962 183494 -147323 815 131945 72964 -171041 160233
12511 -235709 -147546 -72575 -181049 -196178 178337 306215 -23456 83860 -295352 -223304 238834
12499 10408 -56019 319207 275354 425476 790396 49297 230729 -149415 -87870 277064
12488 -104682 -258301 -12154 -196904 126472 81709 -91651 -116079 -155962 -274891 -114628
12477 -250738 93436 -146796 -231388 32667 59411 -364041 -13392 -192211 107886 173087 -4868
12465A87038G5381b53529A61763n8589c7526j04343J9395A91214c09382a50455
12454f8191A66723G7036i7592B31645b34310A49746a36643A0663e288B69254j28244
12443A41010a3096j09695G5481l2757a13457D3932a48722I5013J39947a30907
12432d09877D7929a82930c5233q5417A465M7059L08613C5364g8277A16998b24529
12420d40483B03384c49597J74479M3046M2895F7456J07030C7601a21759c2919
12409I1985b55256c1301j89902c0655A82049a5459l8325m5694E4545G77a37156
12397B56822a82637F7881K87048a0513l9464B33821a16524j10730g5788A79085
12386g9541k9785o372c2220a3671m8134E3783P6443P1271a83525E1781b06438
$$ plain form
12465 187038 75381 -253529 161763 103174 -37526 -141869 -122474 191214 -309382 -150455
12454 -68191 166723 77036 -97592 231645 -234310 149746 -136643 10663 -5288 269254 141010
12443 141010 -13096 -122791 75481 42724 -113457 43932 -148722 95013 234960 -130907
12432 -409877 47929 -182930 -35233 -120650 1465 48524 357137 35364 -78277 116998 -224529
12420 -440483 203384 -349597 -175118 -132072 -89177 67456 174486 37601 -121759 -32919
12409 91985 -255256 -31301 -221203 -30655 182049 -15459 -53784 -99478 54545 777 -137156
12397 256822 -182637 67881 354929 -10513 -49977 233821 -116524 -227254 -75788 179085
12386 -79541 -109326 -115698 -32220 -13671 -61805 53783 130226 201497 -183525 51781 -206438
12374d0910o5431k2450k46395b0398j6381D26665A48694F3692E697Q7228K09070
12363C01995b06443J3016B8464q403J05552b62149A41988b12558a8958C33561
12352a8751B11314c58474A17441M3678i4069q9516a0831n6461A4802O4702c15238
12340F0427a54885A18440H955J20315b2658j33861O1196B2941h9734I1506B9569
12328b4624m60090D8293b8031j09526j10342B40194l3837b15246J06768d2408
12317e0221l71730A70577a15211e4327E0892b01708d0341j57088H2714j8003L28439
12306C93150G1301a63479A32604j0430O843a73409C25915a63019C76714F0181
12295H3872N7152R4317c7920H2804M2223J95420b26786f2187B63018J46864b80508
$$ plain form
12374 -40910 -106341 -128791 -375186 -20398 -36779 426665 148694 63692 5697 92925 301995
12363 301995 -206443 -193427 28464 20061 125613 -262149 141988 -212558 -18958 333561
12352 -18751 211314 -358474 117441 161119 -94069 -183585 -10831 -67292 14802 79504 -315238
12340 60427 -154885 118440 8955 129270 -22658 -156519 -95323 22941 -89734 91506 29569
12328 -24624 -484714 48293 -28031 -137557 -247899 240194 206357 -215246 -108478 -42408
12317 -50221 -421951 170577 -115211 -54327 50892 -201708 -40341 -197429 82714 64711 393150
12306 393150 71301 -163479 132604 122174 129017 -173409 325915 -163019 376714 60181
12295 83872 141024 235341 -37920 82804 125027 320447 -226786 -62187 263018 409882 -280508
12283C9094e5229A97466j8079C660h9742G2283A1745N30050B25205j00464L8057
12272A62798f7440B14431e5287B4856J7055c15290e7881A78218p3533c55088F094
12260g7400p3878b5433C3967K05134J11983b013r6043I474K46882c8182k198m3906
12248h4286C19736a59428D19934h7045A388K97093a05484A60908b09008C01557
12237A92874c6160p8418B13608G4585b12719I0384a64846j9972H9941K36809j08267
12226B18483A08158J97712A25093K43508G0315J11850J496e1619D27114A75384
12215B92145K30012k19933a9671A19302a3352A61755O1114P2627j40944B6996
12204B03055a2099A63927A5101J36431Q2200k4684M9874J83635H3793M7242J32774
$$ plain form
12283 39094 -55229 197466 179387 3660 -89742 72283 11745 541795 225205 124741 162798
12272 162798 -67440 214431 -55287 24856 41911 -315290 -57881 178218 104685 -355088 6094
12260 -77400 -151278 -25433 33967 239101 351084 -2013 -98056 9474 256356 -38182 -40380 -84286
12248 -84286 319736 -159428 419934 -87045 1388 298481 -105484 160908 -209008 301557
12237 192874 -36160 -114578 213608 74585 -212719 90384 -164846 -184818 89941 326750 218483
12226 218483 108158 305870 125093 368601 70315 182165 183661 -51619 427114 175384
12215 292145 522157 302224 -19671 119302 -13352 161755 222869 295496 154552 26996
12204 203055 -12099 163927 15101 151532 233732 209048 258922 442557 83793 131035 263809
12193B63809A3169Q7011B1491J90151J52890I8684J31381N4577B8077O2102K788
12182I2967h8283B56655r8203j3380a60034A34359m693j3855J78885A24764M3678
12171A68442R7961B2480L44138A77702K4820A6303c47681C39741B3594K19511
12161B43105r0938B7737O05735b05542E7385a11595a6519A30919i4106A32142
12150C64651e4367A95207b65572C28432E0838b9866P996k55189R5589I0275Q1507
12139A71782o1057J6655a08956E9912k3132b45051C59782A02779a41527l5415
12129a76942b2162O682E0209A5564a45197I7052R9352l7981G676b83987e8280
12117A28167J15591d1667B00670j5071l9105C1923J49942E1507a73099b4188j58862
$$ plain form
12193 263809 13169 100180 21491 211642 364532 98684 230065 284642 28077 90179 92967
12182 92967 -88283 256655 158452 145072 -160034 134359 129666 115811 294696 124764 168442
12171 168442 266403 22480 366618 177702 202522 16303 -347681 339741 23594 243105
12161 243105 152167 27737 633472 -205542 57385 -111595 -16519 130919 -94106 132142
12150 364651 -54367 195207 -265572 328432 50838 -29866 -21870 -277059 -181470 90275 171782
12139 171782 110725 127380 -108956 59912 36780 -245051 359782 102779 -141527 -176942
12129 -176942 -22162 -15480 50209 15564 -145197 97052 196404 158423 7676 -283987 -58280
12117 128167 243758 -41667 200670 185599 146494 31923 181865 51507 -173099 -24188 -183050
12106a83050g0379m1420m0750p9010A97796I0154b4943k02628k84703b18188c2954
12094f8275A18945e8858I1437m005h7879m816A20302B5745c39353a05702A26198
12082A29914m2973C449K07008b77898I0675a02351B97169a09003P540j16842D8837
12070G5857e8143j20392A18029K51412a28335B15936a0083q3754B3643e7456E1235
12058b58755H4023B3270c6663B66919a67644b562A95349f7430k48483G8903N8572
12047A37475a25251N1522A74032f1602j53039J06958j88210B24135d6605A0J003461
12036A003471K10753C70064A82402J56620B9649J38094L109J15828b17673D1250
12025f4445j60470C73264A17507a94198H772M5814N7546m9672Q0853B4872N1959
$$ plain form
12106 -183050 -70379 -111799 -152549 -231559 197796 90154 -24943 -227571 -512274 -218188 -32954
12094 -68275 118945 -58858 91437 87432 -87879 -92695 120302 25745 -339353 -105702 126198
12082 129914 86941 3449 210457 -277898 90675 -102351 297169 -109003 -101463 -218305 48837
12070 75857 -58143 -178535 118029 369441 -128335 215936 -10083 -93837 23643 -57456 51235
12058 -258755 84023 23270 -36663 266919 -167644 -2562 195349 -67430 -315913 78903 137475
12047 137475 -125251 -73729 174032 -61602 -214641 -107683 -295893 224135 -46605 10 1003471
12036 1003471 1214224 370064 182402 339022 29649 167743 170852 286680 -217673 41250
12025 -64445 -224915 373264 117507 -194198 8772 54586 112132 62460 143313 24872 76831
12014G6831J20766F5283h7078G2359c1340m574F3947a3359o809B82448i7958I935
12001a06396d3166l32220R5835o9705J05141J03117K550A77774a79791F0050a85759
11989D6274K5521f0688j27829h1518C73081F8843a49787A11664C028e3697l2027
11978h5724j8592o5685B72345J5184a34347k52173A4550a31850n9330i2061L7280
11967e4781a5605j2372A35020G798b04950K6292c3646Q686H3553f8007C04156
11955c4833F6809p065R473N4483c63748e0374D0323a26968O503A16641b39155
11943a08495J3200m7438E7617J88292C7539a960A54386c05556H6265d68576E2425
11931G9344k1393a48351A35084B2703c6826A71028J63910a2515C05205j35366
$$ plain form
12014 76831 197597 65283 -87078 72359 -31340 -35914 63947 -13359 -20168 282448 -97958 9935
12001 -106396 -43166 -375386 -279551 -349256 -244115 -140998 -138448 177774 -179791 60050 -185759
11989 46274 71795 -60688 -188517 -81518 373081 68843 -149787 111664 3028 -53697 -85724
11978 -85724 -104316 -170001 272345 287529 -134347 -386520 14550 -131850 -191180 -92061 -54781
11967 -54781 -15605 -27977 135020 7798 -204950 -178658 -33646 -24960 83553 -68007 304156
11955 -34833 66809 59744 69217 123700 -363748 -50374 40323 -126968 -120465 116641 -239155
11943 -108495 -95295 -142733 57617 245909 37539 -1960 154386 -305556 86265 -468576 52425
11931 79344 57951 -148351 135084 22703 -36826 171028 334938 -12515 305205 169839
11921A69839b05336M8264g8371A5260a392A14311b16424f6437A73785i8186j1272
11910a09458n762A09181l4031J04095B199K80340a31690A31090a33541d2044p8614
11899a20658k0105O6209q6925g5444A1231f9083j04740D2559b0475n80372A21933
11887i1999j18976h7362C9129K03841A20301a97463B79958H131K39711c3186B6264
11875H8248c57915a20460N0091j42712A94329e2000A15006K760J81791C9445a1767
11863B04974C1425a15950k20583J16093A29656n8096i3118c1131F2835J11557
11853A74392m8010l7979g4805G5560j1443A705a56484B53516b0046j45180e7281
11841b26766a4990k34105D50070f4801A7828c34346B21631c11001B54844a45246
$$ plain form
11921 169839 -205336 -157072 -78371 15260 -1392 114311 -216424 -66437 173785 -98186 -109458
11910 -109458 -115220 109181 75150 179245 2199 282539 -131690 131090 -133541 -42044 -120658
11899 -120658 -140763 -74554 -161479 -75444 11231 -69083 -173823 42559 -20475 -600847 121933
11887 -91999 -210975 -87362 39129 242970 120301 -197463 279958 8131 247842 -33186 26264
11875 88248 -357915 -120460 -70369 -213081 194329 -52000 115006 117766 299557 39445 -11767
11863 204974 31425 -115950 -336533 -220440 129656 71560 -93118 -31131 62835 174392
11853 174392 126382 88403 -74805 75560 64117 1705 -156484 253516 -20046 -165226 -57281
11841 -226766 -14990 -249095 450070 -64801 17828 -334346 221631 -311001 254844 -145246
11830B28676p6202J1414a14871C5700c38164B11676A1439Q9917R6026E2285H030
11818F4973b91112a16742A89845a77069Q437A17884k7121k3815J55858F4925J05290
11807A70215f8888j94753M1871I763c74289J37239H2219e7938C58717b36065A23641
11795I9003J08280a73562L4757G143i6018B12736B4088Q5857a90823o2157c5899
11783B06672a48092C10786i9484A51166f9194p821q9632Q0363F4722b11670A73360
11771A15394a67469b9030J4442B81575H1526J8755a42913o3533B60920i2372B31200
11759b24563G9967a01884L9278B33377a10792K6890B65979a9010D9816a3395l9924
11748e3319A41049b19423J04279c0124A73214P7495D6352g7107A22336A1845N6572
$$ plain form
11830 228676 152474 163888 -114871 35700 -338164 211676 11439 101356 197382 52285 8030
11818 64973 -291112 -116742 189845 -177069 -168632 117884 90763 66948 222806 64925 170215
11807 170215 -68888 -263641 -221770 9763 -374289 -237050 82219 -57938 358717 -236065 123641
11795 99003 207283 -173562 -138805 7143 -96018 212736 24088 109945 -190823 -252980 -35899
11783 206672 -148092 310786 -99484 151166 -69194 -77015 -166647 -86284 64722 -211670 173360
11771 115394 -167469 -29030 -14588 281575 81526 100281 -142913 -206446 260920 -92372 231200
11759 -224563 79967 -101884 -62606 233377 -110792 -83902 265979 -19010 49816 -13395 -53319
11748 -53319 141049 -219423 -115144 -30124 173214 250709 46352 -77107 122336 11845 68417
11737F8417c6966B39354E024M17042A68713G4370K74965a18399A08822M1592a55209
11725D0015b91395k1032H7398a12928A53067a41580B69356o5458B1250J891a89760
11713A72098d7139j62605C69370A03305a2314A08312h8482D0393g5347j6117A78008
11701B8554Q4301o108K3409a73282E2283a06020C04346A01669D0418N41127a31993
11689A02170J2250Q4899c2933B37762I1921b00608g106j80137A41288a34672I7243
11677a44100q6038r028B54154C6062d4921m0377A9199a36144A54140a89448c7211
11665I143J86517b2467C01266F1106g1943q9935A67433b5328p7214B16999A8372
11653a28902D3561J3834c0021j52061D61574H8224L3320a42751H8356a93913k64711
$$ plain form
11737 68417 -36966 239354 5024 422066 168713 74370 349335 -118399 108822 150414 -155209
11725 40015 -291395 -312427 87398 -112928 153067 -141580 269356 203898 21250 23141 -189760
11713 172098 -47139 -209744 369370 103305 -12314 108312 -88482 40393 -75347 -91464 178008
11701 28554 112855 106747 130156 -173282 52283 -106020 304346 101669 40418 581545 -131993
11689 102170 114420 199319 -32933 237762 91921 -200608 -7106 -187243 141288 -134672 97243
11677 -144100 -230138 -239166 254154 36062 -44921 -85298 19199 -136144 154140 -189448 -37211
11665 9143 195660 -22467 301266 61106 -71943 -161878 167433 -25328 -102542 216999 18372
11653 -128902 43561 57395 -30021 -182082 461574 88224 121544 -142751 88356 -193913 -458624
11642d58624C64532A29760N9170J58006E6540a6607B9692A219M32218A59928J16163
11631B76091a87239A75846a26472C39504o0254B7982h5497k02345P8058I26J17473
11620A18399J51702A953J3770a42262A39793e6261i747C41269b02048N3980q7330
11609b35398E214h0389D2349l665J04573A3889M20526A53174p381a64802C474
11597a42807A66347F0984g9391C3439g8698G5303R0369b19821q8158D602a56496
11585B96645A07794K6156C344O3438a911E4131J68378a27368l16789A16837b39572
11573B5497K22587c25948I3501h0398j31240p1481m316R6239A80845G3683a467
11561A11131J27399a36938C55382a71939D0393L3879Q0170E7878K48050j13840
$$ plain form
11642 -458624 364532 129760 188930 346936 56540 -16607 29692 1219 433437 159928 276091
11631 276091 -187239 175846 -126472 339504 279250 27982 -85497 -287842 -209784 926 118399
11620 118399 270101 1953 15723 -142262 139793 -56261 -9747 341269 -202048 -148068 -235398
11609 -235398 5214 -80389 42349 38684 143257 13889 434415 153174 145793 -164802 3474
11597 -142807 166347 60984 -79391 33439 -78698 75303 165672 -219821 -307979 4602 -156496
11585 296645 107794 133950 3344 66782 -1911 54131 222509 -127368 -444157 116837 -239572
11573 25497 248084 -325948 93501 -80398 -211638 -283119 -287435 -191196 180845 73683 -1467
11561 111131 238530 -136938 355382 -171939 40393 74272 154442 57878 305928 192088
11551A92088a27238D53767k14394Q9661i9515G9701N8914Q4895Q837h6562B60104
11539B71082j31217C5292M2185g0220n3651d9104B75436K05905j33452H3821a97567
11527F59729A46078J02668o09c7859A01517B7697f5823I2256L9885K07480j01408
11516B38213c185k23655A90172G444R7739J45000F1107L29401b50184C93471A19961
11504B1157P4204J33409K10187O2980k21850A34760J55983P233F7298B0691K36380
11493B57071R4630A53497E7317K80324j60081m7934N7067e9634D55678D2965j5883
11482B7082i4631A83165J58995C3193J54684p7352k8130R9982p7291K53950M5636
11471D04672j15298q8953q903q3122J55982d4773B3278J26962a2211C82336j24995
$$ plain form
11551 192088 -127238 453767 239373 329034 -99515 79701 138615 223510 232347 -86562 260104
11539 271082 139865 35292 77477 -70220 -123871 -49104 275436 481341 347889 83821 -197567
11527 659729 146078 248746 248137 -37859 101517 27697 -65823 92256 132141 339621 238213
11516 238213 -3185 -226840 190172 7444 105183 250183 61107 390508 -250184 393471 119961
11504 21157 95361 228770 438957 501937 280087 134760 290743 297976 67298 20691 257071
11493 257071 351701 153497 57317 337641 177560 129626 186693 -59634 455678 42965 27082
11482 27082 -94631 183165 342160 33193 187877 110525 82395 182377 105086 359036 404672
11471 404672 289374 200421 191518 108396 264378 -44773 23278 150240 -12211 382336 257341
11460B57341c8508C3648J8781L7804P0905o9290L15836H8646J62889E4767a21032
11448i4503B42290A05163J97202A27028J64337H318J83298R064a7815A11942K87887
11437C99829j11546E0188g8389I2851P2425F7374a45490f6354A95763J37495b63
11425A47500o7942a04872G203L0696J12648n2246d8888E9842a4492B3344a22368
11413G3874L18034b65637L8762A41215a46666A23690i8446B26511I9566b2201
11402d8850j5541j0181A67325C3676K249c65E6987a8614j24270j5809M2517B15194
11389h4662B60739J88197A1986a0648j46270G2929a39459c7092A08591K64814
11379C73405e7792j05281I8585J87976E9742b09460B64890b4429j55985B39237
$$ plain form
11460 257341 -38508 33648 52429 90233 161138 91848 407684 88646 251535 54767 -121032
11448 -94503 242290 105163 302365 127028 291365 8318 191616 200680 -17815 111942 399829
11437 399829 288283 50188 -78389 92851 165276 67374 -145490 -66354 195763 333258 -263
11425 147500 79558 -104872 7203 37899 150547 98301 -48888 59842 -14492 23344 -122368
11413 73874 391908 -265637 -226875 141215 -146666 123690 -98446 226511 99566 -22201
11402 -48850 -64391 -74572 167325 33676 35925 -365 56987 -18614 -142884 -158693 -116176 215194
11389 -84662 260739 448936 11986 -10648 -156918 72929 -139459 -37092 108591 373405
11379 373405 -57792 -163073 98585 286561 59742 -209460 264890 -24429 -180414 239237
11368B62337a65214O0688K454a4531F3278J44270f6253C53804a4598j735b725
11356b71626C2494b26293h3327C503J08352D5102f8813k14876E896K4559c56897
11344h4854A04585A8836K3379a54822c4516C1960a49643L6569E4920q280L10041
11333C56681N1696A82324e4057A10693a46781B4916O2105J94140k4720I443g5029
11321h0468D7886f6901l7363A74737e517k5490I5746h2379A78114n5433J51724
11310B74405p5524L2447c82350c0354k04600R1427l3353J7776A55289b42080A15118
11298h9755A17343b33371L5412j23729n6980g8932H9772A6995a12232m0161B79291
11286c28373G995J86925J29218c86557H9827J63023E7837j4609a86936K4793l21739
$$ plain form
11368 262337 -165214 -104526 -102072 -14531 63278 207548 -66253 353804 -14598 -16333 -2725
11356 -271626 32494 -226293 -83327 3503 111855 45102 -68813 -283689 5896 30455 -356897
11344 -84854 104585 18836 42215 -154822 -34516 31960 -149643 -113074 54920 46640 356681
11333 356681 408377 182324 -54057 110693 -146781 24916 87021 281161 256441 9443 -75029
11321 -80468 47886 -66901 -104264 174737 -5517 -31007 95746 -82379 178114 122681 274405
11310 274405 198881 231328 -382350 -30354 -234954 -143527 -176880 -159104 155289 -242080 115118
11298 -89755 117343 -233371 -197959 -321688 -378668 -78932 89772 16995 -112232 -152393 279291
11286 -328373 7995 194920 324138 -386557 89827 252850 57837 43228 -186936 -162143 -483882
11275d83882F4448a65534A16288d95338h4125j86586g1075A25501c61289a62950
11264A05319A6257n12a01494c0310o6556M5155k36729G0456k5306K34674A01265
11252B4052J61386c10903B88290b3695k95086a1053G9180b7869a3789k30987N4048
11241a90728c0210p5515c047r557I969c18548A398N2351K10970f9999J0371A47997
11228a41882A73855c91933J42352q415e6321n0807J505C29756j26151b2859m56336
11217d79195a51342D43832j48408C1173J20590O4267b20892L0774C15411d12419
11206d6771l2279A89088P319a03068A01456a32671A50731g0306E8989a97677i8100
11194H9604f3191B12922G5108b17341r5114C887a66229P9172a9089j12798L6904
$$ plain form
11275 -483882 64448 -165534 116288 -495338 -84125 -270711 -71075 125501 -361289 -162950
11264 105319 16257 15745 -101494 -30310 -96866 -51711 -288440 70456 45150 279824 101265
11252 24052 185438 -310903 288290 -23695 -318781 -11053 79180 -27869 -13789 -244776 -190728
11241 -190728 -30210 -105725 -3047 -12604 9969 -318548 1398 53749 264719 -69999 -59628 147997
11228 -141882 173855 -391933 -249581 -257996 -56321 -107128 -105623 329756 203605 -22859 -479195
11217 -479195 -151342 443832 295424 31173 151763 216030 -220892 -190118 315411 -412419
11206 -46771 -79050 189088 196407 -103068 101456 -132671 150731 -70306 58989 -197677 -98100
11194 89604 -63191 212922 75108 -217341 -312455 3887 -166229 -87057 -19089 -131887 -94983
11183i4983B792g3070F4892J09873g1608k60584a56720A57745p0904J12839q3745
11172A15935b09506j7008i5350A40909j8680E9083I429a06530j58913m2879e7244
11160H1945i5383B57775c3018j25548C8177J03821o2787f4315j88214M8033f5687
11148b19919g185B37169g152j29207B5065b1038k87511F1554c89305h340B24256
11136d55837A90181a66516A07134J60037A24533K7255k9968c5269n3207E4565
11125A31641A3079P8386J29060I2459b0791k8947A86781e0162A25691K48755o7349
11114C07097c1568H2700J04368l8734B8075J48504p8526b58134e2982A32137K6308
11103A58445K04433p979j54974p5351D0547K9864L10295A08149Q0693a24654l9618
$$ plain form
11183 -94983 2792 -73070 64892 174765 -71608 -332192 -156720 157745 86841 199680 115935
11172 115935 -209506 -226514 -95350 140909 122229 59083 9429 -106530 -265443 -308322 -57244
11160 81945 -95383 257775 -33018 -158566 38177 141998 79211 -64315 -252529 -204496 -65687
11148 -219919 -7185 237169 -7152 -136359 25065 -21038 -308549 61554 -389305 -8340 224256
11136 -455837 190181 -166516 107134 267171 124533 151788 121820 -35269 -88476 54565
11125 131641 13079 91465 220525 92459 -20791 -49738 186781 -50162 125691 374446 307097
11114 307097 -31568 82700 187068 148334 28075 176579 98053 -258134 -52982 132137 158445
11103 158445 362878 354899 199925 124574 40547 70411 380706 108149 188842 -124654 -164272
11092a64272B80389a75116A92867Q6986C0599M79224j36790A12737k0052K30383
11082C23068J64099A05858J41868m6101K74712j68713J37896R3733k28697L14461
11072F25017j08946J73946l31065P1460o431m9173l7911p624O0988L80625k37662
11061E33224J53094j18692l858K15756P4645k93967k4956N82709n12668K74336
11051H79623J51837j53502R5503m02684J01305J80359p839r0466J56211j46033
11041G64314L49862k79448R5570j50443J30644o6515o723j7965J94901j24253
11031H89944m2074Q6387k98004J51525J20100p037O6079k1453n2908J25369p9852
11020I38076j05168J31133j99037J76056R9436k65536J64778k78971r4936L07730
$$ plain form
11092 -164272 280389 -175116 192867 279853 30599 509823 373033 112737 92685 323068
11082 323068 487167 105858 247726 201625 476337 307624 445520 539253 310556 625017
11072 625017 516071 690017 358952 430412 423981 374808 336897 329273 390261 770886 533224
11061 533224 686318 567626 563768 779524 854169 560202 535246 1117955 605287 879623
11051 879623 1031460 877958 973461 570777 672082 852441 844602 754136 910347 764314
11041 764314 1114176 834728 930298 779855 910499 843984 837261 819296 1014197 889944
11031 889944 847870 934257 636253 787778 907878 900841 966920 945467 892559 1017928 938076
11020 938076 832908 964041 765004 941060 1040496 774960 939738 660767 565831 873561
11010H73561l35573J50401P4216K62853K15927n34562n6736r5877O10262l80651
11000G83821P7245j72090L41376m34676K83949j38360P5248O0533m6778J37797
10990I68065k21388J40957R0907J03189J80470j58792J33167m2643L24000K39210
10980A757142j17105l9791l4177O50276Q6800J77890J61061O28678j62120L48917
10970C457571R46928k38359n7576m2685m89296m52002k54229o99288P9254l06573
10960A943745K7656N544k6360l5473j63243l34689n2123k69201O0149m09959J46422
10949H92468p3530k97734k00686j00373J11804A597J42214P8682O9095I5762a04072
10937E42589C2046N3618J68693a4461H3543M8025J97630p6842b9293l37299A40957
$$ plain form
11010 873561 537988 688389 762605 1025458 1241385 706823 650087 554210 1164472 783821
11000 783821 861066 688976 1030352 595676 879625 741265 816513 877046 830268 968065
10990 968065 746677 887634 978541 1081730 1262200 1103408 1236575 1193932 1517932 1757142
10980 1757142 1640037 1600246 1566069 2216345 2303145 2481035 2642096 3270774 3108654 3457571
10970 3457571 4404499 4166140 4108564 4065879 3576583 3124581 2870352 2171064 2250318 1943745
10960 1943745 1971401 1976945 1950585 1915112 1751869 1417180 1365057 1095856 1156005 746046 892468
10949 892468 818938 521204 320518 220145 331949 1597 143811 222493 291588 95762 -104072
10937 542589 32046 85664 254357 -14461 83543 131568 329198 252356 -29293 -366592 140957
10925B26396c5422C48789A04827R8527a19732g960D0749P3415a3663f243k10152
10914b16395A6651a60841E0645h6930A19135l1624h7659c2108J0283A82501n4944
10903A27557D013a25092f1054A09178B5942i5560j50588h7174E1817a11586j01067
10892b12653A7617J80874I956R9479J7199b2655H3525C0182N3630a93926A9816
10880g7859k07777A80103c09894a16862F6544c27224a00363A91158b91528B62022
10869b35859c4779j0313b1962j27227g4356k27705j600G7822a58067j21385A46448
10857E4786a93523O9529j90425C14072A30807R6601p7515a58894H3805b16486
10846i3094H7423f8336l3546o6673a759B12397M100o2272P8115g7868B24141J7911
$$ plain form
10925 226396 -35422 348789 104827 203354 -119732 -7960 40749 114164 -13663 -6243 -216395
10914 -216395 16651 -160841 50645 -86930 119135 87511 -87659 -32108 -21825 182501 127557
10903 127557 4013 -125092 -61054 109178 25942 -95560 -246148 -87174 51817 -111586 -212653
10892 -212653 17617 198491 9956 109435 126634 -22655 83525 30182 83812 -193926 19816
10880 -77859 -285636 180103 -309894 -116862 66544 -327224 -100363 191158 -291528 262022
10869 -235859 -34779 -45092 -21962 -149189 -74356 -302061 -303661 77822 -158067 -279452 146448
10857 54786 -193523 -123994 -314419 314072 130807 227408 149893 -158894 83805 -216486
10846 -93094 87423 -68336 -101882 -168555 -1759 212397 216497 154225 232340 -77868 224141 242052
10834B42052h1944B9622a27103G6859F917b27022N5940j1785A06537b10882a2511
10822d2358B70269A25039f8436E8033a90946d8853k93251Q4069b5036j03270j16965
10811b45271A1335d3636o6435H6586C57b66379q1341I0260c90118a87826P3764
10800a14062L4795L12p6318C6113a17830p2329O135B1639c09256C1330K98479
10789C29809A06148M3512a6671k7893j0030k49192A6134c0181j81105C0656R3618
10778A24274C4102b84482I9965b63264B2470a5699j01868G482N2200J89385C4619
10766a50027N7467j23580R3815M9380b3028n6029K8449K0436r5958B8242j1946
10755A6296a69060D7189O0245a24353j09692B07970f3106C7725J90449E5017h736
$$ plain form
10834 242052 -81944 29622 -127103 76859 6917 -227022 -171082 -182867 106537 -210882 -12511
10822 -42358 270269 125039 -68436 58033 -190946 -48853 -342104 -258035 -25036 -128306 -245271
10811 -245271 11335 -43636 -110071 86586 357 -266379 -347720 90260 -390118 -187826 -114062
10800 -114062 -79267 -78955 -155273 36113 -117830 -190159 -184024 21639 -309256 31330 329809
10789 329809 106148 149660 -16671 -44564 -54594 -303786 16134 -30181 -211286 30656 124274
10778 124274 34102 -284482 99965 -263264 22470 -15699 -117567 7482 59682 249067 34619
10766 -150027 -92560 -216140 -122325 -72945 -23028 -79057 -50608 -30172 -126130 28242 16296
10755 16296 -169060 47189 107434 -124353 -234045 207970 -63106 37725 228174 55017 -8736
10743H8015i804j62024L2609C4105c7678l25172a9150g784k20297j12579I4302
10731a50150l5867e2798k5485j21949A34185L8452c69695B01538d7187A16405
10720b21997F7907b65342f806l67674D8474a87976O9608A11393J58729a57595
10709a7557B2819K5008d403j05772L3953F138a12925A78187h5472l40968A26011
10697h3651L5358R367B38840a04648o5725e9843I6339a40768l76159A84887Q9953
10686B74840p1235o6733C3770a52055r7761L9834F8341P2772a03804H6000e8359
10674b7165A59198a76114B76540j17653a69854k09851A4373b09971q1210C78895
10663a4660F4218L3477b50748A31939b41252c226m396A68129K82752A77311i1480
$$ plain form
10743 88015 -9804 -171828 -139219 34105 -37678 -362850 -19150 -7784 -228081 -340660 94302
10731 -150150 -186017 -52798 -78283 -200232 134185 172637 -369695 201538 -47187 116405
10720 -221997 67907 -265342 -6806 -374480 48474 -187976 -118368 111393 270122 -157595
10709 -17557 22819 47827 -4403 -110175 -76222 6138 -112925 178187 -85472 -426440 126011
10697 -83651 -48293 -38926 238840 -104648 -170373 -59843 96339 -140768 -516927 184887 274840
10686 274840 203605 136872 33770 -152055 -249816 -209982 68341 141113 -103804 86000 -58359
10674 -27165 159198 -176114 276540 158887 -169854 -379705 14373 -209971 -291181 378895
10663 -14660 64218 97695 -250748 131939 -241252 -3226 -7622 168129 450881 177311 -91480
10651b28719j26809A56128h8715j87162l8299I4819b92762g2220A36870N085a42826
10639i0631B31040b52034P5965j47676F7348a24988K3917B43885a58045B60935
10628a74038c0459r2033b9675C054J02106B7802e9642k1654n778j9209G0967i8106
10615a21282c6518A8158e5240n5719H3843c3644j58704B13787b0233n7710k82395
10604c60338d3473F3253P6337M2928E5793d5128e786A07714c15230a30654H0942
10592C09362q1089a53417N3530p8282j621a8026E4082f8810r7369m1784j73277
10581c81240f8059D9358K10567H5999b03712P7285k68192c791o4771H9336m178
10570H5158b30026J02928L5281A8610a16956A27073h6129C2796b32462C93637
$$ plain form
10651 -228719 -355528 156128 -88715 -275877 -314176 94819 -292762 -72220 136870 141955 -142826
10639 -90631 231040 -252034 -176069 -323745 67348 -124988 -101071 243885 -158045 260935
10628 -174038 -30459 -122492 -29675 3054 105160 27802 -59642 -81296 -87074 -106283 70967 -98106
10615 -121282 -36518 18158 -55240 -110959 83843 -33644 -192348 213787 -20233 -77943 -360338
10604 -360338 -43473 63253 139590 182518 55793 -45128 -5786 107714 -315230 -130654 80942
10592 309362 228273 -153417 -99887 -178169 -179790 -18026 54082 -68810 -166179 -207963 -381240
10581 -381240 -68059 49358 259925 85999 -203712 -126427 -394619 -3791 -68562 89336 85158
10570 85158 -230026 -127098 -91817 18610 -116956 127073 -86129 32796 -232462 393637
10559c60126B43182D4373b63123Q5784f9172a1344A2945e579j40565I3194J76249
10548B69443p3605R6787b28255g9150k39011i6168l11490h5549p7412Q0951j9704
10537a01714L262j91131a27597j77391A12177J70912o8236H8897M5179a48993
10526a76400A85871m2736k9691b7807j33434N0296A7204i2159A32193J23786a8565
10514A35942B7895J15445H070g7422l6396B27146a25280e1390j36555A82524C2265
10502a527B61731a06945o3211F0150a36159I2574R6399e422A67192b93156k00833
10491d93989a51454I7775N6894J29024h8821j02036G7892k6999K60125n530j50878
10480A54610N0098L37112j47690j61208d0125A75868a9705k58739H3698a28334
$$ plain form
10559 -360126 243182 44373 -263123 -177339 -69172 -11344 12945 -5579 -146144 93194 269443
10548 269443 195838 292625 -228255 -79150 -318161 -96168 -407658 -85549 -162961 -82010 -101714
10537 -101714 -98452 -289583 -127597 -304988 112177 283089 214853 88897 134076 -148993
10526 -176400 185871 143135 113444 -27807 -161241 -110945 17204 -92159 132193 255979 -18565
10514 135942 27895 143340 8070 -77422 -113818 227146 -125280 -51390 -187945 182524 32265
10502 -1527 261731 -106945 -170156 60150 -136159 92574 188973 -5422 167192 -293156 -493989
10491 -493989 -151454 97775 154669 283693 -88821 -190857 77892 50893 311018 305488 154610
10480 154610 204708 541820 394130 232922 -40125 175868 -19705 -278444 83698 -128334
10469A18379a08119A38833n8763j0082J11945M8175D6149P2794a33176m5210e0882
10457i4532c4557A9764f5826j732B624M1676h1142B9178a33019J6942I0349K25858
10445C16207D0013c37015A27713b04126e3771j71017Q2409b7952A45602a22840
10434A606c2499A02977a91917q3850J14631k4248B54225C2084M7287a21979G9989
10422g0633B36561r5443a72797b2642A81876a13287j56794B05764C7602N6023
10412I3625b69598R523F0778k8242M35389a86472C4997b1904e602G6379b9584
10400a19106D40071i1109i973j25660A53931D3666J2950J71443n311J07375n095
10389C25028a8850B72455J62393d6244A38694m1222K11574I1184N9658P9810O4077
$$ plain form
10469 118379 -108119 138833 80070 69988 181933 230108 46149 118943 -133176 -178386 -50882
10457 -94532 -34557 19764 -65826 -67558 2624 44300 -81142 29178 -133019 -116077 90349 316207
10445 316207 40013 -337015 127713 -204126 -53771 -224788 -142379 -27952 145602 -122840
10434 1606 -32499 102977 -191917 -275767 -161136 -185384 254225 32084 79371 -121979 79989
10422 -70633 236561 141118 -172797 -22642 181876 -113287 -270081 205764 37602 93625
10412 93625 -269598 -260075 60778 32536 467925 -186472 34997 -21904 -5602 76379 -29584
10400 -119106 440071 -91109 -9973 -135633 153931 43666 56616 228059 222748 330123 325028
10389 325028 -18850 272455 434848 -46244 138694 97472 309046 91184 150842 230652 294729
10378B94729L0807M6405B3602L86681r9186K89036j45313R2953k19785J59398
10368D87386j48152J1963j46664O38513C07648Q7163J41734k49177o3293G8800
10357B26979j06706P6703b213C52714j5271K0808L23784Q8206j72896K03681B11134
10345A05864L21040J03364j76617J90424j52009J5801B00032p9950K14758o3098
10335B71742j20790m6822A2296N947L33221A01384m629R1086D5683J74227M6049
10324B65959J0039j31676N64102A11659L02148M995j37633i5005A80604j6826
10314A63778O8938p3808C23J1796b28545h7932r446j03001A31393J97035j08788
10303B19640a08598A09356b3374r2633C6856M4715K63059a7471A77677a66475
$$ plain form
10378 294729 325536 371941 23602 410283 311097 600133 454820 547773 327988 487386
10368 487386 339234 351197 204533 843046 307648 394811 536545 287368 224075 78800
10357 226979 120273 196976 -2213 352714 337443 358251 682035 770241 597345 801026 211134
10345 105864 426904 530268 353651 544075 392066 407867 200032 120082 334840 271742
10335 271742 150952 104130 12296 18243 351464 101384 96755 187841 45683 219910 265959
10324 265959 275998 144322 708424 111659 413807 418802 281169 -95005 180604 163778
10314 163778 232716 158908 323 12119 -228545 -87932 -97378 -200379 131393 328428 219640
10303 219640 -108598 109356 -23374 -116007 36856 81571 344630 -17471 177677 -166475
10292C69404j64238a05213K9909p9751r295c887A89675h6508j86886m7466a43173
10280D06363b4301A26490d5427j32053j40003C07415a90964i1725A25515i1704
10269B0691b02664H577f3341j84440d5261E0830K89588A59428L73200k58932K32355
10258E06051l8505A2771K84946P1964F8656a10109A01377A8445R3000L6802F4386
10246D10587a16040k85367J94117C78702e45m38924A21991m6069a3547D32374
10235A05743b23269P8181A70372a19024B64059a21629l2341j73863a26446j32143
10225b58589J17172C3567c12881q612B1617a62664b3920k4013B02802B7912h5136
10213I0881f2260B4795d8412j62255A10406a48923a0177q586j12803k6270G1965
$$ plain form
10292 369404 205166 -105213 -75304 -155055 -164350 -3887 189675 -86508 -273394 -320860 -143173
10280 406363 -24301 126490 -45427 -177480 -317483 307415 -190964 -91725 125515 -91704
10269 20691 -202664 8577 -63341 -247781 -45261 50830 340418 159428 532628 273696 506051
10258 506051 467546 12771 297717 369681 68656 -110109 101377 18445 111445 148247 64386
10246 410587 -116040 -401407 -207290 378702 -545 -439469 121991 75922 -13547 432374
10235 105743 -223269 -145088 170372 -119024 264059 -121629 -153970 -327833 -126446 -258589
10225 -258589 -141417 33567 -312881 -321493 21617 -162664 -23920 -47933 202802 27912 -85136
10213 90881 -62260 24795 -48412 -210667 110406 -148923 -10177 -18763 -131566 -157836 71965
10201B11316b2205m5455B7447g0392C37701b38995R8565A11228H023c11849O9343
10190b42506a18692A9749J87798f1163q4104A46395a39734K2723c1713B4257a01218
10178a3653D9072e254H8461f5036K4142C6859j1486a20658G7075c03711I9174
10166B9812f8827j0794l54026a055j58947P1660j9815d3722b1310I8754i3896
10154b8323j82684K2997b6297c470A463a6969k90147J02232k187m1565J1871d7632
10141a34741A69406c2441A19860b85163i8207l88029a46364a7234I8538b91972
10130a56904M5359j08289c4689j7790m8713m7734p5664d9231k7530l19303H250
10118a62744k10210a02437c047k2953A22187a72907e0005B61200d892j02002A19325
$$ plain form
10201 211316 -22205 -67660 27447 -70392 337701 -238995 -140430 111228 8023 -311849 -242506
10190 -242506 -118692 19749 207547 -61163 -145267 146395 -139734 -117011 -31713 24257 -101218
10178 -13653 49072 -5254 88461 -65036 -40894 36859 25373 -120658 77075 -303711 99174
10166 29812 -68827 -79621 -433647 -1055 -160002 -88342 -108157 -43722 -21310 98754 -93896
10154 -28323 -211007 -188010 -26297 -3470 1463 -16969 -307116 -204884 -207071 -248636 -236765 -47632
10141 -134741 169406 -32441 119860 -285163 -98207 -486236 -146364 -17234 98538 -291972
10130 -156904 -111545 -219834 -34689 -52479 -101192 -148926 -224590 -49231 -76761 -396064 8250
10118 -162744 -372954 -102437 -3047 -26000 122187 -172907 -50005 261200 -4892 -106894 119325
10106a28542j18948a19766p8807A7204f8573r4954b926j41161j10974R6623j19390
10095b77828R6144P7532j5660r5737m8171b3038r4482H5946g3333j60180K2658
10084b10855e5655B8591h5404B5053l942g7669j18167R4619a4018j34790A23182
10072c26881K1318a34596b1240k52011D3953A9161J02901k0274P3542b00871C1559
10060a31557L7726C16031f4955b4015Q844I3230M617i7936L3787D8334a41261
10048a65850j70410A52930f4736J8671B61260I6451b53523i0776j74864f256j86610
10037a92866J3516Q8170j221A18616a8556j06064K5815j9326K9385m3522A77044
10025a36018j79980A6446c2715k73546F2034d0478A92595b93846J18863j00234
$$ plain form
10106 -128542 -247490 -119766 -198573 17204 -68573 -163527 -2926 -144087 -255061 -158438 -277828
10095 -277828 -181684 -104152 -119812 -215549 -263720 -23038 -117520 85946 -73333 -233513 -210855
10084 -210855 -55655 28591 -85404 25053 21111 -77669 -195836 -101217 -14018 -148808 123182
10072 -326881 -305563 -134596 -21240 -273251 43953 19161 122062 101788 175330 -200871 31559
10060 -131557 -93831 316031 -64955 -24015 -15171 93230 97847 -97936 -64149 48334 -141261
10048 -165850 -336260 152930 -64736 -46065 261260 96451 -253523 -90776 -265640 -6256 -192866
10037 -192866 -179350 -91180 -92401 118616 -18556 -124620 -98805 -118131 -88746 -132268 177044
10025 -136018 -315998 16446 -32715 -306261 62034 -40478 192595 -293846 -174983 -275217
10015b75217N698A58379b89428j0860J18476F7134b01384N5998j53772A13179
10004D4993J09226I509c5948J1261I3032c57169c9100j64873e4312A6445b6581
9992A21895k2953b44371j8887A44998a26117L3981a7426A43424a57308g8210f182
9980f3418p0749C01685b46076H0325e8801A7880b35452j88212c645n5731k2049
9969h1425A6515a34907q8830L2282k7712C24896a62196L0076j8128a8843A92303
9957a72163c2527j4466k66476I3044e9666K1245F3324g99k18973F2476K51031
9946C13507d0301A28956a24297A70945b9844o6778k62444i6732C2483d2289I0969
9934a70311A47115F1272a44365o2241A40771P2142b44004l7438Q0910J0136K4959
$$ plain form
10015 -275217 -269519 158379 -289428 -300288 -181812 67134 -201384 -145386 -299158 113179
10004 44993 154219 9509 -35948 -24687 93032 -357169 -39100 -203973 -54312 16445 -26581
9992 121895 98942 -244371 -263258 144998 -126117 -92136 -17426 143424 -157308 -78210 -6182
9980 -63418 -134167 301685 -246076 80325 -58801 17880 -235452 -423664 -3645 -59376 -81425
9969 -81425 16515 -134907 -223737 -191455 -219167 324896 -162196 -132120 -150248 -18843 192303
9957 -172163 -32527 -46993 -313469 93044 -59666 -38421 63324 -799 -219772 62476 313507
9946 313507 -40301 128956 -124297 170945 -29844 -96622 -359066 -96732 32483 -42289 90969
9934 -170311 147115 61272 -144365 -206606 140771 212913 -244004 -281442 -200532 -190396 -165437
9923a65437a2094D6167b24683B79838b57732N8240A73958a88194j26940Q1210
9913b33924i7439k64804B6542J28848N4776I1701l9504b25918e2556l24421a79060
9901I0192d0116o2375a3982j60085A42119f2211l45607J35985R0729D5173e5049
9889a98533A02792k9665b9199l6676A43106c17684i9884C6914r266a6211p5388
9878i1599l02921J96779H8088e2914j39664E1064a66143A33384b26167M7551L1800
9867a46816j33314J02928A06763a21145G0965J32462C4983c4899I290a23877I7646
9855a00536L5303k51525A67283b2147j9263A24613D7034P7543a92542j00573C55
9843b03387A30128a90501C67508c39450A45086a80175e6860A61597c12103A12057
$$ plain form
9923 -165437 -12094 46167 -224683 279838 -257732 -199492 173958 -188194 -315134 -233924
9913 -233924 -97439 -362243 26542 155390 210166 91701 52197 -225918 -52556 -376977 -179060
9901 90192 -40116 -102491 -13982 -174067 142119 -62211 -407818 -271833 -181104 45173 -55049
9889 -198533 102792 73127 -29199 -65875 143106 -317684 -99884 36914 27648 -16211 -91599
9878 -91599 -394520 -197741 88088 -52914 -192578 51064 -166143 133384 -226167 -178616 -146816
9867 -146816 -280130 -177202 106763 -121145 70965 203427 34983 -34899 9290 -123877 97646
9855 -100536 -65233 -316758 167283 -22147 -41410 124613 47034 124577 -192542 -293115 355
9843 -203387 130128 -190501 367508 -339450 145086 -180175 -56860 161597 -312103 112057
9832c49552b653C47879a37814j47460A75227b35490i7775j28257q8206J35589
9822a78649P996B6934a67302A63632D3142a72856o4576B6129J95807b10628f7089
9810e3219a9443m1427m9791j6679j86335a49774e8078j62810g3655P153N965m40358
9798e00895F1685a84387A32158c35409a396n43073A6089b1093m3992k19169J37597
9787a46657j51870a7373G9175b17937A11866r403K61201b26313j8329J11929k46500
9776c79213f1587A05501a18463E1787L4445b36838H7380h731l67053A46869D5538
9764g6554K9792r1304a7471B66241b0589n8572A3782a64092D7757Q9094a12970
9752a30762n4965f5966j28936B96032c5371k59253J1558J36061j77168a52780
$$ plain form
9832 -349552 -2653 347879 -137814 -285274 175227 -235490 -97775 -226032 -314238 -178649
9822 -178649 -170653 26934 -167302 163632 43142 -172856 -237432 26129 221936 -210628 -67089
9810 -53219 -19443 -60870 -110661 -127340 -313675 -149774 -58078 -220888 -73655 -66502 -60537 -500895
9798 -500895 61685 -184387 132158 -335409 -1396 -544469 16089 -21093 -65085 -284254 -146657
9787 -146657 -298527 -17373 79175 -217937 111866 102463 363664 -226313 -244642 -132713 -379213
9776 -379213 -61587 105501 -118463 51787 86232 -236838 87380 -8731 -375784 146869 45538
9764 -76554 -46762 -138066 -17471 266241 -20589 -79161 13782 -164092 47757 136851 -112970
9752 -130762 -185727 -65966 -194902 296032 -35371 -294624 -283066 -147005 -324173 -152780
9741c67209B56923G0214m45L8977A4750a56861A97115i9813m79894d4645E5139
9729a64595k6462k8019K3363e6303A61326b43891E7171c81076b4991k27884Q7832
9718a65043c0836o4138p7124j79160a6282j56895C12734b31701B22378c01025
9707a56809H9220A3106g6945A58058b45547E861c7846l0192A55063c44559i4710
9695C7486b59856R6005q2169b7179j61342j18111A17501a30336j17144d7511B20311
9683C11319A38959c33308l242J24205A80476h8462B26384a64262A9948J10702
9673A30650Q0308j01559a76613r5409o349m4583d1332j05982G0104a22174B51133
9661A09851d7641l7887j52722f2295b3823B00003E58a77372A33717b43350c3608
$$ plain form
9741 -367209 256923 70214 69769 108746 14750 -156861 197115 -99813 -579707 -44645 55139
9729 -164595 -191057 -219076 -195713 -56303 161326 -243891 57171 -381076 -24991 -252875 -165043
9718 -165043 -30836 -94974 -172098 -351258 -16282 -173177 312734 -231701 222378 -301025
9707 -156809 89220 13106 -76945 158058 -245547 5861 -37846 -68038 155063 -344559 -94710
9695 37486 -259856 -163851 -246020 -27179 -188521 -306632 117501 -130336 -247480 -47511 220311
9683 311319 138959 -333308 -336550 -212345 180476 -88462 226384 -164262 19948 130650
9673 130650 210958 109399 -176613 -272022 -278371 -322954 -41332 -147314 70104 -122174 251133
9661 109851 -47641 -85528 -238250 -62295 -23823 200003 558 -177372 133717 -243350 -33608
9649e1333p7559n6693e5867F386c23860e4542A50216L3838a0566j4872l79408
9638d04846J01402l9251A74988b2813F2474r725a50706c3472j96877l4184g7908
9626A07230J74848j33480d88386J27488A94438O379b52569M8292H6331B9473f5937
9614b27581c8901A98849g064j98269B3871a46977K7023M7242m0804l9481k60727
9603d13724J75623o5055k21096b08416L2604B70037F0023c1689j88929L4039g4247
9591a38622B86298d402A78320m6345J38316c03623R0507D0384a02408j66629e7184
9579d458j31789j6078A263L8145J97202H5814e234k40985A60256b4110n2135j62281
9567b38526f1781j88670g7377A51554d86218C46505A61825a81417b6648l96611
$$ plain form
9649 -51333 -128892 -185585 -55867 6386 -323860 -54542 150216 184054 -10566 -25438 -404846
9638 -404846 -303444 -342695 174988 -22813 62474 52749 -150706 -33472 -230349 -264533 -77908
9626 107230 282078 148598 -488386 -360898 194438 200817 -252569 -204277 86331 29473 -65937
9614 -227581 -38901 198849 -7064 -205333 23871 -146977 -119954 -72712 -113516 -152997 -413724
9603 -413724 -238101 -303156 -524252 -208416 -175812 270037 60023 -31689 -220618 -186579 -74247
9591 -138622 286298 -4402 178320 131975 270291 -303623 -213116 40384 -102408 -269037 -57184
9579 -4458 -136247 -152325 1263 39408 236610 85814 -5234 -246219 160256 -24110 -76245 -238526
9567 -238526 -61781 -250451 -77377 151554 -486218 346505 161825 -181417 -26648 -423259
9557d23259e7989j18515k16565A5489M3766d09672a52945o027m9221a004n731
9546f735j65494n873K7483e1819k13211j59518A21892a45515O4549k80493B14133
9534i4793A30704L6915b18212a8840j40925B434a29986M7009K0691K7755p8157
9523a12688j67559Q0770H4498a70911K2110A36312a16254e7184j3487q930A1777
9511a91984L0898e7269d676l69578B6221a40592A34228a51842K6810o4751C39555
9499A47170b21920e7281K3243k41983o888B23219O8512d4887j19758f7394j54654
9488b22048J00443n7012F7681b08544J3756j74913i6350c2392j12613A60472d3715
9476c17955c1141F7104c14750J06768L3306e5235F0677a72667J4166j42128a03587
$$ plain form
9557 -423259 -57989 -176504 -393069 15489 59255 -409672 -152945 -158972 -208193 -1004 -6735
9546 -6735 -172229 -178102 -150619 -51819 -265030 -424548 121892 -145515 -80966 -361459 214133
9534 -94793 130704 167619 -218212 -18840 -159765 2434 -129986 -82977 -62286 -34531 -112688
9523 -112688 -280247 -199477 84498 -170911 -148801 136312 -116254 -57184 -70671 -79601 11777
9511 -191984 -161086 -57269 -4676 -374254 26221 -140592 134228 -151842 -125032 -189783 339555
9499 147170 -221920 -57281 -34038 -276021 -282909 223219 291731 -44887 -164645 -67394 -222048
9488 -222048 -121605 -178617 67681 -208544 -194788 -369701 -96350 -32392 -145005 160472 -43715
9476 -317955 -31141 67104 -314750 -207982 -174676 -55235 60677 -172667 -158501 -300629 -103587
9464e9271A9918b86356Q91b3600j05331A09595c0018F3407a66364d085C16456
9452f683l62342J19151D9934b90422R4801F4367J5688C6917i2478E7166a2263
9440a26118d1510n9566c9103A99313c1786F9207I185c24211I548a46559N8356
9429h8203A1604a63509l1803Q4567p0882B23039a51652O4747k12530Q6774g016
9417a37016B8372c54463h2109C5676a03825a5678r9555E5233k14a22941B93076
9405I412P8642g8509b4547k65853E0499i6650G0138i8681C17079b4896k44328
9394b69224R5569I22M7384e6020B8689a68494j02528C0811d7337J372q5750I0557
9381a04424E6741J8954c39312c0106A13888D9403a99409H5614d3312j85428N1120
$$ plain form
9464 -59271 19918 -286356 -285465 -23600 -128931 109595 -30018 63407 -166364 -4085 316456
9452 -6683 -369025 -249874 49934 -290422 -195621 64367 80055 36917 -92478 57166 -12263
9440 -126118 -41510 -101076 -39103 199313 -31786 69207 9185 -324211 9548 -146559 -88203
9429 -88203 11604 -163509 -195312 -110745 -181627 223039 -151652 -86905 -299435 -212661 -7016
9417 -137016 28372 -354463 -82109 35676 -103825 -15678 -115233 55233 55019 -122941 293076
9405 9412 88054 -78509 -24547 -290400 50499 -96650 70138 -98681 317079 -24896 -269224
9394 -269224 -173655 922 48306 -56020 28689 -168494 -271022 30811 -47337 -45965 -131715 90557
9381 -104424 56741 75695 -339312 -30106 113888 49403 -199409 85614 -43312 -228740 -177620
9370a77620j62012K7382J28939N9087j34513g5914A40116b72540a19806A88736
9359b27595J1870R7479M0651A09088A0027h1923J7061b9962j36120b3271A16190
9347H2464a69162I3829c02580J49003M3119A18455m8051J85714a26006e6591n5390
9336a11981O623l8378I3992a72990H7323R3182d8542I2640L5599h7511A11746
9324a57446j103e9106F7824a47737j09222B30350D8882a04669l5254A22084c87221
9312A57126C4497a5490m4311B0889a7469D5103r125f11909I6829a33766F9633
9300a02762n7742e8824I011b52693P3881c9543j29490b6942I4200a31860C5443
9288e8196j77227j89483G962c08160J12472j0476R10P7160o392d3419m1979m137
$$ plain form
9370 -177620 -339632 -312250 -183311 -124224 -258737 -75914 140116 -272540 -119806 188736
9359 -227595 -215725 -118246 -77595 109088 10027 -81923 -64862 -29962 -166082 -23271 116190
9347 82464 -169162 93829 -302580 -153577 -110458 118455 70404 256118 -126006 -56591 -111981
9336 -111981 -105358 -143736 93992 -172990 87323 180505 -48542 92640 128239 -87511 111746
9324 -157446 -158549 -59106 67824 -147737 -256959 230350 48882 -104669 -139923 122084 -387221
9312 157126 34497 -15490 -59801 20889 -17469 45103 35978 -611909 96829 -133766 69633
9300 -102762 -160504 -58824 9011 -252693 -178812 -39543 -169033 -26942 94200 -131860 35443
9288 -58196 -235423 -424906 7962 -308160 -195688 -206164 -205254 -128094 -134486 -43419 -85398 -89535
9276h9535r4528k10441A21599a27966j63071c8258H2602a39930A18369a59523
9265a63406L7503L9625l4160A36366J50235C9876a19013c9922D5832d37852G5304
9253b07199e6485j78714I7208h1041q5027d1482l42681a64861A63449H0623a11696
9241D1945h5034m102l51555a06202E714c24438L0835C7535h1220A49196b9004
9229a03301B4884a96801m5757j05322A33777b72328f9432q2556H6695h3535A8013
9217i7393j67049D468a57673K5228b4028K26A16735b28029I4969e6147O01A31981
9204a24059j635A8609f7491o6693K8233q905l43096H5487a46758f8912r2616j07910
9192b69438B14539a2603A64799a48423A64901e4910m1616k93983B36456c14912
$$ plain form
9276 -89535 -184063 -394504 121599 -127966 -291037 -38258 82602 -139930 118369 -159523
9265 -163406 -125903 -86278 -120438 136366 286601 39876 -119013 -39922 45832 -437852 75304
9253 -207199 -56485 -235199 97208 -81041 -166068 -41482 -384163 -164861 163449 80623 -111696
9241 41945 -85034 -89136 -440691 -106202 5714 -324438 -293603 37535 -81220 149196 -29004
9229 -103301 24884 -196801 -242558 -347880 133777 -272328 -69432 -151988 86695 -83535 18013
9217 -97393 -264442 4468 -157673 -132445 -24028 -23802 116735 -228029 94969 -56147 -55546 131981
9204 -124059 -125694 18609 -67491 -134184 -105951 -114856 -457952 85487 -146758 -68912 -161528 -269438
9192 -269438 214539 -12603 164799 -148423 164901 -54910 -96526 -390509 236456 -314912
9181b70778E6949e9593j46901I6679f08601b26212M7244H7269a03559k25862I5867
9169A95255j7917K8368b74229J30321J6666F8507L2626F534a77345e6520B24154
9157c91521J24793J22926b3083k5910k05146A10417h6725A30741l6062h4764m4588
9146a29352E7281a41452N0524c0019n2542A5635K85371a59798b1124j80980e0061
9134F6840a68434k17029B8531j2468h6116A11758b14378K6944A58576J58438b1144
9122h4509J0996j89975L5495i9825b2350F1470c5915p3902E7197J01286a71689
9110b40568B0256a3552G9541a05767H4194a59617K8031b2472j80643O5944N9687
9099g7484C7672d1706E5268k7379e4690A63759D1075b08622A11816J5813k2483
$$ plain form
9181 -270778 56949 -59593 -206494 96679 -608601 -226212 -178968 87269 -103559 -329421 95867
9169 195255 177338 205706 -274229 -143908 -127242 68507 101133 6534 -177345 -56520 224154
9157 -391521 -266728 -143802 -23083 -48993 -254139 110417 -86725 130741 94679 -84764 -129352
9146 -129352 57281 -141452 -90928 -30019 -82561 15635 301006 -159798 -21124 -202104 -50061
9134 66840 -168434 -385463 28531 16063 -86116 111758 -214378 -187434 158576 317014 -21144
9122 -84509 -73513 -263488 -227993 -99825 -22350 61470 -35915 -109817 57197 158483 -171689
9110 -240568 20256 -13552 79541 -105767 84194 -159617 -131586 -22472 -203115 -137171 -77484
9099 -77484 37672 -41706 55268 27889 -54690 163759 41075 -208622 111816 127629 105146
9088A05146d5382A86062a36999j58169L8246K6409F8147a41043M4444H5322b5150
9076b2385A18234E0741j2110K5541n419a19833E2310d9026q002K1529A39301g301
9063c0182p964A82825a26630j05782A00261J06494a12739b6009P510l881C81957
9051b43525G6614h4454j56188E0210e04669K30697A80797h3634k572k10308K1907
9040b74607I6272b88238a43403M9650c4686B1843i7370L719k858C31817A65626
9028c20183A00796a49131j52547J19935I0916L20097A91546K1835A3570a68252
9017a84603o9047j50188J88520B05869c95778G2299c91498a68105A32435a42652
9006I7597a87344j58324e9574A8828a70575q410A6885a26668a163o9263A11658
$$ plain form
9088 105146 -45382 186062 -136999 -295168 -256922 -230513 68147 -141043 -96599 85322 -25150
9076 -22385 118234 50741 38631 64172 58753 -119833 52310 -49026 -57028 -35499 139301 -7301
9063 -30182 -38146 182825 -126630 -232412 100261 206755 -112739 -26009 -18499 -22380 381957
9051 -243525 76614 -84454 -240642 50210 -504669 -273972 180797 -83634 -86206 -296514 -274607
9040 -274607 96272 -288238 -143403 -93753 -34686 21843 -97370 -93651 -96509 331817 165626
9028 -320183 100796 -149131 -301678 -181743 90916 411013 191546 213381 13570 -168252
9017 -184603 -253650 -403838 -215318 205869 -395778 72299 -391498 -168105 132435 -142652
9006 97597 -187344 -345668 -59574 18828 -170575 -178985 16885 -126668 -1163 -70426 111658
8994b17608A38609M7957b44516d4189n764j96135h2133j23838j8382J07051c2602
8982a60758l03986b30564p6731D3348a26339A9014L14283a5768j00135A30831
8971i7962b2200l94849g4590A6000e4578q1472A77454b12144i1171E09764e36324
8959a51890b2932l0549j9572l40612a4607J627I2096K08382e4400A38238F8167
8947b30911B3843L9460Q6120a58507j05231M6399r6309a20535j16497Q4789A07720
8935a36190j17953B44100f4060O606k25722C07541m6074b14567k6526C6252Q2803
8924A19055K7869J78186J129648l73928E08135G8324N5120H066k491g1170j86454
8913b57624F9941b93966A13019h0011M959B71889b84780O092a19208A8391b9417
$$ plain form
8994 -217608 138609 186566 -244516 -44189 -49953 -246088 -82133 -205971 -224353 -117302 -32602
8982 -160758 -464744 -230564 -307295 43348 -126339 19014 333297 -15768 -115903 130831
8971 -97962 -22200 -417049 -74590 16000 -54578 -136050 177454 -212144 -91171 509764 -536324
8959 -151890 -22932 -53481 -73053 -413665 -14607 -12980 92096 300478 -54400 138238 68167
8947 -230911 23843 63303 149423 -158507 -263738 -217339 -313648 -120535 -237032 -152243 107720
8935 -136190 -254143 244100 -64060 -57454 -283176 307541 261467 -214567 -241093 36252 119055
8924 119055 146924 325110 1454758 1080830 508135 78324 133444 8066 5575 -71170 -257624
8913 -257624 69941 -293966 113019 -80011 -75052 271889 -284780 -278688 -119208 18391 -29417
8901g9294j97319A3962K56406c38833l2550i7502B34811E5650E88O9483d3200
8889A42424A4769a87195e1013B67565b441o0550p9787B26565d7622A22551J51188
8878B73739b71137a33815K4724P098r0329K7017c0720l41991a6295A19399i8176
8866A31366N3225a69437g6882I9163a60801B17316b47816d697a77E3939p281j8227
8854B8431b61849i3384l03710h0622j50634D5467b50647J21863A87083i1840H7646
$$ plain form
8901 -79294 -276613 13962 270368 -338833 -371383 -97502 234811 55650 588 70071 -43200
8889 142424 14769 -187195 -51013 267565 -2441 -62991 -142778 226565 -47622 122551 273739
8878 273739 -271137 -133815 -109091 -101993 -192322 -165305 -30720 -372711 -16295 119399 -98176
8866 131366 184591 -169437 -76882 99163 -160801 217316 -247816 -4697 -177 53939 46658 28431
8854 28431 -261849 -93384 -397094 -80622 -231256 45467 -250647 -128784 187083 -91840 87646
$$ [...]
##END NTUPLES=NMR SPECTRUM
##END=
