##TITLE=AC1469_13FE002651_8026970_5drCmvS8Dh
##JCAMPDX= 6.0         $$ Bruker NMR JCAMP-DX V2.0
##DATA TYPE= NMR SPECTRUM
##DATA CLASS= NTUPLES
##ORIGIN= BRUKER
##OWNER= Administrator
$$ 1.72 TOPSPIN		Version 2.1
$$ 2013-07-11 20:14:27.124 -0700  Administrator@X
$$ Compression mode = diff/dup
##.OBSERVE FREQUENCY= 400.02188249412
##.OBSERVE NUCLEUS= ^1H
##.ACQUISITION MODE= SIMULTANEOUS (DQD)
##.ACQUISITION SCHEME= undefined
##.AVERAGES= 64
##.DIGITISER RES= 22
##SPECTROMETER/DATA SYSTEM= spect
##.PULSE SEQUENCE= noesygpps1d.comp
##.SOLVENT NAME= COFFEE_meoh
##.SHIFT REFERENCE= INTERNAL, COFFEE_meoh, 1, 14.96061
##AUDIT TRAIL= $$ (NUMBER, WHEN, WHO, WHERE, PROCESS, VERSION, WHAT)
$$ ##TITLE= Audit trail, TOPSPIN		Version 2.1
$$ ##JCAMPDX= 5.01
$$ ##ORIGIN= Bruker BioSpin GmbH
$$ ##OWNER= Administrator
$$ $$ E:\/data/COFFEE/nmr/AC1469_13FE002651_8026970_5drCmvS8Dh/12/pdata/1/auditp.txt
$$ ##AUDIT TRAIL=  $$ (NUMBER, WHEN, WHO, WHERE, PROCESS, VERSION, WHAT)
(   1,<2013-07-11 20:14:22.077 -0700>,<Administrator>,<X>,<go>,<TOPSPIN 2.1>,
      <created by zg
	started at 2013-07-11 20:02:51.927 -0700,
	POWCHK enabled, PULCHK disabled,
       configuration hash MD5:
       C8 4E 4E 5D D3 5C D8 9E 9F 52 82 E0 59 8A DE 15
       data hash MD5: 64K
       22 A2 E8 EC 43 DF B5 45 DC F3 1C AB 0D 2E 8C 6B>)
(   2,<2013-07-11 20:14:25.046 -0700>,<Administrator>,<X>,<proc1d>,<TOPSPIN 2.1>,
      <Start of raw data processing
       efp LB = 0.3 FT_mod = 6 PKNL = 1 PHC0 = 0 PHC1 = 0 SI = 128K 
       data hash MD5: 128K
       D0 E6 A9 1D 3D CF FD 3B D1 D9 8A 80 69 B4 CE 5A>)
(   3,<2013-07-11 20:14:26.046 -0700>,<Administrator>,<X>,<proc1d>,<TOPSPIN 2.1>,
      <pk PHC0 = -82.43042 PHC1 = 0 
       data hash MD5: 128K
       14 80 6D 60 A5 0F 4F 27 CA AD 2C A2 F6 23 4E 6C>)
(   4,<2013-07-11 20:14:26.530 -0700>,<Administrator>,<X>,<proc1d>,<TOPSPIN 2.1>,
      <abs ABSG = 1 
       data hash MD5: 128K
       C5 6C 21 B3 19 9D 12 C7 E3 98 A4 41 52 F9 D6 95>)
(   5,<2013-07-11 20:14:26.624 -0700>,<Administrator>,<X>,<proc1d>,<TOPSPIN 2.1>,
      <abs ABSG = 2 
       data hash MD5: 128K
       EB B2 A2 5F CB 89 9C 92 67 EB A1 DA C2 7E 49 3F>)
(   6,<2013-07-11 20:14:26.718 -0700>,<Administrator>,<X>,<proc1d>,<TOPSPIN 2.1>,
      <abs ABSG = 3 
       data hash MD5: 128K
       0C BB C6 91 F3 74 DD E6 FD 64 A3 4C FB A2 2F 05>)
(   7,<2013-07-11 20:14:26.812 -0700>,<Administrator>,<X>,<proc1d>,<TOPSPIN 2.1>,
      <abs ABSG = 4 
       data hash MD5: 128K
       EB 08 A9 33 93 14 62 8C 47 85 E8 52 75 7A A3 99>)
(   8,<2013-07-11 20:14:26.890 -0700>,<Administrator>,<X>,<proc1d>,<TOPSPIN 2.1>,
      <abs ABSG = 5 
       data hash MD5: 128K
       F0 15 9A 63 10 9B C5 BC 41 90 82 B5 7C E6 C1 34>)
$$ ##END=
$$ 
$$ $$ hash MD5
$$ $$ 59 DC EB 6F 9F 66 A7 1D E0 42 EF 6A 2E 6C F1 56
##$RELAX= 
##$RELAX= 
##$RELAX= 
##$RELAX= 
##$RELAX= 
##$RELAX= 
##$RELAX= 
##$RELAX= 
$$ Bruker specific parameters
$$ --------------------------
##$DU= <E:\>
##$EXPNO= 12
$$ [...]
##$TP07= 0
##$TPNAME0= <>
##$TPNAME1= <>
##$TPNAME2= <>
##$TPNAME3= <>
##$TPNAME4= <>
##$TPNAME5= <>
##$TPNAME6= <>
##$TPNAME7= <>
##$TPOAL= (0..7)
0.5 0.5 0.5 0.5 0.5 0.5 0.5 0.5
##$TPOFFS= (0..7)
0 0 0 0 0 0 0 0
##$TUNHIN= 0
##$TUNHOUT= 0
##$TUNXOUT= 0
##$USERA1= <user>
##$USERA2= <user>
##$USERA3= <user>
##$USERA4= <user>
##$USERA5= <user>
##$V9= 5
##$VALIST= <valist>
##$VCLIST= <CCCCCCCCCCCCCCC>
##$VD= 0
##$VDLIST= <DDDDDDDDDDDDDDD>
##$VPLIST= <PPPPPPPPPPPPPPP>
##$VTLIST= <TTTTTTTTTTTTTTT>
##$WBST= 1024
##$WBSW= 4
##$XGAIN= (0..3)
0 0 0 0
##$XL= 0
##$YL= 0
##$YMAX_a= 6574742
##$YMIN_a= -12348567
##$ZGOPTNS= <>
##$ZL1= 120
##$ZL2= 120
##$ZL3= 120
##$ZL4= 120
##$ABSF1= 14.96061
##$ABSF2= -5.597571
##$ABSG= 5
##$ABSL= 3
##$ALPHA= 0
##$AQORDER= 0
##$ASSFAC= 0
##$ASSFACI= 0
##$ASSFACX= 0
##$ASSWID= 0
##$AUNMP= <proc_prof1d_extract.lims>
##$AXLEFT= 0
##$AXNAME= <>
##$AXNUC= <1H>
##$AXRIGHT= 0
##$AXTYPE= 0
##$AXUNIT= <>
##$AZFE= 0.1
##$AZFW= 0.1
##$BCFW= 0
##$BC_mod= 0
##$BYTORDP= 0
##$COROFFS= 0
##$CY= 15
##$DATMOD= 1
##$DC= 0
##$DFILT= <>
##$DTYPP= 0
##$F1P= 0
##$F2P= 0
##$FCOR= 0.5
##$FTSIZE= 131072
##$FT_mod= 6
##$GAMMA= 0
##$GB= 0
##$INTBC= 1
##$INTSCL= 1
##$ISEN= 128
##$LB= 0.3
##$LEV0= 0
##$LPBIN= 0
##$MAXI= 10000
##$MC2= 0
##$MEAN= 0
##$ME_mod= 0
##$MI= 0
##$NCOEF= 0
##$NC_proc= -2
##$NLEV= 6
##$NOISF1= 0
##$NOISF2= 0
##$NSP= 0
##$NTH_PI= 0
##$NZP= 0
##$OFFSET= 14.96061
##$PC= 1
##$PHC0= -82.43042
##$PHC1= 0
##$PH_mod= 1
##$PKNL= yes
##$PPARMOD= 0
##$PPDIAG= 0
##$PPIPTYP= 0
##$PPMPNUM= 2147483647
##$PPRESOL= 1
##$PSCAL= 4
##$PSIGN= 0
##$PYNMP= <proc.py>
##$REVERSE= no
##$SF= 400.020009794569
##$SI= 131072
##$SIGF1= 0
##$SIGF2= 0
##$SINO= 400
##$SIOLD= 131072
##$SPECTYP= <>
##$SREGLST= <1H.CDCl3>
##$SSB= 0
##$STSI= 131072
##$STSR= 0
##$SW_p= 8223.68421052631
##$SYMM= 0
##$S_DEV= 0
##$TDeff= 65536
##$TDoff= 0
##$TI= <>
##$TILT= no
##$TM1= 0
##$TM2= 0
##$TOPLEV= 0
##$USERP1= <user>
##$USERP2= <user>
##$USERP3= <user>
##$USERP4= <user>
##$USERP5= <user>
##$WDW= 1
##$XDIM= 131072
##$YMAX_p= 393814450
##$YMIN_p= -10836
##$CURPLOT= <Network HP LaserJet P1505>
##$CURPRIN= <$Network HP LaserJet P1505>
##$DFORMAT= <normdp>
##$LAYOUT= <+/1D_H.xwp>
##$LFORMAT= <normlp>
##$PFORMAT= <normpl>
##$SURQMSG= 1
$$ End of Bruker specific parameters
$$ ---------------------------------
##NTUPLES= NMR SPECTRUM
##VAR_NAME=  FREQUENCY,     SPECTRUM/REAL,   SPECTRUM/IMAG
##SYMBOL=    X,             R,               I
##VAR_TYPE=  INDEPENDENT,   DEPENDENT,       DEPENDENT
##VAR_FORM=  AFFN,          ASDF,            ASDF
##VAR_DIM=   131072,        131072,          131072
##UNITS=     HZ,            ARBITRARY UNITS, ARBITRARY UNITS
##FACTOR=    0.0627417313425164, 1,          1
##FIRST=     8223.62146879497, -1541,        -56780
##LAST=      0,             -708,            -58063
##MIN=       0,             -10836,          0
##MAX=       8223.62146879497, 393814450,    0
$$ Real data points
##PAGE= N=1
##DATA TABLE= (X++(R..R)), XYDATA
$$ [...]
67894 104452 103620 102855 101662 100059 98402 96634 94328 91442 88473 85791 83263 80729 78496 77123 76807
67879 76807 77094 77166 76462 75184 74118 73926 74616 75713 76654 76982 76558 75875 75842 76837 78187 78927 78849 78424 78010
67860 78010 77713 77726 78065 78055 76889 74848 73188 72598 72458 71957 71185 70556 69848 68597 67109 66269 66414 67070
67842 67070 67828 68889 70591 72849 75260 77451 79243 80771 82603 85384 89187 93388 97426 101510 106317
67827 106317 112044 117968 123012 126627 129105 131109 133018 134695 135668 135366 133283 129204 123484 117030 110867
67812 110867 105646 101458 97898 94285 90069 85263 80449 76285 73086 70910 69756 69433 69366 68832 67456
67797 67456 65337 62790 60169 57871 56204 55154 54429 53793 53291 53123 53456 54296 55421 56462 57198 57851
67781 57851 58936 60728 62892 64609 65088 64179 62703 61993 62757 64351 65493 65750 65976 67153 69197 71205
67765 71205 72670 73984 75785 78081 80152 81155 80807 79613 78453 77914 78012 78492 79166 79824 80095 79819 79460
67748 79460 79704 80505 80919 80128 78398 76691 75517 74493 73008 70957 68727 66727 65096 63722 62396
67733 62396 61013 59717 58789 58332 58162 58027 57795 57308 56302 54763 53282 52690 53159 53842 53633 52304 50731
67716 50731 49984 50278 50899 51103 50937 51067 51901 53088 53915 54039 53680 53239 52942 52840 53005 53582 54641 56005
67698 56005 57281 58183 58781 59253 59450 59024 58124 57560 57910 58755 59191 58881 58127 57149 55967 54914 54536 54771
67680 54771 54958 54926 55403 56916 58852 60189 60615 60357 59409 57755 56064 55267 55498 56122 56731 57410 58021 58099
67662 58099 57642 57233 57101 56761 55961 55345 55617 56481 56979 56629 55851 55467 56047 57517 59167 60331 61147 62197
67644 62197 63259 63166 61365 58954 57484 57245 57530 58053 59081 60388 61264 61686 62480 64022 65641 66651
67628 66651 67182 67522 67383 66511 65478 65121 65461 65832 65932 66177 66996 68249 69370 69832 69504 68790 68300 68187
67610 68187 67972 67230 66198 65416 65070 65108 65694 66898 68066 68227 67329 66412 66221 66159 65126 63063 61117 60335
67592 60335 60699 61501 62260 62958 63576 63765 63168 61952 60832 60468 60875 61489 61740 61505 61056 60712 60553 60428
67574 60428 60250 60261 60880 62196 63717 64774 65083 64756 63928 62651 61106 59592 58241 56978 55825 54959
67558 54959 54405 53927 53430 53203 53569 54470 55561 56555 57273 57534 57291 56819 56527 56611 57010 57639 58410 59056 59143
67539 59143 58372 56849 55117 53947 53909 54895 56140 56926 57220 57465 57836 58030 57734 57016 56113 55101 53932
67522 53932 52665 51528 50848 50906 51744 53028 54245 55059 55351 55042 54211 53409 53386 54206 54972 54810 53918 53278
67504 53278 53471 54231 55118 56079 57186 58265 59115 59800 60385 60526 59734 58061 56243 55087 54845 55217 55789
67487 55789 56372 57110 58291 59946 61526 62181 61549 60190 59058 58572 58363 57877 56966 55902 55132 55210 56671
67470 56671 59509 62773 65020 65460 64576 63548 63135 63203 63223 62997 62790 62898 63294 63722 63999 64058 63782 63091 62298
67451 62298 62152 63230 65275 67336 68564 68761 68162 67023 65599 64318 63654 63750 64353 65226 66511 68511
67435 68511 71064 73298 74224 73584 71987 70167 68346 66476 64827 63918 63833 63973 63654 62742 61617 60777 60592
67418 60592 61137 61994 62393 61898 60849 59892 59178 58382 57424 56769 56841 57489 58258 59019 60037 61437 62817 63535
67400 63535 63339 62638 62132 62191 62630 63019 63074 62751 62212 61812 61876 62261 62286 61427 59995 58813 58267 58064 57901 57854
67380 57854 57963 57916 57559 57376 57950 59078 59958 60254 60513 61327 62462 63092 62716 61580 60325 59478 59238 59514
67362 59514 60021 60478 60817 61194 61721 62247 62500 62447 62369 62475 62575 62328 61798 61498 61736 62161 62193 61780 61448 61659
67342 61659 62454 63695 65225 66597 67102 66528 65737 65971 67518 69437 70683 71157 71497 72184 73195 74256
67326 74256 75037 75222 74740 73966 73419 73226 73146 73068 73132 73298 73210 72691 72060 71683 71470 71102 70518 69877 69288 69030
67306 69030 69795 72064 75153 77461 77978 77171 76194 75623 75306 75060 74979 75162 75652 76629 78211 79928 80781 80109
67288 80109 78238 76115 74407 73101 71864 70581 69486 68843 68565 68315 68051 68331 69769 72175 74506 75808
67272 75808 76059 75948 76105 76754 77818 78908 79304 78479 76858 75697 75909 77168 78385 78880 78765 78401 77950
67255 77950 77580 77682 78511 79766 80800 81292 81502 81813 82190 82206 81594 80625 79864 79573 79495 79310 79166 79538 80554
67236 80554 81667 82171 81946 81618 82044 83654 86097 88371 89471 89135 88016 86938 86140 85404 84771 84657 85177
67219 85177 85805 86008 85951 86154 86647 86927 86828 86894 87528 88134 87704 86276 85219 85705 87277 88446 88566 88441 88956
67200 88956 89779 89962 89463 89340 90380 92147 93607 94322 94661 95102 95753 96522 97426 98528 99710 100661 101136
67183 101136 101177 100971 100539 99714 98501 97277 96432 95910 95410 94999 95163 96101 97296 98057 98392 99096 100931 103814
67165 103814 106793 108789 109448 109338 109308 109716 110374 111076 111888 112886 113912 114730 115176 115092 114389 113319 112411 111924
67147 111924 111620 111276 111160 111768 113264 115397 117711 119594 120433 120163 119449 119009 118904 118871 119049 119826 121106
67130 121106 122387 123555 125021 126927 128822 130346 131730 133315 134958 136246 137035 137527 138005 138707 139738
67115 139738 140940 142066 143176 144512 145856 146466 145972 144991 144464 144704 145450 146548 148014 149594 150842 151685
67099 151685 152486 153525 154758 156104 157593 159114 160375 161243 161887 162493 163066 163658 164551 166032 168099 170473
67083 170473 172814 174897 176701 178397 180181 182068 183904 185516 186803 187710 188275 188630 188841 188897 189053 189949
67067 189949 191951 194455 196369 197473 198834 201550 205377 209017 211616 213581 215906 218973 222186 224621
67053 224621 225921 226576 227407 228845 230777 232956 235341 237944 240590 243038 245275 247515 249937 252531 255195
67038 255195 257878 260626 263507 266458 269233 271666 274024 276863 280366 284038 287269 290052 292860 295956
67024 295956 299187 302474 306069 310175 314593 318959 323146 327243 331318 335414 339663 344100 348435 352320
67010 352320 355907 359916 364965 370925 377064 382802 388238 393925 400205 406796 413046 418550 423505 428458
66996 428458 433793 439524 445520 451760 458299 465120 472130 479280 486580 494017 501499 508895 516082 522985
66982 522985 529698 536585 544150 552699 562095 571919 581857 591882 602035 612152 621960 631479 641142
66969 641142 651363 662025 672633 682962 693352 704261 715795 727917 740918 755257 770898
66958 770898 787079 802903 817998 832579 847100 861932 877120 892329 907290 922461 938921
66947 938921 957302 977107 997421 1018040 1039363 1061359 1083323 1104826 1126345 1148649 1172011
66936 1172011 1196313 1221525 1247596 1274134 1300662 1327137 1353899 1381174 1408933 1437162 1465967
66925 1465967 1495415 1525506 1556207 1587292 1618355 1649326 1680810 1713458 1747063 1780790 1814282
66914 1814282 1848056 1882711 1918313 1954719 1991913 2029603 2066968 2103266 2138441 2172845 2206732
66903 2206732 2240397 2274369 2308788 2342838 2375435 2406413 2436433 2465788 2493974 2520547 2545751
66892 2545751 2570018 2593298 2615130 2635044 2652704 2668022 2681346 2693140 2703299 2711204 2716626 2720106
66880 2720106 2722057 2722026 2719352 2714147 2707007 2698009 2686664 2672800 2656870 2639345 2620361 2600094 2578908
66867 2578908 2556901 2533649 2508653 2481777 2453089 2422645 2390685 2357874 2325018 2292605 2260680
66856 2260680 2229010 2197207 2164815 2131466 2097006 2061518 2025335 1988967 1952799 1916871 1881177
66845 1881177 1846096 1812178 1779411 1747081 1714512 1681688 1649017 1616845 1585431 1555045 1525680
66834 1525680 1496806 1467788 1438494 1409314 1380732 1353128 1326787 1301711 1277453 1253474 1229681
66823 1229681 1206351 1183566 1161044 1138532 1116076 1093847 1071988 1050739 1030440 1011217 992803
66812 992803 974842 957277 940345 924238 908840 893705 878317 862387 845971 829296 812601
66801 812601 796232 780716 766419 753096 740041 726812 713684 701303 689979 679383 668864
66790 668864 657989 646855 635909 625479 615542 605903 596425 587002 577571 568364 559888 552246 544684
66777 544684 536308 527200 518281 510016 501912 493528 485373 478249 472177 466559 461161 456201 451543 446450
66763 446450 440391 433653 426919 420570 414641 409137 404062 399275 394627 390236 386373 382991 379523 375290
66749 375290 370112 364539 359429 355280 351900 348692 345266 341771 338676 336183 333888 331038 327245 322888
66735 322888 318727 315133 311883 308645 305376 302115 298705 295032 291358 288077 285188 282320 279276 276239
66721 276239 273372 270497 267347 263949 260574 257466 254719 252308 250108 247947 245804 243891 242462 241497
66707 241497 240622 239314 237241 234505 231571 228902 226609 224473 222273 219956 217532 214965 212269 209603
66693 209603 207197 205232 203772 202715 201797 200773 199598 198334 196906 195143 193080 191005 189110 187289
66679 187289 185399 183534 181924 180679 179751 179018 178374 177864 177746 178123 178420 177601 175200 171909 168833 166409
66663 166409 164407 162744 161735 161499 161619 161580 161196 160511 159552 158395 157268 156410 155922 155782 155826 155676 154928 153530
66645 153530 151820 150156 148728 147730 147360 147495 147611 147284 146567 145726 144811 143707 142460 141321 140492 139934 139284
66628 139284 138002 135916 133715 132449 132287 132165 131093 129426 128282 127999 127920 127612 127464 127768 127956 127271 125842
66611 125842 124589 124192 124547 125098 125293 124775 123465 121575 119437 117291 115354 113966 113424 113635 114158 114665
66595 114665 115201 115880 116501 116684 116385 116020 115889 115616 114494 112464 110387 109122 108579 108066 107392 107100 107551
66578 107551 108299 108684 108678 108806 109399 110260 110926 110941 109948 107871 105155 102605 100819 99791 99158 98880 99573 101878
66560 101878 105317 108036 108200 105783 102619 100499 99640 99204 98777 98691 99118 99567 99410 98523 97292 96303 96027
66543 96027 96493 97170 97487 97507 97774 98453 99031 99012 98508 97932 97440 97012 96763 96786 96830 96532 95965 95668 96031 96813
66523 96813 97328 97039 96003 94826 94106 93800 93200 91660 89329 87056 85628 85162 85216 85318 85350 85473 85721 85757
66505 85757 85149 83911 82571 81656 81249 81179 81415 82036 82907 83659 83999 83813 83022 81634 79992 78662 77895 77399
66487 77399 76851 76457 76746 77847 79284 80484 81257 81669 81706 81291 80474 79396 78133 76825 75923 76007 77208
66470 77208 79006 80679 81754 81990 81289 79951 78800 78655 79615 81090 82469 83484 84045 84132 83883 83487 82886
66453 82886 81899 80710 79836 79460 79177 78681 78333 78601 79189 79177 78072 76356 74957 74463 74898 75971 77305
66436 77305 78530 79323 79527 79298 79104 79360 79991 80510 80594 80422 80330 80388 80447 80330 79737 78367 76478 75060 74823
66417 74823 75164 74771 73275 71705 71086 71242 71347 71176 71192 71592 71889 71547 70702 70059 70190 71055 72166 73163
66399 73163 74132 75260 76283 76550 75676 73950 72063 70659 70170 70642 71553 72140 72224 72425 73271 74412 75094
66382 75094 75135 74947 74747 74358 73726 73048 72356 71560 71052 71589 73261 75121 76281 76889 77516 78023 77747 76563
66364 76563 75018 73465 71816 70248 69439 69752 70758 71919 73231 74713 75775 75797 75103 74651 74740 74756 74352
66347 74352 74167 74921 76270 77198 77374 77450 77937 78412 78245 77670 77486 77772 77593 76294 74534 73500 73353 73202
66329 73202 72535 71868 71663 71397 70375 68950 68115 68110 68296 68368 68772 69630 70102 69415 68069 67396 68158 70016 72116
66310 72116 73701 74283 73796 72694 71646 71035 70862 71006 71316 71547 71506 71298 71232 71486 71965 72424 72685 72831 73150
66291 73150 73678 73809 72873 71236 70203 70417 70969 70720 69966 69913 70821 71734 72019 72077 72323 72462 72231 72026 72216
66272 72216 72452 72272 71844 71563 71394 71255 71613 72956 74901 76437 76961 76578 75642 74613 74136 74533 75221 75258
66254 75258 74505 73679 73270 73046 72772 72716 73136 73776 74237 74475 74587 74460 74003 73473 73220 73255 73412 73763 74495 75445
66234 75445 76087 76038 75394 74534 73798 73370 73293 73468 73711 73892 74022 74171 74327 74360 74185 73961 74033 74621 75576 76529
66214 76529 77211 77541 77515 77197 76809 76616 76627 76564 76243 75831 75619 75652 75741 75763 75768 75799 75781 75646 75448 75267 75087 74900
66192 74900 74866 75201 75881 76647 77345 78060 78815 79394 79681 79961 80535 81209 81583 81735 82069 82443 82106 80761 79119
66173 79119 77984 77313 76683 76242 76480 77315 78126 78647 79168 79858 80503 80993 81430 81623 81105 79887 78620 77683
66155 77683 76683 75252 73915 73583 74408 75582 76227 76132 75707 75511 75850 76678 77838 79359 81299 83286 84612
66138 84612 84934 84631 84294 84192 84369 84849 85370 85293 84300 83003 82451 83034 84231 85367 86222 86925 87550 87972
66120 87972 87992 87602 87161 87134 87527 87796 87535 87017 86806 87056 87586 88433 89909 92086 94606 96969 98763 99652
66102 99652 99531 98753 97943 97515 97516 97827 98257 98527 98441 98094 97700 97319 96931 96579 96141 95256 93921 92949 93229 94558
66082 94558 95818 96314 96344 96406 96565 96827 97425 98281 98747 98431 97859 97782 98056 97775 96368 94125 91752 89843
66064 89843 88713 88343 88408 88638 89095 89874 90653 90926 90673 90393 90378 90326 89872 89193 88816 88972 89416 89893 90483 91391
66044 91391 92550 93556 93958 93523 92352 90962 90124 90263 90899 90992 90049 88588 87365 86591 86293 86935 88957
66027 88957 91906 94777 97223 99668 102171 104029 104828 105126 105605 106185 106502 106737 107328 108263 109242 110205 111107
66010 111107 111534 111200 110594 110409 110545 110432 110266 111033 113126 115644 117451 118444 119484 121420 124466 128285
65994 128285 132409 136603 140855 144920 148156 150224 151785 153934 156839 159418 160464 159708 157649 154848
65980 154848 151643 148256 144896 141811 139163 136594 133182 128432 123356 119819 118525 118217 117238 115322 113436
65965 113436 112363 112087 112243 112528 112683 112594 112477 112635 113138 114006 115552 118121 121485 124855 127569 129535 131029
65948 131029 132351 133710 135182 136620 137745 138414 138790 139215 139936 140911 141891 142763 143736 144984 146196 146794
65932 146794 146722 146677 147342 148674 150187 151704 153451 155590 158005 160523 163057 165526 167846 170067 172401
65917 172401 175131 178500 182564 187010 191273 194902 197745 199784 201028 201619 201754 201428 200619 199789 199741 200672
65901 200672 201810 202308 202053 201220 199593 197021 194176 192019 190607 189088 186806 183686 179589 174245 168156
65886 168156 162806 159359 157497 155957 153942 151579 149229 146850 144189 141373 139091 138011 138057 138488 138825
65871 138825 139374 140516 141822 142408 141980 140944 139580 137814 135824 134147 133004 132069 131116 130266 129439 128280
65855 128280 127048 126776 127988 129828 131167 132107 133603 135918 138257 139878 140821 141529 142338 143416 144691
65840 144691 145736 146174 146297 146833 147997 149185 149759 149771 149746 150111 151045 152620 154825 157573 160836 164636 168785
65823 168785 172810 176291 179202 181805 184305 186713 188980 191106 193081 194718 195626 195435 194114 191996 189427
65808 189427 186600 183853 181861 181074 180969 180312 178448 176105 174602 174335 174369 173594 171955 170327 169390 169090
65792 169090 169211 170009 171880 174780 178486 183256 189598 197335 205567 213871 222944 233608 245599 257872
65778 257872 269726 280943 290974 298756 303455 304907 303154 298118 289988 279600 268039 256039 243947
65765 243947 232147 221259 211926 204497 198947 195176 193384 193965 196928 201684 207704 215167 224534 235612
65751 235612 247629 260268 274063 289522 306337 323762 341379 358997 376018 391333 403879
65740 403879 413117 418995 421664 421129 417038 408876 396537 380686 362533 343332 324084 305381 287341
65727 287341 269841 253022 237352 223087 209956 197727 186831 177960 171066 165245 159715 154603
65715 154603 150540 147734 145646 143491 140911 138204 135969 134485 133402 132191 130844 129901 129663 129661 129180 128151
65699 128151 127182 126705 126488 126144 125783 125824 126317 126863 127242 127790 129036 131185 134032 137184 140229 142963 145704
65682 145704 149239 154167 160380 167345 174829 183077 192433 203098 215312 229397 245479 263336 282676
65669 282676 303371 325281 347933 370483 391930 411411 428438 442974 455214 465226 472906 478262
65657 478262 481563 483131 483116 481629 479102 476423 474666 474575 476180 478892 481954 484727 486526 486500 483927 478556
65641 478556 470391 459299 445198 428501 409930 389801 368021 344952 321776 299633 278725 258695
65629 258695 239677 222479 207740 195319 184705 175731 168630 163400 159334 155433 151295 147389 144251
65616 144251 141694 139175 136798 135308 134925 134788 133908 132274 130592 129257 128095 126933 125906 125274 125318 126359
65600 126359 128390 130669 132138 132330 131632 130640 129681 129071 129324 130721 132905 135268 137673 140506 144080 148230
65584 148230 152633 157354 162911 169802 178091 187628 198616 211716 227406 245354 264626 284488 304803
65571 304803 325609 346427 366113 383359 397329 407831 414940 418563 418470 414663 407500 397404 384626
65558 384626 369341 351798 332337 311553 290557 270665 252504 235644 219459 204137 190518
65547 190518 179110 169752 162171 156317 152064 148951 146449 144316 142572 141325 140684 140647 141020 141558 142139
65532 142139 142642 142753 142215 141153 139841 138204 135975 133339 130938 129154 127792 126562 125383 124038 122081
65517 122081 119449 116747 114521 112614 110668 108876 107713 107152 106778 106599 107101 108413 109889 110734 110701 110105
65501 110105 109501 109484 110409 112039 113735 115215 116918 119338 122231 124808 126633 128008 129450 131129 132958
65486 132958 135010 137562 140710 144129 147293 149869 151816 153131 153664 153277 152108 150496 148599 146238 143210
65471 143210 139640 135851 131997 128081 124349 121357 119422 118227 117239 116423 116190 116647 117199 117060 115940 114196
65455 114196 112533 111681 112009 113180 114367 115090 115686 116753 118315 119864 120993 121606 121629 121073 120415 120480 121715
65438 121715 123916 126691 129792 132869 135374 137062 138230 139169 139734 139790 139749 140099 140552 140214 138679 136503
65422 136503 134460 132747 131092 129379 127872 126941 126774 127271 128119 128985 129726 130411 131130 131831 132370 132623 132562
65405 132562 132315 132186 132557 133674 135466 137527 139264 140313 140993 142266 144921 148648 152127 154208 154899
65390 154899 155048 155252 155357 154960 154011 152776 151522 150534 150186 150599 151237 151252 150316 148793 147073 145200 143404
65373 143404 142467 142962 144403 145758 146743 148026 150094 152571 154885 157088 159628 162696 166238 170340 175245
65358 175245 181084 187921 195886 204947 214683 224546 234158 243100 250637 256158 259798 262164 263466 263320
65344 263320 261474 258305 254453 250292 245916 241319 236379 230889 224768 218108 210933 203275 195610 188887
65330 188887 183762 179918 176468 172917 169467 166515 164185 162388 160951 159560 157798 155436 152563 149374
65316 149374 145965 142505 139425 137180 135792 134844 133995 133332 133062 132962 132349 130713 128330 126181 125217 125675
65300 125675 127058 128712 130403 132328 134705 137479 140374 143048 145115 146213 146228 145438 144346 143397 142833
65285 142833 142602 142297 141380 139714 137776 136097 134657 133122 131606 130743 130953 131901 132784 132914 132036 130442
65269 130442 128880 128042 128004 128300 128500 128390 127665 126098 124190 123132 123688 125469 127542 129325 130630 131410
65253 131410 131977 132987 134594 135955 136177 135463 134657 133952 132848 131239 129720 128786 128408 128461 128803 128866 127990
65236 127990 126440 125357 125361 125849 126063 126128 126481 126892 126789 126201 125634 125177 124375 123040 121645 120758 120376 119973
65218 119973 119117 117965 117164 117157 117603 117753 117449 117371 118100 119259 119902 119540 118515 117541 117146 117408 117950 118301 118411
65199 118411 118649 119180 119660 119741 119545 119386 119381 119638 120468 121982 123739 125258 126595 127997 129284 130156 130897 132077
65181 132077 133626 134825 135268 135250 135163 135096 135108 135292 135417 135062 134348 133958 134151 134290 133798 133075 132965 133638 134563
65162 134563 135394 136242 137155 137874 138277 138557 138704 138219 136731 134772 133536 133848 135620 138364 141840 145969
65146 145969 150424 154833 159271 164042 168940 173324 177153 181309 186400 191725 196127 199537 202942 206994
65132 206994 211375 215521 219149 221920 223400 223692 223452 222943 221655 219360 216936 215571 215452 215753 215630 214748
65116 214748 213122 210987 208705 206355 203556 200042 196171 192404 188575 184218 179457 174940 170959 167235
65102 167235 163586 160161 156901 153391 149548 145996 143453 142049 141470 141460 141937 142863 144145 145484 146254 145975
65086 145975 145036 144504 144914 145583 145476 144382 142849 141335 139968 138963 138612 138772 138858 138537 138066 137817 137741 137499
65068 137499 136901 136030 135116 134388 133881 133284 132220 130862 130059 130531 132026 133589 134632 135419 136376 137255 137304
65051 137304 136195 134463 132938 131910 131001 129751 128140 126580 125574 125420 126038 126862 127064 126165 124502 122884
65035 122884 121693 120535 118951 117200 116017 115629 115469 114957 114183 113573 113204 112896 112768 113201 114154 115000 115321
65018 115321 115530 116412 118155 120182 121889 123283 124825 126799 128987 130929 132488 134027 135963 138209 140254
65003 140254 141867 143449 145551 148229 151047 153529 155368 156374 156532 156103 155408 154616 153917 153716 154290 155294
64987 155294 156043 156320 156567 157245 158368 159807 161567 163497 165065 165776 165669 165196 164757 164528 164485 164320 163471
64970 163471 161539 158618 155101 151362 147803 144910 142884 141383 139977 138702 137874 137483 137235 137074 137225
64955 137225 137716 138315 138927 139502 139480 137941 134732 131019 128266 126858 126125 125497 125138 125435 126349 127496 128690
64938 128690 130094 131833 133624 134952 135619 135886 135996 135794 135115 134299 133891 133874 133705 133182 132707 132503 132200 131564
64920 131564 131052 131023 130924 130044 128787 128287 128774 129251 128998 128600 129065 130548 132462 134322 135919 137057 137777
64903 137777 138673 140456 143293 146957 151462 157006 163387 170054 176813 183955 191539 198999 205748 211808
64889 211808 217566 223126 228229 232671 236560 240174 243617 246488 247881 247043 244231 240614 237086 233393
64875 233393 228793 223380 218234 214237 211141 208070 204652 201419 199169 198209 198194 198568 198979 199260 199146 198265
64859 198265 196520 194283 191980 189536 186457 182409 177553 172314 167115 162383 158497 155502 152992 150455
64845 150455 147734 145112 143061 141953 141797 142140 142334 142055 141458 140808 140190 139726 139763 140468 141342 141513 140605 139146
64827 139146 138062 137938 138732 140004 141366 142817 144714 147319 150446 153672 156796 159877 162949 165970 169092
64812 169092 172643 176786 181472 186714 192562 198676 204310 208978 212841 216157 218625 219687 219314 218025
64798 218025 216111 213240 209030 203793 198507 194077 190641 187600 184366 181117 178687 177554 177189 176692 175984
64783 175984 175904 177020 178741 179867 179827 179074 178437 178414 179131 180611 182789 185362 187901 190283 192901 196338
64767 196338 200833 206140 211876 217769 223564 228969 233939 238864 244139 249568 254498 258639 262501 266840
64753 266840 271839 276986 281662 285614 288905 291610 293640 294731 294487 292500 288617 283151 276766 269984
64739 269984 262776 254744 245793 236566 228108 221149 215768 211685 208674 206636 205477 205124 205625 207054 209202
64724 209202 211436 213018 213641 213638 213636 214103 215246 217188 220000 223584 227711 232198 236821 241077 244341 246412
64708 246412 247634 248223 247753 245575 241573 236217 230086 223663 217413 211578 205972 200392 195157 190779 187114
64693 187114 183462 179653 176424 174393 173194 172062 170832 169846 169198 168783 168914 170245 172888 176099 179054
64678 179054 181673 184488 187948 192078 196667 201596 206948 212798 218895 224655 229575 233589 236822 239096
64664 239096 239919 239004 236626 233389 229787 225994 221962 217660 213291 209285 205960 203213 200678 198203 196018
64649 196018 194422 193515 193333 194072 195979 199036 202841 206844 210731 214636 219033 224364 230706 237774 245275
64634 245275 253191 261660 270557 279281 287062 293473 298512 302115 303838 303285 300740 297015 292663 287595
64620 287595 281533 274449 266431 257523 248017 238619 229999 222389 215863 210670 206805 203499 199792 195600
64606 195600 191723 188730 186343 184044 181812 179953 178555 177415 176327 175252 174334 173886 174235 175532 177807
64591 177807 181069 185047 188963 192086 194605 197487 201365 206041 211279 217373 224495 231963 238841 245018
64577 245018 251151 257696 264521 271363 278088 284453 290080 294807 298798 302193 304810 306154 305591 302667
64563 302667 297566 291098 283982 276373 268404 260793 254312 248831 243666 238759 234742 231701 228771 225300
64549 225300 221638 218306 215167 212046 209531 208306 208077 207991 207878 208199 208882 209169 208715 207985 207237 205847 203133
64532 203133 199387 195620 192630 190586 189169 187770 185916 183903 182672 182666 183171 183257 183005 183115 183500 183108 181295
64515 181295 178711 176534 175329 174926 174962 175182 175563 176508 178657 182135 186216 190130 194015 198675 204568 211471
64499 211471 218996 226859 234563 241399 247011 251651 255590 258538 259937 259646 258083 255778 253008 249853
64485 249853 246489 243398 241287 240590 240955 241422 241247 240437 239364 238137 236647 234928 233052 230706 227414
64470 227414 223302 219294 216304 214512 213613 213519 214482 216693 220006 223985 227993 231332 233595 234924 235678
64455 235678 235915 235450 234458 233666 233780 234889 236577 238388 240073 241652 243528 246367 250524 255607 260903
64440 260903 266227 272008 278623 286034 294295 303965 315645 329322 344532 361160 379702 400816 424958
64427 424958 452613 484509 521352 563507 611235 665181 726428 795969 874209 960848 1054862
64416 1054862 1154283 1256099 1356744 1453096 1543115 1625554 1699201 1762585 1814318 1853273 1878195
64405 1878195 1887585 1880651 1858497 1823807 1778894 1724169 1658732 1582210 1495633 1400849 1299991
64394 1299991 1195910 1092484 993577 901528 817012 740319 672207 613217 562690 519040 480993
64383 480993 448157 420425 397292 377943 361742 348336 337363 328240 320305 313096 306524 300658
64371 300658 295297 289820 283642 276696 269241 261359 253083 245018 238209 233036 228630 223808 218323 212870
64357 212870 208168 204553 202241 201366 201684 202739 204446 207117 210850 215213 219602 223541 226587 228415 229123
64342 229123 229101 228412 226691 223803 220179 216276 212129 207774 203688 200408 197968 196135 194901 194303 193938
64327 193938 193224 192134 191235 190998 191429 192325 193515 194743 195728 196517 197560 199250 201477 203717 205410 206261
64311 206261 206331 205904 205163 204009 202234 199771 196683 193095 189321 185850 182873 179993 176724 173179 169863
64296 169863 166915 164075 161464 159842 159846 161320 163593 166040 168114 169291 169460 169200 169303 170100 171461 173262
64280 173262 175514 178221 181473 185630 191016 197431 204240 210911 217168 222664 226955 229994 232289 234267
64266 234267 235715 236126 235488 234404 233429 232577 231593 230479 229501 228796 228142 227188 225725 223608 220532 216165
64250 216165 210594 204497 198678 193447 188619 184093 180248 177563 175943 174690 173260 171885 171239 171543 172263
64235 172263 172790 173196 174064 175609 177227 178052 177854 177272 177219 178091 179498 180675 181163 181128 181056 181174 181252 180970 180322
64216 180322 179473 178345 176621 174298 172002 170487 169906 169788 169690 169561 169411 169019 168203 167080 165760 164072
64200 164072 162082 160727 161267 163944 167690 171398 175004 179027 183603 188568 194176 201041 209401 218971
64186 218971 229525 241005 252859 263774 272382 278014 280599 280186 276908 271217 263844 255530 246892
64173 246892 238386 230165 222029 213738 205445 197807 191635 187345 184584 182455 180214 177803 175597 173773
64159 173773 172200 170840 169877 169362 169069 168854 168831 169088 169628 170793 173341 177647 183083 188546 193427 197685
64143 197685 201186 203562 204755 205198 205246 204751 203430 201427 199256 197267 195363 193258 190925 188722 187060
64128 187060 186017 185395 185122 185363 186143 187191 188388 190140 192896 196415 199981 203382 207293 212495 219025
64113 219025 226234 233511 240726 248038 255315 261760 266262 268416 269083 269560 270196 270366 269937 270116 272329 276603
64097 276603 281624 286165 289823 292447 293612 293000 290807 287429 282985 277495 271282 264872 258600 252581
64083 252581 246917 241640 236535 231352 226203 221507 217502 214089 211155 208749 206853 205318 204123 203475
64069 203475 203442 203779 204317 205234 206697 208466 210183 211830 213528 215115 216427 217844 219932 222531 224924
64054 224924 227078 229999 234394 239589 244396 248660 253199 258495 264253 270306 277051 284616 292160 298507
64040 298507 303154 306220 307707 307348 305198 301839 297831 293265 288108 282816 278254 274947 272661 270897
64026 270897 269696 269722 271501 274781 278731 282620 286138 289205 291683 293264 293490 291957 288735 284544 280264
64011 280264 276251 272356 268574 265276 262602 260026 256898 253308 250106 248074 247329 247507 248197 249039 249696
63996 249696 250034 250310 251017 252505 254859 258115 262385 267606 273292 278766 283708 288370 293258 298781 305201
63981 305201 312612 320702 328709 336001 342713 349563 356998 364800 372604 380476 388762 397609 406969 417011
63967 417011 428207 440949 455286 471101 488420 507489 528684 552407 578984 608582 641378
63956 641378 678048 720134 769732 828571 897350 976120 1065423 1166910 1282620 1413698 1559968
63945 1559968 1720620 1894812 2081387 2278468 2483860 2695763 2912511 3131336 3347706
63936 3347706 3556071 3751036 3927708 4081447 4208087 4304717 4370032 4403708 4405518 4375025
63926 4375025 4311911 4216554 4090625 3937518 3762135 3569925 3365970 3154868 2941118 2728977
63916 2728977 2521698 2321224 2128932 1946541 1776076 1619109 1476441 1348497 1235586
63907 1235586 1137473 1052959 980175 917319 862994 816069 775608 741050 712206 688786 669912
63896 669912 654214 640474 628180 617527 608856 602125 596885 592799 590098 589393 591068 594967 600793
63883 600793 608695 619317 633270 650646 671050 694020 719445 747624 778909 813253 850169 889140
63871 889140 929873 971965 1014534 1056616 1097923 1138766 1178979 1217296 1252035 1282145 1307247
63860 1307247 1326991 1340975 1349218 1352149 1349945 1342307 1329016 1310324 1286614 1258082 1225021 1188135
63848 1188135 1148199 1105683 1061034 1015166 969230 923927 879310 835273 791991 749963 709890
63837 709890 672495 638200 606908 578274 552123 528371 506680 486594 468157 452012 438652
63826 438652 427740 418346 409669 401236 392491 382607 370983 357912 344533 332038 320948 311155 302423
63813 302423 294581 287268 279942 272396 265069 258583 253114 248409 244286 240798 237959 235611 233553 231570
63799 231570 229379 226815 224061 221456 219072 216770 214674 213196 212424 211830 210821 209383 207966 206845 205914
63784 205914 205008 204195 203598 203047 202105 200572 198848 197513 196517 195179 193265 191661 191466 192537 193560 193546
63768 193546 192739 191999 191871 192409 193325 193999 193835 192989 192318 192271 192309 191805 190978 190380 189924 189247 188752 189368 191226
63749 191226 193313 194699 195469 196241 197346 198815 200730 203081 205518 207644 209479 211375 213573 216051 218760
63734 218760 221769 225185 229017 233131 237300 241347 245301 249399 253951 259177 265103 271485 277911 284089
63720 284089 289958 295383 299922 303127 304959 305554 304663 301784 296967 291077 285045 279132 273192 267355 262144
63705 262144 258045 255239 253683 253179 253364 253831 254330 254834 255493 256560 258218 260408 262934 265837 269423 273748
63689 273748 278306 282504 286328 290181 294125 297652 300319 302342 304392 306947 309953 312940 315326 316810
63675 316810 317722 318953 321288 324737 328612 332241 335397 338009 339785 340437 340143 339401 338372 336642 333781
63660 333781 329837 325120 319705 313494 306615 299472 292463 285917 280243 275792 272578 270454 269501 269768 270616
63645 270616 270923 270290 269646 270240 272373 275494 279174 283291 287488 291240 294694 298840 304465 311309 318522
63630 318522 325682 333090 341332 350876 361921 374265 387434 401196 415886 431967 449458 468114
63618 468114 488094 509965 533950 559602 586466 614734 644899 676984 710411 744498 778569
63607 778569 811512 841547 866729 885603 897398 901954 899846 892563 882243 870953 860112 850355
63595 850355 841623 833256 824188 813322 799803 783004 762476 738241 711220 683155 655759 629863
63583 629863 605366 582007 560034 540142 522949 508617 496854 487128 479032 472696 468826 468021 469990
63570 469990 473693 478359 484127 491506 500508 510656 521697 533873 547489 562614 579310 597798
63558 597798 618146 640065 663298 688120 715188 745024 777896 814205 854571 899261 947339
63547 947339 996238 1041955 1079835 1105801 1117665 1115915 1103506 1084695 1063537 1042858 1024257 1008713
63535 1008713 996875 988631 982694 977028 969829 959987 946691 929035 906323 878653 846919 812264
63523 812264 775717 738278 700996 664726 629955 597079 566715 539449 515234 493318 472962
63512 472962 454143 437381 423038 410958 400777 392236 385046 378678 372556 366478 360713 355682 351585
63499 351585 348283 345477 342990 340951 339634 339073 338957 338998 339255 339892 340719 341349 341890 343135 345850 349997
63483 349997 354900 360005 365277 370924 377067 383700 390669 397419 402931 406191 406911 405684 403349 400191
63469 400191 395849 390018 383050 375763 368745 362090 355789 350032 344953 340375 336150 332623 330395 329582
63455 329582 329645 330053 330873 332612 335701 340281 346255 353371 361459 370781 381992 395584 411554 429881
63441 429881 451138 476289 505977 540331 579203 621822 665909 707620 742966 769451 786548
63430 786548 795210 797507 796474 795502 797315 803426 814448 830631 851977 878139 908530 942559 979616
63417 979616 1018687 1057966 1094841 1126352 1149957 1164187 1168912 1165224 1155151 1141250 1126034 1111311
63405 1111311 1097775 1085078 1072317 1058534 1042868 1024364 1001894 974560 942354 906308 867904
63394 867904 828398 788797 750292 714224 681466 652017 625454 601674 580981 563561 549139
63383 549139 537223 527544 520109 514980 512143 511554 513202 517099 523219 531426 541469 553210 566829
63370 566829 582609 600457 619920 640917 664107 690104 718563 748672 780489 815044 852804
63359 852804 892753 933415 974071 1014213 1052245 1085718 1112750 1132439 1144121 1147406 1143284 1134234
63347 1134234 1122588 1109364 1095005 1080390 1066342 1052683 1038561 1023211 1005626 984031 956973
63336 956973 925016 890492 855374 820205 785186 751290 719761 691213 665902 644492 627951
63325 627951 616838 611029 609780 611485 613407 612178 604981 590592 569793 544986 519008 493832 470290
63312 470290 448901 430417 415233 402772 392053 382743 375070 368813 362968 356640 349827 343158 337115
63299 337115 331744 326912 322616 319075 316507 314743 313113 310997 308457 306017 303788 301203 297835 294157
63285 294157 291080 288936 287343 285995 285109 284936 285225 285454 285350 284917 284179 283289 282724 282884 283408 283398 282586 281812
63267 281812 281990 282910 283649 283937 284489 285948 288139 290685 293751 297673 302124 306259 309700 312983 316907
63252 316907 321725 327104 332724 338791 345994 354945 365621 377360 389488 401887 414936 429051 444480
63239 444480 461386 479799 499439 519823 540693 562225 584671 607925 631518 654926 677721
63228 677721 699585 720500 740965 761761 783272 805164 826961 848802 871265 894424 917398
63217 917398 938949 958218 974624 987306 995052 996774 991838 980164 962354 939549 912745 882337
63205 882337 848845 813995 780337 749497 721397 695549 672502 653346 638269 626493 617541 611839
63193 611839 609881 611512 616333 624288 635442 649445 665649 683581 702973 723483 744833 767189
63181 767189 790965 816086 841743 867078 891897 916387 940384 963339 984998 1005580 1025032
63170 1025032 1042448 1056547 1066397 1071334 1070510 1063117 1049016 1028597 1002077 969606 932201 891922
63158 891922 850712 809440 768389 728208 689899 654184 621410 591853 565670 542549 521800
63147 521800 502762 485002 468394 453331 440571 430443 422292 415068 408300 402149 396766 392119 388269
63134 388269 385236 382580 379684 376538 373816 372123 371529 371796 372618 373573 374352 375138 376419 378419 381057 384334
63118 384334 388170 391906 394765 396961 399587 403056 406389 408580 410036 411971 414816 417968 420878 423595
63104 423595 426221 428460 429917 430497 430405 429977 429534 429248 429142 429374 430352 432295 434787 437037 438566 439450 439973
63087 439973 440364 440816 441517 442551 443925 445725 448133 451334 455426 460354 465883 471823 478407 486247 495754
63072 495754 506692 518433 530470 542570 554791 567642 582041 598742 617819 638936 661985
63061 661985 687211 714892 745218 778398 814560 853581 895245 939482 986165 1034823 1084902
63050 1084902 1136228 1188871 1242646 1297065 1351686 1406142 1459935 1512726 1564913 1617446 1670946
63039 1670946 1725333 1780296 1835514 1890185 1942783 1991643 2035432 2072732 2101567 2119885 2126440
63028 2126440 2120881 2103118 2073097 2031290 1979146 1918916 1853021 1783516 1711995 1640071 1569962
63017 1569962 1504365 1445474 1394168 1350357 1313973 1285316 1264485 1251018 1244367 1244550 1251963 1266581
63005 1266581 1287538 1313526 1343464 1376739 1413051 1452188 1493876 1537601 1582510 1627604 1672137
62994 1672137 1715844 1758784 1801016 1842341 1882122 1919277 1952542 1980778 2002917 2017584 2023041
62983 2023041 2017669 2000480 1971224 1930343 1878998 1818774 1751042 1676838 1597645 1515888 1434148
62972 1434148 1354110 1276853 1203787 1136379 1074855 1018161 965626 917899 875710 838494 805001
62961 805001 774764 747995 724313 702578 682078 663017 645552 629106 613066 597643 583494
62950 583494 570750 558838 547072 535143 523130 511326 499976 489077 478459 468177 458570 449827
62938 449827 441738 434085 427030 420842 415381 410174 404900 399562 394324 389494 385516 382557 380039 376979
62924 376979 372942 368429 364266 360878 358240 356185 354494 352881 351155 349356 347620 346000 344509 343202
62910 343202 342072 341028 340121 339637 339773 340289 340645 340399 339470 338232 337486 337973 339600 341371 342471 343207 344451
62893 344451 346336 348131 349376 350428 351648 352731 353267 353459 353703 353871 353673 353523 354348 356466 359180 361637
62877 361637 363621 365342 366867 368012 368541 368293 367329 366103 365244 364926 364639 363785 362359 360858 359740 359173
62861 359173 359128 359414 359735 359994 360535 361756 363484 365011 365847 366246 366869 368079 369670 371163 372263 373087 374040
62844 374040 375367 376833 377986 378762 379596 380828 382167 382978 382972 382439 381944 382031 383114 385232 387882 390484 393084
62827 393084 396254 400081 403726 406366 408308 410633 413827 417280 420205 422590 424956 427584 430317 433007
62813 433007 435884 439446 444047 449499 455106 460275 465169 470505 476731 483750 491688 501402 513679 528092
62799 528092 543202 557980 572656 588220 605595 625412 648084 673625 701724 732433 766700
62788 766700 805809 850308 899917 954560 1015041 1082352 1156524 1236543 1321262 1409955 1501853
62777 1501853 1595529 1688962 1779957 1866164 1944846 2013044 2068081 2107856 2130936 2136823 2126138
62766 2126138 2100128 2059941 2006685 1942171 1868943 1789318 1704903 1617402 1529367 1443418 1360918
62755 1360918 1281948 1206467 1134976 1068091 1006071 948931 896599 848838 805317 765868 730451
62744 730451 698844 670692 645818 624129 605227 588505 573684 560860 549928 540430 532107 525138
62732 525138 519640 515357 512073 509940 509095 509308 510297 512081 514721 518115 522379 528072 535565 544528 554518
62717 554518 565805 579061 594493 611989 632062 655857 684029 716183 751704 790686 833755
62706 833755 881419 933994 991887 1055428 1124488 1198558 1277210 1360183 1446931 1536233 1626330
62695 1626330 1715297 1801136 1881487 1953483 2014198 2061401 2093806 2110534 2110578 2093166 2058644 2008764
62683 2008764 1946058 1873061 1792132 1705646 1615994 1525351 1435533 1348054 1264221 1185090 1111282
62672 1111282 1042863 979534 921035 867348 818457 774137 734170 698582 667317 639729 614797
62661 614797 591945 571302 552954 536387 521038 507125 495374 485844 477500 469150 460513 452078
62649 452078 444181 436664 429436 422895 417512 413242 409690 406775 404875 404260 404686 405654 406820 407963 408811
62634 408811 409134 408870 407910 405934 402817 399116 395780 393346 391736 390869 391047 392481 394804 397438 400324
62619 400324 403845 408059 412454 416711 421377 427360 434724 442445 449631 456745 465223 475966 488638 502563
62605 502563 517847 535250 555306 578049 603514 631975 663555 698017 735144 775027 817698
62594 817698 862537 908211 953115 995798 1035044 1069668 1098296 1119493 1132306 1136620 1132789 1120956
62582 1120956 1101092 1073758 1040534 1003495 964362 924147 883275 841841 800041 758615 718790
62571 718790 681709 647960 617631 590446 565811 543165 522526 504316 488424 473999 460595
62560 460595 448954 439862 432539 425189 417225 410024 405023 401774 398510 394273 389792 386357 384376 383243
62546 383243 382331 381769 382138 383522 385184 386388 387354 388981 391653 394776 397611 400104 402730 405902 409948
62531 409948 415364 422663 432032 443366 456549 471513 488274 507151 528731 553344 580792 610910
62519 610910 644088 680786 720736 763221 808004 855366 905127 956130 1006769 1055455 1100391
62508 1100391 1139521 1171155 1194412 1208858 1214077 1209954 1197036 1176254 1148537 1115020 1077353 1037379
62496 1037379 996647 956491 918318 883303 851909 824149 800235 780519 764882 752738 743830
62485 743830 738606 737607 740729 747247 756340 767437 780181 794141 808414 821579 832268 839782 843939
62472 843939 844469 841051 833906 823698 810495 793364 771476 745403 716923 687666 658345 629174
62460 629174 600474 572747 546419 521763 499054 478732 461297 446773 434288 422573 411153
62449 411153 400759 392244 385435 379562 374489 370778 368509 366883 365272 364011 363683 364109 364642 365117 365884
62434 365884 367039 368238 369256 370158 370797 370664 369504 367722 365963 364539 363481 362741 362050 360871 358951
62419 358951 356761 354984 353634 352116 350119 348002 346243 344947 344074 343686 343689 343640 343193 342494 341832 341146 340291
62402 340291 339570 339549 340358 341650 343205 345120 347339 349453 351195 352769 354455 356170 357635 358762 359709
62387 359709 360855 362861 366376 371359 376975 382557 388458 395537 403961 413047 422306 432176 443542 456808
62373 456808 471605 487187 502983 518974 535729 553987 574058 595682 618615 643360 671254
62362 671254 703691 741184 783212 829162 879308 934540 994986 1059204 1124966 1190441 1254139
62351 1254139 1313902 1366680 1409632 1441259 1461464 1470998 1471057 1463005 1447912 1426294 1398350 1364377
62339 1364377 1324839 1280232 1231253 1179115 1125507 1072115 1020242 970868 924903 883146 845935
62328 845935 812963 783652 757607 734507 713578 693635 673947 654798 636779 619650 602390
62317 602390 584404 566274 549105 533420 518894 504932 491303 478320 466575 456470 447913 440514
62305 440514 434008 428332 423317 418602 413971 409610 405866 402939 400848 399577 399098 399353 400235 401488 402674
62290 402674 403514 404356 406036 409113 413301 417774 421887 425571 429157 432942 436901 440906 445300 450891 458010
62275 458010 465753 472848 479278 486360 495104 505222 516216 528694 543867 562156 583094 606487
62263 606487 632988 663569 699007 739884 786509 838647 895685 957179 1022932 1092414 1164259
62252 1164259 1236131 1304720 1366112 1416884 1455193 1480703 1493682 1494654 1484816 1466043 1440029 1407682
62240 1407682 1369371 1325266 1275283 1219371 1158419 1094682 1030893 968979 909836 853984 802033
62229 802033 754580 711956 674073 640394 610173 582976 558903 538238 520957 506643 494594
62218 494594 483872 473601 463560 454289 446241 439027 431868 424711 418383 413600 410225 407667 405650
62205 405650 404311 403776 403950 404651 405728 407070 408673 410713 413427 416994 421642 427796 435843 445622 456408
62190 456408 467604 479352 492136 505916 520043 534110 548427 563296 578165 591989 604290
62179 604290 615326 625258 633703 640388 645788 650901 656752 664459 675429 690908 711322 736410 766018
62166 766018 800501 840247 884997 933554 983901 1033531 1079936 1120995 1155052 1180827 1197577
62155 1197577 1205420 1205364 1198851 1187135 1170804 1149642 1123016 1090710 1053508 1012830 969899 925607
62143 925607 881259 838933 800589 766940 737619 712381 691662 675813 664348 656509 652294 652314
62131 652314 656533 663707 672362 681926 692509 703923 715507 726876 738220 749685 760911 771352
62119 771352 780714 788728 794840 798532 799820 799034 796175 790862 782964 772972 761631 749460 736766 723981
62105 723981 711763 700772 691405 683692 677479 672755 669846 669209 671060 675313 681841 690614 701455 713788
62091 713788 726798 739867 752817 765754 778857 792384 806800 822675 840293 859392 879348
62080 879348 899701 920573 942679 966949 993939 1023407 1054462 1086291 1118708 1151840 1185350
62069 1185350 1218244 1249481 1278551 1305549 1331091 1356341 1382577 1410165 1437964 1463995 1486602
62058 1486602 1504770 1517682 1524613 1525433 1520813 1511719 1498802 1482282 1462070 1437800 1408930 1375109
62046 1375109 1336512 1293852 1248060 1199918 1149956 1098813 1047728 998377 951949 908560 867854
62035 867854 829912 795126 763416 734285 707756 684541 664951 648191 633183 619656 607963
62024 607963 598139 589664 581871 574058 565364 555237 544138 533329 523739 515268 507268 499378 491841
62011 491841 485340 480696 478492 478759 481069 484971 490270 496977 505200 515048 526355 538455 550391 561294
61997 561294 570399 576867 580070 580117 577713 573368 567137 559204 550175 540413 529569 517228 503792 490230
61983 490230 477154 464604 452658 441676 431931 423405 416136 410318 405900 402353 399054 395738 392461
61970 392461 389369 386635 384446 382889 381955 381699 382210 383304 384530 385712 387317 390029 394036 398942 404304
61955 404304 410071 416457 423603 431467 440044 449655 460903 474224 489562 506649 525517 546414 569230
61942 569230 593606 619864 649248 682577 718869 755958 792426 828274 863630 897604 928897
61931 928897 957058 982568 1005908 1027010 1045440 1060554 1071453 1077268 1077718 1073213 1064342 1051579
61919 1051579 1035624 1017820 999891 983282 968952 957768 950863 949351 953687 963550 978443 998173
61907 998173 1022448 1050074 1078916 1106704 1131624 1152055 1166303 1173092 1172196 1164255 1150060 1130286
61895 1130286 1105765 1077516 1046365 1012879 977746 941961 906575 872531 840751 811947 786119
61884 786119 762559 740633 720319 701723 684382 667472 650620 634163 618619 604262 591241
61873 591241 579792 570186 562650 557395 554596 554234 556102 560055 566090 574119 583806 594810 607207 621642
61859 621642 639091 660418 685989 715604 748863 785698 826524 871883 921978 976460 1034427
61848 1034427 1094478 1154872 1213894 1270142 1322482 1369774 1410769 1444200 1468928 1483998 1488808
61837 1488808 1483424 1468865 1447135 1420930 1393171 1366520 1343165 1324941 1313475 1309934 1314431 1325831
61825 1325831 1342440 1362924 1386353 1411221 1434796 1453774 1465521 1468407 1461177 1442713 1412799 1372731
61813 1372731 1324658 1270425 1211362 1148994 1085358 1022499 962057 905409 853624 806899 764411
61802 764411 725249 689327 657065 628458 603035 580624 561451 545298 531134 518008 505877
61791 505877 495188 485910 477464 469415 461765 454649 448172 442506 437712 433374 428855 424038 419432 415384
61777 415384 411605 407719 403918 400709 398288 396524 395295 394467 393745 393034 392822 393700 395504 397513 399527
61762 399527 402151 405788 409884 413612 416916 420387 424358 428619 432974 437561 442487 447451 451905 455407
61748 455407 457808 459253 460081 460644 461214 462019 463182 464449 465219 465187 464872 465158 466328 467917 469484 471133
61732 471133 473111 475399 478025 481446 486126 491823 497683 503098 508145 513167 518255 523301 528343 533554
61718 533554 538938 544230 549171 553688 557702 560844 562619 562847 561737 559386 555436 549462 541594 532457
61704 532457 522550 512059 501320 491084 482048 474300 467429 461016 454885 449098 443983 439997 437268
61691 437268 435289 433327 431066 428689 426403 424151 421748 419081 416164 413182 410454 408154 406131 404228
61677 404228 402628 401573 400807 399749 398267 396878 396011 395458 394784 393993 393476 393522 394115 395070 396157 397256 398579
61660 398579 400488 402913 405253 407190 409281 412275 416056 419824 423256 426845 431053 435744 440748 446418
61646 446418 453190 460929 469147 477659 486572 495728 504531 512322 518743 523768 527564 530193 531214 529856
61632 529856 525900 520229 514069 507825 501201 494378 488296 483470 479220 474678 470143 466762 465096 464694
61618 464694 465111 466573 469310 472716 475662 477470 478161 477840 476200 472700 466990 459090 449407 438746 428155
61603 428155 418430 409626 401182 392654 384279 376684 370091 364065 358149 352467 347465 343234 339449 335922
61589 335922 332826 330224 327704 324726 321215 317604 314376 311633 309020 305981 302305 298553 295764 294495
61575 294495 294226 293888 292872 291331 289639 287923 286181 284523 283137 282061 281086 279868 278176 276147 274269
61560 274269 273007 272438 272274 272130 271707 270876 269854 269176 269182 269566 269687 269341 269012 269305 270423 272186 274258 276267
61542 276267 278018 279725 281795 284216 286423 287941 288941 289982 291447 293419 295849 298516 300931 302601
61528 302601 303386 303429 302804 301373 298952 295527 291392 287144 283350 280125 277252 274775 273152 272540 272274 271467
61512 271467 269948 268221 266643 265100 263426 261702 260075 258670 257758 257657 258328 259312 260150 260670 260881 260843
61496 260843 260649 260234 259212 257297 254959 253208 252577 252659 252885 253269 254060 255032 255682 256013 256598 257775 259124
61479 259124 259890 259733 258958 258122 257557 257260 257114 257127 257364 257751 258075 258156 257885 257141 255849 254196 252611 251509
61461 251509 251184 251855 253493 255548 257190 258043 258490 259081 259836 260340 260335 260021 259862 260232 261096 261987 262444 262602
61443 262602 263141 264568 266780 269436 272450 275900 279728 283883 288541 293924 299981 306390 312657 318115
61429 318115 322235 325198 327770 330266 332093 332816 333187 334400 336632 339101 341401 343786 346200 347984 348890
61414 348890 349498 350136 350136 348765 346323 343658 340955 337712 333729 329488 325493 321682 317557 312712 307313
61399 307313 302202 298333 295865 293992 291886 289561 287541 286036 284859 283931 283384 283232 283394 283919 284816 285748
61383 285748 286382 286967 288065 289715 291350 292587 293524 294138 294070 293396 293122 294365 297163 300489 303344 305541
61367 305541 307559 309971 313016 316462 319856 322997 326103 329362 332535 335297 337929 341311 346163 352509
61353 352509 360012 368528 378129 388709 399915 411500 423477 435671 447242 457013 464458 470203 475385
61340 475385 480671 486097 491632 497386 503148 508144 511613 513461 514117 513882 512673 510312 506750 502042 496331
61325 496331 489892 483062 476110 469314 463071 457733 453406 450112 447971 446841 445879 444000 441083 438306
61311 438306 437009 437436 438952 441158 444332 448832 454570 461161 468222 475250 481388 485522 486711 484672
61297 484672 480036 474068 467895 461936 456182 450829 446259 442453 438921 435359 431949 428840 425847 422999
61283 422999 420962 420362 420999 422282 424242 427384 431660 436392 441384 447393 455032 463796 472650 481148 489485
61268 489485 497800 506079 514464 522974 531034 538093 544894 553406 565045 579396 595006 610917 626821
61255 626821 642101 655684 667043 676719 685357 692583 697370 699442 699781 699486 698432 695373 689263 680264
61241 680264 669567 658601 648436 639453 631207 622763 613575 604028 594916 586440 578117 569739 562016
61228 562016 555990 551915 548962 545975 542419 538680 535501 533072 530687 527502 523657 520275 518187 517053
61214 517053 516124 515531 516085 517842 519536 519828 518678 517147 516143 515803 515911 516444 517700 520245 524790 531870
61198 531870 541479 553210 566776 582239 599691 618935 639503 660689 681395 700239 716228 729314
61186 729314 740108 749131 756612 762943 768932 775317 782154 788868 794746 799203 801771 802255 800988 798610
61172 798610 795347 790791 784654 777544 770519 763832 756513 747442 736545 724714 712785 700927 688913
61159 688913 676646 664326 652410 641410 631566 622697 614633 607801 602992 600438 599424 598998 598756 598535
61145 598535 597618 594733 588978 580431 569825 557927 545369 532802 520951 510522 502086 495887 491641
61132 491641 488673 486444 484988 484744 486035 488838 493067 498937 506898 517141 529251 542496 556592
61119 556592 572105 589923 610257 632263 654705 676892 698948 721340 744357 767975 791889
61108 791889 815395 837379 856788 873357 887720 900577 911734 920119 924751 925435 922494 916132 906373
61095 906373 893424 877734 859656 839280 816758 792696 768178 744327 721658 699706 677504
61084 677504 654690 632035 610614 590640 571539 553084 535802 520066 505370 490976 476958
61073 476958 464126 453061 443630 435383 428053 421644 416313 412186 409055 406312 403447 400611 398445 397352
61059 397352 397177 397644 398829 401038 404309 408168 411918 415321 419082 424418 431920 440974 450588 460605
61045 460605 471687 484218 497843 512214 527553 544088 561405 578836 596197 613619 630856
61034 630856 647375 663157 678905 695274 712277 729669 747528 766211 785978 807116 830457
61023 830457 857553 890241 930104 978287 1035726 1103651 1184240 1281112 1399309 1544668 1722544
61012 1722544 1935257 2177787 2433230 2672359 2861070 2974045 3006643 2976904 2916837 2859742
61002 2859742 2830577 2840595 2884031 2937355 2965097 2933282 2824121 2642625 2411527 2159532
60992 2159532 1911086 1682054 1480352 1308321 1164768 1046397 949068 868955 803093 749051
60982 749051 704416 666962 635287 608797 586787 567920 550904 535355 521491 509232 498227
60971 498227 488657 481219 476053 472341 469283 466889 465339 464078 462260 459763 457072 454327 451180 447596
60957 447596 444114 441180 438791 436961 435964 435822 436003 435934 435464 434597 433215 431430 429793 428729 428056 427446
60941 427446 427026 426997 426867 425695 423065 419330 414855 409547 403271 396300 389131 382047 375079 368180 361419
60926 361419 355077 349583 345081 341110 337079 333089 329906 327925 326537 324796 322494 320250 318720 318045
60912 318045 318025 318519 319567 321225 323391 325812 328350 331257 335066 340085 346029 352156 357731 362422 366497
60897 366497 370686 375563 380941 386047 390439 394443 398492 402328 405200 406645 406634 405100 401882 397238 391929
60882 391929 386573 381198 375629 369987 364493 359094 353676 348512 344107 340544 337375 334284 331569 329763
60868 329763 328908 328430 327713 326619 325466 324693 324619 325381 326897 328859 330910 332873 334753 336563 338354 340457
60852 340457 343471 347707 352692 357505 361720 365881 370906 377128 384033 390815 396998 402497 407280 411189
60838 411189 414087 415989 416954 416967 416148 414975 413997 413302 412564 411742 411326 411571 411868 411386 410121 408731 407377
60821 407377 405431 402446 398763 394874 390725 386075 381006 375549 369272 361921 354265 347581 342374 338133
60807 338133 334239 330472 326634 322495 318367 315112 313174 312054 311073 310209 309724 309352 308489 307087 305900
60792 305900 305760 306838 308603 310280 311433 312327 313687 315896 318489 320607 321913 322853 324088 325922 328367
60777 328367 331540 335809 341467 348346 355859 363563 371572 380206 389261 397952 405606 412156 417829 422759
60763 422759 427158 431547 436370 441461 446126 449655 451600 451876 450932 449657 448775 448457 448741 450009 452590
60748 452590 456078 459582 462553 464867 466246 466333 465415 464396 463670 462530 460061 456250 451855 447528 443514
60733 443514 440045 437595 436660 437395 439379 441744 443792 445715 448561 453314 460139 468566 478109 488512
60719 488512 499717 511925 525612 541222 558885 578547 600146 623500 648194 673897 700685
60708 700685 728868 758541 789411 820870 852022 881782 909180 933505 954009 969696 979665 983514
60696 983514 981231 972875 958679 939317 915789 889115 860333 830511 800340 769864 739051 708538
60684 708538 679324 651790 625537 600264 576231 553693 532544 512890 495432 480685 468135
60673 468135 456817 446564 437956 430951 424298 416773 408547 400788 394093 387923 381623 375407 370020 365769
60659 365769 362307 359206 356334 353735 351538 350032 349487 349812 350668 351915 353600 355484 357091 358482 360423
60644 360423 363351 366486 368516 368941 368250 366991 365307 363412 361882 361189 361255 361709 362357 363333 364987 367615
60628 367615 371015 374323 376696 378215 379740 381734 383650 384646 384500 383548 382073 380114 377653 374666 371133
60613 371133 367270 363580 360423 357695 355124 352642 350190 347430 344110 340607 337644 335432 333519 331468
60599 331468 329321 327226 325036 322570 320051 317968 316586 315768 315204 314609 313775 312706 311800 311660 312532 313988
60583 313988 315345 316409 317604 319401 321826 324695 328061 332094 336664 341472 346642 352804 360339 368812
60569 368812 377352 385354 392494 398301 402116 403583 402965 400918 398075 394784 391080 386911 382506 378463
60555 378463 375402 373652 373447 375220 379383 385809 393840 402870 412697 423262 434261 445074 454883 462845
60541 462845 468447 471732 472954 471917 468058 461440 453420 445892 439968 435662 432665 430916 430274 430182 430058
60526 430058 429905 430130 430767 431261 431167 430862 431192 432483 434204 435726 437181 439286 442437 446341 450594 455356
60510 455356 461271 468936 478699 490884 505933 524274 546204 571845 600976 632901 666708 701698
60498 701698 737214 771895 803381 829116 847337 857027 857105 846349 824453 792963 754926 713651
60486 713651 671858 631564 594188 560424 530161 502827 478059 456147 437767 423127 411410
60475 411410 401265 391856 383250 375747 369211 363284 357920 353322 349455 346053 343011 340388 338017 335520
60461 335520 332767 329957 327158 324189 321122 318482 316594 315053 313209 311008 308997 307659 307119 307353 308203
60446 308203 309091 309171 308042 306217 304652 303860 303543 302994 301766 299981 298040 296170 294324 292521 291088 290457
60430 290457 290785 291852 293214 294420 295284 296093 297345 299051 300489 300938 300505 299913 299606 299506 299620 300349 301945
60413 301945 303999 305786 306938 307550 307875 308170 308706 309566 310437 310840 310652 310261 310172 310588 311353 312148 312691 312868
60395 312868 312813 312927 313793 315924 319336 323282 326630 328802 330334 332282 335059 338077 340515 342128 343110
60380 343110 343551 343490 343415 344146 346038 348658 351466 354354 357218 359414 360344 360429 360757 361636 362183 361644 360517
60363 360517 359841 359876 360119 360319 360714 361377 362030 362625 363500 364813 366346 368114 370623 374129 378052 381529 384319
60346 384319 386747 388944 390603 391413 391399 390765 389660 388177 386478 384847 383629 383006 382779 382493 381850 380846
60330 380846 379462 377524 375070 372649 370954 370240 370263 370622 370985 371196 371445 372172 373500 374969 376158 377435
60314 377435 379651 383184 387812 393548 401033 410934 423358 438047 454618 472209 489233 504023 515661
60301 515661 523848 528136 527805 522605 513301 501339 488174 474983 462702 451963 442950 435467 429216
60288 429216 423957 419420 415183 410849 406368 402101 398489 395673 393450 391505 389573 387476 385201 382988
60274 382988 381147 379711 378338 376586 374227 371330 368173 365095 362296 359740 357366 355380 354096 353448
60260 353448 352914 352097 351188 350644 350574 350692 350785 350949 351366 352000 352585 352842 352737 352562 352657 353012 353345 353653 354342 355511
60240 355511 356450 356434 355915 356260 358151 360786 362991 364546 365987 367503 368767 369769 371209 373782 377445
60225 377445 381520 385247 388084 389782 390535 390999 391941 393773 396457 399757 403464 407392 411319 415097 418859
60210 418859 423017 427885 433253 438515 443329 447956 452745 457440 461363 464246 466486 468506 470323 471960
60196 471960 473862 476434 479421 482220 484692 487096 489184 489994 488876 486382 483696 481405 479222 476794
60182 476794 474281 472031 470038 468020 465877 463814 462025 460455 458954 457539 456381 455573 454993 454395 453550
60167 453550 452315 450725 449170 448344 448719 449989 451124 451131 449779 447686 445832 444979 445349 446689 448676 451241
60151 451241 454372 457663 460443 462539 464600 467319 470475 473170 474989 476583 479058 483063 488521 494848
60137 494848 501259 507108 512198 516684 520591 523644 525632 526670 526953 526560 525753 525133 525056 525059 524373 522976 521688
60120 521688 521075 520689 519681 517888 515990 514730 514256 514210 514226 514187 514120 513938 513385 512294 510871 509605 508747 507928
60102 507928 506403 503796 500577 497736 495971 495262 495241 495800 497101 499123 501523 504069 506866 509989 513217
60087 513217 516424 519927 524004 528190 531554 533695 535056 536196 537280 538394 539839 541670 543238 543601
60073 543601 542292 539491 535678 531411 527183 523092 518664 513353 507197 500773 494529 488454 482356 476218
60059 476218 470161 464254 458474 452848 447688 443662 441365 440556 440066 438856 437144 436115 436516 437876 439199
60044 439199 440113 441126 442960 445803 449172 452427 455408 458530 462108 465789 468838 470863 471917 471955 470684
60029 470684 468035 464410 460234 455563 450346 444783 439132 433309 426920 419643 411533 403137 395438 389309
60015 389309 384768 380942 377056 373325 370608 369332 369083 369173 369202 368967 368170 366597 364589 363128 363159 364709
59999 364709 366803 368443 369610 371088 373398 376306 379431 382823 386676 390891 395314 400079 405294 410549
59985 410549 415201 419037 422269 425023 427212 428855 430012 430498 430103 429131 428188 427377 426181 424373 422548
59970 422548 421438 421042 420750 419980 418489 416354 414065 412421 411897 412109 412124 411255 409397 406874 404292 402384
59954 402384 401560 401556 401765 401937 402309 403093 404140 405135 405813 405903 405250 404179 403494 403765 404673 405306 405053 404018 402612
59935 402612 401022 399197 397161 395134 393368 392021 391179 390907 391221 392024 393106 394181 394986 395444 395752 396226
59919 396226 397003 397996 399124 400457 402030 403681 405250 406909 409095 412109 415817 419747 423410 426603 429551
59904 429551 432693 436129 439311 441493 442518 442907 443153 443183 442762 442205 442379 443982 446973 450744 454754 458935
59888 458935 463524 468476 473153 476738 479015 480610 482399 484802 487688 490754 493754 496534 499077 501461
59874 501461 503555 504821 504679 503055 500332 496791 492436 487488 482660 478654 475556 473013 470873 469332
59860 469332 468463 467901 467071 465542 463101 459747 455794 451864 448559 446089 444216 442459 440332 437641 434728
59845 434728 432317 430860 430055 429165 427751 425975 424275 423038 422577 423033 424123 425202 425784 425909 425913 426078 426682
59828 426682 428139 430691 433895 436642 437863 437216 435142 432314 429051 425251 420887 416429 412544 409410
59814 409410 406633 403939 401613 400018 398998 398121 397291 396698 396257 395561 394410 393053 391802 390752 389894 389175
59798 389175 388351 387091 385399 383715 382452 381650 381157 380875 380704 380489 380272 380417 381241 382582 383874 384598 384585
59781 384585 383961 382894 381385 379318 376837 374605 373458 373694 374898 376482 378214 380142 382198 384071 385461
59766 385461 386446 387586 389500 392175 394906 397161 399231 401665 404292 406529 408572 411484 415846 421024
59752 421024 426148 431220 436735 442707 448654 454260 459428 463907 467348 469648 470913 471307 471296 471685 472900
59737 472900 474475 475721 476669 477786 478952 479460 479017 478111 477321 476765 476361 476111 475973 475802 475564 475355 475219
59720 475219 475229 475618 476387 476939 476653 475787 475261 475571 476471 477725 479478 481788 484498 487693 491602 495779 499234
59703 499234 501802 504583 508466 512915 516911 520532 524689 529699 534985 540006 544635 548591 551250 552222
59689 552222 551696 550188 548350 546835 545759 544371 541976 539168 537408 537113 536925 535290 532204 528839 525936
59674 525936 523162 519829 515614 510585 505056 499583 494772 490908 487868 485413 483454 482070 481450 481757 482841
59659 482841 484109 484922 485275 485946 487876 491458 496362 501797 506922 511237 514835 518116 521084 523019 523093
59644 523093 521202 517954 513846 508859 503010 496910 491362 486489 481643 476314 470848 466105 462541 459837
59630 459837 457373 454858 452364 449932 447364 444490 441456 438545 435757 432706 428965 424351 418959 413193
59616 413193 407854 403837 401501 400407 399847 399444 399132 398907 398941 399727 401662 404503 407555 410333 412703 414500
59600 414500 415489 415753 415655 415290 414391 412936 411462 410542 410264 410428 410969 411869 412905 413743 414138 413914 412959 411436
59582 411436 409700 407786 405255 401825 397939 394396 391614 389454 387539 385435 382825 379874 377252 375370
59568 375370 373805 371920 369895 368621 368625 369583 370904 372282 373546 374491 375152 375952 377303 379243 381588 384291
59552 384291 387515 391494 396308 401638 406763 411190 415349 420408 427298 436228 447272 460974 477993
59539 477993 498233 520378 541954 559687 570385 572422 566775 556554 545326 535699 528926 525281
59527 525281 524599 526665 531204 537524 544344 550326 554817 557908 559835 560537 559799 557474 553401 547421 539786
59512 539786 531362 523050 514938 506321 496686 486494 476835 468495 461506 455538 450423 446187 442709 439570
59498 439570 436354 433078 430226 428239 427017 426149 425605 425888 427274 429232 431057 432910 435646 439564 443912
59483 443912 447924 451805 456276 461639 467893 475469 484983 496148 507564 517842 526466 533288 537758
59470 537758 539214 537808 534676 531117 527799 524738 521850 519517 518693 520360 524762 531227 538893 547434
59456 547434 556928 567221 577878 588812 600505 613287 626631 639496 651338 662414 672962 682312
59444 682312 688987 691554 689274 682190 671054 657296 642719 628866 616606 606218 597559 589951 582269
59431 582269 573685 564494 555904 548897 543540 539489 536864 536310 538323 542844 549556 558392 569649 583709
59417 583709 600718 620574 643213 668819 697311 727080 754100 772836 778865 771247 752775 728300
59405 728300 702847 680589 664343 655250 652995 656537 664209 672831 677429 673146 658071 634025 604731
59392 604731 573789 544180 518260 497023 479759 465320 453554 444851 438650 433528 428876 425439
59380 425439 423814 423268 422734 422269 422652 423892 425038 425439 425421 425539 425865 426378 427486 429596 432378 435021 437219
59363 437219 439435 442098 445030 447946 451176 455390 460754 466889 473746 481980 492211 504254 517426
59350 517426 531322 546006 561669 578420 596173 614367 632050 648715 664800 680791 695980
59339 695980 708808 718418 725105 729093 729743 726439 719667 710634 700219 688809 676776 664513 652124
59326 652124 639543 626889 614426 602423 591411 582260 575437 570333 565770 561068 556163 550966 545298
59313 545298 539460 534148 529613 525459 521442 517904 515092 512554 509663 506478 503696 501846 500797 499920
59299 499920 498608 496771 494992 494021 494003 494363 494478 494176 493541 492712 492146 492612 494435 496982 499354 501422 503737
59282 503737 506614 509872 513453 517702 522893 528956 535848 543767 552783 562640 573198 584736 597481
59269 597481 611068 624762 637961 650132 660540 668538 674138 677898 680299 681496 681549 680382 677523
59256 677523 672366 664865 655649 645431 634732 624231 614704 606225 597960 589276 580708 573276 567192
59243 567192 561945 557477 554507 553566 554329 556116 558476 561073 563502 565570 567384 568819 569259 568232 565993
59228 565993 563053 559338 554271 547589 539685 531152 522330 513390 504569 496156 488294 480836 473496 466304
59214 466304 459918 455122 451897 449320 446636 444053 442078 440478 438535 436148 434000 432589 431741 431173 430872
59199 430872 430674 430142 429333 429197 430641 433486 436861 440368 444310 448892 453841 458888 464116 469691 475671
59184 475671 482215 489549 497428 504988 511532 517241 522758 528184 532921 536532 539401 542380 546042 550492
59170 550492 555697 561708 568505 575822 583260 590555 597683 604740 611728 618475 624662 629856 633543 635342
59156 635342 635331 634061 632067 629288 625086 618881 610731 601346 591689 582490 573956 565835 557881 550260 543322
59141 543322 537060 531074 525127 519350 513799 508268 502855 498283 495180 493279 491867 490840 490727 491780
59127 491780 493684 496219 499597 503970 509150 515090 522129 530482 539911 550225 561689 574601 588821
59114 588821 604037 620114 636855 653820 670816 688187 706057 723608 739694 754024 767185
59103 767185 779593 791002 800950 809156 815383 819368 821025 820428 817660 813040 807393 801667 796245 790973
59089 790973 785742 780596 775449 770207 765073 760063 754289 746518 736586 725521 714036 701738 688261
59076 688261 674377 661205 648848 636595 624179 612082 600708 589999 579918 570763 562839 556193
59064 556193 550707 546083 541669 536709 531025 525207 520005 515654 511871 508316 504911 501738 498757 495672
59050 495672 492193 488431 484892 482017 479873 478379 477575 477471 477867 478664 480248 483122 487145 491429 495097
59035 495097 497968 500450 503047 506101 509802 514162 518984 524027 529319 535338 542852 552502 564406 578102
59021 578102 592831 607950 623183 638646 654482 670304 684985 697210 706281 712215 715212 715470
59009 715470 713614 710768 707738 704398 700375 696250 693562 693441 695540 698506 701358 704256 707928 712461
58995 712461 716794 719527 720192 719467 718125 716103 712775 707744 701022 692769 683391 673698 664326 654945 644668
58980 644668 633447 622612 613697 607108 602311 598989 597441 597900 599990 603113 607057 611861 617248 622597
58966 622597 627632 632798 638698 645338 652330 659672 667760 676466 684769 691630 696798 700289 701531 699741
58952 699741 695025 688434 680857 672435 663129 653307 643520 634134 625365 617335 609916 602874 596328 590673
58938 590673 585862 581133 575693 569355 562362 555045 547939 541717 536527 531765 526950 522509 519112 516534
58924 516534 513863 510775 507915 505932 504758 504058 503866 504330 505158 505792 506112 506680 508158 510592 513377 515954
58908 515954 518553 522106 527402 534495 542966 552502 562887 573661 584164 593943 602804 610545 617038
58895 617038 622622 628007 633678 639773 646732 655661 667647 682803 700210 718721 737675 756943 776432
58882 776432 795508 812863 827161 837887 845337 849682 850394 846902 839535 829337 817047 802683 786200
58869 786200 768211 749932 732650 717328 704402 693691 684580 676440 668891 661702 654629 647485 640307
58856 640307 633250 626323 619237 611563 603080 594007 584855 576035 567717 560112 553687 548782 545084 541751
58842 541751 538089 533939 529420 524639 519780 515138 510846 506764 502845 499351 496461 493861 491029 487814
58828 487814 484512 481545 479302 478044 477484 476691 475017 473122 472431 473371 474778 475470 475794 477000 479457 482228
58812 482228 484354 485787 486950 487980 488791 489454 490076 490527 490636 490527 490417 490183 489511 488491 487687 487470 487577
58795 487577 487545 487342 487271 487430 487685 488187 489409 491488 493906 496209 498785 502440 507354 512983 518964 525480
58779 525480 532519 539379 545427 550913 556484 562131 567149 570965 573352 573855 571759 566913 560174 552728
58765 552728 545313 538270 531861 526161 520955 516144 512053 508987 506656 504487 502473 501310 501636 503392
58751 503392 505948 508642 511140 513530 516125 519076 522163 525088 527879 530835 534122 537712 541746 546655
58737 546655 552762 559887 567496 575147 582704 590269 598046 606280 615198 624841 634818 644193 651790 656838
58723 656838 659346 659795 658604 656139 653076 650320 648332 646788 645147 643526 642804 643897 647022 651617 656822
58708 656822 661975 666680 670520 672859 673061 670900 666641 660650 653006 643521 632113 619078 605002 590429
58694 590429 575667 560999 546986 534344 523388 513781 505003 496928 489718 483360 477634 472502 468117
58681 468117 464423 461065 457853 455001 452821 451420 450788 450877 451434 452081 452761 453889 455906 458939 463010 468214
58665 468214 474518 481751 490007 499560 509957 519739 527599 533449 537664 539692 538482 534280 529005 524423
58651 524423 520665 516914 512892 509055 505760 502901 500241 497649 495097 492746 490946 489834 489041 488087 487034
58636 487034 486536 487193 488940 490980 492322 492583 492314 492267 492315 491519 489409 486730 484575 483214 482247 481524 481315
58619 481315 481715 482554 483946 486482 490758 496982 504998 514326 524214 533958 543172 551580 558801 564731 569813
58604 569813 574329 577578 578510 577149 574647 571871 568721 565034 561270 557800 554312 550618 547477 545818
58590 545818 545539 545833 546559 548515 552391 558096 565163 573208 581880 590852 600073 609681 619504 628944 637471
58575 637471 644965 651493 657079 661872 666359 671179 676784 683312 690740 699179 709041 720832 734694 750381
58561 750381 767822 787357 808982 831594 853548 873898 892555 909278 923235 933870 941607 947203
58549 947203 950653 951235 948475 942797 935192 926493 916881 906015 893624 879946 865363 849753 832641
58536 832641 814095 795001 776229 757947 740078 722969 707155 692827 680055 669275 660900 654561
58524 654561 649399 645156 642360 641307 641426 641918 642529 643381 644498 645941 648096 651246 654947 658289 660898
58509 660898 663331 666347 670031 673852 677500 681340 685855 690696 694578 696332 695985 694607 693155 691718
58495 691718 689805 686955 682933 677762 671967 666605 662663 660432 659632 660003 661480 664004 667592 672586 679380
58480 679380 687823 697313 707614 719160 732221 746114 759532 771411 781146 788237 792240 793096 791139
58467 791139 786789 780557 773283 765906 758811 751700 744323 737110 730978 726755 724894 725407 727795 731253
58453 731253 735244 739782 744960 750356 755127 758552 760237 759959 757674 753641 748287 741932 734911 727903
58439 727903 721834 717353 714575 713319 713353 714416 716259 718782 721937 725583 729751 734969 741908 750544 760128
58424 760128 770199 781201 793695 807266 820691 833017 843973 853319 860347 864259 864844 862567 858177
58411 858177 852377 845792 838990 832453 826474 821168 816587 812814 809868 807573 805706 804334 803782 804137 804970
58396 804970 805787 806639 808028 810240 812964 815518 817302 818041 817803 816777 814855 811477 806087 798882 790967
58381 790967 783739 778194 774753 773598 775040 779535 787177 797091 807524 816897 824793 831840 838750 845743
58367 845743 852786 859933 867316 875126 883747 893580 904568 916160 927934 939983 952425 964728 975862
58354 975862 985052 992235 997850 1002415 1006258 1009495 1012236 1014814 1017613 1020658 1023674 1026836 1031139 1037643
58340 1037643 1046461 1056872 1068372 1081138 1095451 1111186 1128128 1146361 1165847 1185758 1204715
58329 1204715 1221771 1236886 1250315 1261926 1271441 1279244 1286374 1293413 1299652 1303825 1305685 1306573 1308341
58316 1308341 1312015 1317584 1324658 1332880 1341988 1351977 1363263 1376260 1390725 1405848 1421139 1436960
58304 1436960 1454026 1472561 1492069 1511722 1530886 1549483 1567976 1586733 1605286 1622536 1638008
58293 1638008 1652606 1667650 1683406 1699117 1714524 1730683 1748950 1769631 1792055 1815658 1840370
58282 1840370 1866073 1892332 1918908 1946192 1974887 2005530 2038430 2073667 2110845 2149145 2188134
58271 2188134 2228375 2270883 2316014 2363278 2412186 2462792 2515405 2570293 2627867 2688635 2752612
58260 2752612 2819143 2887648 2958205 3030951 3105174 3179497 3252932 3325441 3397637 3470429 3544985
58249 3544985 3622581 3704241 3790635 3882268 3979568 4082907 4192795 4309985 4435138 4568453
58239 4568453 4709906 4859752 5018524 5186750 5365079 5554494 5755820 5969144 6194318
58230 6194318 6432197 6684945 6955108 7244949 7556721 7892950 8256116 8648530 9072757
58221 9072757 9531917 10029566 10569824 11157847 11799907 12503163 13276080 14129234 15075181
58212 15075181 16127624 17301598 18615012 20090016 21753854 23640592 25793551 28266551
58204 28266551 31123389 34435843 38278176 42717370 47807764 53603825 60191417 67717160
58196 67717160 76394732 86490021 98306006 112181397 128496906 147673656 170149866
58189 170149866 196312800 226336568 259870653 295603008 330896900 361849916 384038165
58182 384038165 393814450 389570879 372270991 344971035 311671130 276155752 241303334
58175 241303334 208929075 179950792 154653302 132932795 114482287 98911732 85815189
58168 85815189 74807165 65542744 57725093 51103599 45469206 40650020 36505808 32921753
58160 32921753 29804230 27078322 24684287 22572988 20703038 19040112 17556134 16227703
58152 16227703 15035119 13962078 12994823 12121138 11330416 10614052 9964553 9374186 8835173
58143 8835173 8340996 7886662 7467794 7080247 6720543 6385895 6073890 5782817 5512129
58134 5512129 5261621 5030102 4815429 4615694 4429556 4255568 4092136 3938332 3793858
58125 3793858 3657953 3529028 3405691 3287592 3175046 3068339 2967563 2872598 2782962 2697956
58115 2697956 2617031 2539699 2465280 2393337 2324215 2258460 2195651 2134623 2074990 2017576 1963039
58104 1963039 1910870 1860317 1811589 1765411 1721778 1679902 1639256 1600026 1562538 1526799 1492736
58093 1492736 1460585 1430732 1403175 1377306 1352357 1328138 1305173 1283984 1264435 1246007 1228414
58082 1228414 1211457 1194449 1176418 1156982 1136493 1115210 1092932 1069709 1046335 1023740 1002298
58071 1002298 982048 963146 945605 928898 912383 896055 880492 866135 852943 840643 828983
58060 828983 817747 806840 796384 786553 777255 768110 758679 748629 737812 726410 715079 704715
58048 704715 695924 688585 681939 675196 668156 661190 654567 648006 641072 633827 626765 620228 614289 609065
58034 609065 604671 600744 596458 591155 584736 577488 569938 562767 556273 549784 542230 533507 524658 516468
58020 516468 508632 500721 493184 486605 480518 473906 466756 460214 455176 451393 448114 445050 442371 440163
58006 440163 438189 436102 433820 431699 430333 430126 431167 433485 437074 441603 446555 451875 457985 464763
57992 464763 471056 475783 479071 481628 483429 483920 483305 482554 482049 481175 479572 477901 476930 476441 475602 473989
57976 473989 471797 469406 467162 465329 463902 462588 461198 459881 458844 458125 457759 457745 457695 456939 455292 453375
57960 453375 451845 450659 449390 447826 445866 443200 439644 435575 431514 427417 422903 418095 413692 410169
57946 410169 407428 405361 404331 404827 406957 410457 415012 420397 426513 433427 441289 450068 459521 469500
57932 469500 480113 491322 502375 511882 518625 522324 523508 522635 519484 513545 504905 494493 483445
57919 483445 472503 462059 452407 443631 435433 427406 419470 411901 404999 398929 393810 389728 386601 384110
57905 384110 381690 378598 374294 369046 363945 359955 356913 353779 349844 345407 341247 337798 335005 332712
57891 332712 330984 330123 330393 331582 332861 333318 332773 331896 331415 331399 331382 330970 330127 329021 327741 326155 323976
57874 323976 321079 317769 314574 311741 309094 306451 303936 301771 300075 299020 298945 299985 301767 303801 306088
57859 306088 309081 313114 318135 323982 330567 337774 345380 353129 360672 367459 372922 376817 379202 380058
57845 380058 379219 376758 373240 369424 365807 362424 358930 354863 350074 344925 339864 334873 329713 324736
57831 324736 320909 318760 317770 317157 316872 317287 318211 318893 318960 318742 318602 318524 318454 318510 318527 317864 316048 313330 310230
57812 310230 306845 303045 299171 295936 293503 291098 287768 283387 278789 275050 272729 271673 271363 271423 271857
57797 271857 272851 274363 275983 277195 277804 278048 278279 278508 278395 277779 277125 277213 278365 280195 282177 284253 286751
57780 286751 289908 293700 297958 302411 306696 310537 313868 316576 318316 318882 318623 318015 316792 313984 309058
57765 309058 302655 295874 289142 282171 274827 267483 260496 253807 247312 241297 236196 232083 228653 225643
57751 225643 223014 220808 219079 218010 217768 218102 218347 218097 217668 217568 217603 216948 215238 213193 211875 211548 211604
57734 211604 211427 210949 210360 209716 209055 208611 208584 208770 208658 207958 206873 205851 205206 205076 205590 206873 208792 210863
57716 210863 212550 213725 214771 216183 218083 220075 221537 222078 221894 221707 222237 223667 225701 228140 231139
57701 231139 234808 238832 242781 246586 250298 253511 255507 256015 255367 253777 250993 247060 242942 239851 238118
57686 238118 237218 236717 236685 237290 238680 241417 246374 253926 263747 275755 290723 309463 331962 358119
57672 358119 389084 426991 473405 528752 593071 665787 743474 818157 878769 915000 920699 895378
57660 895378 844038 775432 699102 622768 551641 488989 436250 392810 356864 327040 302810
57649 302810 283419 267389 253517 241675 232037 224127 217197 211118 206286 202953 201173 200959 201793 202306
57635 202306 201243 198756 196069 193980 192370 191141 190683 191059 191373 190533 188378 185720 183447 181757 180145
57620 180145 178061 175727 174165 174099 174954 175411 174901 173980 173243 172625 171968 171499 171254 170677 169435 168182 167835
57603 167835 168345 168858 168900 168819 169072 169683 170441 171099 171261 170506 168853 166886 165288 164424 164332 164875 165797 166814
57585 166814 167730 168416 168816 169088 169530 170078 170134 169273 168011 167378 167698 168256 168270 167768 167292 167090 166867 166183 164838
57566 164838 162981 160964 159036 157164 155297 153729 152880 152667 152442 151764 150978 150824 151627 153125 154880 156608
57550 156608 158140 159370 160338 161242 162277 163448 164560 165408 166031 166667 167415 168071 168486 168956 169882 171066 171755
57533 171755 171509 170633 169571 168246 166371 164137 162110 160568 159346 158308 157582 157265 157210 157257 157419 157735 158082
57516 158082 158274 158232 158038 158004 158647 160352 162847 165212 166651 167208 167563 168155 168731 168771 168154 167219 166269 165284
57498 165284 164204 163253 162770 162767 162958 163233 163834 164900 166100 166938 167260 167239 167058 166872 166892 167111 167083 166466 165764
57479 165764 165887 166764 167001 165416 162482 159665 157668 156028 154368 153229 153322 154510 155952 156972 157390 157235
57463 157235 156545 155516 154556 154096 154348 155146 155991 156406 156415 156530 157134 158064 158996 159953 161131 162346 163142 163482
57445 163482 163958 165123 166854 168562 169774 170390 170572 170666 171045 171754 172365 172380 171762 170884 170030 169175 168273 167466
57427 167466 166896 166545 166414 166717 167641 168988 170265 171133 171562 171525 170824 169438 167930 167176 167586 168677 169546
57410 169546 169695 169383 169259 169742 170684 171470 171451 170417 168846 167701 167863 169512 171919 174004 175267 176171 177456
57393 177456 179168 180653 181520 182176 183172 184354 185130 185438 185938 187181 188944 190580 191744 192561 193289 194074
57377 194074 194926 195743 196332 196594 196695 196973 197613 198446 199125 199487 199665 199747 199461 198516 197335 197033 198268 200364
57359 200364 201980 202590 202818 203381 204362 205657 207463 209851 212305 214236 215707 217155 218582 219513 219711 219452
57343 219452 219088 218799 218861 219669 221250 223029 224312 224875 225005 225174 225817 227167 229047 230883 232102 232563 232507
57326 232507 232169 231572 230696 229734 229098 229149 229916 231055 232063 232568 232510 232218 232286 233151 234674 236219 237266 237843
57308 237843 238279 238724 239185 239874 241197 243307 245915 248546 250847 252619 253839 254808 256095 258197 261262
57293 261262 265138 269534 274043 278189 281659 284516 287166 290111 293707 298005 302699 307314 311563 315593
57279 315593 319813 324470 329366 334041 338205 341879 345033 347217 347834 346850 345032 343343 342241 341642 341263
57264 341263 340749 339701 337998 336088 334671 334055 333999 334127 334256 334415 334872 336101 338356 341218 343875 345951
57248 345951 347749 349653 351686 353810 356254 359227 362593 366139 369953 374201 378685 382952 386753 390126
57234 390126 393131 395836 398542 401728 405652 410231 415314 420881 426935 433402 440197 447198 454065 460298
57220 460298 465698 470670 475820 481250 486397 490672 494125 497334 500773 504563 508881 514325 521555 530680
57206 530680 541194 552474 564085 575654 586819 597430 607540 617097 625948 634316 642938 652397
57194 652397 662551 672968 683713 695286 707864 721099 734669 748487 762214 775045 786369
57183 786369 796406 805895 815457 825593 836985 850145 864752 879819 894658 909300 923949 938487
57171 938487 952680 966411 979391 991157 1001881 1012822 1025309 1039355 1053802 1067780 1081476
57160 1081476 1095480 1110044 1125146 1140671 1156234 1171369 1186264 1201853 1218798 1236809 1255341
57149 1255341 1274432 1294243 1314182 1333248 1351122 1368321 1385407 1402702 1420692 1440001 1460816
57138 1460816 1482856 1505935 1530053 1554942 1580147 1605670 1631988 1659346 1687731 1717675 1750342
57127 1750342 1786495 1826093 1869404 1917839 1972997 2035343 2104574 2181054 2266194 2361473 2467565
57116 2467565 2584229 2710297 2843674 2982040 3124203 3270893 3424325 3587241 3762482
57107 3762482 3953336 4164045 4399698 4665500 4966439 5308219 5698742 6148429 6669270
57098 6669270 7274175 7977432 8794944 9743170 10837784 12093315 13523039 15137801 16944226
57089 16944226 18943653 21131692 23497336 26021801 28677997 31430241 34232900 37027564
57081 37027564 39739516 42274692 44519769 46349748 47644951 48312254 48301182 47609448 46279711
57072 46279711 44391669 42050893 39374935 36479697 33470401 30438433 27461591 24604371
57064 24604371 21917116 19434988 17178296 15154528 13361057 11787397 10417147 9230321
57056 9230321 8205804 7322952 6562162 5905067 5334665 4835204 4392335 3994210 3632766
57047 3632766 3303492 3003792 2731758 2486061 2265599 2068346 1891009 1730396 1584738
57038 1584738 1453238 1334825 1228139 1132347 1047049 971281 903300 841550 785321 734325 688061
57027 688061 645846 607173 571851 539890 511205 485214 460814 437135 414302 393106 373926
57016 373926 356425 340290 325638 312364 299649 286713 273844 262119 252102 243279 234864 226743
57004 226743 219365 212942 207107 201410 195948 191334 187988 185463 182649 178806 174386 170645 168364 167173
56990 167173 166278 165619 166016 168312 172785 179390 188015 198163 208662 218054 225116 228822 228160 222609 212893
56975 212893 200822 188260 176366 165657 156268 147990 140568 134236 129673 127250 126703 127817 131018
56962 131018 136803 144890 154520 165603 178952 195122 213214 230945 245686 255421 259087 256491 248125
56949 248125 235172 219496 203230 187968 174301 162302 152337 145054 140647 138619 138520 140658 145754
56936 145754 154078 165305 179150 195819 215612 238249 262594 286728 308008 323208 329315 324859
56924 324859 310767 289837 265216 239177 213046 187836 164659 144530 127903 114433 103234
56913 103234 93510 85109 78418 73633 70214 67229 64165 61235 58842 56997 55450 54165 53350 53019 52902
56898 52902 52978 53860 56313 60438 65656 71544 78393 86844 97332 110158 125752 144346 165381 187506
56884 187506 209160 228783 244524 254420 257459 254366 247104 237609 227162 216698 207180 199490 194173
56871 194173 191530 191914 195799 203512 215023 230132 248910 271894 299802 333068 371642 414971
56859 414971 461722 509229 553247 588615 610757 617279 608672 587751 558371 524519 490059 458384
56847 458384 431610 410234 394074 383538 379650 383012 393399 410508 434562 465991 505195 552952
56835 552952 610395 677639 752202 828849 900562 959423 997536 1009007 992450 951798 894448
56824 894448 828272 759715 693573 633400 581503 538627 504207 477470 458464 447879 446015 452369
56812 452369 466392 488098 517644 554621 598097 646805 698433 748576 790950 819078 828242 816740
56800 816740 786303 741498 688079 631260 575046 522444 475459 434909 400854 373388 352728
56789 352728 338599 330130 326576 327715 333493 343810 358858 379038 404032 432083 460235 484888
56777 484888 502091 508222 501422 482530 454440 420654 384436 348570 314945 284236 256363 231372
56765 231372 209627 191319 176139 163499 152783 143483 135371 128550 123109 118770 115097 111948 109420
56752 109420 107394 105460 103322 100971 98478 95904 93482 91542 90091 88682 86867 84670 82562 81057
56738 81057 80321 79994 79417 78303 77242 77228 78528 80240 81218 81244 80975 80887 80721 80083 79251 79016 79870 81624
56720 81624 83836 86215 88440 89958 90404 90158 90040 90337 90452 89738 88362 87092 86448 86380 86630 87007 87326
56703 87326 87435 87459 87808 88803 90412 92323 94130 95403 95820 95395 94551 93899 93907 94586 95439 95825 95603 95300 95435
56684 95435 95866 96116 96189 96559 97321 97953 98072 97931 97833 97496 96472 94905 93409 92395 91931 92063 92727 93406
56666 93406 93485 93075 93025 93957 95644 97480 99070 100097 100105 98966 97367 96369 96398 96994 97499 97725 97930 98443 99450
56647 99450 100978 102952 105291 107926 110688 113263 115412 117142 118511 119419 119856 120281 121327 123061 124900
56632 124900 126439 127947 129755 131559 132861 133861 135268 137141 138570 138785 138145 137599 137488 137394 137008 136551
56616 136551 136222 135714 134652 133278 132358 132365 132932 133166 132475 131117 129949 129523 129439 128746 127053 124999 123443
56599 123443 122434 121292 119613 117767 116405 115782 115741 116010 116328 116486 116486 116530 116690 116775 116662 116516 116444 116179 115509
56580 115509 114883 115081 116230 117576 118417 118933 119818 121336 123055 124493 125839 127960 131665 136866 142484
56565 142484 147342 151206 154863 159185 164380 170175 176422 183230 190584 197980 204472 209197 212122 214267
56551 214267 216828 219973 222809 224631 225721 226580 226930 226171 224609 223410 223154 223025 221820 219379 216621
56536 216621 214313 212216 209560 206129 202597 199720 197374 194687 191123 187093 183364 180212 177466 175019
56522 175019 172810 170488 167672 164540 161708 159509 157876 156845 156546 156602 156234 155293 154603 154865 155706 156300
56506 156300 156441 156388 156010 154884 153211 151997 152093 153388 155008 156029 155999 155082 153798 152513 151225 150012
56490 150012 149373 149680 150469 150836 150542 150191 150178 150052 149221 147881 146859 146749 147510 148710 149849 150593 150985 151380
56472 151380 151991 152622 153037 153412 154158 155350 156635 157717 158680 159789 161182 162834 164656 166476 168004 168987
56456 168987 169429 169609 169780 169805 169208 167711 165740 164282 164132 165309 167162 168889 169960 170260 170068 169847 169943
56439 169943 170423 171138 171828 172218 172253 172317 172930 174050 174895 174763 173923 173416 174020 175632 177528 178978 179712 180065
56421 180065 180695 181844 182962 183369 183204 183275 183923 184603 184763 184597 184564 184646 184662 184930 185978 187681 189304 190432
56403 190432 191264 191938 192172 191885 191626 191998 192925 193910 194818 196015 197768 199870 201880 203511 204716 205569 206160
56386 206160 206645 207359 208717 210753 212810 214035 214332 214489 215140 215958 216240 215991 215871 216171 216435 216222 215752
56369 215752 215582 215902 216407 216672 216533 216293 216587 217807 219565 221003 221777 222417 223482 224720 225408 225316 224928
56352 224928 224797 225050 225551 226160 226693 226903 226738 226539 226809 227751 228993 229800 229726 229208 229391 231090 233922 236664
56334 236664 238488 239575 240482 241314 241834 242150 242782 244012 245589 247361 249793 253387 257654 261212 263137
56319 263137 263862 264409 265073 265330 264927 264409 264415 264960 265745 266761 268159 269772 271296 272875 275052 278086 281708
56302 281708 285625 289854 294317 298459 301572 303439 304464 305234 306089 307003 307772 308350 308994 309983 311177 312172
56286 312172 312983 314286 316668 319778 322565 324333 325334 326374 328107 330719 333994 337535 341071 344706
56272 344706 348821 353684 359233 365192 371252 377134 382694 388091 393727 399960 406982 414998 424346 435277
56258 435277 447703 461261 475601 490734 507355 526761 550028 577007 606423 637244 669744
56247 669744 704895 742993 783298 824866 867174 909880 952467 994236 1034313 1071518 1104562
56236 1104562 1132532 1154968 1171484 1181694 1185549 1183262 1174817 1160071 1139579 1114751 1086795 1056106
56224 1056106 1023182 989535 956763 924977 893087 860680 828791 798643 770441 743783 718561
56213 718561 694897 672559 651117 630598 611552 594513 579645 566866 556044 546954 539179 532145
56201 532145 525393 518990 513613 509980 508113 507347 507010 506831 506675 506292 505568 504738 504208 504352 505551 507978
56185 507978 511096 513759 515253 516011 516961 518393 519908 521263 522788 524983 528119 532184 536822 541303 545043
56170 545043 548284 551932 556581 562031 567929 574435 581912 590234 598886 607694 617065 627377 638454 649898
56156 649898 661785 674737 689265 705318 722658 741607 763206 788700 819087 855155 897668
56145 897668 947363 1005033 1071911 1149828 1240625 1345223 1463158 1592572 1730001 1869953
56135 1869953 2005258 2128803 2235815 2325197 2399202 2462080 2518463 2571734 2622459 2667671 2702011
56124 2702011 2720433 2720723 2704196 2674696 2637047 2595464 2551875 2504705 2449365 2380612 2295250 2193440
56112 2193440 2078297 1954766 1828605 1705746 1591618 1490140 1402780 1328660 1265996 1213502
56102 1213502 1170363 1135314 1106590 1082937 1064038 1049686 1039063 1031273 1026121 1023780 1023803 1024954 1026059
56089 1026059 1026853 1028057 1030749 1035476 1041832 1048989 1056645 1065092 1074417 1084178 1094115 1104558 1115749 1127263
56075 1127263 1138617 1150001 1161856 1174091 1186366 1198856 1212029 1225852 1239885 1254076 1268884
56064 1268884 1284684 1301633 1320032 1340144 1361582 1383499 1405521 1427937 1450848 1473603 1495319
56053 1495319 1515578 1534534 1552650 1570435 1588111 1605555 1622817 1640557 1659590 1680160 1702114
56042 1702114 1725612 1751025 1778254 1806851 1836846 1868724 1902415 1937043 1971985 2007626 2044786
56031 2044786 2083849 2124775 2167472 2211804 2257475 2304171 2351659 2399780 2448696 2499082 2551625
56020 2551625 2606429 2663413 2723188 2786707 2853915 2923553 2994709 3068019 3144990 3226599 3312851
56009 3312851 3403201 3497099 3594487 3696041 3802662 3914726 4032277 4155787 4285985 4422951
55999 4422951 4566306 4716485 4874839 5042109 5217860 5402068 5596288 5802422 6021042
55990 6021042 6251942 6495898 6755062 7031874 7328478 7647117 7990460 8361382 8762667
55981 8762667 9196886 9666602 10175094 10727133 11328747 11986224 12705942 13495359 14363707
55972 14363707 15321868 16382634 17561743 18878509 20355872 22021292 23908588 26059219
55964 26059219 28523094 31360493 34644591 38462800 42918113 48132951 54252833 61444181
55956 61444181 69888117 79780650 91345377 104852713 120634568 139085811 160642755
55949 160642755 185719998 214570906 247023881 282082379 317517082 349766994 374483329
55942 374483329 387722600 387288205 373486306 348882065 317274383 282514933 247704788
55935 247704788 214915854 185281599 159238589 136777353 117642143 101465343 87847399
55928 87847399 76401420 66776052 58663986 51802893 45973750 40996743 36724529 33036088
55920 33036088 29833507 27039142 24590671 22436254 20532705 18845141 17345243 16008775
55912 16008775 14814594 13744727 12783862 11918640 11137661 10431352 9790919 9207696 8674037
55903 8674037 8184231 7733735 7317841 6931684 6571237 6233694 5917155 5620540 5343533
55894 5343533 5086021 4847430 4626629 4422027 4231560 4053149 3885601 3728647 3581792
55885 3581792 3443726 3313280 3190375 3075296 2967489 2865822 2769704 2679142 2593724 2512231
55875 2512231 2433263 2355755 2278986 2202805 2128065 2056312 1988683 1925242 1865375 1808511 1754363
55864 1754363 1702800 1653787 1607283 1563042 1520568 1479446 1439735 1401909 1366322 1332745 1300561
55853 1300561 1269434 1239593 1211340 1184511 1158623 1133354 1108482 1083552 1058154 1032584 1007741
55842 1007741 984172 961654 939879 919049 899473 880977 863073 845488 828218 811344 795075
55831 795075 779716 765306 751552 738379 726233 715425 705507 695710 685812 676054 666378 656225
55819 656225 645039 632549 618721 603990 589498 576503 565324 555290 545861 537356 530328 524609
55807 524609 519414 514294 509684 506470 505176 505560 506998 509211 512493 517079 522392 527231 530743 533033
55793 533033 534790 536562 538451 540238 541640 542500 542750 541990 539141 532869 522635 509234 494227 479011
55779 479011 464590 451868 441755 434986 432079 433322 438358 445627 452533 456445 455677 449702 439001
55766 439001 425075 410295 397004 386364 378178 371899 367502 365178 364495 364427 364207 363718 362918 361297 358233
55751 358233 353578 347535 340152 331389 321688 311998 303117 295294 288623 283463 280078 277976 275886 272582
55737 272582 267736 262022 256462 251629 247386 243384 239759 237145 235888 235362 234302 231843 228143 223966
55723 223966 219788 215433 210550 205333 200692 197680 196696 197257 198553 200254 202757 206562 211367 215850 218541
55708 218541 219014 218122 216979 215906 214532 212762 211151 210089 208995 206749 202876 197941 192743 187508 182097
55693 182097 176659 171621 167099 162814 158789 155755 154482 154859 155970 157017 157822 158489 159070 159829 161387
55678 161387 164087 167385 170276 172280 173641 174613 175107 175143 175129 175378 175731 176000 176401 177094 177552 177024 175595
55661 175595 174224 173604 173470 173290 173101 173268 173728 174022 174063 174412 175641 177689 180010 182133 183850 184964 185154
55644 185154 184241 182394 179878 176660 172496 167470 162132 156960 151891 146612 141147 135875 131134 127224
55630 127224 124620 123612 123609 123400 122399 121223 120744 120989 121415 121826 122387 122870 122557 120940 118128 114597 110969
55613 110969 108021 106349 105784 105445 104537 102864 100592 97933 95206 92843 91074 89805 88875 88170 87473 86650
55597 86650 86091 86460 87700 88761 88686 87621 86381 85397 84610 84120 84260 85024 85996 87005 88489 91049 94854
55580 94854 99555 104620 109725 115020 121046 128255 136631 145846 155571 165360 174329 181296 185371 186292 184303
55565 184303 179904 173681 166194 158039 150009 142873 136725 130846 124555 117992 111673 105621 99546 93678
55551 93678 88685 84760 81484 78733 76963 76327 76233 76203 76522 77539 78838 79777 80439 81350 82485 83297 83618
55534 83618 83852 84171 84119 83226 81561 79535 77578 76239 76100 77177 78579 79269 79149 79116 79915 81212 81962
55517 81962 81567 80367 78963 77443 75579 73558 71990 71032 70051 68474 66678 65567 65406 65489 64968 63614
55501 63614 61718 59653 57707 56109 54936 54118 53642 53654 54215 55054 55681 55750 55194 54121 52705 51236 50099
55484 50099 49510 49262 48879 48204 47738 48190 49659 51495 53064 54366 55698 56937 57572 57423 56954 56720 56685
55467 56685 56302 55225 53810 52865 52886 53598 54305 54632 54756 54889 54880 54526 54009 53613 53192 52328 51032 49793 48855
55448 48855 47888 46633 45524 45250 45841 46526 46522 45797 44990 44742 45143 45838 46635 47838 49792 52232 54378 55752
55430 55752 56562 57189 57623 57685 57489 57393 57601 58122 58910 59756 60244 60214 60211 61029 62781 64765 66283 67204 67734 68056
55410 68056 68366 68770 68931 68262 66767 65247 64261 63317 61701 59756 58573 58506 58757 58589 58187 58009 57940 57543
55392 57543 56703 55574 54293 53266 53277 54661 56598 57857 58126 57945 57583 56797 55741 55104 55038 54820 54113
55375 54113 53752 54542 55895 56561 56328 56020 55984 55636 54639 53606 53217 53380 53667 54003 54406 54547 54184 53736 53806
55356 53806 54271 54382 53746 52733 51887 51358 51029 50889 51074 51688 52654 53638 54159 53957 53275 52619 52273 52149 52012
55337 52012 51638 50874 49869 49177 49255 49842 50236 50259 50462 51188 51922 51961 51363 50731 50296 49800 49194 48887 49170 49842
55317 49842 50554 51155 51519 51396 50748 49991 49648 49896 50591 51502 52315 52659 52526 52491 53191 54622 56209 57542
55299 57542 58700 59909 61187 62382 63255 63474 62829 61608 60489 59951 59920 60066 60172 60120 59854 59610 59883 60844
55281 60844 61890 62115 61223 59800 58706 58353 58534 58782 58884 59022 59365 59595 59175 58220 57671 58257 59591 60738
55263 60738 61406 61975 62518 62568 62039 61610 61785 62092 61738 60671 59469 58448 57522 56824 56805 57526 58367 58692 58463
55244 58463 58044 57678 57386 57147 56891 56493 55965 55542 55329 55045 54395 53584 53120 53128 53166 52855 52433 52500 53367 54789
55224 54789 56244 57329 57913 58021 57620 56611 55154 53875 53430 53815 54449 55038 55940 57355 58637 59017 58727
55207 58727 58659 58995 58953 58178 57558 58144 59805 61593 63010 64245 65386 66164 66472 66481 66161 65290 64091 63275
55189 63275 63213 63503 63563 63268 62783 62253 61984 62433 63536 64405 64262 63466 63074 63501 64191 64551 64571 64422 64041 63528
55169 63528 63507 64583 66554 68570 69984 70746 70966 70528 69314 67563 65759 64259 63220 62774 62971 63531
55153 63531 63932 63876 63539 63221 62981 62769 62701 62880 63043 62750 61902 60782 59613 58439 57466 57100 57424 57995 58317
55134 58317 58264 57880 57190 56508 56542 57686 59369 60554 60801 60489 60205 60353 61196 62678 64154 64825 64656 64450
55116 64450 64894 65841 66694 67063 66917 66433 65999 66035 66533 67035 67275 67600 68432 69622 70648 71212 71321 70987 70310
55097 70310 69747 69794 70346 70743 70551 69969 69425 69047 68726 68484 68559 69175 70216 71074 70939 69535 67616 66454
55079 66454 66647 67593 68257 68248 67950 67792 67776 67798 68100 69063 70518 71542 71259 69794 68259 67692 68209 69264 70417
55060 70417 71549 72498 72983 72974 72776 72582 72188 71352 70217 69245 68836 69184 70309 71994 73725 74880 75039 74160
55042 74160 72594 71009 70061 69903 70097 70180 70157 70316 70705 71075 71249 71275 71183 70873 70291 69542 68806 68274 68161 68551
55022 68551 69137 69293 68537 66878 64773 62890 61862 62008 63158 64886 66903 69098 71175 72572 72870 72206
55006 72206 71222 70744 71394 73117 74978 75864 75649 75354 75872 76902 77546 77592 77577 77737 77674 77187 76779 77000 77717
54987 77717 78470 79160 79959 80778 81376 81887 82708 83786 84482 84414 84082 84314 85286 86542 87898 89726 92052 93835
54969 93835 93877 92366 90882 90570 90958 91023 90873 91515 93169 94776 95405 95291 95076 94741 93966 93057 92664 92755 92608
54950 92608 91820 90707 89636 88618 87689 87093 86746 86062 84746 83443 83112 83924 85200 86352 87465 88905
54934 88905 90653 92214 93031 92908 92171 91547 91791 93245 95625 98276 100745 103171 106071 109765 114174 119217
54918 119217 125126 132103 139866 147826 155564 162678 168284 171240 171078 168305 163658 157529 150348 142935
54904 142935 136018 129755 124151 119566 116248 113653 110878 107694 104634 102131 100123 98442 97025 95731
54890 95731 94490 93676 93740 94381 94728 94538 94581 95617 97593 100201 103592 107997 113133 118583 124463 131131
54874 131131 138461 145910 153113 159912 165991 170909 174343 175851 174738 170808 165122 159226 153588 147426
54860 147426 140196 132587 125743 120057 115095 110384 105956 102293 99893 98672 97761 96207 93937 91682
54846 91682 89918 88419 86978 85924 85497 85271 84777 84325 84525 85182 85346 84537 83357 82675 82640 82777 82784 82898
54828 82898 83417 84169 84662 84753 84921 85670 86781 87500 87439 86920 86350 85721 84948 84299 84065 84074 83909 83527 83296 83540
54808 83540 84316 85512 86832 87826 88248 88365 88620 89102 89573 89908 90206 90574 91087 91810 92583 92963 92742 92344
54790 92344 92283 92435 92333 92016 91977 92336 92702 92881 93108 93484 93867 94512 96099 98773 101788 104487 107038 109705
54772 109705 112060 113727 115490 118710 123669 129269 134527 139764 146022 153779 162555 171421 179470 185880
54758 185880 189945 191330 190278 187439 183387 178310 172172 165083 157389 149526 141982 135310 129828 125267
54744 125267 121087 117226 114203 112324 111141 110010 108836 107976 107611 107583 107665 107656 107319 106637 106089 106372 107754
54727 107754 109874 112175 114391 116727 119652 123513 128299 133850 140184 147272 154504 160845 165751 169428
54713 169428 171898 172380 170189 165849 160664 155339 149645 143283 136470 129685 123421 118216 114352 111467
54699 111467 108902 106532 104802 103991 103879 104141 104505 104475 103571 102059 100920 100781 101233 101391 100714 99149 96954
54682 96954 94717 93197 92814 93438 94686 96116 97149 97341 96893 96457 96303 96140 95832 95628 95483 94852 93551
54665 93551 92197 91392 91065 91019 91444 92329 93055 93251 93505 94427 95559 96042 95923 95830 95720 95084 94235 94226 95343
54646 95343 96669 97377 97548 97546 97460 97555 98319 99602 100429 100184 99405 98898 98706 98475 98221 98020 97451 96142 94643
54627 94643 94028 94732 96239 97760 98703 98728 97979 97199 96993 96986 96292 94849 93684 93657 94456 95112 95101 94679 94417
54608 94417 94733 95630 96590 96838 96066 94854 94151 94347 95047 95756 96510 97630 99047 100157 100442 99996 99332 98774
54590 98774 98229 97473 96456 95389 94736 95020 96356 98176 99736 100831 101675 102122 101677 100529 99844 100452 101674
54573 101674 102232 102047 102294 103655 105362 106260 106113 105472 104802 104337 104406 105204 106249 106663 106244 105915 106790 108853
54555 108853 110847 111558 111063 110486 110616 111135 111338 111220 111372 112067 113000 113900 114775 115447 115546 115287 115674 117306
54537 117306 119365 120385 119871 118638 117710 117470 117824 118563 119386 119952 120162 120180 120166 120304 120948 122250 123623 124096
54519 124096 123429 122353 121471 120502 119039 117586 117117 117747 118437 118066 116449 114241 112245 110902 110174 109756
54503 109756 109498 109607 110259 111145 111680 111688 111577 111789 112341 112966 113433 113561 113198 112414 111675 111623 112623 114495 116622
54484 116622 118373 119581 120619 121871 123185 124009 124073 123703 123475 123831 125060 127287 130240 133254 135703 137320
54468 137320 138041 137872 137132 136485 136353 136487 136450 136358 136711 137586 138496 139055 139307 139293 138764 137593 136141 134887 133963
54449 133963 133286 132876 132694 132361 131472 130159 128959 128153 127590 127194 127219 127831 128744 129519 130018 130288 130189 129425 127959
54430 127959 126181 124641 123703 123433 123646 124146 124990 126443 128464 130382 131357 131154 130238 129150 128141 127446
54414 127446 127450 128290 129563 130706 131518 132071 132355 132371 132417 132880 133704 134382 134553 134356 134174 134241 134579 135125 135814 136594
54394 136594 137333 137754 137658 137398 137769 139054 140403 140697 139919 139036 138552 137990 137022 136287 136532 137497 138293 138489
54376 138489 138160 137219 135534 133622 132430 132258 132440 132258 131673 131068 130807 131221 132539 134470 136245 137404
54360 137404 138213 139023 139530 139097 137606 135607 133734 132303 131403 131002 130891 130774 130515 130113 129461 128413 127148
54343 127148 126228 126060 126427 126741 126726 126614 126696 126922 127100 127262 127528 127707 127428 126754 126284 126443 126918 127107 126872
54324 126872 126517 126201 125874 125727 126145 127077 127858 127998 127835 128134 129216 130758 132314 133751 135190 136710 138166
54307 138166 139186 139445 139014 138332 137704 136940 135658 133871 132016 130386 128734 126612 124031 121651 120245
54292 120245 120084 120856 122035 123126 123660 123340 122410 121636 121662 122499 123769 125174 126437 127125 126981 126308 125520
54275 125520 124504 123033 121730 121764 123363 125312 126318 126314 126040 125945 126074 126500 127165 127605 127505 127337 127832 128957
54257 128957 130042 130783 131454 132141 132464 132218 131723 131344 131113 130976 130979 131037 130913 130566 130164 129661 128839 127878 127314
54238 127314 127200 126857 125832 124608 123922 123813 123912 124266 125193 126442 127260 127403 127439 127865 128425 128564 128155 127416
54220 127416 126399 125018 123441 122078 121190 120823 121085 122112 123614 124842 125261 125087 124834 124554 123914 122964
54204 122964 122306 122328 122668 122752 122597 122730 123423 124326 124836 124606 123766 122799 122113 121573 120644 119230 118075 117914 118397
54185 118397 118411 117412 115951 114844 114350 114361 114819 115594 116277 116515 116403 116339 116661 117495 118689 119700 119932 119404
54167 119404 118767 118375 117784 116545 115115 114348 114282 114118 113401 112563 112150 112040 111783 111319 111001 111055 111343 111569 111529
54148 111529 111218 110882 110940 111667 112928 114308 115474 116326 116807 116809 116386 115957 116054 116819 117882 118829 119582 120260 120834
54129 120834 121181 121359 121574 121925 122449 123273 124399 125362 125547 124928 124120 123585 123225 122853 122595 122617 122925 123736 125472
54110 125472 127949 130080 130981 130982 130927 130857 130195 128956 127786 126805 125383 123382 121750 121389 121994 122504 122239 121179
54092 121179 119638 118192 117575 118079 119211 120384 121664 123377 125245 126518 126899 126752 126368 125614 124459 123308
54076 123308 122555 122184 122120 122632 123937 125568 126649 126841 126650 126632 126673 126329 125615 124992 124577 123952 123000 122489 123308
54057 123308 125289 127329 128679 129653 130926 132652 134556 136504 138529 140411 141703 142216 142265 142431 143192 144730
54041 144730 146817 148913 150506 151452 151973 152407 153054 154054 155218 156107 156520 156836 157575 158623 159163 158551 157014
54024 157014 155393 154340 153930 153864 153824 153663 153465 153423 153499 153200 151949 149784 147475 145698 144318 142845 141497
54007 141497 141184 142213 143521 143743 142778 141736 141457 141686 141773 141599 141528 141871 142666 143662 144334 144282 143894 144254 146119
53988 146119 149313 153333 158089 163574 169281 174681 180096 186453 194202 203033 212570 222569 232222 239887
53974 239887 243937 243694 239421 231916 222386 212287 202745 194132 186401 179666 174253 170303 167547 165458
53960 165458 163595 161886 160609 159989 159805 159579 159116 158572 158032 157427 156975 157274 158619 160526 162268 163684
53944 163684 165170 166994 168976 170769 172232 173554 175208 177692 181193 185522 190448 195799 201150 205727
53930 205727 209039 211407 213490 215366 216444 216234 214839 212748 210480 208432 206700 205002 203108 201359
53916 201359 200391 200267 200319 199954 199235 198429 197435 196038 194395 192815 191252 189493 187737 186480 185782 185069 183830
53899 183830 182143 180345 178524 176617 174727 172981 171231 169284 167413 166226 165868 165648 164689 162811 160576
53884 160576 158582 156964 155565 154335 153404 152881 152705 152683 152592 152323 152011 152046 152845 154454 156302 157455 157312
53867 157312 156149 154853 154005 153381 152423 151060 149781 148993 148595 148222 147685 147088 146694 146789 147477 148533 149575
53850 149575 150433 151141 151600 151533 150951 150375 150342 150864 151522 151943 152007 151819 151704 152018 152712 153296 153528 153864 154890
53831 154890 156500 158149 159709 161487 163457 165134 166411 167868 169939 172232 174159 175924 178511 182878
53817 182878 189457 198204 208791 220922 234740 250674 268368 285788 299855 308166 310010 305973
53805 305973 297180 285110 271628 258506 246777 236676 228148 221192 215692 211230 207384 204187 202009
53792 202009 200874 200174 199301 198367 197919 198016 198014 197288 195770 193616 190865 187775 185190 184005 184292 185227 185851
53775 185851 185674 184788 183741 183202 183399 183965 184546 185363 186792 188645 190521 192758 196282 201304 206822 211745
53759 211745 215932 219679 222721 224370 224399 223156 220899 217600 213398 208798 204304 200189 196661 193857 191521
53744 191521 189093 186321 183631 181663 180643 180333 180416 180694 181049 181470 182111 183100 184220 184964 185080 185022 185698
53727 185698 187654 190527 193417 195765 197824 200211 203126 206132 208676 210695 212592 214672 216698 218172
53713 218172 219054 220016 221815 224532 227643 230753 233893 237058 239896 242214 244470 247310 250690 253872 256357
53698 256357 258484 260987 264170 267735 271230 274490 277660 280874 283973 286570 288420 289619 290320 290392 289546
53683 289546 287799 285611 283565 282015 281007 280336 279735 279188 279021 279473 280229 280660 280497 279946 279116 277727 275589
53666 275589 273053 270765 269136 268196 267730 267408 266970 266523 266399 266617 266703 266336 265833 265700 265918 266109 266237 266647
53648 266647 267445 268279 268818 269119 269405 269818 270502 271632 273138 274596 275639 276392 277333 278755 280437 281894
53632 281894 282937 283963 285629 288142 290999 293608 296018 298820 302355 306300 310080 313438 316521 319598
53618 319598 322896 326558 330610 334963 339448 343809 347762 351260 354729 358795 363643 368712 373219 376936
53604 376936 380397 384261 388474 392179 394602 395993 397441 399639 402079 403625 403639 402353 400442 398609 397319
53589 397319 396419 395157 393027 390477 388254 386205 383474 379954 376686 374509 373013 371295 369171 367080
53575 367080 365264 363620 362032 360327 358247 355970 354277 353588 353161 351998 350332 349387 349727 350696 351599 352592
53559 352592 354065 355836 357427 358704 359802 360802 361877 363460 365856 368791 371663 374178 376582 379445
53545 379445 383412 388945 396053 404362 413560 423617 434453 445661 456774 467585 478038 488001 497472
53532 497472 506796 516348 526060 535540 544660 553787 563480 574153 586022 599104 613255 628329 644378
53519 644378 661629 680328 700689 722897 747038 773069 800928 830467 861110 891793 921634
53508 921634 950633 979389 1008120 1036365 1063761 1090690 1117883 1145649 1173885 1202578 1231809
53497 1231809 1261223 1290027 1317762 1344755 1371472 1397674 1422654 1446214 1468980 1491616 1514081
53486 1514081 1535885 1556778 1576901 1596498 1615849 1635429 1655670 1676354 1696410 1714451 1729495
53475 1729495 1741230 1749847 1755739 1759160 1759934 1757476 1751214 1741076 1727646 1711910 1694794 1676866 1658321
53462 1658321 1639211 1619542 1599139 1577624 1554722 1530523 1505302 1479132 1451934 1423916 1395738
53451 1395738 1368141 1341475 1315644 1290426 1265803 1242017 1219256 1197412 1176364 1156612 1139333
53440 1139333 1125446 1114766 1106315 1099283 1093373 1088457 1084528 1081984 1081470 1083229 1087011 1092704 1100573 1110660
53426 1110660 1122396 1135191 1149200 1165211 1183933 1205466 1229291 1254597 1280835 1308015 1336295
53415 1336295 1365465 1395325 1426568 1460494 1497569 1536868 1577366 1619212 1663240 1709798 1758764
53404 1758764 1810315 1864866 1922408 1982571 2045232 2110442 2177792 2246427 2315747 2385619 2456061
53393 2456061 2527158 2599145 2671908 2744421 2815293 2883859 2950100 3013542 3073105 3128294 3179736
53382 3179736 3228101 3273119 3314131 3351093 3384393 3413967 3439204 3459646 3475354 3486527 3492922
53371 3492922 3493502 3486465 3469809 3442263 3403803 3355395 3298479 3234738 3165926 3093570 3018853 2942872
53359 2942872 2866783 2791526 2717616 2645374 2575197 2507413 2441972 2378467 2316395 2255324 2194896
53348 2194896 2134733 2074356 2013422 1952262 1892027 1833924 1778392 1725419 1675518 1629730 1588503
53337 1588503 1551200 1516975 1485659 1457465 1432300 1409786 1389496 1370797 1352792 1334892 1317223
53326 1317223 1300156 1283773 1268134 1253705 1240964 1229791 1219712 1210570 1202573 1195898 1190665 1187108
53314 1187108 1185332 1185126 1186409 1189591 1194964 1201980 1209761 1218218 1228127 1240270 1255013 1272562 1292889
53301 1292889 1315393 1339354 1364806 1392348 1422060 1453283 1485641 1519497 1555029 1591468 1627641
53290 1627641 1662831 1696739 1729108 1759773 1788712 1815693 1840167 1861879 1881207 1898546 1913617
53279 1913617 1925712 1934275 1938975 1939640 1936640 1931004 1923564 1914061 1901474 1885076 1864791 1840742 1813024
53266 1813024 1781962 1748227 1712609 1675757 1637981 1599086 1558718 1517194 1475718 1435340 1396035
53255 1396035 1357294 1319265 1282568 1247217 1212620 1178692 1146007 1114582 1083375 1051479 1019097
53244 1019097 986783 954353 921354 888222 856181 826134 798260 772558 749124 727866 708588
53233 708588 691467 676925 664875 654452 644582 634529 623898 612593 600930 589337 577770 565743
53221 565743 553037 539919 526520 512526 497853 483173 469321 456540 444760 434294 425579 418273
53209 418273 411241 403600 395415 387302 379713 372713 366113 359594 352857 345782 338450 331103 324220 318421
53195 318421 313966 310440 307225 304217 301690 299585 297449 295152 293137 291769 290870 290084 289333 288685 288129
53180 288129 287717 287570 287513 287066 286010 284671 283432 282391 281658 281448 281536 281167 280022 278806 278289 278184 277652
53163 277652 276536 275319 274178 272984 272101 272190 273073 273695 273470 272879 272399 271644 270070 267887 265676 263550
53147 263550 261292 259002 257065 255647 254619 253833 253163 252457 251728 251175 250782 250210 249354 248583 248032 247121 245399
53130 245399 243510 242558 242626 242646 241798 240407 239339 239101 239707 240855 241877 241995 241051 239733 238791 238272 237743
53113 237743 236949 235901 234574 232975 231377 230071 228880 227338 225397 223606 222426 221636 220648 219154 217279
53098 217279 215316 213621 212673 212777 213660 214591 215070 215182 215159 214912 214288 213584 213408 214036 215168 216324 217174 217484
53080 217484 217149 216448 215998 216150 216608 216820 216613 216272 216109 216169 216251 216033 215291 214202 213317 213026 213118 213085 212746 212339
53060 212339 212071 211927 211972 212519 213786 215489 216970 217716 217775 217654 217814 218181 218243 217693 216822 216109 215611 215096 214662
53041 214662 214752 215435 216085 216074 215494 214849 214278 213521 212557 211850 211809 212335 213036 213593 213723 213139 211886 210637 210172
53022 210172 210564 211186 211567 211859 212309 212679 212573 212099 211748 211669 211509 210980 210209 209402 208538 207637 207037 207100 207750
53003 207750 208539 209086 209327 209421 209586 209946 210430 210877 211268 211709 212120 212202 211841 211305 210852 210368 209695 209079 208952
52984 208952 209373 210046 210808 211742 212822 213771 214347 214549 214529 214490 214619 214907 215157 215436 216305 218166 220469 222147
52966 222147 222890 223455 224559 226069 227570 229118 230864 232319 232684 231836 230447 229135 227934 226594 224967
52951 224967 222960 220491 217690 214965 212704 211052 210019 209622 209839 210555 211622 212848 213900 214405 214194
52936 214194 213401 212291 211174 210419 210281 210537 210545 209870 208792 208017 207969 208464 208983 209092 208684 208020 207502 207311 207242
52917 207242 207016 206645 206335 206072 205550 204573 203349 202313 201737 201588 201613 201536 201301 201102 201071 200986 200553 199952 199721
52898 199721 199961 200110 199801 199533 200013 201128 202108 202600 202947 203454 204005 204492 205000 205376 205243 204763 204776 205667 206611
52879 206611 206541 205523 204515 204021 203665 203035 202273 201763 201786 202573 204201 206218 207777 208381 208292 208136 208376 209131
52861 209131 210114 210684 210332 209254 208113 207217 206317 205270 204319 203550 202571 201082 199333 197664 196010 194240
52845 194240 192628 191483 190631 189724 188869 188423 188312 188059 187459 186805 186477 186684 187493 188654 189471 189350 188504 187585
52827 187585 186596 184808 182026 179314 178009 178331 179438 180555 181575 182676 183907 185205 186445 187409 188034
52812 188034 188756 190218 192419 194460 195430 195332 194822 194225 193287 191917 190593 189713 188923 187603 185859 184470
52796 184470 183824 183414 182587 181383 180353 179849 179857 180227 180697 180885 180698 180645 181250 182213 182669 182372 182054 182361 182924
52777 182924 183015 182762 183041 184194 185450 185917 185701 185642 186126 186623 186435 185566 184605 184005 183754 183722 183982 184596 185233
52758 185233 185312 184602 183529 182803 182722 182962 183039 182888 182905 183449 184433 185455 186220 186764 187371 188393 190047 192160
52740 192160 194090 195130 195137 194684 194592 195369 197000 199031 200818 201927 202396 202494 202279 201683 200986 200728 200972 201140
52722 201140 200878 200637 200935 201400 201233 200403 199683 199467 199262 198577 197650 196970 196503 195855 194921 193992 193401 193389 194100
52703 194100 195377 196716 197743 198612 199587 200395 200420 199592 198639 198323 198710 199435 200445 202105 204535 207104 208794
52686 208794 209145 208708 208471 208855 209400 209468 209006 208445 208047 207684 207238 206863 206675 206422 205801 205003 204645 205091 206046
52667 206046 206932 207511 207966 208496 209149 210074 211668 214225 217532 220977 223983 226202 227392 227370 226195 224166
52651 224166 221488 218102 214014 209747 206249 204202 203459 203278 203051 202725 202490 202259 201701 200790 200058 200139 201162
52634 201162 202723 204275 205386 205826 205784 206001 207381 210172 213661 216736 218684 219440 219262 218413 217104 215559
52618 215559 213996 212496 210969 209383 208033 207415 207683 208431 209195 209956 210900 211873 212562 213092 213910 214966 215638
52601 215638 215736 216008 217183 218933 220391 221409 222619 224310 225980 227147 228022 229028 230142 231115 232031 233132
52585 233132 234243 234887 235003 235092 235468 235786 235676 235481 235845 236564 236484 234837 232254 230052 228825 228250 228007 228163
52567 228163 228526 228383 227281 225596 223891 222166 220232 218487 217593 217515 217547 217335 217225 217446 217594 217325 217114
52550 217114 217818 219648 221962 223961 225270 225904 225971 225550 224684 223505 222399 221950 222497 223745 224956 225563
52534 225563 225490 224955 224150 223179 222096 220869 219457 218041 217081 216839 216864 216261 214642 212614 211100 210397 210238
52517 210238 210622 211972 214277 216659 218301 219521 221362 224227 227506 230594 233627 236890 239969 241995
52503 241995 242567 242045 241011 239796 238490 237067 235417 233479 231505 229968 229054 228362 227278 225642 223899
52488 223899 222627 222042 222001 222352 223130 224459 226372 228695 231003 232725 233560 233834 234258 235156 236143 236725 237032
52471 237032 237644 238791 240139 241361 242588 244106 245906 247770 249655 251772 254326 257234 260000 261805
52457 261805 261949 260439 258061 255725 253667 251450 248644 245421 242434 240220 238763 237664 236686 235989 235755
52442 235755 235749 235529 235011 234501 234197 234007 233911 234045 234241 233897 232710 231207 230155 229759 229873 230686 232523 235049
52424 235049 237412 239332 241409 244079 246882 249231 251441 254390 258425 263307 269171 276837 286780 298159
52410 298159 309167 318139 324066 326356 324677 319324 311473 302693 294106 286026 278330 270994 264287 258686
52396 258686 254704 252630 252174 252425 252395 251734 250888 250639 251558 253746 256741 259694 261987 263834 266018 268885
52380 268885 271893 274465 276935 280188 284417 288831 292701 296270 300270 304906 309717 314335 318952 323882
52366 323882 328936 333409 336659 338711 340300 342272 344830 347481 349777 351923 354414 357302 360291 363512
52352 363512 367661 373200 379897 387455 396084 405975 416603 427265 438139 450126 463598 478009 492897
52339 492897 508613 525649 543839 562706 582232 602679 623920 645500 667300 689636 712685
52328 712685 736205 759809 783145 805841 827641 848650 869010 888216 905138 918926 929626
52317 929626 937773 943717 947596 949614 949982 948713 945842 941818 937386 932992 928493 923496 917842 911721
52303 911721 905461 899408 893963 889488 886041 883341 881225 880043 880272 881705 883470 885121 887301 890917
52289 890917 896006 901979 908822 917326 928034 940555 954153 968454 983331 998552 1013923 1029398
52277 1029398 1044722 1059300 1072766 1085288 1096971 1107343 1115926 1122884 1128486 1132167 1132856 1130229 1125016
52264 1125016 1118112 1109985 1100991 1091549 1081712 1071142 1059881 1048735 1038570 1029562 1021455 1014148 1007567
52251 1007567 1001254 994629 987613 980565 973654 966711 959732 953142 947355 942384 938164 935136 934134 935586
52237 935586 938945 943036 946959 950597 954309 958351 962643 966926 970965 974695 978401 982689 988064 994496
52223 994496 1001510 1008683 1015924 1023373 1031321 1040144 1049974 1060322 1070295 1079324 1087459 1094892 1101536 1107266
52209 1107266 1112245 1116721 1120731 1124350 1128018 1132219 1136790 1140860 1143572 1144781 1145095 1145450 1146483 1148055
52195 1148055 1149324 1149549 1148877 1148179 1148028 1148065 1147430 1145667 1143000 1139799 1136032 1131389 1125868 1119973 1114173 1108274
52179 1108274 1101658 1094246 1086950 1080940 1076593 1073348 1070520 1068024 1066329 1065834 1066339 1067115 1067582 1067929 1068796
52164 1068796 1070346 1072069 1073757 1076176 1080171 1085395 1090626 1095277 1099818 1104638 1109305 1113375 1117255 1121648
52150 1121648 1126619 1131869 1137651 1144670 1153152 1162679 1172983 1184212 1196212 1208181 1219536 1230755
52138 1230755 1242895 1256408 1270834 1285475 1300034 1314635 1329660 1345627 1362841 1380977 1399260
52127 1399260 1417261 1435252 1453579 1471928 1489589 1506268 1522122 1536923 1549748 1559847 1567496
52116 1567496 1573554 1578363 1581568 1582891 1582481 1580289 1575660 1568036 1557904 1546690 1535693 1525346 1515396
52103 1515396 1505552 1495959 1487334 1480645 1476427 1474347 1473636 1473998 1475881 1479732 1485179 1491178 1496810 1501826
52089 1501826 1506624 1512033 1519043 1528276 1539532 1552089 1565650 1580704 1597671 1615947 1634306 1652181
52077 1652181 1669922 1687640 1704370 1718923 1731146 1741765 1751081 1758415 1762850 1763915 1761507 1755747
52065 1755747 1747196 1736665 1724460 1710186 1693592 1675134 1655268 1633760 1610429 1586202 1562514
52054 1562514 1539703 1516791 1492977 1468543 1444100 1419739 1395398 1371468 1348438 1326347 1305150
52043 1305150 1285318 1267526 1251957 1238473 1227251 1218700 1212825 1209207 1207579 1207830 1209406 1211280 1212720
52030 1212720 1213654 1214114 1213708 1211877 1208320 1202963 1195922 1187771 1179431 1171351 1162990 1153445 1142484 1130620
52016 1130620 1118381 1105843 1092775 1078782 1063245 1045526 1025451 1003543 980764 958142 936501
52005 936501 916169 896773 877481 857668 837439 817541 798821 781673 765865 750968 736999
51994 736999 724513 713884 704686 696045 687513 679266 671506 664034 656466 648520 639973 630683 620852 610975
51980 610975 601289 591531 581465 571413 561910 553055 544602 536637 529763 524496 520750 518120 516474 516106
51966 516106 517320 519976 523438 526938 529967 532355 534064 535013 535137 534454 532958 530496 526837 521864 515698
51951 515698 508753 501748 495569 490967 488336 487718 488891 491481 495292 500616 507998 517481 528293 539479
51937 539479 550625 561646 572051 580769 586748 589423 588672 584695 578010 569304 559081 547586 535010
51924 535010 521588 507541 493269 479555 467178 456172 445849 435770 426356 418261 411471 405410
51912 405410 399778 394907 391334 389371 389042 390109 392134 394828 398424 403457 410022 417484 425025 432238
51898 432238 438923 444445 447663 447612 444144 437879 429830 421143 412945 405986 400373 395883 392589 390931 391076
51883 391076 392558 394901 398381 403731 411069 419536 428122 436568 445321 454783 464809 474746 483776 491298
51869 491298 497108 501199 503398 503470 501723 499377 498117 499280 503508 510906 521208 533632 546675 558259
51855 558259 566351 569724 568242 562429 552978 540785 527102 513010 498688 483783 468705 454937
51843 454937 443645 434425 426031 417990 410845 405016 400259 396378 393764 392797 393105 393803 394242 394292 394086 393796
51827 393796 393562 393429 393280 392874 391871 389939 387058 383804 381083 379410 378604 378260 378333 379106 380823 383590
51811 383590 387445 392192 397132 401231 403711 404401 403498 401128 397274 392164 386547 381446 377561 374923 373082
51796 373082 371460 369494 366737 363161 359363 356198 354175 353325 353584 355023 357565 360715 363708 365863 366754
51781 366754 366283 364725 362598 360389 358446 357151 356939 358004 360152 363111 366864 371525 377039 383248 390128
51766 390128 397705 405695 413431 420203 425493 428860 429770 427770 422831 415448 406414 396576 386788 377894
51752 377894 370515 364718 360042 355999 352598 350282 349374 349780 351338 354336 359416 366844 376031 385973 396182
51737 396182 406879 418115 428965 438054 444897 450285 455280 460283 465346 470713 476292 480737 481911
51724 481911 478604 471484 462318 452710 443715 436092 430345 426522 424177 422489 420459 417355 413153 408396
51710 408396 403613 399252 396243 395973 399125 404709 410609 414976 416922 416332 413706 410199 407304 406240 407685
51695 407685 411819 418153 425345 431648 435709 436774 434404 428655 420715 412717 406287 401388 396902 392232
51681 392232 387988 385162 384097 384472 386022 388866 393189 398985 406335 415566 426718 438902 450685 461215
51667 461215 470527 478485 483872 485028 481296 473592 463803 454018 446042 440884 438346 437346 436702 435477
51653 435477 432797 428021 421317 413717 406292 399501 393384 387920 382842 377505 371422 364853 358464 352465
51639 352465 346505 340476 334942 330532 327155 324179 321355 319199 318296 318434 318692 318319 317228 315655 313733
51624 313733 311662 309937 308980 308667 308602 308807 309652 311060 312295 312816 313017 313780 315491 317769 319985 321779
51608 321779 323149 324363 325858 328105 331512 336431 343088 351333 360499 369599 377659 383781 387211 387647
51594 387647 385580 382152 378542 375475 373204 371817 371465 372355 374625 378290 383358 389913 398001 407527 418423
51579 418423 430898 445243 461239 477914 494114 509359 524155 539461 555797 572618 588462
51568 588462 601878 612463 621198 629961 640911 656113 677212 705038 739511 779896 824900 872405
51556 872405 919399 962578 999115 1027016 1045213 1053696 1053280 1044800 1028503 1004412 973167 936180
51544 936180 895069 851323 806414 761739 718242 676401 636794 600397 568041 539725 514737
51533 514737 492445 472815 456185 442682 431905 423089 415521 408807 402863 397751 393520 390032 386830
51520 386830 383313 379221 374904 371013 367923 365585 363810 362487 361566 361005 360764 360704 360531 360041 359349 358651
51504 358651 357792 356434 354697 353283 352759 352950 353271 353408 353411 353294 352901 352190 351413 350911 350850 351120 351375 351198 350372
51485 350372 348993 347263 345217 342789 340034 337147 334251 331374 328677 326495 325004 323895 322472 320121
51471 320121 316731 312754 308949 305965 304115 303447 303948 305618 308318 311690 315317 319005 322871 327061 331408
51456 331408 335435 338791 341647 344595 348143 352463 357592 363658 370767 378858 387866 397932 409111 420802
51442 420802 431609 439918 444680 445906 444748 443100 442642 443853 445762 446615 444771 439305 430361 419227
51428 419227 407728 397110 387508 378573 370386 363513 358451 355360 354178 354517 355526 356364 356885 357496 358306
51413 358306 358880 358970 358915 359049 359183 359063 358941 359189 359666 360043 360551 361823 363985 366498 368939 371426 374179
51396 374179 377153 380360 384170 389025 395132 402584 411423 421450 432428 444831 460070 479605 504021
51383 504021 533256 567345 606480 650550 699148 751817 807620 864433 919382 970303 1016327
51372 1016327 1056738 1089819 1113440 1126479 1129121 1121808 1104547 1077367 1040894 996232 944727 888402
51360 888402 830307 773743 720872 672264 627720 587148 550599 518097 489845 466238 447243
51349 447243 431960 419239 408539 399628 391659 383329 374162 365014 356958 350149 344096 338532 333475
51336 333475 328782 324299 320309 317269 315067 313071 310949 309062 307906 307554 307761 308244 308715 308920 308920 309112
51320 309112 309767 310647 311204 311105 310438 309607 309144 309470 310574 311856 312505 312122 311055 310076 309763 310211 311324 313196
51302 313196 315932 319102 321733 323099 323340 323017 322227 320541 317742 314201 310522 307191 304663 303311 303050
51287 303050 303330 303876 305190 307924 311833 315767 318802 321031 322974 324464 324598 322988 320717 319628 320621
51272 320621 323048 325870 328862 332276 335827 338857 341489 344761 349171 353569 355997 355432 352417 348226
51258 348226 343862 339724 335820 332095 328609 325419 322321 318933 315186 311515 308417 306033 304328 303352
51244 303352 303016 302876 302511 301976 301461 300731 299430 297800 296501 295659 294773 293747 293303 293944 295028 295565 295597
51227 295597 296137 297819 300301 303038 305887 308669 310730 311529 311405 311263 311643 312528 313911 315909 318275 320364
51211 320364 321892 323283 324944 326567 327615 328249 329232 331008 333355 335916 338536 341001 342984 344468 345772
51196 345772 346844 346960 345553 343078 340569 338579 337078 336194 336329 337363 338372 338564 338143 337860 337997 338309
51180 338309 338783 339809 341414 342879 343478 343351 343253 343568 343987 344117 343972 343774 343637 343706 344251 345340 346579 347486
51162 347486 347978 348157 347764 346225 343233 339031 334165 329276 325023 321739 319080 316445 313895 312251 312027
51147 312027 312697 313294 313405 313234 313012 312797 312696 312869 313293 313859 314608 315569 316472 317007 317404 318412 320531 323545
51129 323545 326889 330217 333378 336040 337667 338033 337653 337532 338362 340021 341875 343513 344993 346459 347843
51114 347843 349079 350366 352005 354131 356723 359738 363066 366505 369909 373174 376000 377952 378893 379130 378907
51099 378907 378083 376572 374793 373319 372353 371965 372539 374407 377116 379621 381288 382337 383336 384682 386536
51084 386536 388813 391090 392937 394388 395733 396823 397093 396392 395436 395225 396309 398695 402041 405757 409288
51069 409288 412615 416290 420843 426355 432666 439721 447527 456001 464913 473734 481507 487255 490702 492448
51055 492448 493507 495028 498300 504272 512741 522404 532021 541201 550033 558539 566733 574590 581560 586730
51041 586730 589955 592394 595300 598570 600893 600872 597484 589988 578329 563505 546869 529178 510932
51028 510932 493340 477991 465494 455278 446949 441047 438023 437164 437092 437066 437360 438598 441132 444932 449786
51013 449786 455502 461985 469078 476398 483443 489883 495713 501312 507461 514962 523799 532907 541367 549723
50999 549723 559504 571431 584760 598453 612272 626441 641009 656110 672366 690371 709994 730602
50987 730602 751616 772364 791718 808588 822808 835137 846544 857885 870114 884105 900083
50976 900083 917694 936758 957646 980734 1005942 1033094 1062550 1095181 1131792 1172780 1218299
50965 1218299 1268538 1323719 1383760 1447941 1514948 1583340 1651995 1720023 1786304 1849273 1907230
50954 1907230 1958873 2003628 2041627 2073478 2100034 2122352 2141723 2159372 2175778 2190281 2201446
50943 2201446 2207849 2208490 2202915 2191635 2176644 2160893 2146554 2133599 2120309 2105049 2087218 2066484
50931 2066484 2041779 2011627 1975373 1933597 1887201 1836491 1781380 1722173 1659787 1595362 1530118
50920 1530118 1465562 1403279 1344244 1288559 1236100 1187185 1142383 1101916 1065650 1033544 1005608
50909 1005608 981396 959975 940614 923230 907899 894241 881684 870198 860296 852218 845477 839477
50897 839477 834293 830478 828145 826616 825075 823293 821503 819775 817893 815840 814141 813534 814421 816785 820462
50882 820462 825261 830834 836727 842774 849360 857066 866014 875732 885773 896312 907974 921094 935391
50869 935391 950411 966211 983549 1003537 1027084 1054456 1085266 1119020 1155840 1196549 1242012
50858 1242012 1292663 1348935 1411890 1482979 1563172 1652650 1751329 1859291 1976506 2102493 2236495
50847 2236495 2377777 2525581 2678909 2836585 2997238 3158816 3318025 3470485 3611641
50838 3611641 3737646 3845728 3934078 4001651 4048123 4074152 4081746 4074215 4055481 4029369 3999546
50827 3999546 3969827 3943979 3924898 3914096 3912040 3918631 3932905 3952286 3972511 3988560 3995730 3990151
50815 3990151 3968979 3930571 3874314 3799952 3707213 3596487 3469746 3330321 3181793 3027612
50805 3027612 2871762 2718872 2572922 2436181 2309887 2195547 2094769 2008047 1934634 1873825
50795 1873825 1825707 1790397 1767126 1754409 1750655 1754246 1763361 1776125 1790786 1805626 1819049 1829972
50783 1829972 1837894 1842409 1843125 1840229 1834639 1827052 1817191 1804336 1788294 1769324 1747366 1721918 1692622
50770 1692622 1659562 1623063 1583527 1541414 1497140 1451251 1404939 1360037 1317964 1278917 1242520
50759 1242520 1208928 1178667 1151802 1128112 1107961 1092013 1079970 1070565 1063085 1058152 1056634 1058620
50747 1058620 1063959 1073033 1086280 1103464 1124187 1148779 1177995 1212029 1250550 1293646 1342031 1396154
50735 1396154 1455578 1519487 1587587 1660333 1738287 1821276 1908090 1997161 2087442 2178269 2268316
50724 2268316 2355351 2437440 2513774 2583449 2643691 2690285 2720035 2732329 2728402 2710046 2679633
50713 2679633 2640805 2598207 2556359 2518771 2487768 2464654 2450043 2444276 2447398 2458465 2474996 2493548
50701 2493548 2510943 2524737 2532507 2531152 2517369 2488949 2445591 2388714 2320776 2244791 2163998 2081483
50689 2081483 1999941 1921877 1849943 1786739 1734055 1692368 1661318 1640672 1630765 1632092 1644779 1668639
50677 1668639 1703574 1749566 1806064 1871455 1943330 2019232 2096989 2174379 2248908 2318280 2380983
50666 2380983 2436247 2483617 2523018 2555142 2581282 2602560 2619571 2632804 2642865 2649905 2653172 2651599
50654 2651599 2644810 2633363 2618257 2600638 2581898 2563657 2547474 2534732 2526717 2524519 2528862 2540167
50642 2540167 2558690 2584311 2616185 2652863 2692765 2734430 2776505 2818040 2858917 2899718 2940964
50631 2940964 2982543 3023465 3061082 3089787 3100926 3085541 3038835 2963080 2866700 2760528 2654182
50620 2654182 2554610 2466357 2392041 2332460 2286994 2254473 2233709 2223269 2221325 2226255 2237180 2253370
50608 2253370 2273132 2293613 2311490 2323346 2325564 2314899 2289845 2251274 2201455 2142590 2076317
50597 2076317 2004064 1927396 1848195 1768805 1691787 1619117 1551632 1489323 1431991 1379452 1331541
50586 1331541 1288365 1250393 1217862 1190180 1166310 1145740 1128784 1115897 1107032 1101734 1099549 1100174
50574 1100174 1103359 1108818 1116183 1125099 1135412 1147192 1160420 1174766 1189901 1206041 1224064 1245113
50562 1245113 1270123 1299561 1333419 1371619 1414609 1463348 1518367 1578999 1643908 1712092 1782723
50551 1782723 1854023 1923067 1987159 2045112 2097061 2143661 2186028 2226110 2266379 2308932 2355004
50540 2355004 2405187 2459741 2518677 2581825 2648962 2719916 2794756 2874044 2958793 3050065 3148781
50529 3148781 3255911 3372227 3497270 3628807 3763821 3899976 4035559 4168209 4294484
50520 4294484 4410851 4514327 4601812 4669484 4713592 4731716 4722931 4687228 4625387 4539268 4431622
50509 4431622 4305630 4165014 4014524 3859640 3705626 3557055 3418160 3293000 3185039
50500 3185039 3096861 3030401 2986935 2966546 2967934 2989068 3027793 3081515 3146456 3217392 3287817
50489 3287817 3350209 3396830 3421239 3419477 3389885 3332294 3248052 3140742 3016039 2880257 2738897
50478 2738897 2596299 2455967 2320735 2192686 2073088 1962330 1859949 1765074 1677094 1595789
50468 1595789 1520855 1451667 1387752 1329194 1276318 1229190 1187728 1152039 1122149 1097407 1076622
50457 1076622 1058925 1044178 1032376 1023012 1015332 1008978 1004008 1000325 997498 995287 994021 994112 995361 997086
50443 997086 998944 1001285 1004586 1008884 1014043 1020305 1028173 1037860 1049367 1063163 1080249 1101177 1125255
50430 1125255 1151098 1177901 1205937 1235894 1268096 1302384 1338479 1376227 1415682 1457183 1501356
50419 1501356 1548869 1600134 1655362 1715015 1780024 1851246 1928539 2010625 2096068 2184178 2274481
50408 2274481 2365331 2453544 2535804 2610309 2676893 2735761 2786366 2827344 2857051 2873915 2876389
50397 2876389 2862881 2832078 2783692 2718990 2640496 2551126 2453782 2351695 2248741 2148930 2055552
50386 2055552 1970861 1896335 1832950 1781327 1741915 1715046 1700519 1697155 1703106 1716728 1736984 1762851
50374 1762851 1792397 1822445 1848987 1867952 1875963 1870872 1851998 1820106 1777148 1725724 1668404 1607345
50362 1607345 1544337 1480866 1417957 1356160 1296015 1238423 1184294 1133985 1087402 1044668 1006328
50351 1006328 972836 944126 919754 899165 881755 867004 854743 845036 837604 831690 826719 822806
50339 822806 820229 818527 816661 814104 811343 809040 807059 804716 801869 799222 797407 796160 794742 792933
50325 792933 791176 789857 789008 788802 789782 792155 795306 798554 802173 807158 814073 822615 832271 842907 854645
50310 854645 867622 882006 897852 914839 932446 950404 968507 985958 1001639 1015383 1028502
50299 1028502 1042551 1057851 1073548 1088688 1102746 1115466 1126870 1137356 1147270 1156386 1164241 1170820
50287 1170820 1176219 1179486 1178352 1170596 1155623 1134802 1110655 1085887 1062809 1043141 1028092 1018286
50275 1018286 1013213 1010745 1007747 1001731 992065 979665 965812 951483 937555 925121 915359 909083 906433
50262 906433 906876 909534 913628 918742 924737 931484 938697 945994 953064 959764 966043 971748 976567 980222
50248 980222 982711 984279 985047 984759 982941 979294 973833 966673 957867 947586 936317 924587 912477 899696
50234 899696 886294 872972 860353 848184 835794 823284 811757 802207 794624 788428 783287 779236
50222 779236 776359 774854 775129 777404 781451 787146 795090 806130 820377 837315 856897 879953 907312
50209 907312 939082 975130 1015913 1062431 1115572 1175689 1242500 1314913 1391015 1468484 1545046
50198 1545046 1618368 1685801 1744859 1794388 1835303 1870062 1901418 1931582 1962024 1993213 2023855
50187 2023855 2050487 2068397 2073235 2061778 2031625 1981317 1911575 1826054 1730184 1629230 1527627
50176 1527627 1429464 1338416 1256858 1185662 1125031 1074993 1034997 1003772 979992 962564 949935
50165 949935 939708 929532 918074 904764 889135 871166 852119 834322 819831 809387 802493 798080
50153 798080 795156 793173 791868 790768 789091 786235 782061 776453 769107 760259 751250 743672 737979 733527
50139 733527 729973 728081 729020 733346 740739 750260 760593 770466 779235 787091 794650 802355 810084 817068
50125 817068 822343 825690 828104 830950 834663 838644 842354 846027 850282 855584 862256 870457 879906 890067
50111 890067 900919 913153 927335 943260 960450 978962 999313 1021896 1046775 1073842 1102887
50100 1102887 1133804 1167004 1203317 1243183 1286281 1332343 1382046 1436635 1497012 1563765 1637923
50089 1637923 1720971 1814069 1917653 2031726 2155801 2288196 2425518 2562996 2695307 2817711
50079 2817711 2927462 3024816 3112602 3194639 3274367 3354263 3435379 3516745 3595194 3665724 3721796
50068 3721796 3755822 3760832 3732927 3672443 3582823 3468820 3335770 3189536 3035824 2879164
50058 2879164 2722766 2569259 2421242 2281185 2151171 2032723 1926591 1832711 1750550 1679457
50048 1679457 1618486 1566085 1520334 1479534 1442367 1407679 1374504 1342368 1311346 1281785 1254129
50037 1254129 1228854 1206113 1185406 1165991 1147696 1130960 1115935 1101829 1087449 1072241 1056654
50026 1056654 1041526 1027201 1013163 998526 982981 967251 952457 939073 926732 914944 903613
50015 903613 892813 882567 873085 864853 858075 852182 846202 839527 832247 824966 818572 813990 811824 812277
50001 812277 815548 822002 831569 843162 855104 866146 875732 883460 888898 892154 894159 895949 897771
49988 897771 899117 899423 898427 895923 891648 885744 879303 874144 871808 872728 876506 882915 892424 905664 922671
49973 922671 943004 966621 994483 1028286 1069668 1119568 1178134 1245148 1320358 1403099 1491486
49962 1491486 1582354 1672348 1758930 1840212 1914452 1980679 2039859 2094720 2148092 2201704 2256401
49951 2256401 2312238 2367246 2416230 2451617 2466013 2454325 2414430 2347095 2255853 2146442 2025553
49940 2025553 1899382 1772739 1648899 1529923 1417195 1311904 1215222 1128119 1050916 983026
49930 983026 923329 870997 825884 787896 756176 729367 706700 688344 674514 664670 657825 653137
49918 653137 649829 646967 643967 641133 639153 638187 637993 638800 641332 645779 651368 657271 663551 670906 679828
49903 679828 690338 702223 715043 727893 739450 748443 754123 756455 756014 753592 749760 744688 738280
49890 738280 730345 720733 709535 697160 684003 669978 654659 637988 620646 603541 587112 571295
49878 571295 556045 541733 529052 518617 510588 504644 500369 497633 496481 496780 498209 500527 503532
49865 503532 506836 510198 514175 519913 527970 537777 548582 560484 573918 588444 602827 616325 629206
49852 629206 641704 653043 661894 667571 670399 671121 670333 668423 665634 661892 656635 649033 638632 625969
49838 625969 612548 600066 589520 581007 574202 568805 564564 561226 558737 557414 557681 559627 563014 567746
49824 567746 574049 581992 591022 600411 610254 621624 635373 650883 666407 680615 693387 704943
49812 704943 714747 721806 725975 728348 730163 731543 731513 729120 724253 717397 708881 698678 686986 674717
49798 674717 662990 652098 641286 629813 618017 607037 597545 589128 580974 572899 565506 559472 554864
49785 554864 551146 547730 544479 541660 539484 537791 536275 534911 534081 534318 536006 539275 544061 550221 557616
49770 557616 565987 574737 583071 590474 596958 602599 607100 610172 612237 614223 616433 617992 617686 615146
49756 615146 610873 605214 597732 587748 575370 561814 548726 537242 527713 520113 514425 510531 507982
49743 507982 506157 504622 503213 501846 500507 499366 498652 498320 498038 497565 496997 496660 496953 498280 500869 504556
49727 504556 508959 513941 519745 526685 534940 544640 555843 568244 581162 593830 605376 614524 619956
49714 619956 621400 620041 617439 614250 610299 605475 599963 593759 586619 578557 569971 561252 552654 544574
49700 544574 537533 531726 526891 522737 519151 516007 513200 511051 510283 511251 513407 515870 518451 521907 527179
49685 527179 534446 542879 551365 559579 568339 578762 591183 605075 619817 635018 650026 663615
49673 663615 674483 681894 685771 686563 685216 682901 680402 677915 675526 673580 672418 672101 672519 673190 672511
49658 672511 667810 657031 640516 620723 600334 580962 563368 548013 535114 524584 516172 509472
49646 509472 503883 498989 495074 492822 492385 493088 494159 495264 496205 496560 495974 494488 492247 489163 485189
49631 485189 480676 476123 471708 467381 463312 459931 457481 455664 453725 450891 446984 442759 439425 437594
49617 437594 436773 436054 435061 434054 433327 432899 432777 433204 434554 436997 440177 443176 445045 445563 445324 444956 444555
49600 444555 444078 443905 444479 445647 446864 447925 448943 449665 449508 448494 447537 447468 448143 448826 449136 449276 449639
49583 449639 450558 452264 454673 457305 459716 461930 464145 466192 467749 469164 471553 475752 481447 487700
49569 487700 494229 501716 510788 521064 531521 541563 551264 560613 569066 576089 581732 586214 589199
49556 589199 590006 588547 585537 581691 577153 571939 566507 561521 557289 553799 551190 549770 549551 550017 550516
49541 550516 550770 550941 551257 551697 552115 552641 553787 555978 559117 562852 567186 572465 578775 585849 593722 603009
49525 603009 614192 626901 640247 653466 665792 675991 682741 685618 685351 683185 680488 678921 680240
49512 680240 685384 693936 704682 716423 728023 738007 744632 746410 742497 732831 718300 700716 682230
49499 682230 664471 648226 633808 621459 611260 602852 595576 589001 583255 578772 575770 574029 573054
49486 573054 572302 571324 569993 568704 568068 568171 568347 567963 567275 567090 567698 568666 569763 571510 574446 578233 582005
49469 582005 585396 588722 592236 595708 598865 601839 604902 608049 611036 613609 615445 616058 615100 612709 609249
49454 609249 604785 599135 592528 585784 579615 573981 568449 563018 558167 554121 550508 546933 543626 541188
49440 541188 539849 539264 539072 539446 540963 543972 548121 552527 556500 560191 564613 571011 580221 592416 607210
49425 607210 623845 641478 659458 677172 693362 705581 710729 706665 693846 675618 656569 640011
49413 640011 626612 615424 605962 598928 595067 594113 595297 598307 603102 609136 615648 622685 631105 641293
49399 641293 652432 663306 673421 683019 692352 701362 709854 717588 724205 729353 732918 735062 735983 735646
49385 735646 733735 729985 724710 718844 713167 707530 701199 694003 686772 680533 675614 671719 668655 666751
49371 666751 666690 669046 673834 680420 687969 695872 703535 710043 714623 717443 719370 720835 721517 721207 720159
49356 720159 718292 714888 709752 703977 698787 694152 689401 684854 681769 680728 681016 681766 682887 684617 686808
49341 686808 689041 690991 692309 692489 691266 688994 686465 684372 682892 681681 680318 678902 678035 678062 678719
49326 678719 679901 682242 686187 690797 694437 696674 698613 701175 704000 706358 708277 710164 712043 713858
49312 713858 716022 718932 722237 725111 727043 727868 727496 726243 725148 725182 726137 726898 726892 726770 727601 729838 733216
49295 733216 737269 741705 746378 751054 755236 758337 760099 760722 760504 759597 758189 756585 754825 752552 749610
49280 749610 746548 744230 743155 743452 745265 748594 752967 757826 763212 769645 777320 785889 795058 804947
49266 804947 815794 827574 840014 852754 865539 878582 892707 908906 927824 949841 975292
49255 975292 1004057 1035081 1066834 1098118 1127821 1154073 1174559 1187839 1193602 1191436 1180343 1160179
49243 1160179 1132995 1102239 1070906 1040839 1013251 989042 968627 952061 939363 930393 924645 921624
49231 921624 921316 923774 928350 933930 939974 946881 955241 965126 976212 988125 1000451 1012803 1025137
49218 1025137 1037767 1050803 1063708 1075549 1085535 1093226 1098593 1102204 1105296 1109333 1115351 1123750 1134577
49205 1134577 1147788 1163296 1180973 1200681 1222143 1244667 1267170 1288690 1308991 1328599 1348167
49194 1348167 1367825 1387097 1405345 1422150 1437292 1450520 1461538 1470329 1477527 1484331 1491839 1500405
49182 1500405 1509821 1520252 1532771 1548719 1568676 1592469 1620256 1653144 1692384 1737932 1787701
49171 1787701 1837850 1883519 1919718 1942415 1949662 1942300 1923921 1899943 1876030 1856526 1843713 1837952
49159 1837952 1838204 1842645 1849549 1858070 1868086 1879250 1890652 1901638 1912521 1923984 1936106 1948456
49147 1948456 1960865 1973463 1986115 1998568 2011185 2024798 2039620 2054984 2070511 2086868 2104846
49136 2104846 2124201 2144044 2164016 2184321 2204799 2224702 2243508 2261213 2277671 2292269 2304696
49125 2304696 2315546 2325662 2335186 2343836 2351962 2360674 2370799 2382231 2394590 2408143 2423753 2442296
49113 2442296 2464608 2491905 2525786 2567719 2618784 2679477 2748763 2822837 2895718 2962492 3022650
49102 3022650 3079886 3137809 3194901 3242902 3270318 3269104 3240000 3192229 3137313 3081981 3025947
49091 3025947 2965513 2898609 2826928 2754865 2687486 2628870 2580972 2543363 2514252 2491927 2475286
49080 2475286 2463406 2455216 2449716 2446153 2443822 2441923 2439741 2436869 2433230 2429034 2424741 2420837 2417523 2414606
49066 2414606 2411606 2407867 2402800 2396402 2389593 2383728 2379587 2376972 2375169 2373537 2371659 2369397 2367055 2365230
49052 2365230 2364232 2363811 2363523 2363072 2362089 2360033 2356816 2353297 2350559 2348688 2346815 2344485 2342403 2341565 2342127 2343745
49036 2343745 2346798 2352645 2362480 2376258 2392862 2410915 2429115 2446027 2460168 2470641 2477658 2482267
49024 2482267 2485547 2488053 2489966 2491562 2493390 2495985 2499556 2504088 2509764 2517149 2526854 2538973 2552896
49011 2552896 2567745 2582983 2598539 2614425 2630379 2645957 2660849 2674844 2687518 2698241 2706664
49000 2706664 2713071 2718054 2721952 2724788 2726662 2727826 2728315 2727887 2726594 2725177 2724522 2724703 2724851 2723979 2721695
48985 2721695 2718137 2713590 2708459 2703431 2699261 2696234 2693928 2691611 2688886 2685946 2683215 2680782 2678251 2675166
48971 2675166 2671534 2667816 2664427 2661361 2658326 2655126 2651838 2648685 2645826 2643251 2640881 2638782 2637306 2637012
48957 2637012 2638515 2642452 2649389 2659497 2672426 2687827 2706012 2727737 2753245 2781934 2813164 2846949
48945 2846949 2883451 2922159 2962231 3003565 3047039 3093725 3144289 3199105 3258204 3320823 3385510
48934 3385510 3451150 3517638 3585295 3653978 3723175 3792735 3863036 3934449 4006885 4079812 4152437
48923 4152437 4224016 4294354 4363851 4432693 4500085 4564699 4625897 4684044 4739562 4792270 4842051
48912 4842051 4889686 4936482 4983174 5029610 5075438 5120602 5165052 5208412 5250258 5290532 5329398
48901 5329398 5366767 5402230 5435431 5466291 5494720 5520255 5542096 5559478 5571982 5579615 5582738 5581839
48889 5581839 5577147 5568325 5554663 5535727 5511836 5483868 5452624 5418356 5380780 5339356 5293549 5242919
48877 5242919 5187035 5125354 5057365 4983024 4903128 4819169 4732770 4645229 4557540 4470681 4385761
48866 4385761 4303867 4225775 4151784 4081885 4016094 3954603 3897588 3845012 3796781 3753011 3713835
48855 3713835 3678889 3647250 3618131 3591599 3568469 3549505 3534836 3524029 3516430 3511351 3508204 3506771
48843 3506771 3507401 3510684 3516814 3525359 3535781 3547995 3562196 3578163 3595190 3612838 3631393 3651217
48831 3651217 3671921 3692704 3713431 3734778 3757192 3780265 3803506 3827237 3852255 3878871 3906840
48820 3906840 3936038 3966555 3998112 4030033 4062003 4094457 4127997 4162866 4199186 4237165 4276617
48809 4276617 4316674 4356529 4396264 4436449 4477143 4517954 4559022 4601186 4644942 4689837 4735188
48798 4735188 4780772 4826200 4870038 4910341 4946159 4978070 5007237 5034354 5059498 5082335 5102080
48787 5102080 5117598 5128014 5133195 5133439 5128789 5118829 5103117 5081581 5054551 5022639 4986596 4947044
48775 4947044 4904221 4858088 4808847 4757246 4704179 4649955 4594082 4535804 4474808 4411377 4346100
48764 4346100 4279681 4212946 4146651 4081175 4016682 3953807 3893899 3838264 3787279 3740523 3697643
48753 3697643 3658682 3623671 3592316 3564116 3538330 3513796 3489362 3464805 3440943 3418619 3398023
48742 3398023 3379268 3363033 3350011 3340079 3332628 3327415 3324349 3322583 3320645 3317667 3313852 3309579 3304696
48729 3304696 3298983 3292731 3286452 3280453 3275053 3270800 3267927 3265886 3263906 3261902 3260468 3260014 3260313 3260861 3261469
48714 3261469 3262443 3264339 3267474 3271651 3276541 3282304 3289447 3297884 3306607 3314613 3321802 3328513 3334617 3339710
48700 3339710 3344013 3348412 3353703 3360324 3368740 3379263 3391328 3403596 3415050 3425548 3435084 3443127 3449060
48687 3449060 3452910 3455272 3456860 3458428 3460745 3464153 3468348 3472869 3477507 3481803 3484481 3483953 3479415 3471064
48673 3471064 3459378 3444674 3427411 3408414 3388462 3367818 3346301 3323752 3300427 3277065 3254411
48662 3254411 3232465 3210105 3185618 3157510 3124716 3086312 3041715 2991440 2937429 2882381 2828749
48651 2828749 2778204 2731581 2689008 2650193 2614833 2582697 2553291 2525591 2498261 2470162 2440694
$$ [...]
##END NTUPLES=NMR SPECTRUM
##END=
