##TITLE=AC1469_13FE002651_8026970_5drCmvS8Dh
##JCAMPDX= 6.0         $$ Bruker NMR JCAMP-DX V2.0
##DATA TYPE= NMR SPECTRUM
##DATA CLASS= NTUPLES
##ORIGIN= BRUKER
##OWNER= Administrator
$$ 1.72 TOPSPIN		Version 2.1
$$ 2013-07-11 23:03:14.332 -0700  Administrator@X
$$ Compression mode = diff/dup
##.OBSERVE FREQUENCY= 400.02188249412
##.OBSERVE NUCLEUS= ^1H
##.ACQUISITION MODE= SIMULTANEOUS (DQD)
##.ACQUISITION SCHEME= undefined
##.AVERAGES= 64
##.DIGITISER RES= 22
##SPECTROMETER/DATA SYSTEM= spect
##.PULSE SEQUENCE= noesygpps1d.comp
##.SOLVENT NAME= COFFEE_meoh
##.SHIFT REFERENCE= INTERNAL, COFFEE_meoh, 1, 14.96072
##AUDIT TRAIL= $$ (NUMBER, WHEN, WHO, WHERE, PROCESS, VERSION, WHAT)
$$ ##TITLE= Audit trail, TOPSPIN		Version 2.1
$$ ##JCAMPDX= 5.01
$$ ##ORIGIN= Bruker BioSpin GmbH
$$ ##OWNER= Administrator
$$ $$ E:\/data/COFFEE/nmr/AC1469_13FE002651_8026970_5drCmvS8Dh/22/pdata/1/auditp.txt
$$ ##AUDIT TRAIL=  $$ (NUMBER, WHEN, WHO, WHERE, PROCESS, VERSION, WHAT)
(   1,<2013-07-11 23:03:09.379 -0700>,<Administrator>,<X>,<go>,<TOPSPIN 2.1>,
      <created by zg
	started at 2013-07-11 22:51:39.239 -0700,
	POWCHK enabled, PULCHK disabled,
       configuration hash MD5:
       C8 4E 4E 5D D3 5C D8 9E 9F 52 82 E0 59 8A DE 15
       data hash MD5: 64K
       9B B9 9E A2 FA CD AD 3A 15 DE B5 1B 7D 45 47 64>)
(   2,<2013-07-11 23:03:12.332 -0700>,<Administrator>,<X>,<proc1d>,<TOPSPIN 2.1>,
      <Start of raw data processing
       efp LB = 0.3 FT_mod = 6 PKNL = 1 PHC0 = 0 PHC1 = 0 SI = 128K 
       data hash MD5: 128K
       B9 32 C7 19 F0 9D D8 46 52 3F 4D 86 C5 F3 DE C9>)
(   3,<2013-07-11 23:03:13.348 -0700>,<Administrator>,<X>,<proc1d>,<TOPSPIN 2.1>,
      <pk PHC0 = -79.78271 PHC1 = 0 
       data hash MD5: 128K
       15 58 A7 F9 A4 00 9F 93 46 2B CD A3 A8 83 16 10>)
(   4,<2013-07-11 23:03:13.786 -0700>,<Administrator>,<X>,<proc1d>,<TOPSPIN 2.1>,
      <abs ABSG = 1 
       data hash MD5: 128K
       4F 09 D7 AB 5C CB 72 0E 2F B0 DD 45 EB 46 A1 70>)
(   5,<2013-07-11 23:03:13.879 -0700>,<Administrator>,<X>,<proc1d>,<TOPSPIN 2.1>,
      <abs ABSG = 2 
       data hash MD5: 128K
       64 D6 97 5D 75 6E 2E 95 A3 75 05 2A E5 4C F6 DC>)
(   6,<2013-07-11 23:03:13.957 -0700>,<Administrator>,<X>,<proc1d>,<TOPSPIN 2.1>,
      <abs ABSG = 3 
       data hash MD5: 128K
       39 60 60 8D AF 31 10 BA 49 77 00 74 2C F4 BB 26>)
(   7,<2013-07-11 23:03:14.036 -0700>,<Administrator>,<X>,<proc1d>,<TOPSPIN 2.1>,
      <abs ABSG = 4 
       data hash MD5: 128K
       FA 78 1B 8E 9D BD 7E 9A A1 A9 64 A5 2A F7 18 D4>)
(   8,<2013-07-11 23:03:14.114 -0700>,<Administrator>,<X>,<proc1d>,<TOPSPIN 2.1>,
      <abs ABSG = 5 
       data hash MD5: 128K
       8E 6B AD 80 DB 2E 83 66 A7 83 FB E3 C0 38 3D 99>)
$$ ##END=
$$ 
$$ $$ hash MD5
$$ $$ F3 93 DE 3B D8 7D 29 B7 E0 11 E3 BF 85 B4 98 B8
##$RELAX= 
##$RELAX= 
##$RELAX= 
##$RELAX= 
##$RELAX= 
##$RELAX= 
##$RELAX= 
##$RELAX= 
$$ Bruker specific parameters
$$ --------------------------
##$DU= <E:\>
##$EXPNO= 22
$$ [...]
##$TP07= 0
##$TPNAME0= <>
##$TPNAME1= <>
##$TPNAME2= <>
##$TPNAME3= <>
##$TPNAME4= <>
##$TPNAME5= <>
##$TPNAME6= <>
##$TPNAME7= <>
##$TPOAL= (0..7)
0.5 0.5 0.5 0.5 0.5 0.5 0.5 0.5
##$TPOFFS= (0..7)
0 0 0 0 0 0 0 0
##$TUNHIN= 0
##$TUNHOUT= 0
##$TUNXOUT= 0
##$USERA1= <user>
##$USERA2= <user>
##$USERA3= <user>
##$USERA4= <user>
##$USERA5= <user>
##$V9= 5
##$VALIST= <valist>
##$VCLIST= <CCCCCCCCCCCCCCC>
##$VD= 0
##$VDLIST= <DDDDDDDDDDDDDDD>
##$VPLIST= <PPPPPPPPPPPPPPP>
##$VTLIST= <TTTTTTTTTTTTTTT>
##$WBST= 1024
##$WBSW= 4
##$XGAIN= (0..3)
0 0 0 0
##$XL= 0
##$YL= 0
##$YMAX_a= 6666311
##$YMIN_a= -12636197
##$ZGOPTNS= <>
##$ZL1= 120
##$ZL2= 120
##$ZL3= 120
##$ZL4= 120
##$ABSF1= 14.96072
##$ABSF2= -5.597462
##$ABSG= 5
##$ABSL= 3
##$ALPHA= 0
##$AQORDER= 0
##$ASSFAC= 0
##$ASSFACI= 0
##$ASSFACX= 0
##$ASSWID= 0
##$AUNMP= <proc_prof1d_extract.lims>
##$AXLEFT= 0
##$AXNAME= <>
##$AXNUC= <1H>
##$AXRIGHT= 0
##$AXTYPE= 0
##$AXUNIT= <>
##$AZFE= 0.1
##$AZFW= 0.1
##$BCFW= 0
##$BC_mod= 0
##$BYTORDP= 0
##$COROFFS= 0
##$CY= 15
##$DATMOD= 1
##$DC= 0
##$DFILT= <>
##$DTYPP= 0
##$F1P= 0
##$F2P= 0
##$FCOR= 0.5
##$FTSIZE= 131072
##$FT_mod= 6
##$GAMMA= 0
##$GB= 0
##$INTBC= 1
##$INTSCL= 1
##$ISEN= 128
##$LB= 0.3
##$LEV0= 0
##$LPBIN= 0
##$MAXI= 10000
##$MC2= 0
##$MEAN= 0
##$ME_mod= 0
##$MI= 0
##$NCOEF= 0
##$NC_proc= -2
##$NLEV= 6
##$NOISF1= 0
##$NOISF2= 0
##$NSP= 0
##$NTH_PI= 0
##$NZP= 0
##$OFFSET= 14.96072
##$PC= 1
##$PHC0= -79.78271
##$PHC1= 0
##$PH_mod= 1
##$PKNL= yes
##$PPARMOD= 0
##$PPDIAG= 0
##$PPIPTYP= 0
##$PPMPNUM= 2147483647
##$PPRESOL= 1
##$PSCAL= 4
##$PSIGN= 0
##$PYNMP= <proc.py>
##$REVERSE= no
##$SF= 400.020009747512
##$SI= 131072
##$SIGF1= 0
##$SIGF2= 0
##$SINO= 400
##$SIOLD= 131072
##$SPECTYP= <>
##$SREGLST= <1H.CDCl3>
##$SSB= 0
##$STSI= 131072
##$STSR= 0
##$SW_p= 8223.68421052631
##$SYMM= 0
##$S_DEV= 0
##$TDeff= 65536
##$TDoff= 0
##$TI= <>
##$TILT= no
##$TM1= 0
##$TM2= 0
##$TOPLEV= 0
##$USERP1= <user>
##$USERP2= <user>
##$USERP3= <user>
##$USERP4= <user>
##$USERP5= <user>
##$WDW= 1
##$XDIM= 131072
##$YMAX_p= 383174863
##$YMIN_p= -12137
##$CURPLOT= <Network HP LaserJet P1505>
##$CURPRIN= <$Network HP LaserJet P1505>
##$DFORMAT= <normdp>
##$LAYOUT= <+/1D_H.xwp>
##$LFORMAT= <normlp>
##$PFORMAT= <normpl>
##$SURQMSG= 1
$$ End of Bruker specific parameters
$$ ---------------------------------
##NTUPLES= NMR SPECTRUM
##VAR_NAME=  FREQUENCY,     SPECTRUM/REAL,   SPECTRUM/IMAG
##SYMBOL=    X,             R,               I
##VAR_TYPE=  INDEPENDENT,   DEPENDENT,       DEPENDENT
##VAR_FORM=  AFFN,          ASDF,            ASDF
##VAR_DIM=   131072,        131072,          131072
##UNITS=     HZ,            ARBITRARY UNITS, ARBITRARY UNITS
##FACTOR=    0.0627417313425164, 1,          1
##FIRST=     8223.62146879497, -765,         -59841
##LAST=      0,             1242,            -60900
##MIN=       0,             -12137,          0
##MAX=       8223.62146879497, 383174863,    0
$$ Real data points
##PAGE= N=1
##DATA TABLE= (X++(R..R)), XYDATA
$$ [...]
61706E36487o536p963r359r936r353q428q124q197p647o364n429n462n581m673
$$ 536487 529951 521988 512629 502693 493340 484912 476788 468591 460944 454580 449151 443689 438108 433435
61692D33435l115k283k592k986k552j795j783k539l023k553j640j221j446j587
$$ 433435 430320 428037 425445 422459 419907 418112 416329 413790 410767 408214 406574 405353 403907 402320
61678D02320j095l63k11p91j361j259p49n95j009j416j273p42l64l41l45rO37
$$ 402320 401225 400862 400651 399860 398499 397240 396491 395896 394887 393471 392198 391456 391092 390751 390406 390397 391034
61661C91034J181J327J266J469K085K723K998L100L553M427N095M944M153L680
$$ 391034 392215 393542 394808 396277 398362 401085 404083 407183 410736 415163 420258 425202 429355 433035
61647D33035M413O301Q283R231R012Q443Q142P800O852N440M194L223J947j3k263
$$ 433035 437448 443749 452032 461263 470275 478718 486860 494660 501512 506952 511146 514369 516316 516303 514040
61632E14040m120n274n806n944n925n912n850n584n125m605m016l249k380j595
$$ 514040 509920 504646 498840 492896 486971 481059 475209 469625 464500 459895 455879 452630 450250 448655
61618D48655q81r5O60J149J444J791J976J366k44k320m241n807o952p466p401
$$ 448655 447774 447679 448339 449488 450932 452723 454699 456065 455821 453501 449260 443453 436501 429035 421634
61603D21634p250p390p661p801p920q167q316q038p316o278m972l672k947l006
$$ 421634 414384 406994 399333 391532 383612 375445 367129 359091 351775 345497 340525 336853 333906 330900
61589C30900l259l062k572k339k325k044j548j569k518l858m653m425l320j836
$$ 330900 327641 324579 322007 319668 317343 315299 313751 312182 309664 305806 301153 296728 293408 291572
61575B91572n86m3k48q37j440j975k503k923k962k479j699j080q70r13r17q21
$$ 291572 290986 290943 290695 289858 288418 286443 283940 281017 278055 275576 273877 272797 271927 271014 270097 269276
61559B69276o63l43J25L20j19q01r67o42o28j091j071N8J385J632R14M30O90J099
$$ 269276 268613 268270 268395 268715 268596 267795 266828 266186 265558 264467 263396 263454 264839 266471 267385 267815 268505 269604
61541B69604J185J244J558J905K131K488L005L147K609J920J711J796J512P40
$$ 269604 270789 272033 273591 275496 277627 280115 283120 286267 288876 290796 292507 294303 295815 296555
61527B96555m9o49j339k202k762k683k455k820l693m182l766k906k251j774j172
$$ 296555 296506 295857 294518 292316 289554 286871 284416 281596 277903 273721 269955 267049 264798 263024 261852
61512B61852p12q68j319j198m72j92j004k133k395j674q00l74m11p91j357j698
$$ 261852 261140 260272 258953 257755 257283 257091 256087 253954 251559 249885 249085 248711 248300 247509 246152 244454
61496B44454j458q27k64J44O23J175J539J551J174L50p00j288r53j14M97Q88J523
$$ 244454 242996 242169 241905 242049 242672 243847 245386 246937 248111 248461 247761 246473 245520 245406 245903 246791 248314
61479B48314K198K058R19k88p44p22q92j137o81P37K272K709J687J34o24k41L91
$$ 248314 250512 252570 253489 253201 252457 251735 250843 249706 249025 249762 252034 254743 256430 256564 255940 255699 256090
61462B56090L25l73j060j519j898j950j187K44J527K119K140J770R74j8o03m98
$$ 256090 256415 256042 254982 253463 251565 249615 248428 248672 250199 252318 254458 256228 257202 257184 256581 256083
61446B56083n1L47P00J127J600K203L081L945M238L993M013M751N622N886N677
$$ 256083 256032 256379 257079 258206 259806 262009 265090 269035 273273 277266 281279 286030 291652 297538 303215
61431C03215N580N550M989L782K598K025J858J463O72M4K22J120J943K112J901
$$ 303215 308795 314345 319334 323116 325714 327739 329597 331060 331732 331776 331998 333118 335061 337173 339074
61416C39074J929K182K050J242J67p12j375j910k142j975j804k201l254m448n166
$$ 339074 341003 343185 345235 346477 346644 345932 344557 342647 340505 338530 336726 334525 331271 326823 321657
61401C21657n191m791m345l931l334k520j831j562j595j661j671j537j096o03
$$ 321657 316466 311675 307330 303399 300065 297545 295714 294152 292557 290896 289225 287688 286592 285989
61387B85989p23j465j681n36J037J380M16m17l30J2K1J13O00R97J053J392K358
$$ 285989 285266 283801 282120 281584 282621 284001 284417 284000 283670 283682 283703 283816 284416 285413 286466 287858 290216
61370B90216L243L396L203L179L008K351J732J692J820J656J772K867M410N357
$$ 290216 293459 296855 300058 303237 306245 308596 310328 312020 313840 315496 317268 320135 324545 329902
61356C29902N724O286P138P794Q318R199J0229J0758J0893J1259J1608J0951R178
$$ 329902 335626 341912 349050 356844 365162 374361 384590 395348 406241 417500 429108 440059 449237
61343D49237P364O256N586N109N167N747O035N527M780M457M286L559K092J86
$$ 449237 456601 462857 468443 473552 478719 484466 490501 496028 500808 505265 509551 513110 515202 515388
61329E15388j881l848n346o237o785p203p352p113o677o215n641m886m036l062
$$ 515388 513507 509659 504313 498076 491291 484088 476736 469623 462946 456731 451090 446204 442168 439106
61315D39106j877q22m65o79n35M76J667K107J923K098L240M977O380O645N588
$$ 439106 437229 436407 435942 435263 434728 435204 436871 438978 440901 442999 446239 451216 457596 464241 469829
61300D69829L783K005L44j715m093n669n589m587m142m557m733l903k695k072
$$ 469829 473612 475617 475961 474246 470153 464484 458895 454308 450166 445609 440876 436973 434278 432206
61286D32206j958j612r49o55r20q29M50K375L570L594L448M091N165N761N908
$$ 432206 430248 428636 427687 427032 426112 425283 425733 428108 431678 435272 438720 442811 447976 453737 459645
61271D59645O459P660Q638Q598P798P045O750O864P390Q432R929J1600J3113J4150
$$ 459645 466104 473764 482402 491000 498798 505843 512593 519457 526847 535279 545208 556808 569921 584071
61257E84071J4541J4458J4227J3785J2640J0550P972N560L566K017J032N11k29
$$ 584071 598612 613070 627297 641082 653722 664272 672244 677804 681370 683387 684419 684930 684701
61244F84701j867m229o482q113r239r963j0069r505q742q330q357q560q637q294
$$ 684701 682834 678605 672123 664010 654771 644808 634739 625234 616492 608162 599805 591245 582608 574314
61230E74314p294n821m555m019l997l931l735l778m120m281l926l308k818k417
$$ 574314 567020 561199 556644 552625 548628 544697 540962 537184 533064 528783 524857 521549 518731 516314
61216E16314j842j092l50L26R09J139Q00J69k78m88p67j033p04N28K252L919N447
$$ 516314 514472 513380 513030 513356 514265 515404 516204 516373 516095 515607 514840 513807 513103 513631 515883 519802 525249
61199E25249P031Q728J0472J2238J3958J5530J7000J8363J9065J8387J6541J4766
$$ 525249 532280 541008 551480 563718 577676 593206 610206 628569 647634 666021 682562 697328
61187F97328J3799J2927J1149Q759O883N916N337M826M588M559M215L349K246
$$ 697328 711127 724054 735203 743962 750845 756761 762098 766924 771512 776071 780286 783635 785881
61174G85881J002o15k421l779m534n266o263p035p198p247p902r202j0685j1935
$$ 785881 786883 786268 783847 780068 775534 770268 764005 756970 749772 742525 734623 725421 714736 702801
61160G02801j2559j2150j0874r681r344r592r633r143q232o859m922k817j268
$$ 702801 690242 678092 667218 657537 648193 638601 628968 619825 611593 604734 599812 596995 595727
61147E95727o74r98k124l846n708p346q883j0472j1627j1661j0678r501q538p359
$$ 595727 595053 594055 591931 588085 582377 575031 566148 555676 544049 532388 521710 512209 503671 496312
61133D96312n543l380j478j69N18P95J253K622M948P376R134J0454J2078J4125
$$ 496312 490769 487389 485911 485742 486260 487055 488308 490930 495878 503254 512388 522842 534920 549045
61119E49045J5951J7138J7998J8999K0065K0795K1116K1381K1818K2189K2062
$$ 549045 564996 582134 600132 619131 639196 659991 681107 702488 724306 746495 768557
61108G68557K1256J9928J8351J6703J5054J3360J1376Q757N358J488k258n460
$$ 768557 789813 809741 828092 844795 859849 873209 884585 893342 898700 900188 897930 892470
61096H92470q121j0469j2637j4633j6462j8145j9576k0579k1199k1722k2334k2781
$$ 892470 884349 873880 861243 846610 830148 812003 792427 771848 750649 728927 706593 683812
61084F83812k2617k1746k0586j9696j9262j8955j8214j6798j5152j4014j3458
$$ 683812 661195 639449 618863 599167 579905 560950 542736 525938 510786 496772 483314
61073D83314j2615j0756q448o976o666o527n782m861m355l818k482p53J40j18
$$ 483314 470699 459943 451495 444519 437853 431326 425544 420683 416328 412510 410028 409275 409415 409297
61059D09297m80n1Q70J513J771K074K678L516M513N602O633P586Q655R927J1175
$$ 409297 408817 408766 409636 411149 412920 414994 417672 421188 425701 431303 437936 445522 454177 464104 475279
61044D75279J2197J3090J4005J4815J5385J5895J6579J7223J7361J6923J6441
$$ 475279 487476 500566 514571 529386 544771 560666 577245 594468 611829 628752 645193
61033F45193J6456J6925J7396J7623J7872J8489J9373K0168K1041K2865K6364
$$ 645193 661649 678574 695970 713593 731465 749954 769327 789495 810536 833401 859765
61022H59765L1312L7029M3554N1866O2922P6983R4032J14439J38617J65853J93119
$$ 859765 891077 928106 971660 1023526 1086448 1163431 1257463 1371902 1510519 1676372 1869491
61011A869491K14574K22389K09365J72771J17396N5575L228k6717l0087j2775
$$ 1869491 2084065 2306454 2515819 2688590 2805986 2861561 2864789 2838072 2807985 2795210
61001B795210J2763L2663L5161J2990l3658r5210j55626k00073k21677k22407
$$ 2795210 2807973 2840636 2875797 2888787 2855129 2759919 2604293 2404220 2182543 1960136
60991A960136k09003j88492j65961j44257j24534j07060r1636p7656o4539n2547
$$ 1960136 1751133 1562641 1396680 1252423 1127889 1020829 929193 851537 786998 734451
60981G34451m2760l5808l0967k6967k3330k0347j8034j5805j3164j0254p661n989
$$ 734451 691691 655883 624916 597949 574619 554272 536238 520433 507269 497015 489354 483365
60969D83365n469n649n590m762l601k828k527k326k233k596l248l429k763j828
$$ 483365 477896 472247 466657 461895 458294 455466 452939 450613 448380 445784 442536 439107 436344 434516
60955D34516j427j664k041k201k240k329k369k089j379m40M20R96J231J109O64
$$ 434516 433089 431425 429384 427183 424943 422614 420245 418156 416777 416337 416757 417753 418984 420093 420757
60940D20757k4r10j994l082l732l771l718m262n342o198o337n982n549n220n130
$$ 420757 420733 419823 417829 414747 411015 407244 403526 399264 393922 387724 381387 375405 369856 364636 359506
60925C59506n279n161m197k807k266l018l951l913l189k709k500j925j014m05
$$ 359506 354227 349066 344869 342062 339796 336778 332827 328914 325725 323016 320516 318591 317577 317172
60911C17172j36M23J403K150K247K099K259K778L390L847L940L675L506L969M999
$$ 317172 317036 317459 318862 321012 323259 325358 327617 330395 333785 337632 341572 345247 348753 352722 357721
60896C57721N982O392O120N303M353L855L879L544K033j90j885k660l200l932
$$ 357721 363703 370095 376215 381518 385871 389726 393605 397149 399182 398992 397107 394447 391247 387315
60882C87315m439m419m255m291m396m582n224o148o305n051l160j952j758j931
$$ 387315 382876 378457 374202 369911 365515 360933 355709 349561 343256 338205 335045 333093 331335 329404
60868C29404j909j631j144m78J45M41M13L09L22N61J084J692J955J779J666K110
$$ 329404 327495 325864 324720 324242 324387 324828 325241 325550 325872 326433 327517 329209 331164 332943 334609 336719
60852C36719K906L438L507L527L981M936O041O753O704O009N163M526M035L529
$$ 336719 339625 343063 346570 350097 354078 359014 365055 371808 378512 384521 389684 394210 398245 401774
60838D01774L026K578K015J172J91n79r07q15n09k94l29m91o41j013j905k983
$$ 401774 404800 407378 409393 410565 410756 410177 409270 408455 407946 407652 407323 406832 406191 405178 403273 400290
60822D00290l407k924k324k506l400m290m821n237n764o224o288n847n127m533
$$ 400290 396883 393959 391635 389129 385729 381439 376618 371381 365617 359393 353105 347258 342131 337598
60808C37598m262m039l482k814k714l236l424k506j025j73k42m53k24J42J40j82
$$ 337598 333336 329297 325815 323001 320287 317051 313627 311121 310096 309923 309681 309228 309004 309146 309286 309104
60792C09104m74n73l96K64J411K491K766K087J109O84J148K194L239L890M137
$$ 309104 308630 308057 307661 307925 309336 311827 314593 316680 317789 318473 319621 321815 325054 328944 333081
60777C33081M303M768N626O568P161P320P383P611P838P748P314O757O187N615
$$ 333081 337384 342152 347778 354346 361507 368827 376210 383821 391659 399407 406721 413478 419665 425280
60763D25280N229N234N346M916L679K086P64oj95J80Q23J210J156J109J503K089
$$ 425280 430509 435743 441089 446005 449684 451770 452534 452528 452333 452513 453336 454546 455702 456811 458314 460403
60747D60403K333K241K284K533K460J706O47j19n69j192k223l253l705l469k811
$$ 460403 462736 464977 467261 469794 472254 473960 474607 474488 473919 472727 470504 467251 463546 460077 457266
60732D57266j865n31J060K422L312M117N317O869Q502J0299J2391J4258J5132
$$ 457266 455401 454870 455930 458352 461664 465781 471098 477967 486469 496768 509159 523417 538549
60719E38549J5205J5727J7536K0097K2341K3950K5332K6680K7651K7856K7320
$$ 538549 553754 569481 587017 607114 629455 653405 678737 705417 733068 760924 788244
60708G88244K6395K5422K4361K2742K0096J6414J1971O839J090m614r327j2904
$$ 788244 814639 840061 864422 887164 907260 923674 935645 942484 943574 938960 929633 916729
60696I16729j6127j9478k2491k4648k6196k7529k8392k8385k7768k7125k6560
$$ 916729 900602 881124 858633 833985 807789 780260 751868 723483 695715 668590 642030
60685F42030k5806k4739k3226k0938j8060j5690j4743j4743j4507j3708j2826
$$ 642030 616224 591485 568259 547321 529261 513571 498828 484085 469578 455870 443044
60674D43044j1898j0478q757p625p356p235o781o396o453o500n938m816l576k492
$$ 443044 431146 420668 411911 404286 396930 389695 382914 376518 370065 363565 357627 352811 349235 346743
60660C46743j728j422j401j292j117j213j376q65L50J240J176R92J760L102L710
$$ 346743 345015 343593 342192 340900 339783 338570 337194 336329 336679 337919 339095 340087 341847 344949 348659
60645C48659L218K497K254K200J829J147L64n01j310j567q80M73J736K318K128
$$ 348659 351877 354374 356628 358828 360657 361804 362168 361667 360357 358790 357910 358383 360119 362437 364565
60630C64565J511J033J107J658K194K359K297K314K259J537j22k064l145k915
$$ 364565 366076 367109 368216 369874 372068 374427 376724 379038 381297 382834 382712 380648 377503 374588
60616C74588k134j936k544l124k973k439k430l219m181m619m481m141l834l494
$$ 374588 372454 370518 367974 364850 361877 359438 357008 353789 349608 344989 340508 336367 332533 329039
60602C29039l020k421j766j206r02q48p81n03k58m55j016j354j133p11n29m31
$$ 329039 326019 323598 321832 320626 319724 318876 318095 317592 317334 316879 315863 314509 313376 312665 312136 311705
60586C11705m6L97L15k70o47m51p3J67O40J706K989L970M878O218P698Q456Q290
$$ 311705 311659 312056 312371 312101 311454 311003 310930 311097 311737 313443 316432 320402 325280 331498 339196 347652 355942
60569C55942P929P924P955P458O352M812K788K27k421m314m938m549l953l738
$$ 355942 363871 371795 379750 387208 393560 398372 401160 401387 398966 394652 389714 385165 381212 377474
60555C77474l641k803p92J790M023N662P079Q370R200R504R662R776R412Q271
$$ 377474 373833 371030 370238 372028 376051 381713 388792 397162 406362 415866 425528 435304 444716 452987
60541D52987O522M264J333j955m483n426n229m876m586l928k930k180j822j299
$$ 452987 459509 463773 465106 463151 458668 453242 448013 443137 438551 434623 431693 429513 427691 426392
60527D26392k94P06J121J026Q10N31L5n27p52m93R0Q96J945L014L684L924M314
$$ 426392 426098 426804 427925 428951 429761 430292 430327 429800 429048 428555 428645 429541 431486 434500 438184 442108 446422
60510D46422N413P120R002J1056J3633J6693J9697K2435K5376K8731L1714L3257
$$ 446422 451835 458955 467957 479013 492646 509339 529036 551471 576847 605578 637292 670549
60498F70549L3233L2227L0251K6505K0505J2788M173m964j4266k2823k9601l4258
$$ 670549 703782 736009 766260 792765 813270 826058 830231 825267 811001 788178 758577 724319
60486G24319l7030l8052l7302l5075l2037k8732k5301k1784j8361j5366j3163
$$ 724319 687289 649237 611935 576860 544823 516091 490790 469006 450645 435279 422116
60475D22116j1918j1296j0477q872o771n072m361m435m674m624m185l568l119
$$ 422116 410198 398902 388425 379553 372782 367710 363349 358914 354240 349616 345431 341863 338744
60462C38744l077l307l391l000k210j406r54r08r95r70r14j067j368j428j108
$$ 338744 335667 332360 328969 325969 323759 322353 321399 320491 319496 318526 317612 316545 315177 313749 312641
60447C12641p91q52j141j328j446j655j692j174m25l78j410k732l220k519j125
$$ 312641 311850 310998 309857 308529 307083 305428 303736 302562 302137 301759 300349 297617 294397 291878 290753
60432B90753K60J087J122P09O47J374K305K423J514K88o64j416k054k097j167
$$ 290753 291013 292100 293222 293931 294578 295952 298257 300680 302194 302482 301818 300402 298348 296251 295084
60417B95084J65Q90Q18O59Q61J086J028J053J514J933J582O36L7K33P01Q79R05
$$ 295084 295249 296139 296957 297616 298477 299563 300591 301644 303158 305091 306673 307309 307346 307579 308280 309159 310064
60400C10064J165J544J604J252Q77Q39J061J122P34K04L04J427K927L718L534
$$ 310064 311229 312773 314377 315629 316506 317345 318406 319528 320262 320466 320770 322197 325124 328842 332376
60385C32376L056K692J963N60o69o31M74J382J482J342J455J362O04j60J64J503
$$ 332376 335432 338124 340087 340647 339978 339347 339821 341203 342685 344027 345482 346844 347448 347288 347452 348955
60369C48955K509K181J049L71N38P97M43k22m42j11J54O7K13J287L029M312M268
$$ 348955 351464 353645 354694 355065 355603 356400 356843 356621 356179 356068 356222 356289 356502 357789 360818 365130 369398
60352C69398L066J647Q67R00J237J213O29j31n64n77m57m76o41p41n59j27J50
$$ 369398 372464 374111 374978 375878 377115 378328 378957 378826 378262 377685 377228 376752 376111 375370 374811 374684 374834
60335C74834j48q56j269r69m26m01j014j702j974j786j352r68r41j221j156j37
$$ 374834 374686 373830 372561 371592 371166 370765 369751 368049 366075 364289 362937 361969 361028 359807 358651 358514
60319C58514J491K703K985K801K698K687K810L652N636Q175J0159J1203J1900
$$ 358514 360005 362708 365693 368494 371192 373879 376689 380341 385977 394152 404311 415514 427414
60306D27414J2859J3950J4534J4090J2539J0141P228L888J1m221q089j0771j2018
$$ 427414 440273 454223 468757 482847 495386 505527 512755 516643 516654 512433 504344 493573 481555
60293D81555j2133j1494j0386r192q247p438o348m948l820l467l647l665l157
$$ 481555 469422 457928 447542 438350 430103 422665 416317 411369 407549 404082 400435 396770 393613
60280C93613k423k000k149k664l086l040k480j637q33l40l57q96j682k348k768
$$ 393613 391190 389190 387041 384377 381291 378251 375771 374134 373301 372961 372604 371708 370026 367678 364910
60265C64910l069l233l006k299j476r78q36p70o28m50j71L69J037J348R93K77
$$ 364910 361841 358608 355602 353303 351827 350849 350013 349243 348615 348165 347994 348363 349400 350748 351741 352018
60249C52018j52l0K77K28k19n03j29O40J025P47M59Q52J594J687R11K58P14K000
$$ 352018 351866 351836 352113 352341 352122 351619 351490 352130 353155 353902 354361 355213 356807 358494 359405 359663 360377 362377
60231C62377K980K982K343J816J848K378K964L101K690K173J937J790J368R24
$$ 362377 365357 368339 370682 372498 374346 376724 379688 382789 385479 387652 389589 391379 392747 393671
60217C93671J151K145L123L381L134L017L246L599L983M452M895N118N182N186
$$ 393671 394822 396967 400090 403471 406605 409622 412868 416467 420450 424902 429797 434915 440097 445283
60203D45283M873L938K751K162K401K758K666K544L024L734L615K409J040L58
$$ 445283 450156 454094 456845 459007 461408 464166 466832 469376 472400 476134 479749 482158 483198 483556
60189D83556J43k20p08r05r41j456k601l697m100l929l644l315k681j716p87k76
$$ 483556 483699 483479 482771 481866 480925 479469 476868 473171 469071 465142 461498 458183 455502 453786 452999 452723
60173D52723l01o52q72n93j3J41n76j692k263j850q00K64Q88R00N04K74N87J069
$$ 452723 452422 451770 450898 450305 450292 450433 449857 448165 445902 444052 443252 443516 444404 445304 445808 446082 446669 447738
60155D47738R65J29p02p51L0J071J775J852J461J131J355K104K952L700M484N322
$$ 447738 448703 448832 448130 447379 447409 448480 450255 452107 453568 454699 456054 458158 461110 464810 469294 474616
60139D74616O031O634P322P792P236N412L244J846J312Q95J38o93j116r35l67
$$ 474616 480647 487281 494603 502395 509631 515043 518287 520133 521445 522340 522478 521785 520669 519734 519367
60124E19367j8m70j555k260j820p16p6l09q96j377j777k087k029j566j107r21
$$ 519367 519349 518879 517324 515064 513244 512528 512452 512143 511247 509870 508093 506006 503977 502411 501304 500383
60108E00383p43k69L47O97N50j14j166k188k545j974r23j01K27L45O17J088J532
$$ 500383 499640 499371 499718 500415 500965 500851 499685 497497 494952 492978 492055 491954 492181 492526 493143 494231 495763
60091D95763J790J970K325K875L257L167K758K457K397K344K095J708J271Q52
$$ 495763 497553 499523 501848 504723 507980 511147 513905 516362 518759 521103 523198 524906 526177 527029
60077E27029O12O61P15K82p14j770k408k617k625k623k919l922n566p014p366
$$ 527029 527641 528302 529017 529299 528585 526815 524407 521790 519165 516542 513623 509701 504135 497121 489755
60062D89755o616n523m670m049l577l545m230n205n533m769l488k506j808p52
$$ 489755 483139 477616 472946 468897 465320 461775 457545 452340 446807 442038 438550 436044 434236 433484
60048D33484O66J492J184N94R03J943K563K451K494L121L419K576J275P76J114
$$ 433484 434150 435642 436826 437420 438323 440266 442829 445280 447774 450895 454314 456890 458165 458941 460055
60033D60055J204M76n26j214j808k760l968m958n563o002o380o495o244n993o181
$$ 460055 461259 461735 461209 459995 458187 455427 451459 446501 440938 434936 428556 422061 415817 409824 403643
60018D03643o577o319n044l594l082l440l593l074k518k340j979j037k36l34p63
$$ 403643 397066 390747 385703 382109 379027 375587 371994 368920 366402 364062 362083 361046 360810 360476 359713
60003C59713m91K86M77j0o2R35K274L110L374L189K498J825K246L872N184M893
$$ 359713 359222 359508 359985 359975 359913 360848 363122 366232 369606 372795 375293 377118 379364 383236 388420 393313
59987C93313L707L271L880M318L792K807K124J809J592J404J201Q81N46M41L78
$$ 393313 397020 400291 404171 408489 412281 415088 417212 419021 420613 422017 423218 424099 424645 425086 425464
59972D25464j49j146j975k223k147j944j325l09K26m24j620k095j679j353j609
$$ 425464 425315 424169 422194 419971 417824 415880 414555 414246 414472 414048 412428 410333 408654 407301 405692
59957D05692j742j138l47k28o29o79j41L82M35K29O8m8k9M34J172J306K77j190
$$ 405692 403950 402812 402465 402237 401608 400929 400788 401170 401605 401834 401902 401854 401825 402259 403431 404737 405014 403824
59939D03824j805j313p50j007j728j953j380n86j64q5J1K22K32k05q65j188q89
$$ 403824 402019 400706 399956 398949 397221 395268 393888 393302 393138 393053 393064 393286 393518 393313 392448 391260 390371
59922C90371k29L30O62R36J206J393J597K044K635K841K356J581J298J926L201
$$ 390371 390142 390472 391134 392070 393276 394669 396266 398310 400945 403786 406142 407723 409021 410947 414148
59907D14148M363M634L836K677K074K085J887J052K20J36N54P81P84R72J234J218
$$ 414148 418511 423145 426981 429658 431732 433817 435704 436756 436976 437112 437666 438447 439231 440203 441437 442655
59891D42655J370K531M339N210M360K869K117K090K037J929K236K818L118L156
$$ 442655 444025 446556 450895 456105 460465 463334 465451 467541 469578 471507 473743 476561 479679 482835
59877D82835L291L274K548J376N94K40n04j819k809k902k688k858l195l241l205
$$ 482835 486126 489400 491948 493324 493918 494158 493654 491835 489026 486124 483436 480578 477383 474142 470937
59862D70937l420l584l317k989l177l645l688l229k810k613k327j867j548j493
$$ 470937 467517 463933 460616 457627 454450 450805 447117 443888 441078 438465 436138 434271 432723 431230
59848D31230j532j688k101k466k221j463j026j392k072k266j677m97Q83J872J951
$$ 431230 429698 428010 425909 423443 421222 419759 418733 417341 415269 413003 411326 410829 411712 413584 415535
59833D15535J330Q84J146J710K009K122K355K416J681J42j465k432k695k696k932
$$ 415535 416865 417749 418895 420605 422614 424736 427091 429507 431188 431330 429865 427433 424738 422042 419110
59818D19110l522l977l606k424j384j273j713j735j191q72j283j978k277k041
$$ 419110 415588 411611 408005 405581 404197 402924 401211 399476 398285 397413 396130 394152 391875 389834
59804C89834j447o07K64O76L58l77j055j583k005k095j601q16l32l08l41q0M33
$$ 389834 388387 387780 388044 388720 389078 388701 387646 386063 384058 381963 380362 379546 379214 378906 378565 378485 378918
59787C78918J025J584J884J602P51j85p18q30q40j024j426j850j968j583q90k54
$$ 378918 379943 381527 383411 385013 385764 385579 384861 384031 383191 382167 380741 378891 376923 375340 374450 374196
59771C74196L53J282K506L362L324K733K342K396K526K431K149J856J708J921
$$ 374196 374549 375831 378337 381699 385023 387756 390098 392494 395020 397451 399600 401456 403164 405085
59757D05085K526L101L163K830K688L071L860M902O000O531N873M448L568L831
$$ 405085 407611 410712 413875 416705 419393 422464 426324 431226 437226 443757 449630 454078 457646 461477
59743D61477M294L815K571J589J261J131Q88P10O60M99J29k61n85q44q21l52J23
$$ 461477 465771 469586 472157 473746 475007 476138 477026 477736 478396 478895 479024 478763 478178 477334 476513 476161 476284
59726D76284m2o77q77l03K69O0o71j163j190r68m52N45J611J855J047J45L23J610
$$ 476284 476242 475565 474688 474385 474654 474714 474043 472880 471690 470722 470270 470815 472426 474281 475328 475473 475796 477406
59708D77406K912L361L262L409L821L761L009K405K713L530L964L958M149M575
$$ 477406 480318 483679 486941 490350 494171 497932 500941 503346 506059 509589 513553 517511 521660 526235
59694E26235M510L656K661K096J683R31k7o92q79p30m71m30r03j677k130k119
$$ 526235 530745 534401 537062 539158 540841 541772 541745 541053 540174 539444 538973 538543 537640 535963 533833 531714
59678E31714k261k947l628l616l068k606k404k307k431k905l319l226k919k952
$$ 531714 529453 526506 522878 519262 516194 513588 511184 508877 506446 503541 500222 496996 494077 491125
59664D91125l078k598j666j243j554j589n53R48J777J773J776K443L561M400M413
$$ 491125 488047 485449 483783 482540 480986 479397 478844 479792 481569 483342 485118 487561 491122 495522 499935
59649D99935L615K550J768J298O99k91j484k602l591m402m861m951m918m835m344
$$ 499935 503550 506100 507868 509166 509865 509574 508090 505488 501897 497495 492634 487683 482765 477930 473586
59634D73586l253k164k023k989m067m136l181k273k338l137l643l255k332j632
$$ 473586 470333 468169 466146 463157 459090 454954 451773 449500 447162 444025 440382 437127 434795 433163
59620D33163j611k395l843n254n501m164k245j125r53p86k22L6n44j365j519r47
$$ 433163 431552 429157 425314 420060 414559 410395 408150 407025 406072 405286 405064 405100 404556 403191 401672 400725
59604D00725k32L17Q11J309J705J932J922J534Q34K26M6J93M51Q60J480K029K154
$$ 400725 400493 400810 401621 402930 404635 406567 408489 410023 410857 411083 411129 411322 411773 412633 414113 416142 418296
59587D18296J811J109Q7j010j606j477j269j832l116m246m562m110l270k444k052
$$ 418296 420107 421216 421303 420293 418687 417210 415941 414109 410993 406747 402185 398075 394805 392361 390309
59572C90309k266k678k654k077j397j039j075j368j531j010K48J369J476R50R39
$$ 390309 388043 385365 382711 380634 379237 378198 377123 375755 374224 373214 373462 374831 376307 377257 378196
59557C78196J679K269K258K339L039L736L747L529L905M710N194N333N738O554
$$ 378196 379875 382144 384402 386741 389780 393516 397263 400792 404697 409407 414601 419934 425672 432226
59543D32226P449Q599J0655J3572J6353J8075J8426J7041J3319P435R60m135o864
$$ 432226 439675 448274 458929 472501 488854 506929 525355 542396 555715 563150 564110 559975 553111
59530E53111p367o248m179j819M30K488M167M968M610L496K365J592J055L78r03
$$ 553111 545744 539496 535317 533498 533928 536416 540583 545551 550161 553657 556022 557614 558669 559047 558144
59515E58144l085n790p949q770q546q195q166q210q077p949q044q266q277p767
$$ 558144 555059 549269 541320 532550 524004 515809 507643 499433 491356 483407 475363 467097 458820 451053
59501D51053o576m857l086j759j021p32p05o71k40P05J699K189K235K340K607
$$ 451053 444477 439620 436534 434775 433754 433022 432317 431646 431406 432111 433810 435999 438234 440574 443181
59486D43181K644K349K233K754L727M730N735O987Q502R969J1040J1485J1163
$$ 443181 445825 448174 450407 453161 456888 461618 467353 474340 482842 492811 503851 515336 526499
59473E26499J0048Q244N850L001P5k305l636l832l136j922n98N74J662K940M485
$$ 526499 536547 544791 550641 553642 553717 551412 547776 543944 540808 538886 538288 538862 540524 543464 547949
59458E47949O082P533Q780R720J0212J0363J0487J0665J0723J0725J0993J1448
$$ 547949 554031 561564 570344 580064 590276 600639 611126 621791 632514 643239 654232 665680
59446F65680J1370J0137P763M469K75m428q485j0862j1688j1757j1331j0229q894
$$ 665680 677050 687187 694950 699419 699694 695266 686781 675919 664231 652474 641143 630914 622020
59433F22020q323q740r225r091q777q909r051q132n778k638M87L254N668P829
$$ 622020 613697 604957 595732 586641 577864 568955 559904 551772 545994 543356 543843 547097 552765 560594
59419E60594R946J2255J4843J7650K0611K3496K5667K6149K4047J8852J0648M36
$$ 560594 570540 582795 597638 615288 635899 659395 685062 711211 735258 754110 764758 765194
59407G65194r751j7490k1124k0445j6481j0797m854L60M234N968M314j555j0574
$$ 765194 755443 737953 716829 696384 679903 669106 664252 664612 668846 674814 679128 677573 666999
59394F66999j9620k5479k7137k6003k4024k1937j9370j6080j2635r946q389p526
$$ 666999 647379 621900 594763 568760 544736 522799 503429 487349 474714 464768 456379 448853
59382D48853o605n311l952k954k222j311j00R01J184Q59N79Q94J806K749L001
$$ 448853 442248 436937 432985 430031 427809 426498 426398 427299 428483 429342 429921 430815 432621 435370 438371
59367D38371K307J277Q99J456K224K479K392K597L205L875M627N856P481Q791
$$ 438371 440678 441955 442854 444310 446534 449013 451405 454002 457207 461082 465709 471565 479046 487837
59353D87837R387R729J0462J1603J2766J3834J5004J6287J7292J7540J6846J5452
$$ 487837 497224 506953 517415 529018 541784 555618 570622 586909 604201 621741 638587 654039
59341F54039J3857J2375J0872R028O786M353J838p78l371n730p822r637j0843
$$ 654039 667896 680271 691143 700171 706957 711310 713148 712370 708999 703269 695447 685810 674967
59328F74967j1075j0656j0392j0621j0855j0586r925r258q711q143p338o132m811
$$ 674967 663892 653236 642844 632223 621368 610782 600857 591599 582888 574745 567407 561275 556464
59315E56464m263n028o243o406n300m129l559k936j956j691k833m116l909k601
$$ 556464 552201 547173 540930 534524 529224 525095 521536 518600 516644 514953 512120 508004 504095 501494
59301E01494j838j941j735p71o8m26j278j721j578j069k79N88J173J481J863K313
$$ 501494 499656 497715 495980 495209 495141 494715 493437 491716 490138 489069 488790 489378 490551 492032 493895 496208
59285D96208K405K155K163K710L399L895M363M978N635O428P726R442J0863J1451
$$ 496208 498613 500768 502931 505641 509040 512935 517298 522276 527911 534339 542065 551507 562370 573821
59271E73821J1376J1020J0587J0307J0415J0639J0314R186P617N811L579J040
$$ 573821 585197 596217 606804 617111 627526 638165 648479 657665 665282 671093 674672 675712
59259F75712j139k595l718m965o261p375q274q866r015r019r315r532q666o616
$$ 675712 674573 671978 668260 663295 657034 649659 641385 632519 623504 614485 605170 595638 586972 580356
59245E80356m639l796l735l613l299k944k120m15J602K889L098K608J764Q04J25
$$ 580356 575717 571921 568186 564573 561274 558330 556210 555795 557397 560286 563384 565992 567756 568560 568685
59230E68685j09m73j652l478n163o313p156p918q484q669q461q079p923q177q317
$$ 568685 568576 568103 566451 562973 557810 551497 544341 536423 527939 519270 510809 502730 494807 486630 478313
59215D78313p569o043m852m685m931m631l628k321r35K14N12k07j165j603j616
$$ 478313 470744 464701 459849 455164 450233 445602 441974 439653 438718 438932 439444 439237 438072 436469 434853
59200D34853j386m38J331K746K681J756J381J617J491J105J761L726N489N775
$$ 434853 433467 433029 434360 437106 439787 441543 442924 444541 446032 447137 448898 452624 458113 463888
59186D63888N142M975N763O963P877Q128P756P126O451N460L958K553K036K278
$$ 463888 469030 474005 479768 486731 494608 502736 510492 517618 524069 529529 533487 536040 538076 540354
59172E40354K611L092M288N902O894P160P722Q892R512Q728P329O443N888M797
$$ 540354 542965 546057 550345 556247 563141 570301 578023 586915 596427 605155 612484 618927 624815 629612
59158F29612L131J592M21p66k234l881n505o838p572p751p794p877p768p513p578
$$ 629612 632743 634335 634756 633990 631756 627875 622370 615532 607960 600209 592415 584538 576770 569257 561679
59143E61679p950p886p114o457o533o681o018m859m037l381k119m57N65O21M31
$$ 561679 553729 545843 538729 532272 525739 519058 513040 508181 504144 500763 498644 498187 498752 499373 499804
59128D99804M99P28J329K886N123O695O819O358O631P886R453J0842J1970J2747
$$ 499804 500303 501031 502360 505246 510369 517064 523883 530241 536872 544758 554211 565053 577023 589770
59114E89770J3124J3410J3969J4744J5464J6131J6808J7121J6526J5093J3519
$$ 589770 602894 616304 630273 645017 660481 676612 693420 710541 727067 742160 755679
59103G55679J2326J1349J0115Q415O377M306K537J217Q4j315l051m664n683o078
$$ 755679 768005 779354 789469 797884 804261 808567 811104 812321 812405 811090 808039 803375 797692 791614
59089G91614o002n470m590l935m173n284o571p548q444r648j1023j2057j2495
$$ 791614 785612 780142 775552 771617 767444 762160 755589 748041 739597 729949 718926 706869 694374
59076F94374j2493j2309j2088j1887j1657j1247j0633j0037r619r164q387p402
$$ 694374 681881 669572 657484 645597 633940 622693 612060 602023 592404 583240 574853 567451
59064E67451o627o247o100o039o082o099n762m970m151l884m296m850m752l644
$$ 567451 560824 554577 548477 542438 536356 530257 524495 519525 515374 511490 507194 502344 497592 493948
59050D93948k013q14n43p98q76n65q3M74J129J638J676J416J414J835K279K500
$$ 493948 491935 491121 490578 489780 488904 488339 488256 488730 489859 491497 493173 494589 496003 497838 500117 502617
59034E02617K788L422M212M826N114M945M217L503M114O834J0747J3926J5258
$$ 502617 505405 508827 513039 517865 522979 527924 532141 535644 539758 546592 557339 571265 586523
59021E86523J5221J4902J4814J4777J4480J3773J2608J0946Q831O444M020J746
$$ 586523 601744 616646 631460 646237 660717 674490 687098 698044 706875 713319 717339 719085
59009G19085k91k012l263l900l909l367k337r87L30J328K110K941L656L748L103
$$ 719085 718794 716782 713519 709619 705710 702343 700006 699019 699349 700677 702787 705728 709384 713132 716235
58994G16235K224J458M38j230l059m099m213m344n359p091q787j0064j0933j1192
$$ 716235 718459 719917 720355 719125 716066 711967 707754 703410 698051 690960 682173 672109 661176 649984
58980F49984j0451q894p413o623o075m894k979j027N07J775K829L330L339L726
$$ 649984 639533 630639 623226 616603 610528 605634 602655 601628 602135 603910 606739 610069 613408 617134
58966F17134N064O623P206O765O379O771P658Q486Q915Q446O527L535Q58n60j341
$$ 617134 622198 628821 636027 642792 649171 655942 663600 672086 681001 689447 695974 699509 700367 699807 698466
58951F98466k720n005p418r180j0127j0442j0302r802q908p580o118n066m575
$$ 698466 695746 690741 683323 674143 664016 653574 643272 633470 624562 616982 610864 605798 601223
58938F01223m132l339k630k714l640m823n897o906p709p841p152o121n355m919
$$ 601223 597091 593752 591122 588408 584768 579945 574048 567142 559433 551592 544440 538319 532964 528045
58924E28045m399l500k434j757j740j975j806j147n30k10K70J255K195K315J827
$$ 528045 523646 520146 517712 515955 514215 512240 510434 509287 508757 508547 508817 510072 512267 514582 516409
58909E16409J768K688M152N584O874Q027Q839R288R743J0367J0736J0425R611
$$ 516409 518177 520865 525017 530601 537475 545502 554341 563629 573372 583739 594475 604900 614511
58896F14511Q705P768O731N980O110P187Q755J0578J2766J5104J6834J7477J7451
$$ 614511 623216 630984 637715 643695 649805 656992 665747 676325 689091 704195 721029 738506 755957
58883G55957J7414J7226J6107J3796J1022Q558O164K896j486n863q815j0195j1313
$$ 755957 773371 790597 806704 820500 831522 840080 846244 849140 847654 841791 832976 822781 811468
58870H11468j3333j5871j7469j7322j5958j4255j2452j0528q940q212q083p788
$$ 811468 798135 782264 764795 747473 731515 717260 704808 694280 685340 677128 669045 661257
58858F61257p161o812p056p434p519p583q006q539q587p959o905n773m949m739
$$ 661257 654096 647284 640228 632794 625275 617692 609686 601147 592560 584601 577696 571923 566974 562235
58844E62235m912m752m055l617m156n134n437m897m279l904l295k348j881k498
$$ 562235 557323 552571 548516 544899 540743 535609 530172 525275 520996 517092 513797 511449 509568 507070
58830E07070l506l633k515j058m02q22j649k116k100j953j698q96M45J449J402
$$ 507070 503564 499931 497416 496358 495956 495134 493485 491369 489269 487316 485618 484722 485167 486616 488018
58815D88018P97O63J096J295R42O39Q44J208J209Q17K43l49p11n46K8N55Q45J014
$$ 488018 488815 489478 490574 491869 492811 493450 494294 495502 496711 497528 497771 497422 496711 496165 496193 496748 497593 498607
58797D98607R57M61j66l13o1p1l93l55J67M29K72P08K290L952M409M049M279N555
$$ 498607 499564 500025 499859 499546 499485 499414 499021 498666 498833 499262 499534 500242 502532 506484 510893 514942 519221 524776
58779E24776P024P827P826P154N943M480L064J762O14k19q75j874l301m390m504
$$ 524776 531800 539627 547453 554607 560550 565030 568094 569856 570470 570251 569376 567502 564201 559811 555307
58764E55307m082l935m097m109l956l832l414k354j203q18j049r41k04N52J056
$$ 555307 551225 547290 543193 539084 535128 531296 527882 525528 524325 523507 522458 521517 521313 521865 522921
58749E22921J739K731L434L453L173K980K691K127J742K126L301M803O192P177
$$ 522921 524660 527391 530825 534278 537451 540431 543122 545249 546991 549117 552418 557221 563413 570590
58735E70590P595P502P173O847O713P043P973R060R444Q648O997N181L640K388
$$ 570590 578185 585687 592860 599707 606420 613463 621436 630496 639940 648588 655585 660766 664406 666794
58721F66794J131m49k224l472l472k305p43N33J386J956K378K815L347L767L666
$$ 666794 667925 667476 665252 661780 658308 656003 655260 655793 657179 659135 661513 664328 667675 671442 675108
58706F75108K877J583M7j596l323n170p095q827j0059j0960j2085j3463j4210
$$ 675108 677985 679568 679615 678019 674696 669526 662431 653604 643545 632585 620500 607037 592827
58693E92827j3566j2027j0764j0218r885r372q856q415p723o639n603n054m845
$$ 592827 579261 567234 556470 546252 536367 526995 518139 509724 502001 495362 489759 484705 479860
58680D79860m550m006l278k396j380m90j02l03o47m48O13K166L610M786N970P247
$$ 479860 475310 471304 468026 465630 464250 463760 463658 463355 462708 462260 462873 465039 468649 473435 479405 486652
58664D86652Q389R323J0158J0533R658P410M781K734J167m63j992k877l188l481
$$ 486652 495041 504364 514522 525055 534713 542123 546904 549638 550805 550342 548350 545473 542285 538804
58650E38804l934m314m565m699m391l429k376j953j954j530m90M73P96N63M7n30
$$ 538804 534870 530556 525991 521292 516901 513472 511096 509143 507189 505659 505169 505642 506438 507001 507048 506518
58634E06518p81m26J60L08q4n70r36j293j578j635j672j906j886r58O76K174L177
$$ 506518 505737 505311 505471 505779 505695 505125 504189 502896 501318 499683 498011 496105 494219 493261 493937 496111 499288
58617D99288L940M509M761N155O395Q226R495R591Q902P865O519N129M163L499
$$ 499288 503228 507737 512498 517653 524048 532274 541769 551360 560262 568127 574646 579775 583938 587437
58603E87437K599J602J176J130M13j134k314k437k384l077l936l853k865j845
$$ 587437 590036 591638 592814 593944 594357 593223 590909 588472 586088 583011 579075 575222 572357 570512
58589E70512j086j47J242K877M506O030P396Q539R316R435Q922Q546R020R761
$$ 570512 569426 569279 570521 573398 577904 583934 591330 599869 609185 618620 627542 636088 645108 654869
58575F54869R404P731O089N542N666N660N585N816O287P037Q655J1247J3814J5488
$$ 654869 664273 672004 678093 683635 689301 694961 700546 706362 712649 719686 728341 739588 753402 768890
58561G68890J6675J8039J9196J9448J9105J8846J8266J6391J3383J0494Q344O428
$$ 768890 785565 803604 822800 842248 861353 880199 898465 914856 928239 938733 947077 953505
58549I53505M357K453Q33j033l413n713p345q574j0040j1816j3522j5089j6812
$$ 953505 957862 960315 961148 960115 956702 950989 943644 935070 925030 913214 899692 884603 867791
58536H67791j8561j9525j9109j7820j6704j5990j4875j2905j0820r464q484o968
$$ 867791 849230 829705 810596 792776 776072 760082 745207 732302 721482 712018 703534 696566
58524F96566n009l561k939k528k008j710j584r92J16R11J046J245J996K736L005
$$ 696566 691557 687996 685057 682529 680521 678811 677227 676235 676351 677262 678308 679553 681549 684285 687290
58509F87290L384M350N167M909L957L399L498L672L564L176K311Q76n77j432j955
$$ 687290 690674 695024 700191 705100 709057 712456 715954 719626 723190 726366 728677 729553 728976 727544 725589
58494G25589k834l964m514m079l066k052j391j276j565j548n04J524L920O220
$$ 725589 722755 718791 714277 710198 707132 705080 703689 702413 700848 699300 698796 700320 704240 710460
58480G10460Q297J0026J1309J2227J2763J2544J1365R708Q308P251N897L656N45
$$ 710460 718757 728783 740092 752319 765082 777626 788991 798699 807007 814258 820155 823811 824356
58467H24356k769n321o460o416n983n629n231m702m222l648k392k97K009L930
$$ 824356 821587 816266 809806 803390 797407 791778 786547 781845 777623 773975 771583 771286 773295 777225
58453G77225N462O655P193O912O032M514K049r08l063l904m476n673o687o186
$$ 777225 782687 789342 796535 803447 809479 813993 816042 815134 812071 808167 803691 798018 791331 785145
58439G85145m328k428j163j88P54J469J914K319K763L278M183N626P091P967Q417
$$ 785145 780817 778389 777226 777038 777792 779261 781175 783494 786257 789535 793718 799344 806435 814402 822819
58424H22819R096J0241J1588J2791J3484J3229J1986J0268Q367N943K892k3j981
$$ 822819 831915 842156 853744 866535 880019 893248 905234 915502 923869 929812 932704 932681 930700
58411I30700l068l809m279m339m180l967l448k511j566q34J14J492K704L295L710
$$ 930700 927632 923823 919544 915205 911025 907058 903610 901099 899533 898699 898813 900305 903009 906304 910014
58396I10014M452N277N937O789P775P886O631N123M488M125K868J060o0l93q74
$$ 910014 914466 919743 925680 932469 940244 948130 954761 959884 964372 968497 971365 972425 972365 971972 971098
58381I71098j839k941m370o647r380j1451j2344j2195j0833q003m250m82L088
$$ 971098 969259 966318 961948 955301 945921 934470 922126 909931 899098 891095 886845 886363 889451
58368H89451O560R351J0760J1162J1485J1922J2259J2927J4352J5723J5828J4760
$$ 889451 896011 905362 916122 927284 938769 950691 962950 975877 990229 1005952 1021780 1036540
58356A036540J3538J2377J0834R195Q212P690O852N924N861O652P304P496P783
$$ 1036540 1050078 1062455 1073289 1082484 1090696 1098386 1105238 1111162 1117023 1123675 1130979 1138475 1146258
58343A146258Q309Q700R146J0166J1509J2631J4019J6441J9089K0238J9763J9274
$$ 1146258 1154567 1163267 1172413 1182579 1194088 1206719 1220738 1237179 1256268 1276506 1296269 1315543
58331A315543J9574J9657J8583J6736J4851J3115J1694J0890J0429R660Q651Q112
$$ 1315543 1335117 1354774 1373357 1390093 1404944 1418059 1429753 1440643 1451072 1460732 1469383 1477495
58319A477495Q112P984P546P336P650Q355R559J1374J3281J4808J6440J8644K0545
$$ 1477495 1485607 1493591 1501137 1508473 1516123 1524478 1534037 1545411 1558692 1573500 1589940 1608584 1629129
58306A629129K1075K0883K1479K2881K3853K4135K4534K5099K5087K4681K4827
$$ 1629129 1650204 1671087 1692566 1715447 1739300 1763435 1787969 1813068 1838155 1862836 1887663
58295A887663K5396K5359K4707K4311K4088K3281K2503K3242K5291K6859K7483
$$ 1887663 1913059 1938418 1963125 1987436 2011524 2034805 2057308 2080550 2105841 2132700 2160183
58284B160183K8658L1103L3658L5361L6738L8354L9922M1353M3051M4769M5837
$$ 2160183 2188841 2219944 2253602 2288963 2325701 2364055 2403977 2445330 2488381 2533150 2578987
58273B578987M6727M8636N1346N3388N4509N6050N8666O1582O4360O7485P0940
$$ 2578987 2625714 2674350 2725696 2779084 2833593 2889643 2948309 3009891 3074251 3141736 3212676
58262C212676P4062P6939Q0157Q3218Q5190Q6690Q9086R1952R3632R4159R5198
$$ 3212676 3286738 3363677 3443834 3527052 3612242 3698932 3788018 3879970 3973602 4067761 4162959
58251D162959R7243R9460J02050J06038J10952J15448J20125J26699J34706J42242
$$ 4162959 4260202 4359662 4461712 4567750 4678702 4794150 4914275 5040974 5175680 5317922
58241E317922J49641J58960J69828J79699J88327J98217K10295K22992K36006
$$ 5317922 5467563 5626523 5796351 5976050 6164377 6362594 6572889 6795881 7031887
58232G031887K50949K67693K84179L00525L19321L41244L64387L88429M15186
$$ 7031887 7282836 7550529 7834708 8135233 8454554 8795798 9160185 9548614 9963800
58223I963800M44697M75338N08287N47019N91985O40887O94544P56801Q28362
$$ 9963800 10408497 10883835 11392122 11939141 12531126 13172013 13866557 14623358 15451720
58214A5451720R06926R94105J095624J214079J348847J504069J688879J908574
$$ 15451720 16358646 17352751 18448375 19662454 21011301 22515370 24204249 26112823
58206B6112823K164608K465012K824914L253210L747617M305387M929537N624833
$$ 26112823 28277431 30742443 33567357 36820567 40568184 44873571 49803108 55427941
58198E5427941O404740P310674Q411978R778515J1461943J3502848J5931386J8744958
$$ 55427941 61832681 69143355 77555333 87333848 98795791 112298639 128230025 146974983
58190A46974983K1894545K5280207K8687245L1645189L3342635L2762393K9035846
$$ 146974983 168869528 194149735 222836980 254482169 287824804 320587197 349623043
58183C49623043K1847125J1704695m3985j1535671k1004660k7398677l0618243
$$ 349623043 371470168 383174863 383130878 371595207 350590547 323191870 292573627
58176B92573627l1265662l0174502k8073477k5488111k2760297k0083199j7548760
$$ 292573627 261307965 231133463 203059986 177571875 154811578 134728379 117179619
58169A17179619j5206051j3090939j1219479r584501q171756o968886n956376
$$ 117179619 101973568 88882629 77663150 68078649 59906893 52938007 46981631
58162D6981631n104578m386394l784009l280644k856196k495033k189396j931589
$$ 46981631 41877053 37490659 33706650 30426006 27569810 25074777 22885381 20953792
58154B0953792j710462j518194j352949j211862j088198r77738q81386p98833
$$ 20953792 19243330 17725136 16372187 15160325 14072127 13094389 12213003 11414170
58146A1414170p25737o59325o00865n50298n04108m60754m22749l91019l62283
$$ 11414170 10688433 10029108 9428243 8877945 8373837 7913083 7490334 7099315 6737032
58137F737032l34286l08796k87120k67333k48206k31457k17750k04594j90472
$$ 6737032 6402746 6093950 5806830 5539497 5291291 5059834 4842084 4637490 4447018
58128D447018j77300j66611j56951j47141j38560j32060j25901j18862j12309
$$ 4447018 4269718 4103107 3946156 3799015 3660455 3528395 3402494 3283632 3171323
58119C171323j07272j02444r6896r1886q8166q4310p9483p5199p2558p0278o7139
$$ 3171323 3064051 2961607 2864711 2772825 2684659 2600349 2520866 2445667 2373109 2302831 2235692
58108B235692o3940o1498n9092n6396n4559n3929n3034n1122m9306m7950m5549
$$ 2235692 2171752 2110254 2051162 1994766 1940207 1886278 1833244 1782122 1732816 1684866 1639317
58097A639317m1638l8255l6826l5995l4216l2108l0537k8688k5993k3905k3667
$$ 1639317 1597679 1559424 1522598 1486603 1452387 1420279 1389742 1361054 1335061 1311156 1287489
58086A287489k4100k3429k1811k0321j9057j7933j7824j9148k0575k0787k0328
$$ 1287489 1263389 1239960 1218149 1197828 1178771 1160838 1143014 1123866 1103291 1082504 1062176
58075A062176k0375k0866k1171k1349k1419k0657j8895j7341j6793j6302j4843
$$ 1062176 1041801 1020935 999764 978415 956996 936339 917444 900103 883310 867008 852165
58064H52165j3123j2384j2447j2222j1323j0023q537p310p105p903q599q589q595
$$ 852165 839042 826658 814211 801989 790666 780643 772106 764796 757691 749788 741189 732600 724005
58051G24005r176r623r248q619q504q608q366q064q201q556q616q249p425o200
$$ 724005 714829 705206 695958 687339 678835 670227 661861 653797 645596 637040 628424 620175 612750 606550
58037F06550n314n676o851p339o726o207o477o796o696o944p909q602q358p965
$$ 606550 601236 595560 588709 581370 574644 568437 561960 555164 548468 541524 533615 525013 516655 508690
58023E08690q077q016p259o623o779o938o289n451n224n157m642m190m353m513
$$ 508690 500613 492597 485338 478715 471936 464998 458709 453258 448034 442877 438235 434045 429692 425179
58009D25179m084l674l747l355j720R9O93M26M69O30n4j322k119k552l676n510
$$ 425179 421095 417421 413674 410319 408599 408698 409391 409817 410286 410916 410862 409540 407421 404869 401193 395683
57993C95683o779o581n165l170j173K66J057J838K921L502K827J570R90J192J355
$$ 395683 388904 382323 377158 373988 372815 373081 374138 375976 378897 382399 385226 386796 387786 388978 390333
57978C90333J253J320J541J387P65J19l05n61n99m11k93l71l02M7J59k24n13k70
$$ 390333 391586 392906 394447 395834 396599 396718 396413 395852 395253 394842 394549 394178 393876 393923 394082 393858 393345 393075
57960C93075j1k45n07l69n43j731l126l427k870k795l467l801l232k483k198j946
$$ 393075 393064 392819 392312 391943 391400 389669 386543 383116 380246 377451 373984 370183 366951 364468 362270 360324
57944C60324j039M48J883K926L809M988O532P815Q181P921Q063Q936R681R554
$$ 360324 359285 359733 361616 364542 368351 373339 379871 387686 395867 403788 411851 420787 430468 440022
57930D40022Q870Q056O703M359J591o91k464m257o094p588q647r363r598r347
$$ 440022 448892 456948 463651 468010 469601 468910 466446 462189 456095 448507 439860 430497 420899 411552
57916D11552r022q737p980o631n584n451n503m839l913l657l806l398k506k161
$$ 411552 402530 393793 385813 379182 373598 368147 362644 357805 353892 350235 346429 343031 340525 338364
57902C38364k706l504m170m923n736o147n980n445m527l079j425j68N44R57J169
$$ 338364 335658 332154 327984 323061 317325 311178 305198 299753 295226 292147 290722 290554 291098 292055 293224
57887B93224J251J563K250K762K552J853J078m7j811l516m153l813l425l423l548
$$ 293224 294475 296038 298288 301050 303602 305455 306533 306486 304675 301159 297006 293193 289768 286345 282797
57872B82797l623l597l117k102j312j366j529o38J083K335K674K860L398M002
$$ 282797 279174 275577 272460 270358 269046 267680 266151 265513 266596 268931 271605 274465 277863 281865
57858B81865M586N502O556O956O538O073O060O072N625M892M224L571K711J520
$$ 281865 286451 291953 298509 305465 312003 318076 324136 330208 335833 340725 344949 348520 351231 352751
57844C52751kj619k814l392l889m807n713n787n038m227l858l937m338m622l912
$$ 352751 352749 351130 348316 344924 341035 336228 330515 324728 319690 315463 311605 307668 303330 298708 294796
57829B94796j928K17J250J365J575J906J609Q12M74O80N25k26p71q14j083j925
$$ 294796 292868 293085 294335 295700 297275 299181 300790 301602 302076 302756 303281 303055 302284 301470 300387 298462
57813B98462k695k972l169l512l579l328l392l864l898l163k530k630k750k022
$$ 298462 295767 292795 289626 286114 282535 279207 275815 271951 268053 264890 262360 259730 256980 254958
57799B54958q01J2K91M95P12P17O11O51P44O56M84N12Q28J349J881K053J623J042
$$ 254958 254157 254169 254460 254955 255667 256384 256995 257646 258390 259046 259530 260042 260870 262219 264100 266153 267776 268818
57781B68818J178K325L902N194N821N525M262K662J631J239P47j73j035j574k254
$$ 268818 269996 272321 276223 281417 287238 292763 297025 299687 301318 302557 303304 303131 302096 300522 298268
57766B98268l394m625n608o529p364p611p159o701o669o543n808m865m322m005
$$ 298268 294874 290249 284641 278112 270748 263137 255978 249277 242608 236065 230257 225392 221070 217065
57752B17065l427k671k074j499o86P2K84N0j35j54k41l77l05r2j77p57j425j455
$$ 217065 213638 210967 208893 207394 206708 206780 207064 207114 206979 206825 206584 206207 205902 205810 205633 204876 203451 201996
57734B01996m93R55J795J406L19m64o72p33p05j05J103K103K193J541P95M72Q67
$$ 201996 201503 202458 204253 205659 205978 205514 204842 204109 203404 203299 204402 206505 208698 210239 211034 211506 212373
57717B12373J875K694K435J272K73q6l19o79n29M49J482J820J812K102K501K541
$$ 212373 214248 216942 219377 220649 220922 220836 220517 219838 219309 219758 221240 223060 224872 226974 229475 232016
57701B32016K502K957L757M263M269L894K997J479j12j116j659k271k910l108
$$ 232016 234518 237475 241232 245495 249764 253658 256655 258134 258022 256906 255247 252976 250066 246958
57687B46958k910k797k620j530P88L359M913N310N736P456J0611J4292J7732K1099
$$ 246958 244048 241251 238631 237101 237889 241248 246161 251471 257207 264663 275274 289566 307298 328397
57673C28397K4963K9422L4323M0036M7211N5592O3713O9634P1119O5319M9914
$$ 328397 353360 382782 417105 457141 504352 559944 623657 693291 764410 829729 879643
57662H79643K5687k716k9293m9721o2129o6473o4451n9108n3066m7047m0721l4436
$$ 879643 905330 902614 873321 823600 761471 694998 630547 571439 518373 471326 430605 396169
57650C96169k9175k5173k1703j8192j4767j1741r258p464o339n398m057k385j077
$$ 396169 366994 341821 320118 301926 287159 275418 266160 258696 252357 246959 242902 240517 239440
57637B39440o73j049j552j454o00J91j85j705l023l108k402j911j801j684j554
$$ 239440 238767 237718 236166 234712 234112 234303 234118 232413 229390 226282 223880 221969 220168 218484 216930
57622B16930j616j584j138p15r11j430j497j084q10p94n96j48J91N01J245K314
$$ 216930 215314 213730 212592 211877 210966 209536 208039 206955 206145 205351 204755 204607 204798 205299 206544 208858
57606B08858K976K895K393J664N80n72j009m68L62P17N02L8l60l31L62J292J553
$$ 208858 211834 214729 217122 218786 219366 218794 217785 217317 217679 218396 218898 218936 218576 218245 218607 219899 221452
57589B21452Q37j05l75P4N96P11N53N98J065J599J614J059N18L64K39k42p01o01
$$ 221452 222289 222184 221809 221883 222479 223190 223743 224341 225406 227005 228619 229678 230196 230560 230799 230557 229856 229255
57571B29255k02j47l37j08N59R18O28K16J64K68K19J08Q1M5l1QJ50K45M67J173
$$ 229255 229053 228906 228569 228461 229020 229938 230566 230782 230946 231214 231433 231541 231622 231667 231636 231644 231794 232039 232506 233679
57551B33679K143K610K310J918K110K758L267L302K904K330K020K313K939L263
$$ 233679 235822 238432 240742 242660 244770 247528 250795 254097 257001 259331 261351 263664 266603 269866
57537B69866L079K719K246J341J95k13O54K025K684K334J564Q95M71L51N17O83
$$ 269866 272945 275664 277910 279251 279446 279233 279887 281912 284596 286930 288494 289389 289860 290211 290728 291411
57521B91411N65L08K66N12Q28J106J452J965K567K972K797J981J140J067J761
$$ 291411 291976 292284 292550 293062 293890 294996 296448 298413 300980 303952 306749 308730 309870 310937 312698
57506C12698K397K464K405K701K933K419J411Q84J222J833K140K244K406K441
$$ 312698 315095 317559 319964 322665 325598 328017 329428 330312 331534 333367 335507 337751 340157 342598
57492C42598K020J288P74Q29J373K146K930L512L671L351K796K407K398K616K732
$$ 342598 344618 345906 346680 347509 348882 351028 353958 357470 361141 364492 367288 369695 372093 374709 377441
57477C77441K533K064J552J268J364J769K266K720L101L283L089K648K393K454
$$ 377441 379974 382038 383590 384858 386222 387991 390257 392977 396078 399361 402450 405098 407491 409945
57463D09945K409K025J906K749M136M854M455L767L583L631L361L008L184L733
$$ 409945 412354 414379 416285 419034 423170 428024 432479 436246 439829 443460 446821 449829 453013 456746
57449D56746L875L400L002L291M075M841N419N823N853N377M836M876N439N694
$$ 456746 460621 464021 467023 470314 474389 479230 484649 490472 496325 501702 506538 511414 516853 522547
57435E22547N134M326M205M796N209M873M237L994M139M218M213M626N698O937
$$ 522547 527681 532007 536212 541008 546217 551090 555327 559321 563460 567678 571891 576517 582215 589152
57421E89152P595P363O547N686N077M652M312M310M970N954O217N164L562K872
$$ 589152 596747 604110 610657 616343 621420 626072 630384 634694 639664 645618 651835 656999 660561 663433
57407F63433L636N030N907N971N765N908O480P075P330P395P669Q145Q301P924
$$ 663433 667069 672099 678006 683977 689742 695650 702130 709205 716535 723930 731599 739744 748045 755969
57393G55969P539P655P974P930P662P805Q466R133R522R840J0193J0433J0604
$$ 755969 763508 771163 779137 787067 794729 802534 811000 820133 829655 839495 849688 860121 870725
57380H70725J0838J0824J0107R000Q384Q407Q318P852P831Q787R926J0248J0023
$$ 870725 881563 892387 902494 911494 919878 928285 936603 944455 952286 961073 970999 981247 991270
57367I91270J0205J0883J1273J1120J1103J1803J2993J4050J4583J4475J3812
$$ 991270 1001475 1012358 1023631 1034751 1045854 1057657 1070650 1084700 1099283 1113758 1127570
57356A127570J2955J2343J2153J2326J2861J3745J4647J5098J5039J4910J5042
$$ 1127570 1140525 1152868 1165021 1177347 1190208 1203953 1218600 1233698 1248737 1263647 1278689
57345A278689J5261J5203J4779J4225J3840J3836J4299J5102J5856J6127J5847
$$ 1278689 1293950 1309153 1323932 1338157 1351997 1365833 1380132 1395234 1411090 1427217 1443064
57334A443064J5456J5493J6032J6625J6952J7180J7555J7851J7724J7412J7535
$$ 1443064 1458520 1474013 1490045 1506670 1523622 1540802 1558357 1576208 1593932 1611344 1628879
57323A628879J8146J8551J8270J7648J7236J7068J6992J7276J8270J9652K0596
$$ 1628879 1647025 1665576 1683846 1701494 1718730 1735798 1752790 1770066 1788336 1807988 1828584
57312A828584K0726K0464K0409K0728K1262K1926K2730K3530K4010K4011K3847
$$ 1828584 1849310 1869774 1890183 1910911 1932173 1954099 1976829 2000359 2024369 2048380 2072227
57301B072227K4062K4799K5552K5831K5866K6273K7076K7596K7460K7232K7682
$$ 2072227 2096289 2121088 2146640 2172471 2198337 2224610 2251686 2279282 2306742 2333974 2361656
57290B361656K8806K9924L0477L0474L0308L0426L0953L1439L1230L0362K9769
$$ 2361656 2390462 2420386 2450863 2481337 2511645 2542071 2573024 2604463 2635693 2666055 2695824
57279B695824L0209L1291L1961L1708L0900L0080K9475K9180K9297K9741L0245
$$ 2695824 2726033 2757324 2789285 2820993 2851893 2881973 2911448 2940628 2969925 2999666 3029911
57268C029911L0672L1092L1587L2173L2914L3826L4677L5146L5271L5447L5907
$$ 3029911 3060583 3091675 3123262 3155435 3188349 3222175 3256852 3291998 3327269 3362716 3398623
57257C398623L6420L6604L6326L5710L4998L4470L4330L4449L4378L3866L3319
$$ 3398623 3435043 3471647 3507973 3543683 3578681 3613151 3647481 3681930 3716308 3750174 3783493
57246C783493L3462L4466L5658L6291L6439L6766L7544L8300L8530L8373L8234
$$ 3783493 3816955 3851421 3887079 3923370 3959809 3996575 4034119 4072419 4110949 4149322 4187556
57235D187556L8154L7911L7522L7163L6741L6041L5149L4309L3425L2314L1327
$$ 4187556 4225710 4263621 4301143 4338306 4375047 4411088 4446237 4480546 4513971 4546285 4577612
57224D577612L1022L1210L1084L0493L0239L0773L1376L1287L0973L1464L2804
$$ 4577612 4608634 4639844 4670928 4701421 4731660 4762433 4793809 4825096 4856069 4887533 4920337
57213D920337L3990L4331L4179L4248L4706L5077L4743L3533L1947L0680K9716
$$ 4920337 4954327 4988658 5022837 5057085 5091791 5126868 5161611 5195144 5227091 5257771 5287487
57202E287487K8254K5811K3088K1225K0421J9850J8742J7062J5164J3370J1933
$$ 5287487 5315741 5341552 5364640 5385865 5406286 5426136 5444878 5461940 5477104 5490474 5502407
57191E502407J0980J0357R840R530R649J0023J0171R978R845R969R921R230Q115
$$ 5502407 5513387 5523744 5533584 5543114 5552763 5562786 5572957 5582935 5592780 5602749 5612670 5621900 5630015
57178E630015P258O932O777O543O679P766R507J0821J1205J1419J2348J3516J3509
$$ 5630015 5637273 5644205 5650982 5657525 5664204 5671970 5681477 5692298 5703503 5714922 5727270 5740786 5754295
57165E754295J1757R090O517M271K283O13j065l525o891j0126j2374j4143j6397
$$ 5754295 5766052 5775142 5781659 5785930 5788213 5788826 5787761 5784236 5777345 5767219 5754845 5740702 5724305
57152E724305j9035k1354k3438k5896k8397k9829k9967k9834l0076l0010k8781
$$ 5724305 5705270 5683916 5660478 5634582 5606185 5576356 5546389 5516555 5486479 5456469 5427688
57141E427688k6568k4035k1321j8296j5355j3255j2393j2770j4449j7502k1528
$$ 5427688 5401120 5377085 5355764 5337468 5322113 5308858 5296465 5283695 5269246 5251744 5230216
57130E230216k5707k9426l2641l5543l7945l9169l8563l6189l2835k9290k5765
$$ 5230216 5204509 5175083 5142442 5106899 5068954 5029785 4991222 4955033 4922198 4892908 4867143
57119D867143k2194j8817j6164j4605j4264j5145j6745j7608j5894j0707k465
$$ 4867143 4844949 4826132 4809968 4795363 4781099 4765954 4749209 4731601 4715707 4705000 4702535
57108D702535Q083K0744L5585N2328P0709R1409J16205J47042J85081K30547K83104
$$ 4702535 4710618 4731362 4766947 4819275 4889984 4981393 5097598 5244640 5429721 5660268 5943372
57097E943372L41955M05646M72401N41281O12982O88952P69517Q52868R35268
$$ 5943372 6285327 6690973 7163374 7704655 8317637 9006589 9776106 10628974 11564242
57088A1564242J011289J073957J115997J131403J114769J059148R57536Q09579
$$ 11564242 12575531 13649488 14765485 15896888 17011657 18070805 19028341 19837920
57080A9837920O26507M26714K25273K8486j62055l42838n07187o48607p63348
$$ 19837920 20464427 20891141 21116414 21144900 20982845 20640007 20132820 19484213 18720865
57071A8720865q50559r12022r51973r75707r87410r89082r81049r62802r33725
$$ 18720865 17870306 16958284 16006311 15030604 14043194 13054112 12073063 11110261 10176536
57062A0176536q93997q45256p90170p31341o70748o09955n50389m93424m40366
$$ 10176536 9282539 8437283 7647113 6915772 6245024 5635069 5084680 4591256 4150890
57053D150890l92252l49480l11790k78795k50166k25208k02819j82325j63983
$$ 4150890 3758638 3409158 3097368 2818573 2568407 2343199 2140380 1958055 1794072
57044A794072j48150j34390j21933j10666j00929r2427q4206p5810o7812o0922
$$ 1794072 1645922 1511532 1389599 1278933 1178004 1085577 1001371 925561 857749 796827
57034G96827n5087m9778m4773m0279l6474l3341l0801k8683k6578k4042k1109
$$ 796827 741740 691962 647189 606910 570436 537095 506294 477611 451033 426991 405882
57023D05882j8411j6567j5544j4781j3939j3121j2357j1371j0156r378r554j0133
$$ 405882 387471 370904 355360 340579 326640 313519 301162 289791 279635 270257 260703 250570
57011B50570j0051r176q403q239q051p199o070n419n175m693l902l380l345l229
$$ 250570 240519 231343 222940 214701 206650 199451 193381 187962 182787 178094 174192 170812 167467 164238
56997A64238k517j543j051j230j462j038L7J102J674K101L148N021P047Q412Q930
$$ 164238 161721 160178 159127 157897 156435 155397 155434 156536 158210 160311 163459 168480 175527 183939 192869
56982A92869Q923Q577P631N664K565j141m490o723p813q171q007p311o331n472
$$ 192869 201792 210369 218000 223664 226229 225088 220598 213875 206062 197891 189884 182573 176242 170770
56968A70770m609l153j042Q80J912K476L532N380P601R829J1976J3768J4692J4431
$$ 170770 166161 163008 161966 162846 164758 167234 170766 176146 183747 193576 205552 219320 234012 248443
56954B48443J2981J0262O110P94m704r173j1891j2927j2847j2123j0834q939o758
$$ 248443 261424 271686 277796 278590 273886 264713 252822 239895 227048 214925 204091 195152 188394
56941A88394m767l029j128J090L257N173P322J0208J3530J6447J8440J9397J9061
$$ 188394 183627 180598 179470 180560 183817 188990 196312 206520 220050 236497 254937 274334 293395
56928B93395J6905J2640O499p72p942j3588j6940j8420j8917j8771j7855j6413
$$ 293395 310300 322940 329439 328667 320725 307137 290197 271777 252860 234089 216234 199821
56916A99821j4981j3534j1552r133p297o755o930o677n596m113k692j580j135
$$ 199821 184840 171306 159754 150621 143324 136569 129639 122962 117366 113253 110561 108981 107846
56903A07846j627k561k787j615M19K187L172L737M417N361O399P331Q009Q512
$$ 107846 106219 103658 100871 99256 99675 101862 105034 108771 113188 118549 124948 132279 140288 148800
56889A48800R346J1116J3701J6101J7356J7329J6216J3788R764M744J2l623o098
$$ 148800 158146 169262 182963 199064 216420 233749 249965 263753 273517 278261 278273 274650 268552
56876B68552p360p225o161n215m679l556j039K250N162P664J0639J4392J8251
$$ 268552 261192 253967 247806 242591 237912 234356 233317 235567 240729 248393 259032 273424 291675
56863B91675K1681K5007K8812L3024L6651L8108L5965K9824K0657J0064o25j0391
$$ 291675 313356 338363 367175 400199 436850 474958 510923 540747 561404 571468 570843 560452
56851E60452j8177k3121k5114k4661k2306j8550j4076r461m686O03O329J2044
$$ 560452 542275 519154 494040 469379 447073 428523 414447 404986 400300 400903 407232 419276
56839D19276J7698K3830L0846L8456M5974N2791N8332O1604O0884N4106M0178
$$ 419276 436974 460804 491650 530106 576080 628871 687203 748807 809691 863797 903975
56828I03975K0441j424k1429l7213m8000n3571n4185n1180m6412m0902l4644k7778
$$ 903975 924416 922992 901563 864350 816350 762779 708594 657414 611002 570100 535456 507678
56816E07678k1040j4771q340j028O952J4792K2048K8834L5202M0627M3971M3815
$$ 507678 486638 471867 463527 462499 469451 484243 506291 535125 570327 610954 654925 698740
56804F98740L9074K9503J5755p32j7670l2197m2062m6805m7530m5614m2047l7653
$$ 698740 737814 767317 783072 782340 764670 732473 690411 643606 596076 550462 508415 470762
56792D70762l3074k8329k3125j7709j2843q702m512M53O005J1506J6439K0279
$$ 470762 437688 409359 386234 368525 355682 346980 342468 342921 348926 360432 376871 397150
56780C97150K2307K2080J9637J4950P770j502j1224j9398k4996k8124k9365k9354
$$ 397150 419457 441537 461174 476124 483894 482392 471168 451770 426774 398650 369285 339931
56768C39931k8601k7168k4684k1150j7486j4775j3177j1978j0625r268q357q048
$$ 339931 311330 284162 259478 238328 220842 206067 192890 180912 170287 161019 152662 144614
56756A44614q020p650o504m794l204k169j625j515j993k816l085k256j028n91
$$ 144614 136594 128944 122440 117646 114442 112273 110648 109133 107140 104324 101239 98983 97955 97364
56742I7364j196k037k349k064j450q24n59q05j073p51q2Lp90j553j401o37j76
$$ 97364 96168 94131 91782 89718 88268 87444 86885 86080 85007 84256 84174 84177 83387 81834 80433 79796 79620
56725G9620j22K45J145J720J137j72r51n88L37R87J180J214J215J147J148J349
$$ 79620 79498 79743 80888 82608 83745 83573 82622 82034 82371 83358 84538 85752 86967 88114 89262 90611
56709I0611J475J134N20K62N21P30M48n6l15l27l15k21J06N28Q35J097J404J495
$$ 90611 92086 93220 93740 94002 94523 95253 95701 95645 95330 95003 94688 94467 94573 95101 95936 97033 98437 99932
56691I9932J118O06N41R00J054O46L5k21mL88N66K47n69j453j797j426p91l98
$$ 99932 101050 101656 102197 103097 104151 104797 104832 104611 104607 104995 105561 105808 105239 103786 101989 100563 99772 99374
56673I9374k38M1N06Q14P28N48P67J360J749J502Q41K41k31p65j203j156p50n94
$$ 99374 99136 99177 99683 100497 101225 101773 102540 103900 105649 107151 107992 108233 108002 107237 106034 104878 104128 103534
56655A03534q46q28p6Q51J140R76J209J979K495K223J608J296J268J095P23N33
$$ 103534 102688 101860 101784 102635 103775 104751 105960 107939 110434 112657 114265 115561 116829 117924 118647 119180
56639A19180Q06J440K065K304J994J350Q14O08O45Q64J343J971K330K263K149
$$ 119180 119986 121426 123491 125795 127789 129139 129953 130561 131206 132070 133413 135384 137714 139977 142126
56624A42126K224J909N27j419k430j789n40k38j087j874j596n57K26J86m07r26
$$ 142126 144350 146259 146786 145367 142937 141148 140608 140370 139283 137409 135813 135256 135482 135668 135261 134335
56608A34335r97p14m29l17k20J8K10N6l81p27p90p30p15p47q47j027j043n92J39
$$ 134335 133338 132624 132195 131878 131658 131676 131886 131942 131561 130834 130044 129314 128599 127852 127005 125978 124935 124343 124482
56589A24482O02O47O27N78rj203k095j826p47J21L59K68R3p8P2P42J450J582J456
$$ 124482 125084 125731 126358 126936 126927 125724 123629 121803 121056 121177 121536 121804 121897 121819 121891 122633 124083 125665 127121
56570A27121J929K980L612L312K789K853L395L854M069M219M407M749N448O352
$$ 127121 129050 132030 135642 138954 141743 144596 147991 151845 155914 160133 164540 169289 174737 181089
56556A81089O805O355N337M449L991L742L364K687J825J138Q40O22K0q74j499
$$ 181089 187894 194249 199586 204035 208026 211768 215132 217819 219644 220782 221622 222244 222264 221390 219891
56541B19891j658j762k081k362k377k337k481k763l118l598m001l881l169k296
$$ 219891 218233 216471 214390 212028 209651 207314 204833 202070 198952 195354 191353 187472 184303 182007
56527A82007j529p64j62k74j175k106k463k503k669k795k547k045j532r39l58
$$ 182007 180478 179714 179552 179278 178103 175997 173534 171031 168362 165567 163020 160975 159443 158504 158146
56512A58146l41j109j903j816r53j22K24K10K4j49j4M61P95O01J74LO3N4j6p7
$$ 158146 157805 156696 154793 152977 152024 151902 152126 152336 152360 152211 152197 152658 153453 154054 154228 154231 154294 154348 154332 154255
56492A54255l20p56q27j72O54Q60M41m8l10k83K22J056J366O47k84k83M78R10
$$ 154255 153935 153179 152352 152180 152834 153694 154135 154087 153777 153494 153716 154772 156138 156785 156501 156218 156696 157606
56474A57606O99N19O69O73K71j82n03q53j042n54M89J243J321J268J567J916J825
$$ 157606 158305 158824 159493 160166 160437 160255 159752 158899 157857 157303 157792 159035 160356 161624 163191 165107 166932
56457A66932J323P62L84K82L75L51O1p9L53R70R80L27l21o47r09j104q14n3N95
$$ 166932 168255 169017 169401 169683 170058 170409 170470 170391 170744 171714 172694 173021 172700 172053 171144 170040 169226 169173 169768
56438A69768Q30Q69P64L22j09J14P40O82k94j040o82K18Q53J459K468L165K464
$$ 169768 170598 171467 172231 172553 172444 172558 173298 173980 173686 172646 171964 172182 173035 174494 176962 180127 182591
56421A82591O39p61p45J88R21Q76K55l32l70J43O46O15J10m13o87q52j099j293
$$ 182591 183230 182469 181724 181912 182833 183709 183964 183632 183262 183405 184051 184666 184776 184363 183676 182824 181725 180432
56403A80432r90P9J521K440K340J654J072P06L48K26O67J255J189N91N09J400
$$ 180432 179442 179521 181042 183482 185822 187476 188548 189254 189602 189828 190495 191750 192939 193530 194039 195439
56387A95439K444K730K286J633R91M62K97M87N83L70J28j3l33p07m17O38J306
$$ 195439 197883 200613 202899 204532 205523 205985 206282 206769 207352 207722 207850 207837 207504 206797 206380 207018 208324
56370B08324O29o54r97q0R99J341J133R53J032J304J525J263L30o47o62M20J501
$$ 208324 208953 208299 207302 207222 208221 209562 210695 211648 212680 213984 215509 216772 217102 216455 215793 216213 217714
56353B17714J450L98n03m22L61J005J127J018J054J223J374J517J627J406O53
$$ 217714 219164 219562 219059 218637 218998 220003 221130 222148 223202 224425 225799 227316 228943 230349 231002
56338B31002k61o61k47P18J753K373K250J567R96R21R52O88M88Q57J507J858K054
$$ 231002 230741 230080 229833 230551 232304 234677 236927 238494 239490 240411 241363 242051 242539 243396 244903 246761 248815
56321B48815K529K890K467J713J677K170J942Q74L51J027J752J489Q21O60P87
$$ 248815 251344 254234 256701 258414 260091 262261 264203 265077 265428 266455 268207 269696 270517 271177 271964
56306B71964P89J195K405L528L601L182L401M056M036L151K171J400M90m50p73
$$ 271964 272753 273948 276353 279881 283482 286664 290065 294121 298157 301308 303479 304879 305369 304919 304146
56291C04146k79O12J615K595L018K402J299R38J749K940L520L133K071J114J175
$$ 304146 303867 304479 306094 308689 311707 314109 315408 316346 318095 321035 324555 327688 329759 330873 332048
56276C32048K424L927M740N014N345N511M936M092M165N313O365O522O349O671
$$ 332048 334472 338399 343139 348153 353498 359009 363945 368037 372202 377515 383880 390402 396751 403422
56262D03422P402P995Q480R385J0879J2426J3330J3605J4237J6321J9769K3239
$$ 403422 410824 418819 427299 436684 447563 459989 473319 486924 501161 517482 537251 560490
56250E60490K5663K7397K9377L1672L3673L5297L7147L9381M1285M2003M1233
$$ 560490 586153 613550 642927 674599 708272 743569 780716 820097 861382 903385 944618
56239I44618L9214L6498L3638L0610K6681K1345J5152Q977K861l708j0498j6454
$$ 944618 983832 1020330 1053968 1084578 1111259 1132604 1147756 1156733 1159594 1155886 1145388 1128934
56227A128934k0896k4041k6289k7806k8914l0161l1593l2480l2081l0414k8145
$$ 1128934 1108038 1083997 1057708 1029902 1000988 970827 939234 906754 874673 844259 816114
56216H16114k6015k4456k3456k2685k1858k0898j9711j8160j6430j4929j3609
$$ 816114 790099 765643 742187 719502 697644 676746 657035 638875 622445 607516 593907
56205E93907j1930r902q442q020p689o362m482l313l044k716j898j176r62r54
$$ 593907 581977 572075 563633 555613 547924 541562 537080 533767 530723 528007 526109 524933 523971 523017
56191E23017r26j045j145o16O37J832K257K015J582J264J263J727K493L112L379
$$ 523017 522091 521046 519901 519285 519922 521754 524011 526026 527608 528872 530135 531862 534355 537467 540846
56176E40846L429L416L419L599L980M270M346M674N636O707P075O922P208Q272
$$ 540846 544275 547691 551110 554709 558689 562959 567305 571979 577615 584322 591397 598319 605527 613799
56162F13799R494J0396J1228J2296J3456J4552J5743J7159J8656K0048K1271K2364
$$ 613799 623293 633689 644917 657213 670669 685221 700964 718123 736779 756827 778098 800462
56150H00462K3692K6049L0024L5390M1539M8324N5971O4412P3300Q2414R1405
$$ 800462 824154 850203 880227 915617 957156 1005480 1061451 1125863 1199163 1281577 1372982
56139A372982R9305J04981J07789J07312J02926R4588Q3789P2866O3512N6530
$$ 1372982 1472287 1577268 1685057 1792369 1895295 1989883 2073672 2146538 2210050 2266580
56129B266580N2389N0727M9537M6052L8698K7686J4145k00j2897k1882k7238l1115
$$ 2266580 2318969 2369696 2419233 2465285 2503983 2531669 2545814 2545614 2532717 2510835 2483597 2452482
56117B452482l5978m3514n4648o9123q4795r8457j07743j11825j10652j04765
$$ 2452482 2416504 2372990 2318342 2249219 2164424 2065967 1958224 1846399 1735747 1630982
56107A630982r5701q5363p4762o4139n4034m5144l7327l0006k3522j8784j5543
$$ 1630982 1535281 1449918 1375156 1311017 1256983 1211839 1174512 1144506 1120984 1102200 1086657
56096A086657j2391q633n044k575j305p40j72J167L253M815M912M564N483P506
$$ 1086657 1074266 1065633 1060589 1058014 1056709 1055969 1055797 1056964 1060217 1065032 1069944 1074508 1079991 1087497
56082A087497R010R576J0276J1399J1897J1537J1568J2624J3756J4204J4521J5199
$$ 1087497 1096507 1106083 1116359 1127758 1139655 1151192 1162760 1175384 1189140 1203344 1217865 1233064
56070A233064J5690J5579J5454J5924J6902J8307K0221K2052K2935K3215K4093
$$ 1233064 1248754 1264333 1279787 1295711 1312613 1330920 1351141 1373193 1396128 1419343 1443436
56059A443436K5577K6465K6501K6673K7042K6412K4724K3642K3868K4017K3179
$$ 1443436 1469013 1495478 1521979 1548652 1575694 1602106 1626830 1650472 1674340 1698357 1721536
56048A721536K2577K3332K4505K4862K4981K6090K8071L0085L2014L4041L5813
$$ 1721536 1744113 1767445 1791950 1816812 1841793 1867883 1895954 1926039 1958053 1992094 2027907
56037B027907L7094L8304L9581M0444M1059M2484M4932M7241M8821N0545N2881
$$ 2027907 2065001 2103305 2142886 2183330 2224389 2266873 2311805 2359046 2407867 2458412 2511293
56026B511293N4743N5315N5486N6469N8330O0748O3799O7135O9879P2153P5151
$$ 2511293 2566036 2621351 2676837 2733306 2791636 2852384 2916183 2983318 3053197 3125350 3200501
56015C200501P9029Q2495Q5157Q8334R2703R7190J01082J05209J10065J14842
$$ 3200501 3279530 3362025 3447182 3535516 3628219 3725409 3826491 3931700 4041765 4156607
56005D156607J19403J25019J32058J39177J45778J53053J61473J69710J77166
$$ 4156607 4276010 4401029 4533087 4672264 4818042 4971095 5132568 5302278 5479444
55996E479444J85112J94231K03656K13482K25339K39330K53554K67877K84702
$$ 5479444 5664556 5858787 6062443 6275925 6501264 6740594 6994148 7262025 7546727
55987G546727L04614L25044L45062L67534L94403M23709M53855M86879N24841
$$ 7546727 7851341 8176385 8521447 8888981 9283384 9707093 10160948 10647827 11172668
55978A1172668N66878O12549O64232P23392P88662Q60450R43106J039595J148998
$$ 11172668 11739546 12352095 13016327 13739719 14528381 15388831 16331937 17371532 18520530
55969A8520530J272467J416489J586927J785965K019034K298552K636548L040772
$$ 18520530 19792997 21209486 22796413 24582378 26601412 28899964 31536512 34577284
55961C4577284L523080M103303M798338N616345O570391P690317R014212J0579296
$$ 34577284 38100364 42203667 47002005 52618350 59188741 66879058 75893270 86472566
55953H6472566J2429655J4615797J7165436K0057778K3223513K6511917K9568079
$$ 86472566 98902221 113518018 130683454 150741232 173964745 200476662 230044741
55946B30044741L1705130L1953872K9362837K3420061J4386073L378417p876415
$$ 230044741 261749871 293703743 323066580 346486641 360872714 364251131 356374716
55939C56374716j7592986k4547698k8414791k9633521k8982011k7202125k4848504
$$ 356374716 338781730 314234032 285819241 256185720 227203709 200001584 175153080
55932A75153080k2289410j9740905j7308401j5042365j2978440j1139587r527246
$$ 175153080 152863670 133122765 115814364 100771999 87793559 76653972 67126726
55925F7126726q129813o934681n925045n074880m357457l754263l249946k825731
$$ 67126726 58996913 52062232 46137187 41062307 36704850 32950587 29700641 26874910
55917B6874910k464688k157867j898990j678056j485744j319040j176788j053844
$$ 26874910 24410222 22252355 20353365 18675309 17189565 15870525 14693737 13639893
55909A3639893r44822q49385p68425o98505o35014n77723n28354m85442m46174
$$ 13639893 12695071 11845686 11077261 10378756 9743742 9166019 8637665 8152223 7706049
55900G706049m10856l81039l55174l30265l06181k84587k65204k46587k29225
$$ 7706049 7295193 6914154 6558980 6228715 5922534 5637947 5372743 5126156 4896931
55891D896931k14441k01431j88414j75695j64791j55500j46361j37181j28834
$$ 4896931 4682490 4481059 4292645 4116950 3952159 3796659 3650298 3513117 3384283
55882C384283j21433j14668j08929j04248r9283r3134q7107q2902q0275p8058
$$ 3384283 3262850 3148182 3039253 2935005 2835722 2742588 2655481 2572579 2492304 2414246
55872B414246p6211p4991p3383p0237o6084o2159n8584n4944n1686m9445m7930
$$ 2414246 2338035 2263044 2189661 2119424 2053340 1991181 1932597 1877653 1825967 1776522 1728592
55861A728592m6628m5670m4920m3405m0867l8472l6954l5391l3067l0914k9777
$$ 1728592 1681964 1636294 1591374 1547969 1507102 1468630 1431676 1396285 1363218 1332304 1302527
55850A302527k8783k7059k5579k5607k6484k6702k6140k5621k5243k4666k4201
$$ 1302527 1273744 1246685 1221106 1195499 1169015 1142313 1116173 1090552 1065309 1040643 1016442
55839A016442k4141k3844k2751k1461k0624j9794j8439j7033j6030j4920j3486
$$ 1016442 992301 968457 945706 924245 903621 883827 865388 848355 832325 817405 803919
55828H03919j2634j2716j2439j0866r118q587q782q601q428r184j0405j1149j1701
$$ 803919 791285 778569 766130 755264 746146 737559 728777 720176 711748 702564 692159 681010 669309
55815F69309j2555j2772j1437r741r489j0122r488p210n163m664m996m867l798
$$ 669309 656754 643982 632545 622804 613315 603193 593705 586495 581332 576668 571672 566805 563007
55802E63007j997p7J122J437J767K688L391L013K139J649J006n50k000j655J57
$$ 563007 561010 560933 562055 563492 565259 567947 571338 574351 576490 578139 579145 578595 576595 574940 575097
55787E75097J363P73j238m219p864j0967j2185j1927j1751j1781j0528p354l358
$$ 575097 576460 577233 575995 571776 563912 552945 540760 528833 517082 505301 494773 487419 484061
55774D84061M60M083P042P844N693J497l379q236j2372j4653j4582j2997j1053
$$ 484061 484521 488604 495646 503490 509183 510680 507301 499065 486693 472040 457458 444461 433408
55761D33408r287p952p349p348p408p501q222r641j0909j1401j1412j1277j0621
$$ 433408 424121 416169 408820 401472 394064 386563 378341 368700 357791 346390 334978 323701 313080
55748C13080r113p277n859m846l695k249q99j7L55K83k72j397k896m133m493m097
$$ 313080 303967 296690 290831 285985 282290 280041 279142 279125 279480 279763 279491 278094 275198 271065 266572 262475
55732B62475l678l525l080j979r05p66j450k175k718l384m034m066l367k479j752
$$ 262475 258797 255272 252192 250213 249308 248542 247092 244917 242199 238815 234781 230715 227348 224869 223117
55717B23117r98q6Q20J663K570L413L746L314K213O48j091k531l263l280k774
$$ 223117 222119 222033 222853 224516 227086 230499 234245 237559 239772 240420 239329 236798 233535 230255 227481
55702B27481j874r08n23j085k217l370m443n417n909n641m942m163l178k035j444
$$ 227481 225607 224699 224176 223091 220874 217504 213061 207644 201735 196094 191152 186989 183811 181776 180332
55687A80332j748k067j460l95M0q4K21J172K035K468K747K675J693J85n62j17
$$ 180332 178584 176517 175057 174662 174702 174618 174839 176011 178046 180514 183261 185936 187629 187814 187252 187135
55671A87135M69J77p49j495j800j871j810j609j330j064q67q18q10m84K21Q16
$$ 187135 187604 187781 187032 185537 183737 181866 180056 178447 177117 176053 175186 174368 173558 173074 173295 174111
55655A74111R95J250K040K860K954K553K366K251J536M11j71K0K47L6m86j429
$$ 174111 175106 176356 178396 181256 184210 186763 189129 191380 192916 193327 193156 193176 193423 193459 192973 191544
55639A91544l106n050o173o153n673n185m529l829l554l554l175k536k400k629
$$ 191544 188438 183388 177215 171062 165389 160204 155675 151846 148292 144738 141563 139027 136627 133998
55625A33998k123p09L89M31J78L18K79n25j418j510j050q23r56j137j287j303
$$ 133998 131875 131166 131555 131986 132164 132482 132761 132236 130818 129308 128258 127435 126479 125342 124055 122752
55609A22752q45j62k49j462k745l033k618k329k204j933j806k137k361j784p85
$$ 122752 121907 121745 121496 120034 117289 114256 111638 109309 107105 105172 103366 101229 98868 97084 96299
55594I6299k06p5J26L49K53J84P27J534J675J164J003J690K599L043L042K933
$$ 96299 96093 96018 96144 96493 96746 96930 97657 99191 100866 102030 103033 104723 107322 110365 113407 116340
55578A16340K948L412M662O481Q057Q775Q634P845O504M767K903J040q58k599
$$ 116340 119288 122700 127362 133843 141900 150675 159309 167154 173658 178425 181328 182368 181510 178911
55564A78911l758m176m177m171m295m487m738n074n477n798n754n130m117l304
$$ 178911 175153 170977 166800 162629 158334 153847 149109 144035 138558 132760 127006 121876 117759 114455
55550A14455l125l387l511l185k565j932j314n40L79J002P66l02j379j623j019
$$ 114455 111330 107943 104432 101247 98682 96750 95436 94896 95275 96277 97043 96741 95362 93739 92720
55535I2720j28P35J538J943J474M64L5O79J519J418L54p46j166r20m39k37o24
$$ 92720 92592 93327 94865 96808 98282 98746 98781 99460 100979 102397 102751 102005 100839 99919 99480 99243 98619
55518I8619j362j864j929j991k340k571k209j494j007q83q76r21j072j107p31
$$ 98619 97257 95393 93464 91473 89133 86562 84353 82859 81852 80969 80093 79172 78100 76993 76262
55503G6262j01K95K27j02m48p14q74j002j203j371j209p13l14k62j88K96Q72Q64
$$ 76262 76161 76456 76683 76581 76133 75419 74545 73543 72340 70969 69760 69047 68733 68471 68283 68579 69451 70315
55485G0315J56o98j149j026l97M78J053Q28j01r62r79o2J034J280L52r23j431
$$ 70315 70471 69773 68624 67598 67201 67679 68732 69560 69459 68497 67518 67456 68490 69770 70122 69199 67768
55468F7768j088q33j181j443q11K97P61K69l43k61M09R82J011N63j2m09n71o01
$$ 67768 66680 65847 64666 63223 62412 62709 63470 63739 63396 63135 63544 64526 65537 66100 66088 65679 65108 64507
55450F4507n42l70j92j44q0L10R14J151P33R6j87j09n8k45o23j056j316j156o80
$$ 64507 63965 63595 63403 63259 63179 63489 64403 65554 66287 66383 66196 66087 66029 65784 65161 64105 62789 61633 60953
55431F0953l17k96m25n72q56j096p08M54J645K142K081J945J717J196P27Q00J221
$$ 60953 60636 60340 59915 59343 58487 57391 56683 57137 58782 60924 63005 64950 66667 67863 68590 69390 70611
55414G0611J349J022N93K14k69p85r43n65J37Q21J157R00J98m26p33j092j699
$$ 70611 71960 72982 73575 73789 73520 72735 71792 71227 71364 72185 73342 74242 74440 74014 73281 72189 70490
55397G0490j970j304o8Q43J113J008N84j88q17p07j58m0m86p00k10M85P02L58
$$ 70490 68520 67216 67148 67991 69104 70112 70696 70508 69691 68984 68826 68786 68300 67600 67390 67875 68577 68935
55379F8935j69m26o8P38J112L65r24j477r76k93k2K22O91P76M0q66j081p97p69
$$ 68935 68766 68340 68272 69010 70122 70487 69563 68086 67110 66817 66795 67017 67708 68484 68524 67658 66577 65780 65011
55360F5011j006q13JO87N29k63p85l99O29J411J321O50J62J26P2m17j110j494
$$ 65011 64005 63192 63193 63880 64409 64146 63361 62962 63591 65002 66323 66973 67135 67261 67333 66916 65806 64312
55342F4312j421j080n95K7O63J077J139Q94M78O1j53j08K0o6m43p76n40L74J273
$$ 64312 62891 61811 61216 61243 61906 62983 64122 65016 65494 65555 65402 65294 65314 65248 64805 64029 63489 63863 65136
55323F5136J214Q3j139j405p10J20M16J47l81p71o89j84K28J41j50j08K12L46
$$ 65136 66350 66433 65294 63889 63179 63299 63715 63862 63481 62710 62021 61837 62065 62206 62056 61948 62160 62506
55305F2506K85M38P70O58j08q93j039o69k97q4J82N79Q96Q89N80L14N26J238J879
$$ 62506 62791 63229 63999 64657 64549 63656 62617 61948 61651 61567 61749 62328 63224 64113 64693 65007 65533 66771 68650
55286F8650J877J307O55O5o64j451j890j838j573j250p15L5O83R49P32n1j261
$$ 68650 70527 71834 72489 72554 71890 70439 68549 66711 65138 63888 63173 63208 63891 64840 65572 65521 64260
55269F4260k153j927p98J13J93n1J8K19J13j64j26L01P54Q88N76q4o52o40q3M29
$$ 64260 62107 60180 59382 59495 59688 59637 59655 59874 59987 59823 59697 59998 60752 61640 62216 62132 61480 60840 60757 61186
55249F1186N43N03N79O50N98N93O43M15j34m88l74k35l98l69L35J182J269O61
$$ 61186 61729 62232 62811 63461 64059 64652 65295 65710 65576 65088 64714 64479 64081 63712 64047 65229 66498 67159
55231F7159J93J31o3o15r20m85K84O22L76K7m7K1m9k15j69J48L39J13j90LO64
$$ 67159 67352 67483 67420 66805 65885 65400 65684 66306 66682 66709 66662 66683 66634 66419 66250 66398 66737 66850 66660 66663 67327
55210F7327J232J446J532J489R06k02j054j065o00l00j65J06L82L69K52L61N00
$$ 67327 68559 70005 71537 73026 73932 73730 72676 71611 71011 70711 70546 70652 71034 71403 71655 72016 72516
55193G2516K62k26n45p06r27r93o06j56k95p93p51K8P92J055J164J338J162M68
$$ 72516 72778 72552 72007 71301 70374 69381 68775 68619 68324 67531 66780 66808 67600 68655 69819 71157 72319 72787
55175G2787o5Q0L19j81j172j579r94j30K11Q1O0M01P62P26L55J34L22N37J97o46
$$ 72787 72722 72802 73121 72940 71768 70189 69195 69065 69276 69357 69417 69818 70580 71306 71661 71795 72117 72654 72851 72205
55155G2205j270j169o46l08k49j15K12M31L01Nj71j93j72p5J73M17L52n3m12l05
$$ 72205 70935 69766 69120 68812 68563 68448 68660 69091 69392 69397 69226 69033 68861 68786 68959 69376 69728 69675 69263 68958
55135F8958L08J078J525J263L19o43p46J45J100J162M80j42m77r67j575j521m55
$$ 68958 69266 70344 71869 73132 73451 72808 72062 72207 73307 74469 74949 74807 74330 73363 71788 70267 69812
55118F9812Q34J381J048K37p38j426j110K49J455J356L64k42j86l07r09j189n91
$$ 69812 70646 72027 73075 73312 72574 71148 70038 70287 71742 73098 73462 73220 73034 72727 71818 70629 70038
55101G0038K55M58J8m39n58m05r5L61R60J629K105K010J380R31J185J551J033
$$ 70038 70293 70751 70769 70330 69772 69367 69272 69633 70593 72222 74327 76337 77717 78648 79833 81384 82417
55084H2417j72q00m10p0o59j525j596r24k64K41Q32J120M98o37j175q02k95j43
$$ 82417 82245 81445 81035 80965 80306 78781 77185 76261 75997 76238 77070 78190 78688 78051 76876 76074 75779 75636
55066G5636J17Q91J636J546O37k88n25j9O51P62O7q85j372j376j430j648j489
$$ 75636 75753 76644 78280 79826 80463 80175 79650 79631 80282 81044 81111 80226 78854 77478 76048 74400 72911
55049G2911p13P4K41ml0L04O49Q53J064J255J193Q93O54N49K72l22q31p37n4O70
$$ 72911 72198 72272 72513 72509 72479 72783 73432 74285 75349 76604 77797 78690 79344 79893 80165 79843 79012 78275 78221 78891
55029G8891R40P88O72R33J410J533R05k42j200j415r66m44l72p35j049r04l97
$$ 78891 79831 80619 81291 82224 83634 85167 86072 85830 84630 83215 82249 81805 81433 80698 79649 78745 78348
55012G8348R0M01O42O68N9j098j803j182K63J126Q96N39R75J684J544N09l64l94
$$ 78348 78438 78839 79481 80149 80208 79110 77307 76125 76388 77514 78410 78949 79924 81608 83152 83661 83297 82903
54994H2903O7N06R10J231J036K49l18Q7R94J266O31p2k25k02m80o55qJ326K310
$$ 82903 82970 83476 84386 85617 86653 86902 86584 86671 87665 88931 89562 89490 89265 89063 88583 87928 87920 89246 91556
54975I1556K212J323M33q3l66n41n00k48j89o60j319j353n06M40N94J19o0L99
$$ 91556 93768 95091 95524 95441 95075 94534 94034 93786 93597 92937 91618 90265 89759 90199 90793 90912 90852 91251
54957I1251Q41O84K28k4k10o35q62j86J060J647J042J50j2L29K61m11j042j216
$$ 91251 92092 92776 93004 92980 92770 92135 91273 91087 92147 93794 94836 94986 94974 95303 95564 95153 94111 92895
54939I2895j175j155r62m70k0L0j32JN78J271J776K161K613L012L002K494J999
$$ 92895 91720 90565 89603 89133 89113 89143 89011 89012 89590 90861 92637 94798 97411 100423 103425 105919 107918
54922A07918K222L276M510N270N668O309P339Q100P836O501M660K817J009r34
$$ 107918 110140 113416 117926 123196 128864 135173 142512 150612 158448 164949 169609 172426 173435 172501
54908A72501k933m539n373n553n607n839o016n775n160m462l736k881k078j668
$$ 172501 169568 165029 159656 154103 148496 142657 136641 130866 125706 121244 117508 114627 112549 110881
54894A10881j554j251o64k78l54m62j47L20L51j13n35m07M08J714L044L938M421
$$ 110881 109327 108076 107412 107134 106780 106318 106171 106491 106842 106729 106194 105787 106195 107909 110953 114891 119312
54877A19312M984N749O148N817N339N427N790N655M983M262L249J123j999m810
$$ 119312 124296 130045 136193 142010 147349 152776 158566 164221 169204 173466 176715 177838 175839 171029
54863A71029o438p251p634p071n315l522l084l842m458m323m007l989l949l585
$$ 171029 164591 157340 149706 142635 137320 133798 130714 126872 122414 118091 114084 110095 106146 102561
54849A02561l171k960k611j686m14N07O68K89j24k98l80o26j012j258j275j260
$$ 102561 99390 96430 93819 92133 91719 92226 92894 93183 93059 92761 92381 91755 90743 89485 88210 86950
54833H6950j228p82K49J270J519J050N90N26N33K61j50l41j05N96J501J934J325
$$ 86950 85722 84940 85189 86459 87978 89028 89618 90144 90677 90938 90788 90447 90342 90938 92439 94373 95698
54816I5698J07n47j45M96M18j99n13l25k14m94q08q43p66p76p17m36j47k6J95
$$ 95698 95805 95258 95113 95609 96027 95828 95315 94990 94776 94282 93474 92631 91865 91089 90372 89936 89789 89763 89958
54797H9958Q34J620J884J380N33j28m79o08m73m0M21M66Om61k19R59K474L297
$$ 89958 90792 92412 94296 95676 96209 96081 95602 94994 94521 94481 94902 95368 95374 94913 94694 95653 98127 101424
54779A01424K859J632O30M29P90J216J495J616J594J692K431L894N287N808N753
$$ 101424 104283 105915 106545 106974 107764 108980 110475 112091 113685 115377 117808 121702 126989 132797 138550
54764A38550O092O958P364O667N506M767M238L051J115p41k020l200m833o558
$$ 138550 144642 151600 158964 165631 171137 175904 180142 183193 184308 183567 181547 178347 173514 166956
54750A66956p448p123o136n286m837m545m232l976l695k967j623l34j6p00j479
$$ 166956 159508 152385 146249 140963 136126 131581 127349 123373 119678 116711 115088 114754 114738 114038 112559
54735A12559j718j689j774j666q84L60J443K220K980L712M097M168M381M891N319
$$ 112559 110841 109152 107378 105712 104828 105188 106631 108851 111831 115543 119640 123808 128189 133080 138399
54720A38399N391N336N418N493N231M543L503K162O16r10k221l293m194m997n780
$$ 138399 143790 149126 154544 160037 165268 169811 173314 175476 176092 175182 172961 169668 165474 160477 154697
54705A54697o537p023o860n943m594l307k423j965j686j332r36p94r57j066r52
$$ 154697 148160 141137 134277 128334 123740 120433 118010 116045 114359 113027 112091 111297 110340 109274 108322
54690A08322j015j596k189j995j112m45m49o40n96o04r44j203q95k98l6j40j12
$$ 108322 107307 105711 103522 101527 100415 99970 99521 98881 98285 97681 96737 95534 94639 94341 94305 94165 94053
54673I4053K17M61K85j97o59q38o08j13K37J26k71n32n11m30m37m26k60P9N46
$$ 94053 94270 94731 95016 94819 94160 93322 92714 92601 92838 92964 92693 92161 91650 91220 90783 90357 90097 90176 90722
54654I0722J031J231Q97K57m3L77J194J731J680J310J066J070J057P15Q5m50n18
$$ 90722 91753 92984 93881 94138 94095 94472 95666 97397 99077 100387 101453 102523 103580 104295 104380 103930 103412
54637A03412j59J74N1n12j046j077n90oK73K10pk60n15p03p81q31q50n78J10P47
$$ 103412 103253 103427 103478 102966 101920 100843 100253 100247 100520 100730 100723 100463 99948 99245 98464 97633 96783 96205 96315 97062
54617I7062O50j34p53o22r7K15L22N38P06M58O4K24R74J458J098L76P8K84N34
$$ 97062 97712 97578 96825 96203 96106 96321 96643 97181 97887 98345 98409 98633 99607 101065 102163 102539 102617 102901 103435
54598A03435N67M02n8q08j322r54J20R42Q66J48o19j128j215p09J64P08N62K75
$$ 103435 104002 104404 104346 103538 102216 101262 101382 102324 103190 103338 102719 101591 100376 99667 99831 100539 101101 101376
54580A01376N17J085J280R64N63J51n73j372j464o76J29K37KJ19N52Q23Q56R30
$$ 101376 101893 102978 104258 105222 105785 105936 105363 103991 102527 101851 101980 102217 102219 102338 102890 103713 104569 105499
54562A05499J027Q83N58L90M73O03O24M94J35l83p64q90j060j437j586j071j56
$$ 105499 106526 107409 107967 108357 108830 109433 110057 110551 110686 110303 109539 108649 107589 106152 104566 103495 103339
54545A03339N75R79J163R89M92M08J251K170J819M02m08K29J246J396R38Q83J370
$$ 103339 103914 104893 106056 107045 107537 107945 109196 111366 113185 113587 113179 113408 114654 116050 116988 117871 119241
54528A19241J734J660J418J139O08k71j263k027k326k128j687j276p86R7J212
$$ 119241 120975 122635 124053 125192 125800 125529 124266 122239 119913 117785 116098 114822 114036 114133 115345
54513A15345J870J645Q23j04q37j085o35J10L00k48p50n87q9K28M51P21O45O1
$$ 115345 117215 118860 119683 119579 118742 117657 117022 117132 117432 117184 116434 115847 115758 115986 116437 117158 117803 117864
54495A17864l11J24P46O27R7K67J273K055J919J239N84M9k80j21M66R36R47O57
$$ 117864 117553 117677 118423 119050 119147 119414 120687 122742 124661 125900 126484 126533 126253 126132 126598 127534 128481 129138
54477A29138L14J4L7O40J471J783J458J152J217J193O66j6k85r8K70O42P90L77
$$ 129138 129452 129466 129503 130143 131614 133397 134855 136007 137224 138417 139083 139067 138782 138684 138954 139596 140386 140763
54459A40763m77j021p71k14j46n76q15m76J67P18J044J119Q32J48o98j284j270
$$ 140763 140286 139265 138494 138280 138134 137558 136743 136267 136434 137152 138196 139315 140147 140295 139597 138313 137043
54442A37043p27j90k03o36p84k77L49K86m79j174j208q02n61p22j006j071q88
$$ 137043 136316 136126 135923 135287 134503 134226 134575 134861 134382 133208 132000 131198 130637 129915 128909 127838 126950
54425A26950o14k76K10P12Q27M29L9L17J179J793J612R97O04M80K03k80m67m8
$$ 126950 126336 126060 126270 126982 127809 128238 128277 128594 129773 131566 133178 134175 134779 135259 135462 135182 134715 134667
54407A34667N80P98N21J73L0p0k89m45l28j07n7MN05J325J719J267M55Ql3p5j91
$$ 134667 135247 136045 136566 136739 136769 136699 136410 135965 135637 135530 135473 135477 135982 137307 139026 140293 140748 140756 140723 140648 140457
54386A40457j14J25J67j3l1J84J82k77p10n44O9M70L68R2M4K22M25N76P05O95
$$ 140457 140343 140468 140635 140622 140591 140775 140957 140680 139970 139426 139495 139965 140333 140425 140469 140691 141116 141692 142397 143092
54366A43092L02m73j189j323q60l77l36n35l96K70J013J240P68o3o92p46l63k0
$$ 143092 143394 142921 141732 140409 139549 139172 138836 138301 137905 138175 139188 140428 141196 141133 140441 139695 139332 139312
54348A39312k4k38m62q43j583k382k550j742l55Q12J183P89K03J0J32r1r32j718
$$ 139312 139288 139050 138588 137745 136162 133780 131230 129488 129133 129945 131128 131917 132120 132130 132262 132171 131239 129521
54330A29521j634q18r9J91M06O52M60l07q87m53Q21J892J858O78q60j712j329
$$ 129521 127887 127069 126970 127161 127567 128219 128679 128372 127485 127032 127853 129745 131603 132281 131421 129709 128380
54313A28380r9J124J848K079J798R73J06J3O94J117N58l92p39m70l16n28p38q43
$$ 128380 128281 129405 131253 133332 135130 136103 136209 136222 136916 138033 138591 138199 137460 136990 136674 136146 135408 134565
54295A34565j153j557j403m93L86L89l48r79j025p14l95j18J04M2m08q69q30l41
$$ 134565 133412 131855 130452 129959 130345 130734 130386 129407 128382 127668 127273 127155 127259 127301 126893 126024 125194 124853
54277A24853Nj03k61l7L05K67j2N2M22M14j50m77N0R12J215R35P28Q17Q38O76
$$ 124853 124858 124755 124494 124457 124762 125029 125017 125069 125491 125905 125755 125278 125328 126240 127455 128390 129118 129935 130773 131449
54257A31449O40P23L85n15j202q17M44J522J683J191P90Q25R66O67k23j288j932
$$ 131449 132089 132812 133197 132682 131480 130663 131107 132629 134312 135503 136293 137118 138084 138751 138528 137240 135308
54240A35308j893j412r35o95o45o83q40j173j564j732j467q23q6L40J50n74j214
$$ 135308 133415 132003 131068 130373 129728 129045 128205 127032 125468 123736 122269 121446 121360 121700 121850 121276 120062
54223A20062j066j51O87P24K30L0M04Q17P28K45j74l13k97l26m62n26k45L45P72
$$ 120062 118996 118845 119532 120256 120486 120516 120920 121737 122465 122710 122536 122223 121926 121600 121138 120612 120367 120712 121484
54204A21484O76L65L92P03O56J4o92q84n52L9P17J189J035K51n76r78j117j280
$$ 121484 122160 122525 122917 123620 124276 124290 123598 122714 122162 122201 122918 124107 125142 125393 124817 123839 122722 121442
54186A21442j251o91L00J293J960K021J217k06j255j073R6J191J408P12l45r05
$$ 121442 120191 119500 119800 121093 123053 125074 126291 126085 124830 123757 123853 125044 126452 127164 126819 125914
54170A25914l78P89J261L27j115j756j523j251j076m18N45P30j25p56r6J097J222
$$ 125914 125536 126325 127586 127913 126798 125042 123519 122268 121192 120774 121319 122049 121924 121168 121072 122169 123391
54153A23391j4j276j226J35J726K518K264J433O28Q8k44l74l07k88n79r64q83
$$ 123391 123377 122101 120875 121010 122736 125254 127518 128951 129579 129667 129423 129049 128742 128454 127875 126911 126028
54136A26028k43L34K64l36q80q90k18Q35J493J097N3m17J94Q77N03n19p80J11
$$ 126028 125785 126119 126383 126047 125167 124277 124059 124894 126387 127484 127537 127120 127314 128191 128694 128175 127395 127506
54118A27506J044R70J60m44m81k71p7J44M01N01K97j44o29r46r18n53r0J88K51
$$ 127506 128550 129520 129680 129236 128755 128484 128407 128551 128952 129453 129750 129606 128977 128031 127113 126560 126470 126658 126909
54099A26909K75L81N08N69N29L49km11o68p16p23q31q96o50%Q86J655J881J311
$$ 126909 127184 127565 128073 128642 129171 129520 129518 129107 128439 127723 127000 126169 125273 124623 124623 125509 127164 129045 130356
54080A30356K66l98j28O43R85O24J61J63M37M91K36q2l54o01p64p94q45j000j001
$$ 130356 130622 130224 130096 130739 131724 132348 132509 132672 133109 133600 133836 133754 133400 132799 132035 131241 130396 129396 128395
54061A28395n59J39N85N33J46l26p09q22n69j05L58P93J166J196P71M28Q91K077
$$ 128395 127836 127975 128560 129093 129239 128913 128204 127382 126813 126708 127066 127859 129025 130221 130992 131420 132311 134388
54043A34388L080L209K622J801J027N27O58J395K008J744P82Q3L11J182J849J704
$$ 134388 137468 140677 143299 145100 146127 146654 147312 148707 150715 152459 153241 153324 153635 154817 156666 158370
54027A58370P83l94j226j347p44K67J127J289O34l90j206j608j693j503j077p10
$$ 158370 159153 158759 157533 156186 155442 155709 156836 158125 158759 158369 157163 155555 153862 152359 151282 150572
54011A50572p25r59r90q39r71j415j502q07J33N45N01O77J316J947K101J802J311
$$ 150572 149847 148888 147898 147059 146088 144673 143171 142364 142497 143042 143543 144220 145536 147483 149584 151386 152697
53994A52697Q49O54R13J489J948K003J777J620J884K804M341O081P595Q881J0145
$$ 152697 153546 154200 155113 156602 158550 160553 162330 163950 165834 168638 172979 179060 186655 195536 205681
53979B05681J1027J0513Q007M182M27k491m774o671p829p804o977o342o397o567
$$ 205681 216708 227221 235228 239410 239837 237346 232572 225901 218072 210268 203291 196949 190552 183985
53965A83985n963m492k999k340k527k793k398j348l49q6n22r91r99o92m27j39
$$ 183985 178022 173530 170531 168191 165664 162871 160473 159125 158776 158690 158168 157177 156178 155486 155059 154920
53949A54920M53J237J724J745J634J606J412R13N49Q02J507K173K766L608M593
$$ 154920 155373 156610 158334 160079 161713 163319 164731 165644 166193 166995 168502 170675 173441 177049 181642
53934A81642N170N123M809M417L631K372J352J263J758J815J007j47j005j403
$$ 181642 186812 191935 196744 201161 204792 207164 208516 209779 211537 213352 214359 214212 213207 211804
53920B11804j385r44l14o2n17j413k265k819k879k186q28M34Q03K66n74j263j678
$$ 211804 210419 209475 209161 209099 208582 207169 204904 202085 199206 197020 196192 196626 197429 197695 197121 195858 194180
53903A94180j718j390j158j530k267k590k294j930j825j638j170q27q34o98j66
$$ 194180 192462 191072 189914 188384 186117 183527 181233 179303 177478 175840 174670 173843 173009 172311 172145
53888A72145j5j009k451k802j654j68M47J40m67r41j144j072r54j099j422j455
$$ 172145 172130 171121 168670 165868 164214 164046 164493 164633 164166 163225 162081 161009 160055 158956 157534 156079
53872A56079j029m43J07P84J531J749J016k43j169j299p87j39N1n21j404j687
$$ 156079 155050 154607 154714 155498 157029 158778 159794 159551 158382 157083 156296 156157 156208 155687 154283 152596
53856A52596j087l28j24k51j86j04n00j096j073l59K21K45K76P91J332J273Q43
$$ 152596 151509 151181 151057 150806 150620 150516 150016 148920 147847 147488 147709 147954 148230 149021 150353 151626 152469
53839A52469P08R32J077J033J095J241J143Q88J002J543J864J606J366J863K912
$$ 152469 153177 154109 155186 156219 157314 158555 159698 160586 161588 163131 164995 166601 167967 169830 172742
53824A72742L754M103M281M538M846N338O357Q018J0131J2499J4740J5896J4927
$$ 172742 176496 180599 184880 189418 194264 199602 205959 213977 224108 236607 251347 267243 282170
53811B82170J1732P105J705m088r201j1933j1733j0119q979q527p809o583n538
$$ 282170 293902 301007 302712 298624 289423 277490 265757 255638 246659 238132 230323 223740 218202
53798B18202m923m253l395k874k812k569j801j049q14p72m65j14j50m11m41k54
$$ 218202 213279 209026 205631 202757 199945 197376 195575 194526 193712 192940 192475 192361 192211 191800 191359 191105
53782A91105j78j49J62O08N38l35j436j943j609p83J97J305K476L361L749M030
$$ 191105 190927 190778 190940 191548 192086 191751 190315 188372 186763 185980 186177 187482 189958 193319 197068 201098
53766B01098M691N390N207M009K834K372J805N7k363l845l842l398l478l920m291
$$ 201098 205789 211179 216386 220395 223229 225601 227406 227463 225100 221255 217413 214015 210537 206617 202326
53751B02326m699n142n002l926k512j564j082o56k68j48j89q3K72Q36J592K249
$$ 202326 197627 192485 187483 183557 181045 179481 178399 177743 177475 177327 177138 177055 177327 178163 179755 182004
53735A82004K337J888J549J595J518J001O33R06J229Q08qj97M43J155J419J379
$$ 182004 184341 186229 187778 189373 190891 191892 192525 193431 194660 195468 195460 195263 195706 196861 198280 199659
53719A99659J230J004Q95J111J386J372J331J779K617L290L708M195M612M480
$$ 199659 200889 201893 202788 203899 205285 206657 207988 209767 212384 215674 219382 223577 228189 232669
53705B32669L959L809M136M091L099J693P47M86O33J004J557K180K775L250L380
$$ 232669 236628 240437 244573 248664 251763 253456 254203 254689 255322 256326 257883 260063 262838 266088 269468
53690B69468L032K541K368K364J980J227P74Q41P83J21o33p68m35l49p42j194
$$ 269468 272500 275041 277409 279773 281753 282980 283754 284595 285378 285499 284866 284098 283663 283314 282572 281378
53674B81378j336j244j127r84p13l30j07l43r39j356j220q99j044j633j962j633
$$ 281378 280042 278798 277671 276687 275974 275644 275537 275194 274255 272899 271679 270780 269736 268103 266141 264508
53658B64508j043p76q95j015p84j49N17N65j87r17n79P27J802J883J425J079P80
$$ 264508 263465 262689 261794 260779 259995 259846 260363 260928 260741 259824 259245 259972 261774 263657 265082 266161 266941
53641B66941L51K07P48J502J665J216Q32Q70J152J515K010K511K697K512K284
$$ 266941 267292 267499 268247 269749 271414 272630 273462 274332 275484 276999 279009 281520 284217 286729 289013
53626B89013K304K527K693K655K599K958L889M811M920M286L871M186M598M429
$$ 289013 291317 293844 296537 299192 301791 304749 308638 313449 318369 322655 326526 330712 335310 339739
53612C39739M085M281M690M384L382K710K881L312L474L643M081M272L627K452
$$ 339739 343824 348105 352795 357179 360561 363271 366152 369464 372938 376581 380662 384934 388561 391013
53598C91013J521J040N91l6n37o28m14j55K6P8j11n76j110j409j425j465j844
$$ 391013 392534 393574 394165 394129 393592 392964 392550 392395 392421 392499 392388 391812 390702 389293 387868 386403 384559
53581C84559k422k702k391j803j472j558j800k020k335k798l124k932k182j190
$$ 384559 382137 379435 377044 375241 373769 372211 370411 368391 366056 363258 360134 357202 355020 353830
53567C53830l14K63N24N51M94M73N11N89P62J087J439J504J111N86N25J124J859
$$ 353830 353516 353779 354303 354854 355348 355821 356332 356921 357683 358770 360209 361713 362824 363410 363935 365059 366918
53550C66918K055J766J757K583L933N081N805O548P740R155J0100J0124R469Q764
$$ 366918 368973 370739 372496 375079 379012 384093 389898 396446 404186 413341 423441 433565 443034 451798
53536D51798Q374Q137P779P394P327P669Q223Q888R801J0925J1907J2504J2914
$$ 451798 460172 468309 476088 483482 490809 498478 506701 515589 525390 536315 548222 560726 573640
53523E73640J3426J3978J4399J4872J5821J7330J9031K0612K2094K3562K4874
$$ 573640 587066 601044 615443 630315 646136 663466 682497 703109 725203 748765 773639
53512G73639K5792K6318K6728K7312K8085K8751K9017K8943K8872K8950K8868
$$ 773639 799431 825749 852477 879789 907874 936625 965642 994585 1023457 1052407 1081275
53501A081275K8277K7350K6647K6499K6722K6968K7086K7012K6611K5877K5134
$$ 1081275 1109552 1136902 1163549 1190048 1216770 1243738 1270824 1297836 1324447 1350324 1375458
53490A375458K4691K4266K3191K1336J9643J9218K0024K0819K0629J9771J9196
$$ 1375458 1400149 1424415 1447606 1468942 1488585 1507803 1527827 1548646 1569275 1589046 1608242
53479A608242J9129J8850J7662J5546J2939J0279P855N588K990k87l829o849r207
$$ 1608242 1627371 1646221 1663883 1679429 1692368 1702647 1710502 1716090 1719080 1718793 1714964 1708115 1698908
53466A698908j1428j3648j5263j5939j6238j6745j7332j7904j9157k1571k4161
$$ 1698908 1687480 1673832 1658569 1642630 1626392 1609647 1592315 1574411 1555254 1533683 1509522
53455A509522k5428k5417k5617k6727k7631k7060k5275k3509k2424k1866k1530
$$ 1509522 1484094 1458677 1433060 1406333 1378702 1351642 1326367 1302858 1280434 1258568 1237038
53444A237038k1194k0486j9122j7246j5171j2956j0655q728p621p037o133m470
$$ 1237038 1215844 1195358 1176236 1158990 1143819 1130863 1120208 1111480 1103859 1096822 1090689 1086219
53432A086219k318n3K298M753P088R028J0555J1868J3201J4745J6560J8457K0166
$$ 1086219 1083901 1083848 1086146 1090899 1097987 1107015 1117570 1129438 1142639 1157384 1173944 1192401 1212567
53419A212567K1605K2816K3700K4136K4502K5603K7824L0589L2983L4772L6485
$$ 1212567 1234172 1256988 1280688 1304824 1329326 1354929 1382753 1413342 1446325 1481097 1517582
53408A517582L8628M1174M3762M6048M7881M9425N1247N3902N7274O0559O3003
$$ 1517582 1556210 1597384 1641146 1687194 1735075 1784500 1835747 1889649 1946923 2007482 2070485
53397B070485O4549O5638O6651O7672O8537O8948O8741O8181O7678O7035O5380
$$ 2070485 2135034 2200672 2267323 2334995 2403532 2472480 2541221 2609402 2677080 2744115 2809495
53386B809495O2291N8601N5531N3223N0789M7693M4338M1138L7771L3742K9190
$$ 2809495 2871786 2930387 2985918 3039141 3089930 3137623 3181961 3223099 3260870 3294612 3323802
53375C323802K4601K0148J5652J0937N792k56p672j6497k6364l6665m6440n4542
$$ 3323802 3348403 3368551 3384203 3395140 3400932 3400676 3393004 3376507 3350143 3313478 3267038 3212496
53363C212496o0429o4593o7775o9969p0765p0463p0037o9899o9416o7991o6011
$$ 3212496 3152067 3087474 3019699 2949730 2878965 2808502 2738465 2668566 2599150 2531159 2465148
53352B465148o4282o2962o1646o0259n9298n9051n9087n8713n7696n6326n4862
$$ 2465148 2400866 2337904 2276258 2215999 2156701 2097650 2038563 1979850 1922154 1865828 1810966
53341A810966n3113n0706m7587m4177m0935l7908l4816l1443k7912k4579k1825
$$ 1810966 1757853 1707147 1659560 1615383 1574448 1536540 1501724 1470281 1442369 1417790 1395965
53330A395965j9905j8818j8300j7987j7633j7051j6070j4680j3247j2267j1775
$$ 1395965 1376060 1357242 1338942 1320955 1303322 1286271 1270201 1255521 1242274 1230007 1218232
53319A218232j1212r955p898n506l415k022j218m57P28K151L263M081N434P886
$$ 1218232 1207020 1197065 1189167 1183661 1180246 1178224 1177006 1176549 1177277 1179428 1182691 1186772 1192206 1200092
53305A200092J0757J2837J4018J5485J8080K1151K3505K4991K6397K8053K9437
$$ 1200092 1210849 1223686 1237704 1253189 1271269 1292420 1315925 1340916 1367313 1395366 1424803
53294A424803L0193L0774L1693L2704L3194L2936L2038L0560K8692K6991K5728
$$ 1424803 1454996 1485770 1517463 1550167 1583361 1616297 1648335 1678895 1707587 1734578 1760306
53283A760306K4287K1887J8847J6336J4762J3177J0530O865K837j272n475r477
$$ 1760306 1784593 1806480 1825327 1841663 1856425 1869602 1880132 1886997 1889834 1888562 1883087 1873610
53271A873610j2786j5290j7297j9108k1017k3445k6620l0071l2977l5027l6631
$$ 1873610 1860824 1845534 1828237 1809129 1788112 1764667 1738047 1707976 1674999 1639972 1603341
53260A603341l8231l9743m0765m1073m0723l9812l8325l6281l4075l2453l1915
$$ 1603341 1565110 1525367 1484602 1443529 1402806 1362994 1324669 1288388 1254313 1221860 1189945
53249A189945l2105l2185l1887l1800l2354l3033l2995l2169l1165l0328k9412
$$ 1189945 1157840 1125655 1093768 1061968 1029614 996581 963586 931417 900252 869924 840512
53238H40512k8141k6548k4740k2760k0702j8642j6464j4114j2012j0768j0469
$$ 840512 812371 785823 761083 738323 717621 698979 682515 668401 656389 645621 635152
53227F35152j0571j0588j0490j0476j0697j1262j2147j2998j3372j3285j3177
$$ 635152 624581 613993 603503 593027 582330 571068 558921 545923 532551 519266 506089
53216E06089j3277j3287j2781j1641j0028q333p165o972p499q029q205q230q152
$$ 506089 492812 479525 466744 455103 445075 436742 429577 422605 415106 407077 398872 390642 382490
53203C82490p573o380n330n249n980o552o323n544m820m420m199l935l572l226
$$ 382490 374917 368537 363207 357958 351978 345426 339103 333559 328739 324319 320120 316185 312613 309387
53189C09387k999k823k522k035j469r37n24m48r72j951k702k600j729p45j69k2
$$ 309387 306388 303565 301043 299008 297539 296602 296078 295630 294658 292707 290005 287405 285676 284931 284762 284740
53173B84740j06k88m06j99L72P85L56q63j905j953j363j145j523j664j058l83
$$ 284740 284634 284346 283940 283741 284113 284898 285254 284391 282486 280533 279170 278025 276502 274838 273780 273397
53157B73397m89j101j344j179j352j951k102j293j83L86M58M71L12m10j483k227
$$ 273397 272908 271807 270463 269284 267932 265981 263879 262586 262403 262789 263247 263718 264030 263620 262137 259910
53141B59910k439k548k802k809k132r61P1N37N14L12J07j01l30n49p78j061j292
$$ 259910 257471 254923 252121 249312 247180 246219 246290 246827 247341 247653 247760 247659 247329 246780 246002 244941 243649
53124B43649j264j060j112j651k229k175j370l02N16P90L14p87j732j680q63m24
$$ 243649 242385 241325 240213 238562 236333 234158 232788 232486 233002 233792 234106 233319 231587 229907 229044 228620
53108B28620q89j425j088k07R0n92j531j876j484p72j92lk04n81r02j047r19m21
$$ 228620 227731 226306 225218 225011 225101 224509 222978 221102 219618 218846 218654 218651 218447 217866 216964 215917 214998 214577
53090B14577L40R54J050O22n4o98j094j068o33l6M75Q14J020J145J192J011L64
$$ 214577 214917 215871 216921 217543 217489 216791 215697 214629 213996 213960 214435 215249 216269 217414 218606 219617 219981
53073B19981o42j251p99L20R56O40Q4N3L47L66J00j6J46L54M39K85k61j009j335
$$ 219981 219339 218088 217289 217609 218565 219205 219289 219342 219689 220055 220155 220139 220285 220639 221078 221363 221102 220093 218758
53054B18758q74r0L86N48O63N05k27j078j216n97L3K53L55N01L24l66j098j399
$$ 218758 217884 217794 218180 218728 219391 219896 219669 218591 217375 216778 216811 217064 217419 217920 218244 217878 216780 215381
53036B15381j407j504j678j603j187o80l22k9M29R85J143N35l85o63o4N34L32
$$ 215381 213974 212470 210792 209189 208002 207322 207000 206971 207400 208385 209528 210063 209678 209015 208951 209485 209817
53019B09817k97m96k37j22k04J00Q57J293Q63n2p30r06p27m25k12q3K90J003J345
$$ 209817 209520 209024 208787 208665 208461 208561 209418 210711 211574 211522 210792 209886 209159 208734 208522 208439 208729 209732 211077
53000B11077N35r57j644q85K81N86R0j99K45J086J714J698R36j71q90q48l48J62
$$ 211077 211612 210655 209011 208126 208407 208993 209083 208884 209129 210215 211929 213627 214563 214392 213502 212654 212306 212468
52982B12468N42O68K62n28r00l23O39J031P31L98M47P14J071J647K393K901K804
$$ 212468 213010 213678 213940 213412 212512 212189 212828 213859 214590 214988 215435 216149 217220 218867 221260 224161 226965
52965B26965K140J214L69j89n27q79j250j334j014p05q82j468k003k178j915j237
$$ 226965 229105 230319 230688 230499 229972 229093 227843 226509 225495 224790 223908 222440 220437 218259 216344 215107
52949B15107m73k76q75j479j138j9P84P30L76K96K57k09r43j399j359r96m83K3
$$ 215107 214634 214358 213483 212004 210866 210847 211631 212361 212737 213033 213290 213081 212138 210739 209380 208384 207901 207924
52931B07924K14j32p37j026p55k41J32L69O83J039J105P03J07k61l85o18j071
$$ 207924 208138 208006 207269 206243 205488 205247 205379 205748 206431 207470 208575 209278 209385 209124 208739 208121 207050
52914B07050j385j248r08q17r74j012q67r06j287j578j213j53J095J892J846J025
$$ 207050 205665 204417 203509 202692 201718 200706 199839 198933 197646 196068 194855 194702 195797 197689 199535 200560
52898B00560Rm52n8P67J306J176N53n8j65L63J085J258N66m66r25m34M66Q71L60
$$ 200560 200569 200117 200059 200826 202132 203308 203861 203803 203638 204001 205086 206344 206910 206444 205519 205085 205551 206422 206782
52879B06782o90j509j588r96k44J55L5l46n52l20K41Q41J366J881K304K275J587
$$ 206782 206092 204583 202995 201999 201755 201910 201945 201599 201047 200727 200968 201809 203175 205056 207360 209635 211222
52862B11222N71j68l67k63k17m61j119k108k992l258k917k474k208j832j159o71
$$ 211222 211793 211625 211258 210995 210778 210317 209198 207090 204098 200840 197923 195449 193241 191409 190250 189579
52846A89579r05j529j633r34j54Ml11n47o25q50j232j372j076o10k70J0L88P52
$$ 189579 188674 187145 185512 184578 184424 184428 184117 183570 182945 182095 180863 179491 178415 177805 177535 177545 177933 178685
52828A78685Q74P24M18l9o82j265j354q51j82K14M01P33J244J542J392J107J186
$$ 178685 179559 180283 180701 180662 179980 178715 177361 176510 176328 176542 176943 177676 178920 180462 181854 182961 184147
52811A84147J707K285K491K151J280P1j039j558j372q43l83r7O3Ql49q31j113
$$ 184147 185854 188139 190630 192781 194061 194132 193093 191535 190163 189320 188937 188840 188903 188911 188562 187731 186618
52794A86618j072q09n09l82n96r44q19J3Q10O30l62j025p94l10k47l09k6K04k58
$$ 186618 185546 184737 184228 183846 183250 182306 181487 181500 182310 182940 182578 181553 180759 180449 180202 179893 179867 180071 179813
52775A79813j046j181n92k22n52r04n36L09R29J093J041R50Q94R61J076R30M80
$$ 179813 178767 177586 176994 176772 176220 175316 174780 175089 176018 177111 178152 179102 179996 180957 182033 182963 183443
52758A83443J29J14P7l07o18k01P81J398J020m6j041j375q72J95J179J540J355
$$ 183443 183572 183686 183763 183456 182838 182637 183418 184816 185836 185790 184749 183374 182502 182697 183876 185416 186771
52741A86771J111R88P27K70J42Q08J950K667K358J219k9p29o20J06R63J374R95
$$ 186771 187882 188870 189597 189867 190009 190817 192767 195434 197792 199011 198982 198253 197633 197739 198702 200076 201071
52724B01071n8j236j946j964j473p39K0M63K18o11j290j188n00Q8K99L87M04J9
$$ 201071 201013 199777 197831 195867 194394 193655 193675 194138 194356 193745 192455 191267 190767 190855 191154 191541 191945 191964
52706A91964p64j256r17j22L49L86N13R08J092P63M08O77J484K130K190J918J707
$$ 191964 191200 189944 189027 188905 189254 189640 190153 191061 192153 192916 193324 194001 195485 197615 199805 201723 203430
52689B03430J561J194M70l65q72p86l00N9Oj09K70J037J346O22o16j278q99K3
$$ 203430 204991 206185 206655 206290 205418 204632 204332 204391 204397 204288 204558 205595 206941 207563 206947 205669 204770 204793
52671B04793P75J078R64M65k80q72r21m56J01M25N74Q21J233J543J463J065O93
$$ 204793 205568 206646 207610 208075 207795 206923 206002 205546 205647 206072 206646 207467 208700 210243 211706 212771 213464
52654B13464M84J60n26j315j655j361p69l28k66n57r24r43m89JR8R9O17J473J701
$$ 213464 213948 214108 213582 212267 210612 209251 208482 208154 207888 207331 206407 205464 204975 204976 205074 205173 205790 207263 208964
52635B08964Q93j94o91o33m15J23J245K409K703K045J164M94j52q16j155j122
$$ 208964 209857 209663 208972 208339 207924 208047 209292 211701 214404 216449 217613 218107 217955 217139 215984 214862
52619B14862j120j218r34j74K98r4q03r15m95m11q85j065k23J096J627R52Rk7
$$ 214862 213742 212524 211590 211416 211714 211620 210817 209902 209407 208996 208111 207046 206823 207919 209546 210498 210507 210480
52601B10480Q41J513J268O88P81J576K186K171K028K160K131J488P28O93J327
$$ 210480 211321 212834 214102 214790 215571 217147 219333 221504 223532 225692 227823 229311 230039 230732 232059
52586B32059J780J583J012L07o50j686k094j463k87O61J101J055M07p59j720j819
$$ 232059 233839 235422 236434 236741 236091 234405 232311 230848 230561 231222 232323 233378 233785 233026 231306 229487
52570B29487j428j524k220k470j512J9Q65N93k06q41j060q46k44M86R01P55J74
$$ 229487 228059 226535 224315 221845 220333 220352 221217 221810 221604 220763 219703 218857 218613 219099 220000 220755 220929
52553B20929n27r92q85j08R47J651J699J290P42J80l37o45o19l06J25M51M51R7
$$ 220929 220402 219410 218525 218417 219364 221015 222714 224004 224746 224926 224589 223944 223325 223019 223144 223595 224046 224143
52535B24143l14m32k61r3j9Q6J35j94q61j291j117p38p72j193j410j042k75M54
$$ 224143 223829 223397 223136 223043 223024 223110 223245 223051 222190 220899 219782 219044 218272 217079 215669 214627 214352 214806
52517B14806Q35P80M76L22O21J314K079K610K702K353J871J683J813J803J375
$$ 214806 215641 216421 216897 217219 217840 219154 221233 223843 226545 228898 230769 232452 234265 236068 237443
52502B37443P95L50j62r87j734j763j151o54p26j034j073q27o39p40j041j265
$$ 237443 238238 238588 238426 237439 235705 233942 232791 232137 231411 230377 229304 228477 227838 227098 226057 224792
52486B24792j200r21o67l54M57J808K915K981K239J585J391J321J243J421J698
$$ 224792 223592 222671 222004 221650 222107 223915 226830 229811 232050 233635 235026 236347 237590 239011 240709
52471B40709J330J14j056j236n47K80R51J595K124K297K250K309K305J720N79
$$ 240709 242039 242153 241097 239861 239314 239594 240545 242140 244264 246561 248811 251120 253425 255145 255724
52456B55724l80o54o63j087j829k130j702j253j622k664l397l190k348j498r14
$$ 255724 255344 254690 254027 252940 251111 248981 247279 246026 244404 241740 238343 235153 232805 231307 230393
52441B30393o04n67n74j76N86R29M37n6M14J332J361M87J35Q49J311M21p99o37
$$ 230393 229789 229222 228648 228472 229058 229987 230424 230368 230782 232114 233475 233962 234097 234946 236257 236678 235879 235242
52423B35242Q07J829J566R27J131K320L839N112N940O483P206Q392R596R893Q826
$$ 235242 236049 237878 239444 240371 241502 243822 247661 252773 258713 265196 272402 280794 290390 300283 309109
52408C09109O745M202J413j601m623p171q634q597p269n540m273l579l037k419
$$ 309109 315854 320056 321469 319868 315245 308074 299440 290843 283574 278034 273761 270182 267145 264726
52394B64726j793j196o51m12o18q29m87J86M84L75O23J510K341K589K754L469
$$ 264726 262933 261737 261086 260674 260056 259227 258740 258926 259410 259785 260408 261918 264259 266848 269602 273071
52378B73071M378M626M089L391K995K956L371M326N374N763N270M400L672L196
$$ 273071 277449 282075 286164 289555 292550 295506 298877 303203 308577 314340 319610 324010 327682 330878
52364C30878L047L368L882L777K634J183O74J533K956L828L777L388L566M681
$$ 330878 333925 337293 341175 344952 347586 348769 349443 350976 353932 357760 361537 364925 368491 373172
52350C73172O266P496Q031Q251Q693R475J0438J1515J2636J3530J4011J4425J5308
$$ 373172 379438 386934 394965 403216 411909 421384 431822 443337 455973 469503 483514 497939 513247
52337E13247J6646J7852J8603J9204K0007K0891K1550K1907K1953K1585K0917
$$ 513247 529893 547745 566348 585552 605559 626450 648000 669907 691860 713445 734362
52326G34362K0446K0471K0632K0421J9809J8967J7663J5582J3029J0671Q680O727
$$ 734362 754808 775279 795911 816332 836141 855108 872771 888353 901382 912053 920733 927460
52314I27460M701K850J216l93j827k759l418m335n313n567n150n169o005o403
$$ 927460 932161 935011 936227 935834 934007 931248 927830 923495 918182 912615 907465 902296 896291 889888
52300H89888n192l141j967k020k136j500n61O5N07J164K058L004M056N398P111
$$ 889888 884696 881555 879588 877568 875432 873932 873371 873436 873943 875107 877165 880169 884225 889623 896734
52285H96734R088J1076J2729J3893J4712J5284J5501J5418J5386J5330J4427J2209
$$ 896734 905822 916898 929627 943520 958232 973516 989017 1004435 1019821 1035151 1049578 1061787
52273A061787R652Q270Q208Q173P181N462L554J477p82k844m493o002p462q401
$$ 1061787 1071439 1079709 1087917 1096090 1103271 1108733 1112287 1113764 1112982 1110138 1105645 1099643 1092181 1083780
52259A083780q562q458q698r122r224q962q674q467q174p687o993o124n367n191
$$ 1083780 1075218 1066760 1058062 1048940 1039716 1030754 1022080 1013613 1005439 997752 990759 984635 979268 974077
52245I74077n567n801n414m865m804m934m247k305J97K213L257L529L515L565
$$ 974077 968510 962709 957295 952430 947626 942692 938445 936140 936337 938550 941807 945336 948851 952416
52231I52416L720L868M037M355M722M884M935N338O179O918P218P524Q283R026
$$ 952416 956136 960004 964041 968396 973118 978002 982937 988275 994454 1001372 1008590 1016114 1024397 1033423
52217A033423Q963Q181P538P471P630P655P547P246O524N553M934M884M898M483
$$ 1033423 1042386 1050567 1058105 1065576 1073206 1080861 1088408 1095654 1102178 1107731 1112665 1117549 1122447 1126930
52203A126930L804L260K881K460J945J333N87o2q4O40J418J497R60L80j66j054
$$ 1126930 1130734 1133994 1136875 1139335 1141280 1142613 1143200 1143138 1143054 1143694 1145112 1146609 1147569 1147949 1147783 1146729
52187A146729k158k768k706k810l810n277o249o562o821p225p255o644n846n223
$$ 1146729 1144571 1141803 1139097 1136287 1132477 1127200 1120951 1114389 1107568 1100343 1093088 1086444 1080598 1075375
52173A075375m398l020j588q41o32k26M35O86M04M02J246K437L296L931M703N324
$$ 1075375 1070977 1067957 1066369 1065528 1064896 1064670 1065105 1065791 1066195 1066597 1067843 1070280 1073576 1077507 1082210 1087534
52157A087534N281M823M657M755M408L485K816L083M043N175O426P840R010R581
$$ 1087534 1092815 1097638 1102295 1107050 1111458 1114943 1117759 1120842 1124885 1130060 1136486 1144326 1153336 1162917
52143A162917R917J0599J1479J1887J1766J1859J2613J3540J4065J4383J4986
$$ 1162917 1172834 1183433 1194912 1206799 1218565 1230424 1243037 1256577 1270642 1285025 1300011
52132A300011J5708J5949J5691J5589J5993J6527J6862J7290J8087J8767J8532
$$ 1300011 1315719 1331668 1347359 1362948 1378941 1395468 1412330 1429620 1447707 1466474 1485006
52121A485006J7226J5384J3453J1452R318P076M711K308K61j121k189l619n485
$$ 1485006 1502232 1517616 1531069 1542521 1551839 1558915 1563626 1565934 1566195 1565074 1562885 1559266 1553781
52108A553781p222q567r862j1185j1808j1081r290p242n350l622k196j247n53
$$ 1553781 1546559 1537992 1528130 1516945 1505137 1494056 1484766 1477524 1472174 1468552 1466356 1465109 1464556
52095A464556L17J422K459L275L950M476M796N119N900P371R357J1474J3346J4774
$$ 1464556 1464873 1466295 1468754 1472029 1475979 1480455 1485251 1490370 1496270 1503641 1512998 1524472 1537818 1552592
52081A552592J5879J7001J8204J9064J9076J8173J6625J4715J2747J1012R463
$$ 1552592 1568471 1585472 1603676 1622740 1641816 1659989 1676614 1691329 1704076 1715088 1724551
52070A724551P654N375K990P46j884n538r766j3236j5083j5697j6160j7288j9070
$$ 1724551 1732205 1737580 1740570 1741316 1739432 1733894 1724128 1710892 1695809 1680112 1663952 1646664 1627594
52057A627594k0693k1289k1047k1239k2615k4214k4569k3787k3309k3732k4082
$$ 1627594 1606901 1585612 1564565 1543326 1520711 1496497 1471928 1448141 1424832 1401100 1377018
52046A377018k3513k2543k1958k1420j9963j7396j4487j1969r978q237o397m334
$$ 1377018 1353505 1330962 1309004 1287584 1267621 1250225 1235738 1223769 1213791 1205554 1199157 1194823
52034A194823k338q52R0P77J153P98k42j317k212l603n849q017q860q468q074
$$ 1194823 1192485 1191633 1191723 1192500 1193653 1194451 1194209 1192892 1190680 1187077 1181228 1173211 1164351 1155883 1147809
52019A147809q434r224r908j0476j1173j2106j3383j5134j7165j8893j9842k0024
$$ 1147809 1139375 1130151 1120243 1109767 1098594 1086488 1073105 1057971 1040806 1021913 1002071 982047
52007I82047j9751j9321j9011j9117j9776k0675k1104k0449j8823j7051j5830
$$ 982047 962296 942975 923964 904847 885071 864396 843292 822843 804020 786969 771139
51996G71139j4969j3785j2179j0787r970r295q334p488p365p780q012p904q031
$$ 771139 756170 742385 730206 719419 709449 700154 691820 684332 676967 669187 661175 653271 645240
51983F45240q759r686j0275j0497j0654j0795j0645j0060r292q730q367p754o564
$$ 645240 636481 626795 616520 606023 595369 584574 573929 563869 554577 545847 537480 529726 523162
51970E23162n067l795k795j646j96J198K231K992L498L459K783J902J180L89q11
$$ 523162 518095 514300 511505 509859 509663 510861 513092 516084 519582 523041 525824 527726 528906 529295 528484
51955E28484k288l704m971n970o193n321l853k607j708o89O59K037L185M130N022
$$ 528484 526196 522492 517521 511551 505358 500037 496184 493577 491869 491180 491839 493876 497061 501191 506213
51940E06213O073P474Q959R808R712R193Q601P184M137J12l386n914q209j0455
$$ 506213 512286 519760 528719 538527 548239 557432 566033 573217 577354 577466 574080 568166 559957 549502
51926E49502j1729j1576j0870j0552j0411r934r491r812j0672j1043j0359r050
$$ 549502 537773 526197 515327 504775 494364 484430 474939 465127 454455 443412 433053 424003
51914D24003p821o884n921m605l042j664o62K87J402K292K585K839L917N541O378
$$ 424003 416182 409298 403377 398772 395730 394066 393404 393691 395093 397385 399970 402809 406726 412267 418645
51899D18645N786M467L119J443q63l150m596n306n823o094n765n006m207l241
$$ 418645 424431 428898 432017 433460 432597 429447 424851 419545 413722 407628 401863 396857 392650 389409
51885C89409j847m15M55J032K212M256O467Q074Q857Q952Q669Q478Q620Q707Q172
$$ 389409 387562 387147 387602 388634 390846 395102 401569 409643 418500 427452 436121 444599 453219 461926 470098
51870D70098P069N894M859L838K909K305J927J630J906L441N958Q188R198R008
$$ 470098 477167 483061 487920 491758 494667 496972 498899 500529 502435 505876 511834 520022 529220 538228
51856E38228P710M904N67m107p552r310j0163j0935j1670j1949j1613j0911j0102
$$ 538228 545938 550842 551409 547302 539750 530440 520277 509342 497672 485723 474110 463199 453097
51843D53097r212q252p509p271p241o636n133l396k283j844j568j329j414j700
$$ 453097 443885 435633 428124 420853 413612 406976 401843 398447 396164 394320 392752 391423 390009 388309
51829C88309j570q23r5p1o81j332j565j353j006r51j318j714j661j234q79n84
$$ 388309 386739 385916 385821 385750 385069 383737 382172 380819 379813 378862 377544 375830 374169 372935 372056 371472
51813C71472K11J727L421M597M989M562L292J532P3o61j143k023l147l804l804
$$ 371472 371683 373410 376831 381428 386417 390979 394271 395803 395876 395215 394072 392049 388902 385098 381294
51798C81294l706l932m094l526k288j305j367k167k587j972p96J14N83Q88J046
$$ 381294 377588 373656 369562 366036 363748 362443 361076 358909 356322 354350 353554 353668 354251 355139 356185
51783C56185R17P87J071J457J208L45l10m61p04j233j171J33J974L300M192N411
$$ 356185 357102 357889 358960 360417 361625 361970 361660 361199 360495 359262 358091 358224 360198 363498 367690 373101
51767C73101O982Q100Q198P292N577L507J959J353P71j032l804n955o624o514
$$ 373101 380083 388183 396381 403673 409250 412757 414716 416069 416840 415808 412004 406049 399425 392911
51753C92911o456o263n535m657m204l947l266k154j135l60N55J902L642N709Q068
$$ 392911 386455 380192 374657 370000 365796 361849 358583 356429 355294 354934 355489 357391 361033 366742 374810
51738C74810J0349J1807J1863J0573Q564O624N289M674M608M888N300N415M619
$$ 374810 385159 396966 408829 419402 427966 434590 439879 444553 449161 454049 459349 464764 469383
51725D69383K541n98m023o760q024p670o288m685l258k138j829k973n176o811
$$ 469383 471924 471326 467303 460543 452519 444849 438561 433876 430618 428480 426651 423678 418502 411691
51711D11691o563m859l125j843k25K218M599N544M640K591K89j676k814k640j080
$$ 411691 405128 400269 397144 395301 395076 397294 401893 407437 412077 414668 414957 413281 410467 407827 406747
51696D06747J294L637N358O256O184M847K116j467m744o726p310p035o246m891
$$ 406747 408041 411678 417036 423292 429476 434323 436439 434972 430228 423502 416192 409157 402911 398020
51682C98020l205k020j896k188j639O9J937L075L875N325P486R394J0326J0513
$$ 398020 394815 392795 390899 388711 387072 387141 389078 392153 396028 401353 408839 418233 428559 439072
51668D39072J0416R887Q380N671K072j835n331p678q452p814o265m316k487j376
$$ 439072 449488 459375 467755 473426 475498 473663 468332 460654 452202 444388 438123 433807 431320 429944
51654D29944j313k066l160m365n573o439o614o310o079o069n987n837o073o716
$$ 429944 428631 426565 423405 419040 413467 407028 400414 394104 388025 381956 375969 370132 364059 357343
51640C57343o949o044m346k833k034j869k218k900l225k480j053l21r02j703j362
$$ 357343 350394 344350 340004 337171 335137 333268 331050 328150 324925 322445 321392 321071 320169 318466 317104
51625C17104j83L04m19j144p65J48L21k69m63K72J107J183P74O47R01J096J127
$$ 317104 316921 317225 316806 315662 314897 315045 315366 315097 314634 314906 316013 317196 317970 318617 319518 320614 321741
51608C21741J281J615J922K306L176M591O069P149P727P813P351O340M765K462
$$ 321741 323022 324637 326559 328865 332041 336632 342701 349850 357577 365390 372741 379081 383846 386308
51594C86308m61l089m306m030l227k413j043J210L422M626N284O514Q211R253
$$ 386308 385847 382758 378452 374422 371195 368782 367739 368949 372371 376997 382281 388795 397006 406259
51580D06259R490J0156J1944J3881J4837J5079J5510J6103J6182J5791J5570J5336
$$ 406259 415749 425905 437849 451730 466567 481646 497156 513259 529441 545232 560802 576138
51568E76138J4044J1416Q772P778R020J2215J7057K3168K9618L5298L9596M2193
$$ 576138 590182 601598 610370 618148 627168 639383 656440 679608 709226 744524 784120 826313
51556H26313M2394L9509L3950K7202K0386J3343N500k903j0970j8170k4578l0228
$$ 826313 868707 908216 942166 969368 989754 1003097 1008597 1005694 994724 976554 951976 921748
51544I21748l4793l7965l9759m0350l9995l9093l7954l6338l3699l0055k6283
$$ 921748 886955 848990 809231 768881 728886 689793 651839 615501 581802 551747 525464
51533E25464k3210k0769j8318j5572j2807j0347q296o738n759n219m789m290l800
$$ 525464 502254 481485 463167 447595 434788 424441 416145 409407 403648 398429 393640 389350 385550
51520C85550l434l274l432l859m106l688k807k227k269k362j964j398j273j377
$$ 385550 382116 378842 375410 371551 367445 363757 360950 358723 356454 354092 352128 350730 349457 348080
51506C48080r58J0O06K93k16M7R61J513J192M92P6k8j44l29m35n03o88q74p40
$$ 348080 347122 347132 347738 348031 347815 347862 348823 350336 351528 352020 352096 352068 351924 351595 351160 350657 349969 349095 348355
51487C48355l09j17o52j742k684k925k494j866j579j901k680l382l495l017k476
$$ 348355 348046 347929 347277 345535 342851 339926 337432 335566 333987 332086 329406 326024 322529 319512 317036
51472C17036k276k197j773j060o47q26j102q53j45N29J168K314M058N484N614
$$ 317036 314760 312563 310790 309730 309083 308257 307155 306302 306157 306686 307854 310168 314226 319710 325324
51457C25324M617L662L531L862L896L619L724M549N549O021O093O561P796R173
$$ 325324 329941 333603 337134 340996 344892 348511 352235 356784 362333 368354 374447 381008 388804 397977
51443C97977R736R120P578N438K973P24o02p54j76L93L41q04l146n948p917q386
$$ 397977 407713 416833 424411 429849 432822 433546 432944 432190 432014 432407 432748 431944 428798 422850 414933 406547
51427D06547q031p921q131p880o841n604m623l468j578O00J885J645M53o43j157
$$ 406547 398516 390595 382464 374584 367743 362139 357516 354048 352470 353070 354955 356600 357053 356410 355253
51412C55253j263j190q70k29M37O83M46J33J27M14P84J182J660K137K462K658
$$ 355253 353990 352800 351930 351701 352138 352821 353267 353400 353527 353941 354725 355907 357567 359704 362166 364824
51396C64824K898L262L710M208M781N504O569Q210J0441J3003J5762J8874K2326
$$ 364824 367722 370984 374694 378902 383683 389187 395756 403966 414407 427410 443172 462046 484372
51383D84372K5744K9104L3192L8606M4443M8878N1049N1542N0862M8440M3781
$$ 484372 510116 539220 572412 611018 655461 704339 755388 806930 857792 906232 950013
51372I50013L7751L1747K6007J9473J1225J344r419k0093k9601l7075m2352m5932
$$ 950013 987764 1019511 1045518 1064991 1076216 1077560 1068141 1048048 1018447 981372 939020 893088
51360H93088m8356m9820n0254m9391m6862m2699l7694l2883k8652k4759k1132
$$ 893088 844732 794912 744658 695267 648405 605706 568012 535129 506477 481718 460586
51349D60586j8084j5687j3512j1331r507q406p768p128o535o346o467o311n633
$$ 460586 442502 426815 413303 401972 392465 384059 376291 369163 362628 356282 349815 343504 337871
51336C37871m917m741m938m745l721k275j208r18j177j531j621j233l94M75Q06
$$ 337871 332954 328213 323275 318530 314809 312534 311326 310408 309231 307700 306079 304846 304452 304927 305733
51321C05733M58r2l32j86J44N10O83K87p33j740k007j504p00J55J043J683J767
$$ 305733 306191 306099 305767 305581 305725 306235 306918 307205 306472 304732 302725 301221 300521 300676 301719 303402 305169
51304C05169J675K080K714K379O93r97j219l80k56j644l423m079l436k429j734
$$ 305169 306844 308924 311638 314017 314710 313713 312494 312114 311858 310214 306791 302712 299276 296847 295113
51289B95113j199m42N22J433K155K652K785K458J961J821K151K401K037J187M20
$$ 295113 293914 293472 293994 295427 297582 300234 303019 305477 307438 309259 311410 313811 315848 317035 317455
51274C17455K2n2K82J197K488L580M223M636M932M809M125L179K156P76j074k780
$$ 317455 317477 317425 317707 318904 321392 324972 329195 333831 338763 343572 347697 350876 353032 353808 352734 349954
51258C49954l600l609l458l519l712m006m451m784m611l962l235k548j729q98
$$ 349954 346354 342745 339287 335768 332056 328050 323599 318815 314204 310242 307007 304459 302730 301832
51244C01832m99o03p92q38j000j370j550j288r45q27o08P3P94Q16J87k48J05J058
$$ 301832 301333 300730 299938 299100 298100 296730 295180 293892 292947 292120 291512 291585 292379 293195 293382 293134 293239 294297
51226B94297K133L039L501L227K342J520J336J654J887J673J129N49J86K13O81
$$ 294297 296430 299469 302970 306197 308539 310059 311395 313049 314936 316609 317738 318287 318473 318686 319367
51211C19367J441K151K447K221J858K038L019M118M271L249J974J334J089L93
$$ 319367 320808 322959 325406 327627 329485 331523 334542 338660 342931 346180 348154 349488 350577 350970
51197C50970q50j735j595r57r15j777k687k641j644o33k78k30J71O94M66n07r31
$$ 350970 350120 348385 346790 345833 344918 343141 340454 337813 336169 335536 335258 335028 335199 335893 336359 335852 334921
51180C34921M7J394J422R2j014r88n63n36m75K72J220J462J120J063J567K149
$$ 334921 334968 336362 337784 337876 336862 335874 335311 334775 334300 334572 335792 337254 338374 339437 341004 343153
51164C43153K479K554K069N96j518l274m104m214l891l193k390j877j562j102
$$ 343153 345632 348186 350255 350851 349333 346059 341955 337741 333850 330657 328267 326390 324828 323726
51150C23726p71j188k008j988q03K26m6j010j347r31o60q62r51m61M15J260J731
$$ 323726 322955 321767 319759 317771 316968 317194 317148 316138 314791 313860 313200 312338 311387 310926 311341 312601 314332
51133C14332J602J125J184K319L804M433L998L313K806K182J364Q60Q19O86K06
$$ 314332 315934 317059 318243 320562 324366 328799 332797 336110 338916 341098 342462 343322 344141 344827 345033
51118C45033J4O70J703K208J990J633J619J882K080K012J815J892K422K937K723
$$ 345033 345047 345717 347420 349628 351618 353251 354870 356752 358832 360844 362659 364551 366973 369910 372633
51103C72633J753P53K23j06n54p85l11O77J483J729J550J166P42M85M95N79N47
$$ 372633 374386 375139 375362 375256 374702 373917 373606 374283 375766 377495 379045 380211 380953 381438 381933 382512 383059
51086C83059N65R01J433J809J928J861J454N58m48q59m28M50J385K334L229L758
$$ 383059 383624 384525 385958 387767 389695 391556 393010 393568 393120 392261 391833 392283 393668 396002 399231 402989
51070D02989L829L774L914M215M677N598P058Q387Q778Q236P452O676N399L377
$$ 402989 406818 410592 414506 418721 423398 428996 436054 444441 453219 461455 468907 475583 480982 484359
51056D84359J533J248K840N211O997P774Q045Q374Q847R183R077Q430P453O529
$$ 484359 485892 487140 489980 495191 502188 509962 518007 526381 535228 544411 553488 561918 569371 575900
51042E75900N872N332M721M215M054L806K315j250o387j1540j5335j7416j8165
$$ 575900 581772 587104 591825 596040 600094 603900 606215 604965 598578 587038 571703 554287 536122
51029E36122j7960j6849j4851j2328r907p970o359m697k943j421l52L95J037J676
$$ 536122 518162 501313 486462 474134 464227 456257 449898 445201 442258 440837 440485 440880 441917 443593
51015D43593K481L710N215O279O319N673N235N338N550N590N926P085Q758J0025
$$ 443593 446074 449784 454999 461278 467597 473270 478505 483843 489393 494983 500909 507994 516752 526777
51001E26777J0386J0165R953J0063J0577J1546J2805J3840J4191J4104J4408J5642
$$ 526777 537163 547328 557281 567344 577921 589467 602272 616112 630303 644407 658815 674457
50989F74457J7451J9018J9879K0050J9508J8048J5824J3681J2570J2763J3786
$$ 674457 691908 710926 730805 750855 770363 788411 804235 817916 830486 843249 857035
50978H57035J5041J6241J7349J8399J9463K0664K2138K4086K6728L0086L3856
$$ 857035 872076 888317 905666 924065 943528 964192 986330 1010416 1037144 1067230 1101086
50967A101086L7698M1661M6081N1040N6011O0148O2881O4260O4756O4673O3703
$$ 1101086 1138784 1180445 1226526 1277566 1333577 1393725 1456606 1520866 1585622 1650295 1713998
50956A713998O1227N7149N2185M7095M1911L6364L0896K6583K3908K2139K0093
$$ 1713998 1775225 1832374 1884559 1931654 1973565 2009929 2040825 2067408 2091316 2113455 2133548
50945B133548J7160J3279Q487K998k465o956r969j1637j2389j2741j3287j4526
$$ 2133548 2150708 2163987 2172474 2175472 2173007 2166051 2156082 2144445 2132056 2119315 2106028 2091502
50933B091502j6647j9598k3276k7430l1648l5752m0119m5118n0351n4850n8092
$$ 2091502 2074855 2055257 2031981 2004551 1972903 1937151 1897032 1851914 1801563 1746713 1688621
50922A688621o0288o1598o1651o0206n7828n5357n2893m9872m6115m2227l8757
$$ 1688621 1628333 1566735 1505084 1444878 1387050 1331693 1278800 1228928 1182813 1140586 1101829
50911A101829l5454l1813k8057k5045k3053k1220j8566j5263j2399j0616r538
$$ 1101829 1066375 1034562 1006505 981460 958407 937187 918621 903358 890959 880343 870805
50900H70805q612p846p338o672n405l825k631k006j624j383j390j251k88J355
$$ 870805 862193 854347 847009 840337 834932 831107 828476 826470 824846 823463 822073 820822 820534 821889
50886H21889K557K612K130K136K900M123N623P141Q017P901P464P655Q419R059
$$ 821889 824446 827058 829188 831324 834224 838347 843970 851111 859128 867029 874493 882148 890567 899626
50872H99626R536J0558J2350J4321J6081J7874J9823K1666K3583K6364L0194L4125
$$ 899626 909162 919720 932070 946391 962472 980346 1000169 1021835 1045418 1071782 1101976 1136101
50860A136101L7504M1134M6222N2643N9333O5988P3356Q1840R0840R9695J08373
$$ 1136101 1173605 1214739 1260961 1313604 1372937 1438925 1512281 1594121 1684961 1784656 1893029
50849A893029J16930J24984J32208J38819J44986J50106J53199J53878J52343
$$ 1893029 2009959 2134943 2267151 2405970 2550956 2701062 2854261 3008139 3160482
50840C160482J48455J41329J30153J15178R7611P8710N9293M0137K2429P368m532
$$ 3160482 3308937 3450266 3580419 3695597 3793208 3871918 3931211 3971348 3993777 4001145 3996613
50829C996613j3450j9467k2275k1716j8254j2650n493K511R980J5060J6300J3194
$$ 3996613 3983163 3963696 3941421 3919705 3901451 3888801 3883308 3885819 3895799 3910859 3927159 3940353
50817C940353O100m151j6669l0908m6650o3426q0212r6012j10441j23351j34067
$$ 3940353 3946453 3942302 3925633 3894725 3848075 3784649 3704437 3608425 3497984 3374633 3240566
50806C240566j41607j45558j46128j43422j37316j28161j17035j04973r2469p9846
$$ 3240566 3098959 2953401 2807273 2663851 2526535 2398374 2281339 2176366 2083897 2004051
50796B004051o7567n5818m4312l2944k2263j2928n108J218N808Q495R632R728
$$ 2004051 1936484 1880666 1836354 1803410 1781147 1768219 1763111 1764329 1770137 1778632 1788264 1797992
50784A797992Q895P146M927K757M76k443n929r215j1804j3982j6308j9092k2483
$$ 1797992 1806887 1814033 1818960 1821717 1822193 1819750 1813821 1804606 1792802 1778820 1762512 1743420 1720937
50771A720937k6479l0605l4091l6713l9078m1685m4001m4901m3912m1617l8883
$$ 1720937 1694458 1663853 1629762 1593049 1553971 1512286 1468285 1423384 1379472 1337855 1298972
50760A298972l6108l3300l0551k8064k5737k3040j9508j5316j1186p705m845k158
$$ 1298972 1262864 1229564 1199013 1170949 1145212 1122172 1102664 1087348 1076162 1068457 1063612 1061454
50748A061454P60M035P567J1089J4406J7742K1618K6159L0760L4823L8658M3101
$$ 1061454 1062214 1066249 1073816 1084905 1099311 1117053 1138671 1164830 1195590 1230413 1269071 1312172
50736A312172M8341N3654N8504O3287O8590P4117P8851Q2117Q4062Q5158Q5638
$$ 1312172 1360513 1414167 1472671 1535958 1604548 1678665 1757516 1839633 1923695 2008853 2094491
50725B094491Q5463Q4470Q2226P7952P0884O0921M8784L5490K1665P645n837j7379
$$ 2094491 2179954 2264424 2346650 2424602 2495486 2556407 2605191 2640681 2662346 2669991 2664154 2646775
50713B646775k5688l0522l2534l2246k9553k4322j7115r147j728M237Q454J1142
$$ 2646775 2621087 2590565 2558031 2525785 2496232 2471910 2454795 2445648 2443920 2448157 2456611 2467753
50701B467753J2437J1753Q035Q26r173k0750l3035m5322n6525o5427p1435p4649
$$ 2467753 2480190 2491943 2499978 2500804 2491631 2470881 2437846 2392524 2335999 2270572 2199137 2124488
50689B124488p5281p3423o9349o3522n6195m7408l7481k7083j6661o139M607J5326
$$ 2124488 2049207 1975784 1906435 1842913 1786718 1739310 1701829 1674746 1658085 1651946 1656553 1671879
50677A671879K5692L5660M5259N4175O1803O7603P1249P2631P1894O9269O4765
$$ 1671879 1697571 1733231 1778490 1832665 1894468 1962071 2033320 2105951 2177845 2247114 2311879
50666B311879N8282N0344M2355L5615L0172K5048J9602J4256R863O649L959P84
$$ 2311879 2370161 2420505 2462860 2498475 2528647 2553695 2573297 2587553 2597416 2604065 2608024 2608808
50654B608808l474q554j3443j7027j8754j8634j6858j3687r582m965J70O052J2421
$$ 2608808 2605334 2596780 2583337 2566310 2547556 2528922 2512064 2498377 2488795 2483830 2484000 2490052 2502473
50641B502473J8443K3535K7880L1886L5456L8159L9826M0604M0636M0069L9207
$$ 2502473 2520916 2544451 2572331 2604217 2639673 2677832 2717658 2758262 2798898 2838967 2878174
50630B878174L7996L5141K8137J4658n681l0535n5433p5567q7844r1908q9480
$$ 2878174 2916170 2951311 2979448 2994106 2988425 2957890 2902457 2826890 2739046 2647138 2557658
50619B557658q2771p3500o2882n1859m1016l0501k0290j0548j712N645J1033J4244
$$ 2557658 2474887 2401387 2338505 2286646 2245630 2215129 2194839 2184291 2182579 2188224 2199257 2213501
50607B213501J5274J4033J0192L566n484j6121k7408l8387m8076n5896o2006o6878
$$ 2213501 2228775 2242808 2253000 2256566 2251082 2234961 2207553 2169166 2121090 2065194 2003188 1936310
50595A936310p0487p2321p2156p0342o7253o3051n8114n3184m8754m4648m0490
$$ 1936310 1865823 1793502 1721346 1651004 1583751 1520700 1462586 1409402 1360648 1316000 1275510
50584A275510l6189l1774k7170k2514j8237j4461j0727o701k813K66K453M129
$$ 1275510 1239321 1207547 1180377 1157863 1139626 1125165 1114438 1107737 1104924 1105190 1107643 1111772
50572A111772N522O739Q136R928J1671J2778J3558J5015J7603K0792K4000K7323
$$ 1111772 1117294 1124033 1132169 1142097 1153768 1166546 1180104 1195119 1212722 1233514 1257514 1284837
50560A284837L1172L5623M0458M5481N0553N5512O0152O4120O6810O7628O6365
$$ 1284837 1316009 1351632 1392090 1437571 1488124 1543636 1603788 1667908 1734718 1802346 1868711
50549A868711O3106N8103N2159M6826M3473M2108M1782M2125M3718M6806N0568
$$ 1868711 1931817 1989920 2042079 2088905 2132378 2174486 2216268 2258393 2302111 2348917 2399485
50538B399485N4095N7346O0647O3931O7086P0588P5070Q0658Q7236R4889J03408
$$ 2399485 2453580 2510926 2571573 2635504 2702590 2773178 2848248 2928906 3016142 3111031 3214439
50527C214439J11680J18319J22792J25315J25907J24189J19927J13000J02897
$$ 3214439 3326119 3444438 3567230 3692545 3818452 3942641 4062568 4175568 4278465
50518D278465Q8986P1463N1424K9864P118j6528m0268o3029q3984j02540j18171
$$ 4278465 4367451 4438914 4490338 4520202 4527320 4510792 4470524 4407495 4323511 4220971 4102800
50507D102800j30368j38496j41715j39539j32559j22133j09160r3600p5451n5647
$$ 4102800 3972432 3833936 3692221 3552682 3420123 3297990 3188830 3095230 3019779 2964132
50497B964132l5622j6225K380J9950L5643M8144N6055N8267N4298M4427K9395
$$ 2964132 2928510 2912285 2914665 2934615 2970258 3018402 3074457 3132724 3187022 3231449 3260844
50486C260844J0058j2508l6759o0723q2453j00455j13903j22685j27276j28480
$$ 3260844 3270902 3258394 3221635 3160912 3078459 2978004 2864101 2741416 2614140 2485660
50476B485660j27094j23684j18495j11694j03834r6029q9317q3855p8883p3594
$$ 2485660 2358566 2234882 2116387 2004693 1900859 1804830 1715513 1631658 1552775 1479181
50466A479181o7814o1798n5708m9512m3304l7407l2179k7663k3530j9427j5529
$$ 1479181 1411367 1349569 1293861 1244349 1201045 1163638 1131459 1103796 1080266 1060839 1045310
50455A045310j2529j0813r778q446o680n156m111k877j079M13N67j27L3J900M470
$$ 1045310 1032781 1021968 1012190 1003744 997064 991908 987797 984920 983841 984254 984821 984694 984727 986627 991097
50440I91097O158O543O493O995Q314J0147J2182J4385J6920J9827K2866K5679
$$ 991097 997255 1003798 1010291 1017286 1025600 1035747 1047929 1062314 1079234 1099061 1121927 1147606
50428A147606K8069K9985L1278L1791L1859L2434L4392L7737M1679M5499M9152
$$ 1147606 1175675 1205660 1236938 1268729 1300588 1333022 1367414 1405151 1446830 1492329 1541481
50417A541481N2935N6893O0789O4560O8514P2960P7733Q2106Q4990Q5323Q2608
$$ 1541481 1594416 1651309 1712098 1776658 1845172 1918132 1995865 2077971 2162961 2248284 2330892
50406B330892P7409P1141O5060N9332N3104M5281L5143K2555Q097p072k1954l6352
$$ 2330892 2408301 2479442 2544502 2603834 2656938 2702219 2737362 2759917 2768014 2760942 2738988 2702636
50394B702636n0487o3976p5686q4616r0495r3318r2903q9280q3122p5312o6345
$$ 2702636 2652149 2588173 2512487 2427871 2337376 2244058 2151155 2061875 1978753 1903441 1837096
50383A837096n6442m5958l5282k4511j3692l245O178J4084K0097K3774K4802K3187
$$ 1837096 1780654 1734696 1699414 1674903 1661211 1657966 1664144 1678228 1698325 1722099 1746901 1770088
50371A770088J8854J1455J177j0447k1331l0534l8606m6162n2743n7322n9420
$$ 1770088 1788942 1800397 1801574 1791127 1769796 1739262 1700656 1654494 1601751 1544429 1485009
50360A485009n9442n8279n6776n5344n3717n1322m7922m3798l9319l4742l0370
$$ 1485009 1425567 1367288 1310512 1255168 1201451 1150129 1102207 1058409 1019090 984348 953978
50349I53978k6472k2971j9646j6688j4494j2817j0793q120n595m078l379k755
$$ 953978 927506 904535 884889 868201 853707 840890 830097 821977 816382 812304 808925 806170
50337H06170k088j901k373k946l008k518j904j565j515j446j119p14n66n77k59
$$ 806170 804082 802181 799808 796862 793854 791336 789432 787867 786352 784906 783787 783073 782507 781930 781671
50322G81671N64J480K113K486K666K603K680L715N881Q210R856J1283J3386J5852
$$ 781671 782235 783715 785828 788314 790980 793583 796263 799978 805859 814069 823925 835208 848594 864446
50308H64446J7405J7541J6961J6331J5577J4647J4007J4018J4447J5038J5885
$$ 864446 881851 899392 916353 932684 948261 962908 976915 990933 1005380 1020418 1036303
50297A036303J6800J6982J5845J3886J2194J1252J0642R725Q340O667M574J225
$$ 1036303 1053103 1070085 1085930 1099816 1112010 1123262 1133904 1143629 1151969 1158636 1163210 1164435
50285A164435m231j1283j7726k1395k2112k1359k0151j8227j5327j2126r415p239
$$ 1164435 1160204 1148921 1131195 1109800 1087688 1066329 1046178 1027951 1012624 1000498 991083 983844
50273I83844n579n056o099p923r227r607r526r202q313o679m485j895R23L426
$$ 983844 978265 973209 967110 959187 949960 940353 930827 921625 913312 906633 902148 900253 901176 904602
50259I04602N016N730O113O374O281N867N625N813O062N832M945L538J902L74
$$ 904602 909618 915348 921461 927835 934116 939983 945608 951421 957483 963315 968260 971798 973700 974074
50245I74074r25k281l965n665o792p347p929q797r474r556r414r773j0850j2176
$$ 974074 973149 970868 966903 961238 954446 947099 939170 930373 920899 911343 901929 892156 881306 869130
50231H69130j3056j3072j2339j1350j0400r224p512n627m198l080j351J319M045
$$ 869130 856074 843002 830663 819313 808913 799689 792177 786550 782352 779272 777921 779240 783285
50218G83285N874P052Q632J1200J4467J7891K1202K4495K8151L2561L7576M2548
$$ 783285 789159 796211 804843 816043 830510 848401 869603 894098 922249 954810 992386 1034934
50206A034934M7268N2450N8717O5300P0428P2986P3163P1478O7849O1988N4332
$$ 1034934 1082202 1134652 1193369 1258669 1329097 1402083 1475246 1546724 1614573 1676561 1730893
50195A730893M6180L9116L4314L1998L1268L0603K8756K5058J8885R341m076k0626
$$ 1730893 1777073 1816189 1850503 1882501 1913769 1944372 1973128 1998186 2017071 2026412 2022336 2001710
50183B001710l8451n5461p0033q1085q8107r1225r0941q7657q1654p3593o4641
$$ 2001710 1963259 1907798 1837765 1756680 1668573 1577348 1486407 1398750 1317096 1243503 1178862
50172A178862n5755m7059l8316k9875k2778j7831j5037j4013j4516j6162j7995
$$ 1178862 1123107 1076048 1037732 1007857 985079 967248 952211 938198 923682 907520 889525
50161H89525j8910j8492j7090j5094j2539r533o642m488l172k295j533r78r68
$$ 889525 870615 852123 835033 819939 807400 797867 791225 786737 783565 781270 779737 778759 777791
50148G77791j659k815m013n050n959o574o405n197l449j881n25J154L212M976
$$ 777791 776132 773317 769304 764254 758295 751721 745316 740119 736670 734789 734264 735418 738630 743606
50134G43606O052O924Q113R254R600R105Q355P622O657N385M283L811L904M148
$$ 743606 749658 756582 764695 773949 783549 792654 801009 808631 815288 820673 824956 828767 832671 836819
50120H36819M228M147M201M781N996P546R050J0399J1532J2163J2254J2561J4002
$$ 836819 841047 845194 849395 854176 860172 867718 876768 887167 898699 910862 923116 935677 949679
50107I49679J6458J8734K0020K0824K2187K4466K7290L0259L3215L6067L8939
$$ 949679 966137 984871 1004891 1025715 1047902 1072368 1099658 1129917 1163132 1199199 1238138
50096A238138M2339M6714N1873N7356O3260P0243P8574Q7701R6948J06144J15118
$$ 1238138 1280477 1327191 1379064 1436420 1499680 1569923 1648497 1736198 1833146 1939290 2054408
50085B054408J22909J28006J29387J27008J21413J13419J04357R5973Q9562Q5232
$$ 2054408 2177317 2305323 2434710 2561718 2683131 2796550 2900907 2996880 3086442 3171674
50075C171674Q2301Q0155P8151P4805O7808N5281L6832J3367j3559m1823o8828
$$ 3171674 3253975 3334130 3412281 3487086 3554894 3610175 3647007 3660374 3646815 3604992 3536164
50064C536164r2376j11585j26564j37371j43769j45985j44939j41482j35916j28413
$$ 3536164 3443788 3332203 3205639 3068268 2924499 2778514 2633575 2492093 2356177 2227764
50054B227764j19513j09818r9579q8937p8355o8463n9643n1978m5444m0014l5730
$$ 2227764 2108251 1998433 1898854 1809917 1731562 1663099 1603456 1551478 1506034 1466020 1430290
50043A430290l2884l1740l1812l1772l0525k8145k5374k2606j9897j7750j6888
$$ 1430290 1397406 1365666 1333854 1302082 1271557 1243412 1218038 1195432 1175535 1157785 1140897
50032A140897j7129j7218j6256j4780j3940j4063j4530j4807j4916j4929j4573
$$ 1140897 1123768 1106550 1090294 1075514 1061574 1047511 1032981 1018174 1003258 988329 973756
50021I73756j3668j2571j1875j1741j1799j1679j1386j1042j0448r281p717o522
$$ 973756 960088 947517 935642 923901 912102 900423 889037 877995 867547 858266 850549 844027
50009H44027o248o474o249n197l760k324o40J557L836N494O551P659Q979R725
$$ 844027 837779 831305 825056 819859 816099 813775 813135 814692 818528 824022 830573 838232 847211 856936
49995H56936R172P687O347N643N067L983K557J440P88jj364k771l274k686j736
$$ 856936 866108 873795 880142 885785 890852 894835 897392 898832 899620 899619 898255 895484 892210 889524 887788
49980H87788q78M53K937O196R261J2084J5703K0750K6579L2260L7821M3928N0785
$$ 887788 886910 887363 890300 896496 905757 917841 933544 954294 980873 1013133 1050954 1094882 1145667
49967A145667N8077O5598P3103P9647Q3879Q5132Q3690P9964P4175O7064O0183
$$ 1145667 1203744 1269342 1342445 1422092 1505971 1591103 1674793 1754757 1828932 1895996 1956179
49956A956179N5033N2220N1637N2672N3807N2649M7163L6643K1215J059k2895
$$ 1956179 2011212 2063432 2115069 2167741 2221548 2274197 2321360 2358003 2379218 2380277 2357382
49945B357382m7924p0384q7985j00609j08944j13216j13640j11175j07081j02036
$$ 2357382 2309458 2239074 2151089 2050480 1941536 1828320 1714680 1603505 1496424 1394388
49935A394388r6155q9607q2672p5343o7386n8869n0330m2472l5778l0337k5878
$$ 1394388 1298233 1208626 1125954 1050611 983225 924356 874026 831554 795776 765439 739561
49924G39561k2054j8757j5975j3346j0347p164m867m155m260l762k301q35j50
$$ 739561 717507 698750 682775 669429 659082 651918 647051 642896 638636 634874 632573 631738 631588
49911F31588J46Q91K265L813N174O312P258Q055Q906J0010J1230J2105J2103J0769
$$ 631588 631734 632625 634890 638703 643877 650189 657447 665502 674408 684418 695648 707753 719856 730625
49897G30625P941M197R10p62j084j526l177n827q667j1352j3817j5565j5986j5403
$$ 730625 738566 742763 743673 742911 741827 740301 737124 731297 722630 711278 697461 681896 665910 650507
49883F50507j5034j5599j6478j6625j5883j4864j3840j2417j0347q040o107m673
$$ 650507 635473 619874 603396 586771 570888 556024 542184 529767 519420 511380 505273 500600
49871E00600l464k282j116Q2J412K781L875M469M778N339O531Q210R943J1527
$$ 500600 497136 494854 493738 493820 495232 498013 501888 506357 511135 516474 523005 531215 541158 552685
49857E52685J2999J4138J4320J3259J1576J0183R193P971O217M374K796J185p55
$$ 552685 565684 579822 594142 607401 618977 629160 638353 646324 652541 656915 659711 660896 660141
49844F60141k658m034n163o780q954j0871j1762j1696j1225j0610r549p661n157
$$ 660141 657483 653449 648286 641506 632552 621681 609919 598223 586998 576388 566839 559178 554021
$$ [...]
##END NTUPLES=NMR SPECTRUM
##END=
