##TITLE=AC1469_13FE002651_8026970_5drCmvS8Dh
##JCAMPDX= 6.0         $$ Bruker NMR JCAMP-DX V2.0
##DATA TYPE= NMR SPECTRUM
##DATA CLASS= NTUPLES
##ORIGIN= BRUKER
##OWNER= Administrator
$$ 1.72 TOPSPIN		Version 2.1
$$ 2013-07-18 16:12:20.311 -0700  Administrator@X
$$ Compression mode = diff/dup
##.OBSERVE FREQUENCY= 400.02188249412
##.OBSERVE NUCLEUS= ^1H
##.ACQUISITION MODE= SIMULTANEOUS (DQD)
##.ACQUISITION SCHEME= undefined
##.AVERAGES= 8
##.DIGITISER RES= 22
##SPECTROMETER/DATA SYSTEM= spect
##.PULSE SEQUENCE= zg30
##.SOLVENT NAME= COFFEE_meoh
##.SHIFT REFERENCE= INTERNAL, COFFEE_meoh, 1, 14.98509
##AUDIT TRAIL= $$ (NUMBER, WHEN, WHO, WHERE, PROCESS, VERSION, WHAT)
$$ ##TITLE= Audit trail, TOPSPIN		Version 2.1
$$ ##JCAMPDX= 5.01
$$ ##ORIGIN= Bruker BioSpin GmbH
$$ ##OWNER= Administrator
$$ $$ E:\/data/COFFEE/nmr/AC1469_13FE002651_8026970_5drCmvS8Dh/30/pdata/1/auditp.txt
$$ ##AUDIT TRAIL=  $$ (NUMBER, WHEN, WHO, WHERE, PROCESS, VERSION, WHAT)
(   1,<2013-07-18 16:12:13.968 -0700>,<Administrator>,<X>,<go>,<TOPSPIN 2.1>,
      <created by zg
	started at 2013-07-18 16:11:07.515 -0700,
	POWCHK enabled, PULCHK disabled,
       configuration hash MD5:
       C8 4E 4E 5D D3 5C D8 9E 9F 52 82 E0 59 8A DE 15
       data hash MD5: 64K
       FC C8 62 58 F9 9E 06 32 BE 47 7E 72 FA 9B AD D7>)
(   2,<2013-07-18 16:12:16.749 -0700>,<Administrator>,<X>,<proc1d>,<TOPSPIN 2.1>,
      <Start of raw data processing
       efp LB = 0 FT_mod = 6 PKNL = 1 PHC0 = 0 PHC1 = 0 SI = 32K 
       data hash MD5: 32K
       1F 18 74 07 C8 E4 19 5C 11 B1 53 F6 49 FE F5 7A>)
(   3,<2013-07-18 16:12:17.030 -0700>,<Administrator>,<X>,<proc1d>,<TOPSPIN 2.1>,
      <pk PHC0 = 98.28918 PHC1 = 0 
       data hash MD5: 32K
       35 49 2F D0 5E 69 F9 2C 1D 24 C6 1E D6 16 19 8B>)
(   4,<2013-07-18 16:12:17.124 -0700>,<Administrator>,<X>,<proc1d>,<TOPSPIN 2.1>,
      <abs ABSG = 1 
       data hash MD5: 32K
       09 AE 06 DF 10 A5 67 5B FE D7 CB F4 E8 7E CE 8F>)
(   5,<2013-07-18 16:12:17.186 -0700>,<Administrator>,<X>,<proc1d>,<TOPSPIN 2.1>,
      <abs ABSG = 2 
       data hash MD5: 32K
       AA 3D 14 7A FF 5A A8 71 E7 FA 91 8D A4 C5 4B 89>)
(   6,<2013-07-18 16:12:17.249 -0700>,<Administrator>,<X>,<proc1d>,<TOPSPIN 2.1>,
      <abs ABSG = 3 
       data hash MD5: 32K
       14 25 D7 56 00 07 19 43 C1 0E 1F 98 1D A0 37 50>)
(   7,<2013-07-18 16:12:17.311 -0700>,<Administrator>,<X>,<proc1d>,<TOPSPIN 2.1>,
      <abs ABSG = 4 
       data hash MD5: 32K
       84 F3 96 32 70 28 73 8F 37 ED F9 FE 91 66 30 D7>)
(   8,<2013-07-18 16:12:17.343 -0700>,<Administrator>,<X>,<proc1d>,<TOPSPIN 2.1>,
      <abs ABSG = 5 
       data hash MD5: 32K
       95 3A B8 39 A7 C3 F4 70 1B A0 DE 0B C6 3F 0C BD>)
$$ ##END=
$$ 
$$ $$ hash MD5
$$ $$ E3 43 52 98 C4 F0 B0 91 7F 59 74 56 6C AB 30 0E
##$RELAX= 
##$RELAX= 
##$RELAX= 
##$RELAX= 
##$RELAX= 
##$RELAX= 
##$RELAX= 
$$ Bruker specific parameters
$$ --------------------------
##$DU= <E:\>
##$EXPNO= 30
##$NAME= <AC1469_13FE002651_8026970_5drCmvS8Dh>
$$ [...]
150 150 150 150 150 150 150 150
##$TP07= 0
##$TPNAME0= <>
##$TPNAME1= <>
##$TPNAME2= <>
##$TPNAME3= <>
##$TPNAME4= <>
##$TPNAME5= <>
##$TPNAME6= <>
##$TPNAME7= <>
##$TPOAL= (0..7)
0.5 0.5 0.5 0.5 0.5 0.5 0.5 0.5
##$TPOFFS= (0..7)
0 0 0 0 0 0 0 0
##$TUNHIN= 0
##$TUNHOUT= 0
##$TUNXOUT= 0
##$USERA1= <user>
##$USERA2= <user>
##$USERA3= <user>
##$USERA4= <user>
##$USERA5= <user>
##$V9= 5
##$VALIST= <valist>
##$VCLIST= <CCCCCCCCCCCCCCC>
##$VD= 0
##$VDLIST= <DDDDDDDDDDDDDDD>
##$VPLIST= <PPPPPPPPPPPPPPP>
##$VTLIST= <TTTTTTTTTTTTTTT>
##$WBST= 1024
##$WBSW= 4
##$XGAIN= (0..3)
0 0 0 0
##$XL= 0
##$YL= 0
##$YMAX_a= 649522
##$YMIN_a= -552864
##$ZGOPTNS= <>
##$ZL1= 120
##$ZL2= 120
##$ZL3= 120
##$ZL4= 120
##$ABSF1= 14.98509
##$ABSF2= -5.573092
##$ABSG= 5
##$ABSL= 3
##$ALPHA= 0
##$AQORDER= 0
##$ASSFAC= 0
##$ASSFACI= 0
##$ASSFACX= 0
##$ASSWID= 0
##$AUNMP= <proc_prof1d_extract_pilot.lims>
##$AXLEFT= 0
##$AXNAME= <>
##$AXNUC= <1H>
##$AXRIGHT= 0
##$AXTYPE= 0
##$AXUNIT= <>
##$AZFE= 0.1
##$AZFW= 0.1
##$BCFW= 0
##$BC_mod= 0
##$BYTORDP= 0
##$COROFFS= 0
##$CY= 15
##$DATMOD= 1
##$DC= 0
##$DFILT= <>
##$DTYPP= 0
##$F1P= 0
##$F2P= 0
##$FCOR= 0.5
##$FTSIZE= 32768
##$FT_mod= 6
##$GAMMA= 0
##$GB= 0
##$INTBC= 1
##$INTSCL= 1
##$ISEN= 128
##$LB= 0
##$LEV0= 0
##$LPBIN= 0
##$MAXI= 10000
##$MC2= 0
##$MEAN= 0
##$ME_mod= 0
##$MI= 0
##$NCOEF= 0
##$NC_proc= -8
##$NLEV= 6
##$NOISF1= 0
##$NOISF2= 0
##$NSP= 0
##$NTH_PI= 0
##$NZP= 0
##$OFFSET= 14.98509
##$PC= 1
##$PHC0= 98.28918
##$PHC1= 0
##$PH_mod= 1
##$PKNL= yes
##$PPARMOD= 0
##$PPDIAG= 0
##$PPIPTYP= 0
##$PPMPNUM= 2147483647
##$PPRESOL= 1
##$PSCAL= 4
##$PSIGN= 0
##$PYNMP= <proc.py>
##$REVERSE= no
##$SF= 400.02
##$SI= 32768
##$SIGF1= 0
##$SIGF2= 0
##$SINO= 400
##$SIOLD= 32768
##$SPECTYP= <>
##$SREGLST= <1H.CDCl3>
##$SSB= 0
##$STSI= 32768
##$STSR= 0
##$SW_p= 8223.68421052631
##$SYMM= 0
##$S_DEV= 0
##$TDeff= 65536
##$TDoff= 0
##$TI= <>
##$TILT= no
##$TM1= 0
##$TM2= 0
##$TOPLEV= 0
##$USERP1= <user>
##$USERP2= <user>
##$USERP3= <user>
##$USERP4= <user>
##$USERP5= <user>
##$WDW= 1
##$XDIM= 32768
##$YMAX_p= 442506650
##$YMIN_p= -645858
##$CURPLOT= <Network HP LaserJet P1505>
##$CURPRIN= <$Network HP LaserJet P1505>
##$DFORMAT= <normdp>
##$LAYOUT= <+/1D_H.xwp>
##$LFORMAT= <normlp>
##$PFORMAT= <normpl>
##$SURQMSG= 1
$$ End of Bruker specific parameters
$$ ---------------------------------
##NTUPLES= NMR SPECTRUM
##VAR_NAME=  FREQUENCY,     SPECTRUM/REAL,   SPECTRUM/IMAG
##SYMBOL=    X,             R,               I
##VAR_TYPE=  INDEPENDENT,   DEPENDENT,       DEPENDENT
##VAR_FORM=  AFFN,          ASDF,            ASDF
##VAR_DIM=   32768,         32768,           32768
##UNITS=     HZ,            ARBITRARY UNITS, ARBITRARY UNITS
##FACTOR=    0.250966925370066, 1,           1
##FIRST=     8223.43324360094, 80843,        -106531
##LAST=      0,             205942,          -126769
##MIN=       0,             -645858,         0
##MAX=       8223.43324360094, 442506650,    0
$$ Real data points
##PAGE= N=1
##DATA TABLE= (X++(R..R)), XYDATA
$$ [...]
$$ plain form
19518 -117577 59782 84918 134054 94813 -97628 -420551 157601 110406 -24718 -214481 -22778
19506 86069 -64307 -292472 2326 -281662 -110537 -120077 188401 74179 -92923 68421 -88708
19494 94048 7317 339263 -281918 -57916 -46766 161554 -71077 -36886 41578 157951 -213175
19482 28303 21673 132771 -274957 -191719 79684 -45951 -173387 -315824 -55377 -56408 -232201
19471 -232201 -191694 -118683 -23358 -225330 -5782 -69841 -277219 -129700 244809 -105692 -78777
19460 -78777 -48162 -113236 56916 80075 -187507 -182229 -199422 -108460 -296931 -35633 -191662
19449 -191662 -104773 25474 -227743 -143603 -114471 -118299 -315987 -442490 -4777 -159225 146438
19437 -150977 -93408 -222114 -78753 268390 12052 -131612 -3268 -211164 -29623 -360207 172793
$$ packed form
19518a17577E9782K5136M9136l9241i7628l22923A57601m7195b4718j89763b2778
19506H6069f4307k28165B326b81662a10537r540A88401G4179i2923F8421h8708
19494I4048G317L31946b81918e7916J1150A61554g1077L4191D1578J16373b13175
19482B8303o630J11098b74957Q3238G9684d5951j27436j42437e5377j031j75793
19471b32201M0507P3011b3358k01972e782o4059k07378a29700B44809a05692K6915
19460g8777L0615o5074E6916K3159a87507N278j7193R0962j88471c5633j56029
19449a91662Q6889B5474b27743Q4140K9132l828j97688j26503d777j54448A46438
19437a50977N7569j28706g8753B68390A2052a31612c268k07896b9623l30584A72793
$$ plain form
19425 -340158 127951 -239540 -208174 -28811 -127350 86694 -141261 18115 -227508 -243366 -48823
19413 -252376 24630 -149624 77717 235368 21348 -37489 -24158 -31559 -15972 61387 11252
19401 -99713 23601 100678 -16799 57997 -28649 -121464 -161396 295113 -40765 362307 -174583
19389 -100512 -175563 57476 -314689 86613 -340876 104359 21268 29670 94426 256664 440296
19378 440296 -141502 -26531 -80893 242786 136896 90146 -41672 37637 -232252 -331018 -422871
19367 -422871 -297156 -588879 -54330 -220933 -74634 250581 464608 -74608 48860 -36401
19356 -111431 42633 153798 -385902 -169427 -239785 -551028 -25522 -203738 -289931 -100886
19345 177099 -235439 -165939 230710 71655 -151091 -350740 -38569 -142457 173341 -404571
$$ packed form
19425c40158A27951b39540L1366b8811r8539H6694a41261A8115b27508j5858d8823
19413b52376B4630a49624G7717J57651B1348c7489J3331p401J5587F1387A1252
19401i9713B3601P7077a6799E7997b8649r2815l9932B95113d0765C62307a74583
19389a00512p5051E7476c14689H6613c40876A04359B1268Q402O4756J62238J83632
19378D40296a41502b6531n4362B42786j05890m6750d1672C7637b32252r8766r1853
19367d22871J25715k91723e4330j66603g4634B50581K14027g4608D8860c6401
19356a11431D2633J11165c85902a69427p0358l11243b5522j78216q6193a00886
19345A77099b35439O9500B30710G1655a51091j99649c8569j03888A73341d04571
$$ plain form
19334 -254033 289712 -150576 -162575 237660 -122945 -98744 -144381 -111475 -73438 -331712
19324 -331712 142237 27679 -33798 -343017 -153594 80906 52629 -95917 259851 -161699
19313 35908 -77696 -121749 -191860 -35362 -201270 41987 177447 93170 -115156 225754 -20292
19301 -89893 -195054 -30242 -241971 -36012 389229 -27720 -117169 -97379 -59593 -74525 111200
19289 -289613 -324783 84409 255700 48808 62308 -138659 -76716 123441 28272 -69086 -240035
19278 -240035 -190950 -94518 -278184 284015 -58700 -56781 55094 -164176 -37202 -68500 -179742
19267 -179742 26402 -306291 -218510 155657 -62340 -40515 -207278 -288971 -22514 -817 -107582
19256 -107582 -186267 -318868 -304889 -426439 -22840 27070 -391866 27361 128311 58733 77405
$$ packed form
19334b54033B89712a50576j1999B37660a22945K4201m5637L2906L8037k58274
19324c31712A42237B7679c3798l09219a53594H0906k8277i5917B59851a61699
19313C5908g7696m4053p0111c5362j65908D1987J35460q4277a15156B25754b0292
19301h9893j05161c0242k11729c6012C89229b7720q9449J9790L7786j4932A11200
19289b89613l5170H4409J71291D8808J3500a38659O1943A23441B8272f9086j70949
19278b40035M9085i4518j83666B84015e8700J919E5094a64176c7202l1298j11242
19267a79742B6402c06291Q7781A55657f2340K1825j66763q1693b2514h17j06765
19256a07582p8685j32601J3979j21550b2840B7070c91866B7361J00950E8733J8672
$$ plain form
19245 77405 -65455 -114327 108331 -291246 68945 -39494 -13485 -137855 224706 48021 139379
19234 139379 -43572 512621 147128 -60887 -89870 -352287 243401 -116217 8735 -131068
19223 -384151 -21515 -217542 -115987 108451 -20456 37594 -216261 198037 87453 -175438
19212 -61094 66803 -42684 228514 -486164 125929 -277617 34345 -362208 -243403 163788
19201 -182758 40110 258079 -204686 -41944 93076 -87246 -4790 -198499 -261400 -81000 -203413
19190 -203413 79538 -593393 -84368 61854 -77039 -199719 103224 30427 -214491 -201714 -34516
19178 -164934 218064 -12457 -76283 -263042 78015 -101220 118272 212393 -137107 115620
19167 -299761 -21803 64504 -401860 -219537 -30507 -323488 -88124 -55104 21418 64458 -221059
$$ packed form
19245G7405f5455m8872A08331b91246F8945c9494a3485j24370B24706D8021R1358
19234A39379d3572E12621A47128f0887k8983k62417B43401a16217H735a31068
19223c84151b1515j96027J01555A08451b0456C7594b16261A98037H7453a75438
19212f1094F6803d2684B28514d86164A25929b77617C4345c62208J18805A63788
19201a82758D0110K17969b04686d1944I3076h7246d790j93709o2901h1000j22413
19190b03413G9538e93393h4368F1854g7039j22680A03224C0427b14491J2777c4516
19178a64934B18064a2457o3826j86759G8015a01220A18272R4121a37107A15620
19167b99761b1803F4504d01860J82323c0507k92981h8124L3020B1418M3040b21059
$$ plain form
19155 37378 127580 49895 -185718 -63008 59033 -288893 140001 177980 -78809 -23571 -6100
19143 -297120 9255 -512751 -77713 -270045 -252597 -96912 71525 -118775 -68985 -228797 55385
19131 200941 173164 363262 -127684 64639 -377474 80342 -217793 95478 -173275 -255919
19121 -255919 411956 8848 194671 -177351 -18381 -65180 -152552 -56770 49998 275350 -8353
19109 -196383 -138084 -65477 -25511 -226371 208299 -45236 -29963 58155 -76238 -147504 -121190
19098 -121190 99264 -17409 69136 -288598 -314 -181563 366211 -51625 241445 -4219 -319111
19087 -319111 -121758 50344 -273820 -316628 -127136 -204828 -126456 142110 137316 -156436 175420
19075 -3046 209575 -63521 -19940 -266652 48036 -171623 5227 48763 -23272 14819 -254772
$$ packed form
19155C7378R0202D9895a85718f3008E9033b88893A40001L7979g8809b3571f100
19143b97120I255e12751g7713j92332J7448i6912G1525a18775M9790j59812E5385
19131B00941k7777J90098a27684F4639c77474H0342b17793I5478a73275q2644
19121b55919D11956H848J85823a77351a8381m6799q7372e6770D9998K25352h353
19109a96383N8299f5477b5511k00860B08299d5236J5273E8155g6238p1266K6314
19098a21190I9264a7409F9136b88598c14j81249C66211e1625B41445d219l14892
19087c19111a21758E0344b73820m2808a27136p7692P8372A42110m794a56436A75420
19075c046B09575f3521a9940k46712D8036a71623E227M3536b3272A4819b54772
$$ plain form
19063 -95089 -156141 -262904 -148506 -416264 40388 82466 134035 24242 11977 117127 -189828
19051 148028 92801 -43488 86079 -130705 -10738 -165315 -306689 140055 61590 61849 110950
19040 110950 345928 145412 -254003 175112 -46616 -94698 -5074 43001 -263605 148997
19029 180842 301586 53689 76781 -161137 29722 221011 103390 90895 -263672 -317888
19019 -317888 145369 -43333 115857 172626 84571 -57601 -31272 -102314 -163982 137046 -70084
19007 -137621 -64739 80989 -111458 -199650 -190422 -316281 59522 -130321 388886 119830 -157124
18995 78150 322698 -158765 -41841 61847 52895 256162 88967 -142260 167283 -170027 254988
18983 260066 -232363 45638 336646 14117 -73199 -116728 -384922 136273 -286019 -143628
$$ packed form
19063i5089o1052j06763J14398k67758D0388M2078N1569B4242A1977J05150a89828
19051A48028n5227d3488H6079a30705a0738j54577j41374A40055F1590K59M9101
19040A10950K34978A45412b54003A75112d6616m8082e074D3001b63605A48997
19029A80842J20744E3689K3092a61137B9722J91289A03390j2495b63672n4216
19019c17888A45369d3333A15857N6769H4571e7601K6329p1042o1668A37046g0084
19007a37621f4739H0989a11458q8192R228j25859E9522a30321C88886A19830a57124
18995G8150K44548a58765d1841F1847q952K03267H8967a42260A67283a70027B54988
18983B60066b32363D5638K91008A4117g3199m3529k68194A36273b86019J42391
$$ plain form
18973 -143628 209393 -27011 81700 128269 -312008 -200170 26280 -182264 -157132 182821
18962 -1480 92383 -303793 -181804 -178294 -221674 60137 -28784 -324823 -237459 -66345 -22638
18950 -452754 -307010 278606 182526 146277 -52173 63665 -183901 98725 -159007 -85094 -184403
18939 -184403 -418260 -149418 300103 -101437 158571 -138579 108451 -239907 22634 -220180
18928 275291 272395 -34437 -350658 40482 -2172 -266314 -293841 -61064 7489 55795 -490441
18916 54820 -12444 177598 -237596 -138832 -22932 2570 47759 -121681 -400147 -139575 -108917
18905 -108917 -202428 44813 -339158 -103782 -36084 109345 -102256 32735 243576 -121238
18894 -58089 -91984 -110512 184483 -280740 -179980 -286984 -35901 140457 47170 -266883
$$ packed form
18973a43628B09393b7011H1700M6569c12008J11838B6280a82264K5132A82821
18962a480I2383c03793J21989L510m3380F0137b8784k96039Q7364f6345b2638
18950d52754J45744B78606r6080l6249e2173F3665a83901I8725a59007P3913r9309
18939a84403k33857a49418C00103a01437A58571a38579A08451b39907B2634b20180
18928B75291k896c4437l16221D0482b172k64142k7527f1064G489M8306d90441
18916E4820a2444A77598b37596R8764b2932B570M5189a21681k78466a39575L0658
18905a08917r3511D4813c39158a03782c6084A09345a02256C2735K10841a21238
18894e8089l3895j8528A84483b80740J00760j07004c5901A40457D7170b66883
$$ plain form
18883 -52696 -113545 88689 35941 -70966 -101185 -23066 -42865 -31675 -27506 111170 163799 -111541
18870 -298755 146113 -276054 -211634 63547 -165793 7262 155308 91455 -22706 -148755 -2588
18858 -315439 61652 -91263 3439 191523 -241365 -23969 247565 352460 287353 -269955 20956
18846 -194992 -317291 -16915 47294 76171 -203042 -56492 -107232 -4724 -192378 -246068 -471170
18835 -471170 -66131 -159235 -260567 -79261 -295965 -332229 -243730 -399772 186171 -214162
18824 -228956 -10582 -238381 66863 217419 360848 204401 -264035 35310 356303 16132
18813 132104 -21671 171074 237867 -56328 19216 186741 -33689 -210014 -80208 200067 104830
18802 104830 357967 -421553 114449 -332298 72014 167873 -26322 -382781 230137 -76933
$$ packed form
18883e2696o0849H8689C5941g0966l0219b3066j9799J1190M169A11170N2629a11541
18870b98755A46113b76054O4420F3547a65793G262J48046o3853b2706j26049b588
18858c15439F1652i1263C439J88084b41365b3969B47565J04895o5107b69955B0956
18846a94992j22299a6915D7294K8877b03042e6492n0740d724j87654n3690k25102
18835d71170f6131r3104j01332g9261k16704l6264Q8499j56042A86171b14162
18824b28956a0582k27799F6863J50556J43429j56447b64035C5310L20993A6132
18813A32104b1671A71074O6793e6328A9216J67525c3689j76325h0208B00067r5237
18802A04830K53137d21553A14449c32298G2014R5859b6322l56459B30137g6933
$$ plain form
18791 -140378 96003 -80719 -48389 49355 4411 1934 199073 -154651 220665 109728 -222458
18779 -217559 -85149 -30521 -48821 -98237 -54091 25673 -19939 -40821 48322 -119163 110275
18767 -114640 -66378 48764 -208146 -116851 -145383 162877 -81174 31134 179983 -155513 149172
18755 -14519 -443790 11069 69527 -7565 58764 -71788 -47117 91879 -56060 141225 -93056
18743 -25977 -4275 -193516 92863 -81684 102086 156702 -23492 -299654 51523 -26725 79597
18731 -12079 -456993 -38382 -74116 158500 -46667 -89895 515 -206705 -162407 -258051 111180
18719 -177578 3181 247271 -253306 -132189 -52920 -212634 -37664 -373786 -302525 -251750 -87469
18707 335037 142783 -216187 -57163 -187778 34873 -105617 -113452 -149412 5685 -105288 -5278
$$ packed form
18791a40378I6003h0719L2330D9355D411A934J97139a54651B20665A09728b22458
18779b17559h5149c0521j8300m9416M4146B5673a9939k0882D8322a19163A10275
18767a14640M8262D8764b08146R1295k8532A62877h1174C1134J48849a55513A49172
18755a4519m29271A1069N8458g565E8764g1788K4671I1879e6060A41225i3056
18743b5977d275j89241I2863h1684A02086N4616b3492k76162E1523b6725G9597
18731a2079m44914c8382l5734A58500d6667m3228E15b06705M4298r5644A11180
18719a77578C181K44090b53306J21117e2920j59714c7664l36122P1261N0775h7469
18707C35037A42783b16187e7163j30615C4873a05617p835l5960E685a05288e278
$$ plain form
18695 4938 -118207 129987 103421 -377511 159941 60216 134194 246636 -355834 32094 -385681
18683 -149947 -161196 -147683 -85974 -186645 54689 74390 156883 -75220 213415 -110551 -230932
18672 -230932 73459 -100838 -208987 -48271 -295053 40901 -191779 -189369 -180979 -498983 106509
18660 -204164 10912 -66875 225982 -65285 -211040 -294373 -134638 188164 29693 -256185
18649 -322074 -185121 -5005 204350 -140204 -233771 -119765 -483720 17194 -182161 47311
18638 -517642 -68449 41165 -221601 216727 276059 267696 -42709 186667 -67363 -555465 -127719
18626 127927 -137668 39398 -113061 -59287 -156719 -80990 143570 -125768 -242236 35144
18615 -9775 -154311 -135206 -11642 -272833 -68232 -71339 -9965 -121141 1978 -237336 -136207
$$ packed form
18695D938a18207A29987k6566c77511A59941F0216P3978J12442c55834C2094c85681
18683a49947j1249J3513O1709j00671E4689J9701Q2493g5220B13415a10551j20381
18672b30932G3459a00838j08149d8271k46782D0901a91779K410Q390l18004A06509
18660b04164A0912f6875B25982f5285j45755q3333a34638A88164B9693b56185
18649c22074J36953e005B04350a40204r3567J14006l63955A7194a82161D7311
18638e17642f8449D1165b21601B16727N9332q363d2709A86667f7363m88102a27719
18626A27927a37668C9398a13061N3774r7432P5729A43570a25768j16468C5144
18615i775j44536J9105a1642k61191f8232l107i965j11176A978b37336J01129
$$ plain form
18604 -136207 -112604 6051 65105 -296968 -279802 -250172 -80754 -325664 -115420 220201 -12461
18592 -176133 -18859 -131762 45007 -88765 -17992 -117118 152971 -124874 -239381 -62807 -135543
18581 -135543 315424 266479 -259655 111927 -118316 306391 -123993 134527 -34619 99428
18570 7773 58228 -226155 72463 95056 -345042 31766 -103393 -121118 -361045 -106491 -83207
18559 -83207 -162548 -9555 -163011 -140055 -120790 283238 2824 27095 -93632 -78452 -75707 -76451
18547 -76451 101743 -17622 -224488 -125308 188961 -11929 -47245 17505 -172347 -313878 -226074
18536 -226074 -352643 -133922 62619 -271716 -178976 -76773 -211924 93025 81413 -458812
18525 -305787 -589188 -5042 -373942 -61195 27760 174304 -252684 265173 -171526 -69825
$$ packed form
18604a36207K3603F051N9054b96968J7166K9630h0754k44910a15420B20201a2461
18592a76133a8859j12903D5007h8765a7992r9126A52971a24874j14507f2807p2736
18581a35543C15424m8945b59655A11927a18316C06391a23993A34527c4619I9428
18570G773N0455b26155G2463K2593c45042C1766a03393j7725k39927a06491K3284
18559h3207p9341i555j53456K2956J9265B83238B824K4271i3632J5180K745p44
18547g6451A01743a7622k06866R9180A88961a1929l5316A7505a72347j41531Q7804
18536b26074j26569a33922F2619b71716R2740g6773j35151I3025j1612d58812
18525c05787k83401e042l68900f1195B7760J46544b52684B65173a71526f9825
$$ plain form
18514 -5955 -166912 -238468 -149745 140765 -242482 36709 -8531 -403720 -95101 -120715 -226630
18503 -226630 40821 75211 67070 -10886 56040 -12338 331152 -36544 3291 -210264 -87162
18491 -444788 -57370 395673 55307 -122956 229151 -143080 -175158 335115 -45535 -249147
18481 -249147 -30003 -71956 128345 208765 125271 -350532 -321690 -125206 144344 46597 231547
18470 231547 10225 -326980 -84946 -158498 -51716 -180134 -39599 -216458 -208895 -95808 2725
18458 -271375 -159537 72209 -148332 5352 2072 -16532 79806 -169202 -197342 192414 111011
18447 111011 142927 -184706 32745 -37377 -11367 -374404 48781 -49067 -461105 -14992 73640
18435 163181 391394 -237620 -19445 -270992 -117057 -136466 -27411 32613 -272330 75228
$$ packed form
18514e955j60957p1556Q8723A40765b42482C6709h531l95189i5101k5614j05915
18503b26630D0821L4390q141a0886E6040a2338C31152c6544C291b10264h7162
18491d44788e7370C95673E5307a22956B29151a43080l2078C35115d5535k03612
18481b49147c0003m1953A28345Q0420q3494c50532K8842a25206A44344D6597J84950
18470B31547A0225c26980h4946p3552e1716j28418c9599j76859P563i5808B725
18458b71375J11838G2209a48332E352B072a6532G9806a69202k8140A92414q1403
18447A11011L1916a84706C2745c7377a1367l63037D8781d9067m12038a4992G3640
18435A63181K28213b37620a9445k51547a17057j9409b7411C2613b72330G5228
$$ plain form
18424 -7737 -91370 -75328 -171017 24981 -126984 37607 -24543 -286040 -70457 -91288 100079
18412 274608 160200 158971 128849 -124270 239685 -243398 64335 -69723 -175430 136033
18401 -17976 -276788 -85302 -56568 51587 450413 47610 -58671 324979 115578 -153164 18861
18389 343627 106827 -202367 5764 42271 223477 -261590 286992 -169661 103529 -137564
18378 28193 -98773 81996 303003 -6121 -337534 -154252 215267 73572 3829 -202793 219246
18366 156515 -11626 -313351 -8976 31391 164155 -46859 58365 37 78782 -301612 -178855
18355 -178855 -168779 -96844 -121165 -198322 17101 18634 92995 109724 58766 -305197 -7138 -119379
18343 -119379 -3774 -116546 -157992 -256264 -84901 -69110 -99467 108100 -36274 -53675 -18764
$$ packed form
18424g737q3633J6042r5689B4981a26984C7607b4543k61497g0457k0831A00079
18412B74608j14408j229l0122a24270B39685b43398F4335f9723j05707A36033
18401a7976k58812h5302K8734E1587L98826D7610e8671C24979A15578a53164A8861
18389C43627A06827b02367E764L6507J81206b61590B86992a69661A03529a37564
18378B8193i8773H1996K21007f121l31413a54252B15267G3572C829b02793B19246
18366A56515a1626l01725h976C1391J32764d6859E8365C7P8745c01612J22757
18355a78855J0076P1935k4321p7157A7101J533P4361J6729n0958c05197g138j12241
18343a19379c774j12772m1446r8272h4901J5791l0357A08100c6274j7401a8764
$$ plain form
18331 15859 117427 -68182 -55153 74485 103168 -111366 -36618 144852 -140690 -50738 17784
18319 -9668 111297 282322 -141238 311513 -168303 -127126 -23766 34925 -17051 -168419 -349251
18308 -349251 -7361 -403381 64908 -29055 -179069 233246 118257 49507 -288991 -473123
18298 -473123 4285 -134474 154509 110005 36777 -239873 -121430 -209418 -113974 49355 -72813
18286 145550 -21589 -186674 77089 23954 -46949 -105799 -77117 58116 95502 -128912 -151584
18275 -151584 142693 298839 189590 -71349 -203077 -188477 -61514 -69905 180499 -168350
18264 255341 -116682 273945 -203207 190611 8721 54364 -81319 -225420 202985 -58603
18253 -77654 -5432 46195 -263598 39708 -117309 -50057 -178626 -120664 29372 -305976 -209891
$$ packed form
18331A5859J01568f8182J3029G4485K8683a11366c6618A44852a40690e0738A7784
18319i668A11297J71025a41238C11513a68303M1177b3766C4925a7051j51368j80832
18308c49251g361l96020F4908b9055j50014B33246j14989D9507b88991j84132
18298d73123D285a34474A54509m4504C6777b39873J18443q7988R5444D9355g2813
18286A45550b1589j65085G7089B3954d6949n8850K8682E8116L7386a28912k2672
18275a51584A42693J56146j09249g1349j31728J4600f1514q391A80499a68350
18264B55341a16682B73945b03207A90611H721M5643h1319j44101B02985e8603
18253g7654e432D6195b63598C9708a17309e0057j28569N7962B9372c05976R6085
$$ plain form
18242 -209891 199794 117201 -191482 -221757 -61181 -78256 -309350 73081 -154047 -150207 -181480
18231 -181480 41370 -127146 93485 113984 -87124 -55908 -74903 2491 -60959 13777 119929
18220 119929 139003 160805 -178065 93370 -151465 -80009 -120520 -71893 218921 -134603 -300094
18209 -300094 -120333 -10157 207756 -119359 234618 -210986 161656 -255256 -137689 -103299
18199 -103299 -64619 -33008 -2942 -215377 -74707 166767 8910 54978 -59990 -110761 82732
18187 -336729 75296 200995 105772 -75804 106746 65810 -28551 221304 321660 81071 -134290
18175 22648 -277767 175655 -56810 -142915 -335096 -94033 -129454 236155 -157451 29123 -159064
18163 90969 -191487 8192 -156080 -284050 -120498 92355 145073 168781 -12496 -72570 117018
$$ packed form
18242b09891A99794q2593a91482l0275f1181j7075k31094G3081a54047L840l1273
18231a81480D1370a27146I3485K0499h7124L1216j8995B491f0959A3777J06152
18220A19929J9074K1802a78065I3370a51465P1456m0511M8627B18921a34603j65491
18209c00094a20333a0157B07756a19359B34618b10986A61656b55256J17567L4390
18199a03299L8680L1611b942k12435g4707A66767H910M6068e9990n0771H2732
18187c36729G5296J25699r5223g5804A06746m0936b8551B21304J00356H1071a34290
18175B2648b77767A75655e6810q6105j92181i4033l5421B36155a57451B9123a59064
18163I0969a91487H192a56080j27970a20498I2355N2718K3708a2496o0074A17018
$$ plain form
18151 133254 -20644 135959 -187728 50611 -122875 -177109 14514 219539 -242284 -215058
18141 -215058 271628 23757 -38061 22986 98064 52260 -112882 -160658 -171698 -98026 110828
18129 -31902 -456700 -151669 -317693 228532 39479 184486 301744 203947 -248700 100387
18118 -29792 51441 49839 -41832 23048 -312082 399046 60861 -236418 -177182 43743 -104609
18106 149634 3628 -273213 -108069 -108432 124787 -8917 -25969 -216622 153182 -228013 -20102
18094 -170104 214603 -271546 401810 -65458 -239915 2237 -130867 65630 106466 44299 28571
18083 28571 -124609 116706 -98014 328992 -79844 -276205 -96711 222309 1945 -60514 -87681
18072 -87681 -51540 253563 156668 -98242 -210714 140701 39025 18230 -104232 149476 57028
$$ packed form
18151A33254b0644A35959a87728E0611a22875n4234A4514K05025b42284K7226
18141b15058B71628B3757c8061B2986P5078m5804a12882m7776j1040P3672A10828
18129c1902m24798a51669j66024B28532C9479J45007J17258r7797b48700A00387
18118b9792E1441j602d1832B3048c12082C99046F0861b36418N9236D3743a04609
18106A49634C628b73213a08069l63A24787h917j7052j90653A53182b28013b0102
18094a70104B14603b71546D01810f5458j74457B237a30867F5630M0836D4299j5728
18083B8571a24609A16706i8014C28992g9844j96361i6711B22309A945f0514k7167
18072h7681L6141B53563r6895i8242j12472A40701C9025A8230a04232A49476E7028
$$ plain form
18060 -365607 106463 -117995 61104 181446 -20724 -59541 209896 106010 -72350 -104404
18050 -104404 -217480 -130071 63251 61950 -101339 -291853 183796 -44516 -285766 126691
18039 408997 231714 49734 100834 -161485 -98141 30519 -384355 -5923 28850 18277 -126317
18027 -371169 120266 229978 -161335 153888 79736 240501 -316797 -68627 -57516 -199463
18017 -199463 313152 -189833 -90213 41533 -166989 77799 -153866 -75978 -125670 303606
18006 37489 -43203 175892 454590 49538 399180 14104 -2072 146198 -265040 16728 -48565
17994 -251104 -297452 -280574 -7347 178308 371801 -173939 -190474 -54737 -184775 -129229 82675
17982 372745 41911 -195251 -185157 2442 -114005 -250182 177172 263090 -84681 -53099 -170112
$$ packed form
18060c65607A06463a17995F1104J20342b0724l8817B09896j03886g2350l2054
18050a04404j13076Q7409F3251j301a01339j90514A83796d4516k41250A26691
18039D08997j77283D9734N1100a61485O3344C0519c84355e923B8850j0573a26317
18027c71169A20266J09712a61335A53888p4152J60765c16797f8627J1111j41947
18017a99463C13152a89833i0213D1533a66989G7799a53866g5978m9692C03606
18006C7489d3203A75892K78698D9538L49642A4104b072A46198b65040A6728d8565
17994b51104m6348J6878g347A78308J93493a73939j6535e4737j30038N5546H2675
17982C72745D1911a95251J0094B442a14005j36177A77172Q5918h4681L1582j17013
$$ plain form
17971 -170112 -379494 34462 -226064 115604 -252647 -185555 -30895 20858 -307495 -116316
17960 47130 -204237 84981 68195 106165 -14194 305316 -208289 -65952 146564 134689 82240
17949 82240 374576 34341 -11626 -68333 -27748 -197836 -146077 -184880 -87629 1088 -48722
17937 2414 -102365 -152670 46538 -80490 -103943 100722 12545 26480 -113776 -10948 -168853
17926 -168853 -15488 -332792 -267224 15439 -216842 34812 -144890 -95856 102081 -123267
17915 -182891 -404397 101499 181395 -97487 -12056 -48310 1064 -99157 168380 59113 -166130
17903 -156518 131382 -122870 -42687 114638 -95798 -406898 113433 -115076 -337232 73310
17892 -14376 -5022 -88381 -23962 -355081 63389 -138715 -133984 163931 -260767 263168 13362
$$ packed form
17971a70112k09382C4462b26064A15604b52647O7092c0895B0858c07495a16316
17960D7130b04237H4981j6786L7970a4194C05316b08289f5952A46564j1875n2449
17949H2240K92336C4341a1626n6707b7748j70088N1759l8803h7629A088d8722
17937B414a02365n0305D6538h0490k3453A00722A2545J3935a13776a0948j57905
17926a68853a5488l17304O5568A5439b16842C4812a44890M9034A02081a23267
17915a82891k21506A01499P9896i7487a2056l6254A064i9157A68380E9113a66130
17903a56518A31382a22870d2687A14638i5798l11100A13433a15076k22156G3310
17892a4376e022q3359b3962l31119F3389a38715M731A63931b60767B63168A3362
$$ plain form
17880 -250263 -53253 -62286 -48613 -84528 -165003 65847 -130835 342744 -158301 209628 10004
17868 -50696 -72022 -151689 158065 16200 117831 128819 -264422 -43384 251981 41087 118029
17857 118029 -97308 292731 164064 99406 56248 124949 -258337 -25197 -411036 -453635 141415
17845 -23981 -282831 -393590 84062 181057 38994 -57096 167272 -135856 278945 117978
17834 -173670 100992 163398 121773 -180606 -239793 6266 -26178 -3485 32942 457306 280723
17823 280723 79923 -101554 111383 -113555 158400 150075 -90781 113162 -128275 -133582 -8398
17811 101487 359737 107320 -31162 76674 -38281 -49463 23328 115014 273493 -115786 -84511
17800 -84511 274606 183051 -7752 -91456 -224196 38519 102995 -17351 -222889 112395 116118
$$ packed form
17880b50263e3253r033J3673l5915q0475F5847a30835C42744a58301B09628A0004
17868e0696k1326p9667A58065A6200J01631J0988b64422d3384B51981D1087P6942
17857A18029i7308B92731j28667o4658m3158O8701b58337b5197l85839m2599A41415
17845b3981k58850j10759H4062R6995C8994e7096A67272a35856B78945A17978
17834a73670A00992O2406m1625a80606n9187F266b6178c485C2942M24364j76583
17823B80723G9923a01554A11383a13555A58400q325i0781A13162a28275n307h398
17811A01487K58250A07320c1162G6674c8281j1182B3328R1686J58479a15786L1275
17800h4511B74606r1555g752q3704j32740C8519O4476a7351k05538A12395L723
$$ plain form
17789 116118 -203777 -142320 80326 7953 -152454 67567 125910 97727 105833 259224 26690
17777 -91595 -150169 -103202 -230302 22296 342258 136556 88089 -212394 94196 -89724 -300289
17766 -300289 -55868 405148 87835 284981 96307 427925 -108932 -271192 182734 97154
17756 97154 -228091 166013 61330 -155175 69822 323123 -217136 -94091 -176505 -3357 342895
17744 -67360 -67004 61020 -10612 -400315 216986 255979 -246330 -95266 250573 -139151 -28404
17732 54022 332670 -235987 222642 -94167 -90854 -324980 103597 -192797 -30186 247085
17721 -66958 -194207 94197 132427 -221331 -125591 -96564 4270 156073 -178641 -234562 -332550
17710 -332550 -66112 259055 48577 201369 -84167 139629 33986 57791 -303200 44459 84253
$$ packed form
17789A16118b03777O1457H0326G953a52454F7567N8343k8183Q106J53391B6690
17777i1595n8574M6967j27100B2296L19962A36556m8467b12394I4196h9724k10565
17766c00289e5868D05148H7835J97146I6307L31618a08932j62260A82734q5580
17756I7154b28091A66013F1330a55175F9822K53301b17136i4091q2414c357C42895
17744f7360L56F1020a0612l89703B16986L8993b46330i5266B50573a39151b8404
17732E4022K78648b35987B22642i4167L313k34126A03597a92797c0186B47085
17721f6958j27249I4197L8230b21331R5740K9027D270J51803a78641n5921r7988
17710c32550f6112B59055D8577J52792h4167A39629C3986K3805c03200D4459L9794
$$ plain form
17699 84253 122682 -371465 -84091 36495 26177 355759 98254 176944 105440 40148 -55321
17687 155591 149323 451740 80079 -228504 35809 7079 38680 63572 318684 -223392 110194
17675 72602 -76520 15585 105404 -307634 13442 -16052 333274 -104256 233847 -70811 83570
17663 -352153 31602 -268973 -44930 76777 -68556 112710 168224 143707 136467 -123919 -292142
17652 -292142 -152489 166036 288145 -54338 92123 -300234 -227871 265157 -24276 140135
17641 78513 -134814 234275 121801 100192 128142 -340074 466290 -67845 -405284 -31411
17630 28902 -212599 212526 -73751 -113020 -29717 -41060 188191 -13260 261785 -165357 -85395
17619 -85395 -126942 52112 15809 50102 -222824 71537 -113946 -36569 -134431 -204329 9063
$$ packed form
17699H4253L8429c71465h4091C6495j0318L29582I8254P8690p1504D0148e5321
17687A55591o268L02417H0079b28504C5809G079L1601K4892K55112b23392A10194
17675G2602g6520A5585Q9819c07634A3442a6052C33274a04256B33847g0811H3570
17663c52153C1602b68973d4930G6777f8556A12710N5514k4517p240a23919j68223
17652b92142J39653A66036J22109e4338I2123c00234P2363B65157b4276A40135
17641G8513a34814B34275j12474k1609K7950c40074D66290f7845l37439c1411
17630B8902b12599B12526g3751l9269b9717j1343A88191a3260B61785a65357P9962
17619h5395m1547E2112A5809L4293b22824G1537a13946c6569r7862o9898I063
$$ plain form
17607 68199 602384 118146 -92875 -79363 195773 159970 61146 227499 -199678 -61528 -237208
17596 -237208 -155633 457772 290348 -128148 141945 -36397 -102909 -116136 40425 191422
17586 191422 194083 94442 222385 211265 98123 -297542 -250243 -83269 271749 -53255 -193309
17575 -193309 -127264 27936 -139785 148799 225900 -272846 49933 233790 -45571 -181736
17565 -181736 13300 256997 -284261 149875 37208 42749 -77012 -116649 -53796 277942 376945
17554 376945 137981 381599 -53616 31510 142578 -71778 -42173 152770 -127496 -419091
17544 -419091 9149 -45766 -256764 9877 21314 173982 104297 56618 111405 -64819 -198524
17533 -198524 -18824 231083 -146137 173955 380252 -175829 31409 -172809 124672 160949
$$ packed form
17607F8199N34185A18146i2875J3512A95773l5803F1146J66353a99678f1528j75680
17596b37208Q1575D57772j67424a28148A41945c6397o6512j3227D0425J50997
17586A91422K661I4442J27943j1120I8123b97542M7299h3269B71749e3255j40054
17575a93309O6045B7936a39785A48799P7101b72846D9933J83857d5571j36165
17565a81736A3300K43697b84261A49875C7208N541g7012l9637e3796B77942R9003
17554C76945A37981K43618e3616C1510J11068g1778K9605A52770a27496k91595
17544d19091I149d5766k10998I877J1437J52668o9685m7679N4787f4819j33705
17533a98524a8824B31083a46137A73955K06297a75829C1409a72809A24672L6277
$$ plain form
17523 160949 39528 219302 -155797 248750 264033 294638 169049 -67670 -176978 -86468
17512 12160 131867 -198337 351262 -128019 144233 -9399 139730 224394 10947 84815 -248509
17500 322135 167054 -209808 206848 -138844 166235 171602 171588 144019 241463 124233 -274023
17488 109941 -31988 -181998 479034 408165 308303 -278430 -219448 199575 16237 242171
17478 242171 271738 -31781 71339 68001 259309 397968 331628 7506 200482 27633 -10320
17466 87102 170796 17428 224992 454296 172086 53404 243944 242359 38320 156313 291779
17455 291779 96586 517214 251710 6543 415811 269057 187917 356350 315277 164394
17445 164394 11688 247511 344417 200323 237557 261242 383184 135768 201130 155565 220272
$$ packed form
17523A60949C9528J79774a55797B48750J5283L0605j25589f7670j09308h6468
17512A2160J19707a98337C51262a28019A44233i399A39730Q4664A0947P3868b48509
17500C22135j55081b09808B06848a38844A66235N367j4k7569R7444j17230b74023
17488A09941c1988j50010D79034p0869r9862b78430N8982A99575A6237K25934
17478B42171K9567c1781G1339l338J91308J38659o6340G506J92976B7633a0320
17466H7102Q3694A7428K07564K29304A72086E3404J90540j585C8320J17993J35466
17455B91779I6586M20628B51710F543M09268j46754q1140J68433m1073j50883
17445A64394A1688K35823R6906j44094L7234K3685J21942A35768O5362m5565O4707
$$ plain form
17434 220272 371851 244366 223857 496026 255666 160098 82376 335850 256530 -74683
17423 -80849 -11079 180396 349397 552690 271086 502756 455416 362259 481895 40072
17412 123880 263570 -13830 63614 -113691 92235 262214 -168370 308918 -12619 8010 96991
17401 96991 79276 23758 236359 128483 269488 -193895 105685 300489 -8968 363734
17390 333698 -5805 145901 188852 286952 406977 207723 251954 273586 -6026 -114929 481739
17378 210410 -32528 -22887 172031 109450 32624 190579 -90919 172832 92638 -80834 -31567
17366 19854 269917 102342 111404 -46793 13892 112647 375239 33454 177381 113048 374873
17355 374873 254986 -13395 217083 99610 -178466 135581 105900 -159753 336488 214287
$$ packed form
17434B20272J51579j27485k0509K72169k40360r5568p7722K53474p9320g4683
17423h0849a1079A80396J69001K03293B71086K31670m7340r3157J19636D0072
17412A23880J39690a3830F3614a13691I2235J69979a68370C08918a2619H010Q8981
17401I6991j7715B3758K12601j07876J41005a93895A05685J94804h968C63734
17390C33698e805A45901M2951R8100J20025j99254M4231K1632f026j08903D81739
17378B10410c2528R641A72031o2581C2624J57955i0919A72832q0194h0834c1567
17366A9854K50063A02342R062d6793A3892R8755K62592C3454J43927o4333K61825
17355C74873j19887a3395B17083I9610a78466A35581k9681a59753C36488j22201
$$ plain form
17345 214287 48215 263104 320560 128427 184732 5650 138469 119706 -9300 12855 81301
17334 81301 245041 341938 -62775 127072 3177 219054 99466 73486 146523 161531 -133206
17322 -4928 84765 -18348 98530 58666 139874 278076 320693 261607 374039 -101097 56548
17310 -42546 185223 133864 -311039 268484 -44022 97360 -75545 172560 119504 -25812 129964
17298 420537 227851 -280506 331575 60497 -47703 127029 -142192 192060 278604 121609
17287 207883 449951 276631 349132 52170 107709 33115 168691 33058 107926 212437 350044
17276 350044 381989 246318 405489 102393 286433 59704 -7180 -104204 163147 338946
17266 338946 50192 356499 234630 20572 221154 99007 180621 299871 162635 443146
$$ packed form
17345B14287D8215K14889N7456A28427N6305E650J32819j8763i300A2855O8446
17334H1301J63740R6897f2775A27072C177K15877I9466k5980P3037J5008a33206
17322d928H4765a8348I8530l9864Q1208J38202M2617n9086J12432a01097E6548
17310d2546A85223n1359c11039B68484d4022I7360g5545A72560n3056b5812A29964
17298D20537j92686b80506C31575F0497d7703A27029a42192A92060Q6544A21609
17287B07883K42068j73320P2501E2170N5539C3115J35576C3058P4868J04511J37607
17276C50044L1945j35671J59171A02393J84040E9704g180r7024A63147J75799
17266C38946E0192L06307j21869B0572K00582I9007Q1614J19250j37236K80511
$$ plain form
17256 443146 440662 82802 328280 105217 193998 297028 279140 74994 -23030 250743 514582
17245 514582 228611 75658 409960 267013 403721 183592 216060 205522 90392 418447
17235 418447 153848 541938 399246 278651 -65749 39336 413831 -40234 241613 356641
17225 356641 252612 -117631 199249 112686 201261 401486 229033 243183 76546 341126
17215 341126 -67914 332782 249017 111870 418653 94778 240191 131689 189548 102345
17205 102345 447685 446974 22029 92979 238959 244486 183715 -28245 65013 185499 609197
17194 609197 104655 465881 -169110 -141777 -54016 163719 139468 273405 325153 296988
17184 296988 439733 161877 178909 444003 506064 432486 193280 310306 151375 -103137
$$ packed form
17256D43146k484H2802K45478A05217Q8781J03030j7888G4994b3030B50743K63839
17245E14582B28611G5658L34302j42947J36708A83592L2468j0538I0392L28055
17235D18447A53848L88090j42692j20595f5749C9336L74495d0234B41613J15028
17225C56641j04029a17631A99249q6563Q8575K00225j72453J4150G6546K64580
17215C41126f7914C32782q3765A11870L06783I4778J45413j08502N7859q7203
17205A02345L45340p11B2029P0950J45980N527o0771b8245F5013J20486M23698
17194F09197A04655L61226a69110K7333e4016A63719k4251J33937N1748k8165
17184B96988J42745A61877J7032K65094O2061p3578A93280J17026A51375a03137
$$ plain form
17173 407329 68452 103151 164979 476579 138547 356041 595669 291337 -24909 292531
17162 215278 317780 251631 370428 155179 38310 33617 311289 328010 178201 507468
17152 507468 -59091 247193 69946 258362 216711 339133 178429 165784 228025 25452 112276
17141 112276 540992 369204 400916 295451 359295 408022 361644 524003 272138 499408
17131 499408 442816 -30544 425029 332989 117301 234818 216763 346664 409473 349348 129108
17119 537494 328353 267240 305351 511397 282642 484892 497997 445076 481980 532479 393569
17108 393569 373399 417243 335462 81710 90813 306010 163973 87613 254228 731203 314560
17096 418638 316750 739806 238749 225055 107209 151651 201055 334480 607594 212965
$$ packed form
17173D07329F8452L4699O1828L11600A38547K17494K39628B91337b4909B92531
17162B15278J02502o6149J18797A55179C8310m693K77672J6721j49809L29267
17152E07468e9091B47193F9946J88416m1651J22422j60704j2645O2241B5452Q6824
17141A12276M28716j71788L1712j05465O3844M8727m6378J62359k51865K27270
17131D99408n6592c0544D25029r2040A17301J17517j8055J29901O2809o0125A29108
17119E37494k09141o1113L8111K06046k28755K02250J3105n2921L6904N0499j38910
17108C93569k0170M3844q1781H1710R103K15197j42037p6360J66615M76975C14560
17096D18638j01888M23056B38749j3694A07209M4442M9404J33425K73114B12965
$$ plain form
17085 296344 304178 406403 351397 594585 567342 701563 326596 250108 442304 557593
17075 557593 302475 199240 584381 255716 560154 328250 412238 861459 366261 572557
17065 572557 455699 351620 628028 431389 407369 423781 424484 428199 342649 484092 517210
17054 517210 999165 641417 375277 513387 549400 498985 571521 767206 635196 535637
17044 535637 512676 606832 859879 593513 289747 416708 726274 489212 614486 278794
17033 420990 568485 487667 616788 735554 598874 609310 467732 598752 867524 443713
17023 443713 436901 325861 364680 592715 460057 728747 339537 743952 777663 593905
17013 593905 244886 539426 824429 321745 681277 611209 549378 875788 845172 485543
$$ packed form
17085B96344P834J02225n5006K43188k7243J34221C26596p6488J92196J15289
17075E57593k55118j03235L85141B55716L04438k31904Q3988M49221C66261K06296
17065E72557j16858j04079K76408j96639k4020J6412P03L715q5550J41443L3118
17054E17210M81955l57748k66140J38110L6013n0415P2536J95685j32010r9559
17044E35637k2961R4156K53047k66366B89747J26961L09566k37062J25274B78794
17033D20990J47495q0818J29121J18766j36680J0436j41578J31020K68772m23811
17023D43713o812j11040L8819K28035j32658K68690C39537M04415L3711j83758
17013E93905B44886K94540K85003C21745L59532p0068o1831L26410l0616l59629
$$ plain form
17003 485543 701151 497522 712538 743591 847639 889514 810992 598806 931656 656960
16993 656960 976851 480304 996276 819826 970587 990932 1068373 804356 996269 886482
16983 886482 1084940 1043607 908216 1063351 911606 769655 955553 782626 630285 894525
16973 894525 824713 950922 781156 1061172 914861 969878 935999 975247 1120373 935722
16963 935722 1108470 879388 1084122 1331042 785734 915935 757460 1101959 1061793 1089469
16953 1089469 1026234 963189 1032489 1308225 1184915 856036 1517443 999260 885791 1049507
16943 1049507 1089928 1321223 1522628 1206566 1139812 1084737 1421010 1247027 1394929 1362739
16933 1362739 1491999 1486501 1542654 1170139 1260591 1394742 1107672 1279386 1106001 1034652
$$ packed form
17003D85543K15608k03629K15016L1053J04048M1875p8522k12186L32850k74696
16993F56960L19891D80304N15972j76450J50761K0345P7441k64017J91913j09787
16983H86482J98458m1333j35391J55135j51745j41951J85898j72927j52341K64240
16973H94525o9812J26209j69766K80016j46311N5017l3879L9248J45126j84651
16963I35722J72748k29082K04734K46920n45308J30201j58475L44499m0166K7676
16953A089469o3235o3045O9300K75736j23310l28879O61407n18183j13469J63716
16943A049507M0421K31295K01405l16062o6754n5075L36273j73983J47902l2190
16933A362739J29260n498N6153l72515R0452J34151k87070J71714j73385p1349
$$ plain form
16923 1034652 1636168 1110510 1321784 1416867 1124577 1656931 1533405 1581181 1459824 1600939
16913 1600939 1320681 1652214 1574697 1698049 1877050 1402654 1675221 1506209 1362056 1638145
16903 1638145 1746183 1512885 1534210 1623517 2158804 1671620 2143295 2011586 2024860 1882901
16893 1882901 1908917 2073801 2304223 2022683 2145576 2344043 2135655 2333517 2413903 2388327
16883 2388327 2074438 2323300 2498853 2548358 2034242 2466792 2738648 2373590 2588342 2373402
16873 2373402 2560348 2660054 2760012 2845170 2636086 2738450 2581194 2763258 3005836 3019767
16863 3019767 2938945 3220291 2851016 3202941 3139237 3007034 3193938 3354961 3540889 3430297
16853 3430297 3200578 3389231 3306407 3656605 3549410 3751100 3739195 3302874 3873136 3965026
$$ packed form
16923A034652O01516n25658K11274R5083k92290N32354j23526M7776j21357J41115
16913A600939k80258L31533p7517J23352J79001m74396K72567j69012j44153K76089
16903A638145J08038k33298K1325Q9307N35287m87184M71675j31709J3274j41959
16893A882901K6016J64884K30422k81540J22893J98467k08388J97862Q0386k5576
16883B388327l13889K48862J75553M9505n14116M32550K71856l65058K14752k14940
16873B373402J86946R9706R9958Q5158k09084J02364j57256J82064K42578J3931
16863C019767q0822K81346l69275L51925o3704j32203J86904J61023J85928j10592
16853C430297k29719J88653q2824L50198j07195K01690j1905m36321N70262R1890
$$ plain form
16843 3965026 3789570 3740882 4138804 4141406 4084368 4029455 4521646 4529121 4596029 4443114 4914439
16832 4914439 4677161 4852466 4764697 4988096 5382635 5649053 5681602 5558025 5601148 5593012
16822 5593012 5795849 5919858 5679420 6207978 6684948 6569023 6578590 6921455 7189132 7152473
16812 7152473 7355163 7300256 7523774 7645607 7934438 8340387 8224589 8478001 8550748 8935255
16802 8935255 9043021 9167841 9500097 9657054 9855438 10197283 10641348 10928899 10895031 11420863
16792 11420863 11951856 12130168 12201936 12621243 13081361 13529690 13740710 14095186 15111697
16783 15111697 15289297 15721333 15895292 16701853 17274825 17338414 18249254 19112651 19332593
16774 19332593 20110219 21073872 21580595 22328019 23633762 24411417 24909909 25915946 26886505
$$ packed form
16843C965026j75456m8688L97922K602n7038n4913M92191P475O6908j52915M71325
16832D914439k37278J75305q7769K23399L94539K66418L2549j23577M3123q136
16822E593012K02837J24009k40438N28558M76970j15925R567L42865K67677l6659
16812G152473K02690n4907K23518J21833K88831M05949j15798K53412P2747L84507
16802H935255J07766J24820L32256J56957J98384L41845M44065K87551l3868N25832
16792A1420863N30993J78312P1768M19307M60118M48329K11020L54476J016511
16783A5111697J77600M32036J73959Q06561N72972O3589R10840Q63397K19942
16774A9332593P77626R63653N06723P47424J305743P77655M98492J006037R70559
$$ plain form
16765 26886505 28407252 29149636 30505831 32118940 33089545 34849519 36315689 37945530
16757 37945530 39718038 41388901 43816957 45999928 47783598 50072693 52846273 55553456
16749 55553456 58514794 61301818 64655401 67983037 71974285 75817276 79962031 84555141
16741 84555141 89258768 94274766 99599119 105194905 110883430 116980144 123322005 129369767
16733 129369767 135590026 142085255 148602976 154540527 160203400 165325464 170610737 174033259
16725 174033259 177181128 179147150 179831487 179958175 178957632 176897724 173956070 170268323
16717 170268323 165590761 160728004 154483074 148581406 142322510 135767526 129243175 122759910
16709 122759910 116645857 110385168 104506277 98959071 93502855 88654841 83787881 79065539
$$ packed form
16765B6886505J520747P42384J356195J613109R70605J759974J466170J629841
16757C7945530J772508J670863K428056K182971J783670K289095K773580K707183
16749E5553456K961338K787024L353583L327636L991248L842991M144755M593110
16741H4555141M703627N015998N324353N595786N688525O096714O341861O047762
16733A29369767O220259O495229O517721N937551N662873N122064N285273L422522
16725A74033259L147869J966022O84337J26688j000543k059908k941654l687747
16717A70268323m677562m862757o244930n901668o258896o554984o524351o483265
16709A22759910o114053o260689n878891n547206n456216m848014m866960m722342
$$ plain form
16701 79065539 74703916 71124382 67400451 63724186 59927223 57167099 54210108 51612674
16693 51612674 49033031 47019762 44633332 42376458 40316807 38970658 36799119 35056667
16685 35056667 33569814 32228121 31011143 29297402 28349174 27557662 26396689 25148264
16677 25148264 24209800 23184034 22425501 21792039 21033958 19910693 19188486 18823254 18192664
16668 18192664 17448784 17068884 16384899 15838119 15483941 14627606 14770708 14161148 13562937
16659 13562937 13188445 13023999 12307663 11687188 11622488 11625567 11213990 10798527 10598893 10127104
16649 10127104 9704286 9776861 9477929 9178582 9150652 9055681 8444103 8588092 8124132 7900940
16639 7900940 7653594 7655165 7707372 7280842 7108151 7201013 6668893 6544324 6634320 6253611
$$ packed form
16701G9065539m361623l579534l723931l676265l796963k760124k956991k597434
16693E1612674k579643k013269k386430k256874k059651j346149k171539j742452
16685C5056667j486853j341693j216978j713741r48228p91512j160973j248425
16677B5148264r38464j025766p58533o33462p58081j123265p22207l65232o30590
16668A8192664p43880l79900o83985n46780l54178q56335J43102o09560n98211
16659A3562937l74492j64446p16336o20475o4700L079m11577m15463j99634m71789
16649A0127104m22818P2575k98932k99347k7930r4971o11578J43989m63960k23192
16639G900940k47346J571N2207m26530j72691R2862n32120j24569Q9996l80709
$$ plain form
16629 6253611 5958852 6034602 6305300 5530623 5691087 5503645 5594623 5278720 5393075 5207661
16619 5207661 5035396 5225368 5099919 4468390 4503090 4812614 4326800 4688492 4281125 4338454
16609 4338454 4385202 4259675 3889019 4063500 3944554 3917578 3973513 3985320 3857868 3553303
16599 3553303 3533139 3690702 3337752 3485103 3427825 3131136 3349598 3138907 3212067 2982946
16589 2982946 3077819 3187823 3113996 2974393 3241252 3061569 3051029 3043138 2627003 2415054
16579 2415054 2702937 2608970 2480307 2752670 2524904 2220785 2241008 2275628 2304026 2455618
16569 2455618 2268509 2513258 2335880 2395281 2113511 2125454 2058800 1824506 2482861 2066299
16559 2066299 2088221 2076351 1952460 1912195 2081537 2170729 1621226 1552204 2073610 1791329
$$ packed form
16629F253611k94759P5750K70698p74677J60464j87442R0978l15903J14355j85414
16619E207661j72265J89972j25449o31529L4700L09524m85814L61692m07367N7329
16609D338454M6748j25527l70656J74481j18946k6976N5935J1807j27452l04565
16599C553303k0164J57563l52950J47351n7278k96689K18462k10691P3160k29121
16589B982946R4873J10004p3827j39603K66859j79683j0540p891m16135k11949
16579B415054K87883r3967j28663K72363k27766l04119K0223L4620K8398J51592
16569B455618j87109K44749j77378N9401k81770J1943o6654k34294O58355m16562
16559B066299K1922j1870j23891m0265J69342Q9192n49503o9022N21406k82281
$$ plain form
16549 1791329 1749037 2000619 1789714 1613912 1961705 1787577 1938061 1573069 1427479 1721676
16539 1721676 1709188 1490256 1671805 1350368 1686798 1718975 1487230 1508977 1429572 1249369
16529 1249369 1456222 1713966 1461927 1623631 1453751 1121492 1380497 1243993 1161730 1260829
16519 1260829 1534893 919291 1433394 1112823 1519896 815534 1463941 1294497 1378597 1303655
16509 1303655 1461137 985938 1105488 865960 1185656 1165224 1177794 1229530 956086 970656
16499 970656 1201711 858994 1156215 1283791 1168092 1075758 1092377 777895 972664 835943
16489 835943 888180 865323 862990 728057 1105222 906155 1120285 1066377 889769 836399 1006852
16478 1006852 1104174 886025 660518 1018665 606856 829739 919144 924334 821176 1009177
$$ packed form
16549A791329m2292K51582k10905j75802L47793j74128J50484l64992j45590K94197
16539A721676j2488k18932J81549l21437L36430L2177k31745K1747p9405j80203
16529A249369K06853K57744k52039J61704j69880l32259K59005j36504q2263R9099
16519A260829K74064o15602N14103l20571M07073p04362O48407j69444Q4100p4942
16509A303655J57482m75199J19550k39528L19696k0432J2570N1736k73444J4570
16499I70656K31055l42717K97221J27576j15699r2334J6619l14482J94769j36721
16489H35943N2237k2857k333j34933L77165j99067K14130n3908j76608n3370J70453
16478A006852R7322k18149k25507L58147m11809K22883Q9405N190j03158J88001
$$ plain form
16468 1009177 538752 782869 791695 576519 908010 833805 1018039 631603 740374 1039615
16458 1039615 905539 1019802 806412 842974 579486 733588 574714 554426 929400 834846
16448 834846 597216 563661 760471 695493 709085 508040 340353 714992 871648 669246
16438 669246 1117748 881697 973487 497308 551275 660920 593843 548617 498125 858645
16428 858645 662309 627094 546617 483280 727106 784170 639831 617827 402706 586262
16418 586262 883831 727215 840921 828628 568130 750088 511855 797259 319704 739646
16408 739646 660069 682859 702529 338209 655629 682348 383417 738126 434236 555360
16398 555360 970820 691531 225834 419286 319143 396375 433763 298042 325473 652213
$$ packed form
16468A009177m70425K44117Q826k15176L31491p4205J84234l86436J08771K99241
16458A039615j34076J14263k13390L6562k63488J54102j58874k0288L74974r4554
16448H34846k37630l3555J96810o4978J3592k01045j67687L74639J56656k02402
16438F69246M48502k36051R1790m76179N3967J09645o7077m5226n0492L60520
16428H58645j96336l5215q0477o3337K43826N7064j44339k2004k15121J83556
16418E86262K97569j56616J13706j2293k60498J81958k38233K85404C19704M19942
16408G39646p9577K2790J9670C38209L17420K6719k98931L54709l03890J21124
16398E55360M15460k79289B25834J93452j00143P7232L7388j35721K7431L26740
$$ plain form
16388 652213 496237 382920 447023 457241 329553 435429 426692 606789 631806 430360
16378 430360 601005 752675 337417 283174 574225 375355 492535 358240 365846 530412
16368 530412 777032 543224 222950 252088 376606 561171 445168 444112 669467 471078
16358 471078 81116 645694 326008 268904 310327 309415 390603 171574 540923 414768 112623
16346 146488 284204 422252 555343 235751 395430 469593 432595 286743 731641 559608
16336 559608 315127 244579 447995 372575 436593 539084 498915 425968 371855 527614 170960
16324 270436 394374 248172 380336 409477 332011 303975 593345 106051 402214 292806
16314 292806 529199 451507 58704 310305 232930 669605 292427 159040 92075 325493
$$ packed form
16388F52213j55976j13317O4103J0218j27688J05876q737J80097K5017k01446
16378D30360J70645J51670C37417n4243K91051j98870J17180j34295P606J64566
16368E30412K46620k33808B22950K9138J24518J84565j16003j056K25355j98389
16358D71078H1116N64578l19686n7104M1423r12Q1188A71574L69349j26155A12623
16346A46488J37716J38048J33091B35751J59679P4163l6998j45852M44898j72033
16336E59608k44481p0548K03416p5420O4018J02491m0169p2947n4113J55759A70960
16324B70436J23938j46202J32164K9141p7466k8036K89370A06051K96163j09408
16314B92806K36393p7692E8704K51601p7375M36675B92427j33387o6965K33418
$$ plain form
16304 325493 102194 197315 518922 366137 360460 398663 274290 62663 169614 554621
16294 554621 263900 304318 652357 94558 195005 75397 475156 321558 492326 56568
16283 379689 377050 511997 433959 336885 79441 -47388 353891 -34859 464840 246607 412440
16272 412440 169965 212738 387008 171645 361670 -80379 311818 -219285 127807 -101748
16261 193124 591111 163701 223677 194331 74515 682456 227121 165228 363596 203788
16251 203788 106154 417817 284388 207381 352628 177087 350338 609167 162864 110579
16241 110579 347700 65376 203372 220760 279512 33097 157438 322186 148687 23278
16230 142928 60018 175722 -62143 63793 27664 447585 -1022 -32460 196762 641143 530612
$$ packed form
16304C25493A02194R5121L21607j52785n677L8203j24373F2663J06951L85007
16294E54621B63900M0418L48039I4558J00447G5397L99759j53598J70768E6568
16283C79689k639J34947p8038r7074G9441d7388C53891c4859D64840k18233J65833
16272D12440A69965M2773J74270A71645J90025h0379C11818b19285A27807a01748
16261A93124L97987A63701N9976k9346G4515O07941B27121o1893J98368j59808
16251B03788r7634L11663j33429p7007J45247j75541J73251K58829A62864n2285
16241A10579K37121F5376J37996J7388N8752C3097J24341J64748A48687B3278
16230A42928F0018J15704f2143F3793B7664M19921a022l1438A96762M44381j10531
$$ plain form
16219 530612 119225 166616 342319 260163 409978 1721 -69768 216015 91528 227256 294920
16208 294920 142154 -140954 119207 76838 18706 133753 16345 275563 29605 198772
16198 198772 60942 220040 83780 126381 243107 74377 301818 167159 6380 72587 461459
16187 461459 161710 69314 325847 157675 258435 152076 -211323 -19317 258996 119925
16176 284214 210047 238385 74013 80493 439978 29651 -106632 -25852 -88578 110491 93998
16165 93998 266480 288895 77982 56705 352334 137446 665738 146175 50214 225779
16155 225779 100668 -146128 -9463 -77711 166141 223533 -36374 181415 261374 -81711 309020
16143 151386 -18588 178804 220810 55995 147380 93728 126973 253572 130251 -24426 -60203
$$ packed form
16219E30612A19225M7391J75703q2156J49815A721f9768B16015I1528J35728O7664
16208B94920A42154a40954A19207m2369A8706J15047A6345K59218B9605J69167
16198A98772F0942J59098H3780M2601J16726G4377K27441j34659F380O6207L88872
16187D61459A61710F9314K56533A57675J00760j06359b11323a9317B58996A19925
16176B84214p4167K8338G4013O480L59485B9651a06632b5852o2726A10491j6493
16165I3998J72482K2415G7982k1277K95629A37446N28292A46175E0214J75565
16155B25779A00668a46128i463o8248A66141N7392c6374A81415P9959h1711C09020
16143A51386a8588A78804M2006E5995R1385n3652L3245J26599j23321b4426l5777
$$ plain form
16132 -60203 99013 90995 -113885 251638 58930 208550 112816 234121 89069 166788 -225468
16120 241454 -34811 -139192 413353 132359 -117151 280377 -208999 -40666 125650 14503
16109 20982 -230919 173229 76741 -101076 336147 248336 354042 241142 44663 -56142
16098 190179 309814 161100 -107100 304233 44130 135976 117138 -212527 35505 60844
16088 60844 11803 26275 -372334 406730 -96128 -121130 -111886 386444 -196655 -55765 -143868
16077 -143868 -60446 194166 -75788 -155364 276659 -273595 -31590 45459 -257965 93492 2866
16065 47281 -124319 -85837 -64215 280774 -164450 16208 -52501 138556 -143545 -98835 -4513
16053 -258357 -234639 -46033 -90363 -71120 372635 386268 -202883 307537 36916 144771 208138
$$ packed form
16132f0203I9013q018a13885B51638E8930J49620r5734J21305H9069P7719b25468
16120B41454c4811j04381D13353A32359a17151B80377b08999d0666A25650A4503
16109B0982b30919A73229G6741a01076C36147q7811J05706j12900D4663e6142
16098A90179J19635j48714a07100C04233D4130R1846j8838b12527C5505K5339
16088F0844A1803J4472c72334D06730i6128k5002R244C86444a96655e5765q8103
16077a43868f0446A94166g5788p9576B76659b73595c1590D5459b57965I3492B866
16065D7281a24319L8482K1622B80774a64450A6208e2501A38556a43545M4710d513
16053b58357K3718d6033m4330J9243C72635J3633b02883C07537C6916J07855O3367
$$ plain form
16042 208138 -254368 5880 -57441 -172051 -231707 -25508 -378938 2024 -59138 -137126 103819
16030 -22227 -243420 -43365 -124369 -153036 -291540 -373992 -186035 -17089 -145857 -4851 78313
16018 164504 22402 153590 -56396 -54906 129647 68895 -254384 173921 -123291 -197627 507524
16006 84451 -191975 67970 134145 65473 87515 250959 -54789 -29805 11802 113339 -358247
15994 -292042 95898 -1036 126419 155070 236261 63466 -972 247684 205221 213743 -25683 413624
15981 114926 145252 143660 194608 87662 142167 -280709 441809 221738 -311362 4823 301377
15970 301377 -279163 -218858 42115 -94489 -32086 -154273 27059 -285752 -11990 33088 -75306
15958 11999 165937 103171 -186236 -9573 -82686 6668 -273152 -165288 126556 -38917 250418
$$ packed form
16042B08138b54368E880e7441j14610n9656b5508l53430B024e9138p7988A03819
16030b2227k21193d3365q1004k8667j38504q2452a86035a7089j28768d851G8313
16018A64504B2402J31188e6396J490A29647o0752b54384A73921a23291p4336E07524
16006H4451a91975F7970O6175F5473K2042J63444e4789K4984A1802J01537c58247
15994b92042I5898a036A26419K8651Q1191F3466i72B47684m2463Q522b5683D13624
15981A14926L0326j592N0948H7662N4505b80709D41809k20071c11362D823K96554
15970C01377b79163O0305D2115i4489c2086j22187B7059b85752a1990C3088g5306
15958A1999J53938o2766a86236i573p3113F668b73152J07864A26556c8917B50418
$$ plain form
15946 -364062 -178902 -339748 298571 -103044 -68843 -155505 -95157 122176 -292904 -84234
15935 45701 -166883 -47913 -165596 -50343 -99642 -41804 54446 -84157 -114449 -101498 -251025
15924 -251025 -249472 -232400 -110645 -443315 188402 405026 -17886 178098 233080 -329732
15913 114556 -96796 11717 -5382 -143817 -62776 -283283 208455 -4429 -79852 -75273 -233549
15902 -233549 34369 -177952 271709 -191563 94974 26001 -185263 -230834 -399619 -34745
15891 159589 -36762 -147827 51557 -169182 -238700 -104654 221830 69633 -313127 -219732
15881 -219732 -97273 -128187 -154934 -225563 26669 -181022 -31185 40906 -35930 184865 -97942
15869 89362 97676 34682 32487 -144035 63168 125799 -370080 96234 111491 -284839 128989
$$ packed form
15946c64062a78902j60846B98571a03044L4201q6662O0348A22176b92904h4234
15935D5701a66883d7913j17683e0343m9299d1804E4446h4157l0292J2951j49527
15924b51025J553J7072a10645l32670A88402K16624a7886A78098N4982c29732
15913A14556i6796A1717e382j38435f2776k20507B08455d429p5423M579j58276
15902b33549C4369a77952B71709a91563I4974B6001a85263m5571j68785c4745
15891A59589c6762j11065E1557a69182o9518a04654B21830F9633c13127R3395
15881b19732i7273l0914k6747p0629B6669a81022c1185D0906c5930A84865i7942
15869H9362Q314C4682k195a44035F3168O2631c70080I6234J5257b84839A28989
$$ plain form
15857 81623 -136802 187065 -75551 228332 -108797 -150299 -128746 256687 -139662 249510
15846 27906 189349 47793 13196 1743 -88825 177692 -154205 140291 -198580 -408979 4858
15834 169044 170228 257732 176024 -24839 -207129 -159463 -32469 -254268 -84866 -32599 -297705
15823 -297705 -78684 221794 218585 65144 -147904 -27901 189671 -119998 14456 115011 35480
15811 81437 118412 -22038 266883 -9038 143241 210653 39494 -272304 -16762 -158145 -132068
15800 -132068 -71714 116617 -19256 83607 -81171 -207758 -116268 -162025 -71578 -93220 45975
15788 141498 249305 91935 53948 -130396 363632 -293045 56874 44514 -55010 -344661
15778 -344661 -138121 -164772 -284321 7222 94321 -200785 177560 -65649 -369319 3325 42188
$$ packed form
15857H1623a36802A87065g5551B28332a08797m1502K1553B56687a39662B49510
15846B7906J61443D7793A3196A743h8825A77692a54205A40291a98580k10399D858
15834A69044J184Q7504q1708b4839j82290M7666c2469k21799h4866c2599k65106
15823b97705g8684B21794l209F5144a47904b7901A89671a19998A4456J00555C5480
15811H1437L6975b2038B66883i038A43241O7412C9494b72304a6762j41383K6077
15800a32068O0354A16617a9256H3607h1171j26587R1490m5757g1578k1642D5975
15788A41498J07807I1935l7987a30396C63632b93045E6874j2360e5010k89651
15778c44661a38121k6651j19549G222Q7099b00785A77560f5649l03670C325L8863
$$ plain form
15767 42188 -277434 -90380 87812 84256 17670 -154170 -16432 -6488 -105573 -210760 250156
15755 117854 97685 45012 -46028 -128892 -153568 100097 48653 12141 -36438 193520 -133085
15743 -87931 244662 -150900 179512 -34107 -49619 7193 -34277 -120846 87678 -381528 138383
15731 11335 61095 -109782 -128276 -215424 -86764 -112354 -422026 -452923 103682 76115 -163304
15719 -272537 103345 49314 -86356 -148978 -120931 -75203 -265059 -8274 124547 -190662 -296795
15708 -296795 -34746 -483124 143938 -54680 -110946 -163114 -24318 198142 -55508 -177918 45997
15696 162996 39315 -41873 181542 443985 -92124 84181 257341 -36755 61615 -54281 80494
15684 92833 170780 199345 -194538 -158273 -62540 78604 13878 111571 -60888 72532 -10259
$$ packed form
15767D2188b77434i0380H7812l556A7670a54170a6432f488r9085j05187B50156
15755A17854k0169D5012d6028q2864k4676A00097D8653A2141c6438A93520a33085
15743h7931B44662a50900A79512c4107j5512G193c4277q6569H7678c81528A38383
15731A1335M9760a09782j8494q7148h6764k5590l09672l0897A03682k7567a63304
15719b72537A03345D9314h6356o2622K8047M5728j89856h274A24547a90662j06133
15708b96795c4746m48378A43938e4680n6266n2168b4318A98142e5508j22410D5997
15696A62996C9315d1873A81542K62443i2124H4181J73160c6755F1615e4281H0494
15684I2833P7947K8565a94538L6265f2540G8604A3878R7693f0888G2532a0259
$$ plain form
15672 87055 74922 55910 -47347 -18870 27002 40819 -11653 -285893 177995 -50613 241416
15660 11141 139899 5500 -114972 142494 -226793 28079 -111189 -53040 341038 266955 -19257
15648 -99890 -209160 -218578 -97203 226487 -126415 -11981 -84432 -355519 -174440 -249374 -213119
15637 -213119 -72021 -166612 -276281 -267796 -315976 149369 -174378 -45604 91394 -123211 -257725
15626 -257725 268674 259997 -198738 -79838 66387 -30398 449969 107233 -88003 95641 -84733
15614 128714 -117183 77040 -52437 -105729 -126052 -59466 -446403 -47816 -197583 24582 -266776
15602 242625 -133164 356018 -22187 41515 -214335 -296463 215111 116683 -81969 161398
15591 257111 33299 -62666 -155675 183150 -201404 -370211 233187 -62321 -96024 -216762
$$ packed form
15672H7055j2133j9012d7347a8870B7002J3817a1653k74240A77995e0613B41416
15660A1141J28758E500a14972A42494b26793B8079a11189e3040C41038p4083a9257
15648i9890j09270r418i7203B26487a26415a1981p2451k71087a74440p4934L6255
15637b13119g2021r4591j09669Q485m8180A49369a74378d5604I1394a23211j34514
15626b57725B68674q677a98738g9838F6387c0398D49969A07233h8003I5641h4733
15614A28714a17183G7040e2437n3292k0323e9466l86937d7816j49767B4582b66776
15602B42625a33164C56018b2187D1515b14335q2128B15111r8428h1969A61398
15591B57111C3299f2666r3009A83150b01404j68807B33187f2321l3703j20738
$$ plain form
15581 -216762 154674 -134191 176027 191618 -279673 -13308 102290 -97132 -146283 -40504
15570 96054 -75361 -188845 -195004 -391670 -206211 39104 -41829 -52836 299289 -253947 128230
15558 41445 -28113 -79215 -4367 -190737 42188 -270797 166910 101054 -31646 -168270 35401
15546 72509 -186624 242941 -179665 65379 214468 -285094 -121222 70306 78062 -169682
15535 55724 188594 31300 294764 75519 -79338 -50929 -14644 39845 -91759 -151019 -15140
15523 -194334 -55940 -14443 -156300 -166802 72477 -142056 438761 51676 -282615 276378
15512 391742 341607 121106 -132822 -59417 -125023 184327 46623 82281 -17636 167324 -271733
15500 -396812 -264833 47838 -217361 33468 13346 157180 60771 -98990 126369 -302540
$$ packed form
15581b16762A54674a34191A76027J5591b79673a3308A02290i7132m9151d0504
15570I6054g5361j13484o159j96666J85459C9104d1829j1007B99289b53947A28230
15558D1445b8113n1102d367j86370D2188b70797A66910o5856c1646j36624C5401
15546G2509a86624B42941a79665F5379J49089b85094a21222G0306P756a69682
15535E5724J32870C1300K63464G5519g9338K8409a4644C9845i1759n9260a5140
15523a94334e5940a4443j41857j0502G2477a42056D38761E1676b82615B76378
15512C91742n0135A21106a32822e9417o5606A84327D6623L5658a7636A67324b71733
15500c96812J31979D7838b17361C3468A3346J43834F0771i8990A26369c02540
$$ plain form
15489 132955 -13761 -90676 -333617 83545 52011 20569 160146 -14589 -90474 84643 41500
15477 5667 13536 -157484 65979 -76446 213452 -66057 -85024 -7562 89665 264258 -84050 9414
15464 -280168 -189189 -115243 306385 -260267 -115179 374317 176792 -11074 -83876 222343
15453 -163869 -237321 -114657 51166 78016 122 21871 -156631 -41358 4908 -105502 -260924
15442 -260924 60772 -115895 -89899 41582 -151159 -82682 -220555 188434 24047 -169748
15431 39076 120882 70386 -228623 -98886 26981 -475011 -143170 59920 64859 82451 -77143
15419 251015 70230 125743 110471 -50331 -273866 -65844 221591 311096 -83427 -283843 142528
15407 374166 254231 152014 142305 -192186 18645 -27393 83677 -153339 -167248 -60996 -146886
$$ packed form
15489A32955a3761p6915k42941H3545l1534B0569J39577a4589p5885H4643D1500
15477E667P869a57484F5979g6446B13452f6057j8967g562H9665J74593h4050I414
15464b80168R0979P3946C06385b60267a15179C74317A76792a1074p2802B22343
15453a63869p3452a14657E1166K6850A22K1749a56631d1358D908a05502j55422
15442b60924F0772a15895K5996D1582a51159O8477j37873A88434B4047a69748
15431C9076Q1806n0496b28623i8886B6981d75011a43170E9920M939J7592g7143
15419B51015G0230N5513j5272e0331k23535f5844B21591Q9505h3427k00416A42528
15407C74166j19935j02217r709a92186A8645b7393H3677a53339j3909f0996q5890
$$ plain form
15396 -146886 95141 248726 -55312 257119 195526 -106317 -115130 113588 53953 -198442 199004
15384 -61103 113932 197302 231311 139113 222899 400350 -106635 295797 -85956 310100 35731
15372 -101498 -57553 -197079 7507 99616 -1632 93639 77042 197473 -214068 77513 -75894
15360 219726 -284242 -63508 64587 263361 -70000 233238 145629 161352 38766 -251312 289513
15348 -110406 -40696 166209 281515 271988 -239123 -306214 312145 -162010 13863 -422727
15337 -38575 -148929 -149681 465262 -149849 332400 58165 74544 -239240 27454 -205737 159616
15325 -147770 -73669 148302 219222 108241 -5231 -77665 192926 -81056 -231571 -26901 61432
15313 153041 155693 -83439 393484 -45508 -54104 -347501 232106 -150488 162342 -191880 -260004
$$ packed form
15396a46886I5141J53585e5312B57119o1593a06317q813A13588E3953a98442A99004
15384f1103A13932Q3370L4009r2198Q3786J77451a06635B95797h5956C10100C5731
15372a01498M3945j39526G507R2109a632I3639j6597J20431b14068G7513g5894
15360B19726b84242f3508F4587J98774g0000B33238q7609J5723C8766b51312B89513
15348a10406d0696A66209J15306r527b39123o7091C12145a62010A3863d22727
15337c8575j10354p52D65262a49849C32400E8165J6379b39240B7454b05737A59616
15325a47770g3669A48302P0920A08241e231p2434A92926h1056j50515b6901F1432
15313A53041K652h3439C93484d5508q596k93397B32106a50488A62342a91880o8124
$$ plain form
15302 -260004 134414 365311 -80208 53772 18783 203348 177985 269392 240381 -122068 -45057
15290 153643 10158 21881 -147060 -170779 -13420 271255 -33772 2320 386025 213177 -184526
15278 282782 -99922 -34825 -128889 41825 -9200 39011 292625 -210382 -2946 285029 6932
15266 244670 206542 223909 119126 88329 221631 -51434 -237476 -118646 82247 -134759
15255 -94304 -232221 70438 37424 -267836 388485 -40738 283248 92990 63604 -243468 306431
15243 20988 92255 -87515 351710 -165232 -15430 18789 -257397 -116833 280810 179042
15233 179042 180549 92586 334979 -159537 405920 -36953 203453 49714 52898 49760 83177
15222 83177 165973 125343 191390 303862 42991 52015 54169 79272 10707 177493 -120442
$$ packed form
15302b60004A34414K30897h0208E3772A8783J84565k5363R1407k9011a22068d5057
15290A53643A0158J1723a47060k3719a3420B71255c3772B320L83705j72848a84526
15278B82782i9922c4825r4064D1825i200C9011K53614b10382b946B85029F932
15266B44670l8128J7367j04783l0797J33302e1434j86042a18646H2247a34759
15255i4304j37917G0438l3014b67836C88485d0738B83248I2990k9386b43468C06431
15243B0988P1267h7515C51710a65232a5430A8789b57397a16833B80810j01768
15233A79042J507q7963K42393a59537D05920c6953B03453D9714L184l138L3417
15222H3177Q2796m0630O6047J12472D2991R024K154K5103A0707J66786a20442
$$ plain form
15210 71582 114110 1233 -38844 -93032 137772 17001 -198912 81392 50834 80039 166395
15199 166395 183089 16734 -61175 31597 -200861 22317 -178141 -98975 -514224 -35394 -51660
15188 -51660 -60288 179860 -133481 78419 -390593 -12277 255982 34907 -29717 258745 270832
15177 270832 212063 202096 -80621 -144643 31672 102141 -118172 -215586 165809 349962 -91590
15165 -205307 -126994 -133475 -121477 -138963 22738 140673 87624 250454 64703 232567 357005
15154 357005 -9711 96827 9668 -133563 19503 -33644 -158741 5594 416618 -27948 33878
15142 318796 -36150 42630 135112 160893 162020 186556 166902 92321 -134848 -15399 169181
15130 15476 -90184 270661 234126 131585 303714 14926 -308149 363956 -135732 146350
$$ packed form
15210G1582M2528A233c8844n4188A37772A7001a98912H1392l0558K9205Q6356
15199A66395J6694A6734f1175C1597b00861B2317a78141P9166m15249c5394j6266
15188e1660q628A79860a33481G8419c90593a2277B55982C4907b9717B58745J2087
15177B70832n8769r967h0621o4022C1672P0469a18172r7414A65809J84153i1590
15165b05307P8313o481J1998j7486B2738J17935n3049J62830F4703J67864J24438
15154C57005i711I6827I668a33563A9503c3644j25097E594M11024b7948C3878
15142C18796c6150D2630R2482K5781J127K4536j9654p4581a34848a5399A69181
15130A5476i0184B70661l6535j02541J72129A4926c08149C63956a35732A46350
$$ plain form
15119 -255349 -32702 33144 -12004 -93607 71158 335941 -18925 -5472 -56883 177593 160272
15108 160272 133902 137095 196097 87738 337168 -16248 219843 9793 -117570 112103 262484
15097 262484 186671 156987 -7547 128527 167501 36947 202732 30975 144659 -220781 -73852
15085 117280 -129580 -35158 194078 87559 127362 -270651 389415 169197 -26604 158491
15074 30790 150249 436493 168968 -187691 202001 355431 89804 -58408 278585 636597
15064 636597 188130 280783 302003 -124097 -70394 477017 130600 117370 -92585 -71557 496450
15052 236877 446211 75549 167629 346695 68834 219953 169346 262317 192813 -4636 157037
15040 20720 197244 129829 416711 155653 365788 289573 203441 369354 -1637 246354 462744
$$ packed form
15119b55349c2702C3144a2004q1603G1158K64783a8925e472n1411A77593j7321
15108A60272k6370L193N9002H7738K49430a6248B19843I793a17570A12103J50381
15097B62484p5813k9684g547A28527L8974C6947J65785C0975J13684b20781g3852
15085A17280a29580c5158A94078H7559L9803b70651C89415A69197b6604A58491
15074C0790J19459K86244A68968a87691B02001J53430H9804e8408B78585L58012
15064F36597A88130R2653K1220a24097N3703D77017A30600j3230i2585K1028D96450
15052B36877K09334G5549R2080J79066F8834J51119n0607R2971o9504d636A57037
15040B0720J76524o7415K86882A55653K10135p6215q6132J65913a637B46354K16390
$$ plain form
15029 462744 255718 379950 -3006 -194182 -116616 162730 -138639 156601 77079 518202
15019 518202 202473 85264 218328 450660 307345 45098 111567 124245 101928 416933
15009 416933 170360 332093 -67835 305365 380737 343577 99768 153794 325728 224219
14999 224219 342415 451956 216075 115610 293662 232440 -41221 302626 145244 122278
14989 122278 140643 210134 324005 186316 339073 541278 82626 365656 311083 391472
14979 391472 -386499 293293 234179 390605 263506 195413 381417 313057 511992 260665
14969 260665 192907 -275828 363190 471298 553927 168872 495775 -52384 276096 -221516
14958 501447 380737 574400 222940 105285 12502 548888 314951 517605 330700 59833
$$ packed form
15029D62744k07026J24232c006j91176P7566A62730a38639A56601G7079M41123
15019E18202B02473H5264J33064K32332j43315D5098O6469J2678k2317L15005
15009D16933A70360J61733f7835C05365P5372l7160I9768N4026J71934j01509
14999B24219J18196J09541B16075j00465J78052o1222d1221C02626A45244k2966
14989A22278J8365O9491J13871j37689J52757K02205H2626K83030n4573Q0389
14979C91472c86499B93293n9114J56426j27099o8093J86004o8360J98935k51327
14969B60665o7758b75828C63190J08108Q2629A68872L26903e2384B76096b21516
14958E01447j20710J93663B22940A05285A2502N36386k33937K02654j86905E9833
$$ plain form
14947 351953 288193 228961 129522 329857 405801 506389 21215 139039 317724 171739
14937 171739 246141 422930 156202 212000 697206 586358 396415 215896 307507 10760
14926 317689 269521 628201 159112 276967 438204 354108 609184 403242 186330 128795
14916 128795 169697 342578 374827 548642 277621 428848 292608 305821 126344 32709
14905 15883 384211 193513 510862 234115 168970 227087 179199 240454 192342 407297 438450
14894 438450 315931 475014 180898 487036 245095 210329 475518 332666 264800 376237
14884 376237 425035 171188 159103 352282 499228 248065 14346 355680 690972 362864
14874 362864 342648 119341 441842 542721 267506 466365 572798 589960 40098 643808
$$ packed form
14947C51953o3760n9232r9439K00335P5944J00588B1215J17824J78685j45985
14937A71739P4402J76789A56202N5798M85206j10848j89943j80519R1611A0760
14926C17689m8168L58680A59112J17855J61237q4096K55076k05942A86330n7535
14916A28795M0902J72881L2249J73815k71021J51227j36240J3213A26344C2709
14905A5883L68328j90698L17349B34115o5145N8117m7888O1255m8112K14955L1153
14894D38450j22519J59083A80898L06138k41941l4766K65189j42852o7866J11437
14884C76237M8798A71188j2085J93179J46946B48065A4346L41334L35292l28108
14874C62864k0216A19341L22501J00879B67506J98859J06433J7162D0098O03710
$$ plain form
14864 643808 274698 570330 560696 714530 468815 327012 354758 502838 437698 712360
14854 712360 531394 344912 357512 305572 237555 323599 208436 287858 401118 332018 362394
14843 362394 461934 662186 439346 350377 490232 379167 302707 257653 352441 206026
14833 206026 578682 547091 -15931 493695 517399 354580 378629 471753 510152 534301 266955
14821 85352 665360 476616 584623 546435 395858 420549 556022 304600 242681 588455
14811 588455 713103 480999 430881 500572 393002 330808 563736 300457 457112 682039
14801 682039 652548 361031 416088 756673 424168 517889 731225 412862 639450 305370
14790 502053 1009271 610018 570779 601873 449718 422498 60949 557881 300905 744317
$$ packed form
14864F43808B74698K95632r634J53834k45715j41803K7746J48080o5140K74662
14854G12360j80966j86482J2600n1940o8017Q6044j15163P9422J13260o9100L0376
14843C62394R9540K00252k22840q8969J39855j11065p6460m5054R4788j46415
14833B06026L72656l1591a5931D93695K3704j62819K4049R3124L8399K4149B66955
14821H5352N80008j88744J08007l8188j50577K4691J35473k51422o1919L45774
14811E88455J24648k32104n0118O9691j07570o2194K32928k63279J56655K24927
14801F82039k9491k91517N5057L40585l32505R3721K13336l18363K26588C05370
14790E02053N07218l99253l9239L1094j52155k7220F0949M96932k56976M43412
$$ plain form
14780 744317 609812 542880 936081 670174 696093 512623 625630 487154 835181 446682
14770 446682 697453 508963 232074 463464 577787 1095389 774169 372191 866757 530140
14760 530140 828273 897622 518639 771595 631486 538173 698724 663201 853285 696989
14750 696989 678145 982844 781018 973255 835800 949861 628840 681128 803967 647894
14740 647894 668515 790739 870566 562921 643247 664868 794829 844811 655067 1058710
14730 1058710 704320 1018933 538932 665180 1141499 949152 879896 628054 1056187 966818
14720 966818 573164 963309 758631 1070293 1076906 883002 599754 579776 613417 967562
14710 967562 677945 685182 438189 959383 1004694 524484 1285327 696130 531161 739471
$$ packed form
14780G44317j34505o6932L93201k65907K5919j83470J13007j38476L48027l88499
14770D46682K50771j88490B32074K31390J14323N17602l21220C72191M94566l36617
14760E30140K98133O9349l78983K52956j40109r3313J60551l5523J90084j56296
14750F96989j8844L04699k01826J92237j37455J14061l21021N2288J22839j56073
14740F47894K0621J22224P9827l07645Q0326K1621J29961M9982j89744M03643
14730A058710l54390L14613m80001J26248M76319j92347o9256k51842M28133q9369
14720I66818l93654L90145k04678L11662O613j93904k83248j9978L3641L54145
14710I67562k89617P237k46993N21194M5311m80210P60843n89197j64969K08310
$$ plain form
14700 739471 930099 945098 797647 1055277 917007 858748 791611 863913 952864 1024447 866305
14689 866305 924414 624557 1213641 1156603 897989 1160115 916982 1084786 1046600 957595
14679 957595 831223 812587 1173332 984122 1273859 1054636 629908 979789 872490 1202236
14669 1202236 1154924 1172753 1111956 763191 894692 1199023 867252 1096934 1087150 1044051
14659 1044051 919909 1301555 1254437 1155557 1505906 1302989 1369700 1107403 953603 1368714
14649 1368714 1330393 1338844 1381593 1340004 1129630 1132921 1194767 953610 1405499 1216464 1095558
14638 1095558 1175736 1033060 1402343 1504235 1328885 991646 1633422 1387489 1467770 1485433
14628 1485433 1282002 1349311 1769125 1215132 1459903 1099381 1185056 1369547 1774270 1398305
$$ packed form
14700G39471J90628J4999j47451K57630j38270n8259o7137P2302Q8951P1583j58142
14689H66305N8109k99857N89084n7038k58614K62126k43133J67804l8186q9005
14679I57595j26372j8636L60745j89210K89737k19223m24728L49881j07299L29746
14669A202236m7312J7829o0797l48765J31501L04331l31771K29682r784m3099
14659A044051j24142L81646m7118r8880L50349k02917O6711k62297j53800M15111
14649A368714l8321Q451M2749m1589k10374L291O1846k41157M51889j89035j20906
14638A095558Q0178j42676L69283J01892j75350l37239O41776k45933Q0281J7663
14628A485433k03431O7309M19814n53993K44771l60522Q5675J84491M04723l75965
$$ plain form
14618 1398305 1695414 1577794 1540136 1372026 1334666 1226455 1718354 1369927 1683375 1619629
14608 1619629 1603321 1463671 1775037 1363541 1640142 1727411 1663408 1670552 1522888 1482705
14598 1482705 1504382 1645779 1595704 1897149 1699700 1484921 1929836 1953691 1904270 1831837
14588 1831837 2097844 1916749 2182965 1927377 2519538 1962982 1957772 1909646 2446825 1915448
14578 1915448 1903320 1912328 1935909 2314034 2336881 1970575 2122187 2111252 2143735 2677458 2382478
14567 2382478 2171587 2293335 2322959 2429808 2647937 2518844 2797561 2723275 2824190 2345494
14557 2345494 2933257 2940037 3010612 3367192 3891843 4507584 4706517 5864426 8307440 12088562
14547 12088562 21006392 36362785 39264190 19333735 9492479 5470686 3597248 2919753
$$ packed form
14618A398305K97109j17620l7658j68110l7360j08211M91899l48427L13448o3746
14608A619629j6308j39650L11366m11496K76601Q7269o4003P144j47664m0183
14598A482705K1677J41397n0075L01445j97449k14779M44915K3855m9421p2433
14588A831837K66007j81095K66216k55588N92161n56556n210m8126N37179n31377
14578A915448j2128R008K3581L78125K2847l66306J51612j0935L2483N33723k94980
14567B382478k10891J21748K9624J06849K18129j29093K78717p4286J00915m78696
14557B345494N87763O780P0575L56580N24651O15741J98933J157909K443014L781122
14547A2088562Q917830J5356393K901405A9333735I492479m021793j873438o77495
$$ plain form
14539 2919753 2304951 2233724 2257943 2278627 1972522 2012658 2289627 2265838 2016902 2299647
14529 2299647 2339300 2358600 2581515 2019700 2615340 2425061 2263528 2426209 2518538 2534613
14519 2534613 2643797 2275276 2589812 2467040 2647499 2645973 2772946 2564761 2401545 2789911
14509 2789911 2785969 3109607 2915943 2993505 2923451 2749639 2918809 3281708 2982092 3074281
14499 3074281 3514745 3311936 3441461 3608732 3404473 3446321 3444218 3319848 3427503 3681970
14489 3681970 3438963 3789077 3519425 3726259 3651929 3781800 4148146 3811085 3921346 3941037
14479 3941037 4092572 4006258 3989412 4109010 4284355 4432397 4462982 4166115 4267097 4538784
14469 4538784 4594864 4556905 4606267 4887333 4532082 4432098 4689636 4574860 4784383 4885725
$$ packed form
14539B919753o14802p1227K4219K0684l06105M0136K76969k3789k48936K82745
14529B299647L9653J9300K22915n61815N95640j90279j61533J62681R2329J6075
14519B534613J09184l68521L14536j22772J80459j526J26973k08185j63216L88366
14509B789911l942L23638j93664P7562p0054j73812J69170L62899k99616R2189
14499C074281M40464k02809J29525J67271k04259M1848k103j24370J07655K54467
14489C681970k43007L50114k69652K06834p4330J29871L66346l37061J10261J9691
14479C941037J51535q6314j6846J19598J75345J48042L0585k96867J00982K71687
14469D538784N6080l7959M9362K81066l55251r9984K57538j14776K09523J01342
$$ plain form
14459 4885725 4967446 4998061 4958830 4839063 5281031 5378154 5312307 5732438 5747621 5574354
14449 5574354 5550697 5412204 5802782 5793764 5728831 5891982 6166765 5852614 6234505 6494303
14439 6494303 6714530 6603756 6519745 6666626 6822222 6527316 6886538 6987742 6924276 7244465
14429 7244465 7070732 7359999 7488377 7409559 7980519 7591719 7807017 8149386 8074710 8471261
14419 8471261 8370494 8229263 8724162 8490619 9006403 8732418 8978214 9103325 9562681
14410 9562681 9449716 9254347 9483758 9995672 9839276 10180112 10688482 10268474 10825591
14401 10825591 10560315 11221668 11222670 11413978 11519034 11658491 12007349 11697559 12485554 12500514
14391 12500514 12583342 12890406 13160568 13095602 13609960 13848293 14111515 14460536 14482081 14858536
$$ packed form
14459D885725Q1721L0615l9231j19767M41968R7123o5847M20131J5183j73267
14449E574354k3657j38493L90578r018o4933J63151K74783l14151L81891K59798
14439F494303K20227j10774q4011J46881J55596k94906L59222J01204o3466L20189
14429G244465j73733K89267J28378p8818N70960l88800K15298L42369p4676L96551
14419H471261j00767j41231M94899k33543N15784k73985K45796J25111M59356
14410I562681j12965j95369K29411N11914j56396L40836N08370m20008N57117
14401A0825591k65276O61353J002J91308J05056J39457L48858l09790P87995J4960
14391A2500514Q2828L07064K70162o4966N14358K38333K63222L49021K1545L76455
$$ plain form
14381 14858536 15133601 15331550 15560398 15997907 16256452 16377629 16846444 17320727 17320233 18043285
14371 18043285 18156861 18516724 18906887 19301197 19723482 20231815 20261494 21002281 21371809
14362 21371809 22125251 22101523 22898811 22978253 23745454 24481265 25004542 25253630 25881055 26844658
14352 26844658 27359236 27759146 28678002 29427315 29804812 30628003 31467364 31995401 32932020
14343 32932020 33803530 34802188 35518730 36694919 37580376 38690285 39901658 40596321 41949732
14334 41949732 43514673 44732798 45870753 47328944 48699216 50047227 51574391 53368933
14326 53368933 54936846 56859336 58616317 60485988 62545146 64713753 67010018 69086292
14318 69086292 71715619 74336068 77050828 80161088 83284220 86299383 89754204 92779381
$$ packed form
14381A4858536K75065J97949K28848M37509K58545J21177M68815M74283m94P23052
14371A8043285J13576L59863L90163L94310M22285N08333K9679P40787L69528
14362B1371809P53442k3728P97288P9442P67201P35811N23277K49088O27425R63603
14352B6844658N14578L99910R18856P49313L77497Q23191Q39361N28037R36619
14343C2932020Q71510R98658P16542J176189Q85457J109909J211373O94663J353411
14334D1949732J564941J218125J137955J458191J370272J348011J527164J794542
14326E3368933J567913J922490J756981J869671K059158K168607K296265K076274
14318F9086292K629327K620449K714760L110260L123132L015163L454821L025177
$$ plain form
14310 92779381 96396637 100680243 104680922 109273530 113998768 118567609 123642936 129265769
14302 129265769 135025393 141245619 147511332 154428250 161585779 169302794 177448933 185687756
14294 185687756 194747662 203861675 214008448 224284236 235379613 246711087 258769210
14287 258769210 270667287 283803410 297137922 310847215 324293226 338347470 352493763
14280 352493763 366327483 379924356 392771585 405539718 416672475 426676348 434726827
14273 434726827 439741643 442083800 442506650 442260033 442094737 438652309 434147956 429413810
14265 429413810 422256050 413806229 404134850 393537229 381771600 368919758 355530843
14258 355530843 341448476 327411444 312956921 298601603 284704801 271451410 258347877
$$ packed form
14310I2779381L617256M283606M000679M592608M725238M568841N075327N622833
14302A29265769N759624O220226O265713O916918P157529P717015Q146139Q238823
14294A85687756R059906R114013J0146773J0275788J1095377J1331474J2058123
14287B58769210J1898077J3136123J3334512J3709293J3446011J4054244J4146293
14280C52493763J3833720J3596873J2847229J2768133J1132757J0003873Q050479
14273D34726827N014816K342157M22850k46617j65296l442428m504353m734146
14265D29413810p157760q449821r671379j0597621j1765629j2851842j3388915
14258C55530843j4082367j4037032j4454523j4355318j3896802j3253391j3103533
$$ plain form
14251 258347877 246352271 234352005 223179955 212738859 202456223 192864281 183735114
14244 183735114 175585235 167059546 159262790 152215309 145332462 138718673 133128496 127481142
14236 127481142 122199869 116607081 111738542 107445145 102929751 99341417 95256975 91519071
14228 91519071 87956585 84404907 81314031 78475681 75504178 72906283 70346396 67938855
14220 67938855 65909194 63527126 61637875 59023766 57153494 55612020 54166869 52378589
14212 52378589 50829937 49081291 47475542 46639271 44966980 44082028 43128719 41705622
14204 41705622 40347489 38780896 38066556 37371648 36560471 35439620 34234352 33318847 32798121
14195 32798121 31639077 31475681 30508691 29446561 28850738 28006737 27569435 26644589 26052202
$$ packed form
14251B58347877j1995606j2000266j1172050j0441096j0282636r591942r129167
14244A83735114q149879q525689p796756p047481o882847o613789n590177n647354
14236A27481142n281273n592788m868539m293397m515394l588334m084442l737904
14228I1519071l562486l551678l090876k838350k971503k597895k559887k407541
14220F7938855k029661k382068j889251k614109j870272j541474j445151j788280
14212E2378589j548652j748646j605749q36271j672291q84952r53309j423097
14204D1705622j358133j566593p14340o94908q11177j120851j205268r15505n20726
14195C2798121j159044j63396r66990j062130n95823q44001m37302r24846n92387
$$ plain form
14186 26052202 25745450 25122721 24247544 23942432 23096446 22799249 22405318 21879126 21370589
14177 21370589 20775822 20714221 20154607 20000932 19395028 18913590 18499358 18024695 18003154 17727278
14167 17727278 16937800 16780574 16529335 16576665 15716625 15745838 15351049 15299490 14775049 14691835
14157 14691835 14630219 14193074 13744682 13683283 13422894 12867855 12908861 12765096 12757060 12529795
14147 12529795 12027845 11979223 11662749 11693922 11658585 11177856 11108173 10763552 10857828 10922404
14137 10922404 10708012 10628636 10258325 10202165 10119887 9846011 9855474 9324745 9368447 8916738
14127 8916738 8965506 8943829 9082299 8483579 8537992 8474751 8223164 8356569 8185135 7979295
14117 7979295 7853293 7773981 7724956 7479920 7678141 7378056 7191065 6924727 7159799 6992126
$$ packed form
14186B6052202l06752o22729q75177l05112q45986k97197l93931n26192n08537
14177B1370589n94767o1601n59614j53675o05904m81438m14232m74663k1541k75876
14167A7727278p89478j57226k51239M7330q60040K9213l94789n1559n24441q3214
14157A4691835o1616m37145m48392o1399k60389n55039M1006j43765q036k27265
14147A2529795n01950m8622l16474L1173l5337m80729o9683l44621R4276O4576
14137A0922404k14392p9376l70311n6160q2278k73876R463n30729M3702m51709
14127H916738M8768k1677J38470n98720N4413o3241k51587J33405j71434k05840
14117G979295j26002p9312m9025k45036J98221l00085j86991k66338K35072j67673
$$ plain form
14107 6992126 7027113 7026982 6919380 6490142 6542872 6476163 6253913 6324261 6333619 6049688 6310086
14096 6310086 5714685 6045234 5942337 5965040 6125070 5888318 5487037 5791813 5533232 5427408
14086 5427408 5413057 5531663 5406141 5069572 5131931 5187860 5108972 5243333 4861706 4764114
14076 4764114 4906781 4931417 5144899 4814875 4956790 4760716 4539304 4343854 4597147 4260498
14066 4260498 4550833 4731636 4355871 4256030 4452593 4256253 4001670 4297666 4034549 4039014
14056 4039014 4130309 3869968 3829001 3527144 4253004 3940081 3967533 3588719 3798040 4039005
14046 4039005 3690200 3716292 3680493 3375754 3795986 3426573 3246156 3500951 2960623 3634658
14036 3634658 3401132 3473662 2910255 3406770 3338511 3628237 2982252 3101996 3205940 2966061
$$ packed form
14107F992126L4987j31j07602m29238N2730o6709k22250P0348R358k83931K60398
14096F310086n95401L30549j02897K2703J60030k36752m01281L04776k58581j05824
14086E427408j4351J18606j25522l36569O2359N5929p8888J34361l81627r7592
14076D764114J42667K4636K13482l30024J41915j96074k21412j95450K53293l36649
14066D260498K90335J80803l75765r9841J96563j96340k54583K95996k63117M465
14056D039014R1295k60341m0967l01857P25860l12923K7452l78814K09321K40965
14046D039005l48805K6092l5799l04739M20232l69413j80417K54795n40328O74035
14036C634658k33526P2530n63407M96515o8259K89726o45985J19744J03944k39879
$$ plain form
14026 2966061 3097603 3106380 3196904 3063663 2845687 3060889 3008818 2830731 3261156 2780663
14016 2780663 2723257 2518134 3106937 2599302 2543218 2599196 2482674 2552912 2635885 2717075
14006 2717075 2498604 2682549 2318184 2126153 2288774 2540852 2450108 2099726 2251198 2318915
13996 2318915 2481777 2413501 2193897 2505542 2383093 2507350 2847869 4307649 7134309
13987 7134309 14253768 30574821 42076212 25393028 14391887 9294537 7043823 5381467
13979 5381467 4924660 4042034 3645897 3541695 3274400 3298108 2775972 2895064 2644081 2338090
13969 2338090 2667082 2624095 2644996 2714794 2386714 2357831 2282902 2276587 2274207 2321894 2227672
13958 2227672 2552766 2038017 2114368 2105063 2038466 2006189 1944955 2179850 2206172 1969251 2088931
$$ packed form
14026B966061J31542Q777R0524j33241k17976K15202n2071j78087M30425m80493
14016B780663n7406k05123N88803n07635n6084N5978j16522P0238Q2973Q1190
14006B717075k18471J83945l64365j92031J62621K52078r0744l50382J51472O7717
13996B318915J62862o8276k19604L11645j22449J24257L40519J459780K826660
13987G134309P119459J6321053J1501391j6683184j1001141n097350k250714j662356
13979E381467m56807q82626l96137j04202k67295K3708n22136J19092k50983l05991
13969B338090L28992m2987K0901O9798l28080k8883p4929o315k380M7687r4222
13958B227672L25094n14749P6351r305o6597l2277o1234K34895K6322k36921J19680
$$ plain form
13947 2088931 1977270 1902257 1945970 2083052 1686651 1924098 2292334 1951962 1587432 1918564
13937 1918564 1889172 1973406 2052461 1830875 1478422 1718908 1715892 2144666 1799058 1607020
13927 1607020 1788162 1629667 1639787 1575808 1377492 1618806 1530416 1771267 1303477 1431421
13917 1431421 1725828 1307371 1462982 1491578 1460927 1544911 1519172 1402738 1461756 1386406
13907 1386406 1855802 1434024 1741039 1461107 1212911 1396577 1239739 1680093 1218392
13898 1218392 1431541 1229847 1431917 995202 1303267 1476003 1054732 1527752 1200766
13889 1200766 1253584 1417393 1088565 1376374 1107559 1353859 1156786 1515842 1293812 1160221
13879 1160221 1498291 1101940 1367372 1234520 1272311 1132257 1257467 1146179 1253778 1141425
$$ packed form
13947B088931j11661p5013M3713J37082l96401K37447L68236l40372l64530L31132
13937A918564k9392Q4234P9055k21586l52453K40486l016M28774l45608j92038
13927A607020J81142j58495J0120o3979j98316K41314q8390K40851m67790J27944
13917A431421K94407m18457J55611K8596l0651Q3984k5739j16434N9018p5350
13907A386406M69396m21778L07015k79932k48196J83666j56838M40354m61701
13898A218392K13149k01694K02070m36715L08065J72736m21271M73020l26986
13889A200766N2818J63809l28828K87809k68815K46300j97073L59056k22030j33591
13879A160221L38070l96351K65432j32852L7791j40054J25210j11288J07599j12353
$$ plain form
13869 1141425 974146 1109006 1311492 1201092 1096046 1182315 1252481 966660 961285 888135
13859 888135 1067023 1262649 1280491 1228677 1015516 1209868 1093988 1037459 682811 1325742
13849 1325742 1704971 1010233 1265429 1127923 1188602 889177 1274748 1274092 825064 889612
13839 889612 1010355 774494 926229 929917 1453325 1297335 912004 1234996 442158 904377
13829 904377 911509 909985 974310 747908 969479 911782 1178705 807544 828142 1066550 872651
13818 872651 880755 895439 631248 1067570 880142 838690 1067784 892658 819588 897417 901662
13807 901662 1031450 692514 1189343 1003763 835908 868125 841909 729177 1155150 839879
13797 839879 554621 794792 1028472 877287 948321 993282 1272194 812291 879771 812188
$$ packed form
13869A141425j67279J34860K02486j10400j05046Q6269P0166k85821n375p3150
13859H88135J78888J95626J7842n1814k13161J94352j15880n6529l54648O42931
13849A325742L79229o94738K55196j37506O0679k99425L85571o56m49028O4548
13839H89612J20743k35861J51735L688N23408j55990l85331L22992D42158M62219
13829I04377P132j524O4325k26402K21571n7697K66923l71161K0598K38408j93899
13818H72651Q104J4684k64191M36322j87428m1452K29094j75126p3070P7829M245
13807I01662J29788l38936M96829j85580j67855L2217k6216j12732M25973l15271
13797H39879k85258K40171K33680j51185P1034M4961K78912m59903O7480o7583
$$ plain form
13787 812188 735768 880595 1056500 1017893 1128325 379871 912007 777566 855904 917515
13777 917515 652592 998048 909280 840581 1036492 1051640 873708 932292 676121 817836
13767 817836 784008 691360 655937 527977 675526 886863 635632 1080887 1202545 561427
13756 553285 678157 587569 796343 475410 432034 798598 750879 660328 612368 970752
13746 970752 638560 728022 697480 822294 512546 506741 849825 563060 579543 647555 876237
13735 876237 486343 631593 645190 776197 654983 715455 751105 788371 576985 288938
13725 288938 595717 525956 634745 459963 1050135 414039 624326 681387 347749 768934
13715 768934 360548 691724 280054 464191 633887 559712 556209 559350 283914 717119
$$ packed form
13787H12188p6420J44827J75905l8607J10432C79871N32136j34441P8338O1611
13777I17515k64923L45456q8768o8699J95911J5148j77932N8584k56171J41715
13767H17836l3828r2648l5423j27960J47549K11337k51231M45255J21658E61427
13756E53285J24872r0588K08774l20933m3376L66564m7719r0551m7960L58384
13746I70752l32192Q9462l0542J24814l09748n805L43084k86765J6483O8012K28682
13735H76237l89894J45250J3597J31007j21214O0472L5650L7266k11386k88047
13725B88938L06779o9761J08789j74782N90172D14039K10287N7061l33638M21185
13715G68934C60548L31176B80054J84137J69696p4175l503L141k75436M33205
$$ plain form
13705 717119 83954 581278 279216 774167 503132 948954 401900 340126 447999 603249
13695 603249 355552 652157 481579 517918 559931 583828 596673 600256 427946 445868 458177
13684 458177 587291 454256 515246 258982 156882 449917 858584 546519 663698 440373
13674 440373 633027 707384 739867 247132 791999 401532 422474 325475 414009 276127
13664 276127 521053 671741 659228 373833 504256 416467 578517 700206 478892 427289
13654 427289 321862 600076 419775 514169 790211 617516 339604 473681 457269 379411
13644 379411 534617 382651 459559 581488 545768 372765 813410 436647 405128 315354
13634 315354 490482 468658 527162 640846 359988 249545 639378 365982 26850 482920
$$ packed form
13705G17119H3954M97324B79216M94951k71035M45822D01900o1774J07873J55250
13695F03249k47697K96605j70578L6339M2013K3897J2845L583j72310J7922J2309
13684D58177J29114j33035O0990k56264j02100K93035M08667l12065J17179k23325
13674D40373J92654P4357L2483B47132N44867l90467K0942r6999Q8534j37882
13664B76127K44926J50688j2513k85395J30423q7789J62050J21689k21314n1603
13654D27289j05427K78214j80301R4394K76042j72695k77912J34077j6412p7858
13644C79411J55206j51966P6908J21929l5720j73003M40645l76763l1519q9774
13634C15354J75128k1824N8504J13684k80858j10443L89833k73396B6850M56070
$$ plain form
13624 482920 407188 79610 530620 182530 635015 78279 652506 546189 421668 436755
13614 436755 567021 213953 384021 614828 285954 615176 574663 372322 450290 268416
13604 268416 571436 111313 542749 510620 -148399 -4911 94361 584276 479476 476696 284089
13593 284089 316880 422378 318180 451731 137273 214549 288563 388335 516290 68501
13582 89061 608805 342228 426922 401622 271875 413560 430027 437444 17459 23849 351850
13571 351850 302056 327915 542627 410688 72558 243240 -36159 366054 417998 570786
13561 570786 300476 378592 242126 306432 224813 551765 341375 682274 296571 140999
13550 395153 174363 203872 98911 275128 726750 226021 434952 121997 17308 306888
$$ packed form
13624D82920p5732G9610M51010A82530M52485G8279N74227j06317j24521J5087
13614D36755J30266B13953J70068K30807B85954L29222m0513k02341P7968j81874
13604B68416L03020A11313M31436l2129a48399d911I4361M89915j04800k780j92607
13593B84089L2791J05498j04198J33551A37273P7276P4014R9772J27955F8501
13582H9061N19744k66577Q4694k5300j29747J41685J6467P417A7459O390L28001
13571C51850m9794K5859K14712j31939G2558J70682c6159C66054N1944J52788
13561E70786k70310P8116j36466O4306q1619L26952k10390L40899B96571A40999
13550C95153A74363K9509I8911J76217M51622B26021K08931A21997A7308K89580
$$ plain form
13540 306888 333694 335413 624444 474838 438960 459425 225248 226729 257437 6278 506081
13529 506081 397182 77354 300579 169193 180403 417789 54213 -71251 115829 341135
13519 341135 254416 184271 395411 332044 -4084 347916 -59360 187139 430632 205538 569306
13508 569306 400260 417369 299054 213853 184635 210156 392122 441288 313437 643973
13498 643973 300293 278994 609060 293485 121449 502927 543349 -25014 390191 271723
13488 271723 103879 496621 140039 46367 21202 334910 18752 269951 348848 322621
13478 322621 100139 -198821 467174 264868 161356 152091 402945 248359 193721 58764
13467 -4846 489361 378316 -37361 -8502 270276 33441 151315 244425 158745 282461 -31689
$$ packed form
13540C06888K6806J719K89031j49606l5878K0465B25248J481L0708F278M99803
13529E06081j08899G7354K23225j31386J1210K37386E4213g1251A15829K25306
13519C41135q6719p0145K11140o3367d084C47916e9360A87139K43493B05538L63768
13508E69306j69046J7109j18315q5201k9218K5521J81966M9166j27851L30536
13498F43973C00293k1299L30066B93485A21449L81478M0422b5014C90191j18468
13488B71723A03879L92742A40039D6367B1202L13708A8752K51199P8897k6227
13478C22621A00139a98821D67174k02306j03512r265K50854j54586n4638E8764
13467d846D89361j11045c7361h502B70276C3441J17874R3110q5680J23716c1689
$$ plain form
13455 14390 66077 73132 192872 438914 286488 203626 318100 34955 107405 334023 23039
13443 478896 -172852 214284 259258 370061 92508 319356 325380 322946 89797 347390 469198
13432 469198 -9788 -66958 578165 351433 282737 152631 68714 87948 88638 172846 68085
13420 -190163 160844 274182 90114 15436 245278 84736 345157 192157 57090 -8699 128725
13408 72882 392691 9499 -39721 -136281 -13799 4239 212514 169703 106359 612985 305971
13396 162283 248329 137003 79973 79288 230351 284432 97309 183327 200937 294232 19678
13384 452843 293470 186846 447882 328384 116677 471980 253806 122186 418005 197020
13373 449667 159413 385281 435742 368458 465967 114503 184389 380649 314936 287236 37190
$$ packed form
13455A4390N1687P055J19740K46042j52426q2862J14474C4955P2450K26618B3039
13443D78896a72852B14284M4974J10803I2508K26848O024k434H9797K57593J21808
13432D69198i788n7170E78165k26732o8696j30106F8714J9234O90Q4208F8085
13420a90163A60844J13338I0114A5436K29842H4736K60421j53000E7090h699A28725
13408G2882L19809I499c9721r6560a3799D239K08275m2811o3344N06626C05971
13396A62283Q6046j11326n7030o85J51063N4081I7309Q6018J7610R3295A9678
13384D52843j59373j06624K61036j19498A16677L55303k18174A22186K95819A97020
13373D49667A59413K25868N0461o7284R7509A14503O9886J96260o5713k7700C7190
$$ plain form
13361 387395 477884 323229 82202 -35491 122032 -27933 236899 342442 438614 266643
13351 266643 217094 115522 286300 422627 153979 187228 407736 373542 141469 410808
13341 410808 473474 605178 332864 108399 435650 209308 405394 -93069 161791 209684
13331 209684 161808 264454 257132 366089 266893 118049 279833 345981 220834 -158014
13320 231708 352205 -14952 240649 92010 -164187 466797 -229682 -73316 198738 237236
13310 237236 312619 146913 -15090 -101037 108933 297632 36316 151051 643073 339724
13300 339724 95992 169122 149814 219588 -80386 288339 -65405 51349 222737 351108 186289
13289 186289 111430 198592 209114 411775 -35648 372098 -98586 7661 133123 -23578 -21801
$$ packed form
13361C87395R0489j54655H2202c5491A22032b7933B36899J05543R6172j71971
13351B66643m9549j01572J70778J36327A53979L3249K20508l4194A41469K69339
13341D10808O2666J31704k72314A08399L27251B09308J96086i3069A61791M7893
13331B09684m7876J02646p322J08957r9196A18049J61784O6148j25147a58014
13320B31708J20497a4952B40649I2010a64187D66797b29682g3316A98738L8498
13310B37236P5383A46913a5090q5947A08933J88699C6316J14735M92022l03349
13300C39724I5992P3130j9308O9774h0386B88339f5405E1349J71388J28371j64819
13289A86289p4859Q7162J0522K02661c5648C72098i8586G661J25462b3578J777
$$ plain form
13278 -21801 -113076 173852 250683 327235 409996 171082 61512 262250 151808 227383 247699
13267 247699 165938 10665 192703 119199 265878 187340 -17023 254636 17226 309989 56711
13255 136174 416751 97811 17878 -83371 320016 -8853 284192 65570 -137937 65767 289747
13244 289747 125894 -135711 -187951 66392 230770 148196 63692 245272 29832 244223
13234 244223 305359 152732 118884 76758 121946 164860 -12150 157756 5836 390829 -155878
13222 183858 149172 314746 51530 465570 112957 241078 91052 100950 368954 31143 374810
13211 374810 -53688 155064 142070 247332 110638 -235995 81944 360684 384201 156614
13200 28123 -106025 102626 506308 58780 -83535 312481 -196725 19882 -172071 36009
$$ packed form
13278b1801r1275A73852P6831P6552Q2761A71082F1512K00738j10442P5575K0316
13267B47699q1761A0665J82038p3504J46679p8538a7023B54636A7226K92763E6711
13255A36174K80577I7811A7878h3371C20016h853B84192F5570a37937F5767K23980
13244B89747A25894a35711n2240F6392J64378q2574F3692J81580B9832K14391
13234B44223O1136j52627l3848m2126M5188M2914a2150A57756E836L84993a55878
13222A83858l4686J65574E1530M14040A12957J28121I1052R898K68004C1143L43667
13211C74810e3688A55064j2994J05262A10638b35995H1944K78740K3517A56614
13200B8123a06025A02626M03682E8780h3535C12481a96725A9882a72071C6009
$$ plain form
13189 50510 304152 -18159 273223 104254 203549 -99828 58061 391365 -119320 -130267 -216073
13178 -216073 151642 226344 273487 -6284 25592 54866 98208 263669 -85811 139520 160043
13167 160043 150214 119565 -19834 156241 191645 50441 63443 59304 236632 -107510 42055
13155 38105 -180085 71415 611857 213018 62144 42504 3617 42079 221957 -217570 239258
13143 37872 243885 82200 159627 265551 49465 51718 48990 102519 107529 253312 243254 297402
13131 297402 125226 240518 327838 141528 325890 264953 204442 -63404 -98957 45703 313853
13120 313853 360361 13126 62713 184600 89621 51178 118582 37751 249835 162219 159302
13109 159302 107777 -23653 -35452 106479 -155476 -454 -167368 160748 -51901 109712 29027
$$ packed form
13189E0510K53642a8159B73223A04254R9295i9828E8061L33304a19320j0947q5806
13178b16073A51642P4702M7143f284B5592K9274M3342J65461h5811A39520K0523
13167A60043r829l0649a9834A56241L5404E0441J3002m139J77328a07510D2055
13155C8105a80085G1415N40442B13018F2144j9640C617L8462J79878b17570B39258
13143C7872K06013H2200P7427J05924D9465K253k728N3529N010J45783j0058N4148
13131B97402A25226J15292Q7320A41528J84362o0937o0511f3404l5553D5703K68150
13120C13853M6508A3126M9587J21887H9621l8443O7404C7751K12084q7616k917
13109A59302n1525b3653j1799A06479a55476d54j66914A60748e1901A09712B9027
$$ plain form
13097 -129921 24320 -15853 275936 -118938 4005 -38577 -103216 -351301 -93107 -73859 -3441
13085 78372 173157 120314 207798 110330 425812 452504 203708 318461 231346 -70480 38583
13073 360249 -163693 -66633 -33051 -87060 -190412 -18763 104655 8710 160194 72975 201214
13062 201214 159658 335253 172152 -93778 93489 238508 -84028 98300 -104573 173624
13051 123672 58602 41652 55651 -51565 -128952 31909 143184 -23143 274330 -80214 -96311
13040 -96311 213100 -71068 178259 -102166 20286 23471 -50111 163467 351519 6372 -250700
13028 -76270 179879 35765 405249 269162 -20230 -150133 282443 145517 313871 150519
13017 244819 225635 161745 344676 -3331 320696 62549 62238 272539 -309991 69335 299588
$$ packed form
13097a29921B4320a5853B75936a18938D005c8577o4639k48085i3107J9248c441
13085G8372R4785n2843Q7484r7468L15482K6692B03708J14753q7115g0480C8583
13073C60249a63693f6633c3051n4009j03352a8763A04655H710J51484G2975J28239
13062B01214m1556J75595j63101i3778I3489J45019h4028I8300a04573A73624
13051A23672E8602j6950J3999e1565p7387C1909J11275b3143B74330h0214j6097
13040i6311B13100g1068A78259a02166B0286L185e0111A63467J88052F372b50700
13028g6270A79879C5765L69484j36087b0230j29903B82443j36926J68354A50519
13017B44819j9184o3890J82931c331C20696F2549l11K10301c09991F9335K30253
$$ plain form
13006 299588 227263 247848 347472 360004 -9481 118760 4001 -15606 202832 238877 37035
12994 -64356 86699 -2976 74003 162113 -181357 484657 -343100 52880 38643 228305 37827
12982 -109335 191648 222155 -186205 55047 45773 -99592 234348 -176956 -149646 78244 495952
12971 495952 5971 -3909 -11493 168803 308141 274145 -97730 179371 261362 177769 -307042
12959 144937 -121471 8254 -31437 66908 -21478 355498 189632 -163754 149256 47211 185867
12948 185867 30486 315063 -79274 -36932 389791 5997 -113276 19713 192417 174884 -128438
12936 133580 -19026 -67801 91081 90458 248003 216426 359231 -110298 -50912 -318302 114615
12924 201438 -138535 -7991 -160314 90154 -29962 -167921 -188569 25803 65631 282299 17744
$$ packed form
13006B99588p2325K0585R9624J2532i481A18760D001a5606B02832L6045C7035
12994f4356H6699b976G4003Q8110a81357D84657c43100E2880j4237J89662C7827
12982a09335A91648L0507a86205E5047r274i9592B34348a76956K7310G8244M17708
12971D95952E971c909p584A68803J39338l3996i7730A79371Q1991q3593c07042
12959A44937a21471H254c1437F6908b1478C55498j65866a63754A49256D7211J38656
12948A85867C0486K84577g9274c6932C89791E997a13276A9713J72704j7533a28438
12936A33580a9026m8775I1081o23J57545l1577J42805a10298e0912k67390A14615
12924B01438a38535g991j52323I0154b9962j37959k0648B5803L9828K16668A7744
$$ plain form
12912 40847 14988 -103100 111775 76916 475929 151056 132533 5585 -186214 198666 213309
12901 213309 103539 -180045 92780 200137 121189 460924 -45957 83331 3946 262055 166030
12890 166030 116390 -20413 58213 229812 237737 -39652 -97123 67808 10531 156765 -22732
12878 95057 -155303 -81815 134930 501 197497 389376 -46523 188496 13133 -12230 257727
12866 220765 -100841 -216342 363852 279190 -145320 -2000 -95286 -102972 292109 -73669 111759
12854 24330 15187 -110295 432881 -47107 236032 -171180 154233 103396 -152702 227478
12843 261511 164257 197538 -122512 119638 214556 273220 -123579 -343018 -248312 60348 -120483
12831 78144 242390 -216082 -261396 -174396 154647 113016 -137292 -99123 -26048 250452 63711
$$ packed form
12912D0847A4988a03100A11775l4859L99013A51056j8523E585a86214A98666J4643
12901B13309A03539a80045I2780J07357p8948L39735d5957H3331C946K58109r6025
12890A66030m9640b0413E8213J71599P925c9652n7471F7808A0531J46234b2732
12878I5057a55303P3488A34930E01J96996J91879d6523A88496A3133a2230B57727
12866B20765a00841j15501C63852q4662a45320b000r3286p686B92109g3669A11759
12854B4330r143a10295D32881d7107B36032a71180A54233n0837a52702B27478
12843B61511r7254L3281a22512A19638R4918N8664a23579k19439R4706F0348a20483
12831G8144J64246b16082m5314Q7000A54647m1631a37292L8169b6048B50452F3711
$$ plain form
12819 -93057 91606 -61219 -258396 -69536 220727 -317039 23264 -69762 295620 103205 13126
12807 -256214 30868 48340 575863 12393 214471 1389 -60137 232330 205439 -247089 122265
12795 154082 245190 58488 -102305 -98619 -48716 211178 -11200 253291 216706 -4786 17579
12783 119527 -322277 -81483 43988 264123 75259 -80396 -29240 232237 482744 261299
12773 261299 -16106 112837 127559 44687 200314 87776 -275265 -64642 178177 92863 271287
12762 271287 87067 80452 9878 118835 -70614 -69399 -186252 175608 84499 333595 85820
12750 92898 -57318 309957 -166863 390383 -131532 -35155 221440 93853 -47087 -71099 -31643
12738 27129 27886 252805 -270555 153390 -13003 -235025 -135405 94389 110209 98798 -115050
$$ packed form
12819i3057I1606f1219j97177f9536B20727c17039B3264f9762B95620A03205A3126
12807b56214C0868J7472N27523A2393K02078A389f0137B32330k6891b47089A22265
12795A54082R1108E8488a02305L686d8716B11178a1200B53291l6585d786A7579
12783A19527c22277h1483D3988K20135G5259h0396b9240B32237K50507k21445
12773B61299a6106A12837J4722D4687J55627H7776b75265f4642A78177q5314J78424
12762B71287H7067o615I878J08957g0614J215j16853A75608H4499K49096H5820
12750I2898e7318C09957a66863C90383a31532c5155B21440I3853d7087k4012c1643
12738B7129P57K24919b70555A53390a3003k22022R9620I4389J5820j1411a15050
$$ plain form
12726 128634 -42516 -64664 169008 -145960 32384 251753 -80582 116001 -38408 -11360 -63017
12715 -63017 -185581 -93808 90186 521350 302134 186827 4121 383535 377748 -111880 127677
12703 96022 137162 357985 425683 191948 182202 -49385 44043 39010 278721 -295337 123767
12691 -18674 81893 249465 63221 -223769 10214 -51273 -149844 -81332 262524 101548 33266
12679 157015 68885 596918 18439 243334 173496 311699 217826 159669 213168 -79338 193568
12667 65987 239504 -75682 85609 171635 -116071 15002 -102073 164615 75451 147075 45653
12655 244967 -46242 -35158 104731 177860 -82152 10408 204385 -109123 -254405 -31441 182263
12643 -5545 73951 -254575 -121508 -144038 -177266 73471 177957 99886 22501 314177 116460
$$ packed form
12726A28634d2516k2148A69008a45960C2384K19369h0582A16001c8408a1360n1657
12715f3017j22564R1773I0186M31164k19216j15307D121L79414n787a11880A27677
12703I6022M1140K20823O7698A91948r746d9385D4043n033K39711b95337A23767
12691a8674H1893J67572F3221b23769A0214e1273r8571O8512B62524A01548C3266
12679A57015F8885N28033A8439K24895o9838J38203r3873n8157N3499g9338A93568
12667F5987J73517g5682H5609Q6026a16071A5002a02073A64615G5451P1624D5653
12655B44967d6242J1084A04731P3129h2152A0408J93977a09123j45282c1441A82263
12643e545G3951b54575a21508k2530l3228G3471J04486p8071B2501K91676A16460
$$ plain form
12631 161318 41183 425576 217508 165371 163804 311755 300120 104868 255536 339179 273568
12620 273568 8405 431124 -108161 -201238 287500 60729 325479 -123783 29428 -333512
12609 355846 328630 -361107 -70743 460895 -39922 -279491 36954 266642 147834 4215 332050
12598 332050 50246 -144318 24649 212662 -85710 345867 105325 8493 51065 -151228 -146882
12587 -146882 107616 -234795 -99769 -139901 149696 87764 166551 -375375 -60660 367487
12576 -72575 46450 -143273 154523 -42173 41298 -56427 116391 111676 294326 -190722 7875
12564 -163229 -85349 216356 41901 40915 386249 -179720 -98712 -101478 -353796 46585 -209123
12552 48886 -51702 -72930 139562 275912 77552 96510 287509 68997 -217531 156819 8933
$$ packed form
12631A61318D1183L84393k08068n2137j567J47951j1635A04868J50668Q3643o5611
12620B73568H405M22719a08161r3077B87500F0729K64750a23783B9428c33512
12609C55846k7216c61107g0743D60895c9922k39569C6954K29688j18808D215L27835
12598C32050E0246a44318B4649J88013h5710C45867A05325H493M2572a51228M346
12587a46882A07616b34795i9769m0132A49696o1932P8787c75375f0660C67487
12576g2575D6450a43273A54523d2173D1298e6427A16391m715J82650a90722G875
12564a63229P7880B16356D1901r86L45334a79720Q1008k766k52318D6585b09123
12552D8886e1702k1228A39562J36350G7552J8958J90999F8997b17531A56819H933
$$ plain form
12540 172703 283255 314790 14445 -79543 -219942 182875 28382 119515 132714 -93932 41813
12528 -55812 -103801 -68340 -39985 -442644 -218227 120119 101333 307035 38326 159324 325259
12517 325259 354607 199737 281154 102974 101806 -209854 -205089 -185595 -12653 56038 100919
12506 100919 173167 -104912 172378 120697 264959 20784 228889 407 273584 -163604 163292
12494 154108 106861 -48581 -159275 -227893 -61431 99723 240132 221186 127140 -109881 -84262
12483 -84262 -206311 -250748 235139 214284 -155350 -57263 -101063 204013 308694 97225 81736
12472 81736 -192730 -253857 9360 -355431 -195842 -307126 -33437 -165427 -76695 -146335 128272
12460 -106578 22109 -163501 114863 -16138 -61511 54856 221778 -93810 69511 13604 -6732
$$ packed form
12540A72703J10552L1535A4445g9543j40399A82875B8382R1133J3199i3932D1813
12528e5812m7989L5461K8355m02659b18227A20119j8786K05702C8326J20998J65935
12517C25259K9348j54870Q1417A02974j168b09854M765J9494a2653E6038M4881
12506A00919P2248a04912A72378n1681J44262B0784K08105D07K73177a63604A63292
12494A54108m7247d8581j10694o8618f1431I9723J40409j8946r4046a09881K5619
12483h4262j22049m4437B35139k0855a55350e7263m3800B04013J04681I7225j5489
12472H1736a92730o1127I360c55431J59589j11284c3437j31990g6695o9640A28272
12460a06578B2109a63501A14863a6138m5373E4856J66922i3810F9511A3604f732
$$ plain form
12448 120568 -8594 229444 115977 -9835 248596 59415 -117779 161198 -76740 34928 -148535
12436 201017 -8316 261584 337359 25097 -62297 -42026 -465280 -110087 66509 -284114 -190209
12425 -190209 103257 -27956 -315111 244637 -18658 94959 -254383 -210165 140500 167892
12415 167892 -96973 109905 -156425 295927 -594117 -81527 180365 155654 276664 378678
12405 378678 319822 2247 -303855 18842 119788 -272092 -294151 -119434 -62710 68694 123601
12394 123601 -72927 131573 137546 -267732 -100797 256220 -61331 -109582 39137 -11191 79998
12382 -178884 214508 -122448 1622 -58969 -147367 373 190831 -46791 23017 96929 -344420
12370 91718 -379953 -37456 -63537 -204311 -5200 94665 -192905 6679 41573 144551 -45223
$$ packed form
12448A20568h594B29444j13467i835B48596E9415a17779A61198g6740C4928a48535
12436B01017h316B61584P5775B5097f2297K0271m23254a10087F6509b84114R3905
12425a90209A03257b7956k87155B44637a8658I4959b54383M4218A40500K7392
12415A67892i6973A09905a56425B95927e94117h1527A80365k4711J21010J02014
12405C78678n8856B247c03855A8842J00946b72092k2059a19434N6724F8694N4907
12394A23601g2927A31573N973b67732a00797B56220f1331m8251C9137a1191G9998
12382a78884B14508a22448A622e8969q8398C73J90458d6791B3017P3912c44420
12370I1718c79953c7456k6081j40774e200I4665a92905F679L4894J02978d5223
$$ plain form
12358 -77805 67402 26066 47566 -253026 -154305 85680 -191155 -396282 255229 -271864 206535
12346 -64189 292003 185113 -34413 -167151 -127157 1668 -190002 -363614 160749 11335 -88006
12334 158716 -278478 97755 75627 -143693 92113 76547 -85478 213703 3312 71826 44219
12323 44219 -125373 -341382 43651 -531306 -122261 -107231 245897 -234984 299132 -336302
12312 127113 -61335 -194371 -312329 -118557 104653 -84856 -109352 -205220 -31017 -55378 295139
12300 -68943 170936 -34635 216816 -91763 238608 249533 32750 26338 294408 188795 179331
12289 179331 -21010 293048 -109187 154917 -210585 360443 4679 -38978 472390 -31808
12278 25442 158844 66660 235558 186644 76978 -112009 -21019 -343215 94638 185199 293535
$$ packed form
12358g7805F7402B6066K1500b53026R8721H5680a91155k05127B55229b71864B06535
12346f4189B92003j06890c4413j32738L9994A668a90002j73612A60749A1335h8006
12334A58716b78478I7755k2128a43693I2113j5566h5478B13703C312O8514k7607
12323D4219a25373k16009D3651e31306a22261J5030B45897b34984B99132c36302
12312A27113f1335j33036j17958a18557A04653h4856k4496r5868c1017k4361B95139
12300f8943A70936c4635B16816i1763B38608J0925C2750o412K68070j05613r464
12289A79331b1010B93048a09187A54917b10585C60443D679c8978D72390c1808
12278B5442J33402F6660J68898m8914G6978a12009b1019l22196I4638R0561J08336
$$ plain form
12267 293535 100545 89111 -291070 41775 101689 -6193 -123418 -22668 -108497 -54761 337191
12255 -90369 193323 174341 -161886 150467 120309 63466 223572 -159516 96479 163803 11650
12243 72392 -64108 77352 -24784 86341 -250341 154785 287662 45220 370709 109230 -42250
12231 289535 28182 -12209 430031 179489 505941 530947 375638 -114113 63530 67841 20303
12219 -2659 196951 231584 146514 42212 249328 297626 160797 122305 -82664 184541 329538
12208 329538 119262 215938 116143 264580 356860 -84997 79013 243992 178508 245806 13235
12196 99764 126163 457125 473197 -59423 116982 1433 299190 215934 365109 -24307 -2197
12184 615941 162858 70226 -24299 27336 297117 -8982 299367 342466 101086 69522 423519
$$ packed form
12267B93535A00545j1434b91070D1775N9914f193j17225b2668q5829N3736C37191
12255i0369A93323j8982a61886A50467l0158n6843J60106a59516I6479O7324A1650
12243G2392f4108G7352b4784H6341b50341A54785J32877D5220L25489A09230d2250
12231B89535B8182a2209D30031A79489L26452K5006j55309a14113F3530M311B0303
12219b659A96951L4633q5070D2212K07116M8298j36829l8492h2664A84541J44997
12208C29538A19262R6676r9795J48437R2280h4997G9013J64979o5484O7298A3235
12196I9764K6399L30962J6072e9423A16982A433K97757q3256J49175b4307b197
12184F15941A62858G0226b4299B7336K69781h982B99367M3099A01086l1564L53997
$$ plain form
12173 423519 81225 -79532 182906 81596 151807 179873 240573 174445 -20372 34192 288918
12162 288918 381470 -88106 283431 -32488 71131 -255058 -117610 98467 3582 160238 -141233
12150 15730 200203 158349 156009 -98466 188695 -160667 142680 35546 25026 133132 -96887
12138 155185 196652 51510 140245 161417 83410 15070 161717 169188 -171129 -18684 228683
12126 -181412 -14131 -5878 139614 29077 -66213 -35517 174 236029 -80552 108200 212981
12115 212981 -126265 -215674 -71981 244726 -76177 126025 11814 40471 -197552 -57667 325125
12103 216398 144760 -27714 -327604 29268 213199 -240295 241232 -173289 -236481 -22684
12092 -102925 16522 -71608 -74999 -162627 -284468 161427 21528 173202 151994 47365 189377
$$ packed form
12173D23519H1225g9532A82906H1596P0211K8066O0700o6128b0372C4192K54726
12162B88918R2552h8106B83431c2488G1131b55058a17610I8467C582J56656a41233
12150A5730J84473m1854k340i8466A88695a60667A42680C5546j0520J08106i6887
12138A55185M1467E1510Q8735K1172p8007A5070J46647P471a71129a8684B28683
12126a81412a4131e878A39614B9077f6213L0696A74K35855h0552A08200J04781
12115B12981a26265q9409g1981B44726g6177A26025A1814K8657a97552e7667C25125
12103B16398p1638b7714k99890B9268J83931b40295B41232a73289o3192b2684
12092a02925A6522g1608l391q7628j21841A61427B1528J51674k1208D7365J42012
$$ plain form
12081 189377 -151142 -60589 63132 -237255 -10695 240376 -213123 -531337 29414 20421 124140
12070 124140 -40374 2319 2926 194553 165196 -148046 200097 93016 -26805 163622 636456
12059 636456 895756 1342711 597746 288300 561044 55945 -24556 -108460 219913 -16223
12048 46934 181362 -191545 -70442 130865 -49891 72160 8205 -84675 217309 -234576 30341
12036 -27050 135570 71659 -85011 22523 -118731 -122267 -165850 290990 100967 -23566 -118454
12025 -118454 111503 70655 54089 -8093 -51569 -225989 178126 -250306 177063 -107374
12014 51794 2082 -191566 -109593 69896 70328 -255857 -13416 24385 -211952 9909 -32824 -34560
12002 -34560 68597 240780 -168318 -223558 -74889 -90377 130646 -59018 -4495 70370 -153885
$$ packed form
12081A89377a51142f0589F3132b37255a0695B40376b13123l18214B9414q993J03719
12070A24140d0374B319O07J91627k9357a48046B00097I3016b6805A63622M72834
12059F36456K59300M46955E97746B88300K72744E5945b4556q3904B19913a6223
12048D6934J34428a91545g0442A30865d9891G2160H205h4675B17309b34576C0341
12036b7050A35570o3911h5011B2523a18731l536m3583B90990A00967b3566r4888
12025a18454A11503m0848j6566h093m3476j74420A78126b50306A77063a07374
12014E1794B082a91566Q1973F9896M32b55857a3416B4385b11952I909c2824j736
12002c4560F8597J72183a68318n5240g4889j5488A30646e9018d495G0370a53885
$$ plain form
11990 9785 -170612 -174607 59950 68965 -288272 119141 -112453 -186663 -48919 67935 13826
11978 348605 -138480 243005 -280100 -306130 333328 2251 -7191 41584 -18791 -100313 159100
11966 -25973 141124 223001 24251 -114272 -50778 115514 162417 -157643 -44845 -127808 -127581
11955 -127581 114639 -234921 289163 -243431 -210243 -66282 -8614 -128234 121777 -28716
11944 334 7029 -44723 -40558 56687 64816 -416990 -176993 25059 210336 -78148 175040 67215
11931 -208544 -222538 -106200 -437377 -114086 -451683 -178188 -324781 93468 183854 -42225
11920 22751 -73017 -8359 61785 141360 49426 -348072 -86717 -189630 22294 102811 260296
11909 260296 39830 -4880 -205080 129021 -9355 -247168 21304 28168 204299 72282 -76361
$$ packed form
11990I785a70612l995E9950R015b88272A19141a12453p4210d8919F7935A3826
11978C48605a38480B43005b80100k6030C33328B251g191D1584a8791q1522A59100
11966b5973A41124Q1877B4251a14272e0778A15514M6903a57643d4845q2963K27
11955a27581A14639b34921B89163b43431L3188f6282h614j19620A21777b8716
11944C34O695d4723M165E6687Q129d16990a76993B5059J85277g8148A75040F7215
11931b08544j3994a06200l31177a14086l37597a78188j46593I3468R0386d2225
11920B2751g3017h359F1785P9575D9426c48072h6717j02913B2294Q0517J57485
11909B60296C9830d880k00200A29021i355k37813B1304O864J76131G2282g6361
$$ plain form
11897 181105 100759 123924 -175764 -230041 332616 -214206 -156537 93407 290347 -41260 -156496
11886 -156496 -86885 -265385 43567 -5637 -52851 -7414 20478 97526 -258395 27347 -147088
11874 -315299 107194 24667 65651 73125 -61219 306477 51780 -174048 41162 516978 171985
11862 -174167 36194 -76857 -126435 -21366 -46407 126746 -84136 -278486 -415323 126041 16481
11850 -394522 -268782 31296 14093 154475 126125 201743 44233 -43676 -68472 -112572 -114549
11839 -114549 69370 -433601 -49586 -66150 210319 -216484 -357410 20863 -132812 -340063
11829 -340063 44704 120694 97352 25197 -10566 -53304 -53493 -109998 121818 -281403 181286
11817 -209884 -13876 -274478 9718 -172431 -155888 117490 -9291 42178 136438 -55255 21543
$$ packed form
11897A81105q0346K3165a75764n4277C32616b14206N7669I3407J96940d1260j15236
11886a56496O9611j78500D3567e637m7214g414B0478P7048b58395B7347a47088
11874c15299A07194B4667M0984P474f1219C06477E1780a74048D1162M75816A71985
11862a74167C6194g6857m9578b1366k5041A26746h4136j94350j36837A26041A6481
11850c94522J25740C1296A4093J40382k8350P5618D4233d3676k4796m4100j977
11839a14549F9370d33601d9586j6564B10319b16484j40926B0863a32812k07251
11829c40063D4704P5990k3342B5197a0566m2738j89n6505A21818b81403A81286
11817b09884a3876k60602I718a72431J6543A17490i291D2178R4260e5255B1543
$$ plain form
11805 -378446 61179 -188079 -244776 -2451 163111 533042 -110512 283780 -131750 -250660
11795 -250660 54910 97716 11422 -214576 -18067 -44292 303406 -264990 88867 -239217 60161
11783 -159274 -65176 -99836 -214380 134462 -45823 -38579 -168500 109576 -5221 -27404 -209495
11772 -209495 -40844 -150640 95035 -21253 -105339 -18942 121382 67993 23366 -118819 181378
11760 -110430 -36828 -22552 63609 -30272 282992 255672 78242 -309285 123339 -247739 315416
11748 -41548 41969 23967 -31622 -99976 108453 -157030 129045 -11322 129717 208666 133282
11737 133282 52798 33633 -55379 -28179 -198696 -41003 24572 -401118 -59263 52983 42566
11726 42566 389047 -117071 27213 -33729 -160623 76456 306584 -161018 -118366 156030
$$ packed form
11805c78446F1179a88079n6697b451A63111L69931a10512B83780a31750j18910
11795b50660E4910M2806A1422b14576a8067k6225C03406b64990H8867b39217F0161
11783a59274f5176l4660j14544A34462d5823P244j29921A09576e221k2183j82091
11772b09495d0844j09796I5035b1253q4086a8942A21382n3389B3366a18819A81378
11760a10430c6828J4276F3609c0272B82992k7320G8242c09285A23339b47739C15416
11748d1548D1969j8002c1622o8354A08453a57030A29045a1322A29717P8949p5384
11737A33282E2798j9165e5379K7200j70517d1003B4572d01118e9263E2983j0417
11726D2566L46481a17071B7213c3729j26894G6456K30128a61018M2652A56030
$$ plain form
11715 -58210 -25976 159760 -114817 -11340 40536 -67852 -154142 58612 238057 296356 -46596
11703 -4740 396216 54614 -151084 1269 43934 4882 76332 237243 -163965 221125 423298
11692 423298 60691 234506 -8261 348004 128528 327369 119398 -69069 25728 121993 128579
11681 128579 185321 196388 101802 162845 279030 -111475 -361231 45842 -24432 -795 146839
11669 147146 -21882 309057 203538 -63131 -154453 8923 211987 5149 -52262 -161191 82895
11657 100666 142881 -153547 89139 301698 -162317 267764 294970 -184131 -91277 -210544
11647 -210544 -305119 38039 107873 -34688 285814 -151568 115481 38872 137310 102043 -160349
11635 -160840 29803 111087 -3463 -47193 -172684 377256 240462 347787 206208 241497 48487
$$ packed form
11715e8210b5976A59760a14817a1340D0536f7852q6290E8612J79445N8299d6596
11703d740C96216E4614a51084A269M2665D882P1450J60911a63965B21125K02173
11692D23298F0691J73815h261C48004A28528J98841A19398f9069B5728R6265O586
11681A28579N6742J1067r4586O1043J16185a11475k49756D5842b4432g95A46839
11669A47146b1882C09057j05519f3131r1322H923K03064E149e2262j08929H2895
11657A00666M2215a53547H9139K12559a62317B67764K7206a84131i1277j19267
11647b10544r4575C8039O9834c4688B85814a51568A15481C8872R8438l5267a60349
11635a60840B9803Q1284c463m3730j25491C77256j36794J07325j41579L5289D8487
$$ plain form
11623 259990 111166 -29334 -3846 89278 -188801 -138195 -390036 -211358 95549 -61519 74542
11611 179426 70812 -163069 253488 251045 233714 256005 -73608 266304 204095 467182 177556
11599 49270 -61375 135745 -72639 8361 175519 145311 -11434 -1804 356174 127747 314129
11588 314129 401757 414858 200577 196483 -147389 -227258 155689 163982 52030 50617 -16801
11576 -88573 250434 -127084 -39843 453260 337186 341846 176595 -41859 106152 101492 157650
11565 157650 261984 311397 64877 -75805 -72546 42045 56323 -107362 206031 273700 45897
11553 119631 234715 232517 269435 94714 362470 -8400 -45605 363193 262637 158321 80171
11542 80171 88276 -72149 125862 303709 40399 195195 169560 199390 -136566 15941 -59697
$$ packed form
11623B59990A11166b9334c846H9278a88801N0606k51841J78678I5549f1519G4542
11611A79426G0812a63069B53488k443j7331K2291g3608B66304o2209K63087A77556
11599D9270f1375A35745g2639H361J67158l0208a1434a804C56174A27747J86382
11588C14129Q7628J3101B00577m094a47389p9869A55689Q293E2030j413a6801
11576h8573B50434a27084c9843D53260j16074M660j65251d1859A06152m660N6158
11565A57650J04334M9413F4877g5805L259D2045J4278a07362B06031O7669D5897
11553A19631J15084k198L6918I4714K67756h400l7205C63193j00556j04316p8150
11542H0171Q105g2149A25862J77847D0399J54796k5635K9830a36566A5941e9697
$$ plain form
11530 -530176 -285627 -72546 238143 237052 284466 -62088 502725 72359 324738 175460 -284124
11518 132683 36697 18478 192426 273103 113066 -225010 256385 259636 83157 -159891 113973
11506 203194 375991 89961 -91108 313783 201500 481493 144902 -122088 -139479 311453
11495 19236 136496 -43582 126308 -100719 44452 46128 19889 -12868 210337 36097 129159
11484 129159 -4658 -34437 178007 402404 223986 -9632 -259024 176139 397286 202328
11474 202328 98567 -193701 -20748 99029 225475 236100 309402 111839 142282 153488 -148906
11462 33517 221312 219137 -89829 -110242 236262 351955 292512 44609 96058 410937 19388
11450 472811 1263 288384 287452 -29362 -13766 -109570 211364 241594 139425 108499 -196451
$$ packed form
11530e30176K44549g2546B38143j091M7414f2088E02725G2359K52379j49278b84124
11518A32683C6697j8219J73948Q0677A13066b25010B56385L251H3157a59891A13973
11506B03194J72797H9961i1108C13783j12283K79993A44902a22088j7391C11453
11495A9236J17260d3582A26308a00719D4452J676A9889a2868B10337C6097R3062
11484A29159d658k9779A78007K24397j78418i632k49392A76139K21147j94958
11474B02328I8567a93701b0748I9029J26446J0625P3302A11839L0443J1206a48906
11462C3517J87795k175h9829k0413B36262J15693n9443D4609N1449L14879A9388
11450D72811A263K87121r32b9362a3766r5804B11364L0230j02169l0926a96451
$$ plain form
11438 -148240 227741 35070 -307370 211094 222876 112182 27069 -356523 504928 -42422
11427 86965 338067 106985 75460 -177019 337177 26371 273456 -245259 -249786 -47008 -22971
11415 152477 -74755 -126246 -133397 -74614 155644 -83318 33026 151243 -36265 -104468 -80471
11404 -80471 124391 -65939 185997 236067 -103644 77580 250413 -21525 -217886 -375363
11394 -375363 181002 61627 -150924 -17638 16464 -263208 -11058 -152994 14142 -112121
11383 11783 287891 285305 89663 -17908 144071 93455 -90424 -95743 84580 220636 -225754
11371 -54861 498 -13997 -10653 73708 -44093 -346183 58287 334171 -75681 -98061 158588 -126990
11358 -22389 -40636 -117787 -361594 312858 147474 -191311 -39478 59109 -179924 -153792 60606
$$ packed form
11438a48240B27741C5070c07370B11094J1782j10694B7069c56523E04928d2422
11427H6965K51102A06985l1525a77019C37177B6371K47085b45259m527d7008b2971
11415A52477g4755n1491p151N8783A55644h3318C3026J18217c6265o8203K3997
11404h0471A24391f5939A85997N0070a03644G7580J72833b1525j96361j57477
11394c75363A81002F1627a50924a7638A6464b63208a1058j41936A4142a12121
11383A1783K76108k586H9663a7908A44071n0616i0424n319H4580J36056b25754
11371e4861D98a3997L344G3708d4093l02090E8287K75884g5681k2380A58588a26990
11358b2389j8247p7151k43807C12858A47474a91311c9478E9109a79924K6132F0606
$$ plain form
11346 257422 -160202 155093 -58358 371555 294895 182197 -21276 185909 9395 2990 -23348
11334 212726 89655 -109580 -103066 190108 30101 -179392 35665 -277795 126712 -189089
11323 -36420 141965 165304 75122 414652 38726 144083 58227 -152219 113230 181772 19771
11311 142094 383443 -128825 -215207 65742 158652 -228911 39326 -97472 -52661 93735 -152371
11299 92343 34182 99140 -45290 -175506 -75688 -289834 184155 72028 -96389 246419 152082
11288 152082 -216899 -140490 100162 -54212 124627 -9785 314801 -67414 -12154 -296721 90618
11276 -11651 -9983 -255666 207627 -300561 -147655 70890 -316052 329005 -213963 191765
11265 -56567 29702 -425984 -59854 -59555 -1081 211609 -109097 125064 -110142 -196626 -367278
$$ packed form
11346B57422a60202A55093e8358C71555p6660j12698b1276A85909I395B990b3348
11334B12726H9655a09580O514A90108C0101a79392C5665b77795A26712a89089
11323c6420A41965K3339G5122L39530C8726J05357E8227a52219A13230O8542A9771
11311A42094K41349a28825q6382F5742R2910b28911C9326i7472M4811I3735a52371
11299I2343C4182O4958d5290j30216g5688k14146A84155G2028i6389B46419r4337
11288A52082b16899P6409A00162e4212A24627i785C14801f7414a2154k84567I0618
11276a1651J668k45683B07627c00561a47655G0890c16052C29005b13963A91765
11265e6567B9702d25984e9854K99a081B11609a09097A25064a10142q6484j70652
$$ plain form
11254 -367278 -23056 231868 -330449 282588 29399 -365655 -72075 4838 -271756 141674
11243 -176349 19609 125696 -127845 197992 -89675 -177517 77210 -210770 -39776 -2464 255253
11231 -172696 -117321 65118 83242 -308228 372376 267990 -259179 148803 18951 -182655
11220 -363536 106553 -123006 -49802 117003 146084 -3200 -86052 -9134 -542748 3084 -71684
11208 53803 -135979 144105 -297783 88797 -222413 61480 -2601 102728 -243684 -17020 197491
11196 75725 -83318 -62710 -93656 -152415 36540 180999 -249318 39 246829 44204 -41145 135430
11183 32258 -75799 -179035 -63641 -100760 -13767 -369353 314680 -299632 368918 378958 -59591
11171 -182559 68039 -52365 -284074 -281242 -120063 -109608 -381883 139033 -72934 28572 -50629
$$ packed form
11254c67278b3056B31868c30449B82588B9399c65655g2075D838b71756A41674
11243a76349A9609J06087a27845A97992h9675q7842G7210b10770c9776b464B55253
11231a72696N5375F5118J8124c08228C72376j04386b59179A48803A8951a82655
11220c63536A06553a23006d9802A17003K9081c200q2852i134n33614C084g1684
11208E3803a35979A44105b97783H8797b22413F1480b601A02728b43684a7020A97491
11196G5725h3318K0608l0946n8759C6540J44459b49318C9K46790D4204d1145A35430
11183C2258g5799j03236f3641l7119a3767l55586C14680b99632C68918J0040e9591
11171a82559F8039e2365k31709K832a20063J0455k72275A39033g2934B8572e0629
$$ plain form
11159 -138599 169609 -104828 -52944 -215100 102718 139146 -141881 147998 242585 -126605
11148 179317 -193116 126264 52709 -217248 124847 -7688 217417 157599 79501 68075 -24724
11136 -94723 -326327 49371 -66253 30874 62850 21048 250198 62988 103427 -215174 -144914
11125 -144914 -180758 -56569 138645 158616 -14738 -205195 -181583 355902 89531 104527 266690
11114 266690 165779 307194 -87808 -99446 31033 96436 -2589 -103443 312908 206635 351996
11103 351996 461382 173557 193636 -79340 291963 418037 -190128 150773 11746 276420
11093 276420 168830 223286 775789 164695 473238 450635 42585 519307 186702 -52325
11082 249388 162577 93607 284356 226103 177966 153812 297125 185018 335564 219174
$$ packed form
11159a38599A69609a04828N1884j62156A02718L6428a41881A47998R4587a26605
11148A79317a93116A26264E2709b17248A24847g688B17417n9818p8098j1426b4724
11136i4723k31604D9371f6253C0874L1976B1048K29150F2988M0439b15174P0260
11125a44914l5844e6569A38645J9971a4738j90457K3612C55902H9531J4996J62163
11114B66690j00911J41415h7808j1638C1033O5403b589j00854C12908j06273J45361
11103C51996J09386A73557K0079g9340B91963J26074a90128A50773A1746K64674
11093B76420j07590N4456N52503A64695L08543k2603D2585M76722A86702e2325
11082B49388q6811o8970J90749n8253m8137k4154J43313j12107J50546j16390
$$ plain form
11072 219174 342505 324274 501224 28591 431194 394123 723291 722239 258612 347428 456541
11061 456541 427876 586971 628257 627991 650926 796825 756902 519601 949351 698016 811270
11050 811270 930370 399403 850138 1033861 831964 761503 813914 728828 727852 659491 764055
11039 764055 663523 969248 774502 1178668 878819 815280 783319 444608 831209 914103
11029 914103 664631 1023255 872222 620460 820099 816548 756083 616388 506964 710508
11019 710508 829140 537229 581634 955804 761290 913926 618337 625258 539849 214373
11008 923067 883356 139693 773043 428013 588804 463008 794637 1254536 844851 767731
10998 767731 851002 512378 803680 959110 821069 1007657 544562 886415 1169723 935111
$$ packed form
11072B19174J23331j8231J76950B8591M02603l7071L29168j052B58612Q8816J09113
11061D56541k8665J59095M1286k66K2935J45899l9923k37301M29750k51335J13254
11050H11270J19100C99403M50735J83723k01897p0461N2411q5086r76o8361J04564
11039G64055j00532L05725j94746M04166k99849o3539l1961l38711L86601Q2894
11029I14103k49472L58624j51033k51762J99639l551o0465j39695j09424K03544
11019G10508J18632k91911M4405L74170j94514J52636k95589O921q5409B14373
11008I23067l9711A39693O33350l45030J60791j25796L31629M59899m09685p7120
10998G67731Q3271l38624K91302J55430j38041J86588m63095L41853K83308k34612
$$ plain form
10988 935111 705480 670842 957883 938812 1133722 1179180 1469717 1257342 1660354 1711149
10978 1711149 1800210 1945498 2330679 2463863 2731644 3109677 3702616 3311726 3245346 3314012
10968 3314012 2758819 2921825 2312838 2081382 1995281 2093349 1659714 1930838 1967912 1632414
10958 1632414 1674356 1427951 1735604 1564077 1547954 1006199 933514 451802 684581 409594
10948 409594 600280 305134 380464 277762 564272 10999 271243 440492 -50239 165304
10937 521935 193392 47257 95489 229214 39381 374261 427334 -222390 83925 159804 109949
10926 109949 302732 -118137 49096 212088 71249 -51065 -36340 -65064 56464 -135669 -243351
10915 -243351 136485 -163262 111936 -23730 59984 -2151 210806 -156706 -42447 -165167
$$ packed form
10988I35111k29631l4638K87041j9071J94910M5458K90537k12375M03012N0795
10978A711149Q9061J45288L85181J33184K67781L78033N92939l90890o6380O8666
10968C314012n55193J63006o08987k31456q6101R8068m33635K71124L7074l35498
10958A632414M1942k46405L07653j71527j6123n41755p2685D51802K32779k74987
10948D09594J90686k95146P5330j02702K86510A0999K60244J69249e0239A65304
10937E21935A93392D7257M8232J33725C9381L34880N3073b22390H3925P5879m9855
10926A09949J92783a18137D9096J62992G1249e1065J4725k8724E6464a35669j07682
10915b43351A36485a63262A11936b3730E9984b151B10806a56706d2447j22720
$$ plain form
10905 -165167 -106403 -146842 -48750 -48970 -138640 -177481 189557 249951 53925 246 -13707 173876
10892 -77980 5033 219491 56218 87728 232419 15963 49215 -245926 -40813 -182263 12006
10880 -195200 52441 56734 230952 -35353 4836 -102263 -33307 151221 -20446 116223 103586
10869 103586 -162479 -126282 -2121 -423422 17391 148172 46594 -430718 -111930 -209112 32961
10857 199289 -298423 215232 249178 214050 157652 74019 92008 -220042 97831 341387 116310
10845 -45398 -26219 44864 -305994 -353763 -140657 -47900 145095 -22118 -91902 -131360 -63147
10833 235157 137104 4255 -96717 15689 -587 81940 -270594 156649 -93096 -357059 229085
10821 78692 64107 143262 -26779 -2090 123029 224490 157863 -234915 -247991 55845 60122
$$ packed form
10905a65167N8764m0439d8750k20q9670l8841A89557O0394E3925B46a3707A73876
10892g7980E033K14458E6218L1510J44691A5963L3252b45926d0813j41450A2006
10880a95200E2441M293J74218c5353D836a02263c3307A51221b0446A16223j2637
10869A03586a62479L6197b121m21301A7391J30781D6594d30718a11930r7182C2961
10857A99289b98423B15232L3946l5128n6398G4019J7989b20042I7831K43556A16310
10845d5398J9179D4864c05994m7769a40657d7900A45095b2118o9784l9458f3147
10833B35157r8053D255i6717A5689e87H1940b70594A56649i3096k63963B29085
10821G8692j4585P9155b6779b090A23029J01461o6627b34915j3076E5845M277
$$ plain form
10810 60122 2823 22625 4737 -215109 -397220 -166634 27596 -231473 -9271 -7655 19632 71480
10798 71480 -217236 206758 -29877 -85873 -355288 -150187 38512 -68533 -168676 -134066 64324
10786 -253725 -3146 122037 62053 -59251 -509377 -336627 150728 -98297 10375 -113212 261245
10774 41127 138856 268559 -128354 318920 308730 -281718 84340 396755 11589 -82644 -180919
10763 -180919 -133452 -254275 -266621 -259157 87053 83794 36282 -198734 -385415 218516 -166392
10751 -341210 44222 44689 -138785 -107339 -123252 87711 -117188 -163830 111665 -326210 2657
10739 209066 107925 161006 -343406 -67459 91753 -337495 107173 -24713 -194284 -88776
10728 -301343 -279985 -24533 185155 -190783 -236400 -261713 -197208 -88327 -123816 -79003 -7291
$$ packed form
10810F0122B823J9802D737b15109j82111a66634B7596b31473i271J616A9632N1848
10798G1480b17236B06758b9877n5996k69415a50187C8512f8533j00143L4610F4324
10786b53725c146A22037n9984e9251m50126J72750A50728i8297A0375a13212B61245
10774D1127R7729J29703a28354C18920j0190b81718H4340L12415A1589h2644r8275
10763a80919M7467j20823j2346P464H7053l259C6282a98734j86681B18516a66392
10751c41210D4222M67a38785L1446j5913H7711a17188m6642A11665c26210B657
10739B09066j01141N3081c43406f7459I1753c37495A07173b4713j69571h8776
10728c01343K1358b4533A85155a90783m5617k5313O4505h8327l5489M4813g291
$$ plain form
10716 -232653 -151841 14946 -65798 -79565 -215851 -76105 -117116 -163043 15906 -153105 175326
10704 116022 65900 -181624 61599 -54223 -183949 -106935 127727 87430 343054 199828
10694 199828 -257748 -272415 -33676 -40740 243727 168646 -142251 286203 -101052 -38984 15231
10682 270266 -254595 -154001 -44061 171484 -80687 -106868 185349 87031 -83419 239798
10671 -324162 18618 -53499 -185058 -236304 -249734 -106259 279445 -189209 -61417 -130443 -97563
10660 -97563 274957 13526 -74726 91179 72968 -143894 34961 -455170 -153696 -102034 -168763
10649 -168763 -100857 -14511 -283118 -12103 -109501 123576 157519 342349 -79328 224390 -229523
10637 -225784 65752 199123 -189365 -313825 -2559 151641 -100067 473 -233629 -260236 -137992
$$ packed form
10716b32653Q0812A4946f5798j3767j36286g6105m1011m5927A5906a53105A75326
10704A16022n0122a81624F1599e4223j29726P7014A27727m0297K55624j43226
10694A99828b57748j4667c3676p064B43727p5081a42251B86203a01052c8984A5231
10682B70266b54595J00594d4061A71484h0687k6181A85349H7031h3419B39798
10671c24162A8618e3499j31559n1246j3430a06259B79445a89209f1417o9026L2880
10660i7563B74957A3526g4726I1179j8211a43894C4961d55170a53696N1662o6729
10649a68763O7906a4511k68607a2103r7398A23576L3943J84830g9328B24390b29523
10637b25784F5752J33371a89365j24460b559A51641a00067D73b33629k6607J22244
$$ plain form
10626 -137992 -180243 41858 176551 126896 120558 -79367 69097 -160113 179221 -74945 139073
10614 134522 -64925 -210863 179216 -52054 -145290 -167203 -152382 22255 105415 394462 -105634
10602 -98487 -205705 143003 -170784 -89337 -7471 -240731 -211586 -289548 -192867 -262313 17451
10590 -227449 94132 -79992 -162068 -263550 25922 73832 77516 -165305 -250144 209902 78471
10578 -102768 165811 -28471 -55549 52333 -192532 -401740 223233 -3897 -164260 56794 -20030
10566 234224 102839 16671 -359439 -200770 15114 44967 -370283 144364 -47252 -171246
10556 -171246 -224191 21567 220771 197642 3824 -215661 -23357 99510 -269587 -91512 62956
10544 -374056 -120806 -50482 -192668 -139973 99186 -29503 -100825 -615 218808 -565 -47250 -175429
$$ packed form
10626a37992m2251D1858J34693m9655o338g9367F9097a60113A79221g4945A39073
10614A34522f4925j45938A79216e2054r3236k1913J4821B2255Q3160K89047a05634
10602i8487j07218A43003a70784Q1447g471k33260K9145p7962R6681o9446A7451
10590b27449I4132g9992q2076j01482B5922M7910L684a65305q4839B09902G8471
10578a02768A65811b8471k7078E2333a92532k09208B23233c897j60363E6794b0030
10566B34224A02839A6671c59439J58669A5114K9853c70283A44364d7252j23994
10556a71246n2945B1567J99204k3129C824b15661b3357I9510b69587i1512F2956
10544c74056a20806e0482j42186N2695I9186b9503p1322f15B18808e65m6685j28179
$$ plain form
10532 -175429 -305075 -542896 -40455 -74394 -71656 -100717 124209 -137658 -306781 70679 50111
10521 50111 -14454 -293580 -128 -147374 64389 -28971 315496 -74125 99862 -156078 -320098
10510 -320098 -70417 -349828 79636 -225825 -125033 -30974 -31926 -5761 315481 -15240 -4367
10498 -19005 182638 -7236 90686 -170129 -77987 151869 -236702 206705 241851 -31565 -133333
10487 -133333 328507 33709 357594 412052 677513 193867 101571 286582 232574 4701 -85735
10475 408437 275461 -14543 -296109 79012 132037 -368624 -182233 53499 -270562 -147485
10465 -147485 204469 -107471 6760 -60952 109613 -277475 -177771 -16665 -28808 -158831 -355160
10454 -355160 -160595 163346 34566 118697 -250010 -50798 -343445 168030 -204919 -432419
$$ packed form
10532a75429j29646k37821d0455l3939K738k9061A24209a37658j69123G0679k0568
10521E0111a4454k79126a28j47246F4389b8971C15496g4125I9862a56078j64020
10510c20098g0417k79411G9636b25825J00792c0974r52e761C15481a5240d367
10498a9005A82638g236I0686a70129g7987A51869b36702B06705L5146c1565j01768
10487a33333C28507C3709L23885N4458K65461A93867r2296J85011n4008D701h5735
10475D08437j32976a4543k81566G9012N3025c68624a82233E3499b70562J23077
10465a47485B04469a07471F760f0952A09613b77475R9704a6665j2143j30023j96329
10454c55160a60595A63346C4566Q4131b50010e0798k92647A68030b04919k27500
$$ plain form
10444 -432419 81876 -73350 -139218 81562 -38986 -2604 -100894 374229 99054 -48297 -175447
10433 -175447 -74453 -382657 200916 -134647 292659 -89046 42338 -4387 -68032 -105038 -188606
10422 -188606 58828 8127 -89555 -172111 -128512 288166 -216279 -118753 5922 -73593 -165342
10411 -165342 100336 -101996 -19340 235590 -165815 -162558 -67915 98457 -104554 170359
10400 153779 70568 22838 137804 230772 110890 101232 148803 313931 92067 216340 -15549
10388 167642 124324 265875 17637 186295 70773 32947 211640 130240 124607 175463 139876
10377 139876 392845 11902 293090 -125441 151624 230222 247814 148254 776304 709237
10367 709237 442486 477537 647602 139995 629529 157893 431784 111822 344946 16287
$$ packed form
10444d32419H1876g3350o5868H1562c8986b604r8290C74229I9054d8297j27150
10433a75447g4453l08204B00916a34647B92659h9046D2338d387o3645l7006q3568
10422a88606E8828H127h9555q2556M3599B88166b16279R7526E922g3593r1749
10411a65342A00336a01996a9340B35590a65815L257f7915I8457a04554A70359
10400A53779G0568B2838J14966R2968A10890r658M7571J65128I2067J24273a5549
10388A67642m3318J41551A7637J68658G0773C2947J78693q1400n633N0856l5587
10377A39876K52969A1902K81188a25441A51624P8598J7592r9560O28050o7067
10367G09237k66751L5051J70065A39995M89534A57893K73891A11822K33124A6287
$$ plain form
10356 171836 408752 368424 384176 203366 556134 564316 722319 659393 654917 284629 545213
10345 545213 338407 635521 609958 223944 316402 510399 251995 432045 294794 337694
10335 337694 259892 311450 290123 85321 178852 -50679 250458 256811 322383 -50866 250218
10323 334727 251755 211804 325602 359042 -142713 294782 277433 231348 119254 17607 105619
10312 105619 175471 -175663 45016 -116816 264245 -51057 206457 35155 13533 -222888
10301 93629 -219350 -40672 5345 57676 160554 -34039 -239440 -49804 52280 -257623 -281830
10290 -281830 234565 -317915 -13273 -63046 36035 -14525 128805 -43370 -9095 -191509 285403
10278 334342 122010 15583 54987 -179060 122129 -188236 -214349 -237499 177391 -44706
$$ packed form
10356A71836K36916m0328J5752j80810L52768Q182J58003o2926m476B84629K60584
10345E45213k06806K97114k5563B23944R2458J93997B51995J80050j37251M2900
10335C37694p7802N1558k1327H5321R3531e0679B50458O353O5572e0866B50218
10323C34727q2972l9951J13798L3440a42713B94782j7349m6085j12094A7607Q8012
10312A05619O9852a75663D5016a16816B64245e1057B06457C5155A3533b22888
10301I3629b19350d0672E345N2331J02878c4039k05401d9804E2280b57623k4207
10290b81830B34565c17915a3273m9773C6035a4525A28805d3370i095j82414B85403
10278C34342A22010A5583L9404a79060A22129a88236k6113k3150A77391d4706
$$ plain form
10267 -19816 103800 172687 185531 25672 723675 350870 423880 433458 338204 486196 253804
10256 253804 239983 150524 -326211 -30249 29384 -86184 -163361 60130 -306240 -75577 91615
10244 189159 -103500 -347021 -291895 255032 48515 -115619 -6143 -106592 -87349 -80434 -80430 -271127
10232 -271127 21786 24405 133788 203160 300766 -274159 -133481 109934 -241065 -45924 -204522
10221 -204522 61450 -86988 198826 -226213 -263200 81602 108073 -255164 -157734 -240014 -29192
10209 -262653 -23208 -167779 -35610 -12538 -189243 -70411 -250234 -317217 -46839 115897 302166
10198 302166 -171154 -25767 -466898 -200240 -7743 124064 137579 53537 206009 34470 -9034
10186 165645 -547827 -340480 115011 -299502 -285706 -279181 100682 -506281 -322088 -143982
$$ packed form
10267a9816A03800O8887J2844B5672O98003C50870P3010R578r5254J47992k32392
10256B53804j3821q9459c26211c0249B9384h6184p7177F0130c06240g5577I1615
10244A89159a03500k43521N5126B55032D8515a15619f143j00449J9243O915Mj90697
10232b71127B1786K619J09383O9372R7606b74159a33481A09934b41065d5924j58598
10221b04522F1450h6988A98826b26213l6987H1602K6471b55164R7430q2280b9192
10209b62653b3208j44571c5610a2538j76705g0411j79823o6983d6839A15897J86269
10198C02166a71154b5767m41131b00240g743A24064J3515E3537J52472C4470i034
10186A65645e47827K07347A15011b99502J3796O525A00682e06281J84193a43982
$$ plain form
10175 -42793 23311 288233 -355878 -118533 -235549 248566 65013 272744 57074 -198618
10164 -254156 -200480 -351912 -84032 176518 40004 146692 -68665 -193067 185278 180832 -148138
10152 37042 -264051 -5964 -197301 -56516 203593 37287 -205249 38268 173382 -23690 298592
10140 -182754 -17450 -83162 -139979 91345 29914 -61787 -120951 182796 -196733 101961 -363913
10128 11201 -86989 -124900 -277271 6773 47692 -103728 -353439 269610 271223 -415425 -356164
10117 -356164 26750 -402301 136310 -152859 75511 -175977 -198186 95066 9536 -28027 -188719
10106 -188719 36340 12486 -223950 -199052 -115704 255683 -18715 -89172 127796 -135364 261182
10094 -184491 -138297 44521 -13806 32867 -242566 -231869 97740 184408 -222610 120491 -67016
$$ packed form
10175d2793B3311K64922c55878a18533j17016B48566F5013K07731E7074a98618
10164b54156N3676j51432h4032A76518D0004J06688f8665j24402A85278m446a48138
10152C7042b64051e964j91337e6516B03593C7287b05249C8268J35114b3690B98592
10140a82754a7450o5712n6817I1345B9914f1787n9164A82796a96733A01961c63913
10128A1201h6989l7911j52371F773M0919a03728k49711B69610J613d15425N9261
10117c56164B6750d02301A36310a52859G5511a75977k2209I5066I536b8027j60692
10106a88719C6340A2486b23950K4898Q3348B55683a8715p0457A27796a35364B61182
10094a84491M6194D4521a3806C2867b42566J0697I7740Q6668b22610A20491f7016
$$ plain form
10082 -35927 -388475 34936 -49388 68583 26400 -52811 60852 -207751 -349869 60510 -243067
10070 8201 -222159 -40354 126402 144054 -93710 107687 -22290 -205101 160055 12908 68937
10059 68937 -50974 67115 -124334 28998 -48326 -235127 118723 -172765 87495 -21079 123663
10047 -127225 138583 -178797 -84695 -102805 97613 126943 154317 -42852 26009 -168918 -67133
10035 -249242 -54917 310477 -92046 -213249 19601 -98427 -38719 31027 70040 80995 -337992
10023 -166705 -28732 -298504 -73975 18616 155066 -77211 23169 81260 -130156 -12897 234167
10011 -160013 44512 -25266 -136401 -140468 -212842 -8091 18175 21517 46585 -114488 -71366 -209226
9999 -209226 -92726 -465166 -9549 -265149 -279597 -347521 271997 32256 -16478 41525 53632
$$ packed form
10082c5927l52548C4936d9388F8583B6400e2811F0852b07751j42118F0510b43067
10070H201b22159d0354A26402J7652i3710A07687b2290j82811A60055A2908N6029
10059F8937e0974F7115a24334B8998d8326j86801A18723a72765H7495b1079A23663
10047a27225A38583a78797h4695j8110I7613K9330K7374d2852B6009a68918f7133
10035b49242e4917C10477i2046j21203A9601i8427c8719C1027L9013J0955c37992
10023a66705b8732k69772g3975A8616J36450g7211B3169N8091a30156a2897B34167
10011a60013D4512b5266j11135m067p2374h091A8175L342K5068a14488M3122j37860
9999b09226i2726l72440i549k55600j4448o7924B71997C2256a6478D1525J2107
$$ plain form
9988 53632 -375747 128123 -268519 -193617 -387242 1219 32460 99181 -30743 -44853 118419
9976 -226587 -11342 -188089 -73997 131933 330513 -157371 -187218 -145624 -204992 48716 -2671
9964 3259 -30147 293815 -133962 6362 -257386 -263859 -129521 33188 -377344 64758 167295
9953 167295 -109271 186488 -72956 -329949 -124310 -150760 20448 -280263 -125189 -138741
9943 -138741 -105887 271753 -278118 -131846 -85819 142259 -201464 -137700 -252557 -79891
9932 24203 -184407 247489 -235040 140360 26645 191477 -83210 -176831 -63835 117839 107977
9921 107977 -99368 -197146 -95765 -121716 45685 -276337 -369551 46607 -74391 81629 235844
9910 235844 71174 29032 100002 -142123 -116515 -110630 -581580 -161482 -99110 288432 -269665
$$ packed form
9988E3632c75747A28123b68519P4902j93625A219L1241O6721c0743j4110A18419
9976b26587a1342j76747g3997A31933J98580a57371k9847M1594n9368D8716b671
9964C259c0147B93815a33962F362b57386o473a29521C3188c77344F4758J02537
9953A67295a09271A86488g2956k56993a24310k6450B0448b80263a25189j3552
9943a38741L2854B71753b78118a31846M6027A42259b01464O3764j14857g9891
9932B4203a84407B47489b35040A40360B6645J64832h3210r3621f3835A17839r862
9921A07977i9368r7778i5765k5951D5685b76337r3214D6607g4391H1629J54215
9910B35844G1174B9032P0970a42123K5608N885m70950a61482O2372B88432b69665
$$ plain form
9898 -448178 -58158 -50343 -198738 61747 22498 -121372 50245 119988 -129962 -88324 -135321
9887 -135321 265443 -385931 -182802 23356 17356 -169443 -122717 -101316 21281 -65938 -239631
9876 -239631 235087 -42355 -76779 -415328 -247556 -213554 -316517 -8552 -98453 -98907 11937
9864 104028 98580 -71862 251813 -143570 136547 -1196 -10239 -118877 -259142 -81364 110013
9852 42394 105033 95146 -79451 -157315 72553 153548 -170366 -2425 43801 -233447 149974 -22415
9839 297921 -17935 -412633 -216488 -260732 -179566 90734 -236435 -237472 -202513 -304474 -50669
9827 -145917 61589 -240881 -76763 -211262 -113109 80477 26762 -138442 222534 -17106 401364
9815 -71203 116080 -97204 165494 18759 36922 36969 76919 95004 2978 -199165 -146889 43327
$$ packed form
9898d48178e8158P815j48395F1747B2498a21372E0245O9743a29962M1638m6997
9887a35321B65443c85931a82802B3356o000a69443M6726K1401B1281f5938j73693
9876b39631B35087d2355l4424l38549J67772L4002j02963h552q9901m54A1937
9864A04028n448g1862B51813a43570A36547a196r043j08638j40265h1364A10013
9852D2394O2639r887g9451p7864G2553Q0995a70366b425D3801b33447A49974b2415
9839B97921a7935l94698J96145m4244Q1166I0734b36435j037L4959j01961e0669
9827a45917F1589b40881g6763j34499R8153H0477B6762a38442B22534a7106D01364
9815g1203A16080i7204A65494A8759J8163M7L9950J8085B978a99165N2276D3327
$$ plain form
9802 -113989 65052 260049 169507 -400744 -176461 -211248 234099 211444 26400 -400580 -189577
9790 -20813 155800 -244838 -75098 -111765 267351 -205688 134073 57938 -10862 -148369 -626015
9779 -626015 -323931 -14941 -127020 111936 -251155 24055 81530 -176672 -39460 156193
9768 55641 55809 -155134 -294914 290525 -11588 -406138 -203617 -251165 -187723 -287574 97166
9756 137102 -77023 -209616 -165535 -246763 15527 -104492 -119090 143980 25907 -288767 -27831
9744 65101 179251 57877 -239107 -160199 43697 -43239 -172375 -7825 47058 -19407 -32355
9733 -32355 -37801 -76547 -298588 -208317 -85432 32017 71577 -143838 -92249 -254895 330483
9721 39685 97519 -271614 125873 -312040 -91613 -129581 -75971 -392576 -145662 -31252 -120165
$$ packed form
9802a13989F5052J94997r0542d00744a76461l4787B34099k2655B6400d00580a89577
9790b0813A55800b44838g5098l6667B67351b05688A34073E7938a0862j37507m77646
9779f26015L02084a4941j12079A11936b51155B4055N7475a76672c9460A56193
9768E5641J68a55134j39780B90525a1588l94550K02521m7548O3442r9851I7166
9756A37102g7023j32593M4081q1228A5527a04492j4598A43980B5907b88767b7831
9744F5101J14150E7877b39107P8908D3697d3239j29136g825D7058a9407j2948
9733c2355n446l8746k22041R0271h5432C2017L9560a43838N1589j62646C30483
9721C9685N7834b71614A25873c12040i1613l7968N3610l16605a45662c1252q8913
$$ plain form
9710 -120165 -129650 -135608 -110687 -110073 -34324 -303628 -160657 -220316 -95857 24329 -58518 -112912
9698 -112912 -250112 -182897 -144168 -229447 -298971 -183458 -37849 -124201 219590 -301448 -211409
9687 -211409 -249144 -218049 -33589 -264248 83685 -221367 14325 61474 -108349 -154479 60692
9675 51229 -223730 66159 275701 40708 -124254 -7039 34408 23543 -136359 1547 46566
9664 46566 -337204 -285678 46866 -154036 42474 -151006 65607 94686 -414669 24245 -132140
9652 160885 229725 19850 -138980 52138 -352742 -191654 -210915 -75726 106984 299307 -269932
9640 15687 24615 -99441 -137474 -107794 -83459 146157 -196264 -305012 -262510 21357 -408963
9628 161382 -258771 -68543 -36090 -315374 22485 97543 -153876 58405 103532 -8131 358912
$$ packed form
9710a20165r485n958K4921O14c4324k69304J42971n9659i5857B4329e8518n4394
9698a12912j37200O7215L8729q5279o9524J15513c7849q6352B19590c01448R0039
9687b11409l7735L1095c3589k30659H3685b21367A4325M7149a08349m6130F0692
9675E1229b23730F6159K09542D0708a24254g039C4408j0865a36359A547M5019
9664D6566c37204N1526D6866a54036D2474a51006F5607K9079d14669B4245a32140
9652A60885O8840A9850a38980E2138c52742J61088j9261g5726A06984J92323b69932
9640A5687Q928i9441l8033K9680K4335A46157a96264j08748M2502B1357d08963
9628A61382b58771f8543L2453k79284B2485P5058a53876E8405M5127h131C58912
$$ plain form
9616 106812 -50786 -279987 -260514 -48228 -26783 67209 -46849 -208718 -95936 135688 77556
9605 77556 90572 89956 161623 51611 -108103 -260786 -66968 69250 -348638 -178304 127250
9593 87610 143304 -557521 29777 110858 -46961 -524949 214666 -425956 110560 -164521 36238
9581 -94107 -43856 -308578 -19964 291960 -224990 -11482 20472 -14328 -77799 59243 29618
9569 79086 -121904 -63925 -79560 143152 17306 89449 13389 -149409 -52809 4018 -14977
9557 -188191 -212112 135335 -46552 -180574 -175521 -65467 -395266 -171954 240938 -92137 37529
9545 -106419 -102123 6094 -96411 -26082 -163079 -320678 -109115 142900 206552 -429 -145296
9534 -145296 -66084 -19366 -324253 317180 14969 112586 2825 254599 -272112 -113736 -263669
$$ packed form
9616A06812e0786k29201J9473d8228K1445F7209d6849j61869i5936A35688n8132
9605G7556J3016o16P1667E1611a08103j52683f6968F9250c48638J70334A27250
9593H7610N5694e57521B9777Q1081d6961m77988B14666d25956A10560a64521C6238
9581i4107d3856k64722a9964B91960b24990a1482B0472a4328o3471E9243B9618
9569G9086a21904N7979j5635A43152A7306P2143A3389a49409e2809D018a4977
9557a88191k3921A35335d6552j34022N053f5467l29799a71954B40938i2137C7529
9545a06419M296F094i6411b6082j36997j57599a09115A42900O3652d29j44867
9534a45296f6084a9366l04887C17180A4969R7617B825K51774b72112a13736j49933
$$ plain form
9523 -263669 269458 -208029 -107470 -14820 119031 78011 -162307 -86491 80072 -617589
9512 69648 -132212 -330523 21781 -40178 -121421 178809 100106 -186475 -76360 -53588 26525
9500 -291713 206225 -423342 -72819 -252934 272625 -273933 -2040 -127701 -32390 -891 -7358
9489 -7358 -225323 141394 -231983 -143242 88336 34135 222919 -76376 -23811 -149194 -72995
9477 -358725 -309189 51608 125158 -116106 -223991 135882 167058 87456 -270032 -100273 -323917
9466 -323917 -215237 -348140 -257124 28238 98335 326826 197201 -328459 3509 -156198 -68256
9454 -29024 -432992 229173 66288 25536 -35124 -47706 -295638 -138412 47800 -326085 94072
9442 -316779 97958 -38931 -104956 -150534 -150445 -116579 154148 56593 -494601 1258 125283 -146121
$$ packed form
9523b63669B69458b08029J00559a4820A19031m1020a62307P5816H0072f17589
9512F9648a32212j98311B1781d0178q1243A78809p8703a86475g6360K2772B6525
9500b91713B06225d23342g2819j80115B72625b73933b040j25661c2390h91o467
9489g358k17965A41394b31983Q8741H8336C4135J88784g6376b3811j25383g2995
9477c58725M9536E1608P3550a16106j07885A35882L1176p9602b70032a00273k23644
9466c23917J08680j32903R1016B8238P0097K28491j29625c28459C509a56198f8256
9454b9024m03968B29173F6288B5536c5124j2582k47932a38412D7800c26085I4072
9442c16779I7958c8931o6025m5578Q9L3866A54148E6593d94601A258J24025a46121
$$ plain form
9429 -230643 90937 204830 -193200 305083 -271876 -314999 -111290 -190410 -514499 -415 -115565
9418 -115565 93733 -109173 -330529 -183470 26170 -70199 219871 130168 -434375 -177103
9407 146022 -234041 -159575 -298196 -34142 -277556 -287711 -13237 -178023 8288 -157751 -206232
9396 -206232 117317 231075 -115290 273817 -67259 -171225 178681 -115236 -247883 102520
9385 54425 -72885 -98973 -291026 48871 -87258 -77164 55195 2313 97697 -109312 -189825 -264799
9373 -264799 152391 165483 -56632 105134 205033 -22383 153191 -326792 -132457 -264142
9363 -264142 -184708 -165131 -24895 10958 18268 -220375 56892 210975 -40134 -163737 -174669
9352 -174669 -12063 242960 -419785 -153100 -122825 -170932 96405 -256376 -18080 -82497 -210239
$$ packed form
9429b30643I0937J13893a93200C05083b71876m3123a11290p9120l24089d15j15150
9418a15565I3733a09173k21356J47059B6170g0199B19871q9703d34375a77103
9407A46022b34041P4466j38621c4142k43414j0155a3237j64786H288a57751m8481
9396b06232A17317J13758a15290B73817f7259j03966A78681a15236j32647A02520
9385E4425g2885k6088j92053D8871h7258J0094E5195B313R5384a09312q0513p4974
9373b64799A52391J3092e6632A05134R9899b2383A53191c26792a32457j31685
9363b64142P9434J9577b4895A0958P310b20375E6892J54083d0134j23603j0932
9352a74669a2063B42960d19785a53100L0275m8107I6405b56376a8080o4417j27742
$$ plain form
9341 -210239 133129 147329 -27576 -115830 -113461 -344772 215463 69884 -71826 -386021 -129756
9329 57011 -59751 -136369 -170906 -113851 -87348 67781 -26016 -120784 -249165 65102 249884
9318 249884 -188260 -18099 -147721 66091 -171932 -199479 -103814 51377 -368969 -203334 -167801
9307 -167801 -92242 -204784 98171 -39799 -38459 -160258 136100 32369 -127660 -38169 42329
9295 -208912 120172 -58096 164333 121352 88643 344 165589 -52782 -158914 96085 30672
9283 -170321 224518 -92017 -309636 203024 -187230 113597 -63390 -9344 -368995 -13191 248176
9271 14018 88403 -16122 81194 -274699 282828 18924 -51533 -286687 -210657 -422508 239
9259 -59794 -260910 -207270 -96031 -71045 101021 -132272 -56792 -434847 -14132 -126334 147344
$$ packed form
9341b10239A33129J4200b7576q8254K369k31311B15463F9884g1826l14195a29756
9329E7011e9751p6618l4537N7055K6503F7781b6016r4768j28381F5102J84782
9318B49884a88260a8099j29622F6091a71932k7547R5665E1377c68969J65635L5533
9307a67801P5559j12542I8171c9799J340j21799A36100C2369a27660c8169D2329
9295b08912A20172e8096A64333m2981l2709C44J65245e2782j06132I6085C0672
9283a70321B24518i2017k17619B03024a87230A13597f3390i344l59651a3191B48176
9271A4018P4385a6122H1194b74699B82828A8924e1533k35154P6030k11851B39
9259e9794k01116N3640i6031K4986A01021a32272e6792l78055a4132j12202A47344
$$ plain form
9247 -394492 163168 -92869 79967 136465 -100079 -8651 -55471 30629 9187 -179818 -45709
9235 -20822 -142680 -128465 -135038 -150876 -161854 189762 -330249 64638 -90228 68559 -290601
9223 -232766 184340 144765 -135753 131905 -216786 -102597 -2427 31624 -119030 -86254 88678
9211 -202183 121356 -49085 -113093 -26614 -16617 -24009 202780 -153265 76090 -324846 -107519
9199 -39198 -61491 95742 -183404 -186835 22486 -117598 -367962 131570 84796 139823 1299
9187 -60222 -132407 -79594 124253 -113300 92256 153091 -204858 375446 95767 -186973 -346225
9176 -346225 -51291 340300 -49091 -386498 -182626 -52591 166911 318244 -11776 -35375 -130021
9165 -130021 -41436 112352 32084 4995 164922 -71896 165013 -351361 69897 -3335 -249180
$$ packed form
9247c94492A63168i2869G9967N6498a00079h651m6820C0629I187a79818d5709
9235b0822j21858J4215o573j5838j0978A89762c30249F4638i0228F8559b90601
9223b32766A84340l9575a35753A31905b16786a02597b427C1624a19030L2776H8678
9211b02183A21356d9085o4008b6614R997p392B02780a53265G6090c24846a07519
9199c9198k2293I5742a83404l431B2486a17598k50364A31570m6774N5027A299
9187f0222p2185N2813A24253a13300I2256O0835b04858C75446I5767a86973j59252
9176c46225e1291C40300d9091l37407a82626e2591A66911J51333a1776k3599r4646
9165a30021d1436A12352C2084D995J59927g1896A65013c51361F9897c335k45845
$$ plain form
9154 -249180 66786 -38184 -82914 150823 -14736 134952 -142172 118770 26485 -381185 62494
9142 454662 -298334 155185 -393280 -57088 -251772 143079 -21344 -458258 -332620 -44302
9131 129198 185477 -11193 -46493 -81919 88468 233684 -17868 -333138 -53074 -362224 -128934
9119 -148207 -268605 559152 94795 129866 -94278 -93101 131311 37141 -124342 -259519 -72285
9107 -174572 -217591 -216654 63382 -283148 115258 39241 129242 -476428 -56711 79753 -33851
9095 -265482 -380074 -183251 182140 117956 -94947 59710 42367 -149453 -2901 -24069 -160213
9084 -160213 -24983 -64896 272872 -38467 -259557 88911 -6807 -135049 -414786 -70957 -103907
9073 -103907 27997 -20789 -102032 64532 -121101 16166 -97499 -12399 -341973 -56938 199884
$$ packed form
9154b49180F6786c8184m4730A50823a4736A34952a42172A18770B6485c81185F2494
9142D54662b98334A55185c93280e7088j94684A43079b1344m36914J25638d4302
9131A29198N6279a1193l5300l5426H8468J45216a7868l15270e3074l09150a28934
9119a48207j20398E59152I4795L5071i4278J177A31311C7141a24342j35177g2285
9107a74572m3019R37F3382b83148A15258C9241R0001d76428e6711G9753c3851
9095b65482j14592a83251A82140o4184i4947E9710j7343a49453b901k1168j36144
9084a60213b4983l9913B72872c8467k21090H8911f807j28242k79737g0957l2950
9073a03907B7997b0789q1243F4532a21101A6166i7499a2399l29574e6938A99884
$$ plain form
9061 28931 57132 -53204 -5595 -280309 309161 -373869 132730 -210452 322086 -61959 94623
9049 34475 -269023 -13989 -900 -115704 23924 -19478 -55451 -54931 -163232 -144634 155257 -185032
9036 173564 -16281 -263981 -84085 -278699 -159118 -260347 23918 -44925 -368564 -219363
9026 -219363 89316 -178435 66336 153454 -112981 -138930 21112 153842 241630 -316898 -246773
9015 -246773 -302440 -139979 185517 -47099 22071 -124357 -23561 -301694 -87525 -190603 -99038
9004 -99038 -211550 -13336 55568 -179805 44654 37209 -454898 45461 12896 -19791 -272311
8993 -272311 -350437 -146947 -196252 -184863 -227667 107024 -217462 -97539 86883 -155693 -212313
8982 -212313 234639 -346069 -112567 241260 72173 -68606 -353770 246642 -34736 -291697
$$ packed form
9061B8931K8201e3204e595k74714C09161c73869A32730b10452C22086f1959I4623
9049C4475b69023a3989i00j14804B3924a9478l5973N20j08301J8598A55257a85032
9036A73564a6281k47700h4085j94614J19581j01229B3918d4925l23639J49201
9026b19363H9316a78435F6336Q7118a12981k5949B1112J32730Q7788c16898P0125
9015b46773n5667a39979A85517d7099B2071a24357b3561k78133h7525j03078R1565
9004i9038j12512a3336E5568a79805D4654p445d54898D5461A2896a9791k52520
8993b72311p8126a46947m9305J1389m2804A07024b17462i7539H6883a55693n6620
8982b12313B34639c46069a12567B41260G2173f8606k85164B46642c4736k56961
$$ plain form
8972 -291697 -185024 103049 79714 28296 -33925 -258698 -176600 -38489 -161983 132636 -137937
8960 -69258 80217 168926 -120920 149746 -130226 113132 4994 -270296 -134886 14230 19196
8949 19196 -72789 109457 29700 -116754 -200826 -321235 92320 -88114 -142556 81669 -17698
8937 -27748 -35658 83917 457048 482255 283712 -162560 -246226 54187 -39217 19741 189721
8926 189721 730145 1056254 2149409 7118876 19962139 10370608 3176241 1308899 747468
8917 747468 347201 346031 -30982 139890 178887 277701 -201159 -22974 214731 404392 133688
8905 -176099 -274804 -93984 110051 371485 -40517 91713 56582 91533 -281404 -178922 -95827
8894 -95827 206042 150526 15347 -196700 -82005 178494 84402 -19984 13365 23725 -73971
$$ packed form
8972b91697J06673A03049k3335B8296c3925k24773Q2098c8489j23494A32636a37937
8960f9258H0217Q8709a20920A49746a30226A13132D994b70296a34886A4230M966
8949A9196g2789A09457B9700a16754q4072j20409I2320h8114n4442H1669a7698
8937b7748p910H3917L73131K5207j98543a62560q3666E4187c9217A9741J69980
8926A89721N40424L26109J093155M969467J2843263r591531C176241A308899n61431
8917G47468C47201j170c0982A39890L8997R8814b01159b2974B14731J89661A33688
8905a76099r8705i3984A10051K61434d0517I1713l5131L4951b81404J02482Q3095
8894i5827B06042n5516A5347a96700h2005A78494H4402a9984A3365J0360g3971
$$ plain form
8882 -89581 -262045 -12895 -58497 11137 -325689 -68741 -176252 -135929 158121 133245 -319016
8870 -144316 134757 171124 15985 -82165 -267202 -181542 -250474 69028 -168377 -245916 74178
8858 -208054 28603 -138502 121573 60230 -5576 202253 -206803 -237997 -48950 -67703 82150
8846 52926 -409 180280 -35927 -53523 -27705 -195052 -78388 -45265 112312 -114539 -195668
$$ packed form
8882h9581j72464a2895m5602A1137c25689f8741j07511M0323A58121k4876c19016
8870a44316A34757L6367A5985h2165j85037Q5660o8932F9028a68377p7539G4178
8858b08054B8603a38502A21573F0230e576B02253b06803l1194d8950j8753H2150
8846E2926d09A80280c5927j7596K5818j67347g8388L3123A12312a14539q1129
$$ [...]
##END NTUPLES=NMR SPECTRUM
##END=
