##TITLE=AC1470_13FE002652_8026926_Jl8XaGtRlM
##JCAMPDX= 6.0         $$ Bruker NMR JCAMP-DX V2.0
##DATA TYPE= NMR SPECTRUM
##DATA CLASS= NTUPLES
##ORIGIN= BRUKER
##OWNER= Administrator
$$ 1.72 TOPSPIN		Version 2.1
$$ 2013-07-18 16:46:01.063 -0700  Administrator@X
$$ Compression mode = diff/dup
##.OBSERVE FREQUENCY= 400.02188249412
##.OBSERVE NUCLEUS= ^1H
##.ACQUISITION MODE= SIMULTANEOUS (DQD)
##.ACQUISITION SCHEME= undefined
##.AVERAGES= 8
##.DIGITISER RES= 22
##SPECTROMETER/DATA SYSTEM= spect
##.PULSE SEQUENCE= zg30
##.SOLVENT NAME= COFFEE_meoh
##.SHIFT REFERENCE= INTERNAL, COFFEE_meoh, 1, 14.98509
##AUDIT TRAIL= $$ (NUMBER, WHEN, WHO, WHERE, PROCESS, VERSION, WHAT)
$$ ##TITLE= Audit trail, TOPSPIN		Version 2.1
$$ ##JCAMPDX= 5.01
$$ ##ORIGIN= Bruker BioSpin GmbH
$$ ##OWNER= Administrator
$$ $$ E:\/data/COFFEE/nmr/AC1470_13FE002652_8026926_Jl8XaGtRlM/20/pdata/1/auditp.txt
$$ ##AUDIT TRAIL=  $$ (NUMBER, WHEN, WHO, WHERE, PROCESS, VERSION, WHAT)
(   1,<2013-07-18 16:45:54.501 -0700>,<Administrator>,<X>,<go>,<TOPSPIN 2.1>,
      <created by zg
	started at 2013-07-18 16:44:48.407 -0700,
	POWCHK enabled, PULCHK disabled,
       configuration hash MD5:
       C8 4E 4E 5D D3 5C D8 9E 9F 52 82 E0 59 8A DE 15
       data hash MD5: 64K
       24 9B E7 40 E5 CA 5C A2 85 C8 79 97 A0 43 54 4A>)
(   2,<2013-07-18 16:45:57.423 -0700>,<Administrator>,<X>,<proc1d>,<TOPSPIN 2.1>,
      <Start of raw data processing
       efp LB = 0 FT_mod = 6 PKNL = 1 PHC0 = 0 PHC1 = 0 SI = 32K 
       data hash MD5: 32K
       52 96 BC 9F D1 70 48 D5 F9 B7 C9 E6 19 33 25 FB>)
(   3,<2013-07-18 16:45:57.704 -0700>,<Administrator>,<X>,<proc1d>,<TOPSPIN 2.1>,
      <pk PHC0 = 97.78931 PHC1 = 0 
       data hash MD5: 32K
       FD 92 3A 66 A9 34 44 69 1C 6D 88 65 0F 53 E0 32>)
(   4,<2013-07-18 16:45:57.798 -0700>,<Administrator>,<X>,<proc1d>,<TOPSPIN 2.1>,
      <abs ABSG = 1 
       data hash MD5: 32K
       53 EB 16 93 05 E3 98 7E 6C 77 3D 8C D0 BD E7 5C>)
(   5,<2013-07-18 16:45:57.860 -0700>,<Administrator>,<X>,<proc1d>,<TOPSPIN 2.1>,
      <abs ABSG = 2 
       data hash MD5: 32K
       CC 17 5E 4B CA 04 90 0A 2E BB 8B DB 51 2B 86 65>)
(   6,<2013-07-18 16:45:57.923 -0700>,<Administrator>,<X>,<proc1d>,<TOPSPIN 2.1>,
      <abs ABSG = 3 
       data hash MD5: 32K
       6E 45 59 74 60 97 C8 D8 78 D0 6C 06 DD 74 54 5D>)
(   7,<2013-07-18 16:45:57.985 -0700>,<Administrator>,<X>,<proc1d>,<TOPSPIN 2.1>,
      <abs ABSG = 4 
       data hash MD5: 32K
       02 6F 89 5C 1F 90 39 68 8C A4 8A 57 B3 0F 1F 38>)
(   8,<2013-07-18 16:45:58.032 -0700>,<Administrator>,<X>,<proc1d>,<TOPSPIN 2.1>,
      <abs ABSG = 5 
       data hash MD5: 32K
       99 2A 65 45 B2 35 22 94 4A 0F F5 2F 58 2D 70 E2>)
$$ ##END=
$$ 
$$ $$ hash MD5
$$ $$ 8D 11 A6 E5 27 95 1B 3D 72 7E E9 EC 17 DA 6F 85
##$RELAX= 
##$RELAX= 
##$RELAX= 
##$RELAX= 
##$RELAX= 
##$RELAX= 
##$RELAX= 
$$ Bruker specific parameters
$$ --------------------------
##$DU= <E:\>
##$EXPNO= 20
##$NAME= <AC1470_13FE002652_8026926_Jl8XaGtRlM>
$$ [...]
##$TP= (0..7)
150 150 150 150 150 150 150 150
##$TP07= 0
##$TPNAME0= <>
##$TPNAME1= <>
##$TPNAME2= <>
##$TPNAME3= <>
##$TPNAME4= <>
##$TPNAME5= <>
##$TPNAME6= <>
##$TPNAME7= <>
##$TPOAL= (0..7)
0.5 0.5 0.5 0.5 0.5 0.5 0.5 0.5
##$TPOFFS= (0..7)
0 0 0 0 0 0 0 0
##$TUNHIN= 0
##$TUNHOUT= 0
##$TUNXOUT= 0
##$USERA1= <user>
##$USERA2= <user>
##$USERA3= <user>
##$USERA4= <user>
##$USERA5= <user>
##$V9= 5
##$VALIST= <valist>
##$VCLIST= <CCCCCCCCCCCCCCC>
##$VD= 0
##$VDLIST= <DDDDDDDDDDDDDDD>
##$VPLIST= <PPPPPPPPPPPPPPP>
##$VTLIST= <TTTTTTTTTTTTTTT>
##$WBST= 1024
##$WBSW= 4
##$XGAIN= (0..3)
0 0 0 0
##$XL= 0
##$YL= 0
##$YMAX_a= 647575
##$YMIN_a= -550254
##$ZGOPTNS= <>
##$ZL1= 120
##$ZL2= 120
##$ZL3= 120
##$ZL4= 120
##$ABSF1= 14.98509
##$ABSF2= -5.573092
##$ABSG= 5
##$ABSL= 3
##$ALPHA= 0
##$AQORDER= 0
##$ASSFAC= 0
##$ASSFACI= 0
##$ASSFACX= 0
##$ASSWID= 0
##$AUNMP= <proc_prof1d_extract_pilot.lims>
##$AXLEFT= 0
##$AXNAME= <>
##$AXNUC= <1H>
##$AXRIGHT= 0
##$AXTYPE= 0
##$AXUNIT= <>
##$AZFE= 0.1
##$AZFW= 0.1
##$BCFW= 0
##$BC_mod= 0
##$BYTORDP= 0
##$COROFFS= 0
##$CY= 15
##$DATMOD= 1
##$DC= 0
##$DFILT= <>
##$DTYPP= 0
##$F1P= 0
##$F2P= 0
##$FCOR= 0.5
##$FTSIZE= 32768
##$FT_mod= 6
##$GAMMA= 0
##$GB= 0
##$INTBC= 1
##$INTSCL= 1
##$ISEN= 128
##$LB= 0
##$LEV0= 0
##$LPBIN= 0
##$MAXI= 10000
##$MC2= 0
##$MEAN= 0
##$ME_mod= 0
##$MI= 0
##$NCOEF= 0
##$NC_proc= -8
##$NLEV= 6
##$NOISF1= 0
##$NOISF2= 0
##$NSP= 0
##$NTH_PI= 0
##$NZP= 0
##$OFFSET= 14.98509
##$PC= 1
##$PHC0= 97.78931
##$PHC1= 0
##$PH_mod= 1
##$PKNL= yes
##$PPARMOD= 0
##$PPDIAG= 0
##$PPIPTYP= 0
##$PPMPNUM= 2147483647
##$PPRESOL= 1
##$PSCAL= 4
##$PSIGN= 0
##$PYNMP= <proc.py>
##$REVERSE= no
##$SF= 400.02
##$SI= 32768
##$SIGF1= 0
##$SIGF2= 0
##$SINO= 400
##$SIOLD= 32768
##$SPECTYP= <>
##$SREGLST= <1H.CDCl3>
##$SSB= 0
##$STSI= 32768
##$STSR= 0
##$SW_p= 8223.68421052631
##$SYMM= 0
##$S_DEV= 0
##$TDeff= 65536
##$TDoff= 0
##$TI= <>
##$TILT= no
##$TM1= 0
##$TM2= 0
##$TOPLEV= 0
##$USERP1= <user>
##$USERP2= <user>
##$USERP3= <user>
##$USERP4= <user>
##$USERP5= <user>
##$WDW= 1
##$XDIM= 32768
##$YMAX_p= 437070381
##$YMIN_p= -669845
##$CURPLOT= <Network HP LaserJet P1505>
##$CURPRIN= <$Network HP LaserJet P1505>
##$DFORMAT= <normdp>
##$LAYOUT= <+/1D_H.xwp>
##$LFORMAT= <normlp>
##$PFORMAT= <normpl>
##$SURQMSG= 1
$$ End of Bruker specific parameters
$$ ---------------------------------
##NTUPLES= NMR SPECTRUM
##VAR_NAME=  FREQUENCY,     SPECTRUM/REAL,   SPECTRUM/IMAG
##SYMBOL=    X,             R,               I
##VAR_TYPE=  INDEPENDENT,   DEPENDENT,       DEPENDENT
##VAR_FORM=  AFFN,          ASDF,            ASDF
##VAR_DIM=   32768,         32768,           32768
##UNITS=     HZ,            ARBITRARY UNITS, ARBITRARY UNITS
##FACTOR=    0.250966925370066, 1,           1
##FIRST=     8223.43324360094, -137325,      -123626
##LAST=      0,             -179972,         743
##MIN=       0,             -669845,         0
##MAX=       8223.43324360094, 437070381,    0
$$ Real data points
##PAGE= N=1
##DATA TABLE= (X++(R..R)), XYDATA
$$ [...]
23832 -94758 166685 -203050 173049 -133044 274421 -44848 97541 90857 53770 60834 102109
23821 102109 87076 25050 58659 -160077 -103278 24325 16527 -204413 -189153 -256607 -263973
23810 -263973 -55435 95335 -100930 -88681 54302 -199561 266510 372281 51342 -110945
23799 49840 -286092 278951 -81008 -145419 221630 -62815 -139996 -120248 -19521 -79331 43183
23787 7387 55960 159166 48137 129263 -13181 -136576 -226427 -274873 268132 166465 416453
23776 416453 78489 -256434 -232092 134404 -281834 -71857 -45016 -105048 92390 -192663 -132599
23765 -132599 161824 -230008 129676 136012 114593 -203012 -144591 52958 206626 -128290
23754 -266340 -118322 -63097 -140239 -33198 -75196 -220215 228487 -60874 132750 -71293 99093
23742 266956 -4308 -327960 161872 244148 -6558 63007 -26097 -259181 -80479 -1 151497 70208
23729 3097 -19358 -194535 -22530 -97661 -11560 -1029 174491 -193341 205770 285113 -36317
23717 -33928 -435469 183132 -263326 198819 4891 64195 -195787 27524 38405 -28128 -78532
23706 -78532 -108211 290168 291391 96588 474754 -132153 220791 48038 -124408 -203422 9321
23694 114508 -281279 -21237 -194274 -205787 72756 121804 -87105 -227098 50314 164458 192638
23683 192638 146679 -48698 273980 -142558 -68033 97338 317429 -106897 363268 267555
23673 267555 -55870 136694 -240540 104725 -109440 -353947 -114333 9840 179362 8713
23662 -169185 135977 65907 -255659 52877 -231957 -281164 193706 61942 -28034 -178013
23652 -178013 79542 290973 -12776 -16850 205796 111590 111309 -28056 -264086 280299 -101442
23640 200175 6817 -107865 -186859 120210 36649 -78192 1463 -35364 140520 -89315 6626
23628 137893 -63505 -148061 34615 -179643 -264837 -240095 -92538 -299546 89973 272292 -172075
23616 290336 155214 219912 -217082 -4124 9795 -169695 -71045 85466 -348559 -59587 -115668
23605 -115668 259314 -135733 -456374 270589 43607 -320876 212724 -207199 183558 25388
23594 -8922 264677 -116860 166196 -93659 54284 61316 72655 -76943 98622 -88861 66786
23582 229095 21370 350868 172987 77093 273033 -224084 -13672 -151459 -31290 -144880
23572 -144880 392885 -381971 -430827 -145969 -343678 8351 -215128 -263268 146283 -78196
23561 -285534 -12752 48500 109962 -378831 49005 175343 56605 207038 -80063 -140711 -88138
23550 -88138 -2416 65607 7330 23364 -347730 -40507 -66712 78730 70890 2500 -215714 -150793
23538 -150793 362041 248587 -264212 150637 98998 -33362 -186166 123152 -330907 161993
23527 -156842 -109615 -177080 -36076 -213820 -52846 238561 31903 5742 174390 -227150 52928
23515 -167040 -128574 -241495 -208221 -59335 8546 3174 -397504 122066 61787 137276 169088
23504 169088 73994 -178711 106740 -77059 -320541 171653 16724 -329277 26837 -142816
23493 -316999 49310 -398142 277104 324184 -203862 -163445 203858 185352 -349922 -65105
23482 15956 -185221 -140928 233421 10673 43376 -46901 -315377 95320 -1140 -175018 -202642
23471 -202642 -335029 -63901 110142 56805 100708 -82559 169779 59500 160641 -216206
23460 4938 -228741 225489 29925 -182410 26769 -226800 118117 -215398 12267 -41166 63663
23448 270303 32745 23257 279755 20105 22024 79808 -114691 -98278 239712 48131 -109335
23436 277156 367229 -37512 27540 -228123 199793 7079 294779 89781 -138446 -147898 -172978
23425 -172978 211445 68917 -98499 -53742 -54680 112826 -155617 3830 256417 73296 119897
23414 119897 112637 -39147 49824 -291345 -112892 -30935 185066 98590 -194896 -197463 -184716
23403 -184716 52892 4519 -60858 -116737 -22631 -112196 72089 -186011 176570 262643 311850
23392 311850 316156 -111013 26955 154029 -52227 22448 61008 -70497 -80688 -170298 28848
23380 244883 43703 -162182 250870 178191 122262 -276486 210673 3105 16111 83638 118137
23369 118137 94201 -138544 -234764 -176389 83574 -34127 -113491 -110201 -248013 170579 -52278
23357 -291355 -27927 -80191 141919 37536 84922 91815 5838 -327344 -265327 -13958 321402
23345 392237 -493309 245045 22888 -112972 226728 -279863 -329250 -265775 81772 -222013
23334 119362 -187964 65034 158457 -73591 -113277 -410775 -101356 -344957 -150885 -145590 -218441
23323 -218441 -102491 123238 110687 51478 -63004 -155483 -7219 -83695 333428 189706 17046
23311 -83383 -123734 -21579 103183 218764 349552 146907 -88793 -48090 -96044 224269 -88974
23299 -196133 -182986 -383950 105538 -31532 -229328 140373 154746 90505 -185042 -115323
23289 -115323 328732 180784 58043 -91197 -45472 69099 -260541 -143899 -103200 -158494 69535
23277 -240176 1805 -88656 -66849 91739 52646 -47608 157103 -106995 -132644 86812 -234979
23265 -83711 -117012 -122919 112770 -81257 -23567 -77857 204716 115850 -89528 190329 -92673
23253 176985 -213468 56541 -457576 -9104 -3194 19991 -66195 -126558 53022 74159 232041
23242 232041 -54714 137586 -145722 273770 -143413 65996 825 -371798 -9201 71934 -91101
23230 -322672 32971 134820 -317119 -36297 184111 -58155 218981 40913 -366374 -139568
23219 120735 91821 24148 126731 -85251 -130099 -105632 108134 118116 -212501 -239629 -16159
23207 86819 112458 108803 137220 -186628 -162084 -35648 71618 397009 -99247 226762 -41765
23195 -307919 -115210 -311154 -40362 56876 35216 -297410 70192 -74351 -114543 90915 -356570
23183 -343851 201587 251930 -167325 159703 -8500 -198070 -204886 -211983 -15992 49090 -182225
23171 -34802 175937 -165312 91613 -68212 143191 78910 168788 -122168 -215681 -103848 -91736
23160 -91736 -152995 -89433 -68658 -95622 33167 -83281 -16422 432741 161874 -61976 -62339 15645
23147 -165794 211644 -216821 -50369 -163518 88673 -529510 -207242 -151937 -276388 338657
23136 -98769 -243482 -63631 47393 56448 97765 -121514 -42199 39280 -183682 65663 -103333
23124 -62363 -342210 -156304 -199759 -130393 33250 61953 -55807 -172683 70492 246159 -31649
23112 -255168 232671 155729 72283 -267043 -31188 356282 150423 110015 183599 430725
23102 430725 -234240 -125949 -20303 131304 24421 260071 129612 -2284 116919 -101875
23091 -284062 -80677 -154109 -85575 129146 -502389 13076 -99419 -270781 -31389 258040 -73559
23079 181903 -177468 49997 76725 63888 375558 26494 -46559 -58163 -114866 -75139 -24338
23067 20809 -64622 269809 195911 -220701 -128969 -20995 111029 -185699 -154796 -148458 11068
23055 97930 -8743 77152 36740 -220482 -140052 -41658 258567 17557 135704 34956 84095
23044 84095 100298 -16140 -49902 -24286 80127 144095 -71709 143016 -43286 42345 -82511
23032 -43734 144883 188948 -183123 38403 -158440 -25445 -217905 -205143 -184084 -257150 -107722
23020 81365 -171887 -11156 -217658 -145703 52463 -245293 -50006 -121400 -56994 -173926 132913
23008 -179592 116889 236219 122926 57499 -300542 44596 244821 153293 -246547 -52362
22997 -288781 -354196 -69711 23875 162333 -267030 -354107 -40128 -53465 375932 273270 1746
22985 -85557 -76231 69707 -231210 119538 88790 111581 -245587 186654 41198 172372 47522
22973 159993 -76161 -111355 -41663 190769 73310 173350 -53813 75346 163435 -106270 -101628
22962 -101628 243554 29523 -139368 131790 19019 61595 -121696 11144 -33075 194871
22951 120796 -219325 221416 201134 -341808 404908 -70802 -127948 -253465 -235600 12155
22940 30119 45892 -247098 -386537 28719 378467 102830 -312958 31961 -36844 -230968
22930 -230968 -132157 -190284 -162767 2562 -13466 -381627 -174 -15261 148251 -87445 150738
22918 -10707 -52195 59434 127694 -212240 -39628 -203451 -59543 184634 46834 80614 173786
22907 173786 -213213 -374023 128293 -189129 -341780 223528 238686 -216304 350764 -337331
22896 67219 -140953 -249497 286388 -209865 380597 -41121 -55451 -85652 -59558 91844 -311386
22884 -429577 -61236 -96942 11472 -17535 78063 -123221 -281850 170914 -292416 -125122
22873 -323415 185756 -84422 -315217 402028 120461 6908 50959 -170192 -220716 207280
22862 -51789 -59058 62520 -359830 216203 262065 -148617 -66188 265596 -89210 153149 -118182
22850 -17533 119719 144369 -239967 -32467 61811 -28255 -210687 -261553 -65615 73852 -417183
22838 10690 -48525 13283 -44119 -103967 -23427 -162849 -145205 -284158 -222376 -229692 -150020
22827 -150020 279535 -236192 23882 89938 -158215 207767 63242 73028 -209546 166590
22816 -121024 -121243 -241145 -194448 -185 1138 -90447 -304960 -445440 -137577 11532 -216103
22804 87925 60624 -4090 298160 -363700 -46204 61953 -227560 -195421 -231162 36628 -61535
22792 -100901 177158 -11173 301001 42325 -45431 -84107 69908 -10965 -502010 -233691 212942
22780 -35858 226248 -45404 84870 177304 194493 -203886 147559 122310 -25348 -61888 141602
22768 125346 -5509 -173202 46698 86247 174022 -153189 -234699 292304 -56637 -243392 -104919
22756 4857 -100594 -79315 -41275 -138444 -412285 -19409 -320665 318005 -125812 -104204 71205
22744 -386345 -141964 -10782 118709 -99550 -104760 -62181 34868 85968 -123370 -234518 -41560
22732 -302551 134662 -154415 -25861 148478 -166382 -156308 36171 111911 -309404 -164566
22722 -164566 272626 -60301 -165546 -198427 197902 -13972 -267064 -150107 129835 -212605
22711 -53542 -119537 151430 -116415 9578 -248551 -16738 231851 -376961 40153 240003 183112
22700 183112 -146975 -49976 195489 95052 125621 -60055 124255 -104128 -49623 116529
22689 26069 78691 -59675 -245651 -301831 -86545 -184248 28929 137549 -36731 96648 -2220
22677 -225172 -326839 301770 -284536 80709 283094 -59446 -222991 -478124 -48604 -80067
22667 -80067 156617 -48842 -94188 -158860 -45709 -69 -1134 -276391 -128590 81174 -32499 -168320
22655 -168320 8543 67270 -23410 -68871 33156 299239 23177 49200 -260051 -386372 -161416
22643 157361 37106 -105980 -150603 -268928 288783 -207034 -5054 -16829 130011 -95408 -209457
22632 -209457 -124666 -56740 5614 -78593 33217 95277 58301 -46660 61460 -155166 -151423 123135
22619 24945 -162485 629 -241203 -161508 -203646 -90409 -133910 65906 389082 -406396 -133426
22607 84703 95110 70812 -203917 80058 -64980 82791 -17478 89886 -72880 -83507 -196487
22596 -196487 53390 6920 -349669 -66102 -271677 96165 -261290 -176691 -228749 63347 -35607
22584 -275905 -261972 156031 -50070 -2631 -63803 -10504 -182418 175509 -108187 198177 193478
22573 193478 127422 -270198 -150675 80048 -269950 -184255 -181236 -99913 167442 -80029 -345613
22562 -345613 36685 -69072 276577 -68837 152202 -458985 -80556 383009 -89145 191834
22551 57881 -40609 181665 -37736 -234471 -175619 226419 164734 -110331 -170663 -112048 14401
22539 -42383 -31982 -98065 25513 -76155 211902 -260830 68382 67574 -400514 102916 203647
22528 203647 -29804 -406137 -105430 44185 27990 76017 -268221 -492472 150671 -9308 -134884
22517 -134884 -72696 248770 -135551 -4300 111700 -99993 -204573 -109211 283736 -111961
22506 -2175 -100263 -39413 2877 -149902 31907 270128 -45773 -23839 250482 -7859 29150 -90985
22493 193792 55966 -19862 194609 -186058 -354088 183772 37515 75442 -198928 -323466
22483 -323466 -415729 134312 -42460 -1699 -339778 750 217611 -127597 -18533 -143166 -47505
22471 -91510 18899 -210649 247451 -66299 136657 -83162 137582 -631 -107581 -144917 137418
22459 -7646 -121845 72275 42411 -42914 195102 453961 -68333 161223 -281864 -30961 31783
22447 146487 185882 -58824 -61249 19929 -94604 -90182 -215324 -128411 -34189 -106255 -75950 -563036
22435 -563036 -175592 -123594 -276784 -269523 -228848 -273693 -206502 -223032 -360565 21302 -180358
22423 84180 -57611 117320 136361 -248295 146855 -39398 -151448 143463 131865 127741 211122
22412 211122 -62472 -277367 -243193 -53476 122914 183460 -307177 -9301 -294032 154556 -273075
22400 -168256 -25501 -126160 308969 -114750 -83935 -85166 -521 -173899 -231089 -81709 -244610
22389 -244610 38174 16149 -2802 -80823 -129383 32074 121264 224083 -173881 -94621 184192
22377 451821 -94257 44303 113743 232842 16097 110813 88032 121839 118472 56237 -157182
22365 63528 -38403 100429 -37918 285766 104208 13851 96637 -111501 -149080 -94147 -26810
22353 -282933 -87617 -139130 314256 -58818 151185 -51401 -217788 9302 161877 65836 248085
22342 248085 -25542 209136 112942 61035 15278 -88306 -128856 13069 18514 -80588 -142545
22331 -142545 -116864 -146378 97300 -55446 -59141 -43428 -377293 -190071 -88633 104516 22218
22319 -15812 196364 -31209 115294 -225256 -60947 116624 67838 -411356 -152021 161701
22308 -43624 -72698 137074 26581 41234 46968 103640 -105235 189753 -30340 -73360 -105986
22297 -105986 39175 -171284 259208 249979 92032 133147 -146597 63428 -167074 137858 -83845
22285 39460 -127991 -22290 -64374 -24296 -202174 -288040 177307 -331055 -13231 21038 -156358
22273 -131853 -61990 261526 14830 14356 143600 134397 155618 -8108 264689 -110566 77547
22261 276676 -65159 -236429 -126177 30956 -123872 282136 -151221 232687 232550 160743 -202128
22249 22322 -385173 -130421 -43272 -15604 -369557 3514 -186829 106991 -132309 -61168 -38628
22238 -38628 -159917 -83806 -249290 -113441 -27079 -17615 -35484 -125952 -91942 -15074 -209542
22227 -209542 -22084 221827 -47879 91845 -194373 -147659 -46439 -310312 20668 -90683 180592
22215 -44306 215280 240124 -161844 218610 -224180 164634 -69951 -441814 104554 -59576
22204 -67288 46 125157 85745 -113580 37398 64618 -319153 -452827 -68172 102737 -232609
22192 -123570 150253 30593 -117886 132843 275191 -284637 95530 -331922 167620 -186727
22181 84317 71935 -49719 102918 -7464 29651 22185 -150366 -342325 -30348 43414 -434011
22169 448 -102103 -37961 70151 -60337 51746 -536915 -191823 5671 -213006 24303 118548
22158 118548 -273830 -41974 26122 -18164 77716 -207358 -5682 169701 -46562 34579 -114312
22146 -3223 -102837 179127 -16045 185483 -121759 -212209 -256379 -54402 -235136 -347988 -102724
22134 224631 -112601 -83813 -1306 -20513 -239372 -110424 98674 -268912 1064 -266503 -163700
22123 -163700 7161 -14127 -142680 -92182 -107922 -171192 48618 -262298 20379 368980 94005
22111 -51388 282079 45045 -126168 51507 -1157 32479 -4523 138459 -271640 -79737 38114
22099 246253 -34394 200795 -31016 -146702 -216703 147456 252025 -114083 146424 54672
22088 -223775 28738 19976 -201762 -51206 181429 54122 30012 -125632 262183 187663 -71392
22076 -3631 -251741 -165550 -37935 12048 -11049 86283 124690 110116 -80000 75522 -4695 -143094
22064 -143094 25038 -349369 -81895 89366 -214592 123087 -27028 -3924 139739 -190295 443217
22052 44751 -73851 -18919 -373560 53930 96234 -145260 -26890 67499 42223 -239830 -112068
22040 -119128 303031 80356 -48417 -61105 -118034 -361604 74360 205555 4134 -10000 53935
22028 -75179 -145297 -149539 -465439 46207 -135994 234100 -140635 1696 -241660 -145717 -121067
22017 -121067 16313 -82794 -244331 -129540 -491683 -91406 -77183 71866 113184 215922 148084
22006 148084 65442 253440 37299 146234 -42196 -151043 -68117 -134042 -4053 -262918 -92990
21994 105956 7455 -80086 -96691 -222772 -224865 150230 8654 173409 -97878 132108 -168235
21982 42012 311669 74054 -393915 -39110 -118305 81387 -196234 167586 16727 109484 -144930
21970 110184 -357196 -164185 -184659 -78952 32045 77268 92063 -157344 -38507 -61582 116940
21958 45881 -143962 -271677 10097 -90603 84763 33362 -110738 201718 -16310 -87131 386959
21946 40976 -64369 28427 -99014 -154599 -173213 49380 36862 208094 -263512 -91554 -64436
21935 -64436 148942 50172 -241876 35091 91165 -259453 -24765 242642 -7224 -74178 86492
21923 206208 70696 21895 22604 262390 -84408 41775 -185711 -411998 -68603 -87064 -109081
21912 -109081 -170705 122881 -90931 -69350 -29893 63964 -335945 25785 -108295 120868 -6346
21900 146135 -94014 91892 -102115 -217871 38162 103505 -203675 -127388 -80567 -41383 -264689
21889 -264689 88382 -93421 -217676 -250212 -207764 -5325 -122626 -36466 -412333 -91878 -263862
21878 -263862 -246349 -248586 -240206 -43372 -217105 -166672 48110 -170533 198524 -21879 -265343
21867 -265343 -97981 -92382 17083 -62018 -72089 -52701 -130348 -14214 -158107 -59887 -26673
21855 -49287 -64317 -175152 -321735 -223700 -6129 -39932 26499 43947 -129429 -161515 152910
21843 167128 117630 130694 -164928 189947 -220189 -186174 -285405 -126540 291385 -336974
21832 -78178 38951 -174327 -36773 138292 254343 55303 -76493 33034 56816 -69663 -241980
21821 -241980 92240 291618 158328 -159907 155471 264713 44830 192272 -47974 127397
21810 -69566 -39870 -84107 62739 -131568 -149796 114527 356750 -83667 -113487 -397286 225489
21798 -464477 -137198 25892 42948 -28104 -140190 67943 164211 -120019 122239 -171407
21787 -203883 -163090 197726 21224 19399 -509563 -70730 -155895 -47683 -37262 -117918 20766
21775 -90016 -14779 -178258 84957 174987 -53266 -116198 86494 -44476 -83651 258619 21922
21763 -265815 148985 -67229 205661 174677 -16771 6750 123865 153283 -395584 -287269 -81882
21751 189630 73545 -92333 -202195 -16662 204493 160406 -58481 -224994 96977 -34104 -140320
21740 -140320 69341 -341506 -102660 66577 -256964 161585 -41907 222874 31310 137872
21730 137872 -149940 -64079 -172531 -250105 66235 -64788 16102 -74141 75014 -162183 -233802
21719 -233802 251112 -141205 267287 -95833 -129862 -137081 -97322 -127892 -190370 -378444 -67143
21707 119830 153537 136511 -29119 -234173 68029 -72921 55550 212597 102541 38065 -26881
21695 -64037 -132050 -121898 -148924 206301 262234 13793 -152677 -241578 2210 172436 70887
21683 -372741 -48911 -193203 425578 -37027 -136704 120164 -40021 -120912 1622 -107293 95441
21671 -51129 139861 -113137 195189 -474313 -28439 7032 191162 -153050 240282 39057
21660 -19873 -172461 235453 -236581 -79892 25561 86369 -142408 -117497 150342 -244649
21649 -4910 86897 -134240 -426788 -204628 -125898 -139224 188745 -59312 199774 33308 150127
21638 150127 -168279 11092 -151346 73249 39480 381155 -105086 -159768 -292375 -58306
21627 76307 18464 119175 -472302 205893 -404177 78370 -182947 -80563 72112 -151455
21616 145487 53186 -101159 277192 -222719 -3960 308697 -255201 207840 -147900 -60469
21605 -22568 30846 31540 -252831 240182 62006 -200886 26500 169585 -233580 -225885 48567
21593 -209834 120704 -7082 33175 52526 -31446 -172893 -16099 -128017 121561 -255844 -38006
21581 -142230 -131549 -245366 133696 176681 -113919 -299406 -59088 42496 -310745 -214378
21571 -214378 -261713 20269 -129475 -73910 99477 30924 248164 -304923 59476 -87119 83277
21559 -57786 246126 225640 -169260 4894 -15984 69928 -180477 -105452 182619 331565 -139993
21547 -94669 61679 -47990 -295859 75979 -29749 184793 -272569 -133887 -110282 37376 434681
21536 434681 -256175 -242060 -196844 -101524 -254703 -19583 -103901 -276957 -25043 -152620 -259260
21525 -259260 -45242 -13060 -169440 -124131 -188161 -111118 78994 -133794 -192738 281050 -285374
21513 75391 93831 180455 195430 -60614 905 -32665 -44977 -173114 -22989 117685 323570
21502 323570 -287115 128827 15566 -28339 37406 87037 -34197 -32797 -76332 -196116 344761
21490 -125415 109229 -96257 -122748 -13161 -168235 -101057 251374 -103406 77994 113438 -370243
21478 -215606 -66938 63474 -97454 4419 118514 35884 -57370 -95120 25554 -217156 -71125
21466 -5763 66468 -73485 -21087 -71967 -44540 -117893 124410 -96295 -949 72765 -80507 18190
21453 -143577 -5597 -164537 -31934 -28346 -47820 -169445 -422687 -153148 -57006 -25009 -193134
21442 -193134 218426 -65269 108162 -129325 181540 -59620 -185710 -133821 36084 -240234
21431 57456 -226213 -260158 -174493 245800 -495939 131111 -344466 -158198 -239447 -155281
21421 -155281 -10094 -63319 -191990 -98466 66794 1072 47837 -282736 243496 -131327 50842
21409 51596 58785 -217173 -148229 223712 -30889 -420202 -158153 187003 105760 73180 -114441
21397 155914 -269014 -329411 -423231 -138182 -410660 43090 154512 -17030 66131 17750 -34601
21385 -144674 101446 -72274 67672 15315 -209214 -191464 -142436 147243 158492 -79198 -378731
21374 -378731 -310637 -226805 -88843 -40322 -110817 -8011 -366017 220173 -390597 -161583 -95826
21363 -95826 -134570 161733 160651 -116487 168049 188998 -72279 -71705 356573 -122380 -111142
21352 -111142 -12479 -238248 48791 276096 -209981 -10228 110891 -177823 -249505 36624
21341 18623 184871 24764 175268 -173581 -12329 30270 69617 156722 200140 -108520 -103293
21330 -103293 -31867 102465 83442 -129390 61818 -347643 21918 104412 -50146 103970 -36403
21318 50886 35670 -6683 117828 -99462 166365 96197 -1846 -342937 -130911 -133373 25943
21306 -119333 163138 -202084 -109313 181117 -115392 -98568 35076 5843 223362 121747
21296 121747 43156 149118 -37952 -295100 -301114 -231415 47841 109922 -274116 130413 -166939
21284 -360067 107006 -147954 -75298 155333 -34625 -74899 33164 -140831 201540 -245417
21273 58326 -211931 210810 -301419 -307531 -71938 -105943 -83326 -327064 -125046 -49200 141773
21261 -6081 -134631 136 205947 -169793 -435714 51921 -167412 -193029 -17178 30086 -333873
21249 82855 148296 99796 169966 208522 283356 12481 -52091 -200366 -209431 -92632 46040 144306
21237 144306 -72703 34862 -265338 168393 250781 9389 -55475 -88961 -23447 192245 213208
21226 213208 -152965 -129255 -17747 112365 -269725 -119156 83294 -27742 354095 -122022
21215 184088 -35324 -73796 -39718 -255575 62884 93774 42726 107224 -265917 -180984 -69298
21203 43321 -284461 107733 130453 -336330 -106592 -75290 117678 4418 340281 -184713
21192 5551 116436 -233157 -208894 4177 -379765 33549 105314 171602 239171 72094 26543
21180 61411 34470 -151401 -175804 -377146 8675 -197602 188132 -351854 -2426 139600 -20248
21168 19358 71434 -148588 52153 -163992 22598 -86835 -91456 102637 41737 165436 -110261
21156 75198 -155782 -99465 -281017 159214 58923 112116 -293052 -185896 -186696 -131752 43555
21144 31446 177549 17902 13225 -123810 -221486 -100732 -63953 -222502 -206137 -344234 -28158
21132 -439961 -102862 -65801 34903 -16323 -252688 -73121 68674 103342 -69941 -122924 408146
21120 -358717 219086 1566 -219958 -286154 -147677 -83019 -394971 42363 50626 -316349 -252429
21109 -252429 -29925 -206130 -21608 135112 197952 75267 -84602 -117957 20292 -417303 -211715
21098 -211715 -138897 -130175 105564 -40032 -82755 -88363 57717 15673 -388017 -84634 -247674
21087 -247674 -111883 157540 263543 -61183 -159946 -27354 -200694 211834 61107 -338193
21076 43578 215462 97172 -179391 -345891 61884 198061 -431539 -59262 -29132 27435 -85261
21064 13875 136607 21177 105125 -144189 124754 250256 95025 56382 193229 85151 99071
21053 99071 -7004 94530 -213202 -123895 -99469 271827 100744 131029 -329845 -212960 -143928
21042 -143928 -14266 -204049 -56278 -61192 -181284 110603 -89056 -210913 -62868 -484145 -84400
21030 232902 -24686 -1019 24924 -210815 -215906 98490 -2248 40874 -243753 81243 66600 148855
21018 148855 -304212 173990 -25581 -71944 -178992 -24130 -197247 -78846 47571 -14177 -175618
21007 -175618 -42855 -3526 71388 121868 65927 431552 -219698 228711 137075 -59815 -87805
20996 -87805 55804 235327 -56999 -136800 -69342 39574 -231300 -57471 -197797 194571 -264997
20984 -127347 484551 -80760 142886 -98837 -78246 29845 -192359 91098 -14553 -266731 -85145
20972 -63904 -134240 -389517 83461 97653 -224524 -29415 -163415 -318003 -71144 -75904 -169775
20961 -169775 -101085 -156232 -19172 134185 -84310 -96031 -172013 78546 4529 -91466 -36715
20949 -241260 -69684 -174989 57039 -136593 -243599 4263 -177492 -312559 243612 -128992
20938 -292163 -16869 -301287 -211298 -175381 57743 208298 -14125 -249408 -134098 -21936 45081
20926 109715 275069 -110959 -37616 60573 73387 114711 -105783 -87503 -99449 -86666 -239962
20915 -239962 -290973 -200094 -35217 -84646 42588 140389 -312525 -146102 -163176 -18847 85481
20903 -375780 64383 7486 -227278 -64582 128044 -8988 -68741 87815 198107 -80829 188149
20891 -187919 -324175 211798 151762 140013 -274418 -63854 -282845 74097 -80103 385208
20880 189344 46914 -82216 -117889 -324036 -42459 174244 -224588 149363 101225 199481 -37761
20868 51431 -112098 -78745 76120 167726 -96481 -69792 -376059 249629 -109220 376181 1632
20856 -486248 -143635 115143 -282999 34969 -2855 147169 -355445 57629 5056 16056 28253
20845 28253 55725 141382 63112 -89840 -5426 -158807 -48315 -189282 103621 -18157 -245013
20834 -245013 -192749 -216718 -179752 -256513 -423622 -418034 -103886 -286222 30425 48870 -5674
20822 -165598 172553 -192182 -57296 -253804 -2992 66730 366824 198340 -332714 -176304
20812 -176304 -427 -111222 -102425 -25309 78692 -266453 -98087 -370655 -130747 -120 -216499
20801 -216499 -109472 -31339 10116 -124365 -151936 -122568 -139711 -75627 -179554 240989 -253685
20789 -105682 52686 90098 -257355 32957 97729 -164742 76715 -18729 -91675 -257575 94038
20777 160224 -243724 68510 -100714 17638 -21510 -64369 106389 -420793 -54003 9467 87425
20766 87425 -134752 -29622 -34853 2729 76594 122920 67929 254095 -341096 6581 74341 32494
20753 45806 -99305 -8027 -324536 120477 12885 -111356 145891 342228 -139387 173872
20742 83349 27599 -109015 -116170 230684 109800 63600 80628 -61740 -187362 -115213 -49237
20730 42699 67177 -93889 25920 -291167 -29650 -268978 -59125 -61414 -146718 -44195 -99410
20719 -99410 -306213 -339131 -339567 -66565 -222117 177234 78182 28035 -323210 -254200 -166191
20708 -166191 426541 86276 18157 1721 -71584 28292 108665 193373 -58463 -92558 189076
20696 202522 -200832 -125222 -128035 -242909 -114897 -54337 262157 20039 -46397 -163581 -416590
20685 -416590 -198736 7088 -448408 58293 -221835 -79714 121717 8779 -140651 -60281 94210
20673 -166606 134934 95701 -65710 -118666 -80989 -267885 -105485 -291352 -352858 -43623 -170691
20662 -170691 -84210 -253291 -153098 132244 -49385 -73959 -169496 -21291 -520427 -144054
20651 87548 -125611 -10502 -129495 -231305 -64992 112993 -2453 -103377 -78567 199554 -267274
20639 -262740 -256672 -238282 105864 107266 84558 -363831 -152704 -213299 43797 74977 -104712
20627 -248537 -187137 -231695 10102 -2133 283882 62366 -296441 -137157 -41177 -336911 33098
20615 51025 -194448 -365785 -168557 -94971 -16212 26112 35782 -178441 -43442 -137351 -54275
20603 -306536 -50374 176075 -27988 -140136 149307 -388292 -239952 -95324 12519 -162665
20592 -110328 33603 -138155 -122807 -70527 45591 341696 -55174 56972 254379 -222648 -296018
20581 -296018 -135426 26359 175341 -121841 -266720 229633 -236728 -13052 -258066 -161404
20571 -161404 -178982 -201341 -252842 20906 79330 199365 -183909 107893 -333095 64202 56181
20560 56181 -184405 -162288 -80285 -245741 -240598 -260074 92246 -135708 176293 -195784 -189518
20549 -189518 200658 -26872 18202 188197 183756 -73755 160939 68377 -160159 -190404 -14367
20537 -187421 -274505 127278 -95864 -277579 -61162 -65815 -38706 -415202 57271 -206002 329073
20525 -215211 -88124 131966 -48099 -243156 -157313 -172494 -378060 -8196 60284 -64301 110789
20513 -72932 69070 -3456 -281824 -65603 -57100 384460 -268554 -238618 -274879 -104729 -233514
20502 -233514 39311 -269679 -121562 -188497 -73833 -303192 -229320 -202184 -178993 -217610 116001
20490 25654 137893 91873 -138343 303195 12932 117038 -98093 15361 -133489 -28040 161602
20478 -139214 -65448 -25765 -2495 -60666 -146708 128249 -234685 196229 157828 -138711 -153297
20467 -153297 173926 15205 -175211 85581 -322836 -68701 -90940 78451 138328 -53235 -131228
20456 -131228 -294882 -112401 -28863 -104857 -14757 -178526 -107093 47426 335803 50798 91446
20445 91446 -186668 -164152 -102032 102011 129365 -63663 -129360 93026 149378 -111600 67279
20433 69821 -168277 -105172 -169745 -251940 245674 -23366 -49053 936 -287387 -55757 154294
20421 -130334 -62981 -67907 86752 -31539 -190856 -82835 -190397 107229 152730 138337 -12423
20409 -130184 -83740 -105115 -104678 -154774 -316748 -383646 -113983 296078 126994 129383 9534
20397 97435 -153065 85094 58364 -260486 -289008 211939 -12295 16454 -233979 -15454 169702
20385 -42810 -61276 -37790 52202 -73957 262652 -71697 -171004 -70275 -173292 -50076 -161759
20374 -161759 -29879 -72853 3909 80420 177951 115572 -137434 -574809 70161 -511510 -59790
20362 -374885 -37836 -27889 129596 139799 -47874 198122 -71803 -15161 127017 -89985 -267104
20351 -267104 113695 -95585 -40127 -25891 -177638 -148598 -196389 -84229 446124 -711 -56362
20340 -56362 -267986 -369988 10352 -68365 -75375 38754 -42632 159430 -139610 -32315 -358086
20329 -358086 -246032 -295723 -459030 -56302 -17178 231571 -97055 117014 -114498 58231
20318 -295215 -75407 -275708 -362407 -95012 -31931 -68343 42239 -261195 88527 -308313 -344874
20307 -344874 -211304 75313 -273390 76978 13339 34497 -157988 -10488 52219 -241462 -128986
20296 -128986 -89589 -218762 -194362 105999 -250238 -35465 72005 73983 -218685 -107923 47840
20284 -30658 -297381 -107337 -144677 81514 -123955 134710 -67633 -132780 103453 -61329 -4177
20272 95051 30121 32950 71875 93222 -249948 -126852 -204442 13854 -324264 -107864 -42412
20260 56590 168973 189359 -284940 -121682 -115497 -265542 69062 256744 -185053 -253657 -85529
20248 46148 2587 132342 18027 -372838 -164260 18300 -200841 -60792 -68067 -111133 199483
20236 -127669 -154218 -246713 33155 33036 -97967 23083 -278588 -263003 107967 -6821 -169582
20225 -169582 -13450 -61547 29543 211214 17646 -206222 -280844 98305 73227 -146011 81955
20213 -176190 308422 -39853 -41531 108010 -131430 -306274 165388 -46939 324960 -67896
20202 -148979 -160178 -116136 -87297 -100715 104981 -163656 -35997 138036 -13527 268904 37417
20190 -125188 -77708 90479 19254 -30951 937 -94548 302947 71492 -304470 -210120 82386
20178 -371656 -171152 -425026 189076 153030 10596 -228259 -17526 159601 122800 88038
20168 88038 138049 -134265 21115 -144540 -202126 14689 69156 -60739 111509 -243220 82035
20156 68992 -226903 365198 -109466 18397 -189777 153180 -159384 -16787 216457 87760
20145 -452007 -231519 -19024 177601 -29999 70842 -103370 -232856 -114455 159938 9582
20134 318375 166085 -394516 92980 -116826 265972 -193632 -123286 25045 -337076 -380211
20124 -380211 33687 -233890 -454463 -32160 -148150 -5186 -105468 -318903 -6836 -272308 -181753
20113 -181753 70821 38897 -95492 -209980 4213 105945 116649 20327 -49430 70321 -159841
20101 -67642 5587 365798 -453796 38645 49720 38353 -147590 1512 -112256 -25563 64362
20089 54955 83745 76481 96383 17856 255830 84944 -241299 20266 129833 -242340 -171610
20078 -171610 -163302 -45711 -23923 -95872 58925 -113843 -97017 18352 -329425 -139274 -11877
20066 61752 -83219 -371781 -6157 127851 -239968 107199 -132693 -76330 -88859 -7804 18013
20054 247815 -208184 85218 384144 -19085 27749 -196441 -133919 262575 77546 160676 -159876
20042 -203832 208682 -146901 -162454 93236 -350990 -266501 248147 100606 -3798 -212218
20032 -212218 -18412 -74116 -27169 -248569 -223758 43102 48315 -115835 34017 -122720 296486
20020 -157511 34229 -119400 406621 -565573 -87575 -74998 -138366 211933 29606 -182783
20009 35128 -466380 -69115 86559 29854 302273 -433887 -119367 -38045 -277961 143814
19998 -217757 218865 61157 77472 -113750 -139429 17317 -167039 -82663 -165619 -143522 10721
19986 -88036 212208 -203457 -76623 205616 -90810 50110 -34685 1966 -403709 -40328 -25752
19975 -25752 -169688 -44093 -10587 -222620 233411 97070 -211798 105013 25936 189550
19965 189550 61929 -222893 -12923 -60318 -257712 1062 -27209 -35595 7516 -238593 -212688
19954 -212688 38387 -377915 -404046 65296 -495278 -149838 184276 303240 24809 -174916
19943 -243771 158810 -240762 -207330 5980 -45565 -302900 -102413 59602 -27845 128880 -79537
19931 80264 -187916 98851 -176353 -318339 103258 159270 -40664 114750 -249358 -150925
19921 -150925 -264341 -71384 -410060 -319971 -86992 204697 286017 -134718 -44813 158149
19910 -432955 -285081 -26616 113690 -169115 67652 -124577 227781 -12089 37250 -158424
19899 215507 63306 -129504 42272 -20669 -104474 183619 -941 36678 -65886 -85662 -315236
19888 -315236 -15809 -169620 -26695 -68680 25328 175410 34384 72647 100933 -150870 -218358
19877 -218358 104034 -232303 -209371 -488436 -211786 -96231 -22200 267235 -16050 -236134
19867 -236134 -76032 189091 -175565 -76543 -82905 -309050 -203042 -185291 -161977 46661 -70448
19855 37231 -28663 -63924 -121641 -47910 90991 128205 118538 -309825 68180 -87507 165482
19843 -306958 -97549 262050 -173706 -114026 176668 -44776 -56128 129035 -396053 268804
19832 -96405 30792 -235523 42303 -57710 76031 -392644 728 -155159 -96000 147559 -150339
19820 -209927 -83882 -74928 21920 5194 -291459 209570 -95272 15593 98943 68882 109889
19809 109889 -20747 -213081 25518 250804 158274 -316615 180769 -50931 -44060 90352 -270118
19797 -205606 28581 -253799 91363 216786 82211 194649 328905 -55469 -488504 239134
19786 -61186 101158 177672 -138192 -14051 -196760 61277 81407 -220889 -97503 43932 178640
19775 178640 -93069 -146007 -288826 -55353 -82146 184907 113037 -363526 -17461 -99266 164053
19763 -34467 -31860 159940 -140952 -248982 -229929 -58930 -65502 -263020 328267 -408006 -132330
19751 81365 -244040 -152947 130411 -79017 140662 119874 2801 -268280 119282 -7071 -26754
19740 -26754 222529 46600 -40938 -55550 183834 59764 -163782 33213 103635 -3810 137708
19728 -259866 -9929 -120803 291782 237807 103421 -12136 119053 -120406 -114961 -209377 -23170
19716 -38096 167830 26274 88121 -290173 -43038 -157624 -317176 -333332 252741 97031 175002
19705 175002 253826 -104518 -196525 94740 -42448 197683 -8081 -115036 -17298 -120503 -426230
19694 -426230 -187938 -119407 -227603 -148564 -24415 -158777 -158899 3174 154834 53324 153031
19683 153031 295650 -55366 42639 -67660 -318032 -29578 -7982 180467 -24922 -224669 160898
19671 -59913 -35282 -205275 23949 -55313 -38845 103204 179319 -229287 -8708 -137347 -196272
19660 -196272 168679 -340626 -166722 -45516 -101951 104858 -56734 -148888 -135095 -420773
19650 -420773 67479 -477396 109972 202573 124215 -70712 -184736 -122650 54032 42650 216554
19639 216554 120308 -66046 -214962 36217 -87512 -275585 192879 198863 -157514 -54549 -375314
19628 -375314 -366124 36663 -80525 -232639 47474 -124892 -67078 -90308 -72073 -50665 215555
19616 140059 54757 125313 -161632 -88071 -132127 140135 215258 -65675 -392592 -64430 324379
19604 -115498 -102039 -239312 -105355 36210 -113243 80156 -163194 3006 22743 201127 -34953
19592 -21740 -68927 98246 -31592 -96364 -137245 -20196 191648 113864 -250149 -33158 -94114
19581 -94114 -247653 -425759 -157903 -20967 -107792 6511 -40090 -276044 -256 -96416 81236
19569 -81420 -12154 -374116 -112354 32065 -230504 -403213 -405414 65028 -77483 54671 -67735
19557 -157902 -236204 -92969 -137717 -214325 -5 -306190 -90880 -51539 70237 -202039 288875 145383
19545 145383 -349988 -177296 -182341 109039 217950 -350444 -188886 -68249 68940 98480
19535 98480 213593 -445628 58129 19804 17971 -248004 239954 2238 -62412 97414 135573
19524 135573 93956 219468 -3801 283877 -332078 -273317 -19093 -428261 66369 -116470 -223905
19513 -223905 67081 243444 287812 -213893 -63450 37963 -388062 -432367 77946 -210005 214090
19501 -116932 -155111 -195777 62519 61686 25238 -123902 133535 231562 -62451 -255115 -273804
19490 -273804 -195261 128856 363329 46109 -375978 -116769 -79371 240558 16770 100837
19480 100837 202054 172044 238925 127315 292506 29544 48758 115569 -38781 -511748 -344179
19469 -344179 -335820 -161783 -101914 175763 119609 -142292 59327 6102 144827 -195139 255197
19457 26210 150256 -207118 3156 -46535 -84613 -268221 -208429 -124209 -99592 -197695 -217087
19446 -217087 -157237 -188798 -140025 -189609 16993 -163032 123536 79357 -163493 413653 -38709
19434 110592 -109750 -43491 436448 231279 110006 -33736 828 347414 -198382 -278717 234524
19422 153782 82542 -62373 -114100 -314027 -44240 44424 201642 55116 91026 -230453 134196
19410 -91646 -235940 -65900 -114173 -130456 52638 18117 -185078 -182644 139660 -309210 91371
19398 -226972 -217607 22118 -108456 8036 25183 -30604 -120288 -49168 224941 154499 -54373
19386 -251157 116905 -22335 -12456 -137642 -160462 136579 -282895 60852 -74317 -203785 -8493
19374 -113493 290946 -258646 -215867 -222168 -329978 -211397 -226146 -479624 75875 -74848 33210
19362 -154580 -38852 54573 -106686 226418 -327465 298914 122877 -270112 -190379 -381648
19352 -381648 -9959 -89155 538945 213723 -50569 -286135 -5551 45551 -324212 71423 -332366
19340 -70694 -87038 -40580 73125 405502 -187121 33767 -101842 178237 -71387 -142250 -197828
19329 -197828 156003 -146982 40321 102730 -141243 -78192 106588 -147431 -399681 -436312
19319 -436312 50047 -90818 -102381 -337114 -216820 -437498 155476 188705 10800 -333013
19308 84917 62362 41329 -7554 -243847 -275915 -80349 -13732 -121742 -43370 239364 129608
19297 129608 -61893 89013 33354 285 -412578 -24067 -244141 53983 20405 -287827 -104033
19285 -55362 -31488 80407 -226246 -301925 110135 177796 42108 63451 -175371 -61223 -278608
19274 -278608 -103881 220574 -166747 205062 -374747 -67144 142745 -248996 -129072 -202652
19264 -202652 36571 22446 249107 -140420 -40837 -15301 56800 -122417 162599 -173662
19253 -292988 -214286 17782 -127988 101347 160449 169283 -33124 -16133 85315 151239 -312194
19241 91661 -204562 205793 -31050 -223210 -81819 133744 -141645 -5617 -15882 -235754 -236548
19230 -236548 -194527 -388412 -9410 13647 -307526 -199585 -160509 -75453 10526 22703 103944
19219 103944 -120955 -46269 18106 -168466 -607 -76726 48135 -8941 -173283 -84512 196170
19207 257938 -83145 182072 -132755 -16441 407478 -125553 58495 254120 -29187 -254804
19197 -254804 264110 139230 -518682 129123 -95356 -348984 79034 -53976 -30951 22187
19186 57858 -200930 -50923 68938 -91668 -391938 -204998 20649 -52655 21843 40541 -91849
19174 51296 -55112 8177 238433 -276296 -420911 -220842 43108 13032 -31308 -64335 -68513
19163 -68513 102358 19148 -66738 53097 -86470 126133 179419 -120721 327641 274872 -10826
19151 -562753 105955 -241765 26353 133882 99632 196015 -100694 -35879 -21502 87667 2152
19139 -61908 32435 -107359 -75581 -490169 -203505 -127735 87429 -148721 -209579 64893 262771
19128 262771 -72838 -303754 179208 35556 19863 -100098 52885 -47184 -105095 -155926 -318630
19117 -318630 -133878 -73598 257345 -242489 -98862 14354 -351638 -262102 -27476 -126292 -145571
19106 -145571 -123272 -87750 -176258 52990 179803 -181131 49046 38863 -75978 35253 -208101
19094 -164331 123166 -20657 -78356 -80977 74699 -44537 -31842 -222513 -275948 -90963 312810
19082 -133847 -37177 -70543 -223310 -14478 -55373 -399739 170771 -247598 132477 73469
19072 73469 -161400 99137 249242 117753 164334 -394222 -241535 -231354 40459 77290 137555
19061 137555 -396322 -171288 119522 -50867 162610 159635 -30704 -342854 -52636 -54143 -212598
19050 -212598 93502 -188077 -2260 34317 106287 123017 -125582 120959 -130996 63405 115361
19039 115361 94948 -171224 33657 33959 -312285 86040 -267240 -189228 -109713 -85554 127317
19027 -119051 206014 -259791 279438 21468 64439 176751 -49507 -209406 -222281 103531
19016 -402760 -58660 -208336 183681 -137080 -31420 369014 -295904 142874 202848 -38240
19005 -158426 -232564 -164797 47119 -112460 -54402 16476 -246533 -112966 -121230 104809 96742
18994 96742 -346315 16372 -27596 78399 140437 -15922 -131084 118381 -226110 -59829 139645
18982 -427786 -305128 -77717 -48513 -261704 -52951 -287106 -187369 154128 -123648 -39135
18971 -116687 -302396 20619 75062 181606 4419 10236 89171 -53812 -11962 96462 255086
18960 255086 -365883 -240174 105418 -7611 44770 -60726 -202371 103254 -44763 -129086 -111071
18949 -111071 -229945 191634 22057 -345230 -59560 -366392 -24524 -154094 -98948 -36044
18938 -199114 -208042 -130354 -283525 74799 -25074 -13026 -35188 -50789 -278782 598 43963 -224458
18925 -202346 -271176 -433995 -146748 23914 7875 198296 138137 -159899 -44416 -169955 -30548
18913 -40794 138444 -264697 -113851 -87118 170210 6255 198683 -12195 49554 137596 -64335
18901 60135 8068 66233 41439 -84411 -213236 -79595 -157282 37154 -89479 3457 -557725 -116202
18888 194034 -69912 -80706 -198064 -152643 173520 -141352 81287 68836 104237 -101480 123731
18876 108173 90691 -361057 -71837 -208496 -274771 -320300 54714 48383 21114 -153977 -308714
18865 -308714 14608 34537 -36586 -279796 331068 -50906 47166 157652 1400 -88895 327763
18853 70265 -180451 42424 -187800 78593 23478 38998 140485 -197401 60990 155509 -411492
18841 138089 -175510 -280075 -73249 -57919 -192309 -119546 167748 137685 -95264 -8502 -300591
18830 -300591 159064 243983 -171875 -87267 -128758 -137958 -22726 -54913 -96342 240114 93841
18818 -115866 51370 -191410 -341529 -47985 164002 -2970 -111123 -85486 205511 15190 41387
18807 41387 -326919 -282057 88838 -37865 -61363 23818 -160856 275685 -172907 -280714 106830
18795 183300 -73259 -140287 116579 -105793 280789 30347 164894 -376173 33532 41629 -105597
18783 -111346 -64936 -233 -7229 -86121 -170273 128374 190396 59874 -132969 4027 -39702 -116849
18771 -116849 93034 -139511 -110695 -136579 32498 -157976 -50759 53889 41946 -17653 9066
18759 124699 -186761 -215339 88637 -10068 -323277 97037 -121568 -106780 256307 -136586
18748 233437 -20152 -53592 -21542 -45217 -22648 -6455 10230 -457607 -30983 -172663 -126618
18737 -126618 121202 22264 -115937 -249584 -128389 129134 32726 40860 -119295 -383299
18727 -383299 -57029 196539 -226838 -316023 -32387 -187372 8372 -128121 -97932 -59625 -56335
18716 -56335 68273 -109114 -151808 -13209 54762 94673 -178821 13563 195890 -156807 49694
18704 -184872 -42615 -278862 -127770 -409698 -191933 -14127 -289894 12882 -23473 -339508
18694 -339508 154887 78400 -71868 122529 -213614 -39926 -365863 52780 -37671 -221627
18684 -221627 -101276 259247 167856 182086 -8969 3760 141488 -163934 -128303 -434240 -223924
18673 -223924 -89925 110032 -245585 -152630 -203912 -104985 -136937 -283591 -27566 -97043 299884
18661 -178123 275412 -313802 -82764 -122627 -197258 -140687 40647 251945 63223 277304 -143811
18649 -267077 -21519 -188271 56152 40105 -189258 -40829 -66270 -68856 -251865 331712 -268245
18637 -158847 98764 170628 -32981 -473198 40357 -169600 -35000 -135370 -77940 -24775 -25950
18626 -25950 -48377 110240 -5414 -91127 236288 67135 62444 -382819 202835 -385723 172607
18614 122645 63926 185420 -191819 -157426 -223380 112089 28593 -186116 65097 -55237 -116240
18603 -116240 44626 -95348 255232 61583 59113 44679 -69879 128912 77416 -61593 -245445
18592 -245445 -280085 193869 28070 88789 -255023 -250586 202980 212990 79454 386449 -204415
18580 -216811 -7310 -149619 -218255 -217024 183026 -205226 102132 -90673 -169546 18258 -35924
18568 -124046 170957 33118 -63228 -287197 -149 -84815 62652 14020 -353536 48241 -150361
18556 -277765 -981 249339 -427595 366951 -177614 -233590 -66823 -154075 5051 -88538 100844
18544 -176926 -9986 -138050 251391 -12696 -131207 -10006 271241 83707 137591 -139556 -76624
18533 -76624 -293865 54590 -294496 89769 143260 -53332 -125921 67950 -270508 -260501 24331
18521 134342 100831 94952 -290099 -214175 -120775 -8826 -174852 93760 106014 -93696 107616
18509 67825 -194611 -10905 -154107 28137 -70098 -161655 -17516 -284126 -187907 80431 65374
18498 65374 -328384 -24018 -146973 27832 100145 -52179 -193827 87344 -8217 30805 -183059
18486 -382994 53017 -90836 -579788 -367785 58919 99715 35286 -126487 14988 -42754 263973
18474 26357 -181104 11076 -137061 -111103 -61833 7398 -217872 -18479 -226900 17975 -9877
18462 182531 -32191 -310653 -90279 -124884 64738 -9928 131968 56838 -105983 -113439 -287759
18451 -287759 69941 319952 -68220 -14926 38285 -257289 -248591 -297277 -130524 233983 -128674
18439 -266143 -250680 -194342 382065 137253 296645 -468693 -198653 126276 51739 -59568
18428 -31373 -103078 -13807 81141 -51896 299959 198703 126751 294427 72840 -6812 146170
18416 45495 68235 -124979 -245545 8164 -75439 51534 141796 203123 -529617 269910 112117
18404 80046 -67927 -108204 106797 98961 112860 -25027 -22440 -319913 -267878 -164978 -218884
18393 -218884 -219490 7071 -322429 -164819 -213967 297167 -165376 70559 -592972 -199700 -10698
18381 125861 82275 -209575 -228121 -135815 70468 -283532 -145126 59864 -320282 -53465 -459448
18370 -459448 152387 192737 197738 67917 122878 -8176 -221228 110030 -140587 -522051 -60568
18358 48973 -67132 -46271 261359 319544 30799 33344 66541 -295016 -64851 -40475 -236996
18347 -236996 82925 -40133 66677 -127308 -20778 -68233 -162987 -245287 33213 9937 -102295
18335 -95225 224837 342669 -308434 -213623 127048 -139566 422865 -74111 -438820 -364368
18325 -364368 123066 -63053 124186 20300 -244563 -18663 -5933 104692 103983 -279099 103077
18313 251830 119220 -138049 -146168 -11766 -67276 20268 -215261 71229 73308 116914 35509
18301 -287218 -342783 39040 -165191 155011 -182826 -94337 -32699 -203025 -233536 -244327 38704
18289 48733 -99313 -50511 135141 204000 402137 150473 -183522 40172 79099 216794 -311402
18277 -182946 -2316 -112058 -58174 -69697 -52342 72533 122717 -275056 40241 198871 226703
18266 226703 -35326 8995 300473 110086 -267760 -154964 -38286 182375 106464 4615 -112079
18254 162879 -376262 -31276 -55178 77894 -52750 78387 -264927 143898 -217598 -41524 -265204
18243 -265204 -100673 -194887 9118 -61163 216693 -257741 286322 73606 -55930 91351 -139421
18231 -286154 -66121 21264 -163441 47151 102661 -43095 -52073 -110906 213261 -179536 -10101
18219 -300792 168337 337605 44949 -141855 -236633 178383 -287772 -244654 144171 4727
18208 13896 212855 76757 -6425 12857 153518 136248 -199268 93325 173027 -207856 -66634
18196 -144603 -25827 -202897 -24342 -136367 -46247 300226 15145 -119256 18973 -11491 83755
18184 427158 -44818 213562 20596 91319 -279386 55912 -254859 211524 -256342 -149707
18174 -149707 193254 -125764 83914 -166401 -84379 -164457 -358003 -161521 83722 28222
18163 -325169 -120397 108595 -127607 273217 238282 148545 -57913 -308825 276653 -30296
18152 -319050 118045 -47885 139682 -9113 40831 57964 73702 234663 -146603 227911 -24665
18140 -38199 228164 -144619 -41259 206759 89923 62041 67273 322725 -90121 423161 -299143
18128 -62874 277546 -96561 -153079 -308265 -442312 -410894 -19510 98689 212132 33385 -58695
18116 156866 123057 81749 201640 -56309 -145467 -312887 -305590 -48766 419630 51250 -272975
18104 -4405 -355283 20530 -332332 -185335 -41188 -351961 -76824 -205731 -127411 163039 -196615
18092 151482 -204079 137124 106123 166413 -330141 -209910 -247676 32622 -45423 -334891
18082 -334891 268858 -103359 349352 -293023 -231353 96989 -102028 240070 59548 40541
18072 40541 80051 -191764 -35796 -110464 8179 -14182 12968 -86204 -13478 281608 -213646
18060 328992 124293 2348 164752 -6620 -21264 -24679 -117344 -26006 122295 -228557 -27197
18048 -373559 167282 -54024 228807 -113012 -61976 -329048 -29774 87303 -21584 -93774 78858
18036 58977 -180384 130679 21973 -68617 84095 41353 205161 -170560 -88831 47660 95387
18025 95387 105602 95101 405362 -249321 103202 -13782 -113009 -31298 115694 -185258 74630
18013 -139899 -224042 -76902 -189697 10907 81169 348912 179039 34959 108529 109127 217485
18002 217485 -73021 -222288 -422923 197740 -184687 -58799 -387574 -159670 326563 169634
17992 169634 223973 67958 -201152 3058 -319136 102038 227126 81973 224867 1419 170690
17981 170690 -3967 158796 83124 174781 181795 198052 -270744 93975 -124917 -193734 -47251
17969 -200294 -156360 -222064 -110928 288029 -69155 -25751 -321907 -252841 -25075 292555 -298905
17957 -67634 -125506 -21039 -109990 32141 -172545 -92839 -74156 44654 -38494 94539 -146687
17945 -119435 61548 -463213 -102495 -179995 68176 276309 -185058 -128811 -92941 -220040
17935 -220040 -299651 -136040 -64298 62745 42737 -95483 -38636 50319 -33656 88478 120493
17924 120493 85 318257 23197 -185685 30056 58755 -206762 130399 5254 6102 -24768 235727
17911 -118577 -21950 -120194 62043 102334 -241073 -228513 19332 -364976 -106524 344928 -116805
17899 224363 -67405 -69425 23214 -370262 -42433 193762 183663 315256 230028 -73156 100402
17887 83593 27354 36677 -299752 28083 90898 -188689 43091 -112168 -269088 -206936 -91232
17875 -109913 1486 77596 129828 194516 -44932 -128974 292355 -16253 -117162 13547 104147
17864 104147 7062 -80451 77333 28737 249440 -13457 -256411 -292219 214438 97462 -390451
17852 42872 73455 107748 -55633 5979 -193713 443402 264394 -29250 215897 -245019 -12117
17840 129824 360823 -64714 -88772 191754 72911 -258060 10909 -241 -209171 -190631 26105
17828 -270992 -259145 174818 -77171 -221557 723 180382 -6024 44746 89281 -142437 454246
17816 -274368 91860 -306299 215934 138580 -228552 1994 18222 192792 -24183 -40977 15349
17804 -76709 -147157 120898 -109458 -242403 -112479 -95161 57223 -212035 -102088 -74185
17794 -74185 163255 386359 -77925 -94080 -4070 13241 -284362 62015 237337 286935 8718
17782 149667 101731 -119308 230867 16015 290033 209377 184214 -120308 103761 116417
17772 116417 -184922 494449 21667 -80362 292610 -149261 286318 -184102 -171556 -104837
17762 -104837 65651 -142399 33086 351383 -383933 54976 -294097 84208 342851 235676
17752 235676 -30703 92714 -27305 248763 13337 -35525 65730 -63331 -157276 84911 -102986
17740 -459551 -1509 -313500 45187 -43695 16896 -183003 107592 10504 51608 -86797 425125
17728 214997 305504 -57923 745 16307 41753 -69013 243106 192145 -227735 -92043 -24429
17716 -56076 72618 -57159 -39890 -16078 125468 -433930 -18444 3174 261165 -286149 -172584
17705 -172584 -339398 -154057 -347113 81244 35931 151495 -223828 90344 371352 118608
17694 -47759 -102343 92868 33813 -130580 52192 330272 -60195 60453 136492 140680 -7210 90256
17681 -209343 199661 167690 170193 -62049 139688 -161317 315099 203171 297774 -201710
17670 90320 191212 223788 133331 -402983 -189908 336071 192061 39163 -54944 -5235 70723
17658 4495 -154797 195439 265816 405050 -174175 -138988 50929 277885 -24998 -126544 -256657
17647 -256657 402266 12758 250453 3033 -255301 -148575 52732 -367498 -198265 -148476
17637 -148476 21706 302153 28514 135566 150491 -107658 352222 33055 -242082 231683
17626 -39585 20695 117673 214335 -200800 146541 -132200 -86555 250079 65822 128963 96192
17615 96192 -199669 167869 135004 216513 -464108 32854 -26515 131226 -123758 -40164 -92555
17604 -92555 -55029 -166386 156688 3841 -259965 -70203 232494 -68287 176807 124563 301717
17593 301717 -186530 156832 177081 -359127 175654 116513 -105749 -32238 163727 136411
17583 136411 61423 -118888 -42759 -220870 -39509 -116866 197838 312178 57654 -38852 26099
17571 -229014 162070 387014 38731 100608 143194 162386 -207314 7718 207759 327533 -82951
17559 225964 -148634 -51564 167599 239096 309987 35244 -168385 183695 26900 64284 58372
17548 58372 340881 250845 32988 134280 137815 66098 -20569 -235754 -66652 51579 137001
17537 137001 -24546 -37610 129224 -67414 242159 50758 -92025 163221 334827 236808 -53541
17525 -60112 -104262 101367 279937 88356 -137016 88713 85759 -70024 -102888 280015 -273339
17513 339204 -101673 142753 100819 -107418 437558 63199 306779 354296 -63840 296599
17502 265657 191132 -239679 -38715 -7916 -30262 -27230 255417 314821 11844 59619 151498
17491 151498 11922 87263 418619 157344 -3443 -96994 334507 238593 -37362 35761 -24586
17479 33773 71280 403868 -63468 179347 -55585 410271 -135708 -20362 53997 130649 121024
17468 121024 209143 -97731 94681 184301 48166 139970 -45696 8837 102823 220403 236464
17457 236464 55339 -122437 319448 255207 214758 516445 733736 73335 57077 298011
17447 298011 159198 107591 482712 57962 183212 153068 439566 344820 168087 411319
17437 411319 464832 135818 353293 55689 566528 -129818 206905 543076 -10398 50936
17426 -40093 242358 384919 54223 460559 -106903 226396 104587 134445 287662 263117
17416 263117 -64552 -183220 -39853 72011 430904 439374 168857 63442 -182624 119316 370733
17405 370733 -85516 -15520 122624 27385 -145660 -12071 -101800 -170937 341936 101408 413539
17394 413539 42158 201130 74579 425120 118818 248220 499869 103959 -117263 280937
17383 -8275 -7245 211972 129212 106548 29282 -8698 -128873 155299 254295 -101553 -46050
17371 249156 485072 420449 -138105 -166519 -35158 -177091 -209988 -124788 274982 85643 142537
17360 142537 46155 -183471 127115 73717 342237 30242 220368 -42240 108448 10008
17349 4280 -103475 485717 146784 172396 -80867 284337 124276 134414 -141039 -94435 -41491
17337 -60490 195319 151622 -149507 175923 279536 337373 175640 -15808 335469 172871
17327 172871 235376 121766 294541 73693 -53581 252812 211141 76455 41345 349656 123491
17315 355510 211504 288288 -123392 95176 430987 519961 232753 8419 82956 -282803 243845
17303 85589 329564 226405 270837 42570 299312 470019 426138 33277 439505 246853
17293 246853 345991 -19900 318192 162522 -103979 165405 400010 149001 105415 90325
17283 90325 230599 188350 118632 173530 94584 243126 475131 186041 -17939 177107 140670
17272 140670 408463 -41023 140470 134182 392861 57888 275752 91386 325887 -186084
17261 110636 331276 361287 281985 164786 50713 391877 423846 438046 75249 109490 55741
17250 55741 38547 13192 384429 373328 198901 324087 245444 107308 186320 28604 127760
17239 127760 421270 94355 115881 513882 -277870 199486 130484 395340 277095 411464
17229 411464 192251 150472 365623 347067 240060 166810 448993 150813 187286 -18983
17218 -37717 235591 128737 62031 283125 253850 369630 294567 13158 456246 -192982
17207 338348 132354 480065 99253 183714 184798 263336 458935 185515 313776 114842
17196 169934 114961 298560 269291 667513 383107 70225 166141 -85246 237535 442644
17186 442644 -6385 432091 215962 90599 294665 269262 244084 321234 282493 179704 194276
17175 194276 301459 363697 560208 466491 157521 453837 235329 376923 361161 182844
17165 182844 -99028 542030 286664 221195 148579 352232 181729 330918 46412 177594
17155 177594 133080 487482 373402 -40352 341159 244354 529508 302129 435536 369870
17145 369870 359219 220145 400275 622846 754637 310816 83768 527512 219698 197313
17135 197313 378735 521025 265032 258727 19318 170379 450887 44495 -42900 289240
17124 387632 298407 444884 54503 180581 -23013 431811 224348 381196 638559 562201
17114 562201 572105 273841 -39059 208712 428580 46474 259319 284315 228703 659824 333285
17103 333285 73279 505662 485787 334809 337927 229095 570647 559188 275000 297803 423509
17092 423509 365076 451355 438273 153016 225813 271660 456369 482488 449708 295242 438866
17081 438866 631109 504889 594939 832978 554303 399745 324652 476739 430267 437965
17071 437965 590897 379700 136986 453797 452354 749896 628161 616471 345039 364105
17061 364105 365036 541320 580179 199874 248797 203115 664737 282132 411903 575200 246646
17049 648387 505842 377031 498536 729231 703026 407565 498214 524898 438876 636465
17039 636465 428844 495015 295998 457659 589980 456825 471903 447648 871711 562837
17029 562837 401266 492786 471420 853524 383682 791695 615210 664537 445110 439943
17019 439943 675382 480874 464234 798446 536298 584762 702540 569624 747478 742431
17009 742431 507391 803331 660489 658427 956020 706321 703907 863001 848064 810532 664771
16998 664771 817649 1059806 1019188 622444 916111 762702 986159 781456 724818 1047083
16988 1047083 891553 912898 780619 1067864 734938 836866 845478 1043527 570243 903323
16978 903323 1006034 897990 1335745 1125892 826154 817789 929912 1043599 1286040 1187723
16968 1187723 935775 844635 1265748 855841 934996 1122832 911033 1164537 654077 897261
16958 897261 837593 953117 1209613 1039712 871435 942303 1083620 1302548 1021067 1460836
16948 1460836 1213812 1124861 1208981 1678538 1318324 1183718 1387554 1478328 968658 1343179
16938 1343179 1258956 1124392 1338111 1527285 1647506 1380377 1397461 1614074 1266426 1740725
16928 1740725 1326380 1425445 1453477 1608529 1430149 1476283 1274298 1568630 1629784 1281277
16918 1281277 1610274 1721555 1733366 1529446 1669382 1428709 1540420 1632992 1812553 2031515
16908 2031515 1639122 2059230 1645545 1514805 1966436 1503863 1811955 1845545 1751383 1960638
16898 1960638 1888566 2143226 1883276 2087215 2265740 2034875 2294358 2011671 2132274 2279873
16888 2279873 2138992 1748210 2416671 2247228 2097306 2287986 2348313 2426172 2438977 2272811
16878 2272811 2659416 2270144 2419216 2763521 2116328 2511848 2738662 2418575 2709840
16869 2709840 2770356 2667587 2797126 2690375 3203641 2939396 2697299 2975159 3122586 2987868
16859 2987868 2750586 3163396 3450413 3085082 3155115 3286755 3499503 3554547 3545630 3515847
16849 3515847 3676289 3774998 3651945 3614779 3713367 3917147 4021750 4035705 4198544 4034841
16839 4034841 4226095 4208281 4276370 4611390 4408390 4642626 4758794 4758156 4988257 5136552
16829 5136552 5175171 5272475 5188504 5467787 5155887 5548284 5739066 5815839 5708082 5681301
16819 5681301 6531087 6088439 6414001 6436859 6849627 6814304 6705685 7016400 7320582 7565219
16809 7565219 7571716 7739244 8017620 7762147 8200921 8209993 8430934 8812429 8947979 9237040
16799 9237040 9215929 9817427 10006268 10556352 10673121 10799100 10977639 11391952 11585442 12029759
16789 12029759 12199330 12634533 12774698 13536477 13691909 13785371 14633140 15005049 15483170
16780 15483170 15863068 16438028 16982767 17397556 18095210 18571199 19208342 19771687 20258647
16771 20258647 21225850 22107604 22576726 23541995 24466928 25508174 26190223 27446956 28626744
16762 28626744 29594981 30923966 32141442 33198435 34712478 36180713 37942804 39516131
16754 39516131 41327923 43245897 45014883 47396435 49584898 52108715 54546592 57092363
16746 57092363 60115817 63298712 66441985 69961900 73504974 77813792 81539651 86009615
16738 86009615 90834927 95300369 100439594 105499599 110994446 116762136 122116518 127959459
16730 127959459 133787115 139553995 145134524 150205808 155248954 159437121 163256483 166583577
16722 166583577 168946012 170477777 171005848 170991408 169644483 167992677 165057630 162048802
16714 162048802 157667934 153034890 147842255 142498847 136801440 130918224 125273512 119577847
16706 119577847 113787267 108238016 102877020 97649232 92667804 88161233 83489577 79275793
16698 79275793 74890990 71322403 67762697 64058133 60717618 57880414 54742035 52659972
16690 52659972 50145576 47627188 45430021 43425308 41574927 39219017 37740641 36153664
16682 36153664 34783907 33491047 31897842 30541925 29246251 28367699 27195231 26132614
16674 26132614 25176091 24193505 23099362 22505129 21827424 20775672 19923969 19520703 18957284
16665 18957284 18114795 17350278 16749537 16655508 16170065 15700615 15333255 14851376 14595846
16656 14595846 13698335 13294311 12878640 12388773 11918866 12269649 11273439 11374711 11103585
16647 11103585 10668633 10608739 10335856 9968106 9587125 9334090 9259820 9147031 8828563 8804010
16637 8804010 8518073 7964485 7879900 8030846 7508920 7689374 7671331 7390912 7240143 7027250
16627 7027250 6770454 6342205 6567677 6414834 5843383 6304023 6049897 5779405 5449590
16618 5449590 5703273 5561234 5614115 5303757 5239799 5341750 5128035 5363625 4708096 4573428
16608 4573428 4447718 4455607 4461766 4516379 4180197 4116928 3925247 4375696 3728858 3987511
16598 3987511 3823094 3778186 3961340 3988797 3499358 3559652 3699248 3878713 3371353 3572129
16588 3572129 3263923 3247455 3167584 3370410 3110215 2891550 3237683 3254132 2713202 2793422
16578 2793422 2630964 2809340 2877668 2860887 2919740 2464544 2738942 2500965 2548333 2474827
16568 2474827 2573428 2534016 2303889 2657791 2499700 2420308 2397198 2386399 2126368 2094942
16558 2094942 1966042 1901880 2490161 1962287 2158734 2032289 2245583 1987598 2142895 1832001
16548 1832001 1791210 1871169 1743623 2186504 1835346 1579789 1999285 1786810 1804093 1709040
16538 1709040 1907989 1839843 1703770 1403308 1450501 2055386 1411426 1440586 1689886 1526710
16528 1526710 1659233 1312465 1676765 1673867 1363668 1717509 1660073 1647132 1424812 1500604
16518 1500604 1499588 1544648 1455909 1313070 1398134 1398699 1408136 1384553 1548667 1528124 1048124
16507 1048124 1232643 1494458 1164021 1117966 1360006 1206460 1161697 1124674 1092663 1302538
16497 1302538 1136881 1122665 1162182 878632 1300750 1021336 1002699 1208417 1216869 1148703
16487 1148703 1070521 1034534 662671 1129503 959605 1035576 903504 1125482 1172384 846187
16477 846187 936845 1059308 1018048 1239088 827187 833434 760054 529529 892611 945013 863143
16466 863143 548945 969931 873441 918036 649786 851814 463013 924882 962796 966549
16456 966549 907136 1031577 931257 817344 727869 904227 914600 510215 927226 542051
16446 542051 618376 1198371 636337 767252 651057 870545 884076 653327 517045 721208
16436 721208 767252 1026037 639411 925751 764640 885568 545772 487855 708537 547884
16426 547884 306838 577911 803856 742385 592954 488071 660135 792579 576210 580888
16416 580888 472822 561242 478944 558561 540593 826964 629787 585929 428665 704512
16406 704512 857677 603570 682133 544096 431453 450513 438080 470252 340679 272497
16396 272497 566150 729235 289963 712949 524660 727235 352944 771035 546152 95253
16385 405542 668176 130508 595296 376710 177886 596855 393301 578709 461975 522173
16375 522173 361100 435699 394497 457934 505968 662633 287526 271524 342568 679642 659606
16364 659606 234512 247132 681284 630682 516799 310352 556707 523277 445032 541551
16354 541551 341995 61920 376860 241599 383762 489644 533475 442319 435701 319859
16344 319859 469854 535987 429036 384844 312807 386960 278699 457839 433708 438259 531346
16333 531346 166960 638626 398019 440910 267949 347372 106489 309119 425345 297023
16323 297023 366597 375051 337592 338547 303213 278362 396768 616353 616549 46869 625558 387105
16311 387105 288756 184432 367244 294979 347702 395347 373395 157828 32356 202604 -163321
16299 353766 457091 426170 396448 342149 310143 204933 132810 92347 5367 498822 410330
16288 410330 206402 586465 337662 389203 582662 253196 492329 610580 408423 279838
16278 279838 271222 269466 239788 278934 304202 54537 321224 227023 56097 514689 56022
16266 429665 296921 209390 468774 229045 59758 62185 115628 202556 -54466 208485 125933
16255 125933 362806 108887 167809 387604 483510 472866 -125333 98957 148722 227188 372084
16244 372084 125418 324491 229014 157640 212115 213951 475611 503148 129277 189776 35169
16232 65154 -62793 153577 218958 -21040 159806 76620 173078 151410 187861 184989 372427
16221 372427 166783 54420 130749 584856 146489 141118 235286 243573 145623 92381 112044
16210 112044 277397 -155100 306117 -184827 202213 -49723 103619 440523 247400 -80909
16199 348911 -51909 73408 257842 -23871 94421 409001 176762 116952 -231517 262792
16188 173987 65387 -114331 358393 250001 -74591 61025 553999 123803 211671 33603
16177 414838 39811 -129033 341938 282195 -8185 213926 294326 126226 209932 -125194 390881
16165 -42904 -21601 174707 -7945 37988 159975 173201 -136659 279600 21867 256602 10035
16153 -112437 253905 64134 306924 -22727 5624 9049 -129504 194663 -34779 251644 89146
16141 -86797 256114 81133 175676 220291 321135 -7677 -131079 63446 161321 184453 130491
16130 130491 -72819 130719 207870 170471 -39788 73186 93195 116915 198873 154508 45135
16118 144520 43483 -448731 189564 200430 76601 -163746 -23031 311387 326535 3794 278374
16107 278374 22065 94509 95947 442622 325190 -79957 -15972 318601 415626 -39526 24006
16095 137868 -110443 275672 -133053 -145975 -203765 33977 121612 -39208 -16401 131647 -206303
16083 30135 78812 -204840 -90270 99157 221656 191965 -193890 -36311 142136 88069 -28510
16071 15871 -374296 147279 -133747 49369 368862 51517 294570 28944 27080 -126045 13066
16059 -262953 172046 -14112 -169305 24872 -330354 -231245 7583 -21744 -282677 57529 -10464
16047 6146 97299 427912 209191 113285 72019 123935 161131 -320174 155730 -176807 24297
16035 -59109 -42880 -141035 -35305 39255 -254278 90310 90912 313288 42112 212445 9659 173441
16023 173441 196341 313392 147285 56163 -235517 72385 -183001 -362846 -47849 163597
16012 -63154 -330989 -150224 79139 -106922 -4768 -76654 -117189 -175818 -416350 -111927 -116859
16001 -116859 70681 -40265 112384 -25915 107531 239512 146937 -203355 -69962 -84310 175740
15989 217536 17792 418632 224400 15967 169068 236251 184809 -97473 398290 -96360 206800
15977 13975 -183662 69022 114896 111199 214792 162854 103722 -181266 150482 250096 -66023
15965 -285890 354162 -128245 198639 -90611 22733 -84330 146782 93761 -291222 -104433
15954 -76128 -118418 -42327 34197 -456243 -22728 -83330 13754 -61240 -155334 149798 -5838
15942 -49119 -210741 -95013 197888 -250262 -206656 -290237 -49937 -315960 230263 -71207 22250
15930 -91647 16733 -216464 266764 -35876 89026 25022 -29948 36618 64352 113244 -208734
15918 237468 65753 112893 164352 400254 -156410 -141136 74860 167084 -235666 -182796 -121362
15907 -121362 -179433 -476365 -60561 -357012 210167 -102983 -177170 -36465 -70766 37180 -8958
15895 -75294 -197617 -3341 51674 73546 -357530 246321 283471 164371 324301 35122 152905
15884 152905 527866 77748 136744 -3440 7045 13968 51306 -96308 -220619 -180208 -191368 -199226
15872 -199226 160498 -138377 189459 -230439 -204976 -58653 -211457 -52016 -172204 -173766
15862 -173766 -202994 -191212 156497 -152764 140038 228545 -164631 253085 98718 133809
15852 133809 197809 -93995 -267176 34116 16522 120781 -94963 66961 70716 -144345 129806
15840 66696 -170348 157107 -104302 79076 391480 -221265 56438 83896 75460 -247706 -216202
15829 -216202 -170163 113507 -10380 -91493 176056 -2340 -36896 70966 8258 68529 73543 -75212
15816 265724 -397562 -163338 3506 37016 -456384 -22248 -254300 -315953 144532 -184508
15805 -329655 -280095 -37614 67827 230943 -76240 -64219 -117249 180795 96795 -145834 -327458
15794 -327458 297817 157936 6238 -283203 -375402 -49062 -300743 -32279 -95427 13361 -158453
15782 -180889 -52893 122058 -257870 -492089 208171 -553944 -85279 131494 177450 -399033
15771 -6097 -82466 -138681 13773 428447 -322911 -159912 -26244 -27653 53349 -54602 56047
15759 9812 -94605 -195846 -106200 -415557 -20738 -101972 21638 239988 -294495 129228 -3203
15747 -18077 -101566 -85776 -447689 -18813 29759 3873 317314 450806 132081 -216606 86142
15735 -23947 -148844 50914 51207 18008 80237 -140639 82187 32430 115990 -123082 -235551
15724 -235551 59197 -13755 -6424 249278 123168 -111295 30542 95039 -240368 78020 -155776
15712 9008 -54795 -123505 413965 -103229 4893 -270576 133408 82352 537670 -249132 109077
15700 90911 140719 236548 119296 189095 -149370 -17012 -8868 51964 47841 -12349 -192827
15689 -192827 -110164 88653 -155538 62209 -120725 -133275 -125795 67407 106241 -321306 -196567
15678 -196567 345789 -221126 238407 -109345 10349 -15352 -96988 381802 -25290 75973
15667 -179343 -110969 175148 -358803 -10090 -224553 -70080 -186916 -252781 240431 285121
15657 285121 -88405 50542 -476757 -39246 21660 -455368 156431 -394087 -191131 104569
15646 -69877 -13886 -102490 -283978 41351 229309 93998 -131654 -160258 248465 -41626 15295
15634 178113 37603 225506 -48659 -6128 -2858 78015 -291139 -11550 -11315 -115437 -15816 -299848
15622 -299848 -73706 -249370 418719 -16635 161871 -122059 -83484 103223 -93160 -452926
15612 -452926 -114503 85690 -362630 111885 -99467 -191753 251193 -6593 -28419 -161171 -100362
15601 -100362 89758 209880 -15709 -313209 -323762 87245 -121444 159996 165751 -98132 -16735
15589 -311209 -33052 51314 -159077 269896 -110874 276451 302213 235105 11534 -41423 -11797
15577 -260747 -47571 -194563 51039 -11659 -250733 -343367 -222617 -11299 167926 247415 -87777
15565 -63880 55969 115524 51399 221291 206209 116397 289680 43223 134585 -2315 104528
15553 25713 -206833 -431683 124385 -23052 -134984 191214 17247 -130193 213246 -71115
15542 305192 -78796 -244746 -77623 238431 -223372 -51562 -197302 -50247 -25474 -58681 93386
15530 -50818 5820 -67173 -282093 -94238 92803 304308 17197 -215668 -30312 178118 336573
15519 336573 -184124 252881 179624 93978 -193918 -173835 -212217 -21599 -183032 103337
15508 161431 -20485 41930 274260 10652 -78941 -424322 -133386 -227855 342782 47806 83252
15497 83252 26973 -111661 150898 -64218 214074 227533 141474 -360209 232819 -175090
15486 301955 -17760 -52390 22401 13742 -136510 -100552 114541 -134724 419700 -202905 260448
15474 -69005 324271 159381 354702 21980 42665 173079 -19589 75730 91298 -85569 -12797
15462 159073 -151112 125419 -209685 -360170 -6500 80955 -12465 -74900 17759 176030 432502
15451 432502 142917 -76884 -188898 28883 92287 -74447 -254299 -58175 -182814 67924 -70826
15439 -163333 -73591 -107942 -246712 -100635 134525 -53816 12373 181348 63133 -110348
15428 -240462 -43904 232474 171597 41072 -352322 240619 -9630 -103091 10164 177368 -72010
15416 -107427 290609 243030 162465 -107973 314663 -5691 30 112039 -27720 129389 258939
15405 258939 101847 62743 57035 -14705 -229978 118411 146773 -320215 -304099 -63375 -404612
15394 -404612 -185578 -181582 -82913 31385 93857 52541 55564 -98395 -111758 -135454 -202492 39865
15381 -188858 159836 162175 189909 -143542 96184 64095 -7554 54151 -126335 51179 -153363
15369 110488 -57600 115486 214446 -164398 134977 376108 408187 -46600 -95363 171789
15358 29416 -281149 -162770 53855 134614 234896 -67397 395505 -191938 -111703 -9578 42854
15346 311784 74363 -226473 205280 70967 142905 63585 3504 378148 84689 -172265 597
15334 -65042 343447 289766 -124173 75092 193359 11257 416308 19304 -208591 -83167 85596
15322 101960 277024 161072 287128 -254464 93782 -119309 87429 139336 13079 -137221
15311 220085 -19609 225279 106362 -81766 100794 1292 -32627 108813 65228 37669 158055
15300 158055 -169087 185672 2267 164848 -13978 136693 388206 106175 7474 67050 115393
15289 115393 -11961 -165920 334773 187864 -103909 325833 -68095 -83626 -14159 275075
15278 -51073 57888 248516 -78175 310726 176431 -128022 406055 -121956 7161 -64261 266047
15266 -97061 -52013 7435 213463 -278486 115486 266556 202121 120180 344032 66406 26828
15254 139560 136180 343022 10611 413918 234750 671451 388840 -80424 257106 -38187
15243 -42709 44487 28295 298604 86949 -52206 -222413 112584 -144726 309332 463592
15233 463592 41326 -76541 306329 373980 243995 -380351 -19958 316303 74805 6558 -117844
15221 28289 179358 49027 338428 419615 86161 156790 -158123 230760 184435 112107 266065
15210 266065 104343 -47002 193517 230999 -24229 -196056 -43609 598467 -65718 -165829
15200 -165829 199584 -148505 70832 104185 69342 26133 170779 198409 124894 -62468 -18528
15188 206913 287741 64999 179061 38657 -203532 181870 401692 336603 40676 -108102
15177 14010 209624 -58253 10418 8191 -201424 153267 385 374652 365119 132632 -108469
15165 36873 -5593 178392 44852 -103793 277065 -63285 21291 -88705 485154 408679 32044
15153 429959 27299 50551 558432 -78843 231454 121634 326247 -72585 444886 103266
15142 38595 73526 -69208 245808 279532 227322 -31809 241370 60466 -167397 255748 -168607
15130 224605 188837 256699 -72374 -37425 219906 63644 97822 -109482 143477 11540 -42282
15118 42691 203455 126598 269253 329419 308913 451260 30289 279668 -66224 108791 -182554
15106 9059 396360 -21026 -428478 444556 -152153 100227 74877 383863 -97526 -11286 171968
15094 -87498 -55879 -286785 -38054 159446 423399 150444 36395 243503 227190 44262 -58574
15082 453137 376142 359016 40761 131899 227880 221263 93599 100636 128565 429132 -99768 82158
15069 106497 221404 440118 208350 469058 340245 470911 169021 -67165 179146 -26749
15058 -168730 149855 137028 131530 454672 229727 235914 260103 191363 255286 413270 67960
15046 21026 66271 172251 147515 372052 -105895 233986 325270 480973 250360 81503
15035 140477 33969 322873 133613 -126759 187389 121388 -94153 142778 279964 302501
15025 302501 85636 192872 59178 -99273 316813 184937 439467 73008 126140 269978
15015 269978 80103 490533 319292 355570 404076 518724 586769 -24527 126454 452663
15005 452663 441497 341812 90731 239330 332322 58412 197695 -170102 165641 295004
14995 295004 290144 401437 19764 40690 385851 280675 120217 2569 -40114 357570 451667
14984 451667 309974 164224 356757 177966 366340 187391 163115 158260 96954 -81351
14973 381885 173037 293211 115815 -11254 353011 -30623 229849 202387 256022 608769
14963 608769 -83675 527708 182997 182901 324618 167235 350067 343951 209424 420229 380620
14952 380620 449985 199037 22340 338090 462486 171798 382849 306193 563842 121621
14941 453733 375614 534380 215170 157321 266111 90538 435155 410804 337746 534266
14931 534266 389965 140826 231719 397305 297524 512895 289996 343673 444750 440028
14921 440028 388454 185497 -116762 482353 208590 629098 367252 616494 298052 274979
14911 274979 787471 260525 232575 501203 286140 220402 366512 433458 197697 819871
14901 819871 575229 489307 281254 194940 446699 507412 93526 376478 454507 392265 465191
14890 465191 363979 478703 397715 314234 298594 252180 547733 325679 449527 284640
14880 284640 286924 242352 233435 313225 403109 -93177 368706 512283 -138001 522700 356962
14869 356962 602221 394283 187366 457654 567782 708427 591509 409351 104382 732453
14859 732453 335944 306684 266161 586133 421643 581115 368285 221418 351065 618306
14849 618306 343837 682201 354585 572243 553658 348972 464835 444684 88771 635538
14839 635538 462052 498073 685513 288538 529188 189276 504328 378651 103024 528697
14829 528697 949259 459470 254462 743737 689495 261534 710948 302524 697887 576340
14819 576340 299803 666383 461815 585589 489562 500718 406603 778746 833671 482433
14809 482433 347944 805911 574603 748705 255848 588113 508545 800032 597673 530528
14799 530528 796429 496035 764459 375785 619921 461473 482131 599792 502102 386510
14789 386510 668617 602981 745922 552761 651740 687882 387697 672468 575826 447657
14779 447657 634492 614063 593985 601668 532947 607671 125451 935998 766184 433675 382219
14768 382219 611476 728263 847731 620493 682318 799199 419270 601281 646927 630638
14758 630638 771269 549938 677161 660813 536693 765118 741465 386499 902821 547207
14748 547207 515464 1037899 589850 484080 636149 841404 594929 821123 472796 1158063
14738 1158063 821923 723199 787292 905463 697256 810989 653584 1011727 608841 771718
14728 771718 823344 753869 999222 568476 865005 723033 814818 732682 956022 991365
14718 991365 878539 628870 421485 911924 776128 591685 828786 938705 863830 972484
14708 972484 794662 355203 896464 1036304 827804 904238 749291 946705 780719 1014541
14698 1014541 611972 627041 1191678 938935 727137 847123 1183557 616198 664256 1095322
14688 1095322 826404 896925 1123012 992350 1026248 1060260 1249593 727592 255974 952280
14678 952280 1292635 1154063 1326315 1051607 1109141 1132638 853584 842432 890226 971792
14668 971792 865273 1185195 882446 1177818 1350606 1179219 1101461 1062838 954268 1046450
14658 1046450 848042 1229469 1045991 923263 1257333 1392453 1200349 1285210 1484350 1471280
14648 1471280 1284261 1107686 1138524 1652268 1214510 1376692 1052856 1217453 1002211 1111833
14638 1111833 1170105 1366917 1024544 1464116 1454617 1691055 1604239 1297969 1571099 1022247
14628 1022247 1356179 1363152 1276336 1256749 1491209 1267917 1578876 1496152 1467602 1316310
14618 1316310 1310491 1333545 1733130 1280929 1423693 1444973 1476198 1108696 1564013 1567896 1706105
14607 1706105 1769199 1728475 1679121 2336938 1364410 1724137 1490773 1456774 1716214 1473768
14597 1473768 1683989 1521702 1603876 1854131 1539684 2000315 1827111 1704595 1995538 1958353
14587 1958353 1512567 2134086 1922983 2098290 1795096 2009509 2134260 1879693 1892866 2184765
14577 2184765 1935042 2179295 2058047 1953569 1866547 2297147 2216681 1716889 1906730 2301583
14567 2301583 2368440 2414960 2607930 2539357 2292280 2575033 2688324 2833175 2651576 2660416
14557 2660416 3037500 3193398 3373643 3693660 3861255 4288356 5013841 6608713 9115429
14548 9115429 12874424 21227199 34867426 35536820 21054416 10859566 6068408 4018730
14540 4018730 2840547 2434895 1973096 2377785 1939125 2012755 2062940 1926747 2166169 2599119
14530 2599119 2330563 2455169 2593330 2218715 2628379 2512630 2490529 2307901 2506625 2700291
14520 2700291 2360888 2958169 2876119 2557562 2523479 2688848 2882985 2721556 2618626 2933567
14510 2933567 3103994 3348479 3514208 3067003 3024601 3094450 2994455 3467390 3187459 3352288
14500 3352288 3456440 3327005 3282599 3493932 3321708 3523940 3422702 3456055 3669501 3471642
14490 3471642 3650317 3515567 3333411 3671726 3699591 3721361 3928766 3839845 3722521 3968596
14480 3968596 3982535 4141017 4135471 4015075 4181116 4058094 3944400 4217197 4657090 4310087
14470 4310087 4335564 4427720 4443393 4734393 4720534 4737973 4847902 4806791 4920067 4855759 4830426
14459 4830426 5047776 4995730 4888888 5174881 5077684 5354884 5295501 5457161 5487995 5385882
14449 5385882 5427268 5678146 5621105 5626883 5875211 5735427 5983256 5794219 6243820 5941860
14439 5941860 6491673 6176266 6627906 6597912 6884632 6787249 6811067 6944762 6875040 7186447
14429 7186447 7024403 7108698 7425413 7476294 7284313 7464577 7898032 8141415 8130315 8226273
14419 8226273 7871118 8480026 8303155 9037854 8833859 8917354 8923640 8768725 9129168 9314147
14409 9314147 9677397 9627280 9846411 9935978 9675949 10507335 10051243 10415786 10734813 10939458
14399 10939458 10812358 11364760 11531370 11461249 11385227 11961406 11921454 12461494 12686517 12518294
14389 12518294 13010994 13390783 13286532 13916608 13995330 13747597 14437386 14849901 15100464
14380 15100464 15015730 15673772 15777578 15968955 16349159 16569370 16848514 17433051 17556151
14371 17556151 17798466 18457475 18737729 18999411 19385617 19909648 20018662 20628237 21221018
14362 21221018 21722354 22229450 22566212 23072301 23473030 23957136 24342824 24973842 25680948
14353 25680948 26112426 26959352 27951249 28348677 29052478 29546478 30231564 31129710 31713636
14344 31713636 32680636 33733362 34505387 35497092 36166685 37624317 38756515 39486368 40680433
14335 40680433 41508973 42823558 44527041 45719935 47027084 48639743 49731166 51626515
14327 51626515 53210577 54769468 56389816 58652890 60813952 62592811 64594160 67198488
14319 67198488 69189141 71565104 74245796 77312695 79744803 83071743 86270423 89431582
14311 89431582 93196877 96776278 100669844 104775203 109013683 114084573 118898122 123914537
14303 123914537 129117776 135515415 141264536 148075354 154708529 161959639 169571891 177820792
14295 177820792 186407874 195145069 204969543 214800402 225442977 236243834 247868328
14288 247868328 259720559 272094345 284602139 297831419 311432583 324798961 338424513
14281 338424513 352316451 365502118 378673395 391115822 402611875 413326346 422443551
14274 422443551 429797097 434493266 436434004 437070381 436437868 435255731 434404947 431360300
14266 431360300 428379635 422641826 414326446 404128388 392564096 380076030 366332745
14259 366332745 352450396 338606371 324088693 310374894 296488206 283061621 270114593
14252 270114593 257351868 245216336 233771747 222763147 212037132 202012776 192352362
14245 192352362 183546624 175394854 167342024 159482591 152400150 145186316 139207830 133055498
14237 133055498 127633597 122159841 116862083 111924962 107447609 103244711 99447204 95467334
14229 95467334 91665818 88176185 84610417 81721851 78308923 75447172 72919523 70411366
14221 70411366 67976670 65505915 63623792 61578258 59506449 57431484 55672556 54286696
14213 54286696 52599587 51228703 49569065 47757373 46534219 45343596 44278486 43263088
14205 43263088 41583693 40632438 39271115 38414620 37522047 36826009 35716433 34349809 33617494
14196 33617494 32597771 31921947 31343652 30418102 29821023 29154943 28384344 27537960 26870077
14187 26870077 26270629 25920357 24986985 24676979 24058177 23448756 23286220 22818172 22235144
14178 22235144 21892621 21494783 21100674 20273753 20055351 19736838 19130340 18880415 18620357
14169 18620357 18286010 17793092 17626837 17255855 16881708 16659179 16165203 16007813 15544885
14160 15544885 15513069 15013428 14592044 14507376 14482429 14049504 14110420 13829637 13377205 13115215
14150 13115215 12940107 12616242 12677450 12452646 11787374 11962068 11529894 11671862 11447446
14141 11447446 11125865 10926786 11079682 10400034 10593477 10316336 10540731 9951736 10194044
14132 10194044 9591192 9464725 9220955 9512504 9201149 9184282 8997222 9190325 8660123
14123 8660123 8843804 8396732 8340848 8456980 8091818 8252892 8363883 8173158 7781413 7808516
14113 7808516 7607975 7498390 7641838 7713740 7252118 7167046 6862247 7139032 6901636 6877141
14103 6877141 6520649 6569958 6504928 6496956 6526553 6181297 6502975 6362738 5977157 6331298
14093 6331298 5860623 6053030 6214305 5570874 5421082 5673126 5495589 5654742 5501447
14084 5501447 5723466 5425032 5349905 5393293 5265903 5337692 4785232 4845140 4907987 4784491
14074 4784491 4963290 4672537 4744097 4687154 4661464 4500823 4648395 4481060 4750258 4426110
14064 4426110 4201575 4417842 4182867 3968707 4647986 4267893 4271162 4313333 3866613 4367667
14054 4367667 4019808 4184014 4074268 3828404 3703033 4032159 3706314 3640635 3580260 3543338
14044 3543338 3630298 3800424 3480882 3596013 3615293 3316493 3419858 3475416 3615041 3228752
14034 3228752 3505203 3296090 3090341 3359577 3382276 3255595 3241426 3024098 2995859 3228798
14024 3228798 2898695 2895864 3076910 3159466 3189207 2642596 2650030 2691601 2905383 2658758 2537291
14013 2537291 2778449 2729980 2587487 2612972 2507566 2336795 2451253 2365198 2196620 2392390
14003 2392390 2278409 1982632 2562382 2396693 2035339 2121875 2148159 2199664 2435027 2387677
13993 2387677 2440345 2659734 2489652 3173507 4639704 7772795 15300327 29539631 36700868
13984 36700868 26411874 16050825 10050594 6675168 5464080 4662482 4133210 3610559
13976 3610559 3487981 3300630 2898481 3165693 2882599 2930091 2855025 2666690 2541493 2541631
13966 2541631 2739269 2418894 2380789 2328099 2147300 2428910 2362988 2340487 2390290 2430671
13956 2430671 2302484 1997369 2333806 1815037 1979740 1852786 2247746 1970228 2108297
13947 2108297 1745944 2005780 2022632 1857103 1915033 1986989 1905380 1878365 1940446 2098871
13937 2098871 1809393 1638057 1967069 2043764 1727960 1744504 1589124 1926614 1574371 1806334
13927 1806334 1862397 2106129 1669387 1756656 1554888 1507162 2026985 1635965 1711176 1516327
13917 1516327 1504064 1759306 1481373 1440071 1808215 1573573 1407415 1402199 1692254 1728598
13907 1728598 1690316 1579546 1776604 1661217 1241492 1694784 1604670 1459748 1490607 1683501
13897 1683501 1402266 1249159 1430975 1580363 1485671 1255630 1390414 1313139 1430074 1422563
13887 1422563 1580185 1510202 1293539 1457196 1251433 1339379 1752606 1249362 1304990 1181741
13877 1181741 1204699 1602000 1397503 1201261 1455747 1496098 1366653 1028810 1018875 1253785
13867 1253785 1165288 1413848 942804 1314966 1625741 776033 1278487 1382526 1000552 1262494
13857 1262494 1180524 953530 1424720 1092599 1287886 1413183 1268487 1300276 1395959 1078229
13847 1078229 825276 1165877 1239275 843766 1006414 1023768 1142193 849281 1048538 1154074
13837 1154074 738061 930181 863897 820900 900418 877733 1315511 1065777 1120761 1027435
13827 1027435 871710 834370 955876 896419 888412 871264 815223 1038570 717697 1152143
13817 1152143 918535 845586 1009166 1125150 1084693 1153699 697752 969281 797723 855597
13807 855597 907084 860597 1025673 948388 1006869 845875 672387 989725 808139 1190625
13797 1190625 868718 972629 801303 913642 531874 656516 769396 774688 860789 756757
13787 756757 897021 811687 998972 626652 793356 895046 1086257 1262903 863814 862651
13777 862651 675604 902044 1012826 840927 661591 792538 823073 521251 940963 1139274
13767 1139274 932895 850997 740723 511016 549872 697494 882677 562878 772180 609914
13757 609914 685154 870379 663398 916266 413215 659840 563611 715029 681072 540416
13747 540416 729285 927016 398626 772130 834422 522890 644493 887555 728754 753580
13737 753580 564931 663774 621807 215432 562292 528211 627486 859455 652662 701832
13727 701832 418616 562628 525757 524140 692570 788725 741149 791858 570068 856114 441936
13716 441936 444429 599485 772951 451046 1153088 580955 685565 481502 963706 524428
13706 524428 361731 520046 640692 627019 650990 441856 546521 628044 802838 239563
13695 401629 629949 500364 536872 536055 914568 719610 416035 728669 653574 583748 486216
13684 486216 373453 604005 694695 277353 701166 779448 623829 442185 595926 421871
13674 421871 384675 473879 445871 573002 326752 358041 337026 555586 312604 516775
13664 516775 575099 549258 443402 394607 363311 260171 603787 197942 579241 600919
13654 600919 185205 611313 17612 553553 381838 573953 444663 343172 554558 299410
13644 299410 307664 429894 379200 393486 561269 559622 705255 596103 763863 608703 510962
13633 510962 205014 715101 353682 708557 497092 498683 331960 368550 278286 568572
13623 568572 485916 249691 551650 523397 382812 572900 503928 455855 571628 221364
13612 445668 252474 454202 222648 473913 322585 574134 584402 287970 563431 407417
13602 407417 272459 564910 479781 421536 185143 435850 370295 337223 267018 99435 372247
13591 372247 662612 645955 -39515 215342 455673 553751 521140 284428 213204 705505
13581 705505 453242 175622 602872 611164 508044 534402 271204 308614 379723 259780
13571 259780 163054 360785 452062 119957 684019 357934 367769 478671 24450 34816 394760
13560 394760 187426 170886 543012 557974 599480 313108 486396 547574 149284 252451
13550 252451 309561 157905 482604 598061 237393 395593 394005 277115 79082 250694
13540 250694 243323 -90135 471254 564892 365540 372038 208334 560887 132067 294939 556908
13529 556908 754730 191781 379337 291413 380689 303647 509820 291016 194232 585533
13519 585533 73574 271310 216500 127800 297773 544036 243690 383925 357432 87003
13508 490351 116334 528636 318400 412801 209827 212430 61061 247550 132998 591857
13498 591857 347758 368567 314691 613260 -49566 -75117 341481 470750 330612 211004
13488 211004 481846 111874 162082 381331 58181 291879 104150 410629 369279 393047
13478 393047 607210 453626 373917 57196 325603 -83244 269949 165248 219623 286314
13468 286314 190396 73178 143985 320580 164363 313234 202957 683006 318228 251534
13458 251534 65140 144356 214746 408570 182240 247371 34712 264998 8758 176168 347324
13447 347324 459309 112304 289882 244669 -176372 103305 340446 390199 103769 89883
13437 89883 335406 -17782 88534 3171 328126 -13893 149580 344561 -24048 223026 396323
13426 396323 232496 314286 542063 138652 171589 191612 68663 194199 428003 343487
13416 343487 -63734 84060 160200 412094 162470 66998 240190 260115 358802 143104 19729
13404 399947 252185 221659 291188 264168 363676 270904 386372 281801 179641 457350
13394 457350 119028 -24169 -15554 490847 515468 167375 563628 130091 -5747 210449 -45886
13382 112071 284118 104177 97082 313279 157160 160841 313906 395289 15922 272101 436668
13371 436668 222830 267728 572549 279545 359565 90898 62743 247204 188570 235716 141271
13360 141271 129605 106223 115165 305340 555933 28698 218309 97559 45179 134946 223421
13349 223421 293847 361668 239498 124990 48885 436525 134319 406166 203435 61341
13338 257436 237291 -31201 346488 -1366 -186908 258865 329660 138235 198816 212587 400321
13327 400321 -190991 370762 249724 316072 288737 -25749 238003 66829 233536 215716
13317 215716 177506 278061 298757 422853 228839 268973 366790 -4832 -134798 287242 235422
13306 235422 220840 232085 500340 271383 237301 -5335 104906 59684 -69583 -19668 -253738
13295 -253738 10075 -15069 195681 43696 135814 -38865 350606 216234 200172 309830 -12279
13283 301636 226898 236380 324178 201480 159382 63831 102440 228205 151549 293141 477022
13272 477022 154540 60951 72098 56977 -262690 -278788 363409 147878 268875 272225 26422
13260 353085 143781 83507 127231 -84618 23889 286248 230837 196387 2211 224251 513756
13249 513756 4183 167799 211457 280131 266098 451030 219385 159042 205669 -95409 79857
13237 117715 -58922 297967 -29088 231058 -552286 279046 156686 209011 236831 100027
13226 118808 157362 158480 -11279 24851 212004 197108 113098 -125315 -62837 553177 -153951
13214 232939 219649 420627 8434 16327 79103 234361 305900 -159601 331131 84190 58241
13203 58241 -69787 -166222 33992 -265870 -15280 152310 301364 121871 -227645 -29139 326023
13191 30640 309833 -50254 309994 235395 128097 46238 311083 257783 46565 68929 441124
13180 441124 -12086 1527 255187 363288 90264 122412 -157336 171683 248863 -123805 258142
13168 121191 164704 30735 64387 314752 168251 -50331 75877 -63510 -72678 156260 281119
13157 281119 294185 324413 340033 -58320 58088 125363 106980 270972 -33103 -29832 -180185
13146 -180185 354402 331941 112043 268471 -28101 -68645 287413 -111065 170067 149491
13136 149491 199461 310482 198945 71747 73735 188017 271164 149825 -6152 -42092 105898
13124 63747 73680 185548 156035 31365 103694 198832 200864 27572 178181 56354 215614
13113 215614 66568 110883 151514 -218534 -45006 371919 301983 -232079 -128140 149854
13102 78956 14674 320381 1737 277345 -49420 290 -31289 -140419 -319515 240163 21139
13090 198529 90728 143849 418304 216083 168469 551427 36717 -180906 -26604 379444
13079 233393 248329 23585 177592 -21206 217324 239399 61616 79278 75300 78745 477320
13068 477320 41809 -68395 456565 -168866 337133 302656 580822 55939 -8247 113828 -5012
13056 -32959 23421 118521 50947 145428 87859 61472 85058 435468 93442 130746 373321
13045 373321 -19611 217002 197112 408933 102306 92792 234688 88355 71573 185523 153722
13034 153722 161245 -25207 22393 512006 -152701 37841 439153 46913 463600 92809 -10423
13022 142512 174669 -99816 54128 238349 -90422 90766 -143818 161440 -250584 132773
13011 -159320 272657 182652 8533 -83305 113147 -123472 290805 -126585 50278 187044
13001 187044 362755 174360 -20196 11403 74873 -83350 51961 -18252 329087 249794 191973
12990 191973 100034 180566 266729 222909 186508 -79267 122965 53704 276760 188730 -10998
12978 241698 -79393 -11457 157782 -23253 422062 366272 -59126 154026 -80966 189641 -56161
12966 266470 227481 349194 201006 -24940 -166968 112088 -15642 18119 5986 -41806 -38333
12955 -38333 239643 184108 7042 46385 98058 161505 74142 -38937 -1835 89792 -48460 178385
12942 365490 -221966 81328 285629 19724 46371 1681 -173556 -257703 331418 -15815 -39948
12931 -39948 122268 -87484 103737 -211202 3195 53276 279615 540269 138628 -5546 231260
12919 359212 376274 -165468 348703 200954 -12389 38985 38998 -71407 42790 19518 30644
12908 30644 131542 116619 -106104 39146 139259 226779 155888 -110218 247612 -3616 68854
12896 354937 92113 96084 30810 -142813 -210018 -161916 -9957 320029 -46433 21618 -6665 -26572
12884 -26572 -283711 -105549 -128215 -338887 19732 -168557 86217 366630 104175 -39043
12873 176369 -209236 -258188 44578 79653 -106928 146669 -78955 69432 -26396 -220966 75846
12861 251765 12108 15090 -152663 205375 53445 225608 -198816 -155560 129382 334128
12851 334128 211630 22075 233372 -269148 225652 -33200 205745 -36875 224762 40785
12840 -31451 370019 27761 202396 45649 48223 -231953 72193 2596 -64266 -70552 40098 -80178
12827 16269 57974 -17004 240739 257720 82821 -26028 245140 156944 -107163 286619 5335
12815 214329 60431 -55794 9309 67441 182172 -40588 -55792 -38892 -158018 -122888 151028
12803 57396 51098 172465 198851 72726 96274 -231094 174722 -48664 178115 -82845 682
12791 -83706 285371 196104 168049 -259418 -168690 -219843 58955 -307742 -273604 -243189 75884
12779 17792 62907 123680 50578 219233 -93630 235434 -56008 114108 -328912 -126665 66657
12767 37435 -19183 31076 -60623 212906 157509 -363431 17462 -18627 -289171 -198336 246588
12755 127024 39019 -8912 29354 -178973 -19041 -282520 -98812 259658 63659 -13178 23654
12743 16832 176757 83263 -166573 -56927 3600 237919 40866 21711 273999 179321 68977
12731 59412 39511 -181057 13041 -30507 55970 -98804 -261705 219792 282109 -53968 -35629
12720 -35629 -25642 -60364 50411 -135992 -88345 -82439 362495 52924 -107044 345980 -85405
12708 229945 -96540 269815 538425 252807 235396 212259 -11604 391571 -106105 -58133
12698 -58133 175446 -295550 422011 -168667 179375 -91607 252961 128396 -213542 119474
12687 24820 -112247 -17788 38564 123294 156487 -161086 69202 444443 124508 -193510 42709
12675 236535 -214023 -215212 132866 -6298 -66831 -243498 17883 353785 184939 47003 60326
12664 60326 294152 19648 67703 113436 -550 178119 136853 -14595 118999 159206 169700
12653 169700 -69679 4934 79128 104856 227490 48749 -49832 186925 120360 348434 -4005
12641 145562 -196108 -45203 -94529 115827 78310 296846 -461 395602 -286027 275563 176002
12630 176002 236137 540549 295554 227088 203397 -129415 52665 43587 -87283 71112 -211387
12618 -99844 66768 109777 -29354 159960 55127 100394 60171 73839 39995 104395 57902
12607 57902 192531 86860 -112448 66045 -212052 64260 117133 66048 152939 381829 286004
12596 286004 303967 -181359 232342 105636 208582 -37509 -64848 65127 152685 -11687 -111363
12585 -111363 299729 -131765 -267422 195299 -168109 6388 27100 -143510 108987 -102748
12574 -72133 170259 -125900 -181871 188820 78318 -58777 404016 -148929 -96502 100270
12563 -70553 31633 151898 187244 -19143 9656 167972 147908 335787 -23021 21505 -144387
12551 -2071 -269674 294768 54392 20902 -167492 -76928 298117 -80947 135222 -3935 -190722
12540 -190722 29809 157122 -162218 -82865 175570 -281628 -266877 69024 38510 203012
12530 203012 -76120 319208 -144166 -75269 -125437 214107 369131 23250 -34252 169972
12519 -139535 -74301 368332 -41473 86524 253 29326 34164 185509 -7957 -5245 -110300 -216315
12507 -216315 80925 235390 -70396 47206 -71391 53038 10537 -191821 -35987 165504 16727
12495 -45440 41223 22251 262010 110782 -333328 165473 297104 187838 14779 -154874
12484 -312099 -254613 -28591 68388 191513 -35628 -85690 -116156 -165850 128860 -163584 -110149
12473 -110149 -158845 -140966 161626 -48048 -52576 -18014 -27568 144636 -125640 120715 158926
12462 158926 189556 62447 -63863 69594 9732 -54086 -14425 -193537 -108247 -273901 158558
12450 -262215 -77940 35139 -55031 -4646 49038 -166961 -51338 103244 61658 -156562 -168992
12439 -168992 -32902 36770 71648 -176806 5984 -56471 108140 -90325 -138359 11004 130496
12428 130496 266847 -116203 119920 -83159 -141785 -12938 85647 75734 -14487 37017 -242215
12416 274945 -209316 -48794 212448 30871 257023 232082 62203 299276 -197814 21235
12405 91557 -279116 -105120 -186494 11790 275880 18178 80898 -189433 -26349 147611 232496
12394 232496 -125456 -360234 -61070 246009 -130151 78935 309460 -66628 -100265 224694
12383 -21337 369196 -83526 -136148 146346 -327076 -81199 -56697 235974 110302 1184 -64791
12371 -167765 -24634 229657 -151413 156942 143174 -171059 -83111 -169639 -493775 -234112
12360 -146917 21974 -253007 -193296 -123453 43486 153478 86822 198110 131517 8481 147001
12349 147001 119170 -95954 8352 -242311 -70688 -247499 75077 66552 -125243 -99017 -192718
12338 -192718 196142 -243487 -4849 -55718 258463 -19223 55262 38754 -196984 -32532 -19149
12327 -19149 -185322 313122 -91566 215724 157599 388585 -186125 -19553 132064 76205
12317 76205 129686 -270561 -289003 -440430 99841 -51723 175289 221296 209933 -18557 91045
12305 -175941 53293 392074 116258 192032 -174769 220886 414522 -112492 15404 6194
12294 -20795 83304 270671 -243357 151703 -61434 -73447 243089 -151521 67001 36220 387816
12283 387816 -50545 19875 -243399 205047 82850 -82504 82179 14112 -50412 -62896 364619
12271 144155 -255237 98408 155442 208692 48263 -58762 60904 -172539 92647 -205982 -12929
12259 98210 147386 -56146 180126 549573 47980 -164205 -237864 242638 -119663 225064
12248 160758 9713 23249 -127422 -118922 108380 66508 147707 418084 43248 205728 381259
12237 381259 7504 56775 -36145 124085 -90212 71209 -133555 69582 65283 95215 279390
12226 279390 11381 144872 145224 270820 -40010 183457 -178009 263591 -254654 475620
12215 259036 18068 131003 117332 46983 207482 120522 -32463 -13924 34025 27795 422458
12204 422458 295431 13441 129443 -15599 31509 267924 315006 48667 256144 -103067
12193 179221 209456 -27599 529190 169733 83286 -107183 221037 12879 389006 296656
12183 296656 85724 -178469 -163083 79183 204149 262318 415984 -128122 176019 16107
12172 -86170 -74631 -39558 294195 27608 24341 -217447 114102 -76165 8040 -23558 267302
12160 -93463 -156362 -74386 148912 -109921 295343 34206 -45774 182511 90424 643875 -49773
12148 9015 129129 70550 -123148 26763 36835 -213553 154335 -140739 270906 -258295
12137 140372 98087 109059 -29688 -59346 -324963 -152180 69156 297417 -69912 53890 -129634
12125 -375723 197534 -113600 177188 -190576 -315879 -82511 -141075 17753 -194664 55611
12114 -29106 -11720 67080 -155757 410200 114025 -74221 -130167 -232795 -27888 -131472 110349
12102 -217373 -53263 77322 -126485 304886 -48651 76107 -92005 178770 188286 5287 466017
12091 466017 96854 -144412 -325892 238129 64679 -160354 -283594 -71824 107657 11167
12080 4476 458157 125230 -60697 -126731 -264201 53116 -182852 104927 -17256 742837 1075100
12069 1075100 1103795 343336 12031 -65031 -11724 -74844 -116760 -99358 248661 78717 13884
12057 -73450 -262405 -45865 -95321 -35676 -10567 -46822 -10848 -232039 95641 6063 146496
12046 146496 5982 98026 245789 45622 -177090 -4322 204027 -91116 -97042 -226355 41643
12034 64500 128282 102675 63707 -29324 30432 -152264 -79923 -123009 44428 -12974 84092
12022 -222412 191936 44014 109441 -50259 -236373 205536 3864 378362 -197204 19689 25315
12011 25315 -18070 47725 66291 -14489 -138606 -3658 -419807 -4554 240973 -113901 -40293
11999 -124356 4584 213769 -123754 98312 -324090 47866 126794 110261 -204045 60992 -197956
11987 -248540 245724 138977 -85063 10879 -119402 -55001 185000 25167 -54426 63717 25521
11975 59278 33923 -237088 64087 -2789 181174 113299 -41436 162658 -46681 181395 144596
11964 144596 -89871 54865 62101 254913 -385185 -86497 -117803 152508 -52101 359620 -286758
11952 71073 140880 348843 -374639 138254 91869 115971 179066 125880 50509 315304 -160428
11940 26591 28042 -166945 -157426 -74977 -159594 -111365 85801 17428 52982 -181802 129135
11928 385007 58922 6234 -124864 -21963 -138335 338904 -61447 -47495 -146205 57525 59738
11917 59738 76043 -117886 202308 -212578 -162423 10001 -42593 179860 -231301 49163 -71229
11905 -57283 224350 -81344 132778 172051 29870 -28712 -69487 -58859 108466 -184190 85824
11893 -219706 120161 -235279 51657 74951 104846 109162 30095 -120876 55858 -1316 3585
11881 -111340 -146121 287280 41894 41512 7213 203600 -230962 -46385 48195 -148492 -92138
11870 -92138 -99761 -35880 188916 -49338 -291119 -206092 -56880 -277576 35092 -28541 -321540
11859 -321540 -27305 346624 143619 -45534 19927 -66011 -54740 -127883 -136787 232269 75654
11847 -83803 -98507 -197992 -194478 -122402 61784 15772 -95722 -78095 -221750 7722 -19771 34283
11834 213647 -241088 148828 -234347 -44609 -118191 439082 -168393 -35544 -173558 -162394
11824 -162394 -166494 172533 94093 34851 -58267 -91045 155209 -196383 -145009 -20880 -107790
11813 -107790 96279 -106217 34577 124915 -159957 -210553 35685 -10393 126102 -41487 38407
11801 -187784 -96257 325057 -21739 -192704 -112751 -328462 -68456 -96943 199805 103452 58368
11790 58368 -173243 164906 -123718 243315 -100566 27115 129124 29993 147218 188152
11780 188152 -125430 -138516 -55319 78027 180855 183993 237807 -105691 -63834 -202033 -144085
11769 -144085 113884 231237 -220961 20884 -200955 -348227 261764 -196630 -405566 -169879
11758 -178874 -57348 -352948 58467 -4309 -250767 -256053 -191426 147090 122069 96313 76689
11747 76689 2322 17600 184349 -206322 -189975 -38684 -211067 113722 -233146 -317716 -136821
11735 -4788 127037 217921 -19731 36528 294167 -26426 -49585 9854 -122078 -110816 21998
11723 -77059 116738 -35858 148258 -21306 155102 243937 175299 -109975 89957 -38508 33258
11711 -13471 97679 15907 121228 -75938 -29608 -63981 202436 31208 -3344 -80671 128523
11699 -46315 31055 -293851 140076 57484 -108674 -292963 -38006 158849 19057 93568 139628
11688 139628 -120513 -116295 99768 15643 -242604 -4394 214986 59363 215387 -132782 114041
11676 -163444 -157373 -202359 54591 140603 -204196 -29714 230288 -21250 -43842 45590 -149655
11664 -96474 134654 296485 -415158 -161020 -237917 219518 -331476 -107321 -346811 169198
11653 -12398 -12749 -242352 -241200 22517 140023 -6762 24333 100722 -89310 34393 -232549 126557
11640 327953 -22539 -1012 275068 178283 -208519 -71302 -75504 -85173 102901 -385360 -81574
11628 40883 -238329 50450 18579 -30832 -109632 89416 -121068 199856 37521 -34104 -194368
11617 -194368 -12618 -30206 -149777 -151930 -30043 120947 67471 -139687 322037 112196 144998
11606 144998 250856 25845 173148 49643 151596 306996 228589 203684 2418 241197 27677
11594 -40426 64031 289912 -95781 -35843 -12121 -71958 30287 34965 -28882 200622 -76557
11582 -115830 -23766 -69898 -125 -78265 227039 -72266 36848 21990 -13821 253597 65681
11570 -181071 26311 59818 -251870 -47385 317916 126953 26276 -102583 149845 138403
11560 138403 66480 -193973 -208230 -21605 172701 140013 303849 -161359 -129421 238091
11549 212488 283979 183650 240640 -195939 -136731 -149064 -183089 111038 137131 10323 1903
11537 -117509 -156541 7813 -329855 -5548 -19603 -79247 550999 81499 -185387 -98577 2381
11525 4436 19979 49577 74815 87845 79953 149423 353380 328980 -193458 481013 34264
11513 -43365 133693 -37246 7119 306705 -39030 -90175 237404 -44925 89106 341033 179280
11502 179280 -19191 43267 -56205 58071 282191 -3015 222448 66508 90269 156850 261044
11491 261044 23100 386209 -75136 -10196 37183 65430 -4487 119170 122928 46829 -55069
11479 -314730 73755 -143294 348973 298801 334876 324251 -116829 128948 82071 -48374 194206
11467 360294 -25265 54544 85807 53211 -4796 24094 -66270 -120115 -109627 537066 153535
11455 -143218 -222892 152389 -307135 -190772 84395 -158741 -40197 180706 3906 -97230 156286
11443 57514 130478 179933 13589 -213315 -184828 480226 -228144 183385 -33658 220090 -40660
11431 135986 65124 -109254 45033 -281345 55549 -160059 -174052 -59285 53362 103488 -126073
11419 4417 -14978 186111 209182 197217 68595 -29157 63713 -86770 -119097 -233074 3997 -117474
11406 24021 -24166 -10699 354017 200816 95052 -66503 -109092 264861 273151 -152974 50881
11394 -359004 124966 -88300 -161385 -83941 -326982 -41062 42430 150463 -104389 131005
11383 93380 48307 -287679 -116918 -208820 252951 28981 60577 165731 149497 -37080 148049
11371 207528 164542 -80450 43810 -220023 -84293 -274283 146480 332235 -342816 112064
11360 -154448 -48338 16931 113602 -37597 -165677 -118069 -298813 24711 65507 190972 -155183
11348 -267909 167977 -210056 -30880 -217349 52963 26898 -204324 350032 -249474 -178660
11338 -178660 265242 -223295 -9023 -365185 -103382 160354 67386 30395 -30396 32964 230061
11327 230061 -96802 -7102 11548 -350365 104939 -974 129068 -56196 -125507 -70583 -187091
11316 -187091 99668 8304 145535 46151 217015 -143058 -357722 179494 153592 -51672 -116250
11305 -116250 -32918 -71235 157500 -300738 -60284 -33670 257471 -137126 -65249 -47944 -113470
11294 -113470 94462 213763 -156170 108231 -63550 -281501 45786 -127378 -109316 262748
11283 -119093 -55438 -233945 206003 86273 -2179 15627 203969 -25899 173737 -200527 166087
11271 -313621 236854 -284882 206796 -279631 -321 108845 -16171 -47004 -379935 -85757 1027
11259 64357 -171187 -238699 -163754 -91045 -80683 -196691 -356216 50123 254593 62813 -173610
11247 333121 -923 13129 -335429 190745 189348 -158939 -131959 15415 392589 188870 -441
11235 -6485 205431 -153736 -242767 97798 -39189 36396 -357369 -178785 -20669 -292431 -140676
11223 -110326 -128478 -183312 -14031 -287319 -47541 61558 -145999 258583 71140 178848 -350018
11211 -22564 134100 465957 -201168 116285 -350669 -306870 -203490 -21305 41429 227736
11201 227736 -31214 -29820 -39520 48304 8845 74049 -149012 73350 228977 62904 -101517
11189 -457870 183060 131109 -553613 89166 85977 -141793 62774 56444 82813 -81750 45235
11177 10795 121922 -80196 166390 -293294 -84571 32372 435832 -424012 -65018 -10471 189299
11165 -54410 -284458 -291989 191317 -209694 86211 -83649 20622 236148 -172412 -66021 117911
11153 -257786 37940 184695 -25168 366914 4642 277375 -162794 26983 30048 128100 149356
11142 149356 -49834 -247293 55368 330040 -166452 -77386 63776 -32192 285026 -122295
11131 151212 -69902 95847 22355 230941 319414 200713 -174681 -105290 -26471 7600 -134320
11119 63386 236309 11310 452692 38652 127073 52447 -105711 -20691 49043 -124985 -40528
11107 -128896 -253597 -277501 295036 264431 -107419 -91211 243889 -227170 247062 62577
11096 219135 -54630 46527 94099 327277 93793 197891 77229 405017 299690 -228929
11085 -42721 -146737 390931 87729 238364 -76901 139923 61439 114798 276952 90545 51458
11074 51458 278611 109211 111487 102493 297203 80194 262474 283230 255908 311375 788844
11063 788844 275153 410030 517379 289532 393836 705981 383257 681432 529885 519783
11053 519783 524816 559800 449819 601640 376013 567834 116961 559936 1097204 438362
11042 842381 662417 701953 887743 265737 470098 563462 594594 835671 705811 612805
11032 612805 505295 634841 429588 591236 487000 505575 441106 903983 638359 647035
11022 647035 528027 422092 635551 603668 857383 575533 337576 410469 534713 252872
11011 306823 550238 617737 462139 815721 209868 361066 611318 601118 412834 521932
11001 521932 776198 917728 499123 828949 656244 628260 560569 745612 518518 671355
10991 671355 890330 754821 718961 788047 546866 651738 736088 827439 910197 965528 861777
10980 861777 1022925 1386898 1331424 1830832 1752278 1798490 2247220 2034297 2117432 2553774
10970 2553774 2461237 2314954 1878149 1811311 1435965 1423483 1504441 957967 904433 1249530
10960 1249530 1176204 1013228 1070014 1030189 1072669 781849 765010 976678 770821 190077
10949 201689 982892 182386 172864 282678 233954 65240 80883 -95874 -252324 213031 84245
10937 273867 447476 65395 186307 330279 21759 -13505 -194332 127581 249390 106704
10926 38138 -39521 33279 -52064 202319 -48201 36328 -1513 -233374 -89640 -18435 192145
10914 242476 105891 93083 158057 34334 81496 189656 -238702 75469 68842 11631 -44978
10902 -88529 -349432 -30571 117947 -133216 39435 93292 -91559 -144036 -36759 202232 -267857
10890 -199129 216466 156638 -26424 111894 -145229 -50519 32252 333427 -341315 -237785
10880 -237785 -287662 -256105 -252569 -259724 -216831 -58138 -27651 -74177 3352 -32659 258094 -71010
10867 110209 82716 775 -36049 23501 -82000 -52189 131676 -20446 -312476 -141057 110394
10855 -27714 119923 233590 -131357 -326697 -5425 150617 -195825 -337555 6247 19325 72007
10844 72007 316872 -126902 104021 -16230 -375685 -43668 84987 -89531 62208 408874 188851
10832 199968 -286406 -36942 -187958 215748 -222349 -68820 -244764 -168916 13550 -307626
10821 84180 187480 157471 -61376 -220314 125058 -268804 -238737 258980 -220146 -256238
10811 -256238 244173 -339206 -137792 -245488 -244307 -208817 33258 -18164 172205 -352552
10800 -156923 108124 -29850 -82214 102689 230175 131283 -1783 135476 -39170 -223677 -314084
10789 -314084 -135825 -78184 -331073 29672 78979 -77407 375986 7506 56787 94637 195148
10778 195148 -160354 153148 -74044 -310058 -178746 229668 -25880 -79742 -15748 -116374
10768 -116374 -41242 122295 -84548 177443 -315727 -113941 119223 82450 -109967 -123472
10758 -123472 -98571 -255542 113130 98309 -314966 113710 -25942 -35153 12828 248968 -117026
10746 156094 305936 94573 -261050 -339986 91096 208982 -22833 -106569 -43265 328163 88881
10734 -139286 -22114 -126004 -170889 65523 327112 -3802 13815 81776 -241673 64011 -230050
10722 -56948 -40067 25418 -164893 -25752 -196116 -222590 -268918 131343 294633 24389 115172
10711 115172 -62716 -184813 -282947 174233 -87146 -85295 -351897 8405 -396056 -245710 -270978
10700 -270978 -305488 -26609 123760 -299591 -232062 -86903 180676 -256071 -247994 132713 -294589
10688 -358713 -134877 -151287 -121814 -208650 -32475 -159625 -178838 164297 -33686 529 -232901
10676 109751 -41148 86839 265529 -142895 -241140 -30585 -100402 293633 -308208 166426
10665 228579 -283740 188943 -59871 352237 134960 41006 -193746 -5439 -57335 -300464
10655 -300464 -22240 -90181 -5100 169977 -254015 -290519 124215 -269263 180854 -403733
10644 133024 130121 37588 54087 -28698 55696 226955 -241890 -316154 -1953 215621 -32800
10632 54565 -64635 -84963 -115324 -137845 3933 -514173 22056 102979 -349049 66028 -139969
10620 -540801 2963 -432129 260237 70604 -154242 -167557 267986 7187 -226681 228711 -148665
10608 -243758 57163 -47257 -47366 56361 56793 -29039 -35527 -92853 -123367 -225884 -177217 -108929
10596 -108929 61003 47202 -187850 -44688 -37236 -122084 -241762 -144556 39961 -19028 -195710
10585 -195710 42296 -211615 -285666 226426 172724 -142304 192370 -165314 -150467 -113461
10575 -113461 -162191 31042 -188713 102329 -259401 -203389 135753 -103373 -131489 8740 19439
10564 19439 -85043 -102444 3291 -248789 36163 68370 135480 -239817 14218 15588 -50360 -62592
10552 -62592 125828 -87598 -226787 397577 71820 190904 77992 225013 -104530 -55437
10542 -55437 -12330 270676 -45540 178210 -195550 -108165 118165 431188 -215603 57248
10531 -138219 -172118 444096 -208229 -288045 -37759 69908 -185733 -404915 -54264 46983 24831
10520 24831 99278 -34448 -236283 102477 -124017 97086 160253 -19546 -125644 32196 -72527
10508 -48356 -66158 -66096 -336419 112174 83380 -303503 -130549 -339444 -39366 220051 26839
10496 156331 -103934 -49816 120869 -112631 -115748 245498 16231 -319273 25871 -92912 307552
10484 155767 133715 310542 335574 237778 -112591 -472134 186874 -131403 -4290 -319935
10474 -319935 228400 -78160 -72575 15590 -227515 -92240 193834 -133012 -365796 246021
10463 247356 -100055 11 17414 -288616 -44214 -139751 -164571 -138941 -169536 -52887 54497 146470
10451 146470 260893 34836 -122978 163981 -320 197281 102075 -47770 202497 117261 -185243
10439 178837 54022 6554 -100713 -2083 95554 60547 -193861 -472402 -15626 109551 87540
10428 87540 -179687 -99606 16747 49137 -255596 88388 -208300 9851 -144778 138716 93716
10417 93716 153753 -101168 -374461 -54845 101199 154810 -232965 -136173 82609 -25992 -45406
10406 -45406 -61736 201940 -227321 -9546 -190388 155623 -102575 -88318 -281346 253787
10395 -260544 72144 76927 -18623 -25019 43338 -95578 2625 253712 403930 -8310 -28290 -63741
10383 -63741 -7637 42911 4626 56343 355403 213581 392186 396045 2757 413045 87042 -27256
10370 -5623 195482 301159 466257 326007 348405 407380 505191 178450 561340 185041
10359 184889 362542 11629 -40008 183216 187309 -128648 288272 237259 25199 494859 292039
10348 292039 500575 172445 61821 59374 244000 281997 471392 156418 48303 94321 187436
10337 187436 57628 -74236 359779 -314367 309473 -371763 -121514 474267 -207930 -158232
10327 -158232 167222 341829 5322 187376 27996 226210 -140463 207094 68455 108589
10317 108589 -8265 -67135 -147816 71152 -53224 266231 93565 -223252 -242975 122988 63708
10306 63708 102138 -300405 -107824 84537 -205687 -22852 231737 380625 266866 -152564
10295 -43687 44878 -133958 190320 -36073 -39789 59111 -130687 -149320 66614 -233721 -251061
10284 -251061 135465 -198364 -78582 187246 166017 98987 17717 44144 63547 -66618 89608
10272 -128768 -188247 205763 96761 183027 301687 -256434 -249151 24877 172036 191024 472390
10261 472390 134483 111248 77104 501371 190051 269945 186894 -167422 -253345 -30903 -86686
10250 -86686 156793 -94709 111764 167123 148333 -33253 -120232 -93886 -181315 56860 131511
10239 131511 -57337 -323944 -203461 293028 -373064 213722 301143 121361 -45923 86888
10228 -71111 -84146 16380 -87931 -200968 -163273 -51512 102171 42327 -256905 88136 -314347
10216 -122799 -118995 -140171 -149391 100846 -253219 -188585 -187190 -300172 -185413 131251 -42449
10204 137254 221624 -46344 48003 108701 44362 208473 62218 -140604 159455 -269901 -189750
10193 -189750 -188756 95617 67296 101544 -95891 -187262 -109889 251865 -208980 -265827 -81632
10181 -272090 -91192 -475304 65605 65450 49883 -182740 -293372 215069 -89150 273951 -520875
10169 83364 41468 -118436 -41718 -276408 -114544 -156336 121587 -1852 -146733 -4191 -348483
10158 -348483 -81672 -71860 -66735 69377 -221006 80030 -2812 -146183 66304 16510 -61784 -126478
10146 -126478 -118602 -221852 126184 294292 171428 -215736 -70826 -54037 -97533 -267335
10136 -267335 -78075 -237397 167597 41794 -123560 334000 -48198 -102335 -130223 -40146 -32318
10125 -32318 -115286 212128 -195331 -43950 142062 -227761 -112698 -39986 73148 -176864
10114 -508582 -102717 -340359 -12028 257841 72925 186186 50123 -354734 27412 67285
10104 67285 -195003 65608 -43494 -74009 42564 97617 2260 -94009 9398 431843 37562 87806
10092 87806 99072 -50502 -307512 -199663 109844 -218574 62222 -142071 -204039 -192955 -30460
10080 48799 -194645 63311 -209166 -166830 -90522 141871 -104967 -384801 175404 -230452
10069 -70065 262708 287055 76648 -119094 -108340 158677 -269624 -100609 -178274 23302 -143761
10057 -361881 -6675 -354889 174501 -97617 30235 -95269 -115260 179559 2770 -143422 -220547
10046 -220547 -501180 -27464 -244997 -309591 -61648 -21166 134899 -183735 -145655 23040 201351
10035 201351 -19022 112737 -271903 -71551 179767 330036 -69385 -238699 -20907 -71400
10025 -71400 -78422 -270862 602722 -139895 -423104 25358 532014 197164 23915 -101058
10014 -134625 47977 -4971 104371 -89043 256362 25226 212183 -305585 34644 -228949 -228129
10003 -228129 376478 -189900 -9438 -131551 -121781 -342478 -189133 1482 -94716 20896 -5581
9991 -165316 106398 97461 -55154 -63928 -73351 154095 85860 -181148 92164 59314 -53882 334
9978 36112 47853 -251781 -280767 -169469 -114384 -157801 112850 132732 -36185 -157752 -195579
9967 -195579 -338508 19252 -101176 -44128 290436 -79796 63917 128598 112033 -60557 196398
9955 43797 -114444 -62362 -303187 -218468 60328 113422 122526 -359212 66212 -275707 -289572
9944 -289572 12847 -325989 -134213 52031 -76748 -239489 24584 -227281 -134607 -123313 -30238
9932 8334 258725 -26768 -125449 -75208 -215447 -119802 248717 -381353 33996 -95385 -21335
9920 -101076 27480 227807 -32469 165608 255821 -82898 -225293 34725 87511 18993 96588
9909 96588 -63163 -127959 -205827 -135629 109001 -252689 -98532 -237316 -155815 -69716 -187513
9898 -187513 96401 -95997 -115327 -127700 50091 -91243 -58967 175429 29894 -19434 -175269
9887 -175269 104355 -33173 -79093 -14190 61517 -198532 -198436 -171066 -364923 -367576 160528 262760
9875 262760 -182100 16426 116475 -184270 -172119 -129120 -209717 -326213 -103205 -145779 -259374
9864 -259374 -143716 9430 -168030 -169707 -73048 -378967 215094 -76886 -266753 40831 -43017
9852 6505 -4772 112141 165455 -243581 -122141 195656 -25141 34632 -33761 -144364 -183134
9841 -183134 -293915 109581 55610 -112266 294936 40606 -69843 -51552 -241447 -151845 -12846
9829 -431322 68267 -110882 -223435 -191106 -89090 -138977 49780 211606 22095 -136639 -256622
9818 -256622 -112827 109955 196050 7232 -212808 -213913 7785 -107177 -59353 -208437 -225816
9807 -225816 101669 -225310 152084 -182456 -125686 -70740 86677 -268327 -73792 -152848 -103512
9796 -103512 32901 -42750 -126007 -20988 -221507 -280504 -249269 -4693 -47549 -14703 -102802 -82845
9784 -82845 42487 -244087 12143 6007 84552 -449104 -298510 -171679 61659 97896 -31555
9772 170087 -114711 146348 -197602 53652 -275520 195564 -206881 116697 257434 -236968
9761 -91182 -19965 65126 32534 -48647 -247048 -167048 -117856 -110026 78954 -370274 -33098 104398
9748 170161 6954 56797 -213968 86142 108091 9308 8289 -161785 -243216 -47164 -57038 13457
9735 78256 97873 250150 -318991 198864 -231964 -205090 -99837 85205 -66371 -216819 -38459
9723 -151503 -140534 190662 -276756 -59107 -82834 -3316 -173311 119365 -128178 -126100 -118783
9712 -118783 -38315 28681 27580 -444145 192941 -355319 126443 260385 21232 109390 -131521
9700 -268990 -7033 -122091 -130853 817 -65605 -23605 -257961 -133568 -157460 132199 -136999
9688 -209748 -39421 -184796 -65678 71757 -517682 -221528 -227775 -449051 -321381 68491 -434943
9676 -64905 -250804 -28226 17286 -8702 -201046 -40328 -69550 -170564 -136216 -179 -6476 -24456
9664 -24456 51723 32798 -480334 -171689 -155819 -187386 -119734 -225855 -52816 -150412 29580
9652 106939 320484 -13789 -78142 -8719 60187 7332 -162293 -297422 107477 -22112 -75467
9641 -75467 28434 -5036 -340783 -197065 -36673 446579 -134194 -64122 185827 -46126 -124113
9630 -124113 -170867 182196 -387859 168845 -41598 -392088 -23744 -57294 -14507 -30394 -208618
9619 -208618 -79433 -141344 -205397 -35212 78428 -154252 -132544 -63969 192739 147875 229346
9608 229346 169221 -193820 146548 156425 -20047 -3766 -78488 5031 18238 255220 -43042 -84843
9596 -84843 -86639 -88791 96308 89062 -158689 -59572 184632 8955 147221 -38893 -47220 -420513
9584 -420513 133 -292145 -62055 34181 72719 -149477 -250981 -28336 -205224 215867 172591
9573 172591 -124722 -17592 -164861 -187990 -201933 -319913 -179097 -144441 -339511 75770 85545
9562 85545 -250976 40632 -120050 112887 -166281 -2083 -387756 -62967 230948 -82709 150120
9550 -455306 -577718 -404671 80964 66967 -245361 -68670 -176142 -44665 -669845 117808
9539 95686 309863 -124734 -228183 226391 -224072 203254 -29495 -98167 -91643 -363341 270155
9527 -29349 73515 105883 -98327 -245032 192688 18071 -56364 -88077 159378 30499 -15358
9515 286150 -70873 54820 -388425 -128379 176594 275468 257453 -247780 14295 3461 31838
9504 31838 -129935 -201881 -211291 -223577 -41163 17900 156385 -269663 -172234 18167 67172
9493 67172 -75584 -303986 17770 -97350 -3425 -16332 275031 -19873 -253766 -170165 13665
9481 -222826 -120025 -398363 -278372 78172 -210661 -97470 -218785 113839 -73572 119252
9470 -288168 -57483 89485 278283 -128505 18790 -183099 -166623 -53267 -16122 -180148 -122485
9459 -122485 89285 -46649 -200113 -207126 -143874 -288133 -163583 -13482 -4657 -99494 245288
9447 -173227 -14296 119460 -109588 -287399 186124 -177035 -49610 1285 48955 -100058 -48149
9435 -246045 -343386 48965 37795 -262770 -120404 -351245 -282022 78926 -31199 -53512 21729
9423 219560 -58498 -196535 59481 117624 -177747 184811 50424 -182322 -187344 29872 -237898
9411 -391903 102646 -127274 -24041 35489 182710 43150 -59823 116290 69528 54562 -21919
9399 12574 88241 -145100 -109467 311898 -246757 -381519 -48162 -138674 -57818 40146 -45721
9387 4316 322726 -88716 -303391 -104943 -177760 249030 -391612 -20253 -96814 -188578 85579
9375 -292983 -251353 -240926 -117632 68540 186248 -101103 193265 125495 -111256 -106402 -135597
9364 -135597 -358833 -283083 -10710 -106335 -49469 -319073 -75311 75713 -129209 -245342 -125068
9353 -125068 -119668 -148535 -70189 263072 -157045 -8116 38587 -9179 -129173 -92535 -53756 -131086
9341 -131086 -257846 90658 13141 33789 206982 182138 -41653 64728 69586 -205612 -128429
9330 -128429 -68239 102318 -200983 -21553 -238367 -120556 326801 51636 -175632 155884
9319 55181 2439 -54842 42504 -281723 -194570 -16911 -281937 -46340 -88940 -77610 -141997 -184489
9307 -184489 -81566 -39360 256815 -99577 -151804 -58796 -43569 -112143 1976 -106276 -193281
9296 -193281 43003 -32143 -36017 90694 -84052 -107519 -142738 -72650 61255 11307 -265600 -70881
9283 -144327 186151 89684 4533 -91037 54175 -103327 67146 -137740 180250 -202102 -268280
9272 -268280 -26785 169660 -106659 -210237 -56125 -186819 554061 81228 -54067 26332 -78224
9260 -184575 -8315 -74499 -6430 -232893 -206037 54436 154539 -289720 -1064 -145802 -152281 -25513
9247 160716 -284258 -277864 129672 -163370 168965 -171332 63793 51357 -187286 31910 -94650
9235 157985 365652 24553 136254 172661 -38558 -10157 -74883 172802 -132955 146519 -6275
9223 -14750 -201835 -91399 -56794 -64216 -5131 -31126 269315 -23815 -96189 -56723 -93179 117661
9210 -152273 -183914 -161024 -572401 -36399 50280 -142464 142993 -13660 -23619 105444 -244897
9198 -7710 37243 -369134 -176564 -41443 -56457 -62934 122207 -46148 -339617 -112218 -80915
9187 -80915 151249 76946 -22542 -128937 19436 34435 127282 -143249 -328771 120031 127350
9176 127350 172771 116082 -150264 102831 -84717 -192750 237332 -161264 -337631 -288048
9166 -288048 -228447 -110959 73894 -63541 102315 -201504 -115451 321869 345605 172793 184455
9155 184455 -157770 46003 -221485 -259850 -49225 25083 -14344 -409949 220956 -173785 57324
9143 36034 -77429 80933 -364048 67724 -197096 -55287 274429 -238844 -39143 -184103 196409
9131 -12634 77305 66085 264411 -142446 228622 -297585 -131768 40079 -45355 56299 131375
9120 131375 -244874 -120624 55482 -100958 -27184 -105472 -275840 -74021 -167720 -29680 -156068
9109 -156068 -15902 -79167 -81558 -234999 204689 -83021 -201062 -1542 -7919 -257015 -325202
9098 -325202 279490 11775 232757 -49532 -38838 -70520 -175290 -251515 -154918 -125324 -11042
9086 -342921 -31977 -99892 -50370 -70468 99573 -202823 -91737 -113087 6838 296404 -87626
9074 74876 -105090 -96384 156114 108256 -32223 175514 -16911 -210383 178108 -87801 3863
9062 226498 -96631 -1361 107533 63394 -200132 -184346 92939 -169620 -135003 -476118 -199913
9050 47609 150039 -158146 18738 -55022 226673 256611 -340648 -317321 14065 -250043 -175199
9039 -175199 63662 -31446 -36965 -26202 -51640 -43266 -5343 40064 -106149 171094 239095 -200948
9026 -228705 225760 94666 233713 -62549 -260329 -138766 -271278 -48438 -646 -289940 -124293
9014 189513 -201585 -263545 -100156 -26555 68530 -185527 -7691 -138417 -109348 182774 -201239
9002 -170851 -66104 -365757 50991 -258101 68743 37614 74692 50099 149658 -356400 -15084
8990 -387872 -256301 22638 81445 -133987 -244986 -35929 211816 222930 -178313 341489
8979 157539 9865 95377 -73304 -92588 -187481 49651 116874 104755 -46490 -171671 -90156 -170194
8967 -170194 14692 133533 -274425 -214457 -517112 -174172 -135123 -302746 -320784 -311123 -221215
8956 -221215 11903 3315 160050 -191076 233944 149410 200898 -288336 50682 204738 -273794
8944 83495 -87167 67947 92531 -83498 -222632 201641 45481 -29939 -39455 116301 329343
8933 329343 33199 -154035 -183538 -554841 188921 342051 407431 279747 1271057 1994564
8923 1994564 4356797 13880087 15305955 6436407 2352426 1198007 356036 333494 310878
8914 310878 269922 -87662 -375558 101568 17296 408700 237084 337404 25005 75077 265907
8903 265907 -26664 -217701 41442 -201692 -33279 -206743 245200 266453 -66714 -118593 55135
8891 110154 -91244 94975 119759 248497 125006 245949 52780 -157764 -185279 -12444 -386025
8880 -386025 -227371 -177804 -65829 -101609 -301015 35936 -182391 130033 -104665 -125259 -271267
8869 -271267 92924 -92252 -430522 23227 -104369 144355 -49835 -200492 -157708 43903 -154125
8857 -73938 51520 -340991 -82723 -135628 -25818 -81590 -33801 -51575 -18875 80667 302632
8846 302632 65537 36935 90837 331073 -193960 27858 -74628 223738 -118155 53033 214494
8835 214494 -21933 -130604 246714 -143279 -140792 -129095 -423982 -271858 98048 -151778 -32591
8823 -294148 10817 16199 -52500 -102094 -333884 184220 -10553 -25833 213041 -129489 114342
8811 -296271 -7919 -74816 -206162 172224 88901 -171228 74199 49059 -41854 126061 -44560
8799 -172180 -305091 -209655 -335463 -146438 39818 179327 -225261 -142622 195455 150460
8789 150460 81381 -69498 -180128 29304 -122360 30217 -74881 -32037 14844 -310357 31678
8777 -331457 -49293 -269343 -149472 258888 -130395 -99778 80284 -88511 -183998 55466 150507
8766 150507 -59841 -115169 -149965 -205813 -53462 -287169 81302 65044 -97502 5916 72519 -101956
8753 19331 284381 -69460 -306177 68728 -253679 286978 -224930 75522 -125362 105252
8742 81572 -65185 -123067 -2854 224077 -15941 -131619 -297229 -63548 -5509 184891 -68900
8730 -40895 -35666 374559 27819 109592 -30433 -102676 -159991 -72724 52609 -322276 -64735 -201569
8718 -201569 163196 2287 -149713 -239209 -345455 -323186 23434 -174110 -3382 -259805 -93013
8706 283576 -51064 -130700 -11244 -51102 128509 -145948 -190488 -260034 -100737 86366 43878
8695 43878 -12516 -3975 -64837 -468287 71168 -6215 -264440 313161 96792 100723 -405275 27524
8682 42473 -171107 -388015 61105 -41174 5086 -540295 -118144 237717 138889 -122848 -93299
8671 -93299 -251305 -202002 193399 166140 -28599 -196017 63964 -38161 -202872 108430 -222291
8659 143888 122064 -103777 -9237 97975 -140261 -13974 128037 -45937 -174258 200927 48589
8647 -556038 -117819 -178419 -296223 218365 -189220 -143841 9292 -371253 10746 256955 90567
8635 197725 287948 -9616 177603 -303787 -69593 -271 -313915 -200192 -39189 294862 219144
8624 219144 229332 20190 -253790 -22105 124005 53644 36503 -276278 -45123 -134635 -215507
8613 -215507 -299093 -21440 58872 -160906 -341670 22110 -122852 -201913 -108560 60872 -107921
8601 50318 -101672 -65457 -84076 -310192 -172729 -145993 -91698 -10271 329613 -167464 -68903
8589 74613 151983 33655 355806 -135198 291833 -49382 -318797 22981 -161764 -25149 132455
8577 -143841 -81566 -218536 -223631 -71653 -316133 82950 -139106 25865 -94390 220894 263909
8566 263909 -154698 304192 -128718 300399 -109277 -51838 118876 -36177 135303 5978
8555 16609 -134632 -9063 184415 -322012 96382 164273 78966 -383342 -233751 -110724 -236752
8544 -236752 -97262 -111575 -280652 -93667 -57271 146320 -43361 121569 -283299 -128227 -1170
8532 -182502 164338 -155633 -226007 -15395 -236928 -179025 -78268 -11219 -212263 -85522 -101218
8521 -101218 -324459 112603 236635 -103186 -326528 5382 -269774 -98621 -655349 -113967
8510 145735 48981 179368 -56657 -256855 -8046 143684 106258 -208034 171234 161836 -22957
8498 144102 -117830 -143210 -96987 -18653 105558 -86752 -89042 -220246 -5458 -26861 76668
8486 38571 -154076 -188347 -192804 404840 190361 18624 -145716 -174158 303679 -252897 159572
8474 139509 -96002 69077 -112510 -392386 -175057 17659 -294478 -47819 67676 104992 185745
8463 185745 148676 -71149 334294 -40164 59329 -74025 -465918 -112283 -131406 224544 -104537
8451 268984 -142582 -137361 -230405 -101091 -214231 46109 -100834 73504 75055 -218363 -242296
8440 -242296 -212901 -179412 -524 -137549 282861 -239489 -52796 -208088 236234 149919 205467
8429 205467 -118763 360705 -54654 -111912 -282322 281832 -277978 -122321 -110549 -38961
8418 -203190 76590 -69053 -145385 -41073 -350495 -31226 72078 218444 -176350 159110 -17210
8406 38479 -117128 -70576 146846 -48691 -18207 -181350 -72362 212213 -380802 184231 190906
8395 190906 -88609 192659 25580 41324 136383 -223899 -222323 222057 386925 -118498 27398
8383 89567 -102234 74430 84205 -328278 -219147 113924 -439722 173025 -82497 -112489 -89152
8372 -89152 59685 244321 -29809 -163744 237369 254081 -103007 -183411 -5292 67360 -60219
8360 -235768 472178 128022 -28525 -350353 -217221 6378 105928 -202015 488782 97478 -85187
8348 93977 -165439 292020 -168615 194033 -158560 -242690 141981 43825 -297123 -352341
8338 -352341 161560 120627 -20449 74 -20580 242941 -59002 -45779 256384 -290076 122475
8326 172304 -10082 -186942 -52656 -161724 -188116 -121781 198804 -174916 236327 -542366
8315 -260052 -117668 143241 34776 -147600 13881 -105445 -182368 157927 59922 -35106 -196315
8304 -196315 -184342 -69677 -279179 23933 -20883 1485 -107587 -165775 48164 16970 188522
8293 188522 154086 -212101 -89913 -72152 174292 -133871 -198182 -109491 -192352 30077 -79207
8281 81393 -56029 -80668 -70089 -320456 66807 -1782 119606 60535 41735 224976 112651
8270 112651 35220 -51499 -182947 -180500 -173739 -7422 142892 213037 198270 -69903 -113718 -156742
8258 -156742 -323222 -93945 -112184 -180304 -143476 -173315 -31362 -36493 -443083 176443 -155600
8246 -84790 -97126 -131002 113700 -243091 28323 225671 -114935 -29737 382575 96214 -151470
8234 -382338 -180444 -82248 136680 -9424 -84697 -121109 -181314 29465 141209 -201976 100098
8222 166364 -285023 140310 132659 -71847 -340566 342417 -173215 -32327 -119791 300879 253442
8211 253442 291837 -314297 132170 170415 -159447 -340043 10165 178131 -62011 -230400
8201 -230400 -110930 1664 322245 -4191 -5194 -139018 105313 145180 -133722 53507 -7954
8189 -353461 -38333 -412110 148787 -436247 -142172 89354 -125157 14787 -97411 267590
8178 -65088 -40163 164745 -29099 -268349 -239267 243158 51036 -182120 38933 71844 328475
8167 328475 4144 -220650 -126027 -136118 -129219 12266 -203869 382921 -60915 -15870 -374112
8156 -374112 22480 35442 -2 -42404 103837 -202883 -185762 -254568 -251072 -104262 -27926 115195
8143 157118 -260221 -91428 -159887 -394634 95949 -251745 -183604 -38283 184459 -77040 -236431
8132 -236431 -388759 -96630 -156182 67547 188908 157560 192130 50050 -162289 48583 137448
8121 137448 -298904 197443 -92230 52919 13864 52678 115562 14662 64791 1147 -73690
8109 195212 -102397 -186464 -53696 182630 -8516 -58701 -28558 -68974 60990 -361379 57850
8097 165089 -31443 -121698 -107521 69681 216597 -69600 128655 -46922 -78681 58383 -268246
8085 168849 2986 -40326 -5938 30792 -80538 7852 96474 -500422 54488 138360 79850 -298855
8072 -107736 -229055 -234303 -184216 -92857 -201137 -25821 -59910 18442 70687 -145786 -126582
8061 -126582 -7822 183547 47113 238250 331025 -19470 86869 -78392 21245 -73426 -90324
8050 -90324 -36768 111618 332552 99140 -212058 -273986 28999 -65163 -169911 -59466 304602
8038 -87097 -18902 -215284 391284 -389880 133686 54853 33008 268656 85490 254595 162775
8027 162775 -147995 -52273 -170985 -288449 160433 -203577 -211387 -48773 48204 -240084 287636
8015 -78021 25463 -24415 -63830 -56495 -63238 -265799 78082 262591 223339 162638 270551 -85648
8002 83863 170588 389144 178725 -471256 24481 367552 -50057 35815 -134883 -160677 -27419
7990 -26969 -341290 37927 6893 9270 -317589 -147244 -211055 304854 190433 -52019 1518
7978 246959 37927 -121731 -30375 297151 113620 421808 108645 -25802 310116 -6936 171833
7966 -143410 -125720 -134701 27766 61957 -46346 -5543 -344076 -109802 99148 -162454 -235119
7955 -235119 -192623 -209939 -124256 -273732 -90502 22039 -26279 -234217 13394 -57947 -321263
7944 -321263 -246664 124564 -68386 -45545 138693 -130834 156837 23791 -164913 -192381 100107
7932 -135650 -62263 -17873 -171248 -63082 85346 -49993 421226 237448 -87963 112077 -65744
7920 -114576 -158130 -154980 134756 -118981 -257618 -165138 -23969 65960 -112595 -29470 -98694
7909 -98694 -62949 -276724 95952 22724 470729 -45380 12072 2426 132401 -47281 206919
7897 85421 -21282 -118983 -12849 249134 -185943 -63037 -62738 -45055 33584 11282 -171731 189658
7884 -132088 16375 74566 -18060 -107857 -242466 -208646 42105 265657 -65134 178191 -183737
7872 -85455 61976 -308739 -546224 -168455 -5901 -52030 416869 -305018 -13324 97651 137526
7861 137526 167144 -175338 -29085 -169199 -108159 186938 17632 -307740 27448 36434 -175467
7849 47717 -90021 -258236 7290 1009 -128526 -31883 -38651 -243809 -272895 125116 -105487
7837 209423 -25355 -204158 108390 -97799 310088 -181300 17984 -62710 104658 -88328 56511
7825 111878 4574 -311747 81594 187764 -72002 -375659 192440 -117472 171964 -97864 192981
7813 126146 -170295 -11937 60996 124899 -59410 -493296 123684 56913 -83271 415 86260
7802 86260 -85218 -30626 -16552 165224 906 186919 257891 -49160 -15610 -85818 -240981 155153
7789 -235216 -81278 -13265 -70709 -158678 -267087 -55247 -97583 -12991 77000 -202267 -105299
7778 -105299 -175506 15853 39912 -10752 66957 233750 -200895 222337 41758 116798 -115676
7766 -238175 -124165 -192187 218057 60261 -46081 71031 -104979 44915 227964 214814 7090
7754 140832 -109326 -306164 -109191 208949 -256010 -184499 -126577 -46992 -96156 241223
7743 43633 76976 66982 48504 135949 -141650 -16971 3930 152154 125777 186574 150685 -86587
7730 -38440 -74230 -78452 -261652 -220216 -236704 -159372 -208442 -14017 49872 228329 110763
7718 -559804 167354 40196 -44988 46504 52830 40867 -72759 -155706 154943 -113870 -59764
7707 -59764 8267 -328057 21891 -155041 211229 75641 -187828 35979 -297601 -206944 -123168
7696 -123168 115699 9377 -159628 -226638 -16451 -324126 145937 -51282 140060 178661 102108
7685 102108 53963 -105172 -109389 -126640 19585 -92091 -5093 264274 -94009 93768 153734 -101331
7672 117680 214675 49172 -226404 179018 11504 -464355 393849 30981 -174134 84257 -129808
7660 100953 113163 -40875 -196234 -190570 108583 26701 22562 20075 31122 -148776 -51141 -310087
7648 -310087 -190064 9302 -11881 -172471 -116040 -100563 -28194 -76270 103608 215614 -127160
7636 26109 -47715 25899 289652 -315905 -27357 123304 -148909 14232 -50947 98263 -23576
7624 135170 -349248 -157226 -4305 -61945 111063 159061 68638 -359697 -164671 -386633 17776
7612 -207670 -140374 112288 161707 -264327 -4459 -302992 -117432 -49283 -149830 159935 -105133
7600 59343 36258 -206863 -109147 -81228 -226631 -7311 41049 -68460 -94848 68385 -186577
7588 150505 216112 -252513 251618 35475 -262498 264325 -198909 105631 48621 383438
7578 383438 -13912 -322590 -68892 -370267 -70406 17342 -59798 34410 -119936 -37354 -184793
7567 -184793 -37931 -38056 17052 234693 -299234 279332 -126177 87395 -324359 -75176 -132380
7556 -132380 168541 -12229 -236588 -185650 89153 -204667 69312 208489 -386692 386102
7545 -235221 114446 -210205 260430 -241644 2370 -399951 23723 -112960 -101122 -222794
7535 -222794 -205286 -190836 -20365 156442 261986 20696 -130800 -226851 -60344 -44541 4418
7523 -188423 -238248 151779 114225 -125487 273205 76868 305286 -119754 -268264 46501
7512 -191980 -73558 -71586 -247913 92143 -57548 -166572 -198794 105186 27363 276169 -188333
7500 -5672 -314747 -157368 -96892 -285236 -520225 225695 -77401 -8205 -103725 -32057 99198
7488 177106 -132441 -225135 -107744 231321 37843 -198701 -164320 -255038 -248597 91941 15880
7476 -252893 194099 129174 301182 -178606 -228034 -416714 40964 -79500 -121751 -103697 -223078
7465 -223078 -61809 6550 160387 10990 32784 -164225 -444118 -35215 77226 84126 101648
7454 101648 -62757 -365422 107435 -312063 225158 -26772 -381761 188991 342897 -338129
7443 -162324 -20263 -155041 -92768 183124 107737 -81924 3501 148904 -201348 59290 261941
7432 261941 11831 -18934 -18101 39550 -88275 96067 132680 -303292 -288028 -196202 5767 -59362
7419 -108733 -66960 67018 118597 209749 139098 -200834 274247 205379 147279 120508 172133
7408 172133 63687 243378 27788 -65470 -80113 228376 -107639 110314 157366 -241009 182164
7396 -111541 -192386 150602 390103 190255 123353 -20686 173584 140430 121906 16260 -171772
7384 -277095 -170816 47621 -38751 51685 -438073 18864 -133922 -84472 212055 397580 160797
7372 198946 72999 35373 -254706 37964 210335 -77788 -41900 -422511 -161353 438524 -150824
7360 -147977 -212605 -120950 -242573 172194 116914 139961 -436129 -75210 -228288 -22817 -235846
7349 -235846 188885 -120101 454932 84097 280327 -67404 136303 97811 -72142 266960
7338 98399 -58864 176993 -53249 -183000 -20375 -554880 -43274 -248029 153924 69075 -159781
7326 148064 121403 -240689 267736 152025 247710 -145052 127915 33626 -16805 165340
7315 -117129 -123522 48017 27328 19716 129845 83007 78512 148049 -118474 52620 -264563 -204984
7303 -204984 -392083 89725 -116908 -264353 -80279 -98949 -173590 80024 -5216 -224747 117977
7291 66103 -72122 -446035 210496 208495 -213322 170972 123149 3368 -95108 -203424 -89808
7279 10015 -108782 -143400 69384 107197 234196 -218038 -211360 -64710 -80859 4996 -155581
7267 -152921 5530 -186191 121485 175407 117801 -250762 -184881 -12987 -107978 194345 155367
7256 155367 7643 147800 -122077 -35618 152180 -297180 252575 -301577 -184276 -59484
7245 80385 105491 223539 148253 -4291 -5634 78560 -155168 -21017 47447 162238 120176 162924
7233 162924 -20066 -143380 67839 370859 184754 -338782 147513 228925 -74397 63792 -132497
7221 -412598 -93712 7942 -71046 -366610 -152176 4377 -396515 -121043 64411 -255932 -38829
7209 -186186 -372542 73314 117000 119931 286769 -140942 -334628 -356983 73302 -37940 241246
7197 -168466 -121814 -398550 350593 128548 28159 -305655 183343 -213649 393070 36283
7186 -54776 87126 70531 95315 -170960 -34270 -105259 -83524 12347 -144853 146489 43602
7174 -486950 115715 47705 -206327 188679 -119026 -182081 476565 -331868 -205820 -179098
7164 -179098 -50516 -36144 -120085 -212567 33607 55978 -177761 122756 265818 -271640 -94541
7152 -350542 -123251 44710 132319 -183394 -54973 -19617 32084 112341 -93580 -11378 -59628
7141 -59628 -13906 -211108 -112380 92276 -349380 90796 -144724 -182526 -34101 -181649 53015
7129 577300 6844 -85822 68528 -205268 -104420 19074 -39333 97483 -81418 -4856 215408
7117 21291 93549 -229855 -54751 220944 -183844 -118747 59884 -82654 247628 -51747 -32804
7106 -32804 72611 -20822 109727 -209812 33066 -94481 100953 -103214 108743 362833 65357
7094 68880 43881 -116145 -11936 -108160 -174540 -293178 -247366 -157594 93270 191368 40210
7082 7624 157145 181281 -215001 -196261 218738 69845 81977 -192708 55058 205482 -189501
7070 -141327 -66561 -312073 -117897 -101218 -252772 -178789 -56483 -127190 -193499 211926 -341063
7058 235262 47493 97995 -102675 -481355 240726 -83437 174001 209152 -200964 -136574 94733
7046 -250456 66969 96303 8074 55924 191200 -203394 -99178 -5077 -177959 4154 -116508
7034 -39695 64662 15202 50836 -341616 -109897 -358135 -238681 -140607 25004 238687 -126024
7022 -363146 60569 185189 -194233 137386 214591 147448 -19565 -72912 161982 -101243 143437
7010 -49513 -82132 167115 142955 -387966 104894 -137364 -55073 249220 -126006 -42023 -343956
6999 -343956 -548215 9100 -26340 -397798 -341682 81030 53995 101192 114638 -113762 68024
6987 185286 85945 -22747 122714 46193 121428 179880 -201249 -273911 -470472 -152293 3957
6975 262504 194637 -4288 172899 29853 152366 71263 -235518 -297030 65344 135173 121471
6964 121471 -62404 43497 -138603 312171 59635 234669 207824 -241596 -283895 83908 -27944
6952 58298 -49311 83090 116067 -31670 -258309 294225 -95226 -142935 -277017 144981 -327260
6940 -257533 -68544 -136839 254927 62765 73871 68436 91420 199293 -48912 -30747 -67069
6929 -67069 -267494 -22427 -263058 -111339 -447616 39475 -313992 54399 -182071 10109 -371833
6917 -120470 90528 -11647 95909 44729 -66531 -4002 222436 296874 -144974 -19930 -87306
6906 -87306 -105422 -37417 49459 -19236 -119233 84958 -120112 -404768 329226 -461739 98114
6894 -17552 61896 244954 -126537 167215 -102908 54244 12034 -3436 144750 46732 -155901
6882 88305 -217764 -52256 168858 -196098 153651 -255403 -33766 -151179 -136394 -51188 129895
6870 -259511 226154 241065 11666 189905 239836 -75684 -69003 -108490 124324 -156454 344293
6858 -180802 212189 -293981 -105517 -36211 165900 44012 252997 3024 -16851 7861 -158643
6846 -299132 -173787 153501 151374 44253 43588 -44892 24372 -105594 196947 179928 176637 -146683
6833 -341358 8964 71883 -74113 -33060 10298 -45632 55923 -20039 34525 -153090 189320
6821 -233224 -194490 -80167 70391 -152184 278915 183156 -200438 -140459 27453 -15391 -263860
6810 -263860 -139846 -133473 81863 246072 2202 -248928 123328 191636 -29067 131538 55135
6798 -84771 -105579 22792 327175 52436 15135 -185287 -87552 24596 126720 -224919 257901
6786 -102525 -282708 90230 9313 146441 141081 -19046 -97695 -82493 -72858 236355 95016 25822
6773 -171967 -160951 -28112 98873 134285 35925 143033 -56750 -43595 -46607 -30769 94831 -333942
6760 81886 140168 -35636 -432981 -32882 129691 169379 68247 -340688 -116237 -87984 221095
6748 107596 161172 6119 -93942 42924 251325 -63523 74386 -175519 -130677 -396564 -55395
6736 -117072 -32418 286534 -121559 285923 169172 -147155 438020 186123 -42219 148569
6725 257353 24688 -116299 -443792 -346881 -60235 -85161 -276802 346273 358123 117663 -190008
6713 22659 -225912 -73849 123961 101802 22013 -113587 -135719 238937 88355 83403 202866
6702 202866 -164318 -109200 -70479 83058 -49345 -86076 -33885 114779 -235603 -270617 -52576
6690 67297 -25139 24249 -300948 -357930 113062 42131 -181651 51984 46179 151315 335360
6679 335360 -442222 241640 -1290 -27109 -88687 -90708 72074 133517 -176851 -64006 210267
6667 210609 162042 148880 -350265 -213623 -336491 -37568 -172770 129626 117623 -108469
6656 -40461 -164086 37740 278529 45305 29385 206274 71857 -383454 146514 -323597 -16061
6644 -97874 -94845 65348 -43409 82359 145098 204917 -87875 90834 -178709 381853 -226275
6632 -239369 -233885 -227122 -148043 291084 107631 161697 262322 169578 106563 97392 165153 25791
6619 34247 -235445 -33553 168160 -66889 1217 253101 -77140 53020 84307 -129179 -198572
6608 -198572 -94981 -17115 -65084 -432420 -231956 -234957 -57445 -221982 86552 -27077 -225805
6597 -225805 45505 -890 -11882 -12359 -87723 346164 113374 -86650 305052 -42736 -159651 13317
6584 1300 -392253 40110 -129376 -47491 177723 -60084 -78153 -138998 62774 13473 -44617
6572 -256007 -324018 -191324 101315 44738 -136462 43418 162192 121526 -185281 -67047 83882
6560 109194 -82010 235822 119733 45651 -55973 99714 33717 -349068 -265088 207281 250117
6549 250117 288103 -163310 152709 -157287 -236105 -202867 234487 22154 -180076 -223283 -49375
6537 -212063 90585 -121681 -86125 213414 206096 205931 -273414 -202027 -22918 -126516 -87219
6526 -87219 100788 -161069 -77558 -16011 -109687 154090 -329453 55927 -33992 -33110 -211823
6515 -211823 555711 147058 -2910 187196 -227546 -49356 78278 4164 -58633 91774 11469
6503 194461 120879 188973 15156 -224260 -107103 68398 -99299 166079 -539342 -181423 147805
6491 -102772 -329635 -218763 211163 -227315 67123 -28414 182470 80007 38428 144588
6481 144588 316495 69564 1668 338807 144790 125370 173522 -38416 -41058 -160232 -70362
6469 -118063 -213440 71344 -10821 313 -254653 -82414 -32255 -208051 107022 -7847 -71020 39770
6456 158447 55376 32232 60002 -243389 -2347 106390 105612 94552 -118086 -25253 8267 120176
6444 120176 -257570 -139145 144030 -65750 202801 153461 211478 -155156 -38926 52678 15065
6432 -462238 -269175 280224 -118494 -91371 -97135 -353699 181700 -71089 41081 -69504 11379
6420 149616 183132 -247577 -102881 -424824 -314652 54993 -216645 258192 139158 -211547
6409 9118 75209 -43079 5995 245811 -3802 259006 154843 3797 -146082 -110984 43231 -179899
6396 342408 -241789 -123446 -109213 -10377 105749 205700 326171 -185806 94642 85577 -143749
6384 -314320 -184727 135268 70957 -217811 -113638 197660 290408 -32215 27899 -123540
6373 -132016 -91099 -64361 28079 189119 -230257 49109 -130873 -29348 -173246 235557 101671
6361 184243 530889 -31347 84879 -223055 -19484 370739 -163624 83784 94121 -213012 -6130
6349 201753 -346646 59618 -117998 -106001 279531 -182397 -129435 199316 105793 373277
6339 373277 -80051 107314 -375585 -360334 -186537 -320460 -288874 249920 -105386 -76692
6329 -76692 -65327 -90589 -338364 -140104 -264225 -265732 -318173 161604 206314 -145221 -83115
6318 -83115 -381473 204539 -192851 81051 -74807 164445 -15489 -151886 269742 80357 -192327
6306 54591 299005 321389 -101188 158326 -345695 -200123 -36876 152845 120587 52157 68797
6295 68797 -135016 390017 13287 58048 -115143 116951 -62938 -10647 -111339 211669 110540
6284 110540 -99942 -133192 92611 -35841 34093 -35589 40825 156941 -107557 266163 73897
6272 -58006 -83443 115455 207947 145502 170034 240153 -63061 -157326 199101 178679 -67519
6260 -88258 -395589 -392573 112168 -54699 -260414 -160277 -46056 273985 32269 58550 244960
6249 244960 92624 144298 66590 164653 252366 -190585 1041 -2094 -283727 240604 -368740
6237 200671 294112 -270760 402860 -153360 153086 -10042 135121 386519 -271744 88265
6226 135159 -45819 -73222 2732 -94977 -109850 68044 -10442 -52995 316567 -75350 74949 246851
6214 246851 44674 31418 113115 90078 -189223 -139855 69289 154090 -329349 171608 46592
6202 7970 -158063 -36379 20292 -213005 -191463 -140826 158655 -138684 -39848 -109885 223696
6190 -198062 -155519 542243 -31273 -215632 -170992 -40175 258241 -47238 -141516 -251739 -265652
6179 -265652 183644 -466022 -144780 -182236 228322 82184 101809 135290 212603 137946 243221
6168 243221 195488 172879 -415564 -10050 259240 -290585 25190 44939 44079 -202197 -9817
6156 7981 -112421 234010 198542 289294 213831 -89350 -112130 182157 13045 -595246 256361
6144 37121 37522 -21185 -202560 157398 -267436 -44192 97194 -22926 85534 -51130 27789 78144
6132 78144 -38070 -94815 -124838 5505 73108 -13393 -26902 23729 -40355 -68761 88679 -28183
6119 -261002 136637 43658 9113 230454 10434 -122429 131894 -12171 -232294 69295 51201
6108 51201 -30521 37355 150013 254664 235553 4932 -131607 -144878 -135437 -265882 -56710
6096 -182119 80824 -227890 -96412 -26037 -34598 54496 -94793 -104855 89873 -44649 -268611
6085 -268611 162171 185932 180491 6589 -39266 -104138 -117149 -31216 49678 190136 -200960
6073 -99112 -173336 12555 54964 247694 147501 170379 -331816 341370 -334211 151229 -128431
6061 -47573 -81645 -331089 147972 -397942 70427 -62582 -122996 199973 -41132 -209554 -18971
6049 186497 150353 192537 289174 -81152 -12009 245615 126223 67255 -116373 -61926 -59566
6038 -59566 -28281 237735 58690 -78485 154143 157299 129781 -75437 -178600 -126100 220478
6026 103295 208928 263886 25764 86185 228449 120016 -49744 279294 -49342 203566 -136018
6014 190798 380984 -198478 287111 170788 11893 -48808 -67815 -115407 65554 -148414 -36656
6002 68322 92969 324098 119184 -27556 203631 -167639 87169 122390 -3295 -116754 29520
5990 8339 -334852 -254128 122011 101155 57628 122140 121127 -214799 -303636 -88405 -277290
5979 -277290 97765 74023 74959 238835 -74984 126853 -125460 112804 -50573 92065 52560
5968 52560 -51003 -19941 -83851 228600 -55233 -114679 -49957 81809 77079 120554 -99288 121056
5955 -92240 -206278 2664 84956 -87752 -205545 -28531 -219520 81360 -213032 227759 -44006
5943 -82225 38381 -74723 148170 -694 -307319 22097 -147838 16272 155101 -124000 308644
5931 -316060 -102214 118568 14928 -209002 26418 43622 363508 -59509 -100072 319894 190836
5920 190836 292257 -173962 -246201 345 102104 73826 -136107 4220 -37704 183684 -45852
5908 19805 -315440 306140 8235 -76501 -67610 -185601 -128114 123821 -154927 -58594 150690
5896 -130280 57683 -177465 -44413 298202 323409 185184 143968 114286 -132293 -3567 24962
5884 -4149 -36823 -72663 17914 25200 144666 205207 -253695 104474 -166208 175241 -148661
5872 43599 -102687 16732 -115452 72096 168640 82195 77730 178316 -14486 -8769 -375106
5861 -375106 -440448 49730 102315 -172638 -273539 214787 -214668 -301562 55362 -160550 -173963
5850 -173963 96662 -142384 55180 -92733 -12907 55915 43370 170867 -121950 -57581 317293
5838 -112349 194334 -185524 -97897 110751 21277 184128 115419 132117 407336 91198 -27601
5826 -97160 35298 30934 -252903 -41450 85464 -99168 -43386 25334 -116645 126853 142281
5815 142281 76449 321463 135515 -293977 20775 95296 25468 -135065 37281 -24621 60055
5803 -154574 179380 91198 29434 -25519 -70136 -156545 -199460 122446 -123197 98130 43744
5791 182127 225230 169818 207150 -181808 -133393 50214 70003 -355331 -241191 -188051 171375
5779 72442 -380477 418545 -345109 75511 -40199 -80899 43136 139991 -4339 55481 42320
5768 42320 -70856 -341593 -150815 18624 69648 -223853 -177310 -209016 -46578 180100 -205234
5756 463285 56658 270299 -123848 49823 -139301 2857 -282728 -143185 43090 19140 51791
5745 51791 -68381 -131142 -234331 139769 106921 197179 -69781 46363 -45025 -210438 190147
5733 280184 -155994 -86862 -101703 45206 -193018 139097 81641 -168484 -107577 88241 217004
5722 217004 183074 -211398 847 213010 4865 136553 -518703 -220929 41110 270868 -230465
5710 137258 -235104 348543 153569 46245 132382 181205 -51919 -269785 35658 -68478 -121166
5699 -121166 100575 -254445 -181601 207362 14375 -7815 146553 -115130 -115762 84494 93408
5688 93408 -19782 569 294558 -362526 142224 -261600 361559 67574 -200578 202364 -3015
5676 143758 -1339 -45560 -269645 56399 -122813 212139 263026 156518 -173567 -316446 96028
5664 -139283 142253 -25666 -26817 128702 -277087 276547 209527 -246008 150034 -257077
5653 -132335 -336842 -217802 128190 35195 -146493 13939 250276 46539 -198802 -68394
5642 -68196 173298 102791 -80906 61424 -14700 -196450 -289443 -191267 -153848 -119421 26188
5630 145402 166405 -69699 -130302 -12796 -2524 -33900 -23004 -102323 -56530 445510 -321025
5618 3247 264208 11365 -142605 -195718 7216 149565 -95546 -464456 -127259 -48612 -383202
5607 -383202 -211037 -162578 -109595 -190644 180382 -143115 -69446 197618 -152305 -69738 247838
5595 -240426 -156175 17718 79503 -385924 -109970 -53305 51906 94923 8219 59615 24488
5583 -25851 17504 -139114 -227884 -183540 157808 192106 -19250 -66537 289334 -184789 -132357
5572 -132357 -9266 5465 113377 100934 -44745 222228 117180 228527 34968 -22260 105125
5560 211684 158884 103496 -12818 24251 -143240 -104196 -51715 2039 -123562 893 -26632 224070
5547 87995 -178531 -111643 -37554 -120838 -17698 146448 -127878 64704 152797 -59877 -275048
5536 -275048 -218615 -127371 47448 212535 -126249 199583 -29408 216669 454574 231108
5526 231108 106328 -223367 -62194 356513 -119642 -203636 16866 217166 -223738 63453
5515 326769 143302 24654 -191982 75493 158325 -4139 -50739 -229494 -98418 -192841 -44491
5503 69002 -296039 84439 -70667 -17381 -150044 -56588 -180481 111214 -2782 -137400 44726
5491 -123139 196227 -79171 70867 57832 31211 -47921 201783 -98088 46370 -144280 108364
5479 -243764 -124669 -28899 -95888 -147111 126938 -434904 -264043 -28334 -310426 -98508 -347760
5468 -347760 79738 -229674 169339 -229582 399083 -17271 -74739 -300940 44849 -154661
5457 -10774 16209 449136 284252 -170597 21761 -190552 -104647 -60302 53085 -78849 -212554
5446 -212554 121450 159482 146368 -317888 -76004 -46848 14930 -58376 -154486 -164776 271932
5434 171222 -95864 86 355004 97606 74657 31410 3565 -468627 201003 149298 -107954 36727
5421 161899 404433 93431 -142294 145357 45308 336188 296109 -106842 -187518 -423037
5411 -423037 49650 -298916 48495 114906 383728 -121319 180551 317328 6593 -25626 7715
5399 74418 -54798 93455 -472179 -310293 65103 -24556 188368 -69676 -45941 77615 154355
5388 154355 170170 224316 -102613 -142901 -161684 -9780 -345810 83231 172382 -71335 392669
5376 204527 102431 207312 137534 213356 -73217 91401 63397 -80387 260994 -148121 -57263
5364 -191221 353901 -3888 -158446 -153901 -55675 -196448 -121240 44051 -83948 85014 -321111
5352 135650 190155 221285 111479 11338 -154841 -174273 161015 216035 -29098 76457 224634
5341 224634 -236594 120848 -173 -71327 137655 31059 119260 -191633 -149629 277224 -112822
5329 -104780 -35761 -348899 -177288 -120714 234362 -324682 -114271 -10850 98630 600004
5319 600004 -236561 -296166 -52167 50699 22116 -43773 388402 -37556 99087 -172879 449303
5307 -142502 -129529 -48189 61042 208192 123387 231874 271274 -13874 -6223 79549 67675
5296 67675 216294 -368380 -13692 51481 78551 -19768 202407 142111 40442 144254 1430
5284 4107 32514 50029 -94345 73172 321920 -11780 -43084 157852 304338 56772 2701 194653
5272 194653 -231898 -141896 -156589 109284 118344 133689 15922 -190095 82720 54388 -134163
5260 62546 -43377 -195036 193946 177818 110126 -205489 73107 -50112 42641 122126 71520
5249 71520 206393 -38706 -50927 -41988 161455 326819 -46299 -119169 88802 -131538 552333
5237 -269157 377062 89157 80368 260511 179006 -111722 -40139 285715 97387 -101032 -193814
5226 -193814 -19149 -27541 -182666 202037 -121119 -446331 34347 203198 165415 97488 -37428
5214 -265468 66374 107749 -106177 215181 -108855 -24913 3698 150506 118714 25017 -72572
5202 116546 21931 157792 84658 -156553 79862 -160740 -332054 351977 389589 10226 75190
5191 75190 56811 -138545 -238690 -303900 237294 -131392 -223371 128114 -21564 -347774 67705
5179 -121192 235035 -23767 -191977 3336 -38134 -78983 -68266 27884 170049 361137 85337
5167 23034 75548 -130668 -139676 -235575 7340 43016 -20038 107993 207942 150840 -246715 191779
5154 -135313 233145 -140282 -138603 -164296 174716 54317 -31896 -187491 51089 -18318 23564
5142 -15866 61724 -12961 277617 212278 97936 158656 123463 105203 -1434 -257473 313147
5130 82104 -58854 -15504 -58625 -4836 -230331 186618 256292 -161063 63702 45164 192933
5119 192933 -3935 170112 -229959 239635 90969 -210364 -352861 -314219 -38176 -243715 123633
5107 74756 -32017 222930 -71228 88286 -164642 210054 -281731 -81973 150121 276755 470843
5096 470843 44131 297517 57845 416017 -128913 -128886 149143 -206406 281306 36871 125639
5085 125639 294569 37465 170139 43419 -29321 -94658 -29011 59237 -153962 -66769 -75081
5074 -75081 47210 56160 83247 -196872 19371 207189 -43525 -68462 15333 -23526 -168482
5063 -168482 210911 -154863 -27644 -108112 99777 130723 22588 -152405 -112618 -122794 5792
5051 -41249 -185828 -48427 -237004 90438 303105 -113963 -112364 209924 -275968 -115625 -135702
5040 -135702 140779 48881 350877 -14019 84872 272765 -49254 417134 -90621 87970 1778
5028 -242274 -73769 -151970 375428 -54718 68213 -140065 -184997 -318341 155766 305 -9425
5016 145847 264642 3143 4359 -94167 158009 -163167 -343408 99150 89563 -179312 -32665
5004 59095 215831 -98107 -96979 -336320 273045 -159080 306417 -115091 45799 -108639 359599
4992 -343902 -505250 13895 220226 -65360 29993 -16369 134980 164245 18580 -3159 -126730
4981 -126730 148576 315331 -110651 -136242 21576 -61392 -128179 -155199 148981 -193178 -271155
4970 -271155 73430 224751 -16984 107683 -16643 41054 71553 99182 -79833 14832 -36209
4958 224949 -427048 -142676 4457 -23071 -312068 -95560 156630 -1477 -223848 -123707 -204732
4947 -204732 169157 -196734 25106 271887 191660 2345 26165 -41704 177492 196578 -68684
4935 433175 66013 68587 -91031 17565 128616 -360234 -93166 285175 193657 -266201 -96096
4923 752 244560 43355 93690 105994 -206188 70470 100988 -149437 -185130 305692 -48696
4911 283162 -7755 -13314 113457 -98569 134176 24994 378732 -47757 77522 315197 -62654
4899 31274 -32475 296041 -196765 327619 -141076 273822 -183441 191418 79314 10267
4888 -86350 282717 -90559 -130762 -157187 27091 39551 169431 -69640 -242235 37297 -153657
4876 35092 27987 -122894 -142617 204166 68133 325017 -158017 73332 115700 41720 -28705
4864 28078 159370 -16736 -31475 46131 -110722 157578 -290501 20267 114970 136633 171391
4853 171391 -161998 23696 223401 -124653 11947 218481 -187598 134162 5278 189850
4843 189850 -164154 46883 235140 -138610 222941 -186604 259985 158154 -91125 -31163
4832 -107368 -31180 -188512 45776 -212377 -129744 100002 394589 83504 136391 -271719 174892
4820 37253 58167 -121872 69995 -69414 -52907 -194446 -67912 176525 140305 46618 -401691
4808 227254 -32267 62120 20353 -64736 -241163 52738 -22451 -93250 -191102 -94964 -279038
4797 -279038 -231475 -143494 -9815 -195293 -23358 348496 358947 188735 -96626 -119903 307843
4785 -36215 -118216 226992 -44304 -79121 62370 -169126 10596 414082 -65999 6132 103639
4774 103639 -79343 294525 74386 59463 56106 -145154 -127742 -26886 -330049 -59809 -43888
4763 -43888 -95175 -128623 22531 113301 49468 -115672 60035 93062 6602 17447 -118251 -80043
4751 -80043 -109861 -154680 236268 62357 86583 73934 -236580 -187990 -21148 154003 -84701
4739 12415 -160808 135828 200533 35921 211970 -20413 108495 -38490 69506 -188372 -182548
4728 -182548 -246869 61506 -126388 -113143 87806 -203290 47691 30021 87883 163863 -68389
4716 -23347 23796 109109 10725 -53813 -52541 15266 69334 -225154 -160657 -17269 -54463 116785
4703 119512 -106687 69114 -103759 -167570 100994 300639 84865 52366 -4108 95917 126598
4692 126598 -314061 160053 100037 159310 20425 -199184 100950 191167 104073 -104032 9212
4680 135592 -147848 222402 -317124 -121594 -110192 327239 61955 338368 236037 94705
4669 -22169 -28179 86930 218546 29891 81797 208236 -104566 358366 -80488 -168881 -79371
4657 91305 209571 -200143 30892 -468019 -93690 236845 338223 306390 118921 20879 151553
4646 151553 271575 193577 -111582 70299 113598 47683 54062 -60423 -25256 77907 -95036
4634 -119732 40400 -94358 -41945 293087 101492 -3830 -69287 -30009 196209 166578 227099
4623 227099 -19499 -119175 -130256 44710 -124014 134896 27798 -105992 -113183 169900 -26140
4611 63359 -33317 17947 -201585 131885 -183229 -226823 -129893 -195686 3859 46404 -284318
4599 20318 207172 -118466 -94542 -44975 -136662 27447 -289533 86303 8062 -157263 15886
4587 -96481 318670 -3295 306942 14424 -26357 206626 -71840 -225671 -190347 48780 -201801
4575 14340 75310 494692 -265615 -53382 -26510 -36260 -23535 -56110 -56738 -86209 95465 226676
4563 226676 25251 104661 -300133 126242 -43222 255524 -85776 -53892 -92499 -46150 -109453
4552 -109453 103961 390710 78352 -28877 -316562 9243 100709 -57801 57254 -121650 -145713
4541 -145713 -205174 -190255 33511 -9370 75819 -98481 127515 -111393 -246511 -215710 238932
4529 -70198 153420 173138 112508 -16724 -135275 -149180 21199 -238088 -161856 -59151 -236473
4518 -236473 -128266 134702 87942 54106 -174917 -78688 -45455 175308 46609 49374 -23353
4506 336286 241495 78739 120212 -240200 40513 -179443 70055 -1478 127197 49454 76878
$$ [...]
##END NTUPLES=NMR SPECTRUM
##END=
