##TITLE=AC1470_13FE002652_8026926_Jl8XaGtRlM
##JCAMPDX= 6.0         $$ Bruker NMR JCAMP-DX V2.0
##DATA TYPE= NMR SPECTRUM
##DATA CLASS= NTUPLES
##ORIGIN= BRUKER
##OWNER= Administrator
$$ 1.72 TOPSPIN		Version 2.1
$$ 2013-07-18 16:59:00.079 -0700  Administrator@X
$$ Compression mode = diff/dup
##.OBSERVE FREQUENCY= 400.02188249412
##.OBSERVE NUCLEUS= ^1H
##.ACQUISITION MODE= SIMULTANEOUS (DQD)
##.ACQUISITION SCHEME= undefined
##.AVERAGES= 64
##.DIGITISER RES= 22
##SPECTROMETER/DATA SYSTEM= spect
##.PULSE SEQUENCE= noesygpps1d.comp
##.SOLVENT NAME= COFFEE_meoh
##.SHIFT REFERENCE= INTERNAL, COFFEE_meoh, 1, 14.96098
##AUDIT TRAIL= $$ (NUMBER, WHEN, WHO, WHERE, PROCESS, VERSION, WHAT)
$$ ##TITLE= Audit trail, TOPSPIN		Version 2.1
$$ ##JCAMPDX= 5.01
$$ ##ORIGIN= Bruker BioSpin GmbH
$$ ##OWNER= Administrator
$$ $$ E:\/data/COFFEE/nmr/AC1470_13FE002652_8026926_Jl8XaGtRlM/22/pdata/1/auditp.txt
$$ ##AUDIT TRAIL=  $$ (NUMBER, WHEN, WHO, WHERE, PROCESS, VERSION, WHAT)
(   1,<2013-07-18 16:58:55.251 -0700>,<Administrator>,<X>,<go>,<TOPSPIN 2.1>,
      <created by zg
	started at 2013-07-18 16:47:24.813 -0700,
	POWCHK enabled, PULCHK disabled,
       configuration hash MD5:
       C8 4E 4E 5D D3 5C D8 9E 9F 52 82 E0 59 8A DE 15
       data hash MD5: 64K
       B9 1A D3 F8 BA 0D EB 24 EE AF AB D3 78 2E A4 6E>)
(   2,<2013-07-18 16:58:58.141 -0700>,<Administrator>,<X>,<proc1d>,<TOPSPIN 2.1>,
      <Start of raw data processing
       efp LB = 0.3 FT_mod = 6 PKNL = 1 PHC0 = 0 PHC1 = 0 SI = 128K 
       data hash MD5: 128K
       01 E1 C1 2F 46 DC 39 E2 CD 2C 85 C3 44 60 3C 6F>)
(   3,<2013-07-18 16:58:59.079 -0700>,<Administrator>,<X>,<proc1d>,<TOPSPIN 2.1>,
      <pk PHC0 = -80.12329 PHC1 = 0 
       data hash MD5: 128K
       4A 70 AD 3E EE C1 AF 56 1B DA 7D 2E 1F B5 16 D5>)
(   4,<2013-07-18 16:58:59.469 -0700>,<Administrator>,<X>,<proc1d>,<TOPSPIN 2.1>,
      <abs ABSG = 1 
       data hash MD5: 128K
       64 0B BA 7C 3E 37 03 4F 49 E3 4B 77 E1 B0 27 1A>)
(   5,<2013-07-18 16:58:59.579 -0700>,<Administrator>,<X>,<proc1d>,<TOPSPIN 2.1>,
      <abs ABSG = 2 
       data hash MD5: 128K
       DB 70 E7 B7 C1 D9 48 FA B1 0A 69 13 C6 7A 35 04>)
(   6,<2013-07-18 16:58:59.688 -0700>,<Administrator>,<X>,<proc1d>,<TOPSPIN 2.1>,
      <abs ABSG = 3 
       data hash MD5: 128K
       D2 06 D7 35 0F D3 FA 21 6F 92 1B FA 67 B0 FA 29>)
(   7,<2013-07-18 16:58:59.782 -0700>,<Administrator>,<X>,<proc1d>,<TOPSPIN 2.1>,
      <abs ABSG = 4 
       data hash MD5: 128K
       B4 6E C8 23 BA 2C 9C 33 1D F8 69 D2 1C B5 FA 3D>)
(   8,<2013-07-18 16:58:59.876 -0700>,<Administrator>,<X>,<proc1d>,<TOPSPIN 2.1>,
      <abs ABSG = 5 
       data hash MD5: 128K
       0C 3B 27 DB 6D 5D CD 93 7A A9 CA 4D C5 62 05 97>)
$$ ##END=
$$ 
$$ $$ hash MD5
$$ $$ 53 09 AF 3E F6 59 08 15 9C C4 31 6F F4 D9 A8 EC
##$RELAX= 
##$RELAX= 
##$RELAX= 
##$RELAX= 
##$RELAX= 
##$RELAX= 
##$RELAX= 
##$RELAX= 
$$ Bruker specific parameters
$$ --------------------------
##$DU= <E:\>
##$EXPNO= 22
$$ [...]
##$TP07= 0
##$TPNAME0= <>
##$TPNAME1= <>
##$TPNAME2= <>
##$TPNAME3= <>
##$TPNAME4= <>
##$TPNAME5= <>
##$TPNAME6= <>
##$TPNAME7= <>
##$TPOAL= (0..7)
0.5 0.5 0.5 0.5 0.5 0.5 0.5 0.5
##$TPOFFS= (0..7)
0 0 0 0 0 0 0 0
##$TUNHIN= 0
##$TUNHOUT= 0
##$TUNXOUT= 0
##$USERA1= <user>
##$USERA2= <user>
##$USERA3= <user>
##$USERA4= <user>
##$USERA5= <user>
##$V9= 5
##$VALIST= <valist>
##$VCLIST= <CCCCCCCCCCCCCCC>
##$VD= 0
##$VDLIST= <DDDDDDDDDDDDDDD>
##$VPLIST= <PPPPPPPPPPPPPPP>
##$VTLIST= <TTTTTTTTTTTTTTT>
##$WBST= 1024
##$WBSW= 4
##$XGAIN= (0..3)
0 0 0 0
##$XL= 0
##$YL= 0
##$YMAX_a= 5999783
##$YMIN_a= -12017128
##$ZGOPTNS= <>
##$ZL1= 120
##$ZL2= 120
##$ZL3= 120
##$ZL4= 120
##$ABSF1= 14.96098
##$ABSF2= -5.597201
##$ABSG= 5
##$ABSL= 3
##$ALPHA= 0
##$AQORDER= 0
##$ASSFAC= 0
##$ASSFACI= 0
##$ASSFACX= 0
##$ASSWID= 0
##$AUNMP= <proc_prof1d_extract.lims>
##$AXLEFT= 0
##$AXNAME= <>
##$AXNUC= <1H>
##$AXRIGHT= 0
##$AXTYPE= 0
##$AXUNIT= <>
##$AZFE= 0.1
##$AZFW= 0.1
##$BCFW= 0
##$BC_mod= 0
##$BYTORDP= 0
##$COROFFS= 0
##$CY= 15
##$DATMOD= 1
##$DC= 0
##$DFILT= <>
##$DTYPP= 0
##$F1P= 0
##$F2P= 0
##$FCOR= 0.5
##$FTSIZE= 131072
##$FT_mod= 6
##$GAMMA= 0
##$GB= 0
##$INTBC= 1
##$INTSCL= 1
##$ISEN= 128
##$LB= 0.3
##$LEV0= 0
##$LPBIN= 0
##$MAXI= 10000
##$MC2= 0
##$MEAN= 0
##$ME_mod= 0
##$MI= 0
##$NCOEF= 0
##$NC_proc= -2
##$NLEV= 6
##$NOISF1= 0
##$NOISF2= 0
##$NSP= 0
##$NTH_PI= 0
##$NZP= 0
##$OFFSET= 14.96098
##$PC= 1
##$PHC0= -80.12329
##$PHC1= 0
##$PH_mod= 1
##$PKNL= yes
##$PPARMOD= 0
##$PPDIAG= 0
##$PPIPTYP= 0
##$PPMPNUM= 2147483647
##$PPRESOL= 1
##$PSCAL= 4
##$PSIGN= 0
##$PYNMP= <proc.py>
##$REVERSE= no
##$SF= 400.020009644086
##$SI= 131072
##$SIGF1= 0
##$SIGF2= 0
##$SINO= 400
##$SIOLD= 131072
##$SPECTYP= <>
##$SREGLST= <1H.CDCl3>
##$SSB= 0
##$STSI= 131072
##$STSR= 0
##$SW_p= 8223.68421052631
##$SYMM= 0
##$S_DEV= 0
##$TDeff= 65536
##$TDoff= 0
##$TI= <>
##$TILT= no
##$TM1= 0
##$TM2= 0
##$TOPLEV= 0
##$USERP1= <user>
##$USERP2= <user>
##$USERP3= <user>
##$USERP4= <user>
##$USERP5= <user>
##$WDW= 1
##$XDIM= 131072
##$YMAX_p= 354124138
##$YMIN_p= -13653
##$CURPLOT= <Network HP LaserJet P1505>
##$CURPRIN= <$Network HP LaserJet P1505>
##$DFORMAT= <normdp>
##$LAYOUT= <+/1D_H.xwp>
##$LFORMAT= <normlp>
##$PFORMAT= <normpl>
##$SURQMSG= 1
$$ End of Bruker specific parameters
$$ ---------------------------------
##NTUPLES= NMR SPECTRUM
##VAR_NAME=  FREQUENCY,     SPECTRUM/REAL,   SPECTRUM/IMAG
##SYMBOL=    X,             R,               I
##VAR_TYPE=  INDEPENDENT,   DEPENDENT,       DEPENDENT
##VAR_FORM=  AFFN,          ASDF,            ASDF
##VAR_DIM=   131072,        131072,          131072
##UNITS=     HZ,            ARBITRARY UNITS, ARBITRARY UNITS
##FACTOR=    0.0627417313425164, 1,          1
##FIRST=     8223.62146879497, -810,         -53319
##LAST=      0,             455,             -53936
##MIN=       0,             -13653,          0
##MAX=       8223.62146879497, 354124138,    0
$$ Real data points
##PAGE= N=1
##DATA TABLE= (X++(R..R)), XYDATA
$$ [...]
64865 286090 284645 283715 282741 281418 279944 278501 276946 275153 273296 271530 269685 267534 265129 262496 259317
64850 259317 255438 251566 248827 247492 246647 245287 243299 241192 239416 238342 238398 239571 240949 241407 240789
64835 240789 240002 239916 240569 241483 242303 242945 243502 244296 245762 248022 250704 253444 256382 259910 263983 267996
64819 267996 271462 274550 277811 281535 285668 290323 295980 302875 310390 317423 323383 328414 332633 335600
64805 335600 336904 336879 336254 335249 333489 330745 327290 323485 319433 315150 310720 306146 301373 296631 292496
64790 292496 289447 287560 286619 286205 285619 284230 282191 280447 279731 279871 280359 281213 282726 284636 286194 287121
64774 287121 288042 289862 293039 297492 302849 308586 314226 319656 325181 331138 337538 344042 350180 355572
64760 355572 360150 364254 368408 372988 378103 383591 388860 392932 395136 395889 396356 397072 397176 395291 390902
64745 390902 384605 377301 369598 361890 354388 346897 339008 330836 323311 317382 313094 309772 307016 305084
64731 305084 304223 304033 303756 303075 302394 302441 303650 305835 308288 310354 312072 314136 317013 320250 322927 324694
64715 324694 326047 327575 329320 330981 332365 333400 333872 333430 331796 328913 324995 320511 315911 311279 306419
64700 306419 301373 296638 292739 289803 287694 286250 285160 283889 282141 280302 279121 279008 279913 281718 284298
64685 284298 287248 290057 292754 296021 300397 305587 310809 315733 320880 327074 334596 342840 350730 357507
64671 357507 363155 368102 372543 376087 377997 377736 375368 371516 366915 361920 356524 350826 345339 340668
64657 340668 337010 334120 331664 329415 327221 325031 323021 321558 320980 321459 323028 325669 329431 334461 340794
64642 340794 348064 355697 363485 371714 380564 389716 398776 407685 416301 423955 430010 434612 438277 440886
64628 440886 441780 440771 438266 434315 428399 420475 411479 402303 392917 383008 372923 363306 354230 345409
64614 345409 337062 329834 323967 319216 315559 313373 312673 312692 312433 311363 309455 306927 304204 301917 300620
64599 300620 300469 301265 302755 304912 307937 311937 316576 321185 325425 329729 334916 341444 349192 357797 366798
64584 366798 375474 382983 388930 393671 397948 402307 406870 411399 415433 418485 420333 421111 421046 420131 418087
64569 418087 414591 409543 403204 396139 388940 381890 374887 367742 360561 353727 347471 341525 335402 329115
64555 329115 323424 319105 316019 313218 310083 307051 304964 303962 303378 302729 302437 303387 305898 309268 312330
64540 312330 314405 315710 316882 318232 319534 320388 320521 319772 318103 315750 313135 310444 307579 304708 302656
64525 302656 302375 304052 306907 309778 311856 313086 314060 315402 317048 318371 319166 320165 322225 325291 328645
64510 328645 331915 335311 339020 343083 347859 353918 361168 368644 375472 381659 387620 393342 398355 402246
64496 402246 404864 406212 406468 405979 404966 403322 400871 397680 393983 389997 385997 382384 379474 377368 376122
64481 376122 375747 375824 375495 374194 372176 369948 367439 364216 360401 356814 354058 351925 349911 348046 346904
64466 346904 346895 347750 348741 349366 349809 350654 352174 354029 355680 356827 357317 356936 355695 354186 353222 353068 353330
64449 353330 353604 353939 354631 355856 357641 359971 362799 366127 370150 375127 381039 387603 394705 402574 411408
64434 411408 421086 431458 442801 455735 470731 487816 506720 527251 549675 574864 603944 637618
64422 637618 675803 718019 764056 814131 868371 926249 986546 1047778 1108569 1167682 1223812
64411 1223812 1275564 1321663 1361085 1392902 1416265 1430809 1436942 1435383 1426334 1409357 1384086 1350736
64399 1350736 1309850 1262010 1208110 1149719 1088749 1026855 965315 905382 848365 795321 746866
64388 746866 703306 664793 631277 602388 577395 555330 535371 517336 501726 489040 479003
64377 479003 470550 462542 454427 446342 438805 432306 426940 422291 417663 412483 406548 400041 393407 387085
64363 387085 381246 375884 371206 367649 365342 363805 362509 361531 361354 362170 363835 366424 370263 375344 381120
64348 381120 387086 393138 399157 404627 408968 412011 413900 414726 414528 413442 411592 409006 405889 402847 400489
64333 400489 398817 397174 394834 391589 387908 384636 382408 381252 380792 380785 381155 381558 381421 380684 380050 380095 380467
64316 380467 380408 379747 378832 377689 375971 373682 371236 368649 365286 360755 355561 350478 345635 340592 335115
64301 335115 329524 324377 320109 316886 314597 313015 312089 312016 312944 314806 317577 321510 326832 333274 340113
64286 340113 346726 353014 359374 366332 374118 382431 390621 398180 405042 411383 417291 422694 427449 431293
64272 431293 433795 434596 433785 431868 429298 426094 422032 417194 412252 408099 405176 403237 401796 400607 399541
64257 399541 398187 395944 392598 388525 384122 379276 373560 366820 359415 352001 345258 339676 335327 331806
64243 331806 328533 325197 321916 319023 316789 315299 314479 314260 314690 315826 317501 319350 321136 322923 324875
64228 324875 327019 329406 332307 336001 340346 344770 348758 352207 355306 358234 361040 363656 365870 367325
64214 367325 367728 367149 366043 364833 363505 361708 359306 356634 354087 351583 348656 345115 341372 338092 335624
64199 335624 333885 332717 332250 332859 334777 337819 341659 346355 352328 359715 368097 377162 387260 398759
64185 398759 411035 422691 432773 441088 447263 450278 449420 445171 438627 430398 420595 409686 398776
64172 398776 389025 381048 374777 369621 364891 360359 356399 353486 351832 351711 353671 357876 363465 369122
64158 369122 374265 379232 384319 389128 392988 395629 397289 398381 399108 399230 398253 396000 392894 389451 385731
64143 385731 381630 377490 373858 370659 367154 362871 358134 353570 349550 346228 343708 341920 340671 340005
64129 340005 340185 341085 341987 342283 342119 342047 342264 342607 343164 344509 347239 351494 356994 363465 370887 379289 388265
64112 388265 396897 404412 410928 417233 423695 429601 433787 435805 436311 436411 436890 438048 440020 442961 446784
64097 446784 450823 453999 455479 455119 453235 450093 445754 440242 433645 426118 417950 409525 401061 392559
64083 392559 384180 376426 369702 363885 358698 354291 351031 348857 347231 345651 343811 341486 338788 336420
64069 336420 335051 334468 333923 333282 333092 333476 333766 333544 333270 333492 334074 334677 335422 336570 338015 339543 341171
64052 341171 342768 343826 344142 344357 345272 347010 349419 352782 357444 362995 368619 374114 379866 385951 391958
64037 391958 397674 403206 408354 412559 415665 418155 420403 422177 423179 423744 424705 426784 430200 434570 439093
64022 439093 443045 446225 448704 450220 450212 448466 445387 441534 437248 432832 428627 424604 420206 414978 409312
64007 409312 404250 400561 398071 395915 393323 390220 387103 384476 382481 381033 380052 379416 378925 378522 378421
63992 378421 378881 379973 381698 384063 386815 389488 392058 395258 399769 405334 411180 417036 423097 429197
63978 429197 434857 440170 445821 452018 458182 464003 470065 476944 484392 492069 500549 510797 522850 535795
63964 535795 549066 563168 578995 596939 616887 638740 662685 689112 718530 751606 789235
63953 789235 832487 882300 939213 1003507 1075745 1157009 1248439 1350546 1463071 1585364 1716748
63942 1716748 1856541 2003787 2156907 2313540 2470856 2626117 2776861 2920521 3054106
63933 3054106 3174433 3278627 3364389 3429986 3474173 3495988 3494551 3469262 3420450 3349719 3259511
63922 3259511 3152377 3030760 2897240 2754653 2605960 2454100 2301888 2151827 2006029
63913 2006029 1866348 1734405 1611242 1497106 1391837 1295514 1208509 1130901 1062069 1000975
63903 1000975 946741 898870 857061 820889 789670 762535 738600 717072 697370 679291 663069
63892 663069 649097 637436 627654 619096 611203 603588 596145 589211 583352 578737 574854 571110 567533 564593
63878 564593 562561 561484 561759 564127 568857 575331 582801 591296 601381 613193 626209 639980 654552
63865 654552 669914 685446 700419 714866 729439 744302 758562 771041 781277 789462 795580 799094
63853 799094 799516 796977 792054 785223 776647 766383 754569 741375 726887 711149 694353 676916 659296
63840 659296 641715 624169 606668 589296 571965 554346 536301 518325 501344 486084 472690
63829 472690 460847 450025 439713 429642 419879 410597 401893 393928 387079 381603 377169 372986 368456
63816 368456 363529 358536 353947 350230 347628 345992 344993 344400 343934 343105 341682 340172 339261 338719 337450 334829
63800 334829 331472 328510 326553 325520 324956 324216 322804 320844 318844 316877 314577 312132 310464 309881 309337
63785 309337 307744 305435 303492 302155 300881 299594 298761 298344 297780 297062 296773 296877 296536 295548 294972 295704 297182
63768 297182 298185 298373 298345 298543 298826 298934 298808 298499 298153 297996 298086 298245 298413 298778 299335 299708 299773 300063 301062
63749 301062 302476 303771 305107 307052 309476 311540 312826 313779 314901 316193 317699 319941 323213 326861
63735 326861 329858 331959 333793 335896 338138 340243 342438 345325 349290 354195 359575 364990 370257 375449
63721 375449 380659 385644 389803 392694 394585 396206 397765 398424 397093 393700 389335 385105 381258 377605
63707 377605 374332 371828 369925 367901 365363 362720 360633 359377 358910 359155 359935 360865 361701 362682 364167 366028
63691 366028 367702 368850 369701 370746 372368 374774 377944 381461 384654 387182 389425 392095 395455 398999
63677 398999 401913 403852 405275 407035 409583 412583 415360 417622 419584 421515 423462 425412 427324 428846
63663 428846 429390 428844 427897 427234 426533 424717 421176 416375 411213 406217 401466 396956 392792 389220 386603
63648 386603 385137 384444 383716 382501 381175 380431 380449 380783 380961 381042 381661 383578 386979 391082 394716 397545 400462
63631 400462 404501 409661 415281 421247 428144 436177 444701 453143 461853 471620 482749 495146 509013
63618 509013 524807 542503 561435 581057 601464 622994 645682 669373 694123 720045 746728
63607 746728 773053 797589 819052 836475 849270 857332 861062 861260 858966 855245 850830 845928 840540
63594 840540 834926 829430 823685 816399 806309 793285 778288 762508 746854 731983 718166 705042
63582 705042 692074 679390 667730 657391 647826 638667 630560 624314 619555 615015 610193 606004 603603
63569 603603 603117 603879 605505 608269 612620 618676 626182 634694 643846 653698 664839 677951 693155 709975
63555 709975 728066 747826 770048 794961 821931 850265 879940 911030 942422 971669 996364
63544 996364 1015323 1028231 1034742 1034640 1028682 1018569 1006023 992409 979168 967746 958532 950411 941837
63531 941837 932081 921008 908169 892915 875298 856056 835546 813351 789287 764204 739294 714992
63519 714992 691204 668399 647679 629550 613178 597346 581849 567561 555376 545493 537607 531205
63507 531205 525487 519557 513126 506883 501873 498534 496516 495184 493998 492535 490595 488393 486370 484764
63493 484764 483533 482680 482262 481956 481053 479259 477335 476535 477410 479415 481716 484066 486740 489861 493158 496351
63477 496351 499515 502874 506336 509438 511723 513073 513624 513485 512568 510632 507493 503293 498542 493692 488674
63462 488674 483114 477113 471510 467144 464061 461724 459777 458256 457236 456790 457210 458781 461299 464385 468389
63447 468389 474361 482764 492780 503446 515038 528645 544627 562348 581532 603066 627911 655592
63435 655592 684138 711261 735242 755045 770323 781552 789814 796201 801521 806610 812633 820862 832238
63422 832238 847216 865794 887480 911395 936742 963111 989972 1015873 1038537 1056100 1068163
63411 1068163 1075564 1079342 1080117 1078264 1074342 1069221 1063781 1058371 1052495 1045245 1036178 1025509 1013277 998645
63397 998645 980530 958878 934933 910227 885629 861257 836838 812054 787011 762619 740233
63386 740233 720705 703991 689729 677765 667889 659578 652492 647019 643817 642927 643775 646033 650026 656157
63372 656157 664271 673820 684439 696175 709247 723837 740037 757838 777067 797482 819118 842473
63360 842473 868094 895776 924378 952651 980047 1006306 1030312 1050089 1064237 1073035 1077704 1078967
63348 1078967 1076797 1071330 1063324 1053637 1042717 1030759 1017924 1004185 989250 972841 954855 935133
63336 935133 913440 889983 865706 841686 818331 795495 773290 752408 733610 717302 703771
63325 703771 693454 686583 682673 680598 679031 676564 671709 663463 652076 638806 624689 609898 594494
63312 594494 579241 565165 552677 541712 532449 525125 519232 513778 508535 504250 501378 499315 497310
63299 497310 495380 493700 491756 488933 485554 482489 479913 477304 474500 471906 469636 467314 464902 462882
63285 462882 461268 459256 456345 453149 450471 448136 445420 442324 439639 437862 436681 435582 434472 433557
63271 433557 433012 432864 432927 432807 432218 431307 430411 429571 428606 427651 427166 427335 427874 428593 429699 431254 432755 433733
63253 433733 434562 436106 438642 441625 444675 448259 453051 458959 465207 471249 477131 482989 488714 494417
63239 494417 500809 508650 517864 527644 537524 547963 559672 572604 585924 598856 611259 623383
63227 623383 635397 647246 658771 669809 680334 690648 701329 712830 725106 737688 749978
63216 749978 761363 771198 778989 784660 788460 790530 790671 788583 784194 777689 769398 759753 749204 738027
63202 738027 726353 714480 703014 692467 682816 673700 665028 657195 650723 645936 643044 642225 643465
63189 643465 646409 650563 655563 661300 667927 675802 685199 695874 707108 718357 729788 741985 755175
63176 755175 768933 782637 796028 809240 822337 834907 846170 855499 862722 867849 870635 870731 868176
63163 868176 863334 856164 845982 832309 815709 797395 778220 758516 738725 719476 700905 682526
63151 682526 664160 646613 630964 617437 605378 594262 584254 575748 568685 562481 556396 549974
63139 549974 543381 537475 533263 530984 529806 528654 527350 526683 527322 528938 530652 532163 534125 537332 541789
63124 541789 546745 551435 555569 559210 562539 565869 569585 573777 578004 581668 584696 587689 591329 595792
63110 595792 600760 605792 610531 614769 618661 622778 627597 632888 637932 642480 647105 652422 658271 664000
63096 664000 669250 674010 678154 681456 684047 686266 688000 688710 688275 687305 686350 685273 683771 682106 680805
63081 680805 679861 678723 677010 674884 672815 671268 670494 670313 670184 669880 669956 671212 673802 677249 681315 686347
63065 686347 692713 700382 709282 719712 732104 746554 762803 780569 799724 820225 842007 864954
63053 864954 889021 914415 941520 970487 1000994 1032552 1064895 1097826 1130910 1163789 1196753
63042 1196753 1230580 1265798 1302495 1340733 1380412 1420448 1458683 1493124 1522987 1548237 1568562
63031 1568562 1583311 1592115 1594936 1591620 1581974 1566337 1545576 1520454 1491383 1458911 1424021 1387719
63019 1387719 1350694 1313596 1277396 1243105 1211306 1182239 1156261 1133925 1115637 1101526 1091685
63008 1091685 1086226 1084953 1087252 1092572 1100884 1112322 1126478 1142433 1159566 1177975 1197856 1218768
62996 1218768 1239890 1260814 1281724 1302876 1324247 1345671 1366927 1387582 1407059 1424907 1440713
62985 1440713 1453734 1462983 1467825 1468090 1463445 1453180 1437000 1415646 1390203 1361026 1328011 1291847
62973 1291847 1254279 1216856 1179832 1142685 1105403 1068933 1034495 1002756 973627 946630 921452
62962 921452 898295 877603 859303 842433 825824 809195 793302 778948 766150 754449 743617
62951 743617 733683 724447 715533 706952 699174 692468 686574 681208 676530 672827 670064 668109 667150 667448 668810
62936 668810 670755 673207 676689 681744 688329 695683 702629 708180 712140 714886 716254 715043 710177 702138
62922 702138 692523 682380 671789 661033 651079 642448 634503 626480 618617 611681 605932 601201 597556
62909 597556 595175 593910 593587 594443 596574 599262 601610 603738 606656 611018 616596 622876 629373 635339 639969
62894 639969 643172 645567 647530 648755 648898 648053 646315 643395 639022 633369 626838 619839 612975 606951 601945
62879 601945 597441 592986 588771 585134 581894 578649 575424 572554 570019 567335 564049 560152 556045 552355
62865 552355 549563 547606 545936 544136 542245 540342 538268 536091 534438 533805 533822 533820 533882 534615 535928 536888 537039
62848 537039 537116 538053 539793 541614 543205 544873 546867 549036 551123 552979 554493 555595 556352 556803 556796 556296
62832 556296 555784 555966 557085 558854 561066 563771 566717 569176 570723 571859 573427 575632 578082 580578 583230
62817 583230 585796 587600 588425 589082 590671 593478 596898 600219 603202 606042 609175 613075 617896 623270 628655
62802 628655 633908 639332 645216 651577 658388 665741 673738 682435 691973 702551 714238 727093 741551
62789 741551 758350 777848 799713 823588 849870 879451 912793 949570 989162 1031134 1075170
62778 1075170 1120953 1168268 1216888 1266089 1314430 1360267 1402348 1439796 1471827 1497841 1517670
62767 1517670 1531346 1538665 1539418 1534087 1523911 1510100 1493382 1474445 1454316 1433911 1413493 1392930
62755 1392930 1372134 1350723 1327579 1301481 1272121 1239879 1204711 1166223 1125088 1083481 1043405
62744 1043405 1005140 967923 931666 897234 865399 836446 810738 788718 770093 753679 738458
62733 738458 724438 712302 702601 695450 690463 686675 683024 679297 676319 674833 674557 674768 675482 677429
62719 677429 680963 685670 691187 697826 706011 715434 725297 735383 746530 759807 775379 792471 810515
62706 810515 830044 852175 877336 904936 934348 965805 1000017 1037231 1077053 1118971 1162476
62695 1162476 1206627 1250147 1292223 1332849 1371888 1407986 1438881 1462798 1479126 1487701 1487943 1479212
62683 1479212 1461829 1437246 1407058 1372177 1333111 1290692 1246158 1200675 1155185 1110618 1067793
62672 1067793 1026904 987544 949577 913746 881022 851462 824155 798356 774322 752831 734164
62661 734164 717830 703141 689707 677385 666017 655431 645629 636853 629420 623441 618641 614459 610395
62648 610395 606255 602043 597718 593253 588883 585099 582320 580759 580589 581910 584352 586937 588734 589649 590334
62633 590334 591376 592784 594193 595244 595730 595682 595428 595310 595284 595034 594594 594560 595476 597248 599367 601489 603567
62616 603567 605571 607367 608832 609952 610894 612084 614046 617097 621327 626841 633647 641209 648728 656235
62602 656235 664916 675812 688542 702019 716152 732015 750374 770899 792990 816458 840898 865030
62590 865030 887405 907500 925599 941817 955691 966623 974239 978327 978848 976155 970976 964044 955849
62577 955849 946754 937215 927774 918939 911174 905093 901567 901365 904524 910243 917647 926494 936763 947644
62563 947644 957431 964522 968079 967595 962389 952066 937171 918915 898296 875872 852254 828374 805141
62550 805141 783003 761993 742112 723665 707261 693415 682074 672603 664265 656640 649642 643399
62538 643399 638199 634259 631378 629025 626974 625577 625199 625691 626743 628517 631450 635547 640357 645771 652482
62523 652482 661435 673001 686802 702245 719091 737569 758031 780481 804482 829427 854826 880349
62511 880349 905804 931121 956165 980449 1003131 1023368 1040474 1053770 1062658 1067054 1067417 1064148
62499 1064148 1057296 1047123 1034625 1021029 1007007 992791 978887 966242 955731 947780 942424 939463
62487 939463 938718 940409 944996 952310 961181 970496 980334 991345 1003159 1014183 1023032 1029377 1033234 1034260
62473 1034260 1032162 1027129 1019358 1008586 994579 977752 958912 938645 917233 894867 871611 847478
62461 847478 822907 798895 776437 756065 738103 722792 709712 697634 685622 674075 664075
62450 664075 656013 649452 644172 640456 638332 637243 636732 636840 637579 638512 639195 639720 640438 641424 642439 643254
62434 643254 643760 643920 643800 643514 643013 642035 640340 637848 634555 630581 626363 622505 619281 616529 614147 612324
62418 612324 611074 609828 607915 605291 602526 600181 598455 597351 596838 596821 597183 597878 598869 600022 601260 602749
62402 602749 604782 607506 610860 614646 618490 622028 625424 629489 634841 641095 647378 653552 660351 668277
62388 668277 677050 686450 697008 709306 723037 737358 751934 767045 782871 799301 816461 834881
62376 834881 854967 876744 900133 925010 950896 977098 1003483 1030750 1059672 1090376 1122755
62365 1122755 1157261 1194880 1236402 1282076 1331879 1385625 1442623 1501444 1560196 1616948 1669885
62354 1669885 1717300 1757748 1790285 1814503 1830272 1837484 1836083 1826384 1809307 1786205 1758387 1726761
62342 1726761 1691828 1653956 1613641 1571545 1528220 1483846 1438402 1392226 1346276 1301708 1259268
62331 1259268 1219189 1181492 1146153 1113147 1082580 1054699 1029496 1006465 985043 965102 946623
62320 946623 929124 912036 895480 879951 865274 850765 836549 823634 812214 800923 788659
62309 788659 776407 766182 758675 752966 748199 744275 740987 737764 734672 732614 732023 732089 731828 731280 731137
62294 731137 731704 732781 734193 735894 737806 739979 742620 745627 748400 750575 752643 755322 758542 761568
62280 761568 764051 766424 769241 772651 776680 781572 787541 794390 801713 809545 818543 829361 841872 855315
62266 855315 869341 884698 902568 923394 946858 972955 1002448 1036024 1073564 1114597 1158919
62255 1158919 1206151 1255017 1303792 1351341 1397089 1440012 1478333 1510418 1535466 1553157 1563187
62244 1563187 1565483 1560429 1548433 1529515 1503738 1471853 1435131 1394656 1351183 1305664 1259435 1213756
62232 1213756 1169434 1127045 1087205 1050354 1016449 985204 956604 930947 908362 888515 870898
62221 870898 855284 841858 830971 822767 816850 812345 808524 805449 803730 803548 804229 805090 806367 808879
62207 808879 812914 817907 823244 828885 835116 842122 849991 858734 867944 876694 884133 890177 895480 900856
62193 900856 906893 913970 922320 932013 942916 954752 967236 980425 994992 1011945 1031829 1054283
62181 1054283 1078485 1103930 1130606 1158479 1187055 1215521 1243230 1269891 1295151 1318081 1337443
62170 1337443 1352681 1364403 1373602 1380721 1386024 1390643 1396388 1404252 1413694 1423661 1433610 1443036 1450623
62157 1450623 1454685 1454288 1449457 1440538 1427929 1412188 1393682 1372129 1347080 1318867 1288496 1256555
62145 1256555 1222800 1187057 1150050 1113156 1077717 1044770 1014947 988301 964408 942888 923670
62134 923670 906679 891633 878322 866819 857152 848976 841867 835757 830843 827107 824160 821500 818834
62121 818834 816172 813720 811652 809991 808784 808331 808971 810543 812291 813454 813857 813818 813671 813507 813283 812966
62105 812966 812577 812219 812061 812233 812678 813125 813327 813457 814232 816297 819397 822501 825080 827914 832129 837718
62089 837718 843727 849848 856997 866039 876644 887936 899781 912796 927336 943082 959588 976831
62077 976831 995221 1015330 1037505 1061399 1086064 1110875 1136252 1163079 1191451 1220421 1248993
62066 1248993 1276935 1304502 1331871 1359132 1386458 1413753 1440081 1463777 1483391 1498521 1509675
62055 1509675 1517310 1521108 1520323 1514728 1504958 1491750 1475102 1454441 1429521 1400831 1369200 1335336
62043 1335336 1299878 1263603 1227325 1191685 1157187 1124328 1093452 1064514 1037172 1011322 987501
62032 987501 966534 948658 933114 918932 906039 895220 886788 879747 872637 864996 857475 850634 844172
62019 844172 837478 830479 823691 817664 812538 807953 803242 797922 792129 786403 781097 776273 772197 769431
62005 769431 768228 768310 769567 772495 777407 783523 789444 794398 798452 801662 803744 804665 804861 804529 803244
61990 803244 800620 796906 792523 787419 781355 774581 767670 760822 753818 746636 739664 733243 727358 721899
61976 721899 716978 712860 709756 707680 706368 705357 704411 703792 703826 704248 704345 703818 703076 702583 702329 702177 702319
61959 702319 703006 704075 705131 706084 707157 708487 710092 712160 715058 719038 724273 731186 740394 752179
61945 752179 766227 781998 799171 817650 837373 858305 880553 904271 929426 955640 982258
61934 982258 1008678 1034709 1060540 1086196 1111173 1134839 1157061 1177981 1197132 1213317 1225691
61923 1225691 1234568 1240749 1244264 1244338 1240606 1233930 1225947 1218131 1211372 1206065 1202326 1200315 1200566 1203831 1210452
61908 1210452 1220081 1232223 1246695 1263123 1280134 1295641 1308076 1316981 1322318 1323758 1320963 1314134
61896 1314134 1303719 1289821 1272434 1252207 1230404 1207974 1185104 1161776 1138325 1115185 1092480
61885 1092480 1070270 1049001 1029321 1011450 994918 978906 962762 946367 930166 914718 900135
61874 900135 886184 873068 861757 853155 847054 842280 837831 833636 830346 828702 829067 831287 834993 840290
61860 840290 848014 859021 873293 890102 909017 930378 954754 982388 1013315 1047646 1085388 1126051
61848 1126051 1168555 1211592 1254241 1296369 1338237 1379327 1417707 1450981 1477909 1498752 1514141
61837 1514141 1524123 1528336 1526606 1519289 1507674 1494253 1481914 1472394 1465830 1462007 1461432 1464855 1472360
61824 1472360 1483493 1497649 1513598 1529064 1541740 1550579 1555441 1555652 1549778 1536824 1516891 1490606
61812 1490606 1458755 1422712 1384403 1345266 1305646 1265540 1225550 1186726 1149852 1115239 1082890
61801 1082890 1052572 1023975 997187 972793 951277 932508 916024 901445 888246 875551 862788
61790 862788 850471 839764 831121 823786 816766 809964 804080 799610 796231 793198 790066 786938 784078 781549
61776 781549 779338 777639 776703 776409 776257 775916 775562 775574 776115 777099 778324 779513 780563 782047 785107 790360
61760 790360 797038 803679 809627 815411 821629 828035 833946 839096 843677 847772 851161 853586 854847 854661
61746 854661 852774 849382 845212 840980 836844 832578 828193 824178 820959 818297 815462 812010 808218 804690
61732 804690 801751 799392 797585 796351 795577 795139 795265 796465 798895 801979 804891 807343 809720 812542 815988
61717 815988 819947 824285 828984 834046 839253 844024 847622 849673 850452 850506 850039 848836 846728 843843 840314
61702 840314 836057 831057 825694 820440 815305 809879 804038 798325 793427 789483 786140 783160 780634 778512
61688 778512 776273 773367 769885 766520 763847 761840 760177 758781 757872 757589 757780 758160 758532 758814 759002 759124
61672 759124 759163 759010 758683 758585 759287 760878 762662 763765 764021 764098 764777 766322 768567 771350 774628 778257 781923
61655 781923 785357 788513 791504 794426 797306 800155 802988 805901 809224 813589 819601 827294 835939 844508
61641 844508 852325 859235 865297 870520 874805 877859 879113 878086 874999 870778 866211 861356 856038 850667
61627 850667 846066 842528 839541 836504 833274 829886 826264 822557 819326 816891 814683 811781 808067 804413
61613 804413 801603 799394 796802 793042 788009 782059 775567 768703 761505 754117 746916 740293 734279 728445
61599 728445 722248 715449 708309 701530 695953 692055 689495 687263 684490 681171 678052 675784 674269 672866
61585 672866 671131 669186 667300 665320 662843 660001 657734 656924 657352 657860 657617 656910 656556 656850 657401 657854
61569 657854 658419 659578 661517 664011 666805 669962 673766 678386 683713 689580 696012 703146 710864 718640
61555 718640 725764 731668 736023 738665 739537 738706 736450 733341 730102 727142 724223 720896 717413 714927 714473
61540 714473 715904 718130 720337 722632 725540 729268 733659 738517 743686 748937 754031 758870 763416 767476
61526 767476 770681 772707 773426 772891 771224 768539 764968 760819 756715 753384 751142 749698 748574 747690 747402
61511 747402 747996 749304 750827 752140 753122 753819 754098 753495 751598 748648 745568 743196 741535 739960 738115
61496 738115 736499 736203 738161 742424 747902 752975 756773 759900 763605 768296 773280 777904 782357 787106
61482 787106 792155 797348 802945 809224 815704 821408 825991 830126 834655 839746 845003 850040 854727 859107
61468 859107 863228 866917 869654 870876 870483 868848 866290 862773 858217 852804 846812 840403 833812 827510
61454 827510 821869 816777 811851 807013 802572 798800 795676 793159 791455 790808 791114 791994 793377 795806 799867
61439 799867 805256 810706 815116 818612 822193 826405 830717 834216 836523 837839 838501 838894 839640 841477 844788
61424 844788 849315 854376 859326 863979 868719 874140 880481 887376 894112 900036 904775 908309 910936 912964
61410 912964 914381 915050 915198 915330 915490 915015 913407 911147 909203 907926 906874 905661 904437 903493 902802 902159
61394 902159 901442 900554 899286 897449 895053 892302 889483 886891 884748 883219 882580 883256 885449 888827 892901
61379 892901 897685 903650 910954 919034 927125 934884 942329 949384 955716 960863 964367 965922 965613 963945
61365 963945 961521 958783 956066 953670 951626 949620 947459 945616 945072 946556 950030 954877 960445 966423
61351 966423 972933 980345 988843 998038 1007041 1015066 1022008 1028410 1034899 1041736 1048874 1056233 1063733 1071140
61337 1071140 1078193 1085005 1092068 1099623 1107154 1113785 1119133 1123501 1127296 1130638 1133618 1136616 1140094 1144283
61323 1144283 1149250 1155184 1162396 1171167 1181623 1193636 1206677 1219978 1233106 1246263 1259797 1273521
61311 1273521 1286761 1298983 1310021 1319683 1327478 1332868 1335574 1335591 1333179 1328943 1323533 1316999 1308730 1298410
61297 1298410 1286796 1275095 1263694 1252037 1239760 1227290 1215080 1202816 1189917 1176491 1163293
61286 1163293 1150951 1139771 1130107 1122241 1115845 1110225 1105319 1101896 1100520 1100907 1102697 1106326 1112478 1120998
61272 1120998 1131008 1141992 1154094 1167315 1181088 1194933 1209087 1224175 1240600 1258573 1278520
61261 1278520 1300961 1325852 1352202 1378523 1403722 1427539 1450042 1470733 1488445 1502317 1512675
61250 1512675 1520625 1526840 1531063 1532790 1532163 1530119 1527901 1526469 1526210 1527148 1529462 1533678 1540089 1548198 1557132
61235 1557132 1566597 1576954 1588187 1599152 1608025 1613278 1614207 1610889 1603827 1593362 1579351 1561749 1541581
61222 1541581 1520851 1501121 1482482 1464216 1446132 1428843 1413007 1398812 1386173 1374977 1365046
61211 1365046 1356242 1348733 1343038 1339599 1338332 1338580 1339553 1340946 1343142 1346657 1351308 1356129 1360134 1362997
61197 1362997 1365009 1366756 1369029 1372560 1377365 1382444 1386517 1389061 1390463 1391318 1391821 1391730 1390647 1388395 1385285
61182 1385285 1381835 1378096 1373482 1367465 1360141 1351792 1342293 1331485 1319854 1308190 1296628 1284619 1271892
61169 1271892 1258852 1245976 1233386 1221186 1209618 1198516 1187137 1174986 1162460 1150253 1138388
61158 1138388 1126341 1114025 1102209 1091919 1083691 1077340 1072170 1067468 1063127 1059862 1058511 1058978 1060067
61145 1060067 1060458 1059649 1057849 1055264 1051880 1047910 1044009 1040822 1038504 1036917 1036156 1036620 1038584 1042003 1046836
61130 1046836 1053348 1061919 1072694 1085560 1100409 1117278 1136243 1157278 1180166 1204498 1229789 1255612
61118 1255612 1281542 1307040 1331592 1355030 1377572 1399501 1421012 1442297 1463427 1484025 1503467
61107 1503467 1521687 1539410 1557122 1574053 1588535 1599219 1605553 1607316 1604326 1596710 1585033 1569973
61095 1569973 1552025 1531540 1508837 1484474 1459684 1436302 1415560 1396995 1379064 1360973 1343371
61084 1343371 1327162 1312314 1298094 1283829 1268920 1252620 1234513 1215141 1195719 1177292 1160404
61073 1160404 1145269 1131692 1118942 1106222 1093413 1081135 1070057 1060486 1052509 1046100 1040908 1036410
61061 1036410 1032630 1030486 1031011 1034191 1038835 1043689 1048506 1053962 1060761 1069071 1078781 1089955 1102916 1118045
61047 1118045 1135631 1155796 1178446 1203488 1231109 1261588 1294669 1329508 1365472 1402573 1440547
61036 1440547 1477866 1512403 1543048 1569911 1592910 1611036 1623439 1630632 1634118 1635332 1635366 1635316 1636259
61023 1636259 1639169 1645267 1656277 1673954 1699668 1734914 1781867 1842890 1919817 2014510 2130013
61012 2130013 2270242 2438132 2634231 2856537 3100040 3355065 3606239 3834653 4023264
61003 4023264 4162729 4254275 4308134 4338888 4360504 4382616 4407589 4428343 4429142 4391258 4301093
60992 4301093 4155349 3960532 3729245 3476825 3218953 2969164 2736615 2525605 2336952
60983 2336952 2169733 2022359 1893126 1780420 1682482 1597168 1522268 1456202 1398089 1347068
60973 1347068 1301887 1261341 1224901 1192542 1163992 1138431 1114980 1093289 1073510 1055874 1040511
60962 1040511 1027563 1017071 1008636 1001491 995105 989550 985062 981575 979015 977784 978350 980410 983007 985652
60948 985652 988796 993033 998326 1004254 1010530 1016858 1022737 1028002 1033191 1038773 1044181 1048216 1050332 1050876
60934 1050876 1050148 1047958 1044259 1039520 1034083 1027683 1019990 1011265 1002122 993018 984347 976613 969991 964004
60920 964004 958151 952703 948288 944884 941838 938891 936490 934958 934019 933521 934128 936763 941608 948023 955234
60905 955234 962712 970086 977181 984211 991646 999889 1009324 1020576 1034264 1050368 1068100 1086601 1105645
60892 1105645 1125656 1147244 1170817 1196420 1223801 1252708 1283166 1315237 1348410 1381529 1413538
60881 1413538 1444151 1473548 1501536 1527366 1550397 1570650 1588568 1604317 1617402 1626877 1631922 1632265
60869 1632265 1628122 1619745 1607134 1590276 1569502 1545350 1518129 1487962 1455376 1421560 1387787 1354723
60857 1354723 1322511 1291263 1261065 1231527 1201905 1172009 1142762 1115502 1090756 1067996 1046552
60846 1046552 1026469 1008267 992091 977404 963564 950501 938665 928266 918688 908840 898199 887343
60834 887343 877297 868411 860148 852000 844238 837488 831796 826591 821592 817293 814278 812352 810732 809015
60820 809015 807524 806616 806088 805593 805400 806227 808296 811009 813748 816624 820077 823971 827570 830378 832630
60805 832630 834890 837547 840809 844723 848894 852546 855294 857681 860558 864006 867231 869460 870539 870661
60791 870661 870004 868842 867613 866537 865317 863459 860829 857724 854510 851309 847936 843996 839178 833640
60777 833640 828016 822845 818095 813433 808888 804922 801792 799150 796471 793715 791339 789694 788662 787939
60763 787939 787477 787478 788027 788948 790103 791656 793859 796615 799438 801956 804351 807174 810758 814998 819759 825247
60747 825247 831614 838248 843894 847802 850446 852696 854479 854861 853479 851183 848908 846475 843104 838759
60733 838759 834255 830083 825804 820815 815200 809563 804332 799544 795090 790888 786879 783004 779182 775271
60719 775271 771141 766879 762896 759834 758274 758300 759181 759787 759627 759294 759618 760631 761838 763163 764926 766917
60703 766917 768387 769194 770250 772455 775768 779734 784316 789625 795281 800699 805785 810898 816402 822665
60689 822665 830113 838696 847529 855671 863084 870286 877277 883510 888776 893511 898205 903142 908663 914990
60675 914990 921785 928606 935939 944977 956073 968153 980160 992459 1006169 1021508 1037445 1052871
60663 1052871 1067546 1081862 1096053 1109692 1121788 1131412 1138365 1143187 1146411 1148016 1147649 1145108 1140430
60650 1140430 1133812 1125832 1117569 1110118 1103977 1099071 1095216 1092290 1090059 1088159 1086243 1084000 1081147 1077747
60636 1077747 1074452 1072082 1070857 1070235 1069558 1068661 1067753 1066912 1065868 1064347 1062611 1061665 1062754 1066446 1072241
60621 1072241 1079225 1087089 1096398 1107949 1122166 1139115 1158720 1180666 1204255 1228661 1253351 1278092
60609 1278092 1302432 1325207 1344656 1359122 1367819 1371075 1369796 1364609 1355525 1342465 1325963 1307134
60597 1307134 1286947 1265843 1244246 1223153 1203810 1186676 1170952 1155261 1138698 1121275 1103694
60586 1103694 1086931 1071833 1058757 1047515 1037706 1029026 1021264 1014294 1008334 1004046 1002050 1002346 1004415
60573 1004415 1007793 1012265 1017703 1024165 1032152 1042196 1053942 1065960 1076768 1085833 1093488 1100189 1106155
60560 1106155 1111418 1115865 1119380 1122274 1125476 1129925 1135859 1142972 1151178 1160803 1171987 1184320 1197263
60547 1197263 1210728 1225056 1240568 1257206 1274309 1290538 1304203 1313994 1319485 1320872 1318361 1311997
60535 1311997 1302039 1289235 1274695 1259580 1244959 1231685 1220167 1210307 1201780 1194492 1188699 1184735
60523 1184735 1182721 1182550 1184034 1187039 1191572 1197833 1206113 1216608 1229292 1243944 1260126 1277143 1294229
60510 1294229 1310998 1327723 1345106 1363891 1384819 1408764 1436573 1468684 1505041 1545408 1589520
60499 1589520 1636827 1686242 1736211 1784844 1829824 1868339 1897442 1914642 1918294 1907669 1882986
60488 1882986 1845477 1797344 1741452 1680877 1618562 1557110 1498638 1444643 1395954 1352822 1315047
60477 1315047 1282087 1253341 1228629 1208365 1192909 1181671 1173212 1166470 1161562 1159034 1158604 1159069 1159346
60464 1159346 1159125 1158536 1157724 1156834 1155889 1154448 1151774 1147623 1142490 1136810 1130265 1122281 1112963 1103087 1093247
60449 1093247 1083368 1073044 1062109 1050902 1040163 1030551 1022072 1014120 1006309 999069 993007 987895 982790
60436 982790 977229 971813 967430 964382 962551 961973 962755 964565 966698 968748 970912 973569 976872 980900 985886
60421 985886 991965 998748 1005478 1011715 1017707 1024039 1031080 1038931 1047687 1057434 1067955 1078691 1089107
60408 1089107 1098912 1107760 1114860 1119172 1120061 1117675 1112682 1105771 1097466 1088276 1078776 1069433 1060524 1052383
60394 1052383 1045640 1040945 1038424 1037614 1038056 1039728 1042771 1047003 1052025 1057694 1064241 1071939 1080891 1091050
60380 1091050 1102194 1113950 1126126 1139007 1153020 1168138 1183855 1199668 1215147 1229514 1241648
60369 1241648 1250734 1256586 1259237 1258699 1255394 1250347 1244472 1237907 1230428 1222332 1214500 1207705 1202159 1197586
60355 1197586 1193430 1189090 1184335 1179433 1174656 1169790 1164420 1158490 1152199 1145484 1138128 1130364 1122833 1115760
60341 1115760 1108606 1100809 1092624 1084984 1078731 1074139 1070987 1068793 1067069 1065658 1064939 1065597 1068015 1071830
60327 1071830 1076123 1080146 1083840 1087542 1091210 1094200 1095901 1096341 1095956 1094966 1093277 1090954 1088544 1086970 1087216
60312 1087216 1089969 1095277 1102644 1111701 1122708 1136116 1151712 1168470 1185121 1200481 1213254 1222091
60300 1222091 1226139 1225230 1219375 1208425 1192556 1172893 1151311 1129656 1109298 1091224 1076064 1063876
60288 1063876 1054165 1046375 1040312 1035927 1032783 1030056 1027193 1024342 1021900 1019795 1017520 1014803 1011855 1008948
60274 1008948 1006163 1003661 1001762 1000533 999721 999408 1000230 1002492 1005430 1007922 1009729 1011503 1013826 1016867 1020796
60259 1020796 1025681 1030818 1034898 1037241 1038488 1039915 1042368 1045942 1050104 1053837 1056103 1056500 1055331 1052941
60245 1052941 1049426 1045076 1040580 1036422 1032490 1028652 1025353 1023155 1021921 1020919 1019715 1018627 1018255 1018791
60231 1018791 1019830 1020850 1021920 1023832 1027280 1031966 1036920 1041747 1047083 1053692 1061605 1070395 1079766 1089459
60217 1089459 1099091 1108676 1119006 1130892 1144163 1157868 1171312 1184384 1196960 1208624 1219121 1228710
60205 1228710 1237900 1247044 1256208 1265288 1274267 1283478 1293465 1304366 1315667 1326833 1337955 1349414 1361161
60192 1361161 1372792 1384229 1395879 1408193 1421446 1435783 1450953 1466105 1480447 1494111 1507783
60181 1507783 1521437 1534078 1544925 1554172 1562216 1568751 1573206 1575743 1577227 1578266 1578710 1578032 1575863 1572127
60167 1572127 1566895 1560093 1551347 1540269 1527087 1512759 1498207 1483547 1468383 1452749 1437431 1423278
60155 1423278 1410469 1398595 1387250 1376358 1366019 1356333 1347546 1340216 1334979 1332075 1331320 1332674 1336608
60142 1336608 1343628 1353554 1365576 1378988 1393565 1409242 1425757 1442757 1459921 1476790 1492671 1506871
60130 1506871 1518939 1528643 1536021 1541557 1546038 1550007 1553509 1556466 1558983 1561036 1562229 1562226 1561304 1560091 1558814
60115 1558814 1557083 1554379 1550432 1545152 1538481 1530383 1520819 1509846 1497987 1486354 1475932 1466649 1457591
60102 1457591 1448331 1439673 1432830 1428174 1425238 1423799 1424449 1427955 1434355 1442917 1452752 1463234 1473917 1484505
60088 1484505 1495088 1506132 1517803 1529231 1538793 1545342 1548974 1550354 1549469 1545460 1537737 1526889 1514200
60075 1514200 1500431 1485351 1468470 1449912 1430429 1410697 1390896 1371030 1351437 1332685 1314996
60064 1314996 1298059 1281600 1265949 1251799 1239391 1228226 1217616 1207349 1197699 1188955 1181162 1174313
60052 1174313 1168601 1164336 1161616 1160154 1159542 1159681 1160849 1163330 1167115 1172085 1178309 1185921 1194788 1204596
60038 1204596 1215279 1226969 1239365 1251519 1262599 1272580 1281773 1289823 1295740 1299026 1300303 1300540 1300023
60025 1300023 1298397 1295455 1291342 1286035 1279160 1270606 1260989 1251209 1241673 1232313 1223272 1215157 1208465 1203068
60011 1203068 1198497 1194521 1191097 1187820 1183874 1178716 1172506 1165663 1158291 1150328 1142055 1134008 1126332 1118663
59997 1118663 1110827 1103333 1096890 1091626 1087101 1083035 1079713 1077622 1076901 1077272 1078334 1079795 1081525 1083548
59983 1083548 1085978 1088849 1091978 1095067 1097991 1100893 1103943 1107037 1109863 1112297 1114619 1117204 1120066 1122846
59969 1122846 1125249 1127301 1129077 1130362 1130845 1130634 1130337 1130441 1130673 1130195 1128553 1126346 1124817 1124757 1125972 1127831
59953 1127831 1130118 1133099 1136868 1141049 1145279 1149652 1154366 1159041 1162752 1164869 1165655 1165913 1166082 1165825 1164474
59938 1164474 1161843 1158511 1155306 1152622 1150373 1148570 1147608 1147834 1148972 1150338 1151621 1153241 1155874 1159819
59924 1159819 1164949 1171076 1178184 1186302 1195348 1205126 1215390 1225886 1236461 1247268 1258828 1271694
59912 1271694 1285915 1300866 1315651 1329597 1342318 1353493 1362920 1370730 1377237 1382470 1386072 1387800
59900 1387800 1387869 1386706 1384643 1382097 1379760 1378226 1377521 1377322 1377525 1378250 1379327 1380141 1380030 1378518 1375195 1369885
59884 1369885 1363124 1356064 1349505 1343250 1336740 1330124 1324234 1319534 1315544 1311530 1307399 1303596 1300279 1297109
59870 1297109 1293935 1291252 1289637 1288970 1288657 1288544 1289113 1290695 1293016 1295742 1299024 1303052 1307405 1311293 1314244
59855 1314244 1316156 1316857 1316170 1314385 1312171 1309949 1307631 1304912 1301505 1297223 1292365 1287945 1285020 1283738
59841 1283738 1283504 1284057 1285758 1288842 1293030 1298058 1303861 1309997 1315612 1320334 1324529 1328249 1330662 1331108 1330014
59826 1330014 1327972 1324505 1318685 1310707 1301876 1293200 1284866 1277059 1270416 1265444 1262246 1260934 1261636 1263898
59812 1263898 1266793 1269915 1273667 1278226 1282805 1286370 1288542 1289361 1288660 1286322 1282842 1278937 1274673 1269628
59798 1269628 1264027 1259052 1255625 1253207 1250317 1246245 1241858 1238543 1236690 1235593 1234709 1234472 1235670 1238473
59784 1238473 1242464 1247324 1252943 1258995 1264945 1270512 1275694 1280216 1283421 1284961 1285264 1285104 1284948 1284862 1284718
59769 1284718 1284277 1283269 1281668 1279696 1277450 1274751 1271587 1268376 1265573 1263208 1261163 1259616 1258793 1258394 1257748
59754 1257748 1256603 1255362 1254401 1253488 1252142 1250341 1248637 1247591 1247272 1247275 1247193 1247063 1247413 1248790 1251192 1254094
59738 1254094 1257108 1260495 1264839 1270300 1276414 1282611 1288694 1294762 1301027 1307951 1316365 1326995 1339782
59725 1339782 1353846 1368196 1382324 1396132 1409521 1422132 1433379 1442684 1449815 1454920 1458011 1458529
59713 1458529 1455774 1449848 1441816 1432801 1423230 1413100 1402555 1391952 1381709 1372354 1364360 1357591 1351268
59700 1351268 1344969 1339396 1335626 1333798 1333086 1332885 1333544 1335820 1340029 1345699 1351752 1357123 1361609 1366094 1371574
59685 1371574 1378038 1384752 1391501 1398966 1407794 1417845 1428487 1439196 1449731 1460192 1471021 1482537
59673 1482537 1494324 1505502 1515715 1525402 1534946 1544114 1552549 1560297 1567575 1574483 1581330 1588839 1597591
59660 1597591 1607512 1618213 1629492 1641196 1652895 1664021 1674035 1682173 1687415 1689082 1687155 1681596
59648 1681596 1671739 1656921 1637590 1615244 1591340 1566620 1541466 1516404 1492080 1468950 1447115
59637 1447115 1426448 1407004 1389285 1373872 1360746 1349310 1339174 1330481 1323280 1317083 1311349 1305887
59625 1305887 1300420 1294336 1287518 1280845 1275079 1269584 1263028 1255180 1247091 1239572 1232451 1225477 1218967 1213173
59611 1213173 1207756 1202445 1197616 1193681 1190308 1186806 1183002 1179263 1175862 1172756 1169828 1166935 1163801 1160212
59597 1160212 1156342 1152589 1149070 1145491 1141566 1137458 1133728 1130879 1128908 1127377 1125986 1125019 1125048 1126211 1128042
59582 1128042 1130039 1132164 1134683 1137772 1141468 1145822 1150847 1156392 1162207 1168094 1173890 1179419 1184636 1189781
59568 1189781 1195272 1201401 1208151 1215251 1222430 1229673 1237197 1245073 1252861 1259807 1265431 1269777 1273103 1275554
59554 1275554 1277211 1278202 1278441 1277411 1274498 1269716 1263976 1258601 1254593 1252329 1251797 1252973 1256001 1261151 1268798
59539 1268798 1279322 1292737 1308175 1323755 1337157 1346552 1351244 1351758 1349404 1345598 1341311 1337135 1333716
59526 1333716 1331783 1331525 1332201 1332747 1332706 1332339 1331962 1331554 1330989 1330252 1329272 1327767 1325395 1321887 1317040 1310806 1303391
59509 1303391 1295042 1285690 1275145 1263758 1252588 1242639 1234005 1225984 1217943 1209974 1202740 1196790 1192031
59496 1192031 1187892 1184033 1180727 1178385 1176814 1175281 1173384 1171556 1170606 1170958 1172378 1174244 1175998 1177650
59482 1177650 1179955 1183823 1189315 1195397 1200936 1205852 1211125 1217783 1225985 1234924 1243465 1251006 1257936 1265247
59468 1265247 1273734 1283711 1295408 1309227 1325410 1343808 1364210 1386612 1410784 1435898 1460986 1485601
59456 1485601 1509541 1532053 1551852 1568012 1580326 1588707 1592808 1592610 1588961 1583020 1575317 1565757 1554461
59443 1554461 1542085 1529194 1515754 1501608 1487268 1473879 1462315 1452508 1443780 1435615 1427904 1420506
59431 1420506 1412929 1404665 1395734 1386700 1378222 1370764 1364730 1360539 1358432 1358329 1360037 1363478 1368607 1375372
59417 1375372 1384074 1395551 1410553 1428837 1449244 1470579 1491784 1511059 1525594 1533020 1533045 1527279
59405 1527279 1517774 1506388 1495276 1486895 1483116 1484737 1491717 1502938 1515374 1524636 1527444 1523469 1514454
59392 1514454 1502188 1487995 1473398 1459923 1448160 1437945 1429549 1423852 1421273 1421401 1423899 1428873 1435944
59379 1435944 1443788 1451290 1458706 1466995 1476317 1485706 1494040 1500789 1505898 1509357 1510978 1510492 1508004 1504375
59365 1504375 1500795 1497741 1494742 1491447 1488551 1487187 1487682 1489473 1492175 1496185 1502106 1509884 1518690 1527609
59351 1527609 1536483 1546135 1557635 1571119 1585498 1599353 1611863 1622761 1631851 1639039 1644552 1648627
59339 1648627 1651125 1651827 1650995 1649113 1646155 1641571 1635027 1626812 1617521 1607792 1598320 1589661 1581778 1574096
59325 1574096 1566151 1557981 1549857 1541985 1534519 1527569 1521042 1514697 1508376 1501874 1494614 1485893 1475648 1464642
59311 1464642 1453717 1443099 1432529 1421704 1410441 1398866 1387741 1378240 1371038 1365835 1362032 1359535
59299 1359535 1358514 1358669 1359294 1360008 1360984 1362504 1364648 1367407 1370672 1374108 1377406 1380748 1384673 1389335 1394185
59284 1394185 1398582 1402523 1406685 1411866 1418427 1426064 1434051 1441927 1449949 1458721 1468397 1478611 1489146
59271 1489146 1500257 1512114 1524372 1536514 1548186 1558897 1567854 1574713 1580207 1585363 1590166 1593609
59259 1593609 1595075 1595019 1594100 1592320 1589426 1585715 1581866 1578148 1574146 1569189 1562806 1554905 1545838 1536222 1526463
59244 1526463 1516475 1505978 1494948 1483635 1472322 1461307 1450952 1441534 1433128 1425802 1419704 1414653
59232 1414653 1409802 1404137 1397289 1389642 1381726 1373821 1366070 1358581 1351388 1344550 1338265 1332600 1327198 1321632
59218 1321632 1316037 1310956 1306524 1302340 1298304 1295064 1293250 1292547 1292001 1291162 1290653 1291505 1294069 1297644 1301223
59203 1301223 1304656 1308885 1314830 1322271 1330202 1338178 1346703 1356270 1366627 1377271 1388062 1398895 1409197
59190 1409197 1418376 1426554 1434316 1441787 1448372 1453406 1456646 1458213 1458408 1457657 1456287 1454233 1451182 1447071
59176 1447071 1442283 1437335 1432588 1428309 1424821 1422392 1420999 1420306 1419968 1420012 1420800 1422519 1424783 1426996 1429055
59161 1429055 1431297 1433694 1435518 1436101 1435564 1434479 1433062 1431104 1428550 1425815 1423532 1422224 1422061 1422687 1423478
59146 1423478 1424239 1425442 1427450 1429673 1431015 1431057 1430288 1429161 1427417 1424464 1419998 1414054 1406814 1398656 1390145
59131 1390145 1381701 1373351 1365014 1356984 1350003 1344853 1341818 1340504 1340232 1340728 1342336 1345454 1349892 1355073
59117 1355073 1360786 1367411 1375336 1384433 1394221 1404376 1414906 1425901 1437171 1448062 1457742 1465856 1472911
59104 1472911 1479775 1486769 1493379 1498891 1503094 1506274 1508738 1510527 1511541 1511794 1511517 1510992 1510319 1509381 1508019
59089 1508019 1506081 1503359 1499716 1495381 1490817 1486086 1480619 1473997 1466773 1460140 1454774 1450295 1445825 1440849
59075 1440849 1435552 1430632 1426777 1424143 1422334 1421027 1420340 1420376 1420640 1420372 1419265 1417472 1415050 1412038 1409009
59060 1409009 1406838 1405653 1404507 1402345 1398895 1394452 1389253 1383403 1377134 1370811 1364863 1359755 1355725 1352434
59046 1352434 1349280 1346218 1343875 1342659 1342189 1341893 1341706 1341775 1341879 1341693 1341370 1341350 1341656 1341886 1341822 1341649 1341603 1341804
59028 1341804 1342474 1343924 1346221 1349182 1352786 1357295 1362795 1368870 1374962 1380928 1386997 1393157 1398770 1402913
59014 1402913 1405047 1405299 1404113 1401799 1398454 1394167 1389121 1383621 1378126 1373107 1368654 1364434 1360476 1357841
59000 1357841 1357908 1360819 1365094 1369101 1372491 1375820 1379153 1381674 1382619 1382087 1380790 1379316 1377791 1376027 1373787
58985 1373787 1370988 1367787 1364488 1361289 1358161 1355126 1352689 1351789 1353005 1355874 1359382 1363253 1368308 1375226
58971 1375226 1383432 1391758 1399836 1408101 1416628 1424883 1432710 1440665 1449039 1457321 1465056 1472519 1479954 1486727
58957 1486727 1491872 1495068 1496483 1496086 1493696 1489396 1483270 1475085 1464846 1453318 1441194 1428069 1413067
58944 1413067 1396414 1379488 1363310 1347873 1333103 1319520 1307464 1296373 1285394 1274329 1263652
58933 1263652 1253933 1245565 1238615 1232658 1227081 1221876 1217740 1215037 1213087 1210913 1208404 1206283 1205185 1205196
58919 1205196 1206128 1207736 1209704 1211863 1214476 1217993 1222559 1228039 1234446 1241963 1250533 1259828 1269685 1280272
58905 1280272 1291655 1303541 1315632 1328029 1341028 1354711 1368959 1383735 1399035 1414610 1430025
58894 1430025 1445185 1460652 1477377 1496106 1516973 1539455 1562674 1585916 1608968 1631807 1653955
58883 1653955 1674374 1692178 1707251 1719910 1730110 1737335 1741242 1742105 1740547 1737110 1732157 1725957 1718744
58870 1718744 1710859 1702839 1695124 1687637 1679985 1672115 1664454 1657264 1650266 1643183 1636254 1629869 1623980 1618236
58856 1618236 1612455 1606587 1600532 1594527 1589547 1586694 1586173 1587314 1589533 1592683 1596349 1599500 1601181 1601159 1599542
58841 1599542 1596095 1590268 1581667 1570215 1556067 1539699 1521939 1503583 1485000 1466253 1447457 1428823
58829 1428823 1410452 1392332 1374500 1357063 1340185 1324229 1309737 1296991 1285693 1275307 1265698
58818 1265698 1257159 1249846 1243543 1238002 1233212 1229169 1225696 1222724 1220534 1219403 1219111 1219124 1219254 1219859 1221327
58803 1221327 1223630 1226458 1229580 1232937 1236605 1240843 1245948 1251822 1257823 1263336 1268419 1273693 1279711 1286701
58789 1286701 1294781 1304046 1314402 1325715 1338151 1352049 1367384 1383722 1400783 1418646 1437191 1455682
58777 1455682 1473091 1488549 1501323 1510855 1517180 1520952 1522657 1522081 1518888 1513388 1506325 1498214 1489368
58764 1489368 1480275 1471365 1462541 1453533 1444604 1436408 1429260 1423136 1418234 1414877 1412879 1411770 1411753 1413627
58750 1413627 1417478 1422169 1426546 1430530 1434535 1438397 1441629 1444346 1447187 1450358 1453354 1455681 1457425 1459024
58736 1459024 1460778 1462656 1464332 1465412 1465878 1466355 1467664 1470031 1472908 1475698 1478513 1482040 1486651 1491795
58722 1491795 1496458 1500261 1503906 1508430 1514138 1520588 1527400 1534627 1542220 1549543 1555718 1560168 1562631 1562910
58708 1562910 1560944 1556954 1551123 1543091 1532036 1517351 1499196 1478380 1455758 1431705 1406188 1379328
58696 1379328 1351731 1324129 1296876 1270166 1244662 1221389 1200837 1182537 1165707 1149997 1135428
58685 1135428 1122088 1110248 1100443 1093027 1087829 1084564 1083270 1083936 1086036 1089021 1093167 1099365 1108070 1118886
58671 1118886 1131145 1144401 1158318 1172659 1187589 1203556 1220608 1238086 1255042 1270533 1283371
58660 1283371 1292200 1296342 1296349 1293271 1287559 1279095 1268112 1255477 1241939 1227555 1212161 1196103 1180141
58647 1180141 1164737 1149810 1135279 1121530 1109195 1098610 1089727 1082387 1076408 1071436 1067056 1063139
58635 1063139 1059795 1056904 1054034 1051081 1048672 1047526 1047560 1047994 1048293 1048578 1049135 1049965 1050953 1052116 1053491 1055072
58619 1055072 1057035 1059697 1063021 1066442 1069505 1072449 1075786 1079441 1082729 1085171 1087001 1088779 1090795 1092971
58605 1092971 1095112 1097098 1098925 1100632 1102160 1103303 1104015 1104708 1105994 1108029 1110354 1112519 1114646 1117199
58591 1117199 1120422 1124304 1128993 1134861 1142033 1150046 1158135 1165894 1173602 1181969 1191529 1202308 1213990
58578 1213990 1226261 1238787 1251052 1262649 1273874 1285629 1298412 1311713 1324717 1337390 1350500
58567 1350500 1364839 1381024 1399889 1422321 1448446 1477436 1508293 1540380 1573046 1605345 1636447
58556 1636447 1665817 1692557 1715059 1731968 1743293 1750026 1752795 1751442 1745855 1736603 1724532 1710081
58544 1710081 1693148 1673491 1651140 1626468 1599786 1570862 1539098 1504436 1467852 1430731 1394045
58533 1394045 1358508 1325103 1294834 1267996 1244266 1223485 1205845 1191326 1179576 1170501 1164357 1160956
58521 1160956 1159221 1157895 1156483 1155249 1154565 1154481 1154732 1154958 1154981 1154907 1154706 1153761 1151162 1146608 1140700 1134249 1127630
58504 1127630 1120946 1114461 1108536 1103344 1098897 1095224 1092344 1090137 1088361 1086762 1085228 1084020 1083750 1084800
58490 1084800 1086804 1089133 1091944 1096265 1102835 1111308 1120893 1131466 1143651 1157983 1174250 1191495 1208474
58477 1208474 1224218 1238301 1250481 1260097 1266125 1267924 1265644 1259815 1250866 1239223 1225503 1210410
58465 1210410 1194648 1179116 1164854 1152540 1142236 1133800 1127341 1123205 1121776 1123374 1127914 1134522 1141890
58452 1141890 1149226 1156528 1163741 1170145 1174826 1177314 1177420 1174907 1169852 1163032 1155529 1148068 1140964 1134334
58438 1134334 1128056 1121862 1115899 1110869 1107212 1104422 1101651 1098770 1096424 1095316 1095827 1098075 1101814 1106418
58424 1106418 1111379 1116699 1122477 1128403 1134019 1139127 1143425 1146106 1146453 1144661 1141455 1137068 1131179 1123718
58410 1123718 1115059 1105480 1095131 1084556 1074536 1065244 1056198 1047320 1039503 1033800 1030405 1028703 1027978
58397 1027978 1027840 1028248 1029466 1031778 1034970 1038229 1040791 1042638 1044359 1046339 1048332 1049907 1051100 1052292
58383 1052292 1053462 1054097 1054166 1054744 1056974 1060630 1064488 1068196 1072829 1079297 1087102 1095198 1103365 1111950 1120934
58368 1120934 1130165 1140065 1151083 1162601 1173348 1183005 1192613 1203225 1214783 1226510 1237842 1248678
58356 1248678 1259021 1268650 1277063 1283721 1288468 1291574 1293388 1294238 1294771 1295826 1297593 1299463 1301180 1303665
58342 1303665 1308090 1314560 1322349 1331008 1340557 1350964 1362321 1375285 1390443 1407310 1424666 1441780
58330 1441780 1458590 1474888 1490147 1504084 1516578 1527051 1534802 1540066 1544068 1547933 1552109 1556785
58318 1556785 1562140 1568157 1574810 1582505 1591735 1602339 1613692 1625551 1638207 1651965 1667034 1683642
58306 1683642 1701502 1719440 1736353 1752345 1768180 1784005 1799547 1815198 1831656 1848643 1865134
58295 1865134 1880844 1896376 1911960 1927317 1942797 1959389 1977399 1996284 2016014 2037382 2060683
58284 2060683 2085197 2110281 2135956 2162305 2189457 2218341 2250117 2284535 2320098 2356252 2394209
58273 2394209 2435205 2479255 2526099 2576137 2629826 2687234 2748706 2814763 2884746 2956674 3029108
58262 3029108 3102160 3176274 3251111 3326110 3401012 3475300 3548320 3620439 3692983 3766712 3841568
58251 3841568 3918170 3997905 4081155 4167189 4256514 4351579 4454233 4564169 4680759 4804669
58241 4804669 4936553 5075933 5222764 5378627 5545027 5721876 5908985 6107663 6319522
58232 6319522 6545071 6784891 7040935 7315251 7608602 7921669 8256568 8616040 9002447
58223 9002447 9418594 9868132 10354016 10878044 11443099 12054453 12718060 13439524 14225998
58214 14225998 15087377 16034760 17080122 18238804 19530295 20975981 22599642 24432248
58206 24432248 26514276 28893235 31624044 34774730 38428503 42678958 47628868 53397272
58198 53397272 60123673 67964356 77094313 87721073 100092183 114482121 131170383
58191 131170383 150415934 172398632 197103383 224173931 252781765 281527955 308414375
58184 308414375 331000120 346843158 354124138 352143143 341429706 323477962 300319233
58177 300319233 274113848 246822545 219980213 194611481 171289007 150261860 131572052
58170 131572052 115134270 100792470 88358893 77632942 68409566 60489822 53691182
58163 53691182 47849963 42819752 38473110 34703552 31422166 28552590 26030251 23802963
58155 23802963 21828099 20069131 18495774 17084767 15817405 14676723 13648003 12719720
58147 12719720 11881561 11122466 10432088 9802737 9228250 8702262 8219071 7774863 7366373
58138 7366373 6989398 6639998 6316069 6016292 5738457 5479982 5239003 5013833 4802466
58129 4802466 4603796 4418246 4245920 4085081 3933543 3790444 3655525 3527740 3405948
58120 3405948 3290106 3180568 3076956 2978765 2886208 2799285 2716804 2637444 2561078 2488066 2418100
58109 2418100 2350840 2286883 2226861 2170228 2116083 2064617 2016600 1971989 1930159 1891073 1855027
58098 1855027 1821495 1789253 1757514 1726153 1695063 1664016 1633026 1602250 1571763 1541835 1513015
58087 1513015 1485545 1459180 1433908 1410168 1387969 1366542 1345324 1324445 1303764 1282448 1260223
58076 1260223 1238049 1216676 1195482 1173642 1151523 1129850 1108399 1086761 1065732 1046619 1029620
58065 1029620 1013964 999190 985174 971461 957823 945087 934142 924355 914125 902836 891141
58054 891141 879509 867726 855751 843966 832492 821180 810286 800226 790650 780688 770161 759732
58042 759732 749847 740366 731231 722666 714631 706849 699425 692674 686343 679780 672885 666091 659381 652141
58028 652141 644159 635971 628013 620130 612142 604268 596774 589776 583565 578561 574703 571308 567690 563611
58014 563611 559186 554799 551040 548192 545741 542875 539428 535926 532806 530139 528003 526556 525767 525550 526005
57999 526005 526990 527799 527978 528188 529377 531303 532915 534104 535850 538440 540797 542113 543080 544726 546875
57984 546875 548554 549343 549431 548743 546905 544075 541185 539261 538741 539304 540076 540164 539390 538535 538717 540517 543682
57967 543682 547422 550907 553663 555717 557270 558241 558286 557171 554873 551402 546861 541696 536454 531249 525784
57952 525784 519975 514164 508722 503837 499820 497192 496269 496927 498882 501870 505492 509299 513262 517821 523329
57937 523329 529674 536577 543956 551868 560385 569547 579062 587967 594984 599471 601786 602596 602230 600836 598791
57922 598791 596609 594606 592799 590954 588727 586005 583208 580965 579451 578399 577773 577926 578836 579646 579363
57907 579363 577787 575489 573066 570658 568037 564923 561264 557311 553292 549060 544296 539087 533965 529275
57893 529275 524803 520175 515308 510411 505863 502258 500114 499234 498616 497371 495565 493877 492580 491250 489434
57878 489434 487273 485208 483219 480648 477057 473066 469916 468036 466530 464435 462055 460477 460080 460319 460900
57863 460900 462380 465376 469850 475451 482029 489536 497824 506819 516460 526281 535409 543253 549808 555146
57849 555146 559021 561173 561548 559996 556292 550709 544036 536617 527893 517350 505507 493409 481477
57836 481477 469353 456668 443537 430509 418437 408211 400138 393666 388008 382884 378441 374717 371577
57823 371577 368941 366723 364682 362633 360615 358575 356148 353063 349590 346267 343353 340852 338828 337359
57809 337359 336327 335514 334746 333766 332279 330432 328873 327990 327458 326994 327197 329046 332667 337097 341189 344354
57793 344354 346572 348175 349641 351307 353296 355802 359042 362581 365172 365873 365089 363938 362864 361536 359912
57778 359912 358538 357729 357186 356634 356237 356145 356129 355865 355205 353961 351839 348764 345002 340844 336467 332183 328427
57761 328427 325361 322771 320463 318480 316851 315389 313827 311992 309920 308066 307224 307818 309294 310650 311499
57746 311499 312131 312677 312865 312666 312449 312247 311512 309963 308065 306277 304305 301611 298251 294681 291053 287266
57730 287266 283541 280393 278022 276147 274404 272573 270451 267858 264919 262156 260245 259683 260472 261854 262525
57715 262525 261509 259002 256177 254099 252896 251958 250755 249335 248126 247322 246586 245407 243722 242073 241085
57700 241085 240888 241109 241339 241495 241749 242202 242734 243231 243924 245259 247331 249650 251712 253645 256006 259090
57684 259090 262844 267411 273260 280651 289457 299737 312107 327193 345065 365671 389691 418458
57672 418458 452959 493168 538418 588190 642342 700617 761750 822703 878500 923002 950547
57661 950547 957756 944565 913865 870063 817712 760984 703558 648235 596527 549007 506100 468204
57649 468204 435074 405810 379813 357347 338725 323349 310203 299018 290241 283734 278218 272337
57637 272337 265849 259413 253533 248184 243257 238782 234638 230497 226383 222952 220801 219617 218425 216714
57623 216714 214871 213310 211642 209114 205668 202019 198763 195897 193285 191048 189250 187607 185885 184334
57609 184334 183321 182701 181910 180640 179136 177826 176927 176365 175845 175044 173969 173145 173190 174134 175371 176300 176820
57592 176820 177113 177219 176988 176274 174969 172999 170557 168249 166718 166032 165641 165071 164490 164372 164659 164545 163252
57575 163252 160938 158690 157604 157943 159127 160392 161288 161611 161073 159329 156448 153202 150622 149195 148578
57560 148578 148106 147394 146363 144967 143216 141458 140308 140100 140505 140774 140419 139628 139087 139359 140406 141692
57544 141692 142740 143506 144239 145141 146285 147714 149367 150932 151968 152278 152062 151677 151256 150543 149141 147039
57528 147039 144904 143604 143310 143316 142925 142237 141791 141737 141851 142190 143118 144566 145829 146330 146244 146169 146477 147178 148049
57509 148049 148702 148844 148746 149144 150396 151919 152812 152843 152552 152495 152680 152660 151962 150530 148956 148145 148512 149550
57491 149550 150334 150309 149453 148013 146489 145706 146260 147717 148753 148360 146775 145055 143938 143362 143026 143075 143997
57474 143997 145868 147916 149087 149054 148546 148590 149579 151084 152414 153180 153522 154006 155270 157542 160430 163226
57458 163226 165334 166435 166488 165847 165228 165175 165450 165182 163776 161600 159733 159099 159933 161921 164644 167714 170604
57441 170604 172688 173796 174635 176227 178800 181515 183547 185111 186986 189189 190644 190337 188406 185865 183453
57426 183453 181072 178287 175069 171910 169260 167065 165002 163131 162067 162337 163715 165471 167245 169384
57412 169384 172316 175899 179654 183489 187865 193168 199117 204856 209426 212032 212088 209416 204528 198492 192320
57397 192320 186504 181154 176343 172114 168314 164712 161296 158254 155629 153208 150814 148561 146717 145434
57383 145434 144664 144256 144103 144230 144703 145329 145567 144945 143583 142092 141001 140461 140395 140547 140371 139313 137452
57366 137452 135545 134171 133095 131776 130285 129355 129553 130701 132146 133368 134245 134874 135256 135268 135005 135034 136000
57349 136000 137891 139925 141304 141941 142403 143303 144842 146672 148091 148597 148457 148487 149117 149901 150172 149909 149669
57332 149669 149831 150223 150428 150227 149811 149705 150256 151101 151398 150833 150093 150034 150614 151078 150995 150626 150403 150515 151085
57313 151085 152276 154062 156099 157996 159633 161241 163240 165780 168244 169464 168862 167243 166122 166283 167337
57298 167337 168524 169482 170199 170799 171587 172967 175056 177539 180022 182371 184622 186740 188615 190244 191837
57283 191837 193713 195919 197961 199182 199583 199957 200934 202207 203140 203765 204553 205459 206013 206371 207485 209925
57267 209925 213215 216647 220113 223678 226877 229193 230973 233225 236407 239903 242866 245259 247836 251177
57253 251177 255006 258507 261217 263384 265488 267707 270015 272530 275413 278604 281956 285534 289426 293407
57239 293407 297250 301216 305743 310646 315242 319393 323823 329142 335051 340864 346440 352237 358738 366159
57225 366159 374486 383400 392275 400573 408224 415514 422700 429843 436912 443952 451249 459326 468555 478749
57211 478749 489366 500052 510718 521158 531127 540910 551328 562897 575402 588553 602616 618019
57199 618019 634686 652195 670422 689583 709719 730435 751154 771475 791358 811053 830740
57188 830740 850177 868902 886844 904471 922323 940752 960186 981171 1003860 1027828 1052640
57177 1052640 1078257 1104605 1131162 1157358 1183142 1208833 1234628 1260597 1286914 1313762 1341121
57166 1341121 1368723 1395908 1421448 1444127 1463955 1482405 1501003 1519954 1538584 1556694 1574878
57155 1574878 1593686 1613068 1632600 1651888 1670817 1689700 1708945 1728317 1746894 1764124 1780621
57144 1780621 1797490 1815294 1834149 1854276 1875646 1897468 1918967 1940561 1963421 1987947 2013462
57133 2013462 2039399 2065859 2092958 2120595 2149183 2179725 2212689 2247436 2283176 2319822 2357380
57122 2357380 2395088 2431936 2467881 2504077 2542008 2582696 2626622 2674141 2726070 2783999 2849807
57111 2849807 2924753 3009291 3103839 3209328 3326767 3456809 3600374 3759750 3938919 4143018
57101 4143018 4377900 4650191 4967411 5337724 5769514 6271332 6852303 7522429 8291947
57092 8291947 9169918 10163091 11275257 12505991 13848654 15289468 16808319 18378479
57084 18378479 19963230 21513620 22973808 24292856 25433052 26367939 27074834 27531896
57076 27531896 27722846 27643910 27307086 26738638 25974332 25053037 24010984 22879077 21683220
57067 21683220 20445377 19183926 17914333 16650820 15407840 14200059 13041282 11943486
57059 11943486 10916189 9965903 9095780 8305688 7592580 6951161 6375018 5857722 5393013
57050 5393013 4974248 4594484 4247740 3930165 3639715 3374897 3133992 2915150 2716569
57041 2716569 2536353 2372368 2222371 2084222 1956072 1836604 1725195 1621761 1526368 1438931
57031 1438931 1359076 1286096 1219022 1156935 1099307 1045990 996849 951501 909402 870123 833463
57020 833463 799343 767615 737998 710227 684246 660107 637630 616338 595889 576408 558091
57009 558091 540565 523044 505281 488020 472234 458102 444991 432245 419715 407624 396268
56998 396268 385839 376306 367509 359582 353171 348932 346795 346039 346059 346750 348252 350809 354910 360991 368730
56983 368730 377046 385038 392425 398804 403105 404369 402671 398677 392636 384639 375701 367690 361848 357912
56969 357912 354876 352193 349959 348387 347578 347673 348996 351979 356944 363841 372298 381992 392765 404028
56955 404028 414328 422029 426362 427319 424699 418065 407800 395378 382175 368667 355235 343054 333352
56942 333352 326124 320422 315842 313038 312703 314754 318819 325080 334242 346725 362034 378862 395749
56929 395749 411639 425757 436891 443118 442684 435310 422461 406353 388803 370868 353133 336002
56917 336002 319823 304911 291470 279478 268712 259011 250417 243028 236764 231391 226779 223068 220510
56904 220510 219167 218820 219073 219482 219660 219550 219693 220933 223623 227338 231613 236723 243293 251360 260402 270320
56888 270320 281672 294619 308226 321259 333269 344352 354096 361378 365232 365515 362786 357939 351986
56875 351986 345777 339817 334518 330638 329095 330316 334083 340170 348865 360704 375999 394861 417433
56862 417433 443685 472943 503930 535311 565895 594096 617469 633271 639785 637051 626451 609926
56850 609926 589765 568561 548602 531077 516220 504275 495986 492183 493439 500402 513993 534805
56838 534805 562560 596570 636524 682315 733004 786243 838574 886032 924551 950479 961241
56827 961241 955887 935355 902444 861190 815647 768927 723349 681114 644254 613919 590207 572911
56815 572911 562100 557904 560221 569027 584634 607147 635723 668686 704250 740615 775156 803994
56803 803994 822965 829291 822391 803321 773901 736563 694558 651544 610475 572919 539434 510335
56791 510335 485986 466608 452210 442646 437533 436249 438393 444284 454658 469634 488014 507613
56779 507613 526045 541160 551095 554386 550233 538695 520609 497371 470686 442359 414178 387767
56767 387767 364311 344221 327043 311804 297615 284122 271496 260084 250082 241517 234381 228626
56755 228626 224019 220115 216421 212623 208703 204954 201734 199061 196535 193908 191568 190027 189008 187566
56741 187566 185295 182806 180725 178836 176750 174907 174055 173972 173573 172350 170945 170098 169748 169499 169347 169508
56725 169508 169997 170829 172237 174198 176075 177274 178049 179063 180319 181115 181073 180588 180141 179769 179457 179556 180295
56708 180295 181158 181285 180467 179406 178989 179553 180847 182381 183698 184578 185232 186173 187697 189514 191008 191856
56692 191856 192253 192548 192788 192743 192318 191822 191728 192128 192573 192558 192079 191504 190983 190313 189568 189447 190559 192472 193942
56673 193942 194203 193744 193702 194809 197021 199847 202728 205263 207431 209598 212136 215032 217938 220521 222628
56658 222628 224235 225452 226578 227963 229695 231444 232628 232842 232263 231660 231800 232754 233930 234860 235732 236952
56642 236952 238440 239730 240722 241987 244115 246908 249350 250422 249977 248881 248206 248224 248225 247356 245514 243305
56626 243305 241297 239555 237871 236166 234575 233197 231949 230690 229440 228308 227129 225360 222651 219483
56612 219483 216868 215328 214510 213948 213725 214019 214427 214356 213940 213966 214787 215833 216318 216004 215063 213658 211991 210514
56594 210514 209642 209323 209188 209096 209319 210086 211195 212188 212841 213356 214088 215168 216405 217427 217907 217842 217752 218443
56576 218443 220250 222527 224217 225024 225718 227186 229470 231964 234190 236032 237493 238698 240126 242439 245972
56561 245972 250575 255909 261634 267384 272895 278247 283709 289266 294497 299025 302820 305963 308271 309373
56547 309373 309085 307663 305689 303734 302050 300517 298938 297377 296205 295753 295889 295874 294772 292185 288637
56532 288637 285108 282192 279849 277834 275997 274120 271906 269319 266600 263799 260661 257214 253995 251389
56518 251389 249113 246738 244315 241997 239511 236622 233880 232168 231614 231537 231409 231284 231309 231414 231552 231723 231719
56501 231719 231310 230660 230059 229340 228186 226957 226460 226780 227076 226764 226248 226209 226822 227978 229615 231364 232459
56484 232459 232536 232068 231527 230561 228581 225841 223374 222032 222092 223499 225837 228124 229308 229201 228621 228470 228926
56467 228926 229582 230082 230441 230854 231388 231916 232327 232748 233471 234689 236317 238004 239253 239687 239322 238472 237265
56450 237265 235562 233630 232500 233059 234947 236922 238236 239044 239518 239475 239092 239188 240271 241827 243019 243612
56434 243612 243819 243717 243370 243236 243802 244907 245809 245971 245619 245617 246791 249054 251207 252041 251759 251771 252920 254549
56416 254549 255585 255831 255702 255299 254484 253465 252624 251996 251425 250976 250783 250818 251237 252502 254576 256457 257172
56399 257172 256908 256502 256210 255779 255358 255374 255661 255670 255588 256296 258087 260209 261881 263029 263841 264390 264936 265948
56381 265948 267476 269063 270551 272350 274612 276761 278263 279306 280310 281254 281973 282610 283235 283490 283252 283301
56365 283301 284564 286809 288827 289919 290510 291175 291698 291562 290888 290364 290416 290875 291435 291996 292505 292813 292926 293188
56347 293188 293944 295113 296260 297014 297269 297149 297085 297819 299870 302906 305917 308121 309455 310179 310499 310753 311524
56330 311524 313107 315098 316894 318425 320087 322121 324451 327013 329826 332695 335173 336931 338041 338882
56316 338882 339836 340979 341972 342415 342397 342507 343111 343904 344426 344829 345779 347690 350323 353071 355435 357317 359073
56299 359073 361236 364068 367413 370941 374213 376586 377591 377675 378070 379571 381853 384265 386728 389398 392085
56284 392085 394706 397768 401536 405118 407439 408985 411525 415971 421388 426341 430387 433938 437471 441331
56270 441331 445753 450631 455639 460826 466655 473236 480085 487032 494829 504327 515407 527271 539552
56257 539552 552674 567284 583797 602468 623445 646617 671660 698413 727205 758742 793634
56246 793634 831872 872680 914901 957595 1000384 1043426 1087077 1131233 1174680 1215217 1250823
56235 1250823 1280668 1304813 1323132 1335034 1340202 1339035 1332112 1319562 1301240 1277345 1248727 1216737
56223 1216737 1182814 1147947 1112360 1075918 1038961 1002621 968120 935898 905528 876417 848443
56212 848443 821913 797072 773856 752130 731945 713367 696276 680702 667203 656359 647830 640422
56200 640422 633247 626295 619770 613589 607889 603256 599856 596946 593947 591433 590236 590055 589863 589398 589282
56185 589282 589794 590531 591312 592545 594538 597150 600247 603826 607584 611003 613984 616813 619460 621553 623133
56170 623133 624800 626973 629543 632373 635614 639452 643997 649417 655692 662324 668918 675889 684008 693311
56156 693311 703224 713621 724953 737369 750638 765001 781210 799625 820156 843228 869918 900898
56144 900898 936202 976267 1022310 1075328 1135505 1202807 1277120 1357313 1441031 1525854 1609875
56133 1609875 1690777 1765501 1831719 1889219 1939347 1983628 2023196 2058603 2089394 2114335 2132514
56122 2132514 2143817 2148198 2145392 2135832 2120939 2101732 2077626 2047108 2009038 1962921 1908741 1847256
56110 1847256 1780045 1708887 1635679 1563177 1494753 1432647 1377088 1327593 1284306 1247477 1216603
56099 1216603 1190997 1170519 1154923 1143152 1134108 1127520 1123307 1120774 1119329 1119349 1121343 1124739 1128476
56086 1128476 1132330 1136787 1141981 1147692 1154102 1161598 1169997 1178718 1187550 1196622 1205894 1215300 1225149 1235789
56072 1235789 1247182 1259322 1272635 1287406 1303176 1319264 1335471 1351886 1368613 1386158 1405326
56061 1405326 1426024 1446904 1466913 1486450 1506282 1526110 1545260 1563986 1582912 1601752 1619850
56050 1619850 1637619 1656303 1676599 1698460 1721894 1746850 1772576 1798197 1823787 1850022 1877028
56039 1877028 1904530 1932902 1963031 1995228 2029153 2064731 2102381 2142419 2184958 2230249 2278562
56028 2278562 2329925 2384317 2441600 2500821 2560373 2619636 2679777 2742087 2806288 2871384 2937414
56017 2937414 3005316 3075699 3148836 3225238 3305108 3387789 3472807 3560938 3653245 3749754 3850201
56006 3850201 3955293 4066039 4182497 4304475 4432800 4568566 4711780 4862063 5020144
55997 5020144 5187343 5364152 5550596 5747439 5955856 6176591 6410607 6659709 6925347
55988 6925347 7207809 7507871 7828097 8171240 8538734 8932343 9355782 9812888 10305787
55979 10305787 10836978 11411739 12036308 12715335 13453711 14259462 15142470 16112257 17180210
55970 17180210 18362689 19679333 21150471 22800142 24660814 26772988 29183645 31950511
55962 31950511 35147278 38862237 43196238 48269283 54229764 61255803 69553766 79362128
55954 79362128 90950217 104599964 120583493 139148930 160486514 184636378 211351413
55947 211351413 239965146 269283216 297508166 322294850 341086325 351722985 353051958
55940 353051958 345200542 329415633 307647390 282103777 254879765 227687139 201721373
55933 201721373 177684465 155907269 136479807 119344745 104361388 91349871 80113505
55926 80113505 70447268 62147939 55026575 48913486 43656759 39123181 35200619 31794927
55918 31794927 28824465 26219856 23925997 21898581 20098357 18491316 17052195 15762610
55910 15762610 14605409 13563641 12623709 11775271 11007870 10310712 9675442 9096021 8565996
55901 8565996 8078791 7630405 7218801 6840481 6490377 6165237 5864486 5587386 5331699
55892 5331699 5095469 4877832 4677598 4492981 4323178 4168511 4028779 3903014 3790903
55883 3790903 3692607 3607062 3532017 3465739 3406843 3352324 3297641 3239136 3174832 3102815 3020922
55872 3020922 2928777 2828654 2723594 2615900 2507815 2402052 2300671 2204336 2113294 2028175
55862 2028175 1949425 1876877 1810358 1749860 1694697 1643315 1594343 1547230 1501812 1458155 1416976
55851 1416976 1379138 1344318 1311018 1278223 1246260 1215781 1186742 1158774 1131764 1105663 1080359
55840 1080359 1056006 1032880 1010711 988912 967594 947580 929119 911461 894047 877320 861879
55829 861879 847555 833875 820832 808607 796958 785419 773808 762114 750160 737713 724724
55818 724724 711291 697612 684111 671237 659063 647417 636469 626708 618226 610555 603425 597169
55806 597169 592100 587914 584169 581048 579275 579347 581082 583837 587015 590409 594010 597449 599853 600545 599700
55791 599700 597904 595225 591240 585911 579868 573664 567209 560019 551606 541556 529825 517179 504968
55778 504968 494116 484652 476379 469622 464998 462745 462572 463933 466106 468078 468656 466896 462554 456184
55764 456184 448766 441078 433439 426021 419114 412891 407152 401579 396082 390605 384918 378998 373423 368793
55750 368793 364842 360643 355798 350956 347070 344514 343008 342040 341233 340495 339856 338946 336843 332832 327215
55735 327215 320965 314688 308355 301951 295756 289960 284592 279942 276453 273877 271015 266695 260844 254471
55721 254471 248785 244402 241086 238120 235140 232572 231085 230752 231130 232002 233528 235701 238187 240689 242961
55706 242961 244473 244712 243914 242851 241763 240106 237513 234272 230612 226328 221516 216909 212939 209145 205145
55691 205145 201551 199066 197162 194646 191339 188318 186508 185821 185733 185961 186350 186720 187161 188060 189552 191194
55675 191194 192377 192776 192295 190938 188962 186907 185196 183835 182631 181567 180818 180523 180702 181271 182009 182638
55659 182638 183079 183557 184306 185239 186097 186873 187898 189458 191480 193725 196183 199031 202174 204942 206401 206026
55643 206026 204073 201291 198302 195219 191844 188110 184233 180442 176783 173331 170362 168017 165956 163759
55629 163759 161691 160551 160574 160942 160806 160464 161023 163047 166012 169052 171792 174365 176927 179262 180699 180467
55613 180467 178433 175402 172447 169993 167865 166028 164702 163719 162431 160627 159081 158754 159655 160860 161482
55598 161482 161296 160482 159206 157556 155675 153700 151580 149082 146135 143119 140585 138556 136362 133479 130323
55583 130323 127810 126158 124644 122711 120810 119777 119689 119824 119606 119177 118942 118945 118946 118881 118865 118713 117851 116024 113892
55564 113892 112439 111731 110753 108745 106295 104634 104172 104205 103948 103303 102602 102117 101933 101920 101669 100800 99433 98080
55546 98080 97049 96330 96019 96363 97213 97947 98251 98561 99398 100539 101193 100850 99703 98420 97730 98025 99107
55529 99107 100325 101065 101051 100245 98822 97303 96340 96062 95916 95371 94561 93998 93892 94012 94061 93929 93709 93633 93879
55510 93879 94316 94610 94641 94593 94497 94073 93200 92238 91630 91392 91252 90997 90469 89567 88603 88371 89404 91343 93292
55491 93292 94652 95272 95121 94330 93493 93401 94389 96221 98569 101271 104144 106943 109651 112545 115811 119213
55475 119213 122210 124328 125429 125684 125267 124184 122529 120806 119483 118139 115657 111676 107393 104366 102839
55460 102839 101881 100812 99632 98128 95653 92184 88851 86805 85999 85575 85059 84580 84137 83356 82070 80613
55444 80613 79376 78439 77874 78046 79196 80862 82128 82550 82542 82669 82858 82583 81680 80576 79754 79366 79433 80040
55426 80040 81096 82143 82624 82299 81282 79878 78511 77623 77446 77949 79008 80379 81504 81800 81374 81096
55410 81096 81597 82463 82749 82051 80702 79170 77748 76689 76208 76272 76671 77227 77710 77759 77248 76601 76378 76696
55392 76696 77369 78377 79691 80848 81294 81159 81080 81220 81072 80326 79368 78706 78435 78462 78766 79190 79432 79534 79973
55373 79973 80935 81891 82230 81979 81541 81010 80180 78993 77645 76370 75440 75189 75701 76586 77339 77839 78242 78622
55355 78622 79021 79701 80898 82288 83041 82584 81227 79995 79847 80907 82318 82978 82575 81778 81349 81280 81066
55338 81066 80540 79989 79543 78922 77922 76811 76050 75804 75909 76164 76517 77007 77658 78404 79024 79180 78640 77564
55320 77564 76545 76257 76936 78179 79286 79783 79621 79007 78317 78092 78752 80126 81444 81976 81605 80712 79734
55303 79734 79030 78937 79590 80707 81763 82394 82528 82235 81685 81130 80686 80223 79724 79653 80540 82142 83455 83806
55285 83806 83612 83775 84548 85410 85928 86258 86668 86965 86746 86025 85276 84876 84781 84824 85039 85524 86169 86799 87490 88442
55265 88442 89529 90236 90225 89802 89593 89814 90044 89772 89054 88514 88650 89248 89605 89305 88621 87998 87403 86502 85387
55246 85387 84671 84710 85069 85105 84867 84983 85667 86245 85941 84909 84155 84342 84912 84640 83019 80878 79531 79537 80469
55227 80469 81641 82626 83114 82839 81932 81047 80781 81125 81701 82294 82826 83044 82748 82347 82677 84049 85808 87093
55209 87093 87751 88195 88608 88755 88572 88470 88759 89065 88707 87592 86444 86032 86392 86907 87002 86702 86617 87502 89559
55190 89559 92056 93777 94077 93339 92254 91009 89500 88024 87131 86866 86731 86476 86369 86568 86840 87130 87816
55173 87816 88953 89824 89745 88930 88021 87175 86305 85883 86648 88495 90331 91214 91137 90624 90067 89603 89159 88483 87482
55154 87482 86588 86351 86655 86891 87000 87707 89424 91520 93046 93724 93826 93600 93267 93211 93588 94024 94160 94216 94522
55135 94522 94799 94519 93818 93404 93601 94075 94512 94985 95583 96210 96838 97503 97914 97604 96629 95632 95064 94798 94678
55116 94678 94854 95219 95142 94317 93443 93468 94384 95320 95630 95301 94494 93355 92318 91940 92245 92731 93173 93919 95198
55097 95198 96645 97833 98731 99223 98694 96820 94514 93341 93853 95065 95740 95676 95511 95740 96317 96941 97306
55080 97306 97199 96656 95985 95411 94817 94046 93311 92987 93082 93279 93493 94034 95095 96375 97296 97399 96491 94786
55062 94786 93021 92076 92186 92716 92956 92911 93142 94060 95602 97321 98520 98630 97886 97402 98037 99333 100095 99898
55044 99898 99363 99006 98626 98105 98020 98829 99936 100215 99322 98011 97257 97468 98417 99526 100246 100487 100676 101160
55026 101160 101684 101745 101317 100830 100493 100065 99349 98543 97971 97725 97741 97989 98444 98930 99110 98682 97729 96883 96874 97715
55006 97715 98581 98748 98462 98510 99173 100057 100787 101372 101938 102595 103517 104667 105491 105502 105143 105394 106407 107238 107185
54987 107185 106675 106443 106553 106761 107251 108289 109539 110394 110740 110766 110318 109134 107598 106588 106553 107218 108144 109069
54969 109069 109758 110124 110530 111431 112618 113360 113391 113272 113574 114178 114669 115011 115450 115981 116267 116060 115473 114811 114224
54950 114224 113578 112703 111746 111073 110763 110475 110061 109956 110636 111911 113171 114168 115095 116026 116834 117593 118535 119600
54932 119600 120541 121460 122692 124161 125488 126796 128752 131602 134831 138015 141390 145262 149504 154046 159258
54917 159258 165314 171597 177229 181737 184814 185968 185057 182737 179746 176020 171143 165344 159429 153939
54903 153939 149073 145202 142629 140853 138826 136109 133193 130600 128277 126108 124409 123544 123395 123540 123777
54888 123777 124274 125330 127051 129146 131079 132606 134091 136096 138858 142439 147089 152886 159164 164965
54874 164965 170126 175296 180718 185598 188944 190502 190489 188902 185512 180379 174020 167194 160651 154852 149753
54859 149753 145079 140874 137477 134906 132676 130388 128084 125821 123396 120806 118531 116917 115640 114199
54845 114199 112667 111477 110767 110427 110539 111196 112026 112469 112503 112557 112699 112495 111771 110985 110623 110639 110760 110963 111320
54826 111320 111610 111486 111030 110833 111417 112624 113654 113798 113175 112647 112896 113695 114271 114249 113924 113667 113470 113243
54808 113243 113210 113693 114624 115536 116082 116430 117103 118425 120112 121441 121896 121618 121105 120530 119595 118046 116095
54791 116095 114265 113009 112598 113158 114576 116447 118280 119760 120799 121475 122015 122655 123350 123788 123886 124186 125438
54774 125438 127787 130577 133057 135136 137403 140553 144901 150327 156506 163086 169694 175912 181448 186354
54760 186354 190840 194666 196882 196528 193661 189421 184962 180574 176010 171361 167176 163759 160750 157571
54746 157571 154103 150738 147900 145649 143704 141741 139706 137910 136793 136518 136854 137458 138145 138815 139305 139559
54730 139559 139876 140728 142291 144347 146689 149402 152636 156329 160301 164496 168936 173529 178077 182352 185955
54715 185955 188200 188514 187000 184317 180923 176698 171510 165837 160484 155828 151702 147962 144742 142041
54701 142041 139480 136768 134195 132299 131130 130138 128802 127129 125474 124137 123228 122740 122505 122160 121338 119983
54685 119983 118453 117305 116953 117433 118410 119403 120018 120031 119441 118580 118021 118028 118081 117288 115465 113571 112901 113966
54667 113966 116274 118918 121112 122388 122754 122651 122505 122340 121991 121596 121481 121606 121471 120711 119476 118200 117243
54650 117243 116827 116969 117329 117447 117256 117111 117255 117624 118240 119271 120382 120622 119533 117990 117277 117585 118145
54633 118145 118693 119860 121895 123902 124937 125254 125746 126496 126648 125706 124289 123351 123132 123168 123070 122922 123006 123374
54615 123374 123782 123950 123840 123656 123553 123415 123103 122880 123353 124781 126644 128153 129091 129841 130614 131046 130730 129808
54597 129808 128770 127919 127333 127168 127549 128203 128635 128752 128953 129524 130326 131182 132142 133098 133587 133371 132899 132756
54579 132756 132908 132972 132998 133350 133820 133616 132451 131119 130668 131356 132712 134200 135440 136022 135675 134593 133273
54562 133273 132025 130889 129968 129518 129646 130137 130656 130971 130982 130770 130663 131043 131925 132877 133510 133985 134874 136446
54544 136446 138250 139526 139998 140137 140595 141527 142575 143398 143965 144329 144359 143837 142713 141224 139944 139629 140690
54527 140690 142532 143772 143470 142062 140777 140234 140026 139650 139337 139694 140803 142065 142905 143355 143818 144394 144611
54510 144611 143972 142688 141692 141743 142615 143311 143022 141731 140044 138751 138510 139487 141066 142183 142275 141849 141940 143069
54492 143069 144842 146364 146870 146101 144482 142931 142222 142399 142973 143683 144765 146378 148105 149349 150088 150929
54476 150929 152379 154374 156592 158856 160992 162553 163121 162850 162383 162179 162242 162585 163513 165148 167026 168531
54460 168531 169485 169858 169190 167074 164208 162186 161832 162254 162030 160872 159577 158669 157794 156420 154545 152556
54444 152556 150886 149940 149955 150669 151370 151513 151180 150865 150950 151475 152167 152605 152506 151968 151354 150926 150736 150740 150772 150488
54424 150488 149701 148799 148391 148443 148252 147434 146498 146111 146263 146588 147094 148002 149091 149860 150272 150767 151484 152106 152541
54405 152541 153195 154239 155150 155432 155489 156230 157837 159369 159766 159052 158351 158755 160262 161882 162698 162658 162320 162044
54387 162044 161709 161121 160384 159767 159381 159081 158622 157925 157276 157207 157995 159319 160578 161448 161944 162062 161815 161596
54369 161596 162030 163293 164912 166437 167912 169427 170624 171106 171162 171605 172830 174342 175254 175105 174200 173276
54353 173276 172857 172836 172733 172338 171918 171708 171492 170892 169861 168657 167484 166390 165372 164380 163367 162516 162217
54336 162217 162524 162852 162501 161311 159514 157294 154972 153391 153378 154782 156571 157928 158742 159053 158757 158089
54320 158089 157694 157734 157478 156319 154770 153872 153878 154147 154177 154096 154096 153976 153466 152618 151676 150864 150430 150615 151283 151741
54300 151741 151287 149986 148744 148530 149556 151253 152939 154312 155307 155748 155467 154676 153871 153294 152733 151966 151127
54283 151127 150484 150136 150098 150416 150970 151402 151542 151700 152212 152897 153341 153577 154046 154872 155596 155716 155197 154369 153646
54264 153646 153387 153681 154138 154195 153755 153289 153195 153412 153738 154155 154564 154571 154001 153392 153473 154183 154648 154228 153223 152377
54244 152377 151958 151584 150809 149628 148369 147305 146520 146125 146405 147574 149375 151097 152108 152301 151969 151382
54228 151382 150635 149796 148938 148006 146866 145613 144677 144476 145038 146014 146983 147667 147961 147974 148005 148293 148727 148953 148812
54209 148812 148516 148336 148275 148215 148252 148637 149475 150653 151995 153218 153789 153255 151849 150462 149789 149778 150030 150387
54191 150387 150783 150873 150356 149530 149024 149001 149105 149204 149677 150786 152282 153808 155253 156450 157027 156925 156630 156445
54173 156445 155876 154337 152215 150544 149723 149223 148582 147953 147459 146694 145388 144080 143540 143773 144131 144270 144449
54156 144449 144878 145351 145713 146232 147191 148343 149099 149122 148502 147479 146314 145437 145394 146436 148212 149927 150795
54139 150795 150483 149331 148179 147745 148045 148512 148673 148513 148143 147516 146704 146152 146260 146839 147350 147582 147683 147582
54121 147582 147007 146146 145753 146286 147319 148172 148783 149604 150933 152719 154728 156435 157060 156362 155298 155204 156206
54104 156206 157061 156757 155716 155064 155231 155764 156181 156411 156516 156542 156765 157625 159107 160377 160383 158955 157109 156093
54086 156093 156132 156361 156060 155662 156161 157726 159466 160616 161418 162544 164097 165644 166961 168191 169423 170599
54070 170599 171912 173796 176405 179420 182585 186110 190280 194914 199486 203706 207621 211147 213786 214975
54056 214975 214593 213015 210711 207940 204840 201637 198602 195805 193037 190119 187240 184938 183652 183342 183559
54041 183559 183893 184275 184775 185209 185151 184430 183468 182967 183327 184475 186078 187688 188767 188943 188332 187395 186447 185498
54023 185498 184570 183802 183154 182347 181267 180121 178982 177594 175959 174745 174606 175252 175694 175357 174482 173454
54007 173454 172299 171020 169980 169563 169642 169649 169133 168144 167137 166553 166418 166415 166391 166630 167366 168202 168471 168180 168166 169146
53987 169146 170968 172948 174571 175676 176271 176541 176838 177384 178086 178825 179714 180840 181974 182764 183101 183052 182679
53970 182679 182146 181781 181674 181391 180509 179301 178515 178525 179152 180219 181727 183365 184390 184300 183286 181812 180151
53953 180151 178628 177848 178122 178930 179554 180220 181915 184913 188152 190473 192045 193944 196580 199222 201130
53938 201130 202553 204268 206627 209462 212611 216029 219503 222753 225850 229164 232808 236443 239642 242191
53924 242191 244120 245888 248538 253056 259260 265800 271657 277196 283278 289754 295426 299237 300793 299873
53910 299873 296325 290661 284053 277310 270301 262722 255025 248145 242550 237966 233849 229823 225787 221976
53896 221976 218797 216243 213591 210096 206016 202521 200409 199245 198010 196313 194664 193628 193096 192554 191782
53881 191782 190997 190323 189472 188142 186558 185328 184755 184551 184316 184011 183797 183626 183299 182856 182549 182380 181889 180649
53863 180649 178858 177334 176812 177282 177955 177954 177112 176098 175682 175899 176113 175922 175721 176100 176850 177042 176231 175173
53845 175173 174976 175750 176554 176585 175920 174984 173939 172952 172561 173101 173954 174101 173466 173081 173740 175027 176027 176504
53827 176504 176892 177482 178203 179030 180012 180835 180921 180215 179503 179606 180425 181089 181035 180677 180910 182099 183711 184977
53809 184977 185752 186537 187751 189253 190680 191927 193085 194146 195150 196475 198521 201013 203062 204139 204764
53794 204764 205931 207982 210248 211766 212191 212010 211969 212305 212515 211932 210469 208681 207061 205501 203593 201246
53778 201246 198793 196561 194584 192711 190813 188815 186735 184771 183302 182714 183155 184371 185703 186372 186014
53763 186014 184993 184040 183544 183268 182837 182356 182393 183316 184788 185990 186356 186082 185883 186240 186962 187514 187688 187791
53745 187791 188173 188742 189117 189147 189093 189262 189636 190008 190407 191158 192404 193706 194361 194181 193768 193874 194631 195617 196603
53726 196603 197865 199699 201949 204306 206797 209599 212420 214500 215408 215525 215604 216088 217088 218699 220882
53711 220882 223061 224364 224576 224625 225824 228593 232068 234916 236431 236919 237252 238192 240009 242522 245411 248498
53695 248498 251811 255357 258857 261796 263807 264930 265453 265553 265289 264890 264780 265170 265846 266529 267223 267942 268259
53678 268259 267624 266146 264624 263606 262834 261890 261050 260946 261514 261812 261037 259365 257617 256327 255384 254440 253394
53661 253394 252478 251966 251863 251862 251643 251184 250739 250525 250601 251011 251808 252794 253433 253306 252628 252109 252227 252811 253398 253897
53641 253897 254713 256188 258048 259518 260029 259775 259520 259873 260777 261710 262338 262936 264135 266201 268607 270413
53625 270413 271221 271652 272740 274848 277377 279560 281299 283054 285104 287219 289086 290837 292992 296022 300078
53610 300078 305087 310839 316880 322492 327129 330881 334328 337811 341120 344089 347192 351038 355368 359098
53596 359098 361487 362815 363643 363880 363032 361046 358390 355473 352515 349891 347989 346595 344950 342667 340187
53581 340187 338068 336254 334415 332669 331524 331191 331343 331485 331210 330216 328520 326742 325758 325825 326282 326325 325929
53564 325929 325775 326347 327347 328039 327982 327393 326868 326868 327427 328214 328884 329434 330290 331953 334478 337344 339978 342275
53546 342275 344450 346487 348084 349276 350754 353285 357006 361551 366705 372538 378898 385209 390993 396399
53532 396399 402042 408377 415342 422561 429825 437443 446172 456684 469020 482546 496480 510432 524477
53519 524477 538829 553523 568432 583536 599106 615550 633063 651549 670835 690756 710973
53508 710973 731014 750734 770533 790793 811279 831391 850908 870059 888965 907515 925892
53497 925892 944633 963886 983011 1001285 1018713 1035774 1052628 1068991 1084717 1100085 1115441
53486 1115441 1130816 1145981 1160739 1175206 1189852 1205113 1220730 1235633 1248774 1260064 1270243
53475 1270243 1279794 1288277 1294794 1298935 1301050 1301637 1300541 1296910 1290056 1280327 1268930 1256886 1244409
53462 1244409 1231337 1217692 1203442 1188075 1171038 1152540 1133472 1114466 1095466 1076268 1057014
53451 1057014 1037971 1019207 1000729 982696 965202 948042 930948 913963 897399 881537 866545
53440 866545 852655 840188 829412 820485 813507 808517 805346 803591 802869 803213 805120 809019 814598 820950
53426 820950 827527 834717 843229 853163 864168 876338 890337 906513 924441 943579 963909 985581
53414 985581 1008335 1031762 1055901 1081121 1107462 1134547 1162131 1190431 1219931 1251183 1284838
53403 1284838 1321412 1360778 1402084 1444441 1487638 1532107 1578287 1626183 1675474 1725774 1776622
53392 1776622 1827406 1877588 1927106 1976309 2025291 2073386 2119575 2163406 2205224 2245446 2283880
53381 2283880 2319972 2353474 2384560 2413326 2439439 2462284 2481230 2495715 2505394 2510398 2511278 2508345
53369 2508345 2501049 2488250 2469251 2444351 2414278 2379328 2339460 2295128 2247529 2197827 2146501
53358 2146501 2093614 2039478 1984837 1930675 1878001 1827428 1778640 1730663 1683019 1636212 1590651
53347 1590651 1545669 1500441 1455542 1412556 1372146 1333484 1295797 1259473 1225233 1193127 1162949
53336 1162949 1134911 1109204 1085400 1063042 1042483 1024471 1009074 995568 983160 971431 960301
53325 960301 950018 940945 932956 925370 917902 911258 906231 902627 899732 897460 896267 896183 896782 898060 900524
53310 900524 904442 909712 916441 924843 934485 944507 954776 966081 978894 992728 1007133 1022635
53298 1022635 1040081 1059477 1080104 1101551 1124139 1148300 1173836 1199829 1225246 1249740 1273795
53287 1273795 1297864 1321496 1343672 1363899 1382477 1399678 1415187 1428514 1439446 1447910 1453797 1457105
53275 1457105 1457879 1455943 1451175 1444120 1435724 1426233 1414880 1400913 1384355 1365497 1344298 1320782 1295528
53262 1295528 1269217 1242099 1214313 1186225 1157951 1128949 1098825 1068271 1038557 1010248 982960
53251 982960 956284 930368 905509 881591 857997 833899 808775 782914 757243 732435 708406
53240 708406 684955 662521 641813 622900 605201 588286 572265 557446 543964 531726 520426
53229 520426 509755 499866 491455 484978 479932 475241 470136 464331 457629 449919 441461 432650 423589 414310
53215 414310 405225 396775 388706 380350 371673 363475 356452 350528 345251 340374 335833 331489 327087 322285
53201 322285 316787 310684 304607 299184 294466 290270 286847 284567 283014 281100 278241 274817 271362 267991
53187 267991 264873 262517 261055 259777 257970 255921 254552 254194 254194 253647 252229 250319 248517 247018 245402
53172 245402 243221 240772 238969 238348 238490 238593 238272 237625 236795 235750 234282 232139 229439 226971 225657 225524
53156 225524 225721 225780 226246 227628 229279 230052 229707 229020 228682 228777 229196 229784 229978 229020 226879 224534 223073 222807
53138 222807 223414 224555 226050 227728 229393 230897 232111 233019 233894 235121 236679 238047 238839 239304 239936 240759
53122 240759 241353 241534 241609 241904 242327 242591 242698 242984 243778 245151 246887 248499 249320 248860 247196 244945 242807
53105 242807 241135 239852 238562 236772 234283 231494 229081 227285 225719 224038 222464 221354 220539 219595 218668
53090 218668 218474 219365 220818 222128 223306 224957 227325 229695 230864 230226 228384 226612 225720 225644 226106 227232
53074 227232 229054 230810 231348 230280 228272 226222 224613 223587 223029 222441 221311 219778 218421 217353 216186
53059 216186 215038 214715 215467 216383 216657 216731 217353 218125 218058 217197 216592 216717 216919 216588 215929 215251 214370 213171 212167
53040 212167 211934 212316 212602 212230 211092 209502 208171 207901 208912 210564 211910 212328 211570 209678 207159 204884
53024 204884 203376 202376 201446 200737 200666 201070 201285 201118 201173 201934 202965 203443 203245 203040 203359 204056 204881 206142
53006 206142 208289 210964 213009 213577 212906 211827 210894 210310 210313 211045 212157 213062 213620 214137 214675 214904 214744 214608
52988 214608 214759 214889 214717 214610 215131 216273 217564 218692 219548 219867 219458 218745 218523 219022 219694 220042 220185 220432
52970 220432 220772 221176 221949 223347 225044 226460 227479 228433 229411 230042 229951 229080 227470 225173 222540 220224
52954 220224 218546 217135 215519 213913 213032 213159 213725 213889 213260 211985 210389 208805 207658 207391 208138 209413
52938 209413 210299 210085 208835 207280 206157 205660 205497 205261 204717 203975 203533 203950 205248 206790 207923 208602 209128
52921 209128 209514 209519 209187 208918 208994 209413 210154 211140 211915 211896 211123 210331 210048 210032 209875 209716 210000 210807 211764 212421
52901 212421 212479 211912 211121 210627 210364 209700 208489 207594 207842 208848 209563 209736 210058 210999 212282 213600 215085
52884 215085 216762 218082 218403 217679 216455 215385 214834 214690 214488 213946 213354 213190 213463 213839 214369 215536 217489
52867 217489 219745 221800 223547 224942 225762 226026 226167 226413 226301 225227 223278 221163 219500 218452 217890 217593
52851 217593 217350 217065 216752 216322 215554 214340 212777 210960 208942 206945 205266 203856 202398 201018 200500 201374
52835 201374 203101 204504 204884 204396 203643 203231 203559 204545 205597 206118 206009 205516 204851 204256 204228 205189 206998 209064
52817 209064 210866 212116 212599 212343 211903 212074 213205 214986 216874 218465 219519 219939 219742 218848 217066 214574
52801 214574 212196 210652 209622 208162 206161 204698 204617 205304 205370 204268 202669 201419 200699 200242 199873 199527
52785 199527 199062 198392 197743 197509 197846 198583 199525 200561 201409 201609 201069 200428 200458 201150 201783 201881 201680 201506 201222
52766 201222 200581 199740 198980 198226 197333 196667 196904 198205 199960 201345 201889 201599 200925 200647 201466 203530 206436
52749 206436 209584 212355 214180 214909 215094 215553 216592 217890 219079 220062 220825 221395 222005 222876 223778 224235 224305
52732 224305 224595 225352 226011 226044 225771 225917 226514 226742 225771 223503 220562 217789 215689 214151 212723 211186 209745
52715 209745 208608 207687 206897 206493 206807 207725 208659 209037 208781 208425 208767 210113 211822 212890 213073 213028 213173 213031
52697 213031 212143 211103 210955 211731 212377 212110 211215 210357 209777 209481 209644 210356 211232 211734 211791 211794 212055 212481 212707
52678 212707 212388 211465 210340 209710 209990 210869 211590 211651 211187 210710 210686 211291 212359 213466 214226 214655 215172 216124
52660 216124 217395 218634 219825 221371 223481 225659 227047 227253 226632 225725 224652 223212 221470 220017 219593
52645 219593 220439 221995 223289 223724 223514 223260 223217 223199 223194 223588 224544 225489 225740 225481 225682 226970 228990 230934
52627 230934 232331 233118 233299 232899 232083 231049 229854 228539 227268 226119 224808 222966 220730 218803 217858
52612 217858 218017 218943 220193 221333 221934 221805 221263 220990 221491 222688 224029 224876 224872 224150 223292 222954 223316 223918
52594 223918 224167 223969 223756 223928 224496 225248 226018 226631 226864 226756 226839 227671 229077 230144 230139 229252 228315 227952 228222
52575 228222 228901 229767 230606 231246 231761 232408 233197 233668 233322 232232 231005 230116 229475 228674 227497 226118 224965
52558 224965 224505 225062 226637 228907 231411 233680 235193 235504 234638 233284 232305 232009 232052 232015 231837 231727 231904
52541 231904 232512 233554 234791 235864 236598 237011 237001 236285 234843 233190 232019 231703 232236 233352 234415 234559
52525 234559 233510 232194 232001 233287 235031 236159 236783 237762 239410 241188 242665 244202 246412 249206 251820
52510 251820 253730 255239 257065 259578 262563 265519 267906 269226 269256 268289 266931 265529 263981 262176 260313
52495 260313 258611 256998 255358 253880 252801 251928 250777 249197 247555 246364 245984 246651 248353 250545 252320
52480 252320 253081 252942 252403 251828 251351 251061 251092 251575 252535 253780 254987 256068 257339 259042 260842 262223 263339
52463 263339 264948 267442 270432 273443 276307 278595 279338 278048 275566 273204 271245 268965 265942 262584
52449 262584 259404 256494 253910 251930 250667 249856 249238 248772 248312 247489 246163 244658 243366 242482 242191 242669
52433 242669 243638 244396 244605 244715 245246 246041 246595 246844 247162 247809 248788 250067 251547 252976 254302 255972 258501
52416 258501 261888 265842 270460 276169 283029 290531 297992 304694 309719 312264 312336 310717 308057 304452 300055
52401 300055 295601 291929 289250 287200 285401 283662 281841 279841 277720 275632 273729 272224 271354 271099 271079
52386 271079 270951 270817 271110 272141 273834 275831 277748 279457 281155 283076 285171 287327 289791 292996 296878
52371 296878 300823 304479 308195 312347 316690 320725 324340 327571 330079 331424 331731 331537 331144 330625 330299
52356 330299 330530 331113 331563 332062 333408 335788 338359 340439 342491 345359 348989 352573 355720 358916 362895
52341 362895 368082 374614 382398 390990 399785 408534 417548 427333 438105 449654 461552 473520 485701
52328 485701 498474 511887 525452 538690 551732 565077 578804 592375 605179 616974 627676
52317 627676 637054 644808 650810 655117 657926 659614 660646 661279 661461 661148 660606 660161 659714 658784 657158 655353
52301 655353 654191 653879 653705 652827 651329 650205 650169 650692 650489 648850 646222 643502 641169 639308 638125 637997
52285 637997 639109 641383 644831 649662 655923 663216 670944 678723 686482 694323 702420 710862 719355 727194
52271 727194 733836 739560 745242 751341 757291 762059 765167 766999 768236 769228 769903 770067 769685 768946 768102 767263
52255 767263 766401 765555 764861 764267 763314 761408 758284 754160 749543 745001 740874 736904 732252 726289 719413
52240 719413 712812 707409 703355 700528 698987 698598 698634 698253 697317 696413 696151 696688 697930 699881 702722 706662
52224 706662 711670 717227 722429 726624 729972 733248 737101 741685 746909 752708 758917 765156 771055 776540
52210 776540 781699 786368 790077 792517 794019 795440 797499 800300 803513 806817 809981 812679 814671 816264
52196 816264 818255 821194 824891 828825 832740 836579 840050 842700 844402 845448 846117 846300 845547 843347 839491
52181 839491 834323 828524 822467 815943 808769 801422 794747 789235 784963 782023 780375 779403 778317 777155
52167 777155 776683 777099 777511 777156 776485 776432 777136 778126 779487 781921 785543 789369 792297 794146 795431 796545
52151 796545 797541 798480 799614 801211 803387 806066 809014 812034 815285 819334 824682 831213 838196 844975 851626
52136 851626 858870 867241 876362 885215 893251 901104 910006 920555 932345 944811 957992 972159 986959
52123 986959 1001424 1014879 1027487 1039765 1051853 1063473 1074356 1084385 1093412 1101220 1107667 1112611
52111 1112611 1115710 1116634 1115613 1113422 1110632 1107110 1102522 1097142 1091779 1086977 1082649 1078520 1074571 1070917
52097 1070917 1067490 1064119 1060781 1057588 1054419 1050678 1045529 1038690 1031126 1024762 1021178 1020450 1021419 1022940
52083 1022940 1024663 1026814 1029801 1034173 1040453 1048628 1057959 1067506 1076693 1085303 1093293 1100883 1108517 1116328
52069 1116328 1123702 1129615 1133314 1134578 1133641 1131210 1128321 1125650 1122975 1119581 1115093 1109663 1103536 1096920
52055 1096920 1090150 1083373 1075931 1066681 1055177 1042113 1028304 1013694 997863 981178 964856 949833
52043 949833 936029 922783 909695 896937 885082 874856 866867 861208 857267 854031 850751 847343 844205
52030 844205 841663 839632 837720 835552 832937 829816 826215 822273 818150 813749 808621 802348 795150 788045
52016 788045 782170 777853 774340 770481 765626 759790 753100 745436 736743 727442 718186 709204 700124 690489
52002 690489 680311 670032 660129 650854 642276 634458 627527 621540 616237 611061 605655 600313 595616 591480
51988 591480 586887 580848 573510 565951 558946 552289 545338 537763 529518 520465 510538 500246 490586 482357
51974 482357 475759 470694 467206 465490 465690 467793 471484 476066 480801 485570 490939 497233 503802 509535
51960 509535 513926 517130 519041 518935 516248 511322 505127 498553 492189 486422 481427 477233 474033 472216
51946 472216 471826 472264 472913 473929 476135 480268 486662 495349 505885 517028 527152 535308 541646 546667
51932 546667 550385 552376 552350 550341 546488 540945 534045 526308 518137 509605 500661 491586 483130 476002 470212
51917 470212 465110 460240 456021 453431 453082 454833 458221 463118 469964 479525 492392 508590 527619 548845
51903 548845 571569 594518 615565 632400 643458 648011 645617 636166 620562 600801 578928 556175
51891 556175 533260 511151 491082 473894 459761 448569 440254 434618 431005 428523 426779 426288 427837
51878 427837 431434 436143 441132 446501 452759 459743 466488 471935 475376 476457 475466 473507 471651 469727
51864 469727 466643 462072 457154 453222 450601 449091 448878 450211 452558 454857 456420 457074 456704 455259 452999
51849 452999 450151 446521 441979 437077 432492 427956 422535 415967 409059 402668 397041 392264 388679 386444
51835 386444 385235 384692 384727 385141 385437 385279 384705 383639 381739 379100 376595 374970 373967 372823 371307 369732
51819 369732 368301 367108 366576 367178 368684 370318 371772 373513 375934 378710 381251 383277 384662 385109 384447
51804 384447 383044 381463 379748 377372 373935 369713 365491 362019 359608 358075 356975 355956 354904 353811
51790 353811 352634 351397 350332 349759 349871 350714 352278 354373 356507 358126 359063 359575 359939 360280 360870 362230
51774 362230 364709 368163 372388 377665 384432 392439 400663 408227 415075 421566 427702 433003 436877 438766
51760 438766 438084 434510 428514 421296 413976 406888 399811 392748 386295 381129 377308 374238 371482 369406
51746 369406 368830 369999 372126 374128 375712 377592 380688 385275 390871 396745 402366 407462 411833 415262
51732 415262 417641 419115 420075 421002 422313 424111 425903 426696 425705 423001 419236 414802 409638 403978 398837
51717 398837 395347 393746 393250 392778 391609 389557 386892 384149 381898 380720 381264 383855 387784 391395 393356
51702 393356 393677 393192 392433 391564 391080 391675 393321 395208 396820 398509 400683 402846 403797 402617 399335 394895
51686 394895 390564 387022 383955 380791 377714 375444 374051 372822 371529 371035 372128 374448 377148 380045
51672 380045 383385 387010 390623 394588 399484 404942 409801 413450 416212 418327 419490 419718 419821 420429 421164
51657 421164 421378 421237 421381 421855 422063 421651 420746 419350 417161 414123 410568 406523 401429 395050 388317 382687
51641 382687 378691 375599 372503 369248 366174 363468 361198 359576 358644 357845 356465 354545 352816 351594 350289
51626 350289 348301 345970 344186 343329 343024 342741 342153 341055 339468 337922 337191 337588 338708 339977 341145 342226
51610 342226 343251 344304 345613 347500 350329 354500 360235 367206 374575 381519 387689 393067 397591 401028
51596 401028 403103 403622 402503 399814 395816 391000 386068 381722 378305 375726 373877 373078 373887 376509 380622
51581 380622 385742 391580 398135 405793 415251 426885 440038 453278 465570 476931 487831 498452
51569 498452 508816 519209 529909 540673 551096 561628 573866 589646 609887 634301 661933
51558 661933 691830 723221 755161 786183 814565 839046 859084 874314 884021 887395 884113 874371
51546 874371 858531 837172 811396 782672 752227 720846 689271 658374 628753 600468 573436
51535 573436 547956 524633 503909 485805 470006 456048 443555 432475 423064 415499 409592 404927
51523 404927 401158 398019 395189 392416 389750 387393 385250 382856 379908 376772 374268 372932 372591 372654 372763
51508 372763 373176 374584 377545 381895 386637 390535 393062 394740 396383 398060 399007 398597 397085 395202 393270
51493 393270 391030 388231 385017 381697 378410 375109 371699 368037 363942 359346 354365 349240 344264 339759
51479 339759 335930 332680 329753 327099 324896 323094 321246 319006 316641 314771 313606 312766 311861 311009 310622
51464 310622 310829 311331 311885 312773 314573 317406 320606 323396 325754 328285 331266 334291 337005 339729 342973
51449 342973 346749 350890 355788 362121 369892 378358 386959 395714 404478 412471 418903 423620 426738 428204
51435 428204 428252 427818 427686 427323 425252 420673 414170 406847 399428 392329 385879 379965 373996 367786 362262
51420 362262 358717 357412 357319 357212 356652 355882 355246 354956 355182 356010 357300 358686 359808 360571 361286 362508 364636
51403 364636 367582 370897 374266 377801 381817 386341 390913 394879 397904 400232 402586 405791 410391 416462
51389 416462 423715 431866 441010 451749 465001 481613 501958 525747 552334 581469 613763 650080
51377 650080 690177 732138 773463 812640 849415 883603 914097 939107 957063 967143 969284 963969
51365 963969 951798 933026 907673 876332 840695 802892 764307 725246 685813 646873 610023
51354 610023 576743 547623 522351 500332 481202 464706 450266 437066 424706 413574 404300 396979
51342 396979 391122 386154 381664 377296 372819 368381 364404 361065 358065 355040 352003 349262 347031 345245
51328 345245 343700 342257 340957 339966 339354 338928 338351 337512 336752 336720 338034 340952 345216 350173 355147 359747
51312 359747 363778 366928 368661 368500 366430 363093 359633 357168 356194 356471 357501 358979 360701 362298 363404
51297 363404 364008 364286 364069 362817 360267 356881 353488 350635 348376 346494 344774 343169 341849 341052 340841
51282 340841 341027 341412 341998 342947 344333 345875 346932 346962 346181 345551 345807 346681 347417 347945 348948 350765 352819
51265 352819 354398 355443 356176 356381 355621 353989 352132 350596 349475 348653 348002 347337 346528 345687 344985 344254 343050
51248 343050 341250 339361 338102 337730 337838 337791 337305 336644 336274 336410 336977 337953 339419 341182 342666 343409 343511
51231 343511 343321 342857 341867 340393 338931 337954 337470 337118 336572 335836 335238 335114 335435 335851 336156 336543 337219 337974
51213 337974 338393 338383 338263 338419 339098 340347 341829 342909 343252 343321 343883 345147 346801 348756 351187 353768 355558
51196 355558 356007 355560 354886 353975 352522 350814 349575 349083 349055 349388 350346 351814 352966 353098 352524 352226 352763
51179 352763 353870 355018 355915 356364 356103 355246 354636 355220 356943 358639 359280 359083 359080 359843 361043 362177 363191
51162 363191 364226 365188 365860 366216 366295 365954 365035 363738 362502 361544 360682 359669 358504 357415 356675 356402 356357
51145 356357 356036 355206 354333 354159 354813 355683 356274 356777 357479 358074 358131 358018 358657 360286 362073 363180 363621 363734
51127 363734 363433 362591 361732 361523 361759 361607 360937 360616 361248 362311 362950 363072 363192 363649 364494 365902 368083 370834
51109 370834 373597 375928 377712 379111 380613 382840 385875 388929 391114 392415 393444 394369 394656 393905 392405
51094 392405 390702 389093 387751 386969 386987 387739 388926 390193 391204 391756 391853 391515 390587 389036 387307 385994
51078 385994 385178 384542 384120 384389 385483 386879 388160 389668 392039 395456 399644 404338 409431 414843 420586
51063 420586 426839 433827 441722 450617 460250 469740 478087 485237 492267 500295 509587 519896 531038 542680
51049 542680 554072 564611 574310 583146 590254 594467 595494 593950 590423 585224 578995 572695 566665 560214
51035 560214 552407 542891 531912 519987 507833 496177 485339 475200 465734 457250 450022 444002 439159
51022 439159 435821 434376 434832 436876 440193 444513 449478 454727 460112 465655 471334 477059 482881 489140
51008 489140 496327 504742 514255 524400 534729 544995 555013 564623 573933 583350 593113 602991 612688
50995 612688 622268 631720 640354 647274 652539 657155 661712 665580 667818 668388 667958 666876 664968 662235 659158
50980 659158 656232 653634 651628 650933 652377 656179 661788 668555 676541 686652 699989 717145 738033
50967 738033 762171 788876 817304 846752 877123 908943 942621 977755 1013374 1048806 1084037
50956 1084037 1118990 1152691 1183545 1210657 1234684 1257125 1278872 1299755 1319352 1337645 1354654
50945 1354654 1369929 1382863 1393156 1400589 1404687 1405250 1403036 1399297 1394624 1388810 1381742 1373640 1364315
50932 1364315 1352970 1339113 1323096 1305356 1285640 1263403 1238581 1211553 1182753 1152659 1121790
50921 1121790 1090287 1057904 1024881 992386 961528 932339 904357 877844 853652 832102 812831
50910 812831 795665 780698 767396 754543 741527 729052 718125 708857 700689 693332 686896 681337
50898 681337 676338 671669 667317 663236 659282 655409 651739 648421 645530 643123 641314 640277 640082 640480 640973
50883 640973 641385 642251 644264 647320 650529 653354 656270 660026 664705 669976 675930 683036 691283 700015 708807
50868 708807 718094 728676 740818 754156 768376 783712 800721 819758 840832 863969 889570 918277
50856 918277 950519 986373 1025857 1069200 1116701 1168507 1224695 1285380 1350458 1419245 1490616
50845 1490616 1563690 1638303 1714696 1792715 1871230 1948269 2021683 2089759 2151361 2205746 2252456
50834 2252456 2291329 2322386 2345669 2361405 2370434 2374280 2374685 2373238 2371455 2370858 2372639 2377288 2384661
50821 2384661 2394202 2404957 2415668 2425149 2432318 2435589 2432638 2421401 2401246 2372661 2335970 2291010
50809 2291010 2238106 2178579 2113974 2045402 1974057 1901795 1830596 1761708 1695818 1633772 1576600
50798 1576600 1524956 1479062 1439198 1405819 1379135 1358854 1344307 1334573 1328674 1326060 1326808 1330919
50786 1330919 1337423 1344606 1351129 1356518 1360591 1362972 1363394 1361943 1358658 1353218 1345312 1335055 1322751 1308400
50772 1308400 1291772 1272792 1251562 1228120 1202474 1174881 1145917 1116220 1086318 1056730 1028146
50761 1028146 1001311 976558 953479 931406 910511 892151 877631 866749 858093 850724 844894 841071
50749 841071 839093 838767 840539 844909 851648 860329 871303 885372 902674 922631 944971 970054 998149
50736 998149 1029021 1062381 1098183 1136329 1176602 1219032 1263766 1310314 1357347 1403555 1448376
50725 1448376 1491695 1533210 1572374 1608638 1641428 1670052 1693827 1712116 1724280 1729941 1729483 1723991
50713 1723991 1714649 1702593 1689389 1677007 1666916 1659591 1655238 1654471 1657795 1664838 1674678 1686590 1699825
50700 1699825 1712879 1723754 1731033 1734188 1732854 1726418 1714518 1697497 1676163 1651494 1624764 1597535
50688 1597535 1571171 1546468 1523941 1504221 1487898 1475200 1466148 1460994 1460193 1463948 1472059 1484499
50676 1484499 1501942 1525378 1555126 1590435 1630169 1673504 1719549 1766574 1812266 1854956 1894193
50665 1894193 1930016 1962250 1990832 2016303 2039289 2059640 2076623 2089971 2100274 2108318 2114335 2117972
50653 2117972 2118751 2116556 2111911 2105868 2099514 2093644 2088963 2086338 2086661 2090645 2098988 2112347 2130761 2153381
50639 2153381 2179179 2207615 2238065 2268979 2298548 2326203 2352625 2378120 2401791 2422571 2440139
50628 2440139 2454050 2462321 2461536 2448433 2421441 2381349 2331106 2274833 2216526 2159437 2106321 2059492
50616 2059492 2020309 1989071 1965766 1950473 1942665 1940721 1942835 1948118 1956150 1965627 1974100 1979053 1978731
50603 1978731 1971987 1958009 1936411 1907282 1871044 1828572 1781367 1731209 1679445 1626903 1574450
50592 1574450 1523258 1474436 1428696 1386426 1347741 1312398 1280018 1250600 1224609 1202479 1184159
50581 1184159 1169128 1156590 1145677 1135800 1126988 1119668 1114175 1110679 1109446 1110653 1113842 1118077 1122910
50568 1122910 1128855 1136677 1146506 1157910 1170528 1184393 1199903 1217795 1238927 1263852 1292705 1325576
50556 1325576 1362548 1403122 1445990 1489739 1533569 1577091 1619905 1661856 1703255 1744211 1784083
50545 1784083 1822353 1859884 1898415 1938860 1980945 2024685 2071137 2121235 2174714 2230843 2289600
50534 2289600 2351423 2416426 2484809 2557638 2636174 2720438 2809297 2901976 2998549 3098732 3201086
50523 3201086 3303812 3405497 3504418 3597726 3682135 3755101 3814709 3858802 3885188 3892760 3881678
50512 3881678 3852300 3804635 3739238 3658156 3564597 3461946 3353405 3242230 3131773 3025204
50502 3025204 2925424 2835176 2756945 2692615 2643300 2609491 2591198 2587900 2598376 2620624 2651906
50491 2651906 2688969 2728240 2765791 2797259 2818223 2825068 2815666 2789308 2746212 2687325 2614440 2530103
50479 2530103 2437112 2338141 2235827 2132882 2031756 1934067 1840496 1751379 1667308 1589079 1517143
50468 1517143 1451315 1391080 1336045 1286021 1240810 1200115 1163666 1131358 1103256 1079476 1059957
50457 1059957 1044275 1031712 1021616 1013639 1007574 1003186 1000375 999366 1000423 1003364 1007520 1012136 1016628
50444 1016628 1020611 1023982 1026909 1029438 1031206 1031998 1032549 1034263 1037984 1043577 1050848 1060207 1072005 1085823
50430 1085823 1101107 1118077 1137321 1158731 1181644 1205954 1232338 1261310 1292808 1326862 1363857
50419 1363857 1403677 1445292 1487829 1531702 1578080 1627458 1679309 1732951 1788065 1844340 1901193
50408 1901193 1958105 2014787 2070648 2124377 2174373 2219471 2258968 2292027 2317421 2333915 2340603
50397 2340603 2336722 2321468 2294443 2256351 2208955 2154174 2093355 2027592 1958603 1889015 1821665
50386 1821665 1758674 1701155 1649697 1605009 1568082 1539710 1519967 1508250 1503837 1506192 1514598 1527708
50374 1527708 1543668 1560573 1576567 1589595 1597499 1598544 1591814 1577140 1554911 1526052 1491895 1453760
50362 1453760 1412609 1369141 1324124 1278488 1233124 1188620 1145195 1102886 1061866 1022612 985746
50351 985746 951741 920781 892900 868181 846849 829151 815022 803797 794465 786378 779643 774656
50339 774656 771488 769989 770288 772653 776845 782035 787583 793561 800336 807886 815641 822697 828025 830873
50325 830873 831349 830371 828730 826300 822513 817496 812390 808517 806424 805718 805583 805465 805544 806665 809693 814807
50309 814807 821442 828863 836634 844557 852399 859905 867059 874174 881636 889550 897655 905498 912645 918820
50295 918820 924109 929046 934235 939648 944466 947829 949630 950396 950662 950848 951511 953207 956106 960111 965144
50280 965144 970657 974947 975800 972105 964337 953426 940098 925655 912272 901571 893458 887081 882274
50267 882274 879166 877056 874945 872967 872086 872422 873064 873646 874982 877772 881788 886721 892824 900065 907500
50252 907500 914270 920692 927670 935589 944492 954873 967483 982571 999953 1019650 1041840 1066296
50240 1066296 1092408 1119695 1147838 1176304 1204290 1230922 1255250 1276425 1294357 1309896 1323807
50229 1323807 1335855 1345439 1352758 1358354 1361534 1360234 1352821 1339316 1320469 1296416 1266958 1232760
50217 1232760 1195504 1156902 1118119 1080251 1044824 1013356 986477 963707 944161 927222 912347
50206 912347 898424 883833 867432 849262 830178 811045 792492 775013 758725 743191 727936
50195 727936 713179 699636 687644 676831 666664 656928 647688 639231 632099 626695 622715 619346 616124
50182 616124 613175 610560 607939 605166 602703 601050 600144 599707 599838 600828 602640 605041 608051 611747 615764
50167 615764 619520 623010 626951 632006 638164 644954 651986 659184 666720 674883 683854 693437 703164 712733
50153 712733 722239 731867 741480 750693 759312 767472 775215 782060 787226 790386 792090 793347 794981 797498
50139 797498 801488 807680 816487 827699 840894 856072 873759 894456 918134 944367 973005 1004691
50127 1004691 1040539 1081275 1126884 1177155 1232160 1291771 1354907 1419760 1484744 1548762 1610717
50116 1610717 1669580 1725147 1778033 1828459 1875579 1918436 1957055 1991798 2021864 2045012 2058681
50105 2058681 2060936 2050555 2027023 1990811 1943470 1887299 1824985 1759219 1692153 1625153 1559212
50094 1559212 1495436 1434815 1377833 1324850 1276688 1234252 1197505 1165328 1136392 1109738 1084634
50083 1084634 1060612 1037874 1016990 997899 979732 961949 945073 929874 916239 903402 890931
50072 890931 878969 867683 857038 847077 837963 829665 821951 814756 808266 802561 797365 792315 787371
50059 787371 782876 779257 776737 775423 775569 777484 780888 784635 787595 789827 792406 795929 799746 802924
50045 802924 805420 807731 809859 811321 812090 812740 813585 814303 814634 814946 815730 816903 817984 818745 819275 819502 819123
50028 819123 818126 817069 816559 816563 816439 815635 814199 812621 811399 810848 811083 811964 813216 814933 817865 822840 829920
50011 829920 838490 848325 860196 875247 894087 916736 943084 973086 1006668 1043829 1084603 1128468
49999 1128468 1173812 1218373 1260321 1298760 1333344 1363831 1390211 1412931 1432678 1449756 1463561
49988 1463561 1472567 1474889 1469025 1454110 1429677 1395651 1352868 1303241 1248976 1191715 1132789 1074010
49976 1074010 1017586 965142 917296 874269 836390 803706 775587 751113 729706 711142 695168
49965 695168 681443 669799 660334 653267 648713 646469 645927 646488 648221 651912 658184 666693 676401 686445
49951 686445 696375 705679 713590 719594 723875 727020 729372 730865 731335 730661 728532 724360 717734 708944 698829
49936 698829 688026 676554 664248 651363 638515 626139 614301 603038 592585 583192 574974 568076
49924 568076 562757 559118 556868 555593 555194 555879 557768 560608 563907 567238 570450 573743 577557 582309 588140
49909 588140 594899 602442 610898 620574 631459 642873 653840 663936 673630 683547 693490 702435 709478
49896 709478 714529 718004 720130 720743 719537 716220 710498 702198 691565 679396 666797 654680 643366
49883 643366 632568 621833 611050 600545 590705 581610 573077 564981 557472 550901 545606 541758 539419
49870 539419 538632 539302 540985 543046 545227 547879 551458 556047 561713 569041 578581 589725 600856 611003
49856 611003 620840 631547 643040 653937 663056 670318 676199 680891 684302 686455 687465 687205 685239 681155
49842 681155 674971 667204 658544 649398 639821 629927 620225 611414 603942 597866 593027 589155 586017 583753
49828 583753 582989 584270 587377 591532 596283 601823 608400 615843 623906 632638 642012 651426 660010 667406
49814 667406 673863 679584 684337 687831 690126 691417 691580 690246 687321 683178 678260 672577 665790 657775
49800 657775 649051 640539 632925 626271 620235 614503 608881 603061 596662 589705 582883 577069 572473 568521
49786 568521 564596 560706 557323 554846 553395 552945 553358 554366 555800 557790 560538 563974 567963 572742 578642
49771 578642 585334 591856 597680 603318 609463 615861 621492 625685 628579 630547 631676 631909 631309 629995 627986
49756 627986 625152 621085 615099 606798 596835 586762 577873 570311 563458 556894 550726 545223 540547 536790
49742 536790 533932 531687 529632 527607 525859 524755 524491 525124 526635 528803 531174 533416 535683 538391 541639
49727 541639 545093 548655 553010 559225 567708 577807 588453 598973 609134 618592 626621 632461 635819
49714 635819 637021 636768 635729 634218 632151 629278 625439 620624 614897 608367 601289 594165 587752 582819
49700 582819 579695 577983 576798 575372 573373 570864 568249 566340 566040 567650 570680 574517 579028 584254
49686 584254 589839 595278 600632 606523 613479 621657 631141 641949 653632 665371 676649 687398 697256
49673 697256 705197 710384 713075 714305 714768 714468 713314 711652 710038 708711 707306 705075 701499 696791 691634
49658 691634 686169 679470 670331 658563 645264 631867 619185 607337 596251 586049 577114 569895
49646 569895 564571 560829 558088 555943 554370 553535 553498 554031 554637 554806 554397 553674 552794 551334 548590 544344
49630 544344 539179 534053 529739 526574 524389 522615 520694 518514 516332 514269 512167 509979 507976 506396
49616 506396 505141 504065 503363 503434 504489 506464 509125 512003 514437 516095 517414 519147 521411 523492 524705
49601 524705 525144 525436 526056 527133 528694 530656 532627 534106 535038 535921 537255 539095 541269 543780 546657
49586 546657 549518 551699 552924 553603 554365 555498 556965 558683 560507 562218 563871 566044 569316 573482 577695
49571 577695 581461 585173 589525 594825 601152 608828 618217 629144 640870 652690 664293 675484 685773
49558 685773 694350 700440 703734 704606 703804 701830 698667 694203 688669 682494 675969 669460 663764 659663 657031
49543 657031 654823 652121 648895 645628 642624 639966 637795 636272 635417 635213 635709 636845 638437 640548 643667
49528 643667 648297 654632 662810 673077 685195 697932 709659 719438 727177 732895 736357 737471 736619
49515 736619 734584 732439 731369 732027 734035 736508 739107 742043 744996 746712 745993 742648 737159 729903 721126
49500 721126 711362 701359 691585 682077 672725 663673 655507 648978 644225 640348 636332 632387 629739 628878
49486 628878 628801 628398 627801 627752 628258 628777 629245 629987 630871 631505 632169 633559 635537 637061 637596 637771 638340 639265
49468 639265 640272 641677 644018 647213 650537 653240 654903 655476 655245 654597 653627 652199 650432 648710 647042
49453 647042 644884 641900 638505 635339 632516 629732 626801 623721 620472 617125 613927 610990 608151 605432
49439 605432 603387 602600 603005 604085 605566 607589 610413 614283 619455 626006 633694 642260 651697 661924
49425 661924 672468 682831 692969 702884 711894 718767 722606 723248 720946 716149 709593 702182 694672 687816
49411 687816 682704 680330 680655 682603 685271 688834 694027 701063 709418 718460 727899 737716 747959 758692
49397 758692 769846 780918 790914 798977 805287 811089 817393 823650 828206 830163 830307 829883 829046 827059
49383 827059 823533 818724 812809 805692 797543 788875 780033 771278 763399 757512 753997 752281 751925 753256
49369 753256 756587 761500 767384 774110 781598 789197 796155 802311 807667 811659 813635 813910 813534 812900 811296
49354 811296 808025 803472 798787 794911 792118 790169 788612 787137 785850 785170 785415 786600 788519 790719 792364
49339 792364 792506 790790 787708 784043 780211 776275 772429 769146 766841 765489 764659 763840 762730 761248 759469
49324 759469 757653 756315 755987 756785 758341 760218 762199 764068 765517 766584 767942 770244 773269 776162 778591
49309 778591 781205 784850 789750 795656 802375 809805 817756 826092 835027 845003 856309 868908 882468
49296 882468 896357 909733 921826 932007 939429 942917 941722 936432 928747 920207 911293 901819 891867
49283 891867 882065 873119 865313 858446 852058 845724 839333 833131 827384 821942 816301 810276 804515 800040
49269 800040 797274 795769 795043 795408 797572 801553 806468 811547 817000 823613 831855 841784 853579 867485
49255 867485 882996 898541 912404 923926 933572 941902 948669 952872 953441 949864 942450 932247 920636
49242 920636 908741 897044 885549 874260 863478 853654 845115 838060 832754 829548 828582 829542 831901
49229 831901 835470 840561 847425 855595 864039 872105 880078 888610 897693 906511 914232 920611 925759 929700
49215 929700 932449 934253 935467 936317 937094 938492 941331 945955 952187 959858 969052 979797 991889 1005180
49201 1005180 1019685 1035186 1050966 1066188 1080379 1093416 1105326 1116323 1126731 1136532 1145119 1151861
49189 1151861 1156821 1160672 1163978 1166883 1169425 1171805 1174347 1177377 1181185 1185935 1191732 1198950 1208390 1220810
49175 1220810 1236393 1254896 1276103 1299675 1324589 1349105 1371273 1389203 1401111 1405917 1404068 1397395
49163 1397395 1388020 1377704 1368095 1360691 1356067 1353640 1352590 1352604 1353427 1354332 1354710 1354783 1355068 1355446 1355463 1355364 1356047
49146 1356047 1357951 1360677 1363906 1368087 1373946 1381688 1390923 1401089 1411730 1422574 1433524 1444531 1455534
49133 1455534 1466715 1478631 1491744 1505787 1519894 1533368 1546094 1558295 1570249 1582197 1594110
49122 1594110 1605558 1616276 1626890 1638547 1651716 1665825 1680352 1695801 1713370 1734085 1758676
49111 1758676 1787964 1822910 1864245 1912114 1965784 2023454 2082665 2141285 2198163 2252899 2305151
49100 2305151 2354040 2397491 2431830 2452634 2456922 2444845 2419266 2383904 2341854 2295147 2244826
49089 2244826 2191388 2135609 2079166 2024348 1973238 1927335 1887604 1854346 1826934 1804042 1784412
49078 1784412 1767417 1752969 1740978 1730890 1721743 1712854 1704493 1697522 1692221 1687839 1683570 1679502 1676160
49065 1676160 1673484 1670970 1668716 1667568 1668080 1669817 1671982 1674303 1676973 1679936 1682666 1684783 1686708 1689445
49051 1689445 1693501 1698136 1702093 1705119 1708277 1712507 1717410 1721985 1726113 1730580 1735845 1741672 1748003 1755329
49037 1755329 1763806 1772592 1780574 1787444 1793714 1799931 1806256 1812623 1818990 1825369 1831738 1837935 1843690 1848855
49023 1848855 1853534 1857817 1861521 1864548 1867436 1871189 1876434 1882980 1890245 1897805 1905582 1913875 1923296 1934331
49009 1934331 1946766 1959800 1972785 1985641 1998561 2011663 2024974 2038296 2051001 2062334 2072113
48998 2072113 2080760 2088531 2095113 2100122 2103592 2105789 2106982 2107653 2108403 2109282 2109593 2108791 2107279 2105878 2104811
48983 2104811 2103686 2102321 2101057 2100289 2100036 2099997 2099789 2099205 2098450 2097990 2097927 2097716 2096726 2094950 2092880 2090827 2088710
48966 2088710 2086424 2084076 2081865 2080004 2078750 2078285 2078558 2079467 2081155 2083973 2088197 2093970 2101524 2111219 2123324
48951 2123324 2137720 2153816 2170800 2188161 2206015 2224781 2244611 2265416 2287338 2310701 2335404
48940 2335404 2360998 2387657 2416442 2448089 2482006 2517101 2553199 2590919 2630415 2671158 2712974
48929 2712974 2756404 2801699 2848044 2894199 2939573 2984384 3029064 3073810 3118507 3162819 3206414
48918 3206414 3249158 3290961 3331443 3370093 3406912 3442645 3478194 3513841 3549138 3583400 3616224
48907 3616224 3647714 3678342 3708553 3738459 3767933 3796884 3825281 3852940 3879473 3904455 3927572
48896 3927572 3948724 3968145 3986284 4003287 4018618 4031434 4041302 4048228 4052001 4051874 4047131 4037817 4024786
48883 4024786 4009046 3990991 3970179 3945865 3917922 3887151 3854543 3820312 3783811 3744192 3700920
48872 3700920 3653911 3603697 3551474 3498543 3445584 3392737 3340365 3289262 3240067 3192939 3148021
48861 3148021 3105699 3066042 3028347 2991727 2956091 2922251 2891190 2863475 2839208 2818155 2799826
48850 2799826 2783728 2769740 2758204 2749541 2743754 2740311 2738535 2738124 2739243 2742055 2746324 2751621 2757822
48837 2757822 2765139 2773675 2783161 2793200 2803556 2814203 2825312 2837265 2850391 2864594 2879419 2894651
48825 2894651 2910638 2927836 2946168 2965069 2984080 3003139 3022311 3041482 3060621 3080299 3101625
48814 3101625 3125362 3151064 3177372 3203225 3228617 3254138 3280171 3306795 3334029 3361670 3389110
48803 3389110 3415924 3442670 3470569 3500222 3531045 3562067 3592814 3623192 3652883 3681268 3707783
48792 3707783 3732156 3754481 3775240 3795059 3814224 3832419 3849009 3863360 3874884 3883003 3887234 3887157
48780 3887157 3882343 3872654 3858680 3841472 3821529 3798408 3771665 3741894 3710395 3677877 3643841 3607266
48768 3607266 3567673 3525540 3481929 3437760 3393276 3348161 3302155 3255486 3208720 3162451 3117317
48757 3117317 3074126 3033597 2995920 2960709 2927407 2895652 2865320 2836398 2808885 2782754 2757967
48746 2757967 2734538 2712559 2692160 2673500 2656800 2642263 2629952 2619743 2611329 2604141 2597305 2589938
48734 2589938 2581667 2572815 2564067 2556040 2549088 2543308 2538585 2534690 2531421 2528682 2526496 2524963 2524036 2523319
48720 2523319 2522285 2520935 2519976 2520040 2520965 2522267 2524107 2527158 2531433 2535881 2539445 2542132 2544737 2547876 2551583
48705 2551583 2555670 2560080 2564890 2570110 2575527 2580838 2586088 2591868 2598748 2606589 2614717 2622661 2630298 2637321
48691 2637321 2643220 2647966 2652231 2656727 2661685 2667141 2673181 2679726 2686559 2693880 2702349 2712277 2723204 2734491
48677 2734491 2745820 2756879 2767192 2776749 2786174 2795716 2804545 2811624 2816712 2819799 2820004 2815984 2807223
48664 2807223 2794127 2776951 2755447 2729596 2699993 2667365 2632300 2595511 2557743 2519253 2479922
48653 2479922 2440120 2401018 2363778 2328724 2295471 2263600 2233044 2204067 2176958 2151597 2127198
48642 2127198 2102597 2076913 2049989 2022392 1995060 1968715 1943411 1918766 1894665 1871400 1849028
48631 1849028 1827091 1805263 1783700 1762406 1740863 1718944 1697672 1678305 1661055 1645467 1631672
48620 1631672 1620230 1610915 1602817 1595822 1591018 1589261 1590087 1592419 1595698 1599898 1604956 1610534 1616040 1620671
48606 1620671 1623872 1625905 1627568 1629280 1630904 1632524 1634737 1637885 1641524 1644907 1647584 1649314 1649848 1649018
48592 1649018 1646689 1642572 1636601 1629529 1622459 1615549 1607850 1598734 1588824 1579105 1569787 1560586 1551642 1543548
48578 1543548 1536756 1531436 1527608 1525115 1523788 1523995 1526559 1531696 1538442 1545652 1553221 1561760 1571392 1581463
48564 1581463 1591243 1600236 1607734 1612596 1613781 1611033 1605081 1597238 1588640 1579704 1570426 1561162 1552705 1545460
48550 1545460 1538897 1532031 1524106 1514628 1503228 1489860 1474842 1458471 1440983 1423110 1406067 1390497
48538 1390497 1375856 1361347 1347188 1334452 1323983 1315880 1309696 1304630 1299863 1295332 1292019 1291057 1292722
48525 1292722 1296601 1302182 1308559 1313931 1316322 1314853 1309847 1301885 1291453 1279421 1267089 1255625 1245876
48512 1245876 1238601 1234247 1232545 1232932 1235394 1240287 1247439 1256141 1266056 1277298 1289429 1301212 1311783
48499 1311783 1321308 1329951 1336712 1339963 1338870 1333807 1325669 1315314 1303572 1291262 1279020 1267190 1255780
48486 1255780 1244437 1232683 1220482 1208498 1197542 1187832 1179011 1170818 1163509 1157553 1153126 1150016 1147909
48473 1147909 1146558 1145655 1144749 1143506 1142082 1141048 1140860 1141526 1142846 1144867 1147984 1152647 1158965 1166469 1174258
48458 1174258 1181505 1187840 1193154 1197250 1200095 1202255 1204432 1206487 1207508 1207100 1205932 1204649 1202912 1200101
48444 1200101 1196406 1192473 1188337 1183374 1177085 1169320 1160068 1149733 1139269 1129261 1119120 1108052 1096607
48431 1096607 1086305 1077823 1070565 1064030 1058390 1053346 1047505 1039643 1029974 1019683 1009764 1000708 992619
48418 992619 985028 977073 968458 959884 952101 944939 937748 930401 923308 916704 910454 904434 898668 893209
48404 893209 888216 884003 880742 878218 876093 874206 872457 870716 869085 867949 867445 867139 866557 865803 865312
48389 865312 865161 864911 864073 862488 860371 858141 856027 853730 850676 846787 842762 839455 837160 835601 834291
48374 834291 832704 830367 827101 823052 818394 813215 807790 802678 798401 795153 792810 790900 788666 785659
48360 785659 782312 779447 777131 774608 771453 768070 764840 761573 758303 755840 754768 754379 753401 751584 749895
48345 749895 749285 749823 751055 752686 754837 757789 761489 765387 769076 773161 779004 787390 797875 809589
48331 809589 822002 834489 845746 854400 860030 863280 865235 866925 868974 871333 873726 876564 880928
48318 880928 887376 895414 904434 914526 926012 938956 953549 970259 989192 1010171 1033866 1061797
48306 1061797 1094678 1131955 1173779 1222235 1279732 1347387 1426133 1518232 1626650 1754350 1905686
48295 1905686 2087330 2306736 2571597 2892538 3284520 3763718 4345556 5048324 5894769
48286 5894769 6903621 8077793 9399225 10822947 12258663 13555982 14528742 15021951
48278 15021951 14974362 14429324 13498545 12319103 11026549 9736613 8528943 7442255 6486005
48269 6486005 5656546 4945107 4339478 3826477 3394646 3033710 2732974 2482251 2273505
48260 2273505 2100140 1955488 1833325 1729092 1639559 1561941 1494138 1434933 1382969 1336281
48250 1336281 1293537 1254817 1220333 1189306 1160915 1135311 1112580 1091559 1070973 1051214 1033814
48239 1033814 1019484 1007676 997751 989460 982377 975783 969326 963286 958179 954413 952110 950879 949985 948925
48225 948925 947335 944110 937472 926613 912691 897519 881823 865556 849231 833802 819469 805694
48213 805694 792330 779837 768359 757454 746759 736196 725464 714171 702632 691810 682194 673273
48201 673273 664391 655607 647456 640305 634163 628769 623653 618410 613063 607921 603026 598080 592947 587901
48187 587901 583293 579321 576184 574108 573016 572448 571941 571334 570668 570048 569651 569590 569736 569873 570079 570669 571720
48170 571720 572890 573743 574047 573830 573420 573438 574387 576142 578133 580060 582220 584975 588144 590981 592689 593025
48154 593025 592621 592629 593743 595573 597170 598047 598432 598698 598994 599412 600010 600639 601128 601660 602553 603678 604605 605336
48136 605336 606334 607723 609095 610322 611865 613857 615535 616188 616184 616424 617101 617785 618546 620198 623229 627090
48120 627090 630827 634071 637166 640556 644333 648296 652339 656710 661850 667918 674554 681177 687471 693549
48106 693549 699790 706570 713979 721629 728922 735657 742163 748714 755135 761291 767672 774985 783237 791641
48092 791641 799444 806543 813280 819966 826690 833256 839268 844555 849479 854537 859650 864305 868409 872474
48078 872474 876729 880599 883547 886048 889159 893258 897734 901904 905719 909447 913137 916722 920367 924425
48064 924425 929113 934430 940209 945998 950973 954305 955741 955650 954426 951979 947977 942419 935744 928310 919925
48049 919925 909991 898059 884247 869228 853913 838993 824642 810596 796600 782758 769374 756519
48037 756519 743925 731348 718926 707051 696017 685872 676529 667816 659440 651038 642434 633776 625367
48024 625367 617372 609767 602583 596065 590425 585407 580349 574871 569444 564973 561701 558835 555462 551592
48010 551592 547964 544991 542376 539766 537298 535236 533479 531791 530246 529049 528016 526693 524956 523164
47996 523164 521712 520729 520201 520032 519883 519322 518311 517289 516626 516242 515877 515468 515003 514260 512983 511299 509760
47979 509760 508995 509328 510523 511815 512431 512303 512119 512522 513435 514345 515028 515779 517057 519106 521655 523857 524814
47962 524814 524480 523792 523617 523886 524167 524697 526168 528650 531480 534307 537562 541648 546218 550665 554894 559240
47946 559240 563792 568189 572008 575155 577873 580497 583215 586015 588846 591650 594118 595594 595548 594068 591703
47931 591703 588932 585985 582948 579708 575991 571860 567921 564577 561364 557653 553716 550320 547452 544420
47917 544420 541202 538549 536554 534279 531319 528626 527079 526232 525299 524533 524633 525484 526575 528116 530631
47902 530631 533808 536914 540130 544315 549519 554785 559521 564058 568756 573481 578190 583085 587904 591874
47888 591874 594757 597186 599619 601610 602589 602744 602691 602656 602329 601234 599013 595777 592272 589224 586425 582994
47872 582994 578637 573972 569455 564783 559720 554673 549945 545103 539746 534307 529467 525280 521590 518770
47858 518770 517211 516389 515331 513910 512920 512861 513375 513973 514669 515717 517140 518740 520263 521524 522653 524232
47842 524232 526835 530340 533939 536848 538804 539955 540581 540964 541288 541612 542009 542594 543325 543955 544431 545048 545927
47825 545927 546595 546554 546129 546300 547743 550440 554178 558946 564801 571721 579770 589114 599857 612042 625833
47810 625833 641426 658846 678012 698787 720588 742156 762334 781092 799246 817036 833424
47799 833424 846871 856402 861784 863239 861234 856214 848329 837727 825202 812004 798771 785183 771025
47786 771025 757069 744298 732610 721001 708992 697262 686791 677835 669923 662522 655464 648874
47774 648874 642915 637648 633141 629654 627496 626603 626487 626921 628508 632142 637835 644404 650571 656155 661961
47759 661961 668574 675537 681825 686985 691658 696869 702977 709464 715756 721907 728343 735109 741743 747897
47745 747897 753775 759753 765732 771134 775552 779218 782700 786193 789251 791275 792136 792157 791464 789600 785940
47730 785940 780511 774187 768019 762395 756866 750697 743444 735090 725846 716001 705847 695602 685428
47717 685428 675628 666702 658949 652057 645398 638872 633125 628685 625185 621809 618368 615528 613970 613695
47703 613695 614273 615408 617089 619412 622496 626417 631062 636122 641356 646829 652845 659774 667840 676801
47689 676801 685754 693624 700084 705758 711332 716713 721340 725007 727910 730033 731073 731035 730364 729200 726910
47674 726910 722723 716556 708870 699981 690045 679630 669680 660676 652220 643760 635391 627541 620099 612416
47660 612416 604282 596428 589815 584703 580631 577087 573845 570801 567920 565434 563808 563264 563443 563666 563594
47645 563594 563573 564363 566475 569750 573644 577884 582668 588141 593964 599753 605816 613055 622105 632908 645244
47630 645244 659362 675836 695028 716892 741106 767191 794636 823105 852451 882381 912268
47619 912268 941392 969104 994538 1016459 1033850 1046524 1054766 1058433 1056896 1049938 1038201 1022509
47607 1022509 1003179 980295 954403 926507 897448 867661 837527 807719 779113 752437 727934
47596 727934 705223 683616 662827 643343 625864 610436 596368 582999 570246 558357 547474
47585 547474 537584 528599 520307 512507 505385 499446 494772 490655 486389 482189 478836 476529 474695 472895
47571 472895 471242 469727 467855 465375 462869 460989 459484 457618 455341 453283 451631 449808 447549 445661
47557 445661 445197 446222 447866 449423 450949 452805 455080 457634 460400 463372 466374 469070 471250 472964
47543 472964 474341 475440 476444 477829 479996 482697 485153 486911 488306 489858 491494 492799 493843 495222
47529 495222 497215 499320 500771 501228 500813 499815 498520 497085 495383 493243 490978 489350 488747 488633 488087 486691
47513 486691 484605 482029 479043 475953 473322 471454 470062 468607 466819 464814 462859 461154 459758 458575
47499 458575 457345 455794 453943 452315 451603 451958 452751 453270 453523 454014 454778 455171 454769 453982 453387 452877 451964
47482 451964 450748 450037 450525 452190 454502 456794 458432 458993 458561 457720 457169 457348 458230 459293 459850 459812 460010
47465 460010 461372 463749 465934 466878 466529 465490 464412 463931 464630 466553 469003 471256 473374 475973 479339
47450 479339 483230 487585 492956 500016 508822 518808 529425 540603 552621 565791 580447 596991 615532
47437 615532 635361 655200 674294 692975 711744 730002 746263 759580 770151 778389 784062 786693
47425 786693 786225 782815 776404 767072 755566 742857 729328 714928 699983 685241 671089 657359
47413 657359 644002 631431 620040 609871 601009 593783 588263 583940 580278 577311 575324 574262 573864
47400 573864 574232 575814 578860 583157 588254 593644 598840 603671 608511 613893 619800 625594 630776 635510
47386 635510 640211 644782 648537 650913 652050 652536 652585 651655 649070 644901 639937 634683 628787 621717 613662
47371 613662 605281 596698 587378 577095 566527 556612 547624 539160 530777 522338 513914 505734 498192 491625
47357 491625 485994 480908 475964 471020 466214 461804 457906 454269 450419 446146 441753 437706 434215 431309
47343 431309 429166 428017 427753 427935 428301 428984 430145 431566 432813 433685 434344 435058 435950 436991 438089 439142
47327 439142 440054 440802 441495 442233 442808 442642 441302 439118 437042 435696 434767 433611 432289 431559 431766 432152 431607
47310 431607 429964 428236 427576 428176 429278 430057 430268 430135 429960 430096 431084 433391 436913 440964 444923 448685
47294 448685 452445 456367 460632 465501 470952 476492 481728 486944 492741 499130 505392 510760 514914 517884
47280 517884 519986 521839 523887 525740 526490 525938 525107 525181 526243 527344 527530 526482 524405 521691 518669 515497
47264 515497 512333 509601 507752 506713 505989 505549 506094 508037 510705 513134 515390 518416 522778 528229 534474
47249 534474 541554 549185 556321 561854 565449 567430 568091 567492 565791 563448 561059 559097 557832 557474 558390
47234 558390 561015 565339 570536 575417 579384 582822 586558 591074 596164 601046 604806 607033 608165 608968
47220 608968 609640 609696 608819 607401 605926 604146 601288 597063 592098 587349 583256 579536 575605 571116 566197
47205 566197 561359 557272 554529 553408 553685 554745 556046 557481 559186 561168 563404 566243 570281 575678
47191 575678 581887 588304 595001 602575 611387 621193 631447 641788 652264 663192 674783 686761 698390
47178 698390 708912 717941 725440 731541 736499 740639 744116 746744 748176 748187 746727 743874 739886 735186
47164 735186 730091 724617 718740 712724 706956 701499 696032 690283 684334 678490 673072 668397 664751 662170
47150 662170 660378 659119 658549 659075 660740 662924 664868 666405 668010 670073 672384 674519 676499 678761 681477
47135 681477 684143 685929 686290 685188 682956 680020 676598 672567 667758 662381 656948 651753 646669 641514
47121 641514 636308 630989 625259 618993 612467 605885 598886 591003 582534 574486 567629 561942 556941 552179
47107 552179 547339 542248 537058 532189 527976 524537 521957 520268 519113 517802 516074 514556 514172 515097 516567
47092 516567 517679 518201 518607 519459 520826 522250 523339 524366 526081 528811 531969 534626 536435 537699 538744
47077 538744 539596 540251 540820 541247 541190 540445 539307 538271 537584 537282 537516 538453 539884 541294 542425 543488 544757
47060 544757 546245 547992 550339 553506 557057 560207 562761 565350 568556 572147 575490 578526 581914 586135
47046 586135 590762 594888 598182 601330 605329 610443 616000 621230 626065 630926 635920 640669 644981 649200
47032 649200 653544 657459 660123 661530 662518 663680 664702 664996 664554 663761 662634 660797 658229 655559 653414
47017 653414 651704 649860 647667 645573 644108 643220 642416 641417 640422 639700 639232 639011 639448 641023 643620 646570
47001 646570 649463 652461 655676 658711 661266 663836 667218 671481 676035 680699 686036 692353 698967 704922
46987 704922 710119 715282 721002 727243 733682 740052 746127 751801 757308 763072 769181 775192 780583 785225
46973 785225 789263 792710 795363 797122 798262 799333 800725 802311 803585 804183 804181 803778 802936 801607 800185 799397
46957 799397 799724 801184 803623 806830 810346 813644 816695 820003 823861 827938 831875 835886 840387 845341
46943 845341 850444 855741 861560 867870 874134 879832 884816 889167 892978 896245 898732 900004 899835 898413
46929 898413 895897 892104 887118 881854 877240 872891 867429 860286 852390 844801 837503 830089 822914 816787
46915 816787 811881 807731 804115 801279 799368 798241 797899 798608 800581 803977 809188 816595 825863 835947
46901 835947 846071 856475 867994 881056 895217 909556 923365 936506 949189 961472 973081
46890 973081 983721 993327 1001839 1008989 1014601 1018916 1022341 1025050 1027218 1029396 1032058 1034794 1036589 1037169
46876 1037169 1037602 1039246 1042520 1046991 1052313 1058562 1065757 1073572 1081656 1089989 1098777 1108050 1117453 1126441
46862 1126441 1134682 1142238 1149270 1155634 1160937 1164999 1168051 1170344 1171718 1171706 1170004 1166758 1162482 1157744
46848 1157744 1152899 1148035 1143183 1138515 1134255 1130460 1127022 1123908 1121335 1119732 1119528 1120799 1122984 1125221
46834 1125221 1127275 1129894 1133903 1139132 1144713 1150241 1155949 1161754 1166986 1171373 1175488 1179707 1183320 1185344
46820 1185344 1185809 1185546 1185021 1184059 1182478 1180290 1177363 1173636 1169648 1166101 1162788 1158703 1153431 1147752 1142568
46805 1142568 1137905 1133427 1129313 1125983 1123341 1120971 1118904 1117568 1117018 1116810 1116715 1117045 1118047 1119365 1120454
46790 1120454 1121373 1122911 1125860 1130324 1135677 1141168 1146501 1151885 1157615 1163705 1169880 1175777 1181119 1185916
46776 1185916 1190619 1195925 1202220 1209232 1216304 1222944 1229070 1234943 1241047 1247867 1255516 1263650 1271893 1280286
46762 1280286 1289156 1298690 1308834 1319468 1330392 1341296 1352000 1362570 1372827 1381986 1389359 1395333
46750 1395333 1400929 1406319 1410557 1413095 1414722 1416346 1417504 1417036 1414919 1412499 1410904 1410173 1410080 1410880 1412737
46735 1412737 1415086 1417250 1419299 1421677 1424182 1426027 1426932 1427614 1428931 1430854 1432531 1433226 1432962 1432253 1431334
46720 1431334 1429758 1426799 1422196 1416368 1409842 1402657 1394449 1384998 1374487 1363263 1351550 1339460 1327118
46707 1327118 1314629 1301901 1288587 1274334 1259157 1243546 1228056 1212833 1197690 1182650 1168219
46696 1168219 1155011 1143199 1132368 1121824 1111015 1099923 1089134 1079357 1070776 1063070 1056109 1050194
46684 1050194 1045359 1040859 1035897 1030714 1026479 1024096 1023562 1024436 1026336 1028746 1030862 1032166 1033056 1034544 1037267
46669 1037267 1040904 1044501 1047261 1049151 1050870 1053279 1056751 1060971 1065237 1068834 1071237 1072231 1071919 1070501
46655 1070501 1068070 1064781 1061169 1057992 1055620 1053769 1051981 1050187 1048743 1048053 1048344 1049650 1051951 1055348
46641 1055348 1060130 1066500 1074256 1082928 1092241 1102163 1112479 1122709 1132643 1142588 1152697 1162259 1170047
46628 1170047 1175269 1177999 1178793 1178201 1176536 1173738 1169390 1163115 1155024 1145666 1135542 1124832 1113534 1101721
46614 1101721 1089731 1078220 1067850 1058727 1050236 1041720 1033175 1025061 1017601 1010675 1004291 998676 993870
46601 993870 989655 985959 982883 980243 977559 974721 972204 970333 968726 966804 964476 961862 958709 954692
46587 954692 950178 946099 943005 940664 938635 936780 935130 933674 932500 931841 931761 932052 932578 933449 934693 936099
46571 936099 937605 939512 941986 944619 946883 948846 950987 953410 955734 957778 959843 962147 964433 966414
46557 966414 968326 970721 973898 977792 982193 986870 991630 996631 1002448 1009516 1017531 1025763 1033928 1042364
46543 1042364 1051329 1060620 1070108 1080299 1091943 1105220 1119650 1134770 1150540 1167051 1184132 1201506
46531 1201506 1219213 1237633 1257066 1277366 1298013 1318378 1337814 1355678 1371572 1385719 1398892
46520 1398892 1411755 1424269 1435843 1445931 1454386 1461306 1466790 1470873 1473517 1474625 1474219 1472604 1470160
46507 1470160 1467029 1463171 1458699 1453873 1448757 1443249 1437512 1431949 1426509 1420450 1413173 1405023 1396773 1388532
46493 1388532 1379684 1369795 1358962 1347206 1334152 1319656 1304270 1288654 1272726 1255825 1237580 1218287
46481 1218287 1198453 1178401 1158427 1139122 1121234 1105194 1090846 1077688 1065441 1054406 1045215
46470 1045215 1038205 1033130 1029563 1027460 1027203 1029120 1033074 1038527 1044870 1051754 1059227 1067599 1077018 1087114
46456 1087114 1097083 1106216 1114265 1121281 1127248 1131991 1135419 1137682 1139022 1139547 1139179 1137792 1135349 1131984
46442 1131984 1127938 1123375 1118276 1112697 1107151 1102523 1099397 1097556 1096384 1095653 1095662 1096629 1098353 1100643 1103785
46427 1103785 1108301 1114396 1121895 1130591 1140456 1151577 1164098 1178132 1193516 1209819 1226858 1245046
46415 1245046 1264780 1285477 1305731 1324606 1342444 1360113 1377782 1394681 1409813 1422590 1432995
46404 1432995 1441533 1448916 1455391 1460378 1463046 1463224 1461438 1458116 1453169 1446445 1438151 1428624 1418069 1406799
46390 1406799 1395452 1384556 1374070 1363742 1353817 1345010 1337838 1332401 1328782 1327147 1327256 1328390 1330134
46377 1330134 1332922 1337490 1344091 1352761 1364087 1379039 1397933 1420143 1445005 1472519 1502813 1535399
46365 1535399 1569485 1604777 1641459 1679403 1717874 1756090 1793643 1830193 1865072 1897454 1926697
46354 1926697 1952326 1973842 1990844 2003284 2011324 2014873 2013435 2006507 1994053 1976542 1954654 1929077
46342 1929077 1900547 1869915 1838057 1805697 1773317 1741174 1709369 1677945 1647063 1617146 1588841
46331 1588841 1562790 1539415 1518855 1501010 1485731 1473159 1463832 1458220 1456026 1456178 1457677 1460304 1464316
46318 1464316 1469695 1476061 1483272 1491755 1502163 1514915 1530066 1547360 1566322 1586494 1607624 1629483
$$ [...]