##TITLE=AC1472_13FE002654_8026838_OpbxDh4EUJ
##JCAMPDX= 6.0         $$ Bruker NMR JCAMP-DX V2.0
##DATA TYPE= NMR SPECTRUM
##DATA CLASS= NTUPLES
##ORIGIN= BRUKER
##OWNER= Administrator
$$ 1.72 TOPSPIN		Version 2.1
$$ 2013-07-11 21:55:53.768 -0700  Administrator@X
$$ Compression mode = diff/dup
##.OBSERVE FREQUENCY= 400.02188249412
##.OBSERVE NUCLEUS= ^1H
##.ACQUISITION MODE= SIMULTANEOUS (DQD)
##.ACQUISITION SCHEME= undefined
##.AVERAGES= 64
##.DIGITISER RES= 22
##SPECTROMETER/DATA SYSTEM= spect
##.PULSE SEQUENCE= noesygpps1d.comp
##.SOLVENT NAME= COFFEE_meoh
##.SHIFT REFERENCE= INTERNAL, COFFEE_meoh, 1, 14.96094
##AUDIT TRAIL= $$ (NUMBER, WHEN, WHO, WHERE, PROCESS, VERSION, WHAT)
$$ ##TITLE= Audit trail, TOPSPIN		Version 2.1
$$ ##JCAMPDX= 5.01
$$ ##ORIGIN= Bruker BioSpin GmbH
$$ ##OWNER= Administrator
$$ $$ E:\/data/COFFEE/nmr/AC1472_13FE002654_8026838_OpbxDh4EUJ/12/pdata/1/auditp.txt
$$ ##AUDIT TRAIL=  $$ (NUMBER, WHEN, WHO, WHERE, PROCESS, VERSION, WHAT)
(   1,<2013-07-11 21:55:48.737 -0700>,<Administrator>,<X>,<go>,<TOPSPIN 2.1>,
      <created by zg
	started at 2013-07-11 21:44:19.096 -0700,
	POWCHK enabled, PULCHK disabled,
       configuration hash MD5:
       C8 4E 4E 5D D3 5C D8 9E 9F 52 82 E0 59 8A DE 15
       data hash MD5: 64K
       8B AD E8 03 A7 13 8F E6 90 1F 83 2F DD 34 06 18>)
(   2,<2013-07-11 21:55:51.659 -0700>,<Administrator>,<X>,<proc1d>,<TOPSPIN 2.1>,
      <Start of raw data processing
       efp LB = 0.3 FT_mod = 6 PKNL = 1 PHC0 = 0 PHC1 = 0 SI = 128K 
       data hash MD5: 128K
       43 25 D4 F6 31 3E 26 69 63 DD 75 56 9D 2E A5 66>)
(   3,<2013-07-11 21:55:52.643 -0700>,<Administrator>,<X>,<proc1d>,<TOPSPIN 2.1>,
      <pk PHC0 = -79.77722 PHC1 = 0 
       data hash MD5: 128K
       67 48 90 36 0D FD D0 87 D4 96 5D 87 39 15 8D B7>)
(   4,<2013-07-11 21:55:53.143 -0700>,<Administrator>,<X>,<proc1d>,<TOPSPIN 2.1>,
      <abs ABSG = 1 
       data hash MD5: 128K
       41 9A 4D 42 BB 5E 48 78 AE 6E 32 26 9E 13 11 DB>)
(   5,<2013-07-11 21:55:53.253 -0700>,<Administrator>,<X>,<proc1d>,<TOPSPIN 2.1>,
      <abs ABSG = 2 
       data hash MD5: 128K
       D4 21 34 42 D2 D5 55 68 6E CF EB 7F B1 9E E2 C2>)
(   6,<2013-07-11 21:55:53.424 -0700>,<Administrator>,<X>,<proc1d>,<TOPSPIN 2.1>,
      <abs ABSG = 3 
       data hash MD5: 128K
       34 4E 5D 50 6A 4A 6B AB 0E 5E 12 36 4F 38 3A 9C>)
(   7,<2013-07-11 21:55:53.503 -0700>,<Administrator>,<X>,<proc1d>,<TOPSPIN 2.1>,
      <abs ABSG = 4 
       data hash MD5: 128K
       06 B8 96 7E D4 82 53 45 65 04 D7 13 41 DF 6A 32>)
(   8,<2013-07-11 21:55:53.596 -0700>,<Administrator>,<X>,<proc1d>,<TOPSPIN 2.1>,
      <abs ABSG = 5 
       data hash MD5: 128K
       2F 25 18 E7 BC 12 27 6E 33 50 A0 E3 93 F7 8B C7>)
$$ ##END=
$$ 
$$ $$ hash MD5
$$ $$ 0C 78 63 11 3C 8F CA 28 CB 6F B7 44 25 2F E9 93
##$RELAX= 
##$RELAX= 
##$RELAX= 
##$RELAX= 
##$RELAX= 
##$RELAX= 
##$RELAX= 
##$RELAX= 
$$ Bruker specific parameters
$$ --------------------------
##$DU= <E:\>
##$EXPNO= 12
$$ [...]
##$TP07= 0
##$TPNAME0= <>
##$TPNAME1= <>
##$TPNAME2= <>
##$TPNAME3= <>
##$TPNAME4= <>
##$TPNAME5= <>
##$TPNAME6= <>
##$TPNAME7= <>
##$TPOAL= (0..7)
0.5 0.5 0.5 0.5 0.5 0.5 0.5 0.5
##$TPOFFS= (0..7)
0 0 0 0 0 0 0 0
##$TUNHIN= 0
##$TUNHOUT= 0
##$TUNXOUT= 0
##$USERA1= <user>
##$USERA2= <user>
##$USERA3= <user>
##$USERA4= <user>
##$USERA5= <user>
##$V9= 5
##$VALIST= <valist>
##$VCLIST= <CCCCCCCCCCCCCCC>
##$VD= 0
##$VDLIST= <DDDDDDDDDDDDDDD>
##$VPLIST= <PPPPPPPPPPPPPPP>
##$VTLIST= <TTTTTTTTTTTTTTT>
##$WBST= 1024
##$WBSW= 4
##$XGAIN= (0..3)
0 0 0 0
##$XL= 0
##$YL= 0
##$YMAX_a= 6727787
##$YMIN_a= -13025064
##$ZGOPTNS= <>
##$ZL1= 120
##$ZL2= 120
##$ZL3= 120
##$ZL4= 120
##$ABSF1= 14.96094
##$ABSF2= -5.597241
##$ABSG= 5
##$ABSL= 3
##$ALPHA= 0
##$AQORDER= 0
##$ASSFAC= 0
##$ASSFACI= 0
##$ASSFACX= 0
##$ASSWID= 0
##$AUNMP= <proc_prof1d_extract.lims>
##$AXLEFT= 0
##$AXNAME= <>
##$AXNUC= <1H>
##$AXRIGHT= 0
##$AXTYPE= 0
##$AXUNIT= <>
##$AZFE= 0.1
##$AZFW= 0.1
##$BCFW= 0
##$BC_mod= 0
##$BYTORDP= 0
##$COROFFS= 0
##$CY= 15
##$DATMOD= 1
##$DC= 0
##$DFILT= <>
##$DTYPP= 0
##$F1P= 0
##$F2P= 0
##$FCOR= 0.5
##$FTSIZE= 131072
##$FT_mod= 6
##$GAMMA= 0
##$GB= 0
##$INTBC= 1
##$INTSCL= 1
##$ISEN= 128
##$LB= 0.3
##$LEV0= 0
##$LPBIN= 0
##$MAXI= 10000
##$MC2= 0
##$MEAN= 0
##$ME_mod= 0
##$MI= 0
##$NCOEF= 0
##$NC_proc= -2
##$NLEV= 6
##$NOISF1= 0
##$NOISF2= 0
##$NSP= 0
##$NTH_PI= 0
##$NZP= 0
##$OFFSET= 14.96094
##$PC= 1
##$PHC0= -79.77722
##$PHC1= 0
##$PH_mod= 1
##$PKNL= yes
##$PPARMOD= 0
##$PPDIAG= 0
##$PPIPTYP= 0
##$PPMPNUM= 2147483647
##$PPRESOL= 1
##$PSCAL= 4
##$PSIGN= 0
##$PYNMP= <proc.py>
##$REVERSE= no
##$SF= 400.020009662223
##$SI= 131072
##$SIGF1= 0
##$SIGF2= 0
##$SINO= 400
##$SIOLD= 131072
##$SPECTYP= <>
##$SREGLST= <1H.CDCl3>
##$SSB= 0
##$STSI= 131072
##$STSR= 0
##$SW_p= 8223.68421052631
##$SYMM= 0
##$S_DEV= 0
##$TDeff= 65536
##$TDoff= 0
##$TI= <>
##$TILT= no
##$TM1= 0
##$TM2= 0
##$TOPLEV= 0
##$USERP1= <user>
##$USERP2= <user>
##$USERP3= <user>
##$USERP4= <user>
##$USERP5= <user>
##$WDW= 1
##$XDIM= 131072
##$YMAX_p= 386558905
##$YMIN_p= -12300
##$CURPLOT= <Network HP LaserJet P1505>
##$CURPRIN= <$Network HP LaserJet P1505>
##$DFORMAT= <normdp>
##$LAYOUT= <+/1D_H.xwp>
##$LFORMAT= <normlp>
##$PFORMAT= <normpl>
##$SURQMSG= 1
$$ End of Bruker specific parameters
$$ ---------------------------------
##NTUPLES= NMR SPECTRUM
##VAR_NAME=  FREQUENCY,     SPECTRUM/REAL,   SPECTRUM/IMAG
##SYMBOL=    X,             R,               I
##VAR_TYPE=  INDEPENDENT,   DEPENDENT,       DEPENDENT
##VAR_FORM=  AFFN,          ASDF,            ASDF
##VAR_DIM=   131072,        131072,          131072
##UNITS=     HZ,            ARBITRARY UNITS, ARBITRARY UNITS
##FACTOR=    0.0627417313425164, 1,          1
##FIRST=     8223.62146879497, -1477,        -55560
##LAST=      0,             192,             -56183
##MIN=       0,             -12300,          0
##MAX=       8223.62146879497, 386558905,    0
$$ Real data points
##PAGE= N=1
##DATA TABLE= (X++(R..R)), XYDATA
$$ [...]
63847A479616M401k249q945j5668k1985k7378l1867l5933l9890m3580m6660m8880
63835A160982n0114n0436n0199m9791m9223m8102m6105m3408m0591l8095l5833
63824F59085l3400l0680k8107k6105k4451k2476j9884j7071j4626j2863j1801
63813D17621j1256j0855j0282r598q982q217o862n041l560k952k853k561j839
63800C32763q99p7J35q21k909n204o627o864o307n502m960n093n731n979n127
63785B70798l613k585k576l106l432l199k412j329m83l80r74j650j856j470p23
63770B41010J4K93j31j008j755k011j876j546r82j12P09P73k38j597k006j114
63754B28423j09l37j447j836q96K21M15J32K76P09Q56J145K349L922M384L435
$$ plain form
63847 1479616 1484017 1481768 1472823 1457155 1435170 1407792 1375925 1339992 1300102 1256522 1209862 1160982
63835 1160982 1110868 1060432 1010233 960442 911219 863117 817012 773604 733013 694918 659085
63824 659085 625685 595005 566898 540793 516342 493866 473982 456911 442285 429422 417621
63813 417621 406365 395510 385228 375630 366648 358431 351569 346528 342968 340016 337163 334602 332763
63800 332763 331864 331787 331922 331101 328192 322988 316361 309497 303190 297688 292728 287635 281904 275925 270798
63785 270798 267185 264600 262024 258918 255486 252287 249875 248546 248063 247683 246709 245059 243203 241733 241010
63770 241010 241024 241317 241186 240178 238423 236412 234536 232990 232008 231896 232605 233378 233140 231543 229537 228423
63754 228423 228314 227977 226530 224694 223798 224019 224434 224566 224842 225551 226407 227552 229901 233823 238207 241642
63738B41642K359K112K293K340K583L390M206M289L737L129K705K545K957L989
63724B84276N009N513N885O677P451P256O044M759M010L453K593J476L22q88k081
63709C41755k849k993l011l605m746n599n419m269k836j725j104q66q24o68l7
63694C01204J064K099K552K588K774L104K925K011J143J142J706J840J245N92
63680C27989M07L70j2n10m52L77J493K340K795L046L257L518L951M562N031M887
63664C63049M055L049K424K096J428k5k074m120n586o189o103n950o237o640o287
63649C26890m929l411k645k494k169j419p25m28k77P2O62J521K805M400N675O009
63633C29537N432M589M176M568N654O914P776Q177Q601R441J0466J1223J1760
$$ plain form
63738 241642 244001 246113 248406 250746 253329 256719 260925 265214 268951 272080 274785 277330 280287 284276
63724 284276 289285 294798 300683 307360 314811 322067 328111 332870 336880 340333 342926 344402 344724 343836 341755
63709 341755 338906 335913 332902 329297 324551 318952 313533 309264 306428 304703 303599 302733 301909 301241 301204
63694 301204 302268 304367 306919 309507 312281 315385 318310 320321 321464 322606 324312 326152 327397 327989
63680 327989 328396 328766 328754 328244 327792 328169 329662 332002 334797 337843 341100 344618 348569 353131 358162 363049
63664 363049 367104 370153 372577 374673 376101 376076 374002 369882 364296 358107 352004 346054 339817 333177 326890
63649 326890 321961 318550 315905 313411 311242 309823 309098 308670 308393 308465 309127 310648 313453 317853 323528 329537
63633 329537 334969 339558 343734 348302 353956 360870 368646 376823 385424 394865 405331 416554 428314
63620D28314J2641J4179J6040J7718J9186K0836K2880K5089K7158K9074L0958
63609F64073L2711L4041L4773L4859L4031L1845K8166K3370J7830J1590M953r61
63597I51281m937o942q127r327j0161r961r138r060j0669j3668j6989j9674k1373
63584H01255k2318k2913k3151k2452k0460j7877j5999j5205j4375j2224q952o013
63572E99316m338l318j745O57L052M620N425O098P043Q132R001R423R486R622
63558F62474J0346J1788J3566J5238J6848J8778K1212K4107K7618L2062L7254
63547H91291M2232M5878M7422M6127M1055L1972K0336Q722r32q113j2935j5405
63535A137650j5743j4773j3326j1623r800q643r068j1007j3490j5951j8716k2004
$$ plain form
63620 428314 440955 455134 471174 488892 508078 528914 551794 576883 604041 633115 664073
63609 664073 696784 730825 765598 800457 834488 866333 894499 917869 935699 947289 952242 951281
63597 951281 946344 939402 931275 921948 911787 901826 892688 883628 872959 859291 842302 822628 801255
63584 801255 778937 756024 732873 710421 689961 672084 656085 640880 626505 614281 605329 599316
63572 599316 594978 591660 589915 590572 593624 598244 603669 609767 616810 624942 633943 643366 652852 662474
63558 662474 672820 684608 698174 713412 730260 749038 770250 794357 821975 854037 891291
63547 891291 933523 979401 1026823 1072950 1114005 1145977 1166313 1175035 1174103 1165990 1153055 1137650
63535 1137650 1121907 1107134 1093808 1082185 1072385 1063742 1054674 1043667 1030177 1014226 995510 973506
63523I73506k5172k7470k9063l0614l2035l2365l1059k8774k6653k5171k3966
63512F61164k2522k0653j8448j6182j4257j2926j1935j0700q981p177n919n484
63500E05980n719o251o596o342n515m676m289m119l583k656j964j882k005j772
63486D48611j196o56j95N12J602K803L821M592N182N623N915N987N708N042M153
63471D97504L163J924K90j497l005m136n150o150o938p403p687p781p319o008
63457D39807m133k400j429j353j742j857j262k03Q47J936L487N385O859P563Q209
63442D59714R704J2110J4968J8153K1814K5811K9868L3992L7876M0161L9205L4839
63430G78215K8546K1788J4969Q370L131N24O77K684N734R561J4061J9074K4490
$$ plain form
63523 973506 948334 920864 891801 861187 829152 796787 765728 736954 710301 685130 661164
63512 661164 638642 617989 599541 583359 569102 556176 544241 533541 524560 517383 511464 505980
63500 505980 500261 494010 487414 481072 475557 470881 466592 462473 458890 456234 454270 452388 450383 448611
63486 448611 447415 446759 446564 447076 448678 451481 455302 459894 465076 470699 476614 482601 488309 493351 497504
63471 497504 500667 502591 502881 501384 498379 494243 489093 482943 476005 468602 460915 453134 445815 439807
63457 439807 435674 433274 431845 430492 428750 426893 425631 425428 426275 428211 431698 437083 443942 451505 459714
63442 459714 469418 481528 496496 514649 536463 562274 592142 626134 664010 704171 743376 778215
63430 778215 806761 828549 843518 851888 855019 855543 856220 858904 864638 874199 888260 907334 931824
63417I31824L0064L5044L8349L9147L7101L2321K5525J8092J1354N688O36m049
63405A201096p899j0366j1530j2017j2497j3516j5456j8352k1860k5531k9006
63394A023066l1860l3574l3989l3487l2498l0952k8641k5891k3398k1365j9287
63383G08124j6751j4038j1674r738p940o121m266k205K75K988N355P040Q234R333
63369F68616J0565J2048J3886J5986J8031J9845K1633K3637K5813K7998L0256
63358H88314L2690L5086L7049L8405L9091L8697L6526L2221K6093J8839J1208
63347A234219L996k111o858j0377j2677j3577j3310j2844j3258j4925j7552k0694
63335A100032k3986k7132l0027l2736l4935l5655l4130l0849k7182k3860k0408
$$ plain form
63417 931824 961888 996932 1035281 1074428 1111529 1143850 1169375 1187467 1198821 1204509 1205145 1201096
63405 1201096 1193197 1182831 1171301 1159284 1146787 1133271 1117815 1099463 1077603 1052072 1023066
63394 1023066 991206 957632 923643 890156 857658 826706 798065 772174 748776 727411 708124
63383 708124 691373 677335 665661 655923 647983 641862 637596 635391 635666 638654 644009 651049 659283 668616
63369 668616 679181 691229 705115 721101 739132 758977 780610 804247 830060 858058 888314
63358 888314 921004 956090 993139 1031544 1070635 1109332 1145858 1178079 1204172 1223011 1234219
63347 1234219 1238215 1236104 1229246 1218869 1206192 1192615 1179305 1166461 1153203 1138278 1120726 1100032
63335 1100032 1076046 1048914 1018887 986151 951216 915561 881431 850582 823400 799540 779132
63324G79132j6179j1407o913l295r66n47k579o763j1956j6910k0761k2926k3172
63311F34758k1976k0372j9065j7854j6182j4036j2060j0825j0275r884r196q153
63299D64880p070o339o096o195o415o555o366n627m521l694l589l886l863l360
63285C91304k988l270l911m152l688k958k563k599k556j924q65j97n33j522k202
63270C55376k111j691j497j433j084m78p4j12l76n64o01n53m90m85n70o22m55
63253C42180J9O97J255J216M14m29r6J682L559L973K996K084K119K625L071L862
63237C71227N446P180P951P650P232P392P831P900P500P207P705R127J0728J1385
63223D83461J0706R543R048R375R727R611R484R945J0806J1349J1195J0500R411
$$ plain form
63324 779132 762953 751546 744633 741338 740372 739825 737246 730483 718527 701617 680856 657930 634758
63311 634758 612782 592410 573345 555491 539309 525273 513213 502388 492113 482229 473033 464880
63299 464880 457810 451471 445375 439180 432765 426210 419844 414217 409696 406002 402413 398527 394664 391304
63285 391304 388316 385046 381135 376983 373295 370337 367774 365175 362619 360695 359830 359633 359100 357578 355376
63270 355376 353265 351574 350077 348644 347560 347082 347008 346896 346520 345956 345355 344802 344312 343827 343257 342635 342180
63253 342180 342199 342896 344151 345367 345781 345352 345256 346938 350497 354470 357466 359550 361669 364294 367365 371227
63237 371227 376673 383853 391804 399454 406686 414078 421909 429809 437309 444516 452221 461348 472076 483461
63223 483461 494167 503710 512758 522133 531860 541471 550955 560900 571706 583055 594250 604750 614161
63210F14161P811N708L511J675J51j531l687o144q534j0558j1909j2261j1776
63197E66617j1306j1586j2154j1681r515o475l873k168r06M22J949L545N014O230
63183E14113P430R154J1543J3866J5140J5149J4533J4012J3876J4028J4148J3829
63171F70821J3009J2202J1935J2057J1930J1127R599P351M542J718o62k941n911
63158G56777r701j3540j6660j8841k0119k0655k0939k1418k1736k1107j9607j8203
63146E34251j7266j6010j3950j1846j0449r275p643o046n276m805l540j832j160
63133D25153j770k207j588q74j073j478p71R24K252K491K139J909K029K550L495
63118D33181M516M990M686M046L701L903M395M621M206L488L358M193N168N171
$$ plain form
63210 614161 621972 627680 631191 632866 633017 631486 627799 621655 613121 602563 590654 578393 566617
63197 566617 555311 543725 531571 519890 510375 503900 500027 497859 496953 497375 499324 502869 507883 514113
63183 514113 521543 530697 542240 556106 571246 586395 600928 614940 628816 642844 656992 670821
63171 670821 683830 696032 707967 720024 731954 743081 752680 760031 764573 766291 765629 762688 756777
63158 756777 747076 733536 716876 698035 677916 657261 636322 614904 593168 572061 552454 534251
63146 534251 516985 500975 487025 475179 464730 455455 447812 441766 436490 431685 428145 426313 425153
63133 425153 423383 421176 419588 418714 417641 416163 415392 416316 418568 421059 423198 425107 427136 429686 433181
63118 433181 437697 442687 447373 451419 455120 459023 463418 468039 472245 475733 479091 483284 488452 493623
63104D93623M267L625L982M844N362N372N170M859M405M025M049M482N051N474
63090E58590N462M712L263J709O18m0n73r81j191j625k773m234m956m649m172
63075E49160m191m197l456k331j773j914j921j259k52O39J396K103K683L316M513
63060E42516O369Q127Q990R178R758J1421J3769J5830J7073J7836J8826K0265
63048F99958K1731K2917K4209K6017K7785K8400K7697K6746K6382K6209K5594
63037I83645K4877K4705K4831K4568K4092K4166K4605K4230K2502K0087J7360
63026A239668J3534P990J642m103r100j4220j9576k4167k7268k9293l0900l1970
63014A072237l1904l0533k8317k5826k3317k0702j7718j4187j0223o145k167J673
$$ plain form
63104 493623 497890 501515 505497 510341 515703 521075 526245 531104 535509 539534 543583 548065 553116 558590
63090 558590 564052 568764 572027 573736 574354 574314 573741 572760 571569 569944 567171 562937 557981 553332 549160
63075 549160 544969 540772 537316 534985 533212 531298 529377 528118 527866 528505 529901 532004 534687 538003 542516
63060 542516 548885 557012 566002 575180 584938 596359 610128 625958 643031 660867 679693 699958
63048 699958 721689 744606 768815 794832 822617 851017 878714 905460 931842 958051 983645
63037 983645 1008522 1033227 1058058 1082626 1106718 1130884 1155489 1179719 1202221 1222308 1239668
63026 1239668 1253202 1261192 1262834 1258731 1249631 1235411 1215835 1191668 1164400 1135107 1104207 1072237
63014 1072237 1040333 1009800 981483 955657 932340 911638 893920 879733 869510 863365 861198 862871
63002H62871N286Q459J1119J3433J5548J7344J8732J9955K1359K2807K3685K3633
62990A064231K3116K2954K3332K3629K3281K2453K1540K0377J8344J5187J1186
62979A289630O499R39n366j1604j7036k1775k6395l0935l4752l7327l8748l9382
62967A033748l9399l8690l7168l4975l2506l0166k8083k6214k4645k3455k2271
62956F96176k0501j8318j6805j6545j6555j5422j3249j1638j1673j2692j3234
62945E29544j2549j0993r487q822q992r047q054o352n215n158n297m697l652l081
62931D28148l272l780m194m325m025l392k907k877k961k662k064j595j380j241
62917C87473j105r39n64m3J17l42q21n90K01Q49J118J257J317J263J481K287L108
$$ plain form
63002 862871 868157 876616 887735 901168 916716 934060 952792 972747 994106 1016913 1040598 1064231
62990 1064231 1087347 1110301 1133633 1157262 1180543 1202996 1224536 1244913 1263257 1278444 1289630
62979 1289630 1296129 1297068 1291702 1280098 1263062 1241287 1214892 1183957 1149205 1111878 1073130 1033748
62967 1033748 994349 955659 918491 883516 851010 820844 792761 766547 741902 718447 696176
62956 696176 675675 657357 640552 624007 607452 592030 578781 567143 555470 542778 529544
62945 529544 516995 506002 496515 487693 478701 469654 461600 455248 450033 444875 439578 434881 431229 428148
62931 428148 424876 421096 416902 412577 408552 405160 402253 399376 396415 393753 391689 390094 388714 387473
62917 387473 386368 385429 384865 384822 384939 384597 383776 383186 383387 384236 385354 386611 387928 389191 390672 392959 396067
62900C96067L106K511K300K622K739K635L316N024O377O089M603L222K487K198
62886D45296K290K659K705K007J117P84P47K11p69j433j629k027k920l793m252
62871D40993m598n172n733n831n367m535l603k887k678k996l628m291m530l818
62857C81326k215p21k73n72o16k66l32j007j339o78K96O21L60J30L7q1J45J098
62839C75913K163K252J349N98P06J127J146R42J050J400J589J665J886J963J325
62824C97074K37k08N09J512J627R36N61J135K100K627K585K325J964J396P44L29
62808D17453K14J78J57M03J057J887K619L352M352N452N880M977L119J691J844
62793D54635L392N173O394P229Q073Q879R517J0320J1681J3509J5541J7962K1070
$$ plain form
62900 396067 399173 401684 403984 406606 409345 411980 415296 420320 426697 432786 437389 440611 443098 445296
62886 445296 447586 450245 452950 454957 456074 456858 457605 457816 457047 455614 453985 451958 449038 445245 440993
62871 440993 436395 431223 425490 419659 414292 409757 406154 403267 400589 397593 393965 389674 385144 381326
62857 381326 379111 378390 378117 377545 376929 376663 376331 375324 373985 373307 373603 374224 374584 374714 374751 374670 374815 375913
62839 375913 378076 380328 381677 382275 382981 384108 385254 386196 387246 388646 390235 391900 393786 395749 397074
62824 397074 397311 397103 397612 399124 400751 401687 402248 403383 405483 408110 410695 413020 414984 416380 417124 417453
62808 417453 417667 417845 418002 418405 419462 421349 423968 427320 431672 437124 443004 447981 451100 452791 454635
62793 454635 458027 463200 469594 476823 484896 493775 503292 513612 525293 538802 554343 572305 593375
62780E93375K4517K7509K9797L1902L4261L6643L8500L9467L9549L9124L8620
62769I73264L7787L5477L0860K4706J8640J3110P106P2o959j2753j7421k1850
62757A082039k6276l0297l3714l6495l8248l8625l8000l7003l5574l3330l0660
62746G03817k8573k7389k6345k4664k2373j9937j7667j5638j3772j1829r795q205
62734D77630p586p540p040n724m316l542l254k883k193j232J4J411K474K730K256
62719D41205J635J543K337L738M900N213N137N725P290R075J0439J1661J3307
62706E23205J5338J7376J9361K1412K3441K5377K7427K9665L1772L3685L6058
62695H04117L9438M3204M6046M7324M7403M6769M5489M3430M0403L6069L0229
$$ plain form
62780 593375 617892 645401 675198 707100 741361 778004 816504 855971 895520 934644 973264
62769 973264 1011051 1046528 1077388 1102094 1120734 1133844 1140950 1141022 1134063 1121310 1103889 1082039
62757 1082039 1055763 1025466 991752 955257 917009 878384 840384 803381 767807 734477 703817
62746 703817 675244 647855 621510 596846 574473 554536 536869 521231 507459 495630 485835 477630
62734 477630 470044 462504 455464 449740 445424 441882 438628 435745 433552 432320 432334 433745 436219 438949 441205
62719 441205 442840 444383 446720 450458 455358 460571 465708 471433 478723 487798 498237 509898 523205
62706 523205 538543 555919 575280 596692 620133 645510 672937 702602 734374 768059 804117
62695 804117 843555 886759 932805 980129 1027532 1074301 1119790 1163220 1203623 1239692 1269921
62684A269921K3226J5598P514j002r495j7465k5092l2708l9627m4451m6764m7594
62672A052061m7908m7556m6182m4190m2146l9916l7175l4221l1498k8772k5629
62661F26868k2491k0142j8501j6750j4695j3083j2319j1758j0582q885p407o597
62649D63658o330o279o225o065n739n169m280l176k193j547j034l87K29L99O6
62634D15928m34r02j277j266o17J56O9j002j966j945j365j082j021n47K24M40
62618D03393j35o76m10M94J381J899J996J587P49J0j0P16J599K063K097K199K868
62601D21820M158N648O877P824Q879J0362J2158J3857J5179J6161J6974J7645
62589E57542J8030J8080J8027J8036J7673J6064J2881Q929N386K583q2l103o246
$$ plain form
62684 1269921 1293147 1308745 1316259 1315257 1305762 1288297 1263205 1230497 1190870 1146419 1099655 1052061
62672 1052061 1004153 956597 910415 866225 824079 784163 746988 712767 681269 652497 626868
62661 626868 604377 584235 565734 548984 534289 521206 508887 497129 486547 477662 470255 463658
62649 463658 457328 451049 444824 438759 433020 427851 423571 420395 418202 416655 415621 415234 415463 415862 415928
62634 415928 415494 414592 413315 412049 411432 411588 411657 410655 408689 406744 405379 404297 403276 402729 402953 403393
62618 403393 403258 402582 402172 402666 404047 405946 407942 409529 410278 410288 410278 410994 412593 414656 416753 418952 421820
62601 421820 425978 431626 438503 446327 455206 465568 477726 491583 506762 522923 539897 557542
62589 557542 575572 593652 611679 629715 647388 663452 676333 685262 690648 693231 693149 690046 683800
62576F83800r069j1549j3865j5847j7043j7275j6881j6459j6396j6603j6563j5821
62564E00429j4477j3079j1961j0936r748q556p637o871n951m971m432m519m750
62551C92541m519l772k957k443k169j837j271n58R2O05J087J591J854J469M41
62536C80154n68p19J75J473K387K771L008L297L388L136K960L378M291N167N885
62521D20183O922Q529J0256J1642J2941J4672J6712J8490K0036K2066K4800K7330
62509F14579K8696K9061K9187K9088K7998K5691K2895K0150J7003J2918Q372M263
62497H69901N85l387p617j0924j2381j2354j1809j1153j0240q992p468n587l372
62484G65202j150R08L142N708P865Q649Q122P224O362M959K489p81m361q101j1883
$$ plain form
62576 683800 674731 663182 649317 633470 616427 599152 582271 565812 549416 532813 516250 500429
62564 500429 485952 472873 460912 449976 440228 431672 424035 417164 411213 406242 401810 397291 392541
62551 392541 388022 384250 381293 378850 376681 374844 373573 373015 373107 373712 374799 376390 378244 379713 380154
62536 380154 379586 378867 379042 380515 382902 385673 388681 391978 395366 398502 401462 404840 409131 414298 420183
62521 420183 427105 435634 445890 457532 470473 485145 501857 520347 540383 562449 587249 614579
62509 614579 643275 672336 701523 730611 758609 784300 807195 827345 844348 857266 865638 869901
62497 869901 870486 867099 859482 848558 836177 823823 812014 800861 790621 781629 774161 768574 765202
62484 765202 764052 764960 768102 773810 781675 790324 798446 805670 812032 816991 819480 818699 814338 806237 794354
62469G94354j5303j8157k0773k3376k5545k6694k6814k6295k5330k3901k2143
62458E40023k0315j8576j7032j5804j4731j3344j1481r623q217p058n786m633
62446C93423m043l778l100j822n15L69R97J637K122K119J575P36o2n51p03p74
62430C87630r71j147j074r20j054j439j638j374q00j87K59L39J3m30p41j121j802
62413C73543k352k071j061k37o9r8J36L88L58L17N75Q54Q17P34J020J528J966
62396C76348K646L979N416N784M836L727L640M476N234N278M834M509M725N582
62382D41014O935Q419R576J0170J0435J0865J1601J2163J2092J1768J2050J3127
62370E70215J4220J4784J5455J7217J9984K2748K5048K7564L1050L5278L9403
$$ plain form
62469 794354 779051 760894 740121 716745 691200 664506 637692 611397 586067 562166 540023
62458 540023 519708 501132 484100 468296 453565 440221 428740 419117 410900 403842 398056 393423
62446 393423 389380 385602 382502 380680 380165 380534 381531 383168 385290 387409 388984 389720 389658 389107 388404 387630
62430 387630 386659 385512 384438 383518 382464 381025 379387 378013 377213 377026 377285 377624 377637 377207 376466 375345 373543
62413 373543 371191 369120 368059 367822 367753 367655 367791 368179 368537 368854 369429 370283 371100 371834 372854 374382 376348
62396 376348 378994 382973 388389 394173 399009 402736 406376 410852 416086 421364 426198 430707 435432 441014
62382 441014 447949 456368 465944 476114 486549 497414 509015 521178 533270 545038 557088 570215
62370 570215 584435 599219 614674 631891 651875 674623 699671 727235 758285 793563 832966
62359H32966M3082M6862N1449N6839O2107O6031O7868O7578O5300O0922N4332
62348A475336M5935L6587K7023J7600Q446m26r091j7478k5191l1846l7537m2519
62336A446839m6546m8973m9732m9627m9372m8768m7209m4711m1934l9338l6744
62325I43885l3839l0801k8228k6567k5681k4997k4062k2918k1873k0981k0020
62314F63918j8947j8026j7380j6652j5403j3620j1657r817q287p187o371n345
62302E15226l854k453j982k490l006k636j457j87O75J082J116Q85O47P38J266
62287E03570K062K862L434L638L581L641M050M530M554M046L565L671M370N249
62273E56823O033O784P663Q702R853J1185J2924J5294J8220K1317K4313K7454
$$ plain form
62359 832966 876048 922910 974359 1031198 1093305 1159336 1227204 1294782 1360082 1421004 1475336
62348 1475336 1521271 1557858 1584881 1602481 1610927 1610501 1601410 1583932 1558741 1526895 1489358 1446839
62336 1446839 1400293 1351320 1301588 1251961 1202589 1153821 1106612 1061901 1019967 980629 943885
62325 943885 910046 879245 851017 824450 798769 773772 749710 726792 704919 683938 663918
62314 663918 644971 626945 609565 592913 577510 563890 552233 542416 534129 526942 520571 515226
62302 515226 511372 508919 506937 504447 501441 498805 497348 497161 497836 498918 500034 500919 501566 502304 503570
62287 503570 505632 508494 511928 515566 519147 522788 526838 531368 535922 539968 543533 547204 551574 556823
62273 556823 562856 569640 577303 586005 595858 607043 619967 635261 653481 674798 699111 726565
62261G26565L1357L6291M1870M7406N2495N7072O1180O4848O7997P0143P0270
62250A327494O7348O1139N2383M2209L1487K0667R909q00j1442k1700l0957l8741
62238A508996m5085n0362n4857n8555o1242o2632o2407o0381n6814n2440m8015
62227H96206m3776l9522l5220l1219k7818k4827k1968j9465j7755j6646j5363
62216F02627j3578j1829j0619r635q389p189o754p049p225o688n651m566l560
62203D99895k551j452j90J101J937K086K259L430N432P022P619Q070R221J0554
62189E54433J1135J1168J1649J2806J3926J4567J4989J5312J5121J4136J2684
62178G01926J1294J0276R808R889J0097R903R470R744J1565J5061J9926K5761
$$ plain form
62261 726565 757922 794213 836083 883489 935984 993056 1054236 1119084 1187081 1257224 1327494
62250 1327494 1394842 1455981 1508364 1550573 1582060 1602727 1612636 1611836 1600394 1578694 1547737 1508996
62238 1508996 1463911 1413549 1358692 1300137 1238895 1176263 1113856 1053475 996661 944221 896206
62227 896206 852430 812908 777688 746469 718651 693824 671856 652391 634636 617990 602627
62216 602627 589049 577220 566601 556966 548577 541388 534634 527585 520360 513672 508021 503455 499895
62203 499895 497344 495892 495702 496803 498740 500826 503085 506515 511947 518969 526588 534658 543879 554433
62189 554433 565568 576736 588385 601191 615117 629684 644673 659985 675106 689242 701926
62178 701926 713220 723496 733304 743193 753290 763193 772663 782407 793972 809033 828959 854720
62166H54720L1876L7323M1570M4844M7426M8910M8495M5855M1342L5456K8454
62155A306271K0556J2223M108l336j0130j6604k2890k8684l3586l7525m0653m2973
62143A106777m4372m4862m4419m2776l9838l6204l2697k9394k5759k1820j8410
62132G26226j5961j3836j1301q562o234m328k484p76N42J848L840O472Q968J0991
62118F95405J3095J5762J8575K0665K1584K1466K0652J9371J7596J5065J1799
62107H91035Q634O827O804P554P564O222M031J761k58k042l583m731n302n212
62093I19304m506l349j986o83L90J297K306L577M983O301P551Q942J0552J2337
62079I67016J4390J6881J9629K2090K3975K5617K7469K9446L1056L2017L2464
$$ plain form
62166 854720 886596 923919 965489 1010333 1057759 1106669 1155164 1201019 1242361 1277817 1306271
62155 1306271 1326827 1339050 1343158 1339822 1329692 1313088 1290198 1261514 1227928 1190403 1149750 1106777
62143 1106777 1062405 1017543 973124 930348 890510 854306 821609 792215 766456 744636 726226
62132 726226 710265 696429 685128 676566 670332 666004 663520 662744 663286 665134 668974 675446 684414 695405
62118 695405 708500 724262 742837 763502 785086 806552 827204 846575 864171 879236 891035
62107 891035 899669 906496 913300 920854 928418 934640 938671 940432 940174 938132 934549 929818 924516 919304
62093 919304 914798 911449 909463 908780 909170 910467 912773 916350 921333 927634 935185 944127 954679 967016
62079 967016 981406 998287 1017916 1040006 1063981 1089598 1117067 1146513 1177569 1209586 1242050
62068A242050L2619L2618L2672L3052L3730L4231L4004L2823L0760K7848K3953
62057A590360J8991J3128O817O40m892r583j3699j7771k2126k6579l0682l4249
62045A470355l7489m0584m3279m5031m5524m4977m4005m3193m2619m1664l9543
62034A002447l6277l3023l0944k9844k8299k5375k1735j8732j6764j5046j2905
62023G33503j0732r471r535j0455j1365j1622j1150j0446j0215j0733j1455j1435
62011F04889j0230q296o415m846l213j173J080L156M953O608Q059R011R336R180
61997F22099Q563P265N311L276J714M70j041k967m842o347p770r468j1170j2206
61983E92887j2309j1895j1481j1114j0468r465q500q030p950p665o772n540m483
$$ plain form
62068 1242050 1274669 1307287 1339959 1373011 1406741 1440972 1474976 1507799 1538559 1566407 1590360
62057 1590360 1609351 1622479 1629296 1629936 1625044 1615461 1601762 1583991 1561865 1535286 1504604 1470355
62045 1470355 1432866 1392282 1349003 1303972 1258448 1213471 1169466 1126273 1083654 1041990 1002447
62034 1002447 966170 933147 902203 872359 844060 818685 796950 778218 761454 746408 733503
62023 733503 722771 713300 703765 693310 681945 670323 659173 648727 638512 627779 616324 604889
62011 604889 594659 586363 579948 575102 571889 570716 571796 574952 579905 586513 594572 603583 612919 622099
61997 622099 630662 637927 643238 646514 648228 648698 647657 644690 639848 633501 625731 616263 605093 592887
61983 592887 580578 568683 557202 546088 535620 526155 517655 509625 501675 494010 487238 481698 477215
61970D77215l717k994k265j778j587j398j111j058j408j595q73O60K037K524K395
61955D65047K464L169M298N468O536P600Q771J0054J1398J2849J4621J6945J9743
61942E88963K2546K4864K6761K8847L1574L4526L6708L7596L7648L7592L7483
61931I45108L6821L5381L3383L0925K7805K4084K0146J5982J0981N004r17n588
61919A179115q981j1817j4088j4936j3967j1754q791m885n4M793Q843J2479J6671
61906A132628K1422K5537K7771K7674K5374K1280J6044J0341M382k008q727j5117
61894A286601k0575k5137k9160l2588l4866l5632l5254l4531l3874l2985l1393
61883I40606k9175k6949k5244k4094k3232k2376k1291j9867j8328j7083j6225
$$ plain form
61970 477215 473498 470504 468239 466461 464874 463476 462365 461307 459899 458304 457431 458091 460128 462652 465047
61955 465047 467511 470680 474978 480446 486982 494582 503353 513407 524805 537654 552275 569220 588963
61942 588963 611509 636373 663134 691981 723555 758081 794789 832385 870033 907625 945108
61931 945108 981929 1017310 1050693 1081618 1109423 1133507 1153653 1169635 1180616 1185620 1184703 1179115
61919 1179115 1170134 1158317 1144229 1129293 1115326 1103572 1094781 1089896 1089842 1094635 1103478 1115957 1132628
61906 1132628 1154050 1179587 1207358 1235032 1260406 1281686 1297730 1308071 1312453 1310445 1301718 1286601
61894 1286601 1266026 1240889 1211729 1179141 1144275 1108643 1073389 1038858 1004984 971999 940606
61883 940606 911431 884482 859238 835144 811912 789536 768245 748378 730050 712967 696742
61872F96742j5313j3775j1418q499n605l421k197j294K87K783N511Q050J0904
61859F62755J4493J8189K1167K3766K7074L1394L6030M0496M4961M9382N3187
61848A022894N6124N8580O0662O1691O1075N8968N5550N0258M2523L2839K2459
61837A583623J2291K667o011j3125j8304k1550k2784k1665j7975j1979m512L216
61825A463892J0025J5366J9439K2521K4257K3843K0757J5045P040k780j3700k4737
61813A580968l4851m3212m9465n3869n6941n8837n9331n8470n6829n4766n1917
61802A002480m7946m3454l9447l6117l2840k9380k6336k4202k2596k0763j8433
61791F60966j5840j3236j0794q793p523p041p102p357p441p022n962m527l320
$$ plain form
61872 696742 681429 667654 656236 647737 642132 638711 636514 635220 635507 638290 643801 651851 662755
61859 662755 677248 695437 716604 740370 767444 798838 834868 875364 920325 969707 1022894
61848 1022894 1079018 1137598 1198260 1259951 1321026 1379994 1435544 1485802 1528325 1561164 1583623
61837 1583623 1595914 1598581 1592570 1579445 1561141 1539591 1516807 1495142 1477167 1465188 1460676 1463892
61825 1463892 1473917 1489283 1508722 1531243 1555500 1579343 1600100 1615145 1622185 1619405 1605705 1580968
61813 1580968 1546117 1502905 1453440 1399571 1342630 1283793 1224462 1165992 1109163 1054397 1002480
61802 1002480 954534 911080 871633 835516 802676 773296 746960 722758 700162 679399 660966
61791 660966 645126 631890 621096 612303 604780 597739 590637 583280 575839 568817 562855 558328 555008
61778E55008k836k916k828k112j308j374k263k651j533L81J475J129J83l33j51
61763E37871M83J261J757J654J221J103J392J481J042N68N48O77L84k63o19k61
61747E50299O24J357J109l52k040k438j258J00L42j27j52L26M17o0l00Q4M96M87
61729E48914M39P62J224J555J990K689L203L148K960L330M169M734M616M109L732
61714E91574L711L832L516K280L80j269k130k641l453m434m977m992m917m939
61700E71541m798m393l919l455k975k697k820k860k016l79R30J168Q45Q57J286
61685E46315J643J717J625J393J111J134J609K035J890J431J191J009L06p14j091
61670E62604m61L56M51j74r94j745k317k416j928j383j388j747j639o83O01J462
$$ plain form
61778 555008 552172 549256 546428 544316 543008 541634 539371 536720 535187 535568 537043 538172 538355 538022 537871
61763 537871 538354 539615 541372 543026 544247 545350 546742 548223 549265 549833 550381 551058 551442 551179 550560 550299
61747 550299 550923 552280 553389 553037 550997 548559 547301 547401 547743 547616 547464 547790 548207 548147 547847 547931 548427 548914
61729 548914 549353 550115 551339 552894 554884 557573 560776 563924 566884 570214 574383 579117 583733 587842 591574
61714 591574 595285 599117 602633 604913 605293 604024 601894 599253 595800 591366 586389 581397 576480 571541
61700 571541 566743 562350 558431 554976 552001 549304 546484 543624 541608 541229 542159 543327 544172 545029 546315
61685 546315 547958 549675 551300 552693 553804 554938 556547 558582 560472 561903 563094 564103 564409 563695 562604
61670 562604 562143 562499 562950 562776 561782 560037 557720 555304 553376 551993 550605 548858 547219 546536 547137 548599
61654E48599J713J710J855K283K926L642M204M335L937L417L454M282N278N575
61640E97210M995M041L105K170J297O73pj512l927o111o941o705o585p006p309
61625E67388o954o200n427m543l404k291j537j030m71K12R01J482J705J158k27
61610E40762j867l063l820m713n997p144p423o791o043o062o921p767p720o817
61596D58614n860n341m850l804k447j703k074k989l436l035k306j979k213k569
61582D14008k607k330k001j741j515j393j546j964k371k468k123j356m25Q1l39
61567C89910j466k390k490k041j642j369r42n10n82j116j281m73P59J280P11k11
61551C76147o22m99m40p50j110j169j023r67r41o20L2O26Q57Q92J130J735K572
$$ plain form
61654 548599 550312 552022 553877 556160 559086 562728 566932 571267 575204 578621 582075 586357 591635 597210
61640 597210 602205 606246 609351 611521 612818 613491 613484 611972 608045 601934 594993 588288 581703 574697 567388
61625 567388 560434 554234 548807 544264 540860 538569 537032 536002 535531 535743 536644 538126 539831 540989 540762
61610 540762 538895 535832 532012 527299 521302 514158 506735 499944 493901 487839 480918 473151 465431 458614
61596 458614 452754 447413 442563 438759 436312 434609 432535 429546 426110 423075 420769 418790 416577 414008
61582 414008 411401 409071 407070 405329 403814 402421 400875 398911 396540 394072 391949 390593 390168 390249 389910
61567 389910 388444 386054 383564 381523 379881 378512 377570 377060 376478 375362 374081 373608 374367 375647 376358 376147
61551 376147 375525 375026 374586 373836 372726 371557 370534 369567 368626 368006 368038 368664 369521 370413 371543 373278 375850
61534C75850L389L925L983L593K984K262J264j27j671l011l975m461m224l240
61520C76541k167j918k623l426l473k788k048j756j879k030j808j122m22l44r90
61505C47747j725j938j717j491j308q99l36m5j21j63P0K58O8k96m37l49l06k90
61487C36722jN74J032J072Q52P13P56R20J196J599J959J947J369L84m97p10r2
61470C49795Q58J328R60J62m40p44j087j537j663j110j54N58O76L75N5O2N53J277
61452C49924J529P30p43j676j262j5R17J115J117J379J652J563J360J613K497
61437C61700L701M894N846O276O034N452N068M963M678L920L014K446K286K198
61423D22476J973J771J957K668L494L684K911J818J357J620J729J053J0o58r56
$$ plain form
61534 375850 379239 383164 387147 390740 393724 395986 397250 397123 395452 392441 388466 384005 379781 376541
61520 376541 374374 372456 369833 366407 362934 360146 358098 356342 354463 352433 350625 349503 349081 348737 347747
61505 347747 346022 344084 342367 340876 339568 338669 338333 338288 338167 338004 338074 338332 338400 338104 337667 337318 337012 336722
61487 336722 336721 337295 338327 339399 340251 340964 341720 342640 343836 345435 347394 349341 350710 351094 350597 349887 349795
61470 349795 350653 351981 352941 353103 352663 351919 350832 349295 347632 346522 346368 346926 347602 347977 348032 348094 348647 349924
61452 349924 351453 352183 351440 349764 348502 348487 349404 350519 351636 353015 354667 356230 357590 359203 361700
61437 361700 365401 370295 376141 382417 388451 393903 398971 403934 408612 412532 415546 417992 420278 422476
61423 422476 424449 426220 428177 430845 434339 438023 440934 442752 444109 445729 447458 448511 448521 447863 446907
61408D46907j507k626l927m832n013m567m012m002m674n372n382m704l808k884
61394C89597j913j279j496k267k539j774o25kK4oJ36J84l6k36j0P14J509J852
61376C81833J725J750K398L211L253K381J500J343J580J541J279J374J976K646
61362D09790K967K890K580K380K760L861N130N859O026O221O846P829R003J0297
61348D84439J1515J2442J3184J3988J4691J4797J4135J2944J1336R279P229O023
61336F26002N781N464L989J481j015k704l537l885m205m869n856o752p287p656
61322E94951q056q213p795o907n769m252k413j087j057j795j938j110k49M4M07
61307E44761J476K763L575M281N652P409Q498Q557Q029O984M934K032n94k166
$$ plain form
61408 446907 445400 442774 438847 434015 429002 424435 420423 416421 411747 406375 400993 396289 392481 389597
61394 389597 387684 386405 384909 382642 380103 378329 377704 377702 377726 377720 377856 378040 378004 377768 377758 378472 379981 381833
61376 381833 383558 385308 387706 390917 394170 396551 398051 399394 400974 402515 403794 405168 407144 409790
61362 409790 412757 415647 418227 420607 423367 427228 432358 438217 444243 450464 457310 465139 474142 484439
61348 484439 495954 508396 521580 535568 550259 565056 579191 592135 603471 612750 619979 626002
61336 626002 631783 637247 641236 642717 641702 638998 635461 631576 627371 622502 616646 609894 602607 594951
61322 594951 586895 578682 570887 563980 558211 553959 551546 550459 549402 547607 545669 544559 544310 544354 544761
61307 544761 546237 549000 552575 556856 562508 569917 578415 586972 595001 601985 606919 608951 608357 606191
61293F06191l153m321n603o453o808o965o853o130m891l689k860k211j429m29
61279E44396O55J577K119K427L062M398O060P278P739P808P950Q285Q653Q820
61265F21227Q653Q407Q718R928J1529J2762J3670J4974J6893J8703J9663J9699
61253G84826J8914J7093J4222J0960P989N202K136j125m103o829r724j2560j4305
61240H12696j4320j3213j2121j1560j1297j0991j0475r649q548p542p025o947
61228F89008o878o470n600m136k081n8R27O06k1K47J399K394K609K395K160J682
61212F78183Q34K63O56J569J839J090J54j41P8K70M24R44J936L115M381O044Q407
61195G10046J1348J4468J7483K0373K3063K5088K5816K5111K3585K1847J9765
$$ plain form
61293 606191 603038 598717 593114 586661 579853 572888 566035 559905 555014 551325 548465 546254 544825 544396
61279 544396 545051 546628 548747 551174 554236 558634 564694 571972 579711 587519 595469 603754 612407 621227
61265 621227 629880 638287 647005 656933 668462 681224 694894 709868 726761 745464 765127 784826
61253 784826 803740 820833 835055 846015 854004 859206 861342 860217 856114 849285 839561 827001 812696
61240 812696 798376 785163 773042 761482 750185 739194 728719 719070 710522 702980 695955 689008
61228 689008 682130 675660 670060 665924 663843 663785 664712 665318 665297 665544 666943 669337 671946 674341 676501 678183
61212 678183 679017 679280 679936 681505 683344 684434 684588 684447 684525 684795 685219 686163 688099 691214 695595 701639 710046
61195 710046 721394 735862 753345 773718 796781 821869 847685 872796 896381 918228 937993
61184I37993J6928J3708J1232J0101R670Q943P744O516N396M098K585J178p6j650
61170A034366l874o383q498j0027j1388j3001j4748j6183j7106j7768j8473j9183
61158H77734j9639j9705j9329j8334j6578j4334j2077r855p326m514k065m57N81
61145G34102J482K048J756O22q50k459m460o774q589r065q237o922n831m916l635
61130F78272j638Q44L332N574P573R331J0877J2479J4448J6673J8730K0569K2557
61117H19621K4720K6474K7436K8005K8649K9159K9207K9121K9311K9219K7854
61106A128776K5302K2788K1019J9302J6673J3171R574O364L380Q7m145r548j5294
61093A237449j9766k2099k3214k4722k6980k8821k9217k8478k7636k7137k6643
$$ plain form
61184 937993 954921 968629 979861 989962 999632 1008575 1016319 1022835 1028231 1032329 1034914 1036092 1036016 1034366
61170 1034366 1030492 1024109 1015611 1005584 994196 981195 966447 950264 933158 915390 896917 877734
61158 877734 858095 838390 819061 800727 784149 769815 757738 747883 740557 736043 733978 733521 734102
61145 734102 735584 737632 739388 740010 739160 736701 732241 725467 716878 707813 699576 692654 686823 681907 678272
61130 678272 676634 677478 680810 686384 693957 703288 714165 726644 741092 757765 776495 797064 819621
61117 819621 844341 870815 898251 926256 954905 984064 1013271 1042392 1071703 1100922 1128776
61106 1128776 1154078 1176866 1197885 1217187 1233860 1247031 1256605 1262969 1266349 1266436 1262291 1252743 1237449
61093 1237449 1217683 1195584 1172370 1147648 1120668 1091847 1062630 1034152 1006516 979379 952736
61082I52736k5797k4647k3345k1882k0270j8681j7184j5575j3692j1757j0089
61071G49817q629p059n344l733k295q68M71J352J714K014K610L344L966M574N290
61056G47224N996O681P685R142J0641J1904J3382J5522J7878J9641K0829K2157
61044I08682K3950K5923K7962L0225L2474L4107L5077L6041L7416L8910M0170
61033A270937M1253M2255M3038M3665M4554M5951M7712M9734N2099N4526N6262
61022A791986N6919N7071N7784N9897O3876P0021P8500Q9263J01900J15451J28838
61011B671506J42142J57224J76511K01561K33704K75494L30165L99909M86356
61002E074572N92771P24252Q86178J085296J332208J636817J994045K370508K703898
$$ plain form
61082 952736 926939 902292 878947 857065 836795 818114 800930 785355 771663 759906 749817
61071 749817 741188 734129 728785 725052 722757 721889 722360 723712 725426 727440 730050 733394 737360 741934 747224
61056 747224 753220 759901 767586 776728 787369 799273 812655 828177 846055 865696 886525 908682
61044 908682 932632 958555 986517 1016742 1049216 1083323 1118400 1154441 1191857 1230767 1270937
61033 1270937 1312190 1354445 1397483 1441148 1485702 1531653 1579365 1629099 1681198 1735724 1791986
61022 1791986 1848905 1905976 1963760 2023657 2087533 2157554 2236054 2325317 2427217 2542668 2671506
61011 2671506 2813648 2970872 3147383 3348944 3582648 3858142 4188307 4588216 5074572
61002 5074572 5667343 6391595 7277773 8363069 9695277 11332094 13326139 15696647 18400545
60993A8400545K914262K921341K670326K167109J502896Q35779L25315O1662L8452
60984C1837687J75271L54845M48899L43337k0849o09200j298344j933719k400057
60975B6897870k654552k713070k619064k422746k171967j905255j646758j408100
60967I356358j194671j008916q49828p13755n97685n00591m21354l57150l04707
60958C407701k61902k27239j98834j74826j54306j36972j22122j08547r5413q2990
60948A844550p2529o5281o1348n9504n8343n7277n6209n4797n2769n0570m8748
60937A207175m6930m4351m1313l9007l7787l6655l4746l2306k9866k7393k4896
60926H11925k2946k1903k1183j9977j8297j6731j5538j4528j3511j2397j1092
$$ plain form
60993 18400545 21314807 24236148 26906474 29073583 30576479 31412258 31737573 31799235 31837687
60984 31837687 32012958 32367803 32816702 33160039 33139190 32529990 31231646 29297927 26897870
60975 26897870 24243318 21530248 18911184 16488438 14316471 12411216 10764458 9356358
60967 9356358 8161687 7152771 6302943 5589188 4991503 4490912 4069558 3712408 3407701
60958 3407701 3145799 2918560 2719726 2544900 2390594 2253622 2131500 2022953 1927540 1844550
60948 1844550 1772021 1706740 1645392 1585888 1527545 1470268 1414059 1359262 1306493 1255923 1207175
60937 1207175 1160245 1115894 1074581 1035574 997787 961132 926386 894080 864214 836821 811925
60926 811925 788979 767076 745893 725916 707619 690888 675350 660822 647311 634914 623822
60915F23822r675q462p555o601n245l603k111j145r38j428k012k005j563j618
60901E69861k494l266k930j706o08j70k75q32j839k915l511l645l829m204m244
60886E33393l459k078p68m4qn17j268j843j895j495j250j814l145m450n046m998
60870D99315m674m037l036k329k725l864m325l379j823p05k1P55J561J937J869
60855D74519J735J651J455J181R28N99K06K01Q96J816K201K010J791J774J645
60840D94608J170M44m01j228j700j535r59m69k25p6l5j76k31J89R44J547J930
60823D93797K396K836K652J623K71q14j487j778j654j339j414k162l140l627l396
60808D82764k867k701l248m217m869m782m357m262m561m772m684m508m291l830
$$ plain form
60915 623822 614147 605685 598130 591529 586284 582681 580570 579425 578487 577059 575047 573042 571479 569861
60901 569861 567367 564101 561171 559465 558857 558687 558412 557580 555741 552826 549315 545670 541841 537637 533393
60886 533393 529934 527856 527088 527044 527036 526519 525251 523408 521513 520018 518768 516954 513809 509359 504313 499315
60870 499315 494641 490604 487568 485239 482514 478650 474325 470946 469123 468418 468397 469152 470713 472650 474519
60855 474519 476254 477905 479360 480541 481469 482068 482274 482475 483371 485187 487388 489398 491189 492963 494608
60840 494608 495778 496222 495821 494593 492893 491358 490399 489930 489705 489629 489594 489418 489187 489376 490320 491867 493797
60823 493797 496193 499029 501681 503304 503575 502761 501274 499496 497842 496503 495089 492927 489787 486160 482764
60808 482764 479897 477196 473948 469731 464862 460080 455723 451461 446900 442128 437444 432936 428645 424815
60794D24815l240k930k823k304j276n75q62j673k127k083j955j805j323n97j67
60779C99075k63m99m25m5L69O36P75R16J220J774K533L415M334N131N671O057
60763D30674O482O788O537N798N415O061P241P759P030N515L967K856K436K742
60749E07301L320L457K988K482K364K291J735Q18O5m61j249k553l980m989n448
60734E08141n571n549n493n491n511n446n371n563n993o083n372m290l752l951
60720D34705m106l599k825k483k528k379j910j533j341q91K8R40J361J431J557
60705D16427J801J983K160K555L106L504L669L963M782O033O999O812N302L434
60691D72530K550L009L827L908L292K830K934L196L174K989K991L219L350L007
$$ plain form
60794 424815 421575 418645 415822 413518 412242 411667 410805 409132 407005 404922 402967 401162 399839 399242 399075
60779 399075 398812 398313 397888 397843 398212 398848 399623 400539 401759 403533 406066 409481 413815 418946 424617 430674
60763 430674 437156 443944 450481 456279 461694 467755 474996 482755 489785 495300 499267 502123 504559 507301
60749 507301 510621 514078 517066 519548 521912 524203 525938 526756 526821 526360 525111 522558 518578 513589 508141
60734 508141 502570 497021 491528 486037 480526 475080 469709 464146 458153 452070 446698 442408 438656 434705
60720 434705 430599 427000 424175 421692 419164 416785 414875 413342 412001 411110 411138 412078 413439 414870 416427
60705 416427 418228 420211 422371 424926 428032 431536 435205 439168 443950 449983 456982 463794 469096 472530
60691 472530 475080 478089 481916 485824 489116 491946 494880 498076 501250 504239 507230 510449 513799 516806
60677E16806K123J137P48J250K194K931L383L867M408M799N245O225P613Q616
60663E71345Q930R261J0317J1895J3602J5861J9355K3816K8343L2828L8219M5122
60651H28894N2967O0855O8357P4869P8652P7365O9668N6050L8223J8250j822k0018
60639A402310l4699m4947n0747n2799n2068m9408m5490m1000l6602l2662k9115
60628I32773k5799k2802k0400j8712j7523j6488j5409j4325j3355j2459j1455
60617G44046j0325r309q543p834p073o706p239q351r098r146r160r592r832r139
60603F22699p915p258p490p955q184q435q922r276r108q553p916p195o332n492
60589E12668m794m065l201k491k231k201j963j476j142j214j490j592j286n78
$$ plain form
60677 516806 518929 520066 520814 522064 524258 527189 530572 534439 538847 543646 548891 555116 562729 571345
60663 571345 580275 589536 599853 611748 625350 641211 660566 684382 712725 745553 783772 828894
60651 828894 881861 942716 1011073 1085942 1164594 1241959 1311627 1367677 1405900 1424150 1422328 1402310
60639 1402310 1367611 1322664 1271917 1219118 1167050 1117642 1072152 1031152 994550 961888 932773
60628 932773 906974 884172 863772 845060 827537 811049 795640 781315 767960 755501 744046
60617 744046 733721 724412 715869 708035 700962 694256 687017 678666 669568 660422 651262 641670 631838 622699
60603 622699 614784 607526 600036 592081 583897 575462 566540 557264 548156 539603 531687 524492 518160 512668
60589 512668 507874 503809 500608 498117 495886 493685 491722 490246 489104 487890 486400 484808 483522 482944
60575D82944L43J229J943K525L126L983N382P380R547J1318J2683J4261J6396
60562E73060J8571J9934K0059J8904J6339J2317P392K531j633n063p790r550j0099
60549F54972r570q342o712m798k624k02K414N166Q123J1457J5113J8558K1075
60536G04630K2394K2806K2625K1612J9131J4796R045K992k279o292r063j0610
60524H11787j0921j0328r434q524p351n758m091k749j697q58n25q10r98k09J387
60509G48921K800L633M520N950P466Q523R556J1585J5025J9390K4042K8795L3896
60496I24102L9741M6605N4322O2200O9285P4684P7614P7417P3821O7011N7295
60485A624097M4804K9744J2744n262k3441m1033n7027p0119p9202q3837q4420
$$ plain form
60575 482944 483287 484516 486459 488984 492110 496093 501475 508855 518402 529720 542403 556664 573060
60562 573060 591631 611565 631624 650528 666867 679184 686576 689107 687474 682411 674621 665071 654972
60549 654972 645402 637060 630348 625550 622926 622724 625138 630304 638427 649884 664997 683555 704630
60536 704630 727024 749830 772455 794067 813198 827994 837039 840031 837752 831460 822397 811787
60524 811787 800866 790538 781104 772580 765229 759471 755380 752631 750934 750076 749551 748741 747743 747534 748921
60509 748921 751721 755354 759874 765824 773290 781813 791369 802954 817979 837369 861411 890206 924102
60496 924102 963843 1010448 1064770 1126970 1196255 1270939 1348553 1425970 1499791 1566802 1624097
60485 1624097 1668901 1698645 1711389 1706127 1682686 1641653 1584626 1514507 1435305 1351468 1267048
60474A267048q1953p7518p1837o5315n8538n2321m7015m2074l6807l1494k7178
60463F74998k4330k2223j9902j7338j5158j3554j2044j0310q720p753p280o747
60451E09639n904n007m369l983l639l184k666k340k473k970l259k875k064j486
60437D63420j319j121o33k13j96l57m09n44r65j288j154j090j878l103l339k057
60421D43754n38l68j545k724k844k012r41j33L87R09J651K422K757K496J989J512
60405D46772Q43k61j434k051j996j676j346r44n33l02p3O50J850K690K508J735
60389D46432J300J411J469J216J173J701K208J943J198J000J635K289K241J770
60375D68986J468J329J117J138J782K574K482J312O1k80L20J247J884J745O56
$$ plain form
60474 1267048 1185095 1107577 1035740 970425 911887 859566 812551 770477 733670 702176 674998
60463 674998 650668 628445 608543 591205 576047 562493 550449 540139 531419 523666 516386 509639
60451 509639 503735 498728 494359 490376 486737 483553 480887 478547 476074 473104 469845 466970 464906 463420
60437 463420 462101 460980 460347 460134 459938 459581 459172 458628 457663 456375 455221 454131 452253 449150 445811 443754
60421 443754 443216 442848 441303 438579 435735 433723 432782 432649 433036 433945 435596 438018 440775 443271 445260 446772
60405 446772 447615 447354 445920 443869 441873 440197 438851 437907 437374 437072 436999 437649 439499 442189 444697 446432
60389 446432 447732 449143 450612 451828 453001 454702 456910 458853 460051 461051 462686 464975 467216 468986
60375 468986 470454 471783 472900 474038 475820 478394 480876 482188 482249 481969 482289 483536 485420 487165 487821
60360D87821p75j454r80n7N59R47J355J400P18o2J2P79J167Q29O73J491K854L783
60342E01060L918L581L160K932L170L861M435M189L003J418L5r82j799k600l395
60327E25986m044m370m223l506k221o87M24N61r2o64m85K91J085J780K820M513
60311E17168O479Q037Q897R381J0042J1317J3458J6527K0433K4962K9815L4328
60299G10844L7274L7344L4085K8137K0395J1282J166q892j7493k3897k8190l0493
60287G71562l0663k8892k6011k2826j9552j6149j2833j0049q188p420p423p285
60275E74271o313n063m799n620o087n285m274m471n459n692m876m129l941l529
60261E04733k536j878k197k650k187j140n90p16p50l22J30J95M6L4K54N73P32
$$ plain form
60360 487821 487046 485592 484612 484555 485114 486061 487416 488816 489534 489472 489484 490263 491430 492259 492932 494423 497277 501060
60342 501060 504978 508559 511719 514651 517821 521682 526117 530306 533309 534727 534762 533780 531981 529381 525986
60327 525986 521942 517572 513349 509843 507622 506935 507359 507920 507828 507164 506679 506970 508055 509835 512655 517168
60311 517168 523647 531684 540581 549962 560004 571321 584779 601306 621739 646701 676516 710844
60299 710844 748118 785462 819547 847684 868079 879361 880527 871635 854142 830245 802055 771562
60287 771562 740899 712007 685996 663170 643618 627469 614636 604587 596399 588979 581556 574271
60275 574271 567958 562895 558096 552476 546389 541104 536830 532359 526900 521208 516332 512203 508262 504733
60261 504733 502197 500319 498122 495472 493285 492145 491555 490839 490089 489767 489897 490092 490138 490172 490426 490999 491731
60244D91731M16l88j215j521j283r07o57n02l59j58L21J278K507L495M061M555
60228E01374N242N785N606M685L655L067K785K375J826J564J779K141K278K203
60214E46365K030J693J249J130J619K351K799L000L235L304K817K072J777J954
60200E77395J912J464J222J496J749J486Q41K7r56j613j100K76P75o05k588l312
60184E78469k734k080j693j068n42j137k613l397k823j976j762j566o03O31J246
60169E56352J387J743K246K309J914J626J731K073K480K791K734K384K331K838
60155E86939L163K459J048O6M1N19R43J141J031O47M64J078K378L662M579N386
60139F15544O236O910P353P907Q684R313R478R225Q516P020M677J981o34l217
$$ plain form
60244 491731 492147 491759 490544 489023 487740 486833 486176 485674 485315 485157 485478 486756 489263 492758 496819 501374
60228 501374 506616 512401 518007 522692 526347 529414 532199 534574 536400 537964 539743 541884 544162 546365
60214 546365 548395 550088 551337 552467 554086 556437 559236 562236 565471 568775 571592 573664 575441 577395
60200 577395 579307 580771 581993 583489 585238 586724 587565 587592 586636 585023 583923 584199 584974 584369 581781 578469
60184 578469 575735 573655 571962 570894 570352 569215 566602 563205 560382 558406 556644 555078 554475 555106 556352
60169 556352 557739 559482 561728 564037 565951 567577 569308 571381 573861 576652 579386 581770 584101 586939
60155 586939 590102 592561 593609 593675 593716 594235 595178 596319 597350 597997 598461 599539 601917 605579 610158 615544
60139 615544 621780 628690 636043 643950 652634 661947 671425 680650 689166 696186 700863 702844 702210 698993
60125F98993n750p661q303p723o560n499m938m843m646l710k303j512j809k262
60111F31474j841q93m82o40m34L63Q50M47k77o55q99j396j751j349m31J14q5n59
60093F21556o11Q2J419K871L803M143M531N402O223O228N653N471N990O471O171
60078F85403N088L499J474q32k960m634o013p173p835p929p912q129q314q139
60064F25594p759p301o374m766l204k615k843k956k666k506k658k625k286k316
60050E72719l048l705l403k346j374q10l69J54P25J427K313L043L134K602J912
60035E72974J407J156J148J194P98l60j829k824l169l327l575l712l659l657l747
60020E48818l678l615m245n737p081p050n562l648k271j619j407j360j373j518
$$ plain form
60125 698993 693243 685582 677279 669556 662996 657497 652559 647716 643070 639360 637057 635545 633736 631474
60111 631474 629633 628740 628258 627618 627184 627547 628397 628844 628567 627912 627013 625617 623866 622517 622086 622200 622115 621556
60093 621556 620945 621027 622446 625317 629120 633263 637794 643196 649419 655647 661300 666771 672761 679232 685403
60078 685403 690491 693990 695464 694632 691672 687038 681025 673852 666017 658088 650176 642047 633733 625594
60064 625594 617835 610534 604160 599394 596190 593575 590732 587776 585110 582604 579946 577321 575035 572719
60050 572719 569671 565966 562563 560217 558843 558033 557664 557818 558543 559970 562283 565326 568460 571062 572974
60035 572974 574381 575537 576685 577879 578677 578317 576488 573664 570495 567168 563593 559881 556222 552565 548818
60020 548818 545140 541525 537280 531543 524462 517412 511850 508202 505931 504312 502905 501545 500172 498654
60006D98654j853k120j816p95L38Q43P20O44J101J900K632L237M019N265O969
59991E19738Q863J0710J2596J4854J7693K1135K5357L0752L7246M3736M8386M9248
59979H40314M4599L3492J6948j575j7880k9573l6596l9629l9088l5825l1620k7898
59967F75669k4549k0769j6693j3283j0871q807o673m989m334m360m214l546k701
59954E49880k078j732j613j774k221k694k790k323j570j081j201j785k415k897
59940E21706l382l924m153l643k613j949k252l070l341k634j569q86n46m2O96
59925D88398J273J570J883K254K296J897J645K108L055L787L960L668L032K164
59911E22990J458J305J576J779J755J843K157K257J723Q06J60N5J08r7m07k41
$$ plain form
60006 498654 496801 494681 492865 492070 492408 493251 493971 494615 495716 497616 500248 503485 507504 512769 519738
59991 519738 528601 539311 551907 566761 584454 605589 630946 661698 698944 742680 791066 840314
59979 840314 884913 918405 935353 933778 915898 886325 849729 810100 771012 735187 703567 675669
59967 675669 651120 630351 613658 600375 589504 580697 574024 569035 564701 560341 556127 552581 549880
59954 549880 547802 546070 544457 542683 540462 537768 534978 532655 531085 530004 528803 527018 524603 521706
59940 521706 518324 514400 510247 506604 503991 502042 499790 496720 493379 490745 489176 488290 487744 487702 488398
59925 488398 489671 491241 493124 495378 497674 499571 501216 503324 506379 510166 514126 517794 520826 522990
59911 522990 524448 525753 527329 529108 530863 532706 534863 537120 538843 539649 539809 539864 539972 539875 539468 539227
59895E39227O15J608K017J835J743K189K905L457L830M147M272M158M307N243
59881E81553O640P568P581P046O411N755N146M791M530L693J928j87j709k337
59867F38409k588l094l973m807n039m515l689l175l056k858k265j566j236j339
59853E95209j497j259m05R33K409L822N404P446R699J1494J2405J2300J0856P783
59839F76599L796N98o64m36K41J068K197L087K742R57j518m087o784r518j1666
59824F56612j2787j3142j3123j2639j1512j0068q911q265p949p766p492o699n121
59811E31138l268k237k573l569l955l203j856o87N3L86M6j214k895l894l645k717
59795D95910k004j698j436j123j082j433j844j963j829j687j610j461j127p41
$$ plain form
59895 539227 539842 541450 543467 545302 547045 549234 552139 555596 559426 563573 567845 572003 576310 581553
59881 581553 588193 595761 603342 610388 616799 622554 627700 632491 637021 640714 642642 642455 640746 638409
59867 638409 635821 632727 628754 623947 618908 614393 610704 607529 604473 601615 599350 597784 596548 595209
59853 595209 593712 592453 592048 592981 595390 599212 604616 612062 621761 633255 645660 657960 668816 676599
59839 676599 680395 680993 680329 679893 680134 681202 683399 686486 689228 690185 688667 684580 677796 668278 656612
59824 656612 643825 630683 617560 604921 593409 583341 574430 566165 558216 550450 542958 536259 531138
59811 531138 527870 525633 523060 519491 515536 512333 510477 509790 509843 510229 510275 509061 506166 502272 498627 495910
59795 495910 493906 492208 490772 489649 488567 487134 485290 483327 481498 479811 478201 476740 475613 474872
59781D74872o00p74q16j80R54J658J365O66N70J199J767J656J038M47L05Q58J951
59764D86936K772K451J144L0q8L71O66Q86J612K765L570L662L486L494L419K791
59748E19967J852J438J919K671K870K557K547L273M111M087K997J503L82j5K16
59733E52375O52P05J15p25j291j646k138k488j937n02O78P30J93J54O78Q63K76
59716E46692m24m30K08Q09R40P73P62J117J651K041K246K490K833L002K869K865
59700E70444L547M800N819N933N241M402L952L900L793L115J735M0j371k123k214
59685F11013j873j423j095q56n09j29k31j181k590l562l648l249l071l438m096
59670E80062m493m137l013j773j279j755k527k807k521k136j897j634j300j214
$$ plain form
59781 474872 474272 473498 472682 472502 473456 475114 476479 477145 477715 478914 480681 482337 483375 483822 484127 484985 486936
59764 486936 489708 492159 493303 493333 493245 493616 494282 495168 496780 499545 503115 506777 510263 513757 517176 519967
59748 519967 521819 523257 525176 527847 530717 533274 535821 539094 543205 547292 550289 551792 552174 552159 552375
59733 552375 553027 553732 553847 553122 551831 550185 548047 545559 543622 543120 543798 544528 544721 544875 545553 546416 546692
59716 546692 546268 545838 546046 546855 547795 548568 549330 550447 552098 554139 556385 558875 561708 564710 567579 570444
59700 570444 573991 578791 584610 590543 595784 600186 604138 608038 611831 614946 616681 616721 615350 613227 611013
59685 611013 609140 607717 606622 605766 605257 605128 604897 603716 601126 597564 593916 590667 587596 584158 580062
59670 580062 575569 571432 568419 566646 565367 563612 561085 558278 555757 553621 551724 550090 548790 547576
59656E47576j501j603q18O99J932K226K093K463L306L481K095l40k336k889k362
59641E54022j994k642l973m898m721l744k694j869j138n33k45p9M36J256J664
59626E28848J238M68J23L24O68Q24O27m2r97j724k071k604l672m561m360l354
59610E09735k623k354j612N0J681K141J448M90l8N6O37J201J109L63j52K66J229
59593E13627J850J927J952K184K343K126J521O50k61q04p64n43p94j616k512l101
59577E17785l503l963m506m984n173m827l950l018k531k403k162j733j431j237
59563D72364o78K59Q30N22j01j60L93R47J283J658J997J780R97M89R27J929K680
59546D88116L098L753M811N780O438P375R256J1953J4839J7582J9984K1196J9913
$$ plain form
59656 547576 546075 544472 543654 544353 546285 548511 550604 553067 556373 559854 561949 561609 559273 556384 554022
59641 554022 552028 549386 545413 540515 535794 532050 529356 527487 526349 525816 525571 525492 525928 527184 528848
59626 528848 530086 530554 530677 531001 531669 532493 533120 533078 532081 530357 528286 525682 522010 517449 513089 509735
59610 509735 507112 504758 503146 503196 504877 507018 508466 508956 508918 508974 509611 510812 511921 512284 512132 512398 513627
59593 513627 515477 517404 519356 521540 523883 526009 527530 528180 527919 527115 526351 525808 525014 523398 520886 517785
59577 517785 514282 510319 505813 500829 495656 490829 486879 483861 481330 478927 476765 475032 473601 472364
59563 472364 471686 471945 472775 473297 473196 473036 473429 474376 475659 477317 479314 481094 482091 482580 483507 485436 488116
59546 488116 491214 494967 499778 505558 511996 519371 528627 540580 555419 573001 592985 614181 634094
59533F34094J5708R766L920o38l537m647m076k476o24J382L942O851R025R601
59519F78291Q877P765O688N462L924K155J29k291m942p259q789r611j0168j0793
59505F59438j1412j1604j1006r806q748q347q221p540o126m686l798l141k101
59492E62902p80R7J09m20r45j174r37k4J544L325M792N758O373O873P575Q838
59476F03906J0659J2388J3238J3020J2100J0615Q226M821J108j863l540m020l588
59463F77070k542j295j79R77K719N333Q523J1800J4790J7165J8636J9352K0064
59450G92413K1480K3500K5257K5932K5233K3117J9315J3403N403l764j2475j9214
59438I39600k3287k4921k4864k3957k2831k1662k0198j8305j6426j5206j4591
$$ plain form
59533 634094 649802 659568 663488 662850 659313 654666 650590 648114 647490 648872 652814 659665 668690 678291
59519 678291 687168 694933 701621 707083 711007 713162 713291 711000 706058 698799 690010 680399 670231 659438
59505 659438 648026 636422 625416 615610 606862 598515 590294 582754 576628 571942 568144 565003 562902
59492 562902 562122 562219 562328 561908 560963 559789 558852 558828 560372 563697 568489 574247 580620 587493 595068 603906
59476 603906 614565 626953 640191 653211 665311 675926 684152 688973 690081 688218 684678 680658 677070
59463 677070 674528 673233 673054 674031 676750 682083 690606 702406 717196 734361 752997 772349 792413
59450 792413 813893 837393 862650 888582 913815 936932 956247 969650 975053 971289 958814 939600
59438 939600 916313 891392 866528 842571 819740 798078 777880 759575 743149 727943 713352
59427G13352j3724j1933r477o990m620k065Q06L942P478J1528J5659J9180K2078
59414G45214K5049K8354L1052L1605K8954K2856J3775L005p404j5413j9898k0770
59402H66379j8546j4070q411k696J892L822J540n153j4108k2026k6908k8994k9371
59389G03350k8421k6075k2784j9444j6419j3461j0573q350p209o719o055m825
59377E33015l237j660m04K48K36k4R0P61J526J803J465Q24L32L63J064K187L201
59360E41790L755L950M065M243M611N474P019Q945J0737J2280J3846J5493J6947
59347F53155J8160J9476K1034K2334K2808K2549K2050K1373K0083J7923J5100
59336H76045J1792P867L404q73m148o487q770j1560j4336j6129j6689j6689j6818
$$ plain form
59427 713352 699628 687695 678218 671228 666608 664543 665349 669291 676769 688297 703956 723136 745214
59414 745214 770263 798617 829669 861274 890228 913084 926859 929864 922460 907047 887149 866379
59402 866379 847833 833763 825352 822656 824548 828370 829910 824757 810649 788623 761715 732721 703350
59389 703350 674929 648854 626070 606626 590207 576746 566173 557823 550614 543895 537840 533015
59377 533015 529778 528118 527714 527962 528198 528174 528264 529025 530551 532354 533819 534643 534975 535338 536402 538589 541790
59360 541790 545545 549495 553560 557803 562414 567888 574907 583852 594589 606869 620715 636208 653155
59347 653155 671315 690791 711825 734159 756967 779516 801566 822939 843022 860945 876045
59336 876045 887837 895704 899108 898235 894087 887600 878830 867270 852934 836805 820116 803427 786609
59323G86609j7021j6806j5924j4528j2800j0827q809p108o006n514n420n433n341
59310F55072n145n013m897m446l483k389j575p77O16K611M573O256Q206J0923
59296F60532J4194J7569K0829K3436K4119K1748J6513R678K444m433j0229j4256
59284G82144j6353j6762j5538j2665q823n347l057j535K05K683N665Q545J0759
59271G29921J2151J3108J4141J5210J5765J5577J5062J4511J3404J0940P176L124
59259H80090k77l023n756q786j1645j3642j4681j5308j5969j6489j6365j5349
59247G42800j3595j1511r625q308p320n920l879j940q56k60Q14K537M176N271
59233F92384N999O332N812M485L151K202R95j030l313n034o328p862r564j0730
$$ plain form
59323 786609 769588 752782 736858 722330 709530 698703 689894 682786 676780 671266 665846 660413 655072
59310 655072 649927 644914 640017 635571 632088 629699 628124 627347 627963 630574 635147 641403 649609 660532
59296 660532 674726 692295 713124 736560 760679 782427 798940 808618 811062 806629 796400 782144
59284 782144 765791 749029 733491 720826 712003 706656 703599 702064 702269 704952 710617 719162 729921
59271 729921 742072 755180 769321 784531 800296 815873 830935 845446 858850 869790 876966 880090
59259 880090 879813 876790 871034 862248 850603 836961 822280 806972 791003 774514 758149 742800
59247 742800 729205 717694 708069 699761 692441 686521 682642 680702 679846 679586 680400 682937 687113 692384
59233 692384 698383 704715 710527 715012 718163 720365 721360 720330 717017 711983 705655 697793 688229 677499
59219F77499j1193j1523j1978j2066j1328j0002q671p627o858o321n925n455m701
59206E63851l732k903k490k265j645m22P90J223R66Q03J096J462J737K382L543
59191E64396M433M370L825L647L760L553L220L571M622N453N659N930O835P865
59177F31139Q254Q083P975Q120Q202Q059P871P810P922Q304R096J0190J1153J1512
59163G53690J1113J0233R250Q204O790M894K913J260k41k083m305o376p891q967
59149G78484r873j0625j1094j1203j0893j0088q921p794p157p186p639p902p390
59136F60719o155m902m144l588k663j400k64O30J513K359K936L449M431N987P726
59121F66634R508J1483J3353J4422J4653J4913J5796J6934J7765J8313J8765J8998
$$ plain form
59219 677499 666306 654783 642805 630739 619411 609409 600738 593111 586253 579932 574007 568552 563851
59206 563851 560119 557216 554726 552461 550816 550394 551184 552407 553373 554176 555272 556734 558471 560853 564396
59191 564396 568829 573199 577024 580671 584431 587984 591204 594775 599397 604850 610509 616439 623274 631139
59177 631139 639393 647476 655451 663571 671773 679832 687703 695513 703435 711739 720835 731025 742178 753690
59163 753690 764803 775036 784286 792490 799280 804174 807087 808347 808106 806023 801718 795342 787451 778484
59149 778484 768611 757986 746892 735689 724796 714708 705787 697993 690836 683650 676011 668109 660719
59136 660719 654564 649662 645518 641930 639267 637867 637603 638233 639746 642105 645041 648490 652921 658908 666634
59121 666634 676142 687625 700978 715400 730053 744966 760762 777696 795461 813774 832539 851537
59109H51537J8966J8843J8380J6881J4467J2465J1703J1167R383O542M087K522
59097I96943R38j339l801n644o657o950o650o179o126o532o863o867o866p070
59083I20337p294p586q421r947j1659j3108j4327j5232j5319j4478j3488j3066
59071G76412j2963j2562j1906j1397j0919j0048q941q138p669p048o204n610n426
59058F57581n211m629l837l000k068j350j499k543l527l679l425l568l874l303
59044F12068j507O50K095K458J946J023M12Q30K260L823M665M726M500M391M608
59029F48948N336O599Q156R798J1592J3590J5531J7065J8105J8658J8619J7959
59017H09956J6861J5398J3336J0658P900N500L198O30j803l408m245m782m691
$$ plain form
59109 851537 870503 889346 907726 924607 939074 951539 963242 974409 983792 990334 994421 996943
59097 996943 997881 996542 992741 987097 980440 973490 966840 960661 954535 948003 941140 934273 927407 920337
59083 920337 913043 905457 897036 887089 875430 862322 847995 832763 817444 802966 789478 776412
59071 776412 763449 750887 738981 727584 716665 706617 697676 689538 681869 674821 668617 663007 657581
59058 657581 652370 647741 643904 640904 638836 637486 635987 633444 629917 626238 622813 619245 615371 612068
59044 612068 610561 611211 613306 615764 617710 618733 619145 619975 622235 626058 630723 635449 639949 644340 648948
59029 648948 654284 660883 669039 678837 690429 704019 719550 736615 754720 773378 791997 809956
59017 809956 826817 842215 855551 866209 874109 879609 882807 883437 881634 878226 873981 869199 864508
59004H64508l054n3K694L982M349M947N824O159N560M306K653P62q73j808k402
58989H97554l502n279p117q627j0063j1545j2639j3094j3334j3683j3555j2140
58977G72976r680p362n848m535k546J1K200L396L833M120M697N828P541R292J0197
58962G94120J0037R721J0155J0875J0545Q723O394M470K564k39l856p154r253
58949H47102j0336j1136j1992j2588j2441j1485j0095q528o546l989j493j37k11
58936G46125r23j487k026l093m772o629q157q927q771q129p817q008p958p164
58922F62264o222n898n955n655m939m198l205j477M80J429J111P28J277K321K961
58907F35022L287M184O068Q372J0222J1282J1952J2865J4099J5008J4936J3940
$$ plain form
59004 864508 861454 861401 864095 868077 872426 877373 883197 889356 894916 899222 901875 902637 901764 899956 897554
58989 897554 894052 888773 881656 873029 862966 851421 838782 825688 812354 798671 785116 772976
58977 772976 763296 755934 750086 745551 743005 743016 745216 748612 752445 756565 761262 767090 774631 783923 794120
58962 794120 804157 813878 824033 834908 845453 854176 860570 865040 867604 867365 863509 856355 847102
58949 847102 836766 825630 813638 801050 788609 777124 767029 758501 751955 747966 746473 746336 746125
58936 746125 745202 743715 741689 738596 733824 727195 719038 710111 701340 693211 685394 677386 669428 662264
58922 662264 656042 650144 644189 638534 633595 629397 626192 624715 625195 626624 627735 628463 629740 632061 635022
58907 635022 638309 642493 648561 656933 667155 678437 690389 703254 717353 732361 747297 761237
58895G61237J2518J0987R640R238J0441J2797J5125J7015J9118K1683K3785K4406
58883I47990K3538K1683J8992J5512J1695P912L909o42n414r814j3739j7223j9794
58870I84605k0900k0797k0228j9357j7801j5653j3727j2587j1989j1524j1215
58859H08827j1144j0986j0387r549r088r321r962j0407j0290r696q951q265p593
58846F83188o898o314n965n745n524n388n487n719n822n751n700n750n770n640
58832F01715n347m809l870k650j639j267j418j506j030L6J324K396K960K922K430
58817E90247J883J667J749J661J098M10J67L37K59m58j385j845j759j622j819
58802E90590k270k630k627k206j598j209j337j891k471k682k391j753j056l99
$$ plain form
58895 761237 773755 784742 794382 803620 814061 826858 841983 858998 878116 899799 923584 947990
58883 947990 971528 993211 1012203 1027715 1039410 1047322 1051231 1050589 1045175 1035361 1021622 1004399 984605
58870 984605 963705 942908 922680 903323 885522 869869 856142 843555 831566 820042 808827
58859 808827 797683 786697 776310 766761 757673 748352 738390 727983 717693 707997 699046 690781 683188
58846 683188 676290 669976 664011 658266 652742 647354 641867 636148 630326 624575 618875 613125 607355 601715
58832 601715 596368 591559 587689 585039 583400 582133 580715 579209 578179 578215 579539 581935 584895 587817 590247
58817 590247 592130 593797 595546 597207 598305 598715 598882 599219 599478 599020 597635 595790 594031 592409 590590
58802 590590 588320 585690 583063 580857 579259 578050 576713 574822 572351 569669 567278 565525 564469 564070
58788E64070M29J621K932L868M310M671N334O211P052P817Q463Q619P908O463
58774F39768M842L430K176Q59o01k079l296m055m495n024n805o489o628o193n476
58759F00934m704l950l193k173l82K271M900O284O156N444N069M975M613M020
58745F30264L854M477N486O328P004P855Q873R670J0102J0479J0997J1370J1411
58732G38170J1567J2298J3166J3264J2548J1935J1876J1543R871O875L478N72
58720H57163j288j754j015N0O96J138J983L117L817L839L579L165K211O03j206
58705H76098l023n344q505j1857j4387j5810j6638j7355j7985j8432j8768j9017
58693G08977j8903j8048j6439j4564j2999j1811j0654r384q378p910p606o899
$$ plain form
58788 564070 564499 566120 569052 572920 577230 581901 587235 593446 600498 608315 616778 625397 633305 639768
58774 639768 644610 648040 650216 651075 650474 648395 645099 641044 636549 631525 625720 619231 612603 606410 600934
58759 600934 596230 592280 589087 586914 586532 588803 593703 599987 606143 611587 616656 621631 626244 630264
58745 630264 634118 638595 644081 650409 657413 665268 674141 683811 693913 704392 715389 726759 738170
58732 738170 749737 762035 775201 788465 801013 812948 824824 836367 846238 853113 856591 857163
58720 857163 855875 854121 853106 853156 853852 854990 856973 860090 863907 867746 871325 874490 876701 877304 876098
58705 876098 873075 867731 859226 847369 832982 817172 800534 783179 765194 746762 727994 708977
58693 708977 690074 672026 655587 641023 628024 616213 605559 596175 587797 579887 572281 565382
58681E65382n890n256n262n362m866l624j924j35J353K226K547K750L157L727
58667E48823M465N722P759J0171J2088J2892J2617J1715J0518Q916O486L147l70
58654F54949k960m163m531m884n506o173o608o617o048n032m096l622l360k750
58640E88599j726q15m34l93k07L42J068J589J576R58j4r56j651k117k393k439
58624E80987k284k090j916j491m29J322L314M935N868O262O607P451R040J0936
58610F28512J2080J1653R895P856O201M614K681Q53l5o6l08j434k876l738l932
58595F71956l957l889l324k180r58n3O97J643K904M491O475Q768J0971J2712J3895
58580G20151J4456J4151J2949J1354R885Q432O611M659L393L202L629M187N068
$$ plain form
58681 565382 559492 554236 548974 543612 538746 535122 533198 533063 534416 536642 539189 541939 545096 548823
58667 548823 553288 559010 566769 576940 589028 601920 614537 626252 636770 645686 652172 655319 654949
58654 654949 651989 647826 643295 638411 632905 626732 620124 613507 607459 602427 598331 594709 591349 588599
58640 588599 586873 586058 585624 585231 585024 585366 586434 588023 589599 590557 590543 589587 587936 585819 583426 580987
58624 580987 578703 576613 574697 573206 572777 574099 577413 582348 588216 594478 601085 608536 617576 628512
58610 628512 640592 652245 662140 669996 676197 680811 683492 684345 684310 684244 683936 682502 679626 675888 671956
58595 671956 667999 664110 660786 658606 657648 657595 658292 659935 662839 667330 673805 682573 693544 706256 720151
58580 720151 734607 748758 761707 773061 782946 791378 797989 802648 806041 809243 812872 817059 822127
58567H22127O622Q665J0780J2997J5558J8208K0254K1399K1954K2203K1957K0890
58555A023614J8951J6308J3216J0020P021M230J475j352m290p499j0972j4189
58543A056533j6577j8205j9508k0415k0524k0141k0230k0954k1230k0222j8480
58532H40047j6907j5413j3478j1452j0100r214p787n557l434k273j974j894j467
58519G39097l17J458L015L456K911K290J981J637J329J829L214M256L945K966
58505G73067K695L299L795L770L859M439M759L920K121L86o58j196j623k045k461
58490G98127k976l529l636k811j225L80J474K220L137M554O553R031J1563J3389
58476H36251J3920J3214J1765R980P990N791L306M86k451n075p206r070j0718
$$ plain form
58567 822127 828749 837414 848194 861191 876749 894957 915211 936610 958564 980767 1002724 1023614
58555 1023614 1042565 1058873 1072089 1082109 1089130 1093360 1094835 1093483 1089193 1081694 1070722 1056533
58543 1056533 1039956 1021751 1002243 981828 961304 941163 920933 899979 878749 858527 840047
58532 840047 823140 807727 794249 782797 772697 763483 755696 750139 746705 744432 742458 740564 739097
58519 739097 738780 740238 743253 746709 749620 751910 753891 755528 756857 758686 761900 766156 770101 773067
58505 773067 775762 779061 782856 786626 790485 794924 799683 803603 805724 806110 805452 804256 802633 800588 798127
58490 798127 795151 791622 787986 785175 783950 784330 785804 788024 791161 795715 802268 811299 822862 836251
58476 836251 850171 863385 875150 885130 893120 898911 902217 902703 900252 895177 887971 878901 868183
58463H68183j1720j1749j1115j0259r063p223m960k760o32J689L930N404N906
58450H15631N780N130L705J642l36j656k348k678k858l060l217k855j757n95j50
58435H10378qR97K965M643N192N238N681O498P329Q350R827J1430J2702J3673
58421I04895J4428J4567J3730J2199J0407Q285N567K395r15m179o967q502q576
58408I57334q091p969q023p505o347n147m271l776l733l830l052p74J948L214
58394H99978K512J313J206K171K896K307M46j716l087l379l246l394l565k804
58380H91638o09K461N348P279Q015P719O753N508M357L721L897M666N469O088
58366I62310O812P720Q320Q314Q218Q618R175R138Q567Q304Q677R036Q692P760
$$ plain form
58463 868183 856463 844714 833599 823340 814277 807054 802094 799334 798702 800391 804321 809725 815631
58450 815631 821411 826541 830246 831888 831552 829896 827548 824870 822012 818952 815735 812880 811123 810528 810378
58435 810378 810370 811367 814332 818975 824167 829405 835086 841584 848913 857263 867090 878520 891222 904895
58421 904895 919323 933890 947620 959819 970226 978511 984078 986473 985558 981379 974412 965910 957334
58408 957334 949243 941274 933251 925746 919399 914252 909981 906205 902472 898642 895590 894816 896764 899978
58394 899978 902490 903803 905009 907180 910076 912383 912829 911113 908026 904647 901401 898007 894442 891638
58380 891638 891029 893490 898838 906117 914132 921851 928604 934112 938469 942190 946087 950753 956222 962310
58366 962310 969122 976842 985162 993476 1001694 1010312 1019487 1028625 1037192 1045496 1054173 1063209 1071901 1079661
58352A079661O764N898N017M137L574L628M178M752N065N409O301P699R017R977
58338A161077J1024J2585J4415J6023J7330J8430J9032J8716J7564J6080J4590
58327A336866J3101J1600J0089Q475O825N500M737M293L883L739M262N292O275
58314A424937P027P908R232J0858J2431J3753J4917J6175J7583J8759J9266J9274
58302A592120J9520K0403K1466K1999K1754K0949J9949J9156J8822J8754J8619
58291A813511J8619J9266K0375K1039K0937K0938K1943K3787K5728K7418K8933
58280B062494L0381L1955L3802L5545L6617L7301L8589M0665M2566M3826M5317
58269B479058M7740N0462N2780N5269N8810O3115O7339P1309P5069P8004P9561
$$ plain form
58352 1079661 1086425 1092323 1097340 1101477 1105051 1108679 1112857 1117609 1122674 1128083 1134384 1142083 1151100 1161077
58338 1161077 1172101 1184686 1199101 1215124 1232454 1250884 1269916 1288632 1306196 1322276 1336866
58327 1336866 1349967 1361567 1371656 1380131 1386956 1392456 1397193 1401486 1405369 1409108 1413370 1418662 1424937
58314 1424937 1431964 1439872 1449104 1459962 1472393 1486146 1501063 1517238 1534821 1553580 1572846 1592120
58302 1592120 1611640 1632043 1653509 1675508 1697262 1718211 1738160 1757316 1776138 1794892 1813511
58291 1813511 1832130 1851396 1871771 1892810 1913747 1934685 1956628 1980415 2006143 2033561 2062494
58280 2062494 2092875 2124830 2158632 2194177 2230794 2268095 2306684 2347349 2389915 2433741 2479058
58269 2479058 2526798 2577260 2630040 2685309 2744119 2807234 2874573 2945882 3020951 3098955 3178516
58258C178516Q0240Q0753Q0828P9904P8370P7091P6310P6050P6914P9430Q3138
58247D047544Q7310R1997R7544J03841J10833J18883J27767J36416J44557J53351
58237E220043J63501J74127J84627J95964K08829K22239K35603K50313K67458
58228G122704K85792L04101L23778L46643L71899L97833M25024M55182M88407
58219A0521363N24322N64495O10875O63269P21241P87027Q63604R51546J050783
58210A7258525J163683J293442J441672J611108J808478K041440K315986K641141
58202C1575475L032916L509387M086443M784322N634078O672212P935799R471549
58194G6702181J1343335J3621174J6367852J9632502K3407052K7509729L1464076
$$ plain form
58258 3178516 3258756 3339509 3420337 3500241 3578611 3655702 3732012 3808062 3884976 3964406 4047544
58247 4047544 4134854 4226851 4324395 4428236 4539069 4657952 4785719 4922135 5066692 5220043
58237 5220043 5383544 5557671 5742298 5938262 6147091 6369330 6604933 6855246 7122704
58228 7122704 7408496 7712597 8036375 8383018 8754917 9152750 9577774 10032956 10521363
58219 10521363 11045685 11610180 12221055 12884324 13605565 14392592 15256196 16207742 17258525
58210 17258525 18422208 19715650 21157322 22768430 24576908 26618348 28934334 31575475
58202 31575475 34608391 38117778 42204221 46988543 52622621 59294833 67230632 76702181
58194 76702181 88045516 101666690 118034542 137667044 161074096 188583825 220047901
58187B20047901L4496821L5684197L4170531K9414140K1466518J1179339R9458
58180C86558905j0037239j7932315k3055946k5564077k6031547k5223752k3901468
58173B34812561k2603544k1505839k0488787j9356218j8005976j6450847j4761608
58166A01639742j3027459j1340379r774908q371389p141422o083153n186193m431035
58158C6283804l795092l259867k810154k430949k109756j839070j613147j424538
58150A7001231j266008j132950j021502r26660q44113p71718p07498o48368n92388
58141I090026n40120m92251m47747m05552l66234l30768k99350k72307k50516
58132E685181k34071k21957k13483k08209k04090j97895j88443j77652j67518
$$ plain form
58187 220047901 254544722 290228919 324399450 353813590 375280108 386459447 386558905
58180 386558905 376521666 358589351 335533405 309969328 283937781 258714029 234812561
58173 234812561 212209017 190703178 170214391 150858173 132852197 116401350 101639742
58166 101639742 88612283 77271904 67496996 59125607 51984185 45901032 40714839 36283804
58158 36283804 32488712 29228845 26418691 23987742 21877986 20038916 18425769 17001231
58150 17001231 15735223 14602273 13580771 12654111 11809998 11038280 10330782 9682414 9090026
58141 9090026 8549906 8057655 7609908 7204356 6838122 6507354 6208004 5935697 5685181
58132 5685181 5451110 5229153 5015670 4807461 4603371 4405476 4217033 4039381 3871863
58123C871863j57841j47804j37983j29452j22203j15540j09091j02669r6079q9718
58113B663483q4324p9724p4888o9689o5350o2629o0701n8440n5810n3363n1309
58102A947256m9678m8579m7806m6876m5684m4428m2844m0401l7362l4668l2634
58091A476296l0792k8964k7392k5704k3140k0048j7916j7468j7882j8262j8650
58080A230078j9221j9652j9869k0404k1391k2214k2585k2960k3392k3114k1836
58069I93440k0454j9719j9182j8152j6852j5797j4824j3575j2267j1240j0301
58058H21077r307q784r216j0162j0778j0856j0685j0286r524q685q264q306q405
58045F97819q344q223q100p837p357o818o595p058q110q968q721p290n546m470
$$ plain form
58123 3871863 3714022 3566218 3428235 3298783 3176580 3061040 2951949 2849280 2753201 2663483
58113 2663483 2579159 2499435 2424547 2354858 2289508 2226879 2166178 2107738 2051928 1998565 1947256
58102 1947256 1897578 1848999 1801193 1754317 1708633 1664205 1621361 1580960 1543598 1508930 1476296
58091 1476296 1445504 1416540 1389148 1363444 1340304 1320256 1302340 1284872 1266990 1248728 1230078
58080 1230078 1210857 1191205 1171336 1150932 1129541 1107327 1084742 1061782 1038390 1015276 993440
58069 993440 972986 953267 934085 915933 899081 883284 868460 854885 842618 831378 821077
58058 821077 811770 802986 793770 783608 772830 761974 751289 741003 731479 722794 714530 706224 697819
58045 697819 689475 681252 673152 665315 657958 651140 644545 637487 629377 620409 611688 604398 598852 594382
58031E94382m465n364o678p730q054p799p433p098o651o220o136o307o275n972
58017E02200n784n756n416m597l871l760m061m219m059l841l846m052m047l304
58003D41587j852m90N7P6M59J598L261N261P426R141R849R978J0395J0916J0469
57988E18131Q893P440P059P191O792N585L735J218j687m047n289o001p012q151
57974E33857q632q281p627p080o725o652o849o932o499n744n235n172n199m827
57960D42403l874k596j581j233j289j166r20j220k226l044k795j724p24k03P8
57945D17886L97R03J822L284M979O358P144P448P574P936Q857J0189J1292J1624
57931E07693J1096R762P600M848K094l04k547m817o828q381r869j1694j3478j4435
$$ plain form
58031 594382 589917 584553 577875 570145 562091 554292 546859 539761 533110 526890 520754 514447 508172 502200
58017 502200 496416 490660 485244 480647 476776 473016 468955 464736 460677 456836 452990 448938 444891 441587
58003 441587 439735 439245 439302 439378 439837 441435 444696 449957 457383 466524 476373 486351 496746 507662 518131
57988 518131 527024 534464 541523 548714 555506 561091 564826 566044 564357 560310 555021 549020 542008 533857
57974 533857 525225 516944 509317 502237 495512 488860 482011 475079 468580 462836 457601 452429 447230 442403
57960 442403 438529 435933 434352 433119 431830 430664 429744 428524 426298 423254 420459 418735 418011 417808 417886
57945 417886 418283 419186 421008 424292 429271 435629 442773 450221 457795 465731 474588 484777 496069 507693
57931 507693 518789 528551 536151 540999 543093 542789 540242 535425 528597 520216 510347 498653 485175 470740
57917D70740j4363j3696j2766j1607j0404r556r122q580p405n687m067l137k921
57904C57429k937k788k635k917l660m319m424m046l545l147k841k415j494J16
57890C16377J944L135L372L196L234L461L476L066K284J324O15O13J129J269M68
57875C48963p48j451j493j436j552j482r11o8O11R87J191J356J520J728K045K455
57859C51715K799K972L140L661M658N824O687O998O654N614M076K505J168j25
57845D08346j493k515k820k787l093l741m239m534m967n446n453m956m485m225
57831C53592l774k955k122j459p05K71J308K416L649M477M212L177K475K548K882
57816C69992L263L914M272L189R34n46l31J4j283l777n965p561r061j0044r736
$$ plain form
57917 470740 456377 442681 429915 418308 407904 398348 389226 380646 373241 367554 363487 360350 357429
57904 357429 354492 351704 349069 346152 342492 338173 333749 329703 326158 323011 320170 317755 316261 316377
57890 316377 318321 321456 324828 328024 331258 334719 338195 341261 343545 344869 345484 346097 347226 348495 348963
57875 348963 348215 346764 345271 343835 342283 340801 339890 339822 340433 341420 342611 343967 345487 347215 349260 351715
57859 351715 354514 357486 360626 364287 368945 374769 381456 388454 395108 400722 404798 407303 408471 408346
57845 408346 406853 404338 401518 398731 395638 391897 387658 383124 378157 372711 367258 362302 357817 353592
57831 353592 349818 346863 344741 343282 342577 342848 344156 346572 350221 354698 358910 362087 364562 367110 369992
57816 369992 373255 377169 381441 384630 385564 385018 384687 384701 383418 379641 373676 366115 357054 347010 337274
57801C37274q682q204q518q806q750q577p870o058l879k808k929k904k101j291
57787B55897r57m75N38J425J696J870K480L217L706M217M902N208M769M212M268
57772B96973M612M342L266J993R61Qj146k492l865n133o204o895o933o254n336
57757B67897m960n281n508m875l658k687k165j657j081q29r35r17o26m77o60q12
57741B30769o73l70O8P76J417J281L72l84m46m07r11j529j453p42j31Q4J72K46
57723B28139J84J72O60J610K335K301J712J139Q34O22L39J22K24O07Q99P96L93
57706B43088L1o2R5L70O24P97J018J482K101K531K691K906L217K965J700P0q44
57689B64780r61j186j952k670k709k192j418k08J649L784N632P175Q929J1356
$$ plain form
57801 337274 328592 320388 311870 303064 294314 285737 277867 271809 267930 265122 262193 259289 257188 255897
57787 255897 254940 254465 255003 256428 258124 259994 262474 265691 269397 273614 278516 283724 288493 292705 296973
57772 296973 301585 305927 309193 311186 312147 312155 311009 308517 304652 299519 293315 286420 279487 273233 267897
57757 267897 262937 257656 252148 247273 243615 240928 238763 237106 236025 235196 234261 233344 232718 232241 231581 230769
57741 230769 230096 229726 229794 230570 231987 233268 233640 233256 232810 232403 231492 229963 228510 227768 227637 227721 227893 228139
57723 228139 228323 228495 229155 230765 233100 235401 237113 238252 239086 239708 240047 240169 240393 241000 241899 242695 243088
57706 243088 243119 243057 243152 243522 244146 244943 245961 247443 249544 252075 254766 257672 260889 263854 265554 265624 264780
57689 264780 263819 262633 260681 258011 255302 253110 251692 251484 253133 256917 262549 269724 278653 290009
57675B90009J4654J8936K4350L1083L9357M9254O0360P1642Q1596Q8164Q8633
57664H58038Q0290O2010L5447M782k4813m9048o5713p4719p7119p4209o7590n9367
57652E47989n1497m4716l8616l2777k7379k2703j8715j5340j2645j0543q705p053
57640B57300n867n194m581l645k662k173k279k478k166j157J25J000J219J182
57626B28624J247J060J33j196k038k189k266k585k734k436k061j840j366m39L30
57611B10244L22j80n47q12j378k048k161j631j140j223j612j692j311r07j008
57596A92916j597k078j933j377j100j313j518j316j017j131j612k030k205k283
57582A70406k311k157j776j307q86n68l94m25o71j060j425j601j623j725j926
$$ plain form
57675 290009 304663 323599 347949 379032 418389 467643 528003 599645 681241 769405 858038
57664 858038 938328 1000338 1035785 1040567 1015754 966706 900993 826274 749155 674946 607356 547989
57652 547989 496492 451776 413160 380383 353004 330301 311586 296246 283601 273058 264353 257300
57640 257300 251433 246239 241658 238013 235351 233178 230899 228421 226255 225098 225223 226223 227442 228624
57626 228624 229871 230931 231064 229868 227830 225641 223375 220790 218056 215620 213559 211719 210353 209914 210244
57611 210244 210566 210386 209839 209027 207649 205601 203440 201809 200669 199446 197834 196142 194831 193924 192916
57596 192916 191319 189241 187308 185931 184831 183518 182000 180684 179667 178536 176924 174894 172689 170406
57582 170406 168095 165938 164162 162855 161969 161401 161007 160582 159911 158851 157426 155825 154202 152477 150551
57567A50551j840j271p85j136k097k571j974r45l44j73Q7N29P55N69K33Q2J88
57550A39858L97N38O11P76J140J570J893K084K114J850J467J572K408L183K946
57535A64407J864Q67K09n99j458j531p30j19l60p31m61K3m2m26m33r3J22K64O86
57516A61459J223J420J285J113Q95N89N70J049J389Q70j87q80j019j102j318j452
57500A65904j592j897j871q51O80J357P25j51k54J00J3n79r68p99n53q39j581
57483A56844k037j665q03k97m20o21m72l52o94j098q70k00N2l79p97n32L30J313
57465A47302K061K361K147J655J255J014P43M41L34M42M82K28k43o94q31m96N5
57448A58256K59K1L9Q68J923K112J263K72j34j03m1l3j9j8R1N19J098J269P39
$$ plain form
57567 150551 148711 147440 146655 145519 143422 140851 138877 137932 137588 137415 137502 138031 138786 139355 139588 139670 139858
57550 139858 140255 140793 141404 142180 143320 144890 146783 148867 150981 152831 154298 155870 158278 161461 164407
57535 164407 166271 167138 167347 166748 165290 163759 163029 162910 162550 161819 161358 161381 161339 160913 160480 160387 160509 160773 161459
57516 161459 162682 164102 165387 166500 167395 167984 168554 169603 170992 171862 171675 170795 169776 168674 167356 165904
57500 165904 164312 162415 160544 159693 160373 161730 162455 162304 162050 162150 162163 161584 160616 159817 159264 158425 156844
57483 156844 154807 153142 152339 152042 151622 151001 150529 150177 149483 148385 147515 147315 147367 146988 146191 145659 145989 147302
57465 147302 149363 151724 153871 155526 156781 157795 158538 158979 159313 159755 160237 160465 160222 159528 158697 158201 158256
57448 158256 158515 158536 158575 159443 161366 163478 164741 165013 164879 164776 164735 164702 164683 164665 164756 165275 166373 167642 168381
57429A68381j01n67l33L83J003J051O30L42N15P34M70j05m33m01l13k44m9J22
57411A71085l3l45l72j05Q0J52L71O29N54K86L38O94Q24O56O74Q75O45j9j62P69
57391A77596J954K303J761J006M23Q0K02Q69J579J743J401R77O15L01L12Q85J695
57374A95702K133K058J701J089J88n80n75J80R33J168J089J055R94P82P33J239
57358B09889K046K405K018J447J387J815K232K459K728K980K725J810Q74O01R00
57343B38316J228J387J568J805J987K202K561K799K595K191K082K213K163K000
57329B67097K195K613K505J740J212J505J962J711J090J184K288L563M170M153
57315B98988M035M095M205M197M086M004L991L967L957M134M526M801M665M377
$$ plain form
57429 168381 168280 167713 167380 167763 168766 169817 170447 170789 171304 172038 172508 172403 171970 171569 171256 171012 170963 171085
57411 171085 171052 170707 170335 170230 170310 170462 170833 171462 172016 172302 172640 173334 174158 174814 175488 176363 177008 176989 176827 177596
57391 177596 179550 181853 183614 184620 185043 185123 185325 186194 187773 189516 190917 191894 192509 192810 193122 194007 195702
57374 195702 197835 199893 201594 202683 202871 202291 201716 201896 202829 203997 205086 206141 207135 207917 208650 209889
57358 209889 211935 214340 216358 217805 219192 221007 223239 225698 228426 231406 234131 235941 236815 237416 238316
57343 238316 239544 240931 242499 244304 246291 248493 251054 253853 256448 258639 260721 262934 265097 267097
57329 267097 269292 271905 274410 276150 277362 278867 280829 282540 283630 284814 287102 290665 294835 298988
57315 298988 303023 307118 311323 315520 319606 323610 327601 331568 335525 339659 344185 348986 353651 358028
57301C58028M486N081N685N956O074O307O601O831P168P890R054J0419J1613J2308
57287D63501J2436J2249J1984J1582J1034J0804J1383J2488J3270J3419J3437
57276E97587J3708J3873J3406J2332J1022R739Q727Q289Q408Q548Q226P666P621
57263G29152Q584J0330J2028J2867J2755J2381J2389J2580J2384J1912J1888J2546
57251H71796J3318J3714J3858J3875J3518J2804J2377J2721J3462J3854J3582
57240A018879J2827J1966J1537J1944J2824J3301J3243J3551J4781J6115J6490
57229A167458J6192J6456J7743J9269K0176K0425K0531K0951K1794K2766K3443
57218A387204K3739K3975K4306K4591K5019K6268K8501L0756L2106L2881L3953
$$ plain form
57301 358028 362514 367595 373280 379236 385310 391617 398218 405049 412217 420107 429161 439580 451193 463501
57287 463501 475937 488186 500170 511752 522786 533590 544973 557461 570731 584150 597587
57276 597587 611295 625168 638574 650906 661928 671667 680394 688683 697091 705639 713865 721531 729152
57263 729152 737736 748066 760094 772961 785716 798097 810486 823066 835450 847362 859250 871796
57251 871796 885114 898828 912686 926561 940079 952883 965260 977981 991443 1005297 1018879
57240 1018879 1031706 1043672 1055209 1067153 1079977 1093278 1106521 1120072 1134853 1150968 1167458
57229 1167458 1183650 1200106 1217849 1237118 1257294 1277719 1298250 1319201 1340995 1363761 1387204
57218 1387204 1410943 1434918 1459224 1483815 1508834 1535102 1563603 1594359 1626465 1659346 1693299
57207A693299L5200L5728L5378L4993L5082L5297L5361L5589L6071L6183L5439
57196B083620L4292L3505L3262L3407L4089L5442L6842L7262L6487L5441L5082
57185B468731L5355L5553L5419L5434L5975L6670L6850L6380L5725L5284L5015
57174B862391L4740L4454L4270L4297L4667L5400L6154L6475L6449L6719L7597
57163C253613L8460L8440L7485L6324L5484L4745L3626L2054L0363K8777K7140
57152C626511K5253K3312K1701K0414J9043J7502J6327J5886J5741J5290J4690
57141C831670J4430J4349J3953J3511J3819J4897J5998J7100J9175K2493K5779
57130D017174K7778K8768K9634L0269K9858K8190K5775K2948J9759J6492J3586
$$ plain form
57207 1693299 1728499 1764227 1799605 1834598 1869680 1904977 1940338 1975927 2011998 2048181 2083620
57196 2083620 2117912 2151417 2184679 2218086 2252175 2287617 2324459 2361721 2398208 2433649 2468731
57185 2468731 2504086 2539639 2575058 2610492 2646467 2683137 2719987 2756367 2792092 2827376 2862391
57174 2862391 2897131 2931585 2965855 3000152 3034819 3070219 3106373 3142848 3179297 3216016 3253613
57163 3253613 3292073 3330513 3367998 3404322 3439806 3474551 3508177 3540231 3570594 3599371 3626511
57152 3626511 3651764 3675076 3696777 3717191 3736234 3753736 3770063 3785949 3801690 3816980 3831670
57141 3831670 3846100 3860449 3874402 3887913 3901732 3916629 3932627 3949727 3968902 3991395 4017174
57130 4017174 4044952 4073720 4103354 4133623 4163481 4191671 4217446 4240394 4260153 4276645 4290231
57119D290231J1254R743R696J1682J5609K1134K8219L6858M6637N7300O9357Q3558
57107D691278J00231J19782J43305J71974K06306K46911K95589L55011M27735
57098F758122N16321O23666P52063R02130J073337J264890J474686J697710J926442
57089A6989367K152253K364866K550851K693821K775167K773425K666739K444562
57081C7411051K122474J743052J355429R89005O43919L03455m6641m08018p71333
57072D3342393j122586j448111j736936j981300k176252k319143k409335k448007
57064B7700723k437774k382308k286272k155807j999036j825711j645608j466750
57056A1501457j294907j134283r88095q58324p45502o49015n67472m98774m40374
$$ plain form
57119 4290231 4301485 4311228 4320924 4332606 4348215 4369349 4397568 4434426 4481063 4538363 4607720 4691278
57107 4691278 4791509 4911291 5054596 5226570 5432876 5679787 5975376 6330387 6758122
57098 6758122 7274443 7898109 8650172 9552302 10625639 11890529 13365215 15062925 16989367
57089 16989367 19141620 21506486 24057337 26751158 29526325 32299750 34966489 37411051
57081 37411051 39533525 41276577 42632006 43621011 44264930 44568385 44521744 44113726 43342393
57072 43342393 42219807 40771696 39034760 37053460 34877208 32558065 30148730 27700723
57064 27700723 25262949 22880641 20594369 18438562 16439526 14613815 12968207 11501457
57056 11501457 10206550 9072267 8084172 7225848 6480346 5831331 5263859 4765085 4324711
57047D324711l89929l45784l06934k72754k42750k16285j92530j70890j51439
57038B035416j34458j19695j06460r4379q3449p3371o3490n3561m3928l4676k5124
57027A202825j4393j915J2881L0788N2030P5214R6959J12232J15485J03072P5677
57016A860855L8278k740m2244p6577j02729j18829j25243j24166j17993j08510
57006A080102r7291q5817p4919o4777n5678m8221m2492l7589l2435k6917k1860
56995D92106j8057j5551j3880j2560j1252r638p480m884k253J60K488M843O753
56982D10795P415O516M471J739j683n774r857j2916j4499j4891j4464j3253j1359
56969C32240r317p651o241m527k326QK270M768P691J0576J2893J4831J6753J8068
$$ plain form
57047 4324711 3934782 3588998 3282064 3009310 2766560 2550275 2357745 2186855 2035416
57038 2035416 1900958 1781263 1674803 1580424 1496975 1423604 1360114 1306553 1262625 1227949 1202825
57027 1202825 1188432 1186517 1199398 1230186 1282216 1357430 1454389 1566621 1682106 1785178 1860855
57016 1860855 1899133 1896393 1854149 1777572 1674843 1556014 1430771 1306605 1188612 1080102
57006 1080102 982811 896994 822075 757298 701620 653399 610907 573318 540883 513966 492106
56995 492106 474049 458498 444618 432058 420806 411168 403688 398804 396551 396711 399199 404042 410795
56982 410795 418210 424726 429197 430936 429253 423479 413622 400706 386207 371316 356852 343599 332240
56969 332240 322923 315272 309031 304504 302178 302186 304456 309224 316915 327491 340384 355215 371968 390036
56955C90036J7428J4223R102K912l976j0895j6344j9124j9562j8903j7879j6497
56943C10521j4742j2657j0024o773l448n03K552O408J0593J3918J6221J8576K1535
56930C52177K4032K4398K1670J5753P251k364j1159j7871k2393k4987k5669k4702
56918C16136k2911k1091j9385j7591j5593j3257j0517p872o291o167o725o805
56906A61931n978m694l668l308l412l324k686j957j694j496m68J359L023M171
56892A37799N626Q074J1167J4355J7653K0953K3425K4335K3783K2015J8794J4082
56880C42061Q706L533j366n969r448j0944j0662r350p183m102p00K350N404R313
56866C11643J4033J8806K3565K9005L5227M1342M6466N0013N0878M7490L9238
$$ plain form
56955 390036 407464 421687 430789 433701 429725 418830 402486 383362 363800 344897 327018 310521
56943 310521 295779 283122 273098 266325 262877 262374 264926 271334 281927 295845 312066 330642 352177
56930 352177 376209 400607 422277 438030 445281 442917 431758 413887 391494 366507 340838 316136
56918 316136 293225 272134 252749 235158 219565 206308 195791 187919 181628 175461 168736 161931
56906 161931 155953 151259 147591 144283 140871 137547 134861 132904 131210 129714 129246 130605 133628 137799
56892 137799 143425 151499 162666 177021 194674 215627 239052 263387 287170 309185 327979 342061
56880 342061 350767 354300 352934 346965 337517 326573 315911 306561 299378 295276 294576 296926 302330 311643
56866 311643 325676 344482 368047 397052 432279 473621 520087 570100 620978 668468 707706
56855G07706K7236J3283j143j4561k5126l1468l3694l2984l0438k6603k1730j5951
56843E14527r256j714O301J4397K2678L1701M1836N2749O3487P2899P9711Q2190
56831I71506P8114O5760M5408J9862o709l0575m9417o2265o9112p0671o8058o2490
56819G61353n5071m6706l7955k9005j9868j0557j126Q335J7761K7255L6979M6506
56807F97901N4264N8055N6249M8321L4539J5975n013k5107m1529n3028n9414o0849
56795G20364n8074n2672m6268l9644l2976k6505k0423j4521q548k637L090R015
56783D30201J5399K1540K6166K8473K8179K4833J7945P928l712j5122k4699l1272
56771E25859l4526l5366l5128l4297l2452k9482k6131k3121k0382j7548j4736
$$ plain form
56855 707706 734942 748225 747082 732521 707395 675927 642233 609249 578811 552208 530478 514527
56843 514527 505271 503557 509858 524255 546933 578634 620470 673219 736706 809605 889316 971506
56831 971506 1049620 1115380 1160788 1180650 1173941 1143366 1093949 1031684 962572 891901 823843 761353
56819 761353 706282 659576 621621 592616 572748 562191 561065 569400 587161 614416 651395 697901
56807 697901 752165 810220 866469 914790 949329 965304 960291 935184 893655 840627 781213 720364
56795 720364 662290 609618 563350 523706 490730 464225 443802 429281 420733 418096 421186 430201
56783 430201 445600 467140 493306 521779 549958 574791 592736 600664 596952 581830 557131 525859
56771 525859 491333 455967 420839 386542 354090 324608 298477 275356 254974 237426 222690
56760B22690j2424j0813r665q614p433o163n110m538m332m065l553l053k850k852
56746A37225k771k520k260k050j711j079m10k58q24j529j512o27L65O38J53n15
56730A20315q14o11j39J92J65L5K68Q94J403J409J048O43L11J19K21N82R00J020
56712A27961J086J092P49N2n00n31k65rK76O12O80L53Q4K62N92O20M40L26J82
56693A34062j15k69q1Mm79j143j241p66k96m7J97L77J98j95k91n1o7o93j497j676
56673A25931r06L08J012Q13M18P68J629J795R25J27K68O67L18n79j232j555j712
56656A28995j184L48J851K097J487J314J632J458Q21P48J271J216K82l65j6O14
56640A42569R36J437K309K540J425j70r70r19o46k39M89J128J059L86k46m31j00
$$ plain form
56760 222690 210266 199453 189788 181174 173741 167578 162468 157930 153598 149533 145980 142927 140077 137225
56746 137225 134454 131934 129674 127624 125913 124834 124424 124166 123342 121813 120301 119674 120039 120677 120830 120315
56730 120315 119501 118890 118751 118943 119108 119143 119411 120305 121708 123117 124165 124808 125119 125238 125459 126041 126941 127961
56712 127961 129047 130139 130888 130940 130440 129909 129644 129635 129911 130523 131203 131556 131640 131902 132494 133114 133554 133880 134062
56693 134062 133947 133678 133597 133601 133122 131979 130738 129972 129676 129629 129826 130203 130401 130206 129915 129864 129797 129104 127607 125931
56673 125931 125025 125333 126345 127158 127576 128344 129973 131768 132693 132820 133088 133755 134073 133494 132262 130707 128995
56656 128995 127811 128159 130010 132107 133594 134908 136540 137998 138819 139567 140838 142054 142336 141971 141955 142569
56640 142569 143505 144942 147251 149791 151216 151046 150076 149157 148511 148272 148761 149889 150948 151334 151088 150657 150557
56623A50557O60J411J451O55j99l78k5L05M43M49K86O0J25N14P90P86Q70J136
56605A59896J016K55m37l85L5R4q7J02O63R76P40K24k81o35o22j09N86R20O81
56586A63632J06m45o81n32k59j87j70J93P21O39k03q00l09O42Q35K39N0R83K403
56567A66857L306L553L741M230M796N209N767O951Q532R414Q776P134N836N571
56553B49673N828N834N431M862M301L763L125K102O44n55o11L03R17L34j082k527
56537B82342l787m852n324m893m024l502l562l967m618n509o297o562o341n984
56523B13120n567m914m110l520l329l362l304k942k242j448r54q54p64k97L68
56508A75881O97M21j67n54m93j52K02N64J104J720J986J753J375J074N72j88m75
$$ plain form
56623 150557 151217 152628 154079 154734 154535 154157 154132 154437 154880 155329 155615 155675 155800 156314 157104 157890 158760 159896
56605 159896 160912 161167 160730 160345 160380 160474 160387 160489 161152 162128 162868 163092 162811 162176 161554 161445 162031 162951 163632
56586 163632 163738 163293 162612 162080 161821 161634 161464 161657 162378 163017 162814 162014 161705 162347 163182 163421 163471 164454 166857
56567 166857 170163 173716 177457 181687 186483 191692 197459 204410 212942 222356 231132 238266 244102 249673
56553 249673 255501 261335 266766 271628 275929 279692 282817 284919 285563 285008 284397 284700 285617 285951 284869 282342
56537 282342 278555 273703 268379 263486 259462 255960 252398 248431 243813 238304 232007 225445 219104 213120
56523 213120 207553 202639 198529 195009 191680 188318 185014 182072 179830 178382 177428 176574 175810 175513 175881
56508 175881 176578 176999 176832 176278 175785 175633 175835 176399 177503 179223 181209 182962 184337 185411 185983 185795 185320
56491A85320K73J365J642J083O14M81N3p63j120o46r9j24l43k06J00K20K80M68
56473A88598N64M00K35K75M41Q28J636K402K244J214L99K82O9p74j490j270n00
56456A95553J07O29J320J792J774J778K057J794M79p78o69K88N53j32n84j65M68
56439B06264N69J66l45n92k41O37J333J321J045J201J597J509Q19%p08j247j270
56422B12058o08J48L89M38Q30J096M25q34j496j202n67J09J084K096K310J600
56406B17876Q27O58Q66J001Q90M16l56p97k94P71J407J413J493J936K131J609
56390B31847P30J53K82J248K709L612L070J511K68J0L10O78J062J304J119Q20
56374B50733J117J977K515K216J451O42j60p55p76m90o55j357j791j529j013n92
$$ plain form
56491 185320 185593 186958 188600 189683 190297 190778 190831 190068 188948 188302 188203 188079 187736 187530 187630 187850 188130 188598
56473 188598 189162 189562 189797 190072 190513 191341 192977 195379 197623 198837 199236 199518 199587 198813 197323 196053 195553
56456 195553 195660 196289 197609 199401 201175 202953 205010 206804 207283 206505 205836 206124 206677 206545 205961 205796 206264
56439 206264 206833 206999 206654 206062 205821 206458 207791 209112 210157 211358 212955 214464 215283 215283 214575 213328 212058
56422 212058 211450 211598 211987 212425 213255 214351 214776 213942 212446 211244 210677 210786 211870 213966 216276 217876
56406 217876 218703 219361 220227 221228 222118 222534 222178 221381 221087 221858 223265 224678 226171 228107 230238 231847
56390 231847 232577 232730 233012 234260 236969 240581 243651 245162 245430 245440 245750 246428 247490 248794 249913 250733
56374 250733 251850 253827 256342 258558 260009 260651 260491 259736 258960 258470 257815 256458 254667 253138 252125 251533
56358B51533k8O58Q60M43J28L04M21J67K25J041J738J281J54k55M76J495J994
56341B62635J897J367N23k62m45M4O81R94J073J326J933K630K902K464J611R91
56325B82364R71J396J942K421K619K298J628J267J600K097J834O38o93j335j260
56310B99787r27m79L18J348J913J585R86J136K178L303L927M236M341L771K309
56295C29732P30qM7J51M3R0M63Q52J031J147J401J837K369K789K839K563K345
56278C50421K360K377K368K765L605M078L589K792K733L408M008M309M852N924
56264C99589P181Q266R025R243Q892Q594R084J0292J1611J2845J4230J5716J7103
56251E41671J8701K0961K3554K5653K7085K8345K9601L0509L1016L1394L1494
$$ plain form
56358 251533 251505 252163 253023 253466 253594 253898 254319 254486 254711 255752 257490 258771 258925 258670 259146 260641 262635
56341 262635 264532 265899 266422 266160 265715 265759 266440 267434 268507 269833 271766 274396 277298 279762 281373 282364
56325 282364 283335 284731 286673 289094 291713 294011 295639 296906 298506 300603 302437 303075 302382 301047 299787
56310 299787 298860 298381 298699 300047 301960 303545 304531 305667 307845 311148 315075 319311 323652 327423 329732
56295 329732 330462 330454 330501 330652 330695 330785 331248 332100 333131 334278 335679 337516 339885 342674 345513 348076 350421
56278 350421 352781 355158 357526 360291 363896 367974 371563 374355 377088 380496 384504 388813 393665 399589
56264 399589 406770 415036 424061 433304 442196 450790 459874 470166 481777 494622 508852 524568 541671
56251 541671 560372 581333 604887 630540 657625 685970 715571 746080 777096 808490 839984
56240H39984L0802K9288K7361K4931K1423J6812J1846P105K517k068o584j1063
56228I92354j5572j9718k2878k4842k5808k5898k5326k4717k4487k4182k3216
56217G35710k1889k0785j9616j7790j5697j4153j2896j1086r074q113q242q106
56205E68263p079o026n593n317m835m520m265l205j338r9l76j129r70n0O30Q77
56189E24968J175J494J382R70R34J603K587L291L375K949K437K170K039J849J780
56174E55003K109K667L094L442L817L894L513L398M288N625O234O031N954O402
56160F15471P014P734Q801R843J0372J0998J2684J4871J6033J6105J6653J8447
56148G65026K0674K2817K5542K9245L3526L8609M5636N5002O6010P8606R3462
$$ plain form
56240 839984 870786 900074 927435 952366 973789 990601 1002447 1009552 1012069 1010001 1003417 992354
56228 992354 976782 957064 934186 909344 883536 857638 832312 807595 783108 758926 735710
56217 735710 713821 693036 673420 655630 639933 625780 612884 601798 592724 584611 576369 568263
56205 568263 561184 555158 549565 544248 539413 534893 530628 527423 526085 525986 525610 524481 523511 523461 524091 524968
56189 524968 526143 527637 529019 529989 530923 532526 535113 538404 541779 544728 547165 549335 551374 553223 555003
56174 555003 557112 559779 562873 566315 570132 574026 577539 580937 585225 590850 597084 603115 609069 615471
56160 615471 622485 630219 639020 648863 659235 670233 682917 697788 713821 729926 746579 765026
56148 765026 785700 808517 834059 863304 896830 935439 981075 1036077 1102087 1180693 1274155
56137A274155J09597J23846J33656J38789J39402J34541J23960J09910R5659Q3234
56127B466749P3495O6758O2039N6912M9565M0146K9371J7227M186p838j7221k4458
56115B816931l1270l8948m8537o1116p6464r2288j06059j16751j23942j26571
56105A994985j23893j16699j06496r4366q1602p0061o0615n2223m3699l5451k8401
56094A181479k2394j6910j2291q972o420m019k055q12L05J693K745L130L690M915
56080A124084N867N815N677O463P517P887Q179R559J1679J3241J3900J4298J4885
56067A249051J5748J6989J8353J9235J9733K0625K1758K1909K0931K0270K0492
56056A465094K0180J8479J6789J6443J6604J6134J5695J6261J7166J7571J8253
$$ plain form
56137 1274155 1383752 1507598 1641254 1780043 1919445 2053986 2177946 2287856 2383515 2466749
56127 2466749 2540244 2607002 2669041 2725953 2775518 2815664 2845035 2862262 2866448 2858610 2841389 2816931
56115 2816931 2785661 2746713 2698176 2637060 2560596 2468308 2362249 2245498 2121556 1994985
56105 1994985 1871092 1754393 1647897 1553531 1471929 1401868 1341253 1289030 1245331 1209880 1181479
56094 1181479 1159085 1142175 1129884 1120912 1114492 1110473 1108418 1107606 1107911 1109604 1112349 1115479 1119169 1124084
56080 1124084 1129951 1135766 1141443 1147906 1155423 1163310 1171489 1181048 1192727 1205968 1219868 1234166 1249051
56067 1249051 1264799 1281788 1300141 1319376 1339109 1359734 1381492 1403401 1424332 1444602 1465094
56056 1465094 1485274 1503753 1520542 1536985 1553589 1569723 1585418 1601679 1618845 1636416 1654669
56045A654669K0019K1867K2669K3240K4762K6610K7662K8416K9822L1378L2379
56034A943493L3727L6406L9398M1119M1796M2634M3827M5122M6986M9446N1237
56023B415191N1782N2509N4590N7161N9409O2258O6060O8999P0092P1502P5357
56012C104910Q0354Q4137Q6932R0134R3482R6475J00561J06962J14214J20578
56002D078739J26890J34391J42106J49188J57271J67537J78100J87475J97659
55993E519356K10349K23240K34021K44911K58968K74944K90264L06192L25334
55984G887579L46890L69128L93624M22305M53502M85960N23260N68845O20497
55975A2071590O75472P37089Q09889Q92680R83375J086310J207207J345712J501406
$$ plain form
56045 1654669 1674688 1696555 1719224 1742464 1767226 1793836 1821498 1849914 1879736 1911114 1943493
56034 1943493 1977220 2013626 2053024 2094143 2135939 2178573 2222400 2267522 2314508 2363954 2415191
56023 2415191 2466973 2519482 2574072 2631233 2690642 2752900 2818960 2887959 2958051 3029553 3104910
56012 3104910 3185264 3269401 3356333 3446467 3539949 3636424 3736985 3843947 3958161 4078739
56002 4078739 4205629 4340020 4482126 4631314 4788585 4956122 5134222 5321697 5519356
55993 5519356 5729705 5952945 6186966 6431877 6690845 6965789 7256053 7562245 7887579
55984 7887579 8234469 8603597 8997221 9419526 9873028 10358988 10882248 11451093 12071590
55975 12071590 12747062 13484151 14294040 15186720 16170095 17256405 18463612 19809324 21310730
55966B1310730J682407J899108K154953K453964K812319L251533L786436M433142
55958D3784592N223511O197894P390590Q839489J0603885J2754552J5352679J8450659
55950A28597851K2073138K6111368L0179417L3572982L5380751L4670453L0713281
55943C41299241K3292843J3013823J317987r970755j9324703k5944034k9741121
55936B93943281l1078082l0526245k8710529k6187806k3368813k0520688j7813735
55929A15737383j5347708j3158384j1240554r579378q157931o949038n920818
55922D5383572n050490m321962l714083l202883k772451k413146k112070j855002
55914A9941485j635070j450072j293347j155726j034344r30975q43064p64180
$$ plain form
55966 21310730 22993137 24892245 27047198 29501162 32313481 35565014 39351450 43784592
55958 43784592 49008103 55205997 62596587 71436076 82039961 94794513 110147192 128597851
55950 128597851 150670989 176782357 206961774 240534756 275915507 310585960 341299241
55943 341299241 364592084 377605907 378923894 368953139 349628436 323684402 293943281
55936 293943281 262865199 232338954 203628425 177440619 154071806 133551118 115737383
55929 115737383 100389675 87231291 75990737 66411359 58253428 51304390 45383572
55922 45383572 40333082 36011120 32297037 29094154 26321703 23908557 21796487 19941485
55914 19941485 18306415 16856343 15562996 14407270 13372926 12441951 11598887 10834707
55906A0834707o92100o28986n74338n24482m78489m38269m03219l70458l39809
55897F384557l13278k90175k67860k46651k28911k13937j98661j82944j69289
55888D272851j57565j44750j29931j15247j01599q7477p2261n7008m1763k5675
55878C339575j0112J478O967O081k016j8218m0369o3698q4732j02469j16030j24119
55866B792338j26967j26233j22760j16571j08828j01331r4262q6750p9374p3629
55856A755633o9113o3821n7327n1291m6709m2888l9410l6840l5188l3535l1577
55845A247934k9953k8909k8059k7394k7168k6992k6366k5641k5105k3841k1143
55834I57363j8286j7039j7048j6641j5560j4813j4309j2955j0900r601r590j0055
$$ plain form
55906 10834707 10142607 9513621 8939283 8414801 7936312 7498043 7094824 6724366 6384557
55897 6384557 6071279 5781104 5513244 5266593 5037682 4823745 4625084 4442140 4272851
55888 4272851 4115286 3970536 3840605 3725358 3623759 3536282 3464021 3407013 3365250 3339575
55878 3339575 3329463 3330941 3337908 3343989 3341973 3323755 3283386 3219688 3134956 3032487 2916457 2792338
55866 2792338 2665371 2539138 2416378 2299807 2190979 2089648 1995386 1908636 1829262 1755633
55856 1755633 1686520 1622699 1565372 1514081 1467372 1424484 1385074 1348234 1313046 1279511 1247934
55845 1247934 1217981 1189072 1161013 1133619 1106451 1079459 1053093 1027452 1002347 978506 957363
55834 957363 939077 922038 904990 888349 872789 857976 843667 830712 819812 810211 800621 790566
55822G90566j0562j1412j2360j2674j2496j2558j2708j2242j1340j0665r913q447
55810F53189o852o079n536l965j745k66M89J585K796L049K961M265O505P081N083
55795F62560K623J370K11k463o123r131j0903j1649j1229r575p490o053n716o451
55781E79981q057r911j1190j1709j1806j1317r644o915m051j484J093L528M871
55768E03389M566K978N21k701o181r012j0926j2426j3706j4319j4090j3274j1822
55755D02997r483o832n024m333l967l516l491m175n069n749o261o423n819m763
55741C28092m108l872l176j888j065j284j760j702j527j934k699l140l095k805
55727B94037k403k072k162k707l311l775m309m880n014m487l594k545j266LP23
$$ plain form
55822 790566 780004 768592 756232 743558 731062 718504 705796 693554 682214 671549 661636 653189
55810 653189 646337 640258 634722 630757 629012 628746 629235 630820 633616 636665 639626 643891 650396 657477 662560
55795 662560 665183 666553 666764 664301 658178 649047 638144 626495 615266 605691 598201 592148 586432 579981
55781 579981 571924 562013 550823 539114 527308 515991 506347 499432 495381 493897 494990 498518 503389
55768 503389 507955 510933 511454 508753 502572 493560 482634 470208 456502 442183 428093 414819 402997
55755 402997 393514 386682 381658 377325 373358 369842 366351 362176 357107 351358 345097 338674 332855 328092
55741 328092 323984 320112 316936 315048 313983 312699 310939 309237 307710 305776 303077 299937 296842 294037
55727 294037 291634 289562 287400 284693 281382 277607 273298 268418 263404 258917 255323 252778 251512 251515 252238
55712B52238R20J325K325L414L961L816K993J534n7j039j394j880k806l559l726
55697B58065l921m894o447p739q239p968p148o084n031l977k761j546p95o26n75
55682A90314j13Q89K138L035L006K192J573J809K292K013J065L20j06q87k004
55667B07536k510k030j386j271j337j045n84k75J28R23J826K393K671K984L432
55652B11455L959M522M929M881M330L431K145L73j477k664k970k911l010l481
55638B23512m489o007p343p606o770n625m653l715k930k856l533m144m004l232
55624A56605k217j178m24k94n34m81n5J29j25l01k01l54r82j483j436j282j449
55607A43938j614j386j055j000j000p62n71p64j075j053p80o32o58o71n85l74
$$ plain form
55712 252238 253158 254483 256808 260222 264183 267999 270992 272526 272469 271430 270036 268156 265350 261791 258065
55697 258065 254144 249250 242803 235064 226825 218857 211709 205625 200594 196617 193856 192310 191515 190889 190314
55682 190314 190201 191090 193228 196263 199269 201461 203034 204843 207135 209148 210213 210533 210427 209540 207536
55667 207536 205026 202996 201610 200339 199002 197957 197373 197098 197226 198149 199975 202368 205039 208023 211455
55652 211455 215414 219936 224865 229746 234076 237507 239652 240025 238548 235884 232914 230003 226993 223512
55638 223512 219023 213016 205673 198067 191297 185672 181019 177304 174374 171518 167985 163841 159837 156605
55624 156605 154388 153210 152786 152492 151958 151477 151422 151551 151426 151125 150924 150570 149588 148105 146669 145387 143938
55607 143938 142324 140938 139883 138883 137883 137121 136550 135786 134711 133658 132878 132246 131588 130917 130332 129958
55591A29958pK74J04m35p97p54o08m91j32M56P33N04L36P30J471K178K858L536
55573A39914M012M356M936N683O002N867O048O697O640M915K298L37n86j334k519
55558A93266l864m928n634o076o338o522o597o330n626m720l852l045k352j946
55544A25436j756j458j054r14j022q37k02L11L23K27L47K06o80j816k239j627
55528A13245m34P11J280J041L87J0j26q23k225l194k767j457m13L2J09l06j279
55511A03791k048j833j112j016j662k124j874j254n50L42J246J611J328Q73N29
55496I6247J19l51m61k0N94R30R54Q88R29J148J364J184M73l10o13m11m8L01N18
55477A03435K59o25j584j944j823j820j990j846j289p28k73M04J263J683J356
$$ plain form
55591 129958 129951 130225 130329 129894 129097 128343 127735 127244 127112 127568 128301 128805 129141 129871 131342 133520 136378 139914
55573 139914 143926 148282 153218 158901 164903 170770 176818 183515 190155 195070 197368 197705 197119 195785 193266
55558 193266 189402 184474 178840 172764 166426 159904 153307 146977 141351 136631 132779 129734 127382 125436
55544 125436 123680 122222 121168 120254 119232 118395 118193 118504 118827 119054 119401 119607 118927 117111 114872 113245
55528 113245 112811 113522 114802 115843 116230 116240 116114 115291 113066 109872 107105 105648 105235 105267 105376 105070 103791
55511 103791 101743 99910 98798 97782 96120 93996 92122 90868 90318 90660 91906 93517 94845 95718 96247
55496 96247 96366 96015 95554 95534 96128 97058 98012 98900 99829 100977 102341 103525 103998 103688 103075 102664 102616 102917 103435
55477 103435 103694 103069 101485 99541 97718 95898 93908 92062 90773 90045 89772 90176 91439 93122 94478
55462I4478P42M20M43O58J054J454J350N42l85o46j76L78M86K00j20k48j58J23
55444A00595N13P83O43K7p78j429j741j565p24N58J428J242M65J04K24o5r56j340
55426I7984m65P28Q71R9l52q7J70R5L17J195K035K143J861J946K386K482J937
55409A15345J226Q41O12N9p20r92m37R2n19j996k777k046r54j048k089k367j058
55392A01172P06J359P28j11k65J37M21K39j14j47J91N10N74O08Q11R02N13k06
55374A08028p67j015j166j297j218q58m26j34k4j00l95q46j287j579j662j551
55358I3703j320j036o19n0L42J12n86r50m83L81Q65P46L24j01l30j84K31M76L48
55339I1869J94K59J63m27r82p30J94R20J009Q14P09O38M79K92P2k99p92j253j624
$$ plain form
55462 94478 95220 95640 96083 96741 97795 99249 100599 101141 100756 100110 99934 100312 100798 100998 100878 100630 100472 100595
55444 100595 101108 101891 102534 102561 101783 100354 98613 97048 96324 96882 98310 99552 100017 100121 100345 100280 99324 97984
55426 97984 97519 98247 99118 99217 98865 98778 98948 99043 99360 100555 102590 104733 106594 108540 110926 113408 115345
55409 115345 116571 117412 118024 118083 117363 116371 115934 116026 115507 113511 110734 108688 107734 106686 104597 102230 101172
55392 101172 101878 103237 103965 103854 103589 103726 104147 104386 104272 104125 104316 104826 105400 106008 106819 107721 108234 108028
55374 108028 107261 106246 105080 103783 102565 101707 101281 101147 101123 101023 100628 99782 98495 96916 95254 93703
55358 93703 92383 91347 90728 90678 91020 91132 90546 89596 89113 89494 90359 91105 91429 91328 90998 90814 91045 91521 91869
55339 91869 92063 92322 92485 92058 91076 90346 90540 91460 92469 93283 93992 94630 95109 95401 95473 95174 94382 93129 91505
55320I1505j812j533p14P6J32m52q78n99J41P43Q16L52k74n43k70K46P42J250
55302H8928J616J315K99n29m00K02L67K20N32J166J147L20l16j78J01r6l44J0
55284I4360P08R65N80K7k26j31L2m4k91k31L60Q40L89p43j421j139n84m20m21
55265I2610j68J19J36K49R01J682J671O92m24p93l72J93L59K47M12R96J360Q50
55247A00720k19q60p42n18p05q76m41K75L51m55j289j142l8R02O29o22j537j282
55229I2151m38l0j09J5M67P03N68N11N98L31k21j31J006K235K436J725R88O16
55211A03421L66O0k59o31j048j345j446j420j000K86K096L097K510J233N88N81
55195A07089L50j63j99L17N36P1m69o26p95j287j601j268p47o89q38l85P04J516
$$ plain form
55320 91505 89693 88160 87446 87522 87654 87202 86324 85725 85866 86609 87425 87777 87503 86960 86690 86936 87678 88928
55302 88928 90544 91859 92158 91629 91229 91431 91798 92018 92550 93716 94863 95183 94867 94689 94790 94694 94350 94360
55284 94360 95068 96033 96613 96640 96414 96283 96315 96271 95980 95749 96109 96949 97338 96595 95174 94035 93451 93031 92610
55265 92610 92442 92561 92697 92946 93847 95529 97200 97892 97468 96675 96303 96496 96855 97102 97514 98510 99870 100720
55247 100720 100501 99641 98899 98381 97676 96800 96359 96634 96985 96530 95241 94099 94061 94963 95592 94970 93433 92151
55229 92151 91713 91683 91574 91589 92056 92759 93327 93838 94436 94767 94546 94415 95421 97656 100092 101817 102805 103421
55211 103421 103787 103847 103588 102957 101909 100564 99118 97698 96698 96984 99080 102177 104687 105920 106508 107089
55195 107089 107439 107276 107077 107394 107930 108001 107532 106906 106111 104824 103223 101955 101208 100519 99681 99296 100000 101516
55177A01516J367N94k5j63p0m7j52k95l83l08j8L83P08R28J201J615K016K150
55159A11017J944J503R44L80l5k06j65J4K85M55J51p24j647j937j540j021p91
55142A08627p36o32n48o10o81n10p2L70N07K16k95o55o89n43l54k8M06N21K6o51
55122A03669q28n01k30k04o0L76P74Q89Q23O60M48N25J164J819J607P26M13J102
55104A13172J641J031q7n28l38l61o37m38L52J024J211J201J177R82P27P53Q59
55087A21741M54l48o85l17j31p76j545j381m35K07N9l01k88j11k87q59j435j690
55069A11872j573j150n68j13n5l43o08n37j67J74K04r0l95l15K49Q78J045O92
55051A09200J98k27o52q59l01R26J710J202J00k27M21J047J122J213J676J865
$$ plain form
55177 101516 102883 103477 103452 103289 103219 103172 103020 102725 102342 102034 102016 102399 103107 104035 105236 106851 108867 111017
55159 111017 112961 114464 115408 115788 115753 115547 115382 115396 115681 116136 116287 115563 113916 111979 110439 109418 108627
55142 108627 107891 107259 106711 106101 105420 104910 104838 105208 105715 105931 105636 104981 104292 103749 103395 103367 103773 104294 104320 103669
55122 103669 102841 102340 102110 101906 101846 102222 102996 103885 104708 105368 105816 106341 107505 109324 110931 111657 112070 113172
55104 113172 114813 115844 115757 115229 114891 114530 113893 113455 113807 114831 116042 117243 118420 119402 120129 120882 121741
55087 121741 122195 121847 121162 120845 120714 119938 118393 117012 116577 116784 116843 116542 116254 116143 115856 114997 113562 111872
55069 111872 110299 109149 108581 108468 108413 108070 107462 106925 106758 106932 107136 107046 106651 106336 106585 107463 108508 109200
55051 109200 109398 109171 108519 107660 107359 108285 109995 111197 111297 111070 111491 112538 113660 114873 116549 118414
55035A18414J174M6o89q60p77n74k79j00j02l6R4j53q26j140n55L02M76Ql96m89
55015A13538m55j30P35J634J722J076O17P12P78L96l4o1J68L05L38L34J69k05
54997A21637n43n96l18K15P30P26L5n98j94J129K129J986J164M99J03k88n56m21
54979A26839m3J91L08O05J059J286J092O39J49k48l81j23L96Q38R86Q60N52J66
54961A35171j39j70J29N50P22M35o4k16J79N67K72n40r48m92J98L11m6j25L27
54942A36121P72P06K60j26k45j38J44N35Q29Q37O21M88P37J445K420L328M038
54925A52772M800N933P238Q038Q035P803Q110Q835R043Q066O017L296J98k744
54911B35440m714n441n623o074o716o992o862o704o411n511m183l337l422l788
$$ plain form
55035 118414 119588 119634 118945 118085 117308 116734 116455 116355 116253 116217 116311 116158 115332 114192 113637 113939 114415 114423 114027 113538
55015 113538 113083 112953 113688 115322 117044 118120 118737 119449 120227 120623 120589 120528 120696 121001 121339 121673 121842 121637
54997 121637 121094 120498 120180 120395 121125 121851 121886 121288 121094 122223 124352 126338 127502 128001 128104 127816 127260 126839
54979 126839 126796 126987 127295 127900 128959 130245 131337 131976 132125 131877 131496 131373 131769 132607 133593 134453 135005 135171
54961 135171 135032 134862 134991 135541 136263 136698 136634 136418 136597 137164 137436 136896 135948 135456 135654 135965 135919 135794 136121
54942 136121 136893 137599 137859 137733 137488 137350 137494 138029 138858 139695 140316 140804 141541 142986 145406 148734 152772
54925 152772 157572 163505 170743 178781 186816 194619 202729 211564 220607 228673 234690 237986 238184 235440
54911 235440 230726 225285 219662 213588 206872 199880 193018 186314 179903 174392 170209 166872 163450 159662
54897A59662l569k720j833j351j284j351j138m61L13O44O06Q31J540K274K761
54882A54924L429M619N970O989P746Q423Q742Q377P515O465N103L239J161p46
54868B31956k531m273n601o215o527p018p400p111o359n765n282m358l161k640
54854A57715l271m397m966m456l022j381m88o96j277j236n15J36K28j89j012j954
54838A29219k185j175K09N05k76o28J75J071R86M32M39Q23N76m46j295j211m30
54821A26789K72L48j26n52l63L18Q55R28Q19P61N92L22L74Q58J173Q82M60N64
54803A35274R43P45k38j256j473p63K50O63j0j232j742q53O89J492J004j11q90
54786A32492r05k69O89J582K090K092J714J310J304J798K349K453K274K524L469
$$ plain form
54897 159662 156093 153373 151540 150189 148905 147554 146416 145955 146268 146912 147518 148349 149889 152163 154924
54882 154924 158353 162972 168942 175931 183677 192100 200842 209219 216734 223199 228302 231541 232702 231956
54868 231956 229425 225152 219551 213336 206809 199791 192391 185280 178921 173156 167874 163516 160355 157715
54854 157715 154444 150047 145081 140625 137603 136222 135734 135038 133761 132525 132010 132146 132374 132185 131173 129219
54838 129219 127034 125859 126068 126573 126297 125669 125844 126915 127901 128333 128772 129595 130171 129725 128430 127219 126789
54821 126789 127061 127409 127283 126731 126368 126686 127541 128469 129288 130049 130641 130963 131337 132195 133368 134250 134710 135274
54803 135274 136217 136962 136724 135468 133995 133232 133482 134145 134135 132903 131161 130308 130997 132489 133493 133382 132492
54786 132492 131587 131318 132007 133589 135679 137771 139485 140795 142099 143897 146246 148699 150973 153497 156966
54771A56966M595N456O287P439Q635R368R645R744R452Q258O196L954K015K09
54757B48219j772l824n617o991p917q299q062p377o606n986n469m912m336l888
54743A67163l583l261k841k391j885j174m37j62l68j92J055K716L423K871K194
54728A63128K447L527M796N972O989P588P618P330O985O518N771M610K664l38
54714B35605l648n732o034n830o557p910q404p416n746m330l347k628k234k340
54700A63449k865l350l147j974n15j6r20k239k720k170j222l04M11N90J16l44
54684A42780k6P91J167Q87N61M52J38m86q12m11L46Q57R34O33M6m88n53k91l68
54665A46157j031j692j719j197n21J72Q35J113O90j38o81n66m2M19N49L91J02
$$ plain form
54771 156966 161561 167017 173304 180743 189378 198746 208391 218135 227587 235845 242041 245995 248010 248219
54757 248219 246447 242623 237006 230015 222098 213799 205737 198360 191754 185768 180299 175387 171051 167163
54743 167163 163580 160319 157478 155087 153202 152028 151591 151429 151061 150869 151924 154640 158063 160934 163128
54728 163128 165575 169102 173898 179870 186859 194447 202065 209395 216380 222898 228669 233279 235943 235605
54714 235605 231957 226225 220191 214361 207804 199894 191490 184074 178328 173998 170651 168023 165789 163449
54700 163449 160584 157234 154087 152113 151598 151582 150662 148423 145703 143533 142311 142007 142418 143008 143124 142780
54684 142780 142754 143545 144712 145599 146160 146612 146750 146264 145452 145041 145387 146244 147178 147811 147857 147369 146816 146525 146157
54665 146157 145126 143434 141715 140518 139997 140169 141004 142117 142807 142669 141988 141422 141380 141799 142348 142739 142841
54648A42841j78l02q5M77R37P16j39r05j080r29p56k38Q35J693J342K8r95j102
54630A42160q28p21o84o08p14q98n82L16J021R64M92J16k13n29m08K42O32J63
54612A39921n38m85K42Q07R59J076J135P39J06N9P90J505J568J232R60P15L49
54595A51140Q2J44K94K31O9L1p8n37j104j202o76M7N42P30O58L71J06K36Q00J326
54575A53210J401J158R49P22K30k75r9R04J863J800Q13j10l00J1L11M66N78N75
54557A64207L37j4k41l51n33p99r09o77k04L07P55J187J623J939J919J483Q45
54540A70874M05L82N95O53M29K48N78J466K388K733K421J880J438R61K16o25j068
54523A85974p77J48J280K015J842P69n10j170j007n03k56n05j129j779j998j560
$$ plain form
54648 142841 142663 142361 142276 142753 143690 144406 144267 143362 142282 141353 140597 140359 141194 142887 144229 144257 143262 142160
54630 142160 141332 140611 139927 139319 138605 137707 137125 137441 138462 139426 139918 140034 139821 139292 138884 139126 139758 139921
54612 139921 139383 138898 139140 139947 140906 141982 143117 143856 143962 144021 144811 146316 147884 149116 150076 150791 151140
54595 151140 151222 151366 151660 151891 151960 151991 151913 151376 150272 149070 148394 148441 148983 149713 150371 150742 150848 151084 151884 153210
54575 153210 154611 155769 156718 157440 157670 157395 157296 158200 160063 161863 162676 162566 162266 162277 162588 163054 163632 164207
54557 164207 164544 164530 164289 163938 163405 162606 161697 161020 160816 161123 161878 163065 164688 166627 168546 170029 170874
54540 170874 171279 171661 172256 172909 173338 173586 174164 175630 178018 180751 183172 185052 186490 187451 187667 187042 185974
54523 185974 185197 185345 186625 188640 190482 191251 190741 189571 188564 188061 187805 187300 186171 184392 182394 180834
54507A80834p26qL32L28M1m44p94p21m26l32k75L74J609K400J885M90o35j015
54489A82917j083j205j126m84N60J478J916J950J854J839J888J910J921K027K242
54474A98604K438K545K595K552K321K006J883J986J956J509Q17K20j88m33l81
54459B20430L5M72M75J07j05J52O43R40Q23K80n30j274j649j737j864k057j949
54442B13192j416j019j336k087k329j648p29n10j005j386j060l13K43L94L31J89
54426A99511m9l10m87o43q47r25p01m66o73j143j105k18Q98J450J413J280J263
54409A98248J192R89P57N04J78j14j99q7J49N82J161J487J277Q97Q85J106R77
54392B09989M61J80L74N56M14L38O35Q05K85n95j085j121j217j460j385q85m61
$$ plain form
54507 180834 180108 180100 180432 180760 180801 180357 179563 178842 178416 178084 177809 178183 179792 182192 184077 184567 183932 182917
54489 182917 181834 180629 179503 179019 179579 181057 182973 184923 186777 188616 190504 192414 194335 196362 198604
54474 198604 201042 203587 206182 208734 211055 213061 214944 216930 218886 220395 221212 221432 221244 220811 220430
54459 220430 220465 220937 221412 221519 221414 221566 222209 223149 223972 224252 223722 222448 220799 219062 217198 215141 213192
54442 213192 211776 210757 209421 207334 205005 203357 202628 202118 201113 199727 198667 198354 198597 198991 199322 199511
54426 199511 199462 199152 198665 198022 197175 196250 195549 195083 194410 193267 192162 191944 192842 194292 195705 196985 198248
54409 198248 199440 200429 201186 201690 201868 201754 201555 201468 201617 202199 203360 204847 206124 207021 207906 209012 209989
54392 209989 210450 210630 211004 211560 211974 212312 212947 213752 214037 213442 212357 211236 210019 208559 207174 206289 205828
54375B05828l44o1P30J528J599R23J11l77m56j07N77J118R37J00o28o61j85K34
54357B10866L82M10L74J02n02j255j885k215k196j865j343q26n12m73o33q24r33
54340A96672r85j037j095j169j337j573j650j373q97n52m32m29n98j028j389j122
54324A80006l51L1m52j102j034m31j14j96k4N78J001R42R17J296J540J020J08
54307A83735k39K47Q75R65N78K30K43M83O34N19K38n9l50o11o20j76M93Q66O97
54288A88748K13k40m73l60J03N27M51l0l35l21n25j236j929j994j598j258j060
54271A78683q37p07q36r19n96m9L28O51J190J583J211K39n35p85q26p01r3O83
54253A77684O63l66j300j170l77R5P0N6K27L56M62P03P52Q0j149k057k044j289
$$ plain form
54375 205828 205484 205423 206153 207681 209280 210203 210314 209937 209481 209374 209951 211069 212006 212106 211478 210817 210632 210866
54357 210866 211248 211658 212032 212134 211632 210377 208492 206277 204081 202216 200873 200047 199535 199062 198429 197605 196672
54340 196672 195687 194650 193555 192386 191049 189476 187826 186453 185556 185004 184572 184143 183545 182517 181128 180006
54324 180006 179655 179686 179234 178132 177098 176667 176553 176357 176333 176911 177912 178854 179771 181067 182607 183627 183735
54307 183735 183496 183743 184618 185583 186161 186391 186634 187117 187751 188270 188508 188449 188099 187488 186868 186692 187185 188051 188748
54288 188748 188961 188721 188248 187888 187991 188518 188969 188939 188604 188283 187758 186522 184593 182599 181001 179743 178683
54271 178683 177846 177139 176303 175384 174788 174739 175067 175718 176908 178491 179702 179941 179406 178621 177795 177094 177001 177684
54253 177684 178347 177981 176681 175511 175134 175229 175299 175355 175582 175938 176400 177103 177855 177935 176786 174729 172685 171396
54235A71396k77O36J074P11k63j063j097o09l28o05j073j117n46J81L68j57q11
54218A66420r10m68n7pr3j29l58j017j806k151j809j006j21M57L91k48p55l58
54200A55975Q66J999K285J824J144M83j98p82j044j053j129j338j334q53q5N39
54184A57299P60N65P3m48o23k44M33R06R05O30M31M06L42M9l71o58p34p76q46
54165A58099o39J13J021J262N49m13p70n57m57o68o09J06R53J151P86O88J255
54148A61870J972K241K238K422K610K100Q48k18l53Oq2o97j041p30l38m33o60
54131A71755l00N87J161Q49n8q89j301j340j117o51m3M14M50J68N6M58J083J276
54113A72558P98O1m13n06l40j4L40M81L72K83L28J88l51q58p24o7L75J57m70j006
$$ plain form
54235 171396 171119 171755 172829 173540 173277 172214 171117 170508 170180 169575 168502 167385 166839 167020 167388 167231 166420
54218 166420 165510 165042 164985 164978 164885 164756 164398 163381 161575 159424 157615 156609 156488 156945 157336 157088 156333 155975
54200 155975 156841 158840 161125 162949 164093 164576 164378 163596 162552 161499 160370 159032 157698 156845 156760 157299
54184 157299 158059 158624 158697 158249 157626 157382 157815 158721 159626 160256 160687 161093 161435 161484 161113 160455 159721 158945 158099
54165 158099 157460 157573 158594 159856 160405 159992 159222 158665 158208 157540 156931 157037 157990 159141 159927 160615 161870
54148 161870 163842 166083 168321 170743 173353 175453 176301 176083 175730 175736 175654 174957 173916 173186 172848 172415 171755
54131 171755 171455 172042 173203 174052 173994 173105 171804 170464 169347 168696 168653 169067 169517 169685 169741 170199 171282 172558
54113 172558 173356 173417 173004 172498 172158 172144 172484 172965 173337 173620 173948 174136 173785 172927 172203 172136 172511 172668 172198 171192
54093A71192j113o16L61J157R92j49j347j673j010P5R50J246R44L69k7j06j11
54076A71134k34l76l93k88j21R9L14M77P15J142J485J335Q01M82N73N40m2p52
54058A76891q42k10N82R98R68P64P17R11J004O92L61P62J771K217J456M45M74
54041A89961J379J993J983K115K754L356L655M201N187N792N385M611M476M824
54027B41672M677L802L025K997L346L254K432J350P42R35J515J687J145L68p3
54012B72874k71p08j519k454l323l965m024l338k523k410k897l066k603k300k801
53997B34672l522l452k499j423p28l57l11q07j751k517k534j786p49m5j11q18
53981B11262j458j460j078j004j333j454r83l00J12K74L53K00l28q85r60n29L7
$$ plain form
54093 171192 170079 169463 169824 170981 171973 171824 170477 168804 167794 167869 168819 170065 171009 171378 171351 171245 171134
54076 171134 170900 170524 170131 169843 169722 169821 170135 170612 171327 172469 173954 175289 176090 176572 177145 177685 177643 176891
54058 176891 176049 175839 176421 177419 178387 179151 179868 180779 181783 182475 182836 183598 185369 187586 189042 189487 189961
54041 189961 191340 193333 195316 197431 200185 203541 207196 211397 216584 222376 227761 232372 236848 241672
54027 241672 246349 250151 253176 256173 259519 262773 265205 266555 267297 268232 269747 271434 272579 272947 272874
54012 272874 272603 271895 270376 267922 264599 260634 256610 253272 250749 248339 245442 242376 239773 237473 234672
53997 234672 231150 227698 225199 223776 223048 222691 222380 221573 219822 217305 214771 212985 212236 212191 212080 211262
53981 211262 209804 208344 207266 206262 204929 203475 202492 202192 202304 202578 202931 203131 202803 201918 200958 200429 200466
53964B00466N31R62J194J055P79R01J566K287K524K256J891J825K180K754L146
53949B26317L099K803K676K849L085L306L906N234P001Q466R230R640J0380J1816
53935C09808J3838J6122J8388K0362K1554K1211J8598J3518O695k95n813r204
53923D44782j1101j2584j3958j4584j3782j1633q792n958l677k224j326k98J103
53910C45968K229K404K032K203L232M199M091K895J351J57m42n98p51j273k029
53895C65668k576k832l196l792m190m127m060m465n029n079m641m420m864n645
53881C06752o150o069n475m748m313m258m157l640k932k581k706k973l127l070
53867B50553k558j410j41K72m98j753k667l020k868k138j045l66o60j489k052
$$ plain form
53964 200466 200997 201959 203153 204208 204987 205888 207454 209741 212265 214521 216412 218237 220417 223171 226317
53949 226317 229416 232219 234895 237744 240829 244135 248041 253275 260276 268742 277972 287612 297992 309808
53935 309808 323646 339768 358156 378518 400072 421283 439881 453399 460094 459799 453986 444782
53923 444782 433681 421097 407139 392555 378773 367140 358348 352390 348713 346489 345163 344865 345968
53910 345968 348197 350601 352633 354836 358068 362267 366358 369253 370604 370761 370319 369721 368970 367697 365668
53895 365668 363092 360260 357064 353272 349082 344955 340895 336430 331401 326322 321681 317261 312397 306752
53881 306752 300602 294533 289058 284310 279997 275739 271582 267942 265010 262429 259723 256750 253623 250553
53867 250553 247995 246585 246444 246716 246218 244465 241798 238778 235910 233772 232727 232361 231701 230212 228160
53852B28160k226k351k252j373O7R66P01k0j94K21N60N92O94J019J181Q36J50
53835B26731n05r72j259j338j246j131j004o74j09L06J62l60o36l74L5O6k59m88
53817B16945l94k17j45L3N48J073J036N17M23J406K866L502K851J820J596K374
53801B36234L422M042M155M048L972M009M166M370M507M464M182L735L351L208
53787B91865L134K730J909J111Q18R64J095R18M82p7o66j186j601k054k652l207
53771B93583l401l176k740k266j871j710j778j732j288o67k26J88J026K254L500
53756B79696M930P166J0066J2410J3194J2579J1061Q440M390m59m903q392j1091
53743C39087j2923j3391j2425j0736r119p892p007o187m967l200j566r62j312
$$ plain form
53852 228160 225934 223583 221331 219958 220025 220991 221692 221672 221478 221699 222259 222851 223545 224564 225745 226581 226731
53835 226731 226226 225254 223995 222657 221411 220280 219276 218602 218493 218799 218961 218601 217965 217591 217626 217692 217433 216945
53817 216945 216551 216334 216189 216222 216770 217843 218879 219396 219819 221225 224091 227593 230444 232264 233860 236234
53801 236234 239656 243698 247853 251901 255873 259882 264048 268418 272925 277389 281571 285306 288657 291865
53787 291865 294999 297729 299638 300749 301567 302531 303626 304544 305026 304949 304283 303097 301496 299442 296790 293583
53771 293583 290182 287006 284266 282000 280129 278419 276641 274909 273621 272954 272728 272916 273942 276196 279696
53756 279696 284626 291792 301858 314268 327462 340041 351102 359542 363932 363473 358570 350178 339087
53743 339087 326164 312773 300348 289612 280493 272601 265594 259407 254440 251240 249674 248712 247400
53730B47400j605j241p00n55n74k55K76M89K39j63m20l80M4O87J100J127J231
53713B46700J761K207J786O64j07J09Q72J438J632J740J964K298K609K682K485
53698B70840K502L287M466M786L700K385K447L805M754M159K716J772J583J432
53684C14634R16M14L37N07M40j77j246k254k528j795n37M48Q21P76N21J30j03
53667C11304J71P78J037P01L57N51R60Q89K99k10k32J24O52J343K192L181M307
53650C28404N310N495M375K465R27K27k55j154k219k913l267l654l990l844l244
53635C22663k767k714k728k409j937j769j975k115j693n66J002K438L174L043
53621C11647K431J892J603J399J271J489K151K834L042K821K697L024L647M158
$$ plain form
53730 247400 245795 244554 243854 243299 242725 242470 242746 243235 243474 243311 242891 242511 242555 243242 244342 245469 246700
53713 246700 248461 250668 252454 253118 253011 253120 253992 255430 257062 258802 260766 263064 265673 268355 270840
53698 270840 273342 276629 281095 285881 289581 291966 294413 298218 302972 307131 309847 311619 313202 314634
53684 314634 315550 315964 316301 316808 317248 317071 315825 313571 311043 309248 308711 309159 309980 310756 311277 311407 311304
53667 311304 311475 312253 313290 313991 314348 314899 315859 316748 317047 316837 316605 316729 317381 318724 320916 324097 328404
53650 328404 333714 339209 343584 346049 346976 347203 346948 345794 343575 340662 337395 333741 329751 325907 322663
53635 322663 319896 317182 314454 312045 310108 308339 306364 304249 302556 301990 302992 305430 308604 311647
53621 311647 314078 315970 317573 318972 320243 321732 323883 326717 329759 332580 335277 338301 341948 346106
53607C46106M297M086L820L919M444M800M227K767J407J070J731K655L253L371
53593C91953L049K325J245j45j671k833l016k212j242r09j152j379j341j251j259
53578C80162j374j733k400k933k779k075j500j270r80n21m34r51j399j034n9P34
53562C59454R87R29P72N06K08R7K75O38J006J105P10N5j40N38J534J890J438R69
53544C72971J234K187L253L941M054L702L345L556M473N613O385O728P000P408
53530D35850P760P899Q097Q832J0239J1936J3401J4356J4783J4850J4938J5474
53518E78415J6436J7240J7430J7437J8211K0143K2683K5063K6949K8270K8974
53507H17251K9200K9410K9946L0659L1099L0949L0146K8952K8120K8436K9843
$$ plain form
53607 346106 350403 354489 358309 362228 366672 371472 375699 378466 379873 380943 382674 385329 388582 391953
53593 391953 395002 397327 398572 398427 396756 393923 390907 388695 387453 386544 385392 384013 382672 381421 380162
53578 380162 378788 377055 374655 371722 368943 366868 365368 364098 363118 362597 362163 361212 359813 358779 358720 359454
53562 359454 360441 361370 362142 362648 362856 362953 363228 363866 364872 365977 366687 366742 366602 367140 368674 370564 372002 372971
53544 372971 374205 376392 379645 383586 387640 391342 394687 398243 402716 408329 414714 421442 428442 435850
53530 435850 443610 451509 459606 468438 478677 490613 504014 518370 533153 548003 562941 578415
53518 578415 594851 612091 629521 646958 665169 685312 707995 733058 760007 788277 817251
53507 817251 846451 875861 905807 936466 967565 998514 1028660 1057612 1085732 1114168 1144011
53496A144011L1301L1971L2104L2376L2728L2436L1160K9209K6960K4695K2892
53485A471843K1943K1457K0516J8908J7453J6786J6471J5757J4775J4292J4453
53474A664654J4438J3488J1773J0031Q592P044M784J729j617m700p376r882j2391
53461A700567j4792j6840j8465j9856k1322k3068k5029k6833k8024k8476k8559
53450A449303k8790k9166k9065k8027k6585k5862k6171k6499k5774k4242k2903
53439A156219k1944k0583j8526j6462j4919j3514j1896j0490r524q107n320j702
53427A003232J382L575N600P795R764J1502J3653J6305J8659K0317K1989K4313
53415A158086K6814K8642K9686L0380L0958L1580L2672L4483L6635L8634M0531
$$ plain form
53496 1144011 1175312 1207283 1239387 1271763 1304491 1336927 1368087 1397296 1424256 1448951 1471843
53485 1471843 1493786 1515243 1535759 1554667 1572120 1588906 1605377 1621134 1635909 1650201 1664654
53474 1664654 1679092 1692580 1704353 1714384 1722976 1730020 1734804 1736533 1734916 1730216 1722840 1712958 1700567
53461 1700567 1685775 1668935 1650470 1630614 1609292 1586224 1561195 1534362 1506338 1477862 1449303
53450 1449303 1420513 1391347 1362282 1334255 1307670 1281808 1255637 1229138 1203364 1179122 1156219
53439 1156219 1134275 1113692 1095166 1078704 1063785 1050271 1038375 1027885 1018361 1010254 1004934 1003232
53427 1003232 1004614 1008189 1013789 1021584 1031348 1042850 1056503 1072808 1091467 1111784 1133773 1158086
53415 1158086 1184900 1213542 1243228 1273608 1304566 1336146 1368818 1403301 1439936 1478570 1519101
53404A519101M2648M5006M7518N0287N3243N5914N8127O0404O3059O5488O7079
53393B127874O8360P0173P2104P2920P2454P1853P1748P1409P0130O8306O6415
53382B903746O3898O0042N5394N1260M8020M4827M0983L6755L2737K8986K5184
53371C391832K1185J7026J2634P776K247m071j1239j9243k7922l6933m5786n3906
53359C253600o0896o6734p1609p5501p8066p9057p8756p7835p6843p5932p4978
53348B437393p3767p2138p0216o8543o7698o7590o7401o6397o4631o2624o0570
53337A695818n8273n5615n2702m9507m5864m1979l8454l5616l3116l0389k7268
53326A227035k3961k0761j8013j6039j4720j3382j1438r082p003n540m422l274
$$ plain form
53404 1519101 1561749 1606755 1654273 1704560 1757803 1813717 1871844 1932248 1995307 2060795 2127874
53393 2127874 2196234 2266407 2338511 2411431 2483885 2555738 2627486 2698895 2769025 2837331 2903746
53382 2903746 2967644 3027686 3083080 3134340 3182360 3227187 3268170 3304925 3337662 3366648 3391832
53371 3391832 3413017 3430043 3442677 3450453 3452700 3448629 3437390 3418147 3390225 3353292 3307506 3253600
53359 3253600 3192704 3125970 3054361 2978860 2900794 2821737 2742981 2665146 2588303 2512371 2437393
53348 2437393 2363626 2291488 2221272 2152729 2085031 2017441 1950040 1883643 1819012 1756388 1695818
53337 1695818 1637545 1581930 1529228 1479721 1433857 1391878 1353424 1317808 1284692 1254303 1227035
53326 1227035 1203074 1182313 1164300 1148261 1133541 1120159 1108721 1099639 1092636 1087096 1082674 1079400
53314A079400k036r28j19N28J529L319N648P655Q854R742J1032J2673J4136J5468
53300A166901J7374K0201K3412K6246K8409K9968L1038L1847L2765L3928L5027
53289A477116L5708L5961L5941L5596L4716L3244L1304K9000K6369K3521K0784
53278A819260J8604J7153J5974J4192J1318P786M456J700p83l303n845q377j1154
53265A880981j4422j8086k1811k5296k8417l1257l4053l6928l9715m2181m4281
53254A544534m5919m6627m6048m4630m3332m2504m1575l9961l7785l5535l3632
53243A086986l2519l2585l3572l4493l4579l3939l3006l1847l0426k9040k7901
53232G33079k6639k4798k2568k0524j8900j7649j6843j6380j5572j3807j1597
$$ plain form
53314 1079400 1077364 1076436 1076317 1076845 1078374 1081693 1087341 1094996 1103850 1113592 1124624 1137297 1151433 1166901
53300 1166901 1184275 1204476 1227888 1254134 1282543 1312511 1343549 1375396 1408161 1442089 1477116
53289 1477116 1512824 1548785 1584726 1620322 1655038 1688282 1719586 1748586 1774955 1798476 1819260
53278 1819260 1837864 1855017 1870991 1885183 1896501 1904287 1908743 1910443 1909660 1906357 1900512 1892135 1880981
53265 1880981 1866559 1848473 1826662 1801366 1772949 1741692 1707639 1670711 1630996 1588815 1544534
53254 1544534 1498615 1451988 1405940 1361310 1317978 1275474 1233899 1193938 1156153 1120618 1086986
53243 1086986 1054467 1021882 988310 953817 919238 885299 852293 820446 790020 760980 733079
53232 733079 706440 681642 659074 638550 619650 602001 585158 568778 553206 539399 527802
53221E27802j0172r989j0293j0244r838r513r353r121q701q296q258q713r222
53208D06089q982p757o390n823n810n320m212l555m043m946n183m767m499m666
53194C30136m787m450l794l192k936l144l646l976l792l225k593j948j266p94
53180B86593q38j219j418j208q28n47m34n74j091j860k538k888k884k379j246
53165B64641J70J101J208J002J054J163P70Jl40J10P18P10J55k43j01K97N47N58
53147B73521M56L43L18M18M29K4p19j115n50P17J706J684Q86K08L12J005J489
53130B81132J210M73O0K62N78M80P5k52m80p41q08m24m2m73j704k740k822k222
53112B71562j517p82J9M02r4j076j676j732j847k290k521j996r66j01K81L08J46
$$ plain form
53221 527802 517630 507641 497348 487104 477266 467753 458400 449279 440578 432282 424024 415311 406089
53208 406089 397107 389350 382960 377137 371327 366007 361795 358240 354197 349251 344068 339301 334802 330136
53194 330136 325349 320899 317105 313913 310977 307833 304187 300211 296419 293194 290601 288653 287387 286593
53180 286593 285755 284536 283118 281910 281082 280535 280101 279527 278436 276576 274038 271150 268266 265887 264641
53165 264641 264811 265912 267120 268122 269176 270339 271109 271110 270770 270880 271598 272308 272463 272220 272119 272416 272963 273521
53147 273521 273977 274320 274638 275056 275485 275509 274790 273675 273125 273842 275548 277232 278118 278326 278638 279643 281132
53130 281132 282342 282815 282875 283137 283715 284195 284270 284018 283538 282797 281989 281565 281523 281050 279346 276606 273784 271562
53112 271562 270045 269263 269282 269684 269590 268514 266838 265106 263259 260969 258448 256452 255486 255385 255666 255974 256120
53095B56120j59n35q49j028j094j052q79n85k94k60o92j426j876j510m78N24J031
53078B44958J214J319J143M23m54o66n7N02J24r93j826j800j318j026r98q87n73
53061B39085l18k96l60l19k60m14p66r48o31J5L86J91m9M38J601K474K435J974
53043B44238J824J762J062j59r05p43m41p95j556j933j705j212o80j20L41N51
53027B39529O03O03L59k79r84j337j416j541j642j452j081p80k93P29J781J884
53011B34683J068N05Q09J095M33o07p44J35Q73O99L6m09n85q05j065j054n91J93
52993B34669R32J202Q27J02m99q16r44p97j05J023J979K269J957J394Q39M96M90
52976B45018N43J57n34n91N16J969K539K177J844J978J975J383O42K88K54L16
$$ plain form
53095 256120 255961 255426 254577 253549 252455 251403 250524 249939 249645 249385 248693 247267 245391 243881 243403 243927 244958
53078 244958 246172 247491 248634 249057 248603 247937 247880 248382 248506 247513 245687 243887 242569 241543 240545 239658 239085
53061 239085 238767 238471 238111 237792 237532 237118 236352 235404 234773 234788 235174 235365 235316 235754 237355 239829 242264 244238
53043 244238 246062 247824 248886 248727 247822 247079 246638 245843 244287 242354 240649 239437 238757 238637 238978 239529
53027 239529 240132 240735 241094 240815 239831 238494 237078 235537 233895 232443 231362 230582 230289 231018 232799 234683
53011 234683 235751 236256 237065 238160 238593 237986 237242 237377 238250 238949 238985 238576 237991 237186 236121 235067 234476 234669
52993 234669 235601 236803 237630 237732 237233 236417 235473 234676 234571 235594 237573 239842 241799 243193 244032 244528 245018
52976 245018 245561 245718 245184 244593 245109 247078 249617 251794 253638 255616 257591 258974 259616 259904 260158 260474
52960B60474N97J019R32k7j195j731j811k178k854l080k521j626q57k89p9n43
52944B44231j533k346k455j946j085m2Q30J064O34J9m45q08j070j086j006j147
52928B31809j317j003l84k88p89q56J16J305J635J170N76J1n90q33m35M3J4r9
52910B30085L63R41P15q1l65M6L00R9J17O43J014P89M12L04K26j7r9J49M01O02
52890B36644J204K180K606J864N36m45r29j271j524j564j500j450j277r98r70
52875B33106j231j252q15m92o79q13k93M11M33q6k12L74J024J155Q70N30K86J50
52857B32466J46L10P21J352J807J596Q89M90O23M37o80j959k287j882j860k452
52841B29717k806k550k327k579k716k047p53M85J258J477J148N18N0l5R9L45Q03
$$ plain form
52960 260474 261071 262090 263022 262995 261800 260069 258258 256080 253226 250146 247625 245999 245142 244853 244774 244231
52944 244231 242698 240352 237897 235951 234866 234824 235654 236718 237352 237371 236926 236118 235048 233962 232956 231809
52928 231809 230492 229489 229105 228817 228028 227172 227288 228593 230228 231398 231974 231985 231395 230562 230127 230170 230184 230085
52910 230085 230448 231389 232104 232023 231658 231704 232004 232103 232220 232863 233877 234666 235078 235382 235608 235591 235492 235641 236042 236644
52890 236644 237848 240028 242634 244498 245034 244589 243660 242389 240865 239301 237801 236351 235074 234076 233106
52875 233106 231875 230623 229808 229316 228637 227824 227531 227942 228375 228289 228077 228451 229475 230630 231500 232030 232316 232466
52857 232466 232612 232922 233643 234995 236802 238398 239287 239777 240400 240837 240157 238198 235911 234029 232169 229717
52841 229717 226911 224361 222034 219455 216739 214692 213939 214424 215682 217159 218307 218825 218875 218840 218939 219284 220087
52824B20087J327J352N59o26j459j580j106l45L93R13J308J862K679L569M316
52809B33249M784M751L948K370L48j729l497m546m665m180l658l285k885k535
52795B18470k596k993l065k404j392o48l68m51q79j473j678j029K29J383J935
52780B03041J906J609J421J577J900J924J474Q73M52O8m56q37o68j22L02N25Q63
52763B15852J244J149N28J45N61J266J368P92J80k43r03j883k453k045j101m25
52747B14032j51N6K09J25J81R31J961K106J124K05K77P08M82n0K38J339J971J436
52729B27180N40L49Q82J459J708J703J450P62m29j881l104l587l187k316j571
52714B19958j140q24n00k84k16j80j83l37n63o37n51n12n45n00l55k03N9N30Q91
$$ plain form
52824 220087 221414 222766 223325 222699 221240 219660 218554 218209 218602 219515 220823 222685 225364 228933 233249
52809 233249 238033 242784 246732 249102 249450 247721 244224 239678 235013 230833 227175 223890 221005 218470
52795 218470 215874 212881 209816 207412 206020 205372 205004 204553 203674 202201 200523 199494 199723 201106 203041
52780 203041 204947 206556 207977 209554 211454 213378 214852 215725 216177 216245 215789 214952 214284 214162 214464 214989 215852
52763 215852 217096 218245 218773 218918 219479 220745 222113 222905 223085 222842 221939 220056 217603 215558 214457 214032
52747 214032 213881 213937 214146 214271 214452 215383 217344 219450 220574 220779 221056 221764 222246 222196 222434 223773 225744 227180
52729 227180 227720 228069 228951 230410 232118 233821 235271 236033 235604 233723 230619 227032 223845 221529 219958
52714 219958 218818 217994 217494 217210 216994 216814 216631 216294 215731 215094 214543 214031 213486 212986 212631 212428 212487 213017 213908
52695B13908O95J04j88J17O60J098J454J640J301M79j71j58L23Q67J345J588J206
52678B26268K37n20l77L46P91O64L48K16K96M62N71M78K30O6N0n2l03l18J86R18
52658B30557J433J722K012K276K356K329K343K333K182J957J611Q19m94j767k416
52643B49253k553k611k606k318j981k036k296k106j318n12q7K78J118K465L866
52628B36556M734M626L526J976O60k61j130k129k909l013k375j387o00l93p06
52613B37175j045r68n52k61l67o89q35n56J4L90J71l85n20P0P88R76P98P88Q95
52594B35887P28N05Q93J790K117J206k09q57m03M03P51N07M8k37j90J39O01J001
52576B44680J143R54O44N22N75M12j56p43q99p71q64j241j440j168o97m69o22
$$ plain form
52695 213908 214603 214707 214519 214636 215296 216394 217848 219488 220789 221268 221097 220939 221262 222129 223474 225062 226268
52678 226268 226505 225985 225608 225954 226745 227409 227757 227973 228269 228731 229302 229780 230010 230076 230126 230074 229771 229453 229639 230557
52658 230557 231990 233712 235724 238000 240356 242685 245028 247361 249543 251500 253111 253930 253436 251669 249253
52643 249253 246700 244089 241483 239165 237184 235148 232852 230746 229428 228916 228829 229107 230225 232690 236556
52628 236556 241290 245916 249442 251418 252078 251817 250687 248558 245649 242636 240261 238874 238274 237881 237175
52613 237175 236130 235162 234610 234349 233982 233293 232458 231902 231916 232306 232477 232092 231572 231642 232430 233406 234204 234992 235887
52594 235887 236615 237120 238013 239803 241920 243126 242917 242060 241657 242060 242811 243318 243366 243129 242939 243078 243679 244680
52576 244680 245823 246777 247421 247943 248518 248930 248774 248031 247132 246361 245497 244256 242816 241648 240951 240482 239860
52559B39860r27r84n25K35O82M82N0j12j65n82j180j288q33m84n42m51K23R86
52541B34445J124P14L65L08L27L50N46R05J150J151R70O09no76j005q97p27p70
52523B38884p18j12Q65J409J119N93O20J015Q79Q5l00N83K072K781K317J479R65
52506B54536O94M62M22N64L96l95j418k079k265k204j958j545j260j390j660j406
52490B39494l67R28J708J685J232R23R93J232J304J133Q97P86Q62J120J505J880
52474B57315K017J682Q11k49p40j38J087J812J544R48P34O89L31j4K73Q79Q48
52457B69829P4n42n07l53n83r11r53q74r45j107j412k128k957k974j903p86o24
52440B50344j040j055n95l20l77l00J7J74mk53m15n25m59p8L66M72K41j52q48
$$ plain form
52559 239860 238933 237949 237424 237659 238341 238823 238873 238761 238596 238014 236834 235546 234713 234229 233687 233236 233459 234445
52541 234445 235569 236283 236648 236956 237283 237633 238179 239084 240234 241385 242355 242964 242959 242283 241278 240381 239654 238884
52523 238884 238166 238054 238919 240328 241447 242040 242660 243675 244554 244639 244339 244922 246994 249775 252092 253571 254536
52506 254536 255230 255692 256114 256678 257074 256679 255261 253182 250917 248713 246755 245210 243950 242560 240900 239494
52490 239494 239127 240055 241763 243448 244680 245603 246596 247828 249132 250265 251162 251948 252810 253930 255435 257315
52474 257315 259332 261014 261825 261576 260836 260698 261785 263597 265141 266089 266823 267512 267843 267829 268102 268981 269829
52457 269829 269903 269361 268854 268501 267918 267007 266054 265180 264235 263128 261716 259588 256631 253657 251754 250968 250344
52440 250344 249304 248249 247654 247334 246957 246657 246674 246848 246844 246591 246176 245651 245192 245114 245480 245952 246193 246041 245193
52421B45193j860k383j494M41J948K211J866J790K005K133K216K457K740K983
52407B62246L577M830O256P027P012O785O681O263M894K494l60k875m555n402
52393C04873n725n692n155l986k494j266o18l73k27j25j54k24j20J66L97N30R00
52376B80707J694K437K469J919J658K083K543K352J833J737J957J682P29j97p00
52361C04903j268k167k616j832l83M20K79J41N92J057Q92N53Q49J574J693Q32
52345C05519k15n94l42N8N50J340K249K792K861K878L144L445L450L250L264L703
52329C37352M335M789N073N659O962Q662R824R852R153Q581Q426Q293P894P431
52315D42286P147O881O366N684N233N456O586Q404J0118J0850J0511R888R743
$$ plain form
52421 245193 243333 240950 239456 239897 241845 244056 245922 247712 249717 251850 254066 256523 259263 262246
52407 262246 265823 270653 276909 283936 290948 297733 304414 310677 315571 318065 317705 314830 310275 304873
52393 304873 299148 293456 288301 284315 281821 280555 279937 279564 279337 279212 279058 278834 278714 278880 279277 279807 280707
52376 280707 282401 284838 287307 289226 290884 292967 295510 297862 299695 301432 303389 305071 305800 305603 304903
52361 304903 303635 301468 298852 297020 296637 297057 297336 297477 298069 299126 300018 300571 301420 302994 304687 305519
52345 305519 305304 304710 304368 304426 304976 306316 308565 311357 314218 317096 320240 323685 327135 330385 333649 337352
52329 337352 341687 346476 351549 357208 364170 372832 382656 392508 401661 410242 418668 426961 434855 442286
52315 442286 449433 456314 462680 468364 473597 479053 485639 494043 504161 515011 525522 535410 545153
52302E45153J0045J0355J0588J0945J1287J1111J0178Q786P341N946M583L441
52290F49759K741K360J891J167M72P3j70m84p04n77m42r11j747j861q78J32J64
52273F50985k27R0Q80R25J26j80Q05K329L509M482N559O254O092N565N463N780
52257F98437O103O448P033P674Q163Q740R525R926R414Q397P568O828N627M035
52243H03918K636J736J376J702K475K740J945R56Q92J382J209L38r8K18L32k65
52227H23492q39q03o16p52r15r25j340k362l028k353p57N46J073J271J538J830
52211H15060K114K588L346M196M742M652L976L264L041L222L364L438L758M199
52197H64960M268M089M481N696O814O934O291N651N209M614L711K639J531N21
$$ plain form
52302 545153 555198 565553 576141 587086 598373 609484 619662 628448 635789 641735 646318 649759
52290 649759 652500 654860 656751 657918 658390 658463 658293 657809 657105 656528 656086 655175 653428 651567 650689 650821 650985
52273 650985 650758 650848 651728 652653 652779 652599 653404 655733 659242 663724 669283 675537 681629 687194 692657 698437
52257 698437 704540 710988 718021 725695 733858 742598 752123 762049 771463 779860 787428 794256 799883 803918
52243 803918 806554 808290 809666 811368 813843 816583 818528 819484 820376 821758 822967 823305 823207 823425 823757 823492
52227 823492 822653 821850 821234 820482 819567 818642 817302 814940 811912 809559 808802 809348 810421 811692 813230 815060
52211 815060 817174 819762 823108 827304 832046 836698 840674 843938 846979 850201 853565 857003 860761 864960
52197 864960 869228 873317 877798 883494 890308 897242 903533 909184 914393 919007 922718 925357 926888 927409
52183I27409k47r83k175l811n135n596n535n485n333m839m411m596n070m965m032
52168H65196k860k017j560j305j014l55P40J765K047J572R17M72R9m16j012j465
52152H60804j569j165l03O18J132J166J064J123J340J516J473J148N84j73j093
52137H67665k021k589k592k329k247k212j605j95J550L091M293N183N801O517
52123H78310P840R649J1125J1702J1530J0852R717Q660Q669R885J1098J1212J0541
52110A010790R924R402Q701Q232Q494R023R106R112R868J1094J1684J1410J1093
52097A137933J1140J1129J0784J0084Q389M937N32k731l992m595n875p300p647
52084A162788o979o244n698m931m008l468l365l245k996k882k757k045p10L35
$$ plain form
52183 927409 927162 926179 924004 920193 915058 909462 903927 898442 893109 888270 883859 879263 874193 869228 865196
52168 865196 862336 860319 858759 857454 856440 856085 856825 858590 860637 862209 863126 863598 863697 863281 862269 860804
52152 860804 859235 858070 857767 858385 859517 860683 861747 862870 864210 865726 867199 868347 868931 868758 867665
52137 867665 865644 863055 860463 858134 855887 853675 852070 851875 853425 856516 860809 865992 871793 878310
52123 878310 886150 895799 906924 918626 930156 941008 950725 959385 968054 977939 989037 1000249 1010790
52110 1010790 1020714 1030116 1038817 1047049 1055543 1064566 1073672 1082784 1092652 1103746 1115430 1126840 1137933
52097 1137933 1149073 1160202 1170986 1181070 1189459 1194396 1194928 1192197 1188205 1183610 1177735 1170435 1162788
52084 1162788 1155809 1149565 1143867 1138936 1134928 1131460 1128095 1124850 1121854 1118972 1116215 1114170 1113460 1113795
52070A113795J65j061k112j815j76J588K268J921J673K273L356M238M875N596
52056A136584O349O789O868O758O388N534M306L037J760K92j179k130k542l124
52042A175690m317n433n318l805k003j041r71j196j487k001k528k490j847j321
52028A139932j399j727j884k122k654k826j932n62q9q08j549j322l86N56J342
$$ plain form
52070 1113795 1113960 1112899 1110787 1108972 1108796 1110384 1112652 1114573 1116246 1118519 1121875 1126113 1130988 1136584
52056 1136584 1142933 1149722 1156590 1163348 1169736 1175270 1179576 1182613 1184373 1184665 1183486 1181356 1178814 1175690
52042 1175690 1171373 1165940 1160622 1156817 1154814 1153773 1152802 1151606 1150119 1148118 1145590 1143100 1141253 1139932
52028 1139932 1138533 1136806 1134922 1132800 1130146 1127320 1125388 1124826 1124737 1123929 1122380 1121058 1120672 1121228 1122570
$$ [...]
##END NTUPLES=NMR SPECTRUM
##END=
