##TITLE=AC1473_13FB002635_8026882_x02myc3yUk
##JCAMPDX= 6.0         $$ Bruker NMR JCAMP-DX V2.0
##DATA TYPE= NMR SPECTRUM
##DATA CLASS= NTUPLES
##ORIGIN= BRUKER
##OWNER= Administrator
$$ 1.72 TOPSPIN		Version 2.1
$$ 2013-07-11 22:16:38.737 -0700  Administrator@X
$$ Compression mode = diff/dup
##.OBSERVE FREQUENCY= 400.02188249412
##.OBSERVE NUCLEUS= ^1H
##.ACQUISITION MODE= SIMULTANEOUS (DQD)
##.ACQUISITION SCHEME= undefined
##.AVERAGES= 8
##.DIGITISER RES= 22
##SPECTROMETER/DATA SYSTEM= spect
##.PULSE SEQUENCE= zg30
##.SOLVENT NAME= COFFEE_meoh
##.SHIFT REFERENCE= INTERNAL, COFFEE_meoh, 1, 14.98509
##AUDIT TRAIL= $$ (NUMBER, WHEN, WHO, WHERE, PROCESS, VERSION, WHAT)
$$ ##TITLE= Audit trail, TOPSPIN		Version 2.1
$$ ##JCAMPDX= 5.01
$$ ##ORIGIN= Bruker BioSpin GmbH
$$ ##OWNER= Administrator
$$ $$ E:\/data/COFFEE/nmr/AC1473_13FB002635_8026882_x02myc3yUk/10/pdata/1/auditp.txt
$$ ##AUDIT TRAIL=  $$ (NUMBER, WHEN, WHO, WHERE, PROCESS, VERSION, WHAT)
(   1,<2013-07-11 22:16:31.549 -0700>,<Administrator>,<X>,<go>,<TOPSPIN 2.1>,
      <created by zg
	started at 2013-07-11 22:15:25.393 -0700,
	POWCHK enabled, PULCHK disabled,
       configuration hash MD5:
       C8 4E 4E 5D D3 5C D8 9E 9F 52 82 E0 59 8A DE 15
       data hash MD5: 64K
       9E B2 A3 8E 04 AC 4E 00 C3 D3 ED 63 39 83 A8 F6>)
(   2,<2013-07-11 22:16:34.471 -0700>,<Administrator>,<X>,<proc1d>,<TOPSPIN 2.1>,
      <Start of raw data processing
       efp LB = 0 FT_mod = 6 PKNL = 1 PHC0 = 0 PHC1 = 0 SI = 32K 
       data hash MD5: 32K
       0C 9F E4 0C 36 F0 EC 6D E2 3B 17 FE 72 FD E4 18>)
(   3,<2013-07-11 22:16:34.831 -0700>,<Administrator>,<X>,<proc1d>,<TOPSPIN 2.1>,
      <pk PHC0 = 98.39905 PHC1 = 0 
       data hash MD5: 32K
       4E F0 66 7B 30 B8 6F E1 06 06 08 0C 05 87 F3 65>)
(   4,<2013-07-11 22:16:35.065 -0700>,<Administrator>,<X>,<proc1d>,<TOPSPIN 2.1>,
      <abs ABSG = 1 
       data hash MD5: 32K
       CB 87 5A 0E 8A FF 3B B2 EE 39 DD 43 DA AA 63 8E>)
(   5,<2013-07-11 22:16:35.159 -0700>,<Administrator>,<X>,<proc1d>,<TOPSPIN 2.1>,
      <abs ABSG = 2 
       data hash MD5: 32K
       08 70 02 37 21 84 89 DB 08 9C C5 00 F4 B2 4E 3F>)
(   6,<2013-07-11 22:16:35.237 -0700>,<Administrator>,<X>,<proc1d>,<TOPSPIN 2.1>,
      <abs ABSG = 3 
       data hash MD5: 32K
       13 70 E1 88 76 5A 23 F2 15 2C 50 DF A9 4E 60 66>)
(   7,<2013-07-11 22:16:35.299 -0700>,<Administrator>,<X>,<proc1d>,<TOPSPIN 2.1>,
      <abs ABSG = 4 
       data hash MD5: 32K
       0C EC A5 FE F3 3F 63 1C B4 D1 90 0C 48 6F 1A 0A>)
(   8,<2013-07-11 22:16:35.378 -0700>,<Administrator>,<X>,<proc1d>,<TOPSPIN 2.1>,
      <abs ABSG = 5 
       data hash MD5: 32K
       C0 A5 29 B8 18 8D 00 56 B8 F9 D0 24 0E EB 0D AF>)
$$ ##END=
$$ 
$$ $$ hash MD5
$$ $$ E0 27 7D D4 A5 5C 71 85 75 12 5C 9F 5A D7 A8 B7
##$RELAX= 
##$RELAX= 
##$RELAX= 
##$RELAX= 
##$RELAX= 
##$RELAX= 
##$RELAX= 
$$ Bruker specific parameters
$$ --------------------------
##$DU= <E:\>
##$EXPNO= 10
##$NAME= <AC1473_13FB002635_8026882_x02myc3yUk>
$$ [...]
##$TP= (0..7)
150 150 150 150 150 150 150 150
##$TP07= 0
##$TPNAME0= <>
##$TPNAME1= <>
##$TPNAME2= <>
##$TPNAME3= <>
##$TPNAME4= <>
##$TPNAME5= <>
##$TPNAME6= <>
##$TPNAME7= <>
##$TPOAL= (0..7)
0.5 0.5 0.5 0.5 0.5 0.5 0.5 0.5
##$TPOFFS= (0..7)
0 0 0 0 0 0 0 0
##$TUNHIN= 0
##$TUNHOUT= 0
##$TUNXOUT= 0
##$USERA1= <user>
##$USERA2= <user>
##$USERA3= <user>
##$USERA4= <user>
##$USERA5= <user>
##$V9= 5
##$VALIST= <valist>
##$VCLIST= <CCCCCCCCCCCCCCC>
##$VD= 0
##$VDLIST= <DDDDDDDDDDDDDDD>
##$VPLIST= <PPPPPPPPPPPPPPP>
##$VTLIST= <TTTTTTTTTTTTTTT>
##$WBST= 1024
##$WBSW= 4
##$XGAIN= (0..3)
0 0 0 0
##$XL= 0
##$YL= 0
##$YMAX_a= 609295
##$YMIN_a= -518442
##$ZGOPTNS= <>
##$ZL1= 120
##$ZL2= 120
##$ZL3= 120
##$ZL4= 120
##$ABSF1= 14.98509
##$ABSF2= -5.573092
##$ABSG= 5
##$ABSL= 3
##$ALPHA= 0
##$AQORDER= 0
##$ASSFAC= 0
##$ASSFACI= 0
##$ASSFACX= 0
##$ASSWID= 0
##$AUNMP= <proc_prof1d_extract_pilot.lims>
##$AXLEFT= 0
##$AXNAME= <>
##$AXNUC= <1H>
##$AXRIGHT= 0
##$AXTYPE= 0
##$AXUNIT= <>
##$AZFE= 0.1
##$AZFW= 0.1
##$BCFW= 0
##$BC_mod= 0
##$BYTORDP= 0
##$COROFFS= 0
##$CY= 15
##$DATMOD= 1
##$DC= 0
##$DFILT= <>
##$DTYPP= 0
##$F1P= 0
##$F2P= 0
##$FCOR= 0.5
##$FTSIZE= 32768
##$FT_mod= 6
##$GAMMA= 0
##$GB= 0
##$INTBC= 1
##$INTSCL= 1
##$ISEN= 128
##$LB= 0
##$LEV0= 0
##$LPBIN= 0
##$MAXI= 10000
##$MC2= 0
##$MEAN= 0
##$ME_mod= 0
##$MI= 0
##$NCOEF= 0
##$NC_proc= -8
##$NLEV= 6
##$NOISF1= 0
##$NOISF2= 0
##$NSP= 0
##$NTH_PI= 0
##$NZP= 0
##$OFFSET= 14.98509
##$PC= 1
##$PHC0= 98.39905
##$PHC1= 0
##$PH_mod= 1
##$PKNL= yes
##$PPARMOD= 0
##$PPDIAG= 0
##$PPIPTYP= 0
##$PPMPNUM= 2147483647
##$PPRESOL= 1
##$PSCAL= 4
##$PSIGN= 0
##$PYNMP= <proc.py>
##$REVERSE= no
##$SF= 400.02
##$SI= 32768
##$SIGF1= 0
##$SIGF2= 0
##$SINO= 400
##$SIOLD= 32768
##$SPECTYP= <>
##$SREGLST= <1H.CDCl3>
##$SSB= 0
##$STSI= 32768
##$STSR= 0
##$SW_p= 8223.68421052631
##$SYMM= 0
##$S_DEV= 0
##$TDeff= 65536
##$TDoff= 0
##$TI= <>
##$TILT= no
##$TM1= 0
##$TM2= 0
##$TOPLEV= 0
##$USERP1= <user>
##$USERP2= <user>
##$USERP3= <user>
##$USERP4= <user>
##$USERP5= <user>
##$WDW= 1
##$XDIM= 32768
##$YMAX_p= 448941408
##$YMIN_p= -709427
##$CURPLOT= <Network HP LaserJet P1505>
##$CURPRIN= <$Network HP LaserJet P1505>
##$DFORMAT= <normdp>
##$LAYOUT= <+/1D_H.xwp>
##$LFORMAT= <normlp>
##$PFORMAT= <normpl>
##$SURQMSG= 1
$$ End of Bruker specific parameters
$$ ---------------------------------
##NTUPLES= NMR SPECTRUM
##VAR_NAME=  FREQUENCY,     SPECTRUM/REAL,   SPECTRUM/IMAG
##SYMBOL=    X,             R,               I
##VAR_TYPE=  INDEPENDENT,   DEPENDENT,       DEPENDENT
##VAR_FORM=  AFFN,          ASDF,            ASDF
##VAR_DIM=   32768,         32768,           32768
##UNITS=     HZ,            ARBITRARY UNITS, ARBITRARY UNITS
##FACTOR=    0.250966925370066, 1,           1
##FIRST=     8223.43324360094, -253250,      -179964
##LAST=      0,             -197481,         42887
##MIN=       0,             -709427,         0
##MAX=       8223.43324360094, 448941408,    0
$$ Real data points
##PAGE= N=1
##DATA TABLE= (X++(R..R)), XYDATA
$$ [...]
$$ plain form
19528 -115032 38028 -189642 146387 139038 -62907 161830 -221782 -86083 -284199 -105925
19517 -17555 138045 -517604 121730 204499 -90161 -170586 -164984 -287556 7594 222115 -130597
19505 -149283 -398951 199902 33920 -79481 103951 88485 129188 -411926 -90668 117144
19494 -305011 96284 -121320 23518 -262941 -149481 -5382 123036 -127066 331856 -82110
19483 -202488 -303692 -43545 -79236 -182918 58644 -356612 -213706 -178759 -90991 -26631 -158319
19472 -158319 -209953 -17838 -390523 65938 -94345 127841 -42429 -37396 176867 -122021 -242262
19461 -242262 239461 58367 209264 -151081 -43175 294090 -151942 -77490 80986 -279861
19450 -115116 -4206 -90016 18014 83088 -69943 140080 -33129 121810 -118696 330879 138391
$$ packed form
19528a15032C8028a89642A46387p349f2907A61830b21782h6083j98116a05925
19517a7555A38045e17604A21730Q2769i0161q0425N602j22572G594K14521a30597
19505a49283k49668A99902C3920g9481A03951j5466M0703d11926i0668A17144
19494c05011I6284a21320B3518b62941J13460e382A23036a27066C31856h2110
19483b02488j01204d3545l5691j03682E8644c56612J42906L4947Q7768b6631j31688
19472a58319n1634a7838l72685F5938i4345A27841d2429N033A76867a22021j20241
19461b42262B39461E8367J50897a51081d3175B94090a51942P4452H0986b79861
19450a15116d206q5810A8014O5074f9943A40080c3129A21810a18696C30879A38391
$$ plain form
19438 -259049 -147478 -204850 123245 -305266 -67048 -167563 120681 -60232 -263528 -298867
19428 -298867 -56419 -17867 -218933 -180138 -264860 -449951 -22092 102181 -289344 -349948 -229452
19417 -229452 296209 -323741 54894 -88980 -231335 70457 -227690 67949 -92353 -122790 36811
19405 -255459 102901 -115416 -102425 -361023 -126558 23658 -83721 78334 -89284 -151620 -266334
19394 -266334 150879 2926 -227879 -120275 -165171 96229 -157980 -146600 147798 171067 -226408
19382 -12683 90553 152253 -295940 -37201 -96960 24019 55181 -46942 -174787 -238058 113429
19370 225747 -44148 -250211 -199577 -531080 50201 -140350 160372 -188952 -254404 67024
19359 169356 -72622 13823 276966 -533404 75744 76419 -386573 -355209 -66826 46991 -560788
$$ packed form
19438b59049J11571n7372A23245c05266f7048j00515A20681f0232k03296l5339
19428b98867e6419a7867k01066L8795q4722j85091b2092A02181b89344o0604J20496
19417b29452B96209c23741E4894h8980j42355G0457b27690F7949i2353l0437C6811
19405b55459A02901a15416J2991k58598a26558B3658h3721G8334h9284o2336j14714
19394b66334A50879B926b27879J07604m4896I6229a57980J1380A47798K3269b26408
19382a2683I0553O1700b95940c7201n9759B4019L1162d6942j27845o3271A13429
19370B25747d4148k06063N0634l31503E0201a40350A60372a88952o5452F7024
19359A69356g2622A3823K63143e33404G5744O75c86573L1364f6826D6991e60788
$$ plain form
19347 -395027 -11430 -34972 70769 -174800 -12543 355856 -130020 -158131 124049 -56935 -337959
19336 -337959 -550163 150095 145282 -46012 232648 92409 71057 226955 -140931 -124755 -19024
19324 -104785 -148547 290612 54058 342077 144690 42681 37399 -286809 -190704 -71671 8758
19312 40343 -11473 -197311 28928 -220604 126008 -52165 161139 -75097 310128 -234611
19301 -133912 -276535 275153 166385 -94121 -27145 206490 -286036 -304246 -330467 -315599
19291 -315599 20560 -51803 -29723 -148312 2590 40788 -371768 -366058 79139 -121198 -65817
19280 -65817 -258222 -56888 -33792 104581 -138369 100174 -398118 -511364 141441 -149567
19269 49252 -2503 -15898 -81283 -92309 -216540 -8600 -71648 -63544 -7033 94677 -69579 -204980
$$ packed form
19347c95027a1430k3542G0769a74800a2543C55856a30020k8111A24049e6935k81024
19336c37959k12204A50095m813d6012B32648I2409k1352J55898a40931J6176a9024
19324a04785m3762B90612E4058K88019A44690D2681n282b86809R6105g1671H758
19312D0343a1473j85838B8928b20604A26008e2165A61139g5097C10128b34611
19301a33912j42623B75153j08768i4121b7145B06490b86036j8210k6221J4868
19291c15599B0560e1803K2080j18589B590L8198c71768N710G9139a21198N5381
19280f5817j92405e6888K3096A04581a38369A00174c98118j13246A41441a49567
19269D9252b503j3395o5385j1026j24231h600o3048Q104g033I4677f9579j35401
$$ plain form
19257 -204980 37475 150588 -107584 31817 58338 -28702 35850 -240833 -340738 -66444 -125531
19246 -125531 -355384 -247138 -31831 160227 207285 251495 -28208 -18033 178618 48165 -183579
19234 -2828 -345990 -93861 -88645 -119271 203385 -8643 -195857 -180366 -56585 -71933 106505
19222 202150 -38838 164796 174827 12762 -40331 141660 -42550 -289538 81130 78685 -228896
19210 -145439 -372881 -141881 9838 188637 28695 -256460 -316483 359 -209548 -161919 -196110
19199 -196110 -102583 232752 -114764 -171248 -299808 -71486 -76188 82883 77757 277717 -47570
19187 -227807 199148 25101 -153654 253316 -192285 -16008 -4438 -179759 148402 165931
19177 165931 288413 -164051 -401021 -98963 -354132 -207556 -310261 -187437 -202339 -40525
$$ packed form
19257b04980C7475J13113a07584C1817K6521b8702C5850b40833r9905f6444n9087
19246a25531k29853J08246c1831A60227M7058M4210b8208J0175A78618D8165a83579
19234b828l43162i3861N216l0626B03385h643j87214J5491e6585j5348A06505
19222B02150c8838A64796J0031A2762d0331A41660d2550k46988H1130k445b28896
19210a45439k27442a41881I838J78799B8695b56460o0023C59b09548M7629l4191
19199a96110R3527B32752a14764n6484j28560g1486m702H2883n126J99960d7570
19187b27807A99148B5101a53654B53316a92285a6008d438j75321A48402J7529
19177A65931J22482a64051k36970i8963k55169J46576j02705J22824j4902d0525
$$ plain form
19166 128126 -60848 -92072 -147722 169370 -358718 120286 -140973 -199278 -171180 -381754
19156 -381754 -81824 -183102 -66302 -266314 -75401 102151 176 -206233 88832 41677 64631
19145 64631 152297 284907 -173437 29689 -26615 242986 -138488 -97422 -355024 196039
19134 -146212 -311213 114140 -5439 -123235 15139 135304 25709 -274263 66686 120067 -81363
19122 94613 -142151 -230085 -245636 38573 -19017 266708 -74617 59994 -123800 -319102 -64380
19110 202894 -309703 254188 -52790 -64556 139888 -448145 -246284 394798 65853 -388822
19099 184425 75610 -69955 -262815 129927 -95361 50683 -161064 -72918 67452 295110 245869
19088 245869 294912 375640 -36748 -76789 71840 26492 -281157 -163627 -186645 40989 12137
$$ packed form
19166A28126f0848l1224n5650A69370c58718A20286a40973n8305K8098k10574
19156c81754h1824j01278f6302k00012g5401A02151A76b06233H8832D1677K2954
19145F4631Q7666J32610a73437B9689b6615B42986a38488M1066k57602A96039
19134a46212j65001A14140e439j17796A5139J20165B5709b74263F6686N3381h1363
19122I4613a42151q7934j5551C8573a9017B66708g4617E9994a23800j95302f4380
19110B02894c09703B54188e2790j1766A39888d48145K01861C94798F5853c88822
19099A84425G5610f9955j92860A29927i5361E0683a61064g2918F7452K27658m9241
19088B45869M9043Q0728c6748m0041G1840B6492b81157J17530k3018D0989A2137
$$ plain form
19076 -55382 -137021 -163032 126973 128400 42985 -243940 -247546 -212382 -158968 -251512 -76374 -99823
19064 -99823 -66476 -24259 233641 -194721 -20227 200134 -213745 146452 -264421 -173145
19054 -173145 146027 -369728 -58927 218013 -101358 -236735 133343 -350506 -210436 -1440
19043 156877 -190000 -29905 -46013 46790 -165250 83124 19514 -214073 206413 -33108 -222983
19032 -222983 46433 -3731 -115081 -302123 414628 312800 -128961 56996 136212 120765 -79465
19020 271940 85220 -220496 75614 -262266 106735 -458443 -193133 -186262 -383653 -309107
19010 -309107 -256765 111807 119425 230829 -68086 81194 -156102 138359 163102 -208576 78727
18998 -129441 -90396 -248713 -187030 -25275 -3432 -199432 201136 7875 36590 -169194 24061
$$ packed form
19076e5382q1639k6011A26973J427D2985b43940l606L5164N3414r2544g6374k3449
19064i9823L3347b4259B33641a94721b0227B00134b13745A46452b64421R1276
19054a73145A46027c69728e8927B18013a01358j35377A33343c50506J40070a440
19043A56877a90000b9905j6108D6790a65250H3124A9514b14073B06413c3108j89875
19032b22983D6433c731j11350j87042D14628j01828a28961E6996P9216j5447g9465
19020B71940H5220b20496G5614b62266A06735d58443a93133O871j97391P4546
19010c09107N2342A11807P618J11404f8086H1194a56102A38359K4743b08576G8727
18998a29441L9045j58317O1683b5275c432j96000B01136G875K8715a69194B4061
$$ plain form
18986 -135535 45167 -467191 -223943 -165563 248251 -147269 305995 -65346 -43080 104575
18975 -18721 -197412 -167678 -100591 -67961 49390 -164568 -82828 -61541 110174 334145 126447
18963 -68280 -37720 -46362 -135105 -23810 -172751 -77033 315827 168814 -274848 251062 -137163
18951 -36383 -257362 -133668 -111666 119510 13178 -86840 84729 -278611 -201043 57915 -132667
18939 -201987 176135 -141637 -154504 -45802 -137108 -176765 141812 -87853 -124575 -74135 174986
18927 -87636 168776 7581 74563 138505 209641 -215219 -82596 -133965 18737 -58857 154457
18915 -61016 -4476 -509036 89391 -261637 -11499 -483626 -509607 -24390 -205187 90081 81986
18904 81986 -19341 39130 -50833 275881 -298751 -68156 -129362 102716 -285736 270394 194447
$$ packed form
18986a35535D5167d67191b23943N8380B48251a47269C05995f5346K2266A04575
18975a8721j78691K9734O7087L2630D9390a64568Q1740K1287A10174K23971A26447
18963f8280L0560q642q8743b3810j48941g7033C15827j47013b74848B51062a37163
18951c6383k20979J23694K2002A19510A3178h6840H4729b78611P7568E7915a32667
18939b01987A76135a41637j2867d5802r1306l9657A41812h7853l6722N0440A74986
18927h7636A68776G581O6982O3942P1136b15219h2596n1369A8737e8857A54457
18915f1016d476n04560H9391b61637a1499m72127k5981b4390j80797I0081q095
18904H1986a9341C9130e0833B75881b98751f8156o1206A02716b85736B70394p5947
$$ plain form
18893 194447 75801 -107632 29813 -127137 46334 -105729 -213456 314820 -116757 87710
18882 150504 -50330 -1771 -128751 -244669 -19467 132419 -110339 -166118 2403 344588 -326049
18870 -90042 -361595 -61799 339616 -35187 9824 -153728 -269013 -170206 -155410 -126233 86607
18858 -436613 316068 148070 -209810 5865 -183296 243651 -130441 -25747 62162 -225954
18847 -226335 -146098 -191216 133526 -68019 -122137 -206093 -148809 -295816 -291449 33611 200322
18836 200322 163725 -74203 -60187 -175171 135319 -145373 -98819 17709 -89642 175978 -330
18824 -206544 -63731 -172190 123561 6186 -79983 -150832 60725 -12393 -34328 368595 227356
18813 227356 257039 64876 221147 247282 250453 143241 241824 -35208 -239868 -153686 -161172
$$ packed form
18893A94447G5801a07632B9813a27137D6334a05729j07727C14820a16757H7710
18882A50504e0330a771j26980j15918a9467A32419a10339n5779B403L42185c26049
18870i0042k71553f1799C39616c5187I824a53728j15285R8807J4796K9177H6607
18858d36613C16068A48070b09810E865a83296B43651a30441b5747F2162b25954
18847b26335Q0237m5118A33526f8019n4118q3956N7284j47007M367C3611J66711
18836B00322l6597g4203J4016j14984A35319a45373M6554A7709h9642A75978c30
18824b06544f3731j08459A23561F186g9983p0849F0725a2393k1935C68595j41239
18813B27356K9683F4876J56271K6135L171j07212R8583c5208k04660Q6182p486
$$ plain form
18802 -161172 -202576 -234501 182083 -9871 91271 62336 -217504 78148 -240051 41706 -265089
18790 97373 9425 52494 -5313 -124301 50927 -34005 -139094 -560488 -162351 170631 -117521
18778 -125705 1960 -292273 -155672 91300 173741 44067 260834 -79948 -16575 -372835 -213397
18767 -213397 -71595 -157738 165850 -43049 -103939 -95824 100136 120010 -321551 -65880 -258523
18756 -258523 -38944 -272703 54838 -30631 -193911 32137 -130986 -949 -178698 259633 -311267
18744 122556 -406568 109607 6529 6937 -240850 -74593 -128200 -148366 -102660 -73484 200945
18732 -130405 31636 -11262 -209234 -44143 -19141 -89536 -103588 -453987 205070 159228 -24847
18720 44880 -106902 -122078 -316243 103302 163943 -123397 106639 32792 14942 -206881
$$ packed form
18802a61172m1404l1925A82083i871I1271k8935b17504G8148b40051D1706b65089
18790I7373I425M3069e313j18988E0927c4005j05089m21394a62351A70631a17521
18778a25705A960b92273J36601I1300Q2441D4067K16767g9948a6575l56260J59438
18767b13397g1595q6143A65850d3049o0890Q115A00136J9874c21551f5880j92643
18756b58523c8944k33759E4838c0631j63280C2137a30986i49j77749B59633c11267
18744A22556d06568A09607F529M08b40850g4593n3607k0166M5706K9176B00945
18732a30405C1636a1262j97972d4143a9141p0395j4052l50399B05070m5842b4847
18720D4880a06902j5176j94165A03302O0641a23397A06639C2792A4942b06881
$$ plain form
18709 -241898 242693 216893 -190692 23255 47265 15129 19925 -20673 -259019 -122665 -165768
18698 -165768 144684 108185 139380 205061 107897 -9423 -6451 -326760 56081 175100 -63342
18686 62356 -24724 -162253 -1168 -76430 41137 -2504 -421564 -298217 -133812 159989 210247
18675 210247 157775 -142540 -131326 -159228 143248 130230 -75699 168197 -19741 40024 -34926
18663 -238060 8097 -286192 177310 212188 -98023 -66047 -305162 -42306 -56725 227059 48218
18651 30139 23753 58385 -130504 273439 41291 -913 238333 -128606 -203568 -140603 -258442
18640 -258442 198944 -191400 -132711 101572 1389 -30117 219079 -350133 27557 -238717
18629 -239141 -352197 94462 126186 -371037 194853 101167 -312425 25576 53432 -254309
$$ packed form
18709b41898B42693k5800a90692B3255K4010A5129M796b0673k38346a22665m3103
18698a65768A44684l6499L1195O5681r7164i423K972l20309E6081J19019f3342
18686F2356b4724j37529a168p5262D1137b504m19060J23347a33812A59989N0258
18675B10247n2472a42540J1214k7902A43248j3018g5699A68197a9741D0024c4926
18663b38060H097b86192A77310L4878i8023L1976k39115d2306j4419B27059D8218
18651C0139o386L4632a30504B73439D1291i13B38333a28606p4962O2965j17839
18640b58442A98944a91400N8689A01572A389c0117B19079c50133B7557b38717
18629b39141j13056I4462L1724c71037A94853r3686c12425B5576K7856b54309
$$ plain form
18618 272195 -44066 -429232 -245435 -136976 -254198 62639 -259338 -126819 -36190 -183212
18608 -183212 86851 -146597 59012 5928 -315754 -312775 -90349 -290514 253557 134185 231747
18597 231747 -36943 -386389 -122226 -277682 -146564 -269189 -147869 -340270 143539 -264882
18586 79690 -316030 -109913 -218941 -239992 -203460 -514157 120033 -142763 243623 304927
18576 304927 104250 77739 -47909 -127928 -6705 -223916 -328540 178073 119081 107528 -394679
18564 -164792 -46372 -227609 453887 -134856 204670 332741 -312326 250052 248955 190713
18554 190713 -324340 -265784 -129330 -172018 -213057 -2269 16150 409359 236147 -28884 -33194
18543 -33194 -119640 -133859 -45265 91006 -216434 43272 6867 53474 -50859 68002 -130621
$$ packed form
18618B72195d4066l85166J83797J08459j17222F2639b59338a26819c6190j47022
18608a83212H6851a46597E9012E928c15754K979i0349k00165B53557j19372R7562
18597B31747c6943l49446a22226j55456J31118j22625J21320j92401A43539b64882
18586G9690c16030a09913j09028k1051L6532l10697A20033a42763B43623O1304
18576C04927A04250k6511d7909q0019f705k17211j04624A78073n8992j1553c94679
18564a64792d6372j81237D53887a34856B04670J28071c12326B50052j097n8242
18554A90713c24340N8556a29330m2688m1039b269A6150L93209j73212b8884m310
18543c3194q6446j4219d5265I1006b16434D3272F867M6607e0859F8002a30621
$$ plain form
18531 38908 154333 -16602 -9134 -199600 -89289 7984 -153640 -52857 18462 81683 267798
18520 267798 53882 272874 -63064 91060 399955 -22026 -120453 -59477 -101078 -179955 -163114
18509 -163114 -68605 -174909 -99069 -46499 -104565 -107415 -309518 -579810 72092 -272878 -49295
18497 -17343 170645 60573 100519 -1615 109983 -331582 71189 -142881 -46489 -275008 -169822
18486 -169822 -320229 -15919 227421 -168492 -49813 -177126 253585 -433557 -204697 -198381
18476 -198381 31244 -68278 -260789 -2147 -178928 -144745 -214916 8859 -247861 77606 -63154
18464 43383 -39835 -180300 -111715 112911 -237950 167039 -93465 -164559 134368 -114564
18453 -86187 48313 -411242 122661 -112840 -68868 114086 -77136 -38738 -138138 -130490 -153596
$$ packed form
18531C8908J15425a6602P468j90466h9289G984a53640e2857A8462O3221J86115
18520B67798E3882K18992f3064I1060L08895b2026r8427e9477m1601p8877J6841
18509a63114f8605j06304P5840d6499n8066k850k02103k70292G2092b72878d9295
18497a7343A70645F0573L9946a615A09983c31582G1189a42881d6489k28519J05186
18486a69822j50407a5919B27421a68492d9813j27313B53585d33557b04697O316
18476a98381C1244f8278j92511b147j76781L4183p0171H859b47861G7606f3154
18464D3383c9835j40465O8585A12911b37950A67039i3465p1094A34368a14564
18453h6187D8313d11242A22661a12840M3972A14086g7136L8398r9400P648k3106
$$ plain form
18442 -153596 -59852 307373 32822 -64823 -306399 -32341 -158323 -65409 91660 -8398 -375565
18431 -375565 -2258 -154722 130007 -113376 -493837 -292145 343821 -158591 -115899 203182
18420 -95199 -68775 81363 -137666 171058 -129524 -54155 -195455 -129998 -64379 258906 -100732
18408 -46649 204283 350715 -246126 109975 72841 196985 -196973 66550 -139625 36419
18397 6429 -217792 -49533 44184 -303821 -85285 242955 291253 -238145 -134296 -199758 -138483
18386 -138483 -140384 -175479 -157397 81409 -162269 -313015 384172 -275123 162891 79841 -57760
18374 -46830 -126411 -19775 -95177 169422 94069 121234 -60722 -35562 -109885 11689 160679
18363 160679 106705 56119 223719 -64773 1999 -76257 -28532 71650 -107667 -175660 -45513
$$ packed form
18442a53596e9852C07373C2822f4823k41576c2341j25982f5409I1660h398l67167
18431c75565b258j52464A30007a13376l80461K01692C43821a58591M2692B03182
18420i5199K6424H1363a37666A71058a29524e4155j41300O5457f4379B58906a00732
18408d6649B04283J46432b46126A09975l7134J24144a96973F6550a39625C6419
18397F429b17792d9533D4184c03821h5285B42955M8298b38145J03849o5462O1275
18386a38483j901l5095J8082H1409a62269j50746C84172b75123A62891G9841e7760
18374d6830p9581a9775p5402A69422p5353K7165f0722K5160p4323A1689J48990
18363A60679n3974n0586J67600f4773A999g6257b8532G1650a07667o7993d5513
$$ plain form
18351 184571 -205546 -68040 -346974 258849 -73212 -190759 -322638 90119 -53865 -104011
18341 -104011 -24654 -243189 -182318 -3412 -3151 124695 234701 -17939 5986 -97020 -417003
18330 -417003 220875 -27852 -111925 122813 -12567 28595 -126184 268741 -163334 130375
18319 -71397 -174244 -172964 35411 -138100 27834 159314 -141096 -133175 246487 175329 -146634
18307 -6553 1427 13381 -174689 -375941 -131177 50037 148689 -110627 127128 -97860 -360276
18296 -360276 80867 -31668 -217299 -12757 -104305 11749 -100870 -23308 -97015 163022 64593
18284 -367437 171911 -212024 -29464 -44725 -42565 58088 -176078 -152760 -220496 5220 309430
18273 309430 -254481 -70741 -157286 -141193 -220150 -240619 -159880 188222 -84715 187213 -171099
$$ packed form
18351A84571b05546f8040k78934B58849g3212j17547j31879I0119e3865n0146
18341a04011b4654k18535O0871c412K61A24695J10006a7939E986i7020l19983
18330d17003B20875b7852q4073A22813a2567B8595a26184B68741a63334A30375
18319g1397j02847J280C5411a38100B7834J31480a41096P921B46487p1158a46634
18307f553A427J1954a74689k01252a31177E0037R8652a10627A27128i7860k62416
18296c60276H0867c1668j85631a2757r1548A1749a00870b3308p3707A63022F4593
18284c67437A71911b12024b9464j5261K160E8088a76078K3318o7736E220L04210
18273C09430b54481g0741q6545J6093p8957k0469Q0739A88222h4715A87213a71099
$$ plain form
18261 -389184 -61673 -10014 -33236 57125 305228 -180907 24272 116141 130933 -204245 -137929
18250 -137929 -218682 -58671 -46558 69957 -69038 115952 120978 92911 32225 164218 215509
18239 215509 -171364 123590 -243653 -339727 125777 -42816 145303 71170 268819 -302293
18228 -59014 -143149 -99360 -121330 -240969 -133001 -47933 -248302 271612 -104207 -392967
18218 -392967 96467 98151 -105975 210689 -88533 295274 -70286 -160877 -74360 -281173 67784
18206 -202046 -524187 154718 21587 -28430 124815 -99058 -410092 113217 -201875 21432
18195 286801 123625 110473 152624 -87708 88897 77937 4973 -253303 -109162 91179 -200922
18183 160557 -269701 -73059 -207764 292035 -111002 -160014 98945 -129473 -131034 138616
$$ packed form
18261c89184f1673a0014k3222E7125K48103a80907B4272R1869J4792b04245O6316
18250a37929q0753e8671J2113F9957f9038A15952N026k8067C2225J31993N1291
18239B15509a71364A23590b43653r6074A25777d2816A45303G1170J97649c02293
18228e9014q4135M3789k1970j19639J07968d7933k00369B71612a04207k88760
18218c92967I6467J684a05975B10689h8533B95274g0286r0591g4360k06813F7784
18206b02046l22141A54718B1587b8430A24815i9058l11034A13217b01875B1432
18195B86801A23625j3152M2151h7708H8897j0960D973b53303a09162I1179b00922
18183A60557b69701g3059j34705B92035a11002m9012I8945a29473j561A38616
$$ plain form
18172 -173232 224514 169353 -253165 9834 -2295 -675569 40242 -181768 78636 3170 16214
18161 16214 -253893 -39343 -17706 340164 -40154 7972 -226727 11739 201396 -35165 -187778
18150 -187778 -46002 74419 -51532 3610 163507 45554 -63315 120770 -268625 -159979 -31594
18138 -52124 148425 -145555 -253024 174308 -60386 -342695 262064 -37420 188528 -224651
18127 -276836 -46605 -59642 -22012 170250 -189953 33385 -291183 -181229 -172704 -112028 202717
18115 48984 21830 108785 193132 -268202 -530 191753 -19111 -60833 -14571 65441 87858 -333484
18102 137402 90176 -9031 -150571 172277 145448 211910 -99163 75523 -48443 -219361 -13894
18090 -121921 -154902 257068 64256 -363172 -281086 -38560 -80475 -193212 -214185 125168 347514
$$ packed form
18172a73232B24514n5161b53165I834b295o73274D0242a81768G8636C170J3044
18161A6214b53893c9343a7706C40164d0154G972b26727A1739J89657c5165j52613
18150a87778d6002G4419e1532C610J59897D5554f3315A20770b68625J08646c1594
18138e2124A48425a45555j07469A74308f0386k82309B62064c7420A88528b24651
18127b76836d6605j3037b2012A70250a89953C3385b91183J09954Q525O0676B02717
18115D8984B1830Q6955Q4347b68202e30A91753a9111m1722a4571F5441K2417c33484
18102A37402m7226i031j41540A72277k6829O6462i9163G5523d8443j70918a3894
18090a21921l2981B57068F4256c63172Q2086c8560m1915j12737k0973A25168K22346
$$ plain form
18079 347514 146862 54740 -333776 98374 66925 -417815 -170599 -270204 128284 225276
18069 225276 41453 244737 -37637 -104066 -12916 12499 328841 2453 -5210 -57776 -256714
18058 -256714 183513 62493 -36528 -180573 -44509 -98232 -403000 -298483 106646 129793
18048 129793 70212 -251175 -67413 142903 208097 -54058 147290 -47476 17008 -25942 -61160
18037 -61160 -42441 -191117 -103892 58623 -18046 -28024 674 -509484 74055 112935 -140172 101403
18024 -125647 138811 157784 -110923 -93131 -169401 47920 -78031 -310603 72120 -214751 168897
18012 -57238 26637 -226367 -182060 -41444 70412 42320 -156563 -163932 -170837 -79729 -149882 -104032
18000 -104032 -233364 51626 -96765 27130 -34644 36037 115079 -344272 4947 143753 7211
$$ packed form
18079C47514A46862E4740c33776I8374l1449d17815a70599r9605A28284R6992
18069B25276D1453K03284c7637o6429a2916A2499L16342B453e210n2566j98938
18058b56714A83513F2493c6528j44045d4509n3723l04768J04517A06646K3147
18048A29793n9581b51175f7413A42903O5194e4058A47290d7476A7008b5942l5218
18037f1160J8719j48676Q7225E8623a8046r978F74e09484G4055L8880a40172A01403
18024a25647A38811J8973a10923J7792p6270D7920g8031k32572G2120b14751A68897
18012e7238B6637b26367M4307d1444G0412k8092a56563p369o905g9729p0153M5850
18000a04032j29332E1626i6765B7130c4644C6037P9042c44272D947J38806G211
$$ plain form
17988 -210791 258367 77367 139130 -124106 39508 -99332 -179438 -66279 -133884 -51326 -224703
17977 -224703 -84793 -68621 265405 -133243 -360973 -59421 -10537 169840 -4432 -112235 178246
17965 -58258 94704 -139126 106063 34426 14964 -280466 -207733 15562 -120882 -119724 55938
17953 262637 19127 -250488 197516 -238839 37966 135676 -35475 139203 -64123 132666
17942 -65852 -298082 190999 324293 255037 -157934 86297 219522 82459 -78138 142337
17931 12868 -25668 -361676 -13105 126320 -301633 144161 263833 -60402 -11382 -173796
17921 -173796 58920 -147211 -34666 -186456 34690 26029 44191 -19417 -6388 -17141 178062
17909 -158266 115055 19033 93233 -42035 -38289 -47869 1231 -330669 -74538 157216 -459386
$$ packed form
17988b10791B58367G7367O1763a24106C9508i9332q0106f6279o7605e1326j73377
17977b24703h4793J6172B65405a33243k27730e9421a0537A69840d432j07803A78246
17965e8258I4704a39126A06063C4426A4964b80466P2733A5562a20882J158E5938
17953B62637A9127b50488A97516b38839C7966R7710c5475A39203f4123A32666
17942f5852k32230A90999J33294o9256a57934H6297J33225H2459g8138A42337
17931A2868b5668l36008a3105A26320c01633A44161J19672f0402a1382j62414
17921a73796E8920a47211c4666j51790C4690q661J8162a9417f388j0753A78062
17909a58266A15055A9033P4200d2035L746r580A231c30669g4538A57216d59386
$$ plain form
17897 -205244 -72828 37977 45221 252575 161359 -69415 126923 -83761 37800 28453 156696
17886 156696 -42239 84610 -78713 -180306 -432264 -5937 182554 -146439 20661 -145228 -214133
17875 -214133 116434 624060 -217785 -228426 -13842 -42772 -338627 -337164 31080 -312722 3876
17863 -61983 -318254 -115015 94039 462928 4806 9133 -116865 -179949 -65615 -18262 129923
17851 -968 -35976 -188498 -50380 -79113 -53391 33594 166469 -162620 219133 126167 -261742
17839 50715 -279489 -38512 -23905 69063 -103977 -30566 -174061 -262046 33272 81986 -186255
17827 45797 -187912 -256721 240188 31821 -9440 -46509 -23029 -120864 74179 63375 -459526
17815 -68317 -13361 -139892 -13435 193531 -122293 292897 296286 128211 21660 -42156 61813
$$ packed form
17897b05244g2828C7977P244K07354r1216f9415A26923h3761C7800r347J28243
17886A56696d2239H4610g8713j01593k51958e937A82554a46439B0661a45228o8905
17875b14133A16434N07626b17785j0641a3842k8930k95855J463C1080c12722C876
17863f1983k56271a15015I4039L68889D806M327a16865o3084f5615a8262A29923
17851i68l5008j52522e0380k8733K5722C3594J32875a62620B19133r2966b61742
17839E0715b79489c8512J4607F9063a03977c0566j43495q7985C3272M8714a86255
17827D5797a87912o8809B40188C1821i440l7069b3029r7835G4179j0804d59526
17815f8317a3361j26531a3435A93531a22293B92897L389A28211B1660d2156F1813
$$ plain form
17803 50503 -132636 -116857 39669 -16157 -208781 -87103 -355573 189228 153610 89489 51780
17792 51780 103455 140465 -116306 -20405 80009 -120793 101119 -157209 147807 -187181
17781 -284793 134253 -127910 -2170 327342 143861 -14894 118149 -271373 70285 -160994
17770 251145 -54737 34211 -363566 -122582 -165016 350245 -277235 15729 -144829 -87832
17760 -87832 -36424 -57106 -137971 -130772 -94766 -169403 74776 -266676 -252462 9286 -164763 38578
17747 -69207 44608 -89473 -156359 93417 -70245 289279 63198 -37923 172310 37516 6942
17735 -292030 -39804 -69748 143122 116289 -4745 -142350 -122300 84167 -291679 -184208 -101411
17724 -101411 -150693 148484 34505 249152 97435 179818 -78949 -53169 15397 116271 -138380
$$ packed form
17803E0503a32636J5779C9669a6157j92624h7103k68470A89228l5618o4121l7709
17792E1780N1675L7010a16306b0405H0009a20793A01119a57209A47807a87181
17781b84793A34253a27910b170C27342A43861a4894A18149b71373G0285a60994
17770B51145e4737C4211c63566a22582m2434C50245b77235A5729a44829N6997
17760h7832c6424k0682q0865P199L6006p4637G4776b66676J4214I286a64763C8578
17747f9207D4608h9473o6886I3417g0245B89279F3198c7923A72310C7516F942
17735b92030c9804k9944A43122k6833d745j37605K0050H4167b91679J07471Q2797
17724a01411m9282A48484C4505K14647I7435Q2383g8949K5780A5397J00874a38380
$$ plain form
17712 19050 -150662 218060 -127604 -21909 93225 212385 -39715 198468 -25347 -216057
17702 -216057 237654 -81420 -21038 -239293 242018 220168 -92179 -9398 -45056 258316 -21811
17690 -163246 250955 45831 -9719 202410 340415 -249828 42012 -20199 280602 35903 -448919
17678 110181 188755 -157207 32472 73481 402866 -347884 -100984 -226317 -21619 -268733
17668 -268733 88644 184508 160417 -214822 -360124 52362 185792 -136130 27048 255685
17658 255685 266727 261183 -328996 268800 105234 -1283 -138285 -392465 114806 -466139
17647 -161996 153608 21643 -266690 -7968 275038 198954 301534 134787 316956 135396
17636 217924 318569 -76272 88830 303305 -196269 -134317 316428 -127951 -100742 -79682
$$ packed form
17712A9050a50662B18060a27604b1909I3225J19160c9715A98468b5347j90710
17702b16057B37654h1420b1038k18255B42018k1850i2179i398l5658B58316b1811
17690a63246B50955D5831i719B02410J38005b49828D2012b0199B80602C5903d48919
17678A10181P8574a57207C2472M1009L29385c47884a00984j25333b1619k47114
17668b68733H8644R5864k4091b14822j45302E2362J33430a36130B7048K28637
17658B55685J1042n544c28996B68800A05234a283j37002k54180A14806d66139
17647a61996A53608B1643b66690g968B75038p6084J02580A34787J82169A35396
17636B17924J00645g6272H8830K14475a96269O1952C16428a27951K7209K1060
$$ plain form
17626 -79682 -155506 40495 93531 -217503 202239 208115 9643 172713 -2406 98045 440307
17615 440307 159044 115981 368283 277673 472387 65114 50518 -70267 -9638 159355 8079
17603 -42459 208596 -73256 180750 -100620 -143170 -182132 -85174 -147328 -20692 -226281 -247227
17592 -247227 89757 -172029 -43191 -136704 165950 -92100 -205529 155935 224383 30320 143534
17581 143534 -38159 -49644 -160833 -40747 -187751 -22995 96758 -26991 -242888 257207 -41044
17569 -82095 305499 -30458 335169 158131 -88205 55243 -153506 158585 40469 144124
17559 144124 -90181 282567 -186132 -175936 57505 221638 -29013 480564 55724 -40653 42206
17547 -71482 107495 -99137 132074 -148028 -188995 332880 224069 -109122 302258 34547
$$ packed form
17626g9682p5824D0495N3036b17503B02239N876I643J63070b406I8045L42262
17615D40307A59044m3063K52302r0610J94714F5114j4596g0267i638A59355H079
17603d2459B08596g3256A80750a00620m2550l8962h5174o2154b0692k05589k0946
17592b47227H9757a72029d3191r3513A65950i2100j13429A55935O8448C0320J13214
17581A43534c8159j1485j11189d0747j47004b2995I6758b6991k15897B57207d1044
17569h2095C05499c0458C35169A58131h8205E5243a53506A58585D0469J03655
17559A44124i0181B82567a86132J0196E7505J64133b9013D80564E5724d0653D2206
17547g1482A07495i9137A32074a48028m0967C32880j08811a09122C02258C4547
$$ plain form
17536 120802 114963 -27475 30329 27133 -93407 193577 -46451 132049 -1308 200946 -6565 -54848
17524 -54848 -66408 39176 168442 -6047 92655 357318 84570 -157841 -126566 45121 366202
17513 366202 -37101 -122007 87649 326219 -902 180579 274810 217948 -228231 260376 -43588
17501 -84466 -45255 131051 35879 -22391 -33522 -42119 -197901 -228657 -212507 139749 14849
17489 137540 386943 32480 302436 43685 366676 265070 -99874 -222331 81371 184706
17479 184706 22797 -176124 -38825 141903 -23765 56073 3090 152444 -58731 443164 328697
17468 328697 185754 55446 -240066 -237847 -109920 5499 -64196 -285737 94584 40989 168103
17457 168103 -19120 277674 214392 141733 57491 230412 366383 131982 596091 266322
$$ packed form
17536A20802n839b7475C0329l196i3407A93577d6451A32049a308B00946f565m8283
17524e4848j1560C9176J29266f047I2655K64663H4570a57841L1275D5121L21081
17513C66202c7101q4906H7649K38570i02A80579R4231n6862b28231B60376d3588
17501h4466L9211A31051C5879b2391j1131q597j55782l0756J6150A39749A4849
17489A37540K49403C2480K69956D3685L22991j01606i9874j22457H1371J03335
17479A84706B2797a76124c8825A41903b3765E6073C090J49354e8731D43164j14467
17468C28697j42943E5446b40066K219a09920E499f4196k21541I4584D0989J27114
17457A68103a9120B77674o3282p2659E7491J72921J35971A31982M64109B66322
$$ plain form
17446 236110 376194 250113 -40987 47677 109474 110417 327059 225725 124868 8822 540240
17435 540240 -81190 147433 182305 228472 6453 -61946 268907 362193 -20337 -40726 260245
17423 373085 8452 528904 272965 -7359 175572 268951 -18178 596368 162841 503550 289270
17412 289270 300600 25699 -217454 71640 104360 383942 64422 140666 119909 379242 73184
17400 59414 236099 168506 -12576 -34697 312253 239166 201686 -17416 537 -93682 -103502 203721
17387 371325 35204 -103905 135666 334017 73292 137738 189664 380156 -343522 380355
17376 100253 420253 141723 267764 352127 40671 148241 -387342 -11072 119398 -59485
17365 62381 130772 194747 200103 313427 181074 131411 207824 35225 282444 28223 -86986
$$ packed form
17446B36110J40084j26081d0987D7677O1797R43K16642j01334j00857H822N31418
17435E40240h1190A47433L4872M6167F453f1946B68907R3286b0337k0389B60245
17423C73085H452N20452k55939g359A75572R3379a8178E96368A62841L40709k14280
17412B89270J1330B5699b17454G1640L2720K79582F4422P6244k0757K59333G3184
17400E9414J76685o7593a2576k2121C12253p3087l7480a7416E37i3682r820B03721
17387C71325C5204a03905A35666J98351G3292O4446N1926J90492c43522C80355
17376A00253L20000A41723J26041Q4363D0671J07570c87342a1072A19398e9485
17365F2381O8391O3975N356J13324j32353m9663P6413C5225K47219B8223h6986
$$ plain form
17353 -145049 212071 -11058 -66507 160800 140025 -48558 107685 223472 187212 -99831 -7228
17341 22049 239199 32343 302647 -128631 203716 91720 307670 417219 77989 77463 265049
17330 265049 204845 392043 -72160 105889 72308 175610 -72722 -66503 -46004 71407 -32281
17318 275032 -28358 -93811 47075 -376097 -42725 370864 197131 172841 48557 238918 190313
17307 190313 101747 -129574 272817 340793 24348 160692 99507 185197 -98236 36651 230880
17296 230880 299510 135215 -96984 54155 220650 -222554 225158 191592 179357 189867 54997
17284 11585 85415 -9645 127641 126618 -83226 232422 211891 233464 133315 67713 240054
17273 240054 249351 -1218 90483 256970 306024 37479 -9135 -2153 177236 276084 247483 98056
$$ packed form
17353a45049B12071a1058n5449A60800k0775d8558A07685J15787l6260i9831g228
17341B2049K17150C2343K70304a28631B03716I1720K15950J09549G7989n26J87586
17330B65049o0204J87198g2160A05889l3581J03302g2722O219K0499G1407c2281
17318B75032b8358o5453D7075c76097d2725C70864j73733k4290D8557J90361m8605
17307A90313q8566a29574B72817O7976B4348J36344o1185Q5690i8236C6651J94229
17296B30880O8630A35215i6984E4155J66495b22554B25158l3566j2235J0510E4997
17284A1585P3830i645A27641j023h3226B32422k0531K1573j00149o5602J72341
17273B40054R297a218I0483J66487M9054C7479i135b153A77236R8848k8601I8056
$$ plain form
17260 74728 26597 22239 53533 218463 -128222 -6924 290173 102261 122303 154063 112372
17249 112372 455840 225494 57067 448215 476860 168237 -27354 185567 235075 138570
17239 138570 315985 238395 280740 21414 247402 117927 -3117 393457 253140 122846
17228 220987 357807 -69940 295361 -42720 434846 179981 225812 256745 426729 102086
17217 -37663 162167 130931 -373120 244595 -7137 280710 130098 335393 -146753 145050
17206 348156 358397 322048 435503 -21963 269903 -50202 386429 340057 342322 283432 384931
17195 384931 228933 345388 170927 294391 329243 96934 -10261 208006 426464 253940
17185 253940 327055 380837 133650 -15529 353874 344574 248640 316253 399893 173896 370950
$$ packed form
17260G4728B6597m358L1294J64930a28222f924B90173A02261K0042L1760m1691
17249A12372L43468B25494E7067L91148K8645A68237b7354A85567M9508r6505
17239A38570J77415p7590M2345B1414K25988A17927c117C93457j40317A22846
17228B20987J36820f9940B95361d2720D34846A79981M5831L0933J69984A02086
17217c7663A62167l1236c73120B44595g137B80710A30098K05295a46753A45050
17206C48156J0241l6349J13455b1963B69903e0202C86429m6372K265n8890J01499
17195C84931j55998J16455A70927J23464L4852I6934a0261B08006K18458j72524
17185B53940P3115N3782A33650a5529C53874r300r5934O7613Q3640A73896J97054
$$ plain form
17174 370950 216644 -22124 116783 360811 40240 89000 506406 192277 352170 171719
17163 15570 155233 254844 241649 -9197 322369 165903 399811 384640 219222 336831 469827
17152 469827 -177340 706122 245209 147046 316768 129681 423731 477307 226140 -50593
17141 353112 153665 228178 272490 177096 253276 682298 321883 328911 339774 50739 347118
17130 347118 196093 239334 78708 397368 291608 124438 239101 361520 139105 414485
17120 414485 -79945 355482 185243 185742 191903 409714 -48702 242930 312043 368816 520589
17109 520589 174979 591086 365769 82061 522407 210877 313376 177856 687160 590127
17099 590127 462676 33870 335055 581644 66300 164284 568481 228748 705151 165579
$$ packed form
17174C70950j54306b2124A16783K44028D0240M8760M17406A92277J59893A71719
17163A5570J39663R9611j3195i197C22369j56466K33908j5171j65418J17609J32996
17152D69827a77340G06122B45209r8163J69722A29681K94050N3576B26140e0593
17141C53112A53665P4513M4312r5394P6180M29022C21883P028J0863E0739K96379
17130C47118j51025M3241G8708L18660j05760A24438J14663J22419A39105K75380
17120D14485g9945C55482j70239M99O161K17811d8702B42930O9113N6773J51773
17109E20589A74979M16107k25317H2061M40346B10877J02499j35520N09304r7033
17099E90127j27451C3870L01185K46589F6300R7984M04197B28748M76403A65579
$$ plain form
17088 459294 240901 287635 516969 513976 472408 152392 245886 426962 356458 267279 388331
17077 388331 372963 547698 685115 479453 83481 356823 566578 409738 460018 437952
17067 437952 540559 394953 372422 572113 332515 438055 522806 325315 601531 247933
17056 431560 348398 171039 616485 257321 333044 480001 858356 634367 816707 362668
17045 436674 497083 385947 390200 328812 429793 410032 499250 520711 346341 732277 554667
17034 554667 552321 485577 392587 506024 515143 477557 664934 536956 511755 390139 843495
17023 843495 416216 518366 655569 695757 817288 705743 537436 834946 216623 666504
17013 666504 545226 628871 736275 539408 595812 490750 669268 949481 523383 932928
$$ packed form
17088D59294k18393M6734K29334k993m1568A52392R3494J81076p0504q9179J21052
17077C88331j5368J74735J37417k05662H3481K73342K09755j56840N0280k2066
17067D37952J02607j45606k2531J99691k39598J05540Q4751j97491K76216B47933
17056D31560q3162A71039M45446B57321P5723J46957L78355k23989J82340C62668
17045D36674O0409j11136M253o1388J00981j9761Q9218K1461j74370L85936j77610
17034E54667k346o6744r2990J13437R119l7586J87377j27978k5201j21616M53356
17023H43495D16216J02150J37203M0188J21531j11545j68307K97510B16623M49881
17013F66504j21278Q3645J07404j96867N6404j05062J78518K80213m26098M09545
$$ plain form
17003 932928 421219 541555 739839 749707 537450 786895 606397 575643 427592 808827
16993 808827 646533 584320 379533 774699 740172 700794 755785 838794 519563 742576
16983 742576 772257 786287 676730 1250518 687053 1003363 721745 895620 723883 776430
16973 776430 844963 618477 929382 632667 599314 772879 1370634 976793 719257 1282811
16963 1282811 764571 1062468 991367 1102834 1223306 810710 826060 1082361 1061729 450849
16952 763586 832481 1029255 864668 1170774 1231023 1114787 829855 1032297 1048630 1246931
16942 1246931 1086756 949675 1036389 1250346 1321720 1138130 978493 1429142 1153561 916037
16932 916037 1127825 968440 1307773 1128562 1505011 1179424 1466724 1346260 1382394 1467138
$$ packed form
17003I32928D21219J20336J98284R868k12257K49445j80498l0754j48051L81235
16993H08827j62294o2213k04787L95166l4527l9378N4991Q3009l19231K23013
16983G42576K9681J4030j09557N73788n63465L16310k81618J73875j71737N2547
16973G76430O8533k26486L10905k96715l3353J73565N97755l93841k57536N63554
16963A282811n18240K97897p1101J11467J20472m12596J5350K56301k0632D50849
16952G63586O8895J96774j64587L06106O0249j16236k84932K02442J6333J98301
16942A246931j60175j37081Q6714K13957P1374j83590j59637M50649k75581k37524
16932I16037K11788j59385L39333j79211L76449l25587K87300j20464L6134Q4744
$$ plain form
16922 1467138 1107798 1106622 1422100 1610892 1326573 1098439 1718073 1351720 1377979 1704072
16912 1704072 1372361 1259835 1386621 1824628 1656663 1669835 1495605 1704779 1270810 1480298
16902 1480298 1596359 1700008 1747862 1838496 1777150 1477665 2065973 1693857 1788691 1535140
16892 1535140 1699368 1841618 1751786 1805542 2065112 2125977 2133742 1780150 2013529 2282904
16882 2282904 2235978 2316046 2130869 2443315 2215331 2414506 2235539 2237785 2317211 2128514
16872 2128514 2236593 2300851 2194360 2578901 2582989 2401814 2632648 2762101 2690778 2539937
16862 2539937 2758990 2225757 3080533 2623000 2880246 2709922 2941280 2949788 2957222 3302348
16852 3302348 3047128 2979374 3118952 3161471 3232090 3354745 3256926 3525940 3633001 3617761
$$ packed form
16922A467138l59340j176L15478J88792k84319k28134O19634l66353K6259L26093
16912A704072l31711j12526J26786M38007j67965J3172j74230K09174m33969K09488
16902A480298J16061J03649M7854R0634o1346k99485N88308l72116R4834k53551
16892A535140J64228J42250q9832N3756K59570O0865P765l53592K33379K69375
16882B282904m6926Q0068j85177L12446k27984J99175j78967K246P9426j88697
16872B128514J08079O4258j06491L84541M088j81175K30834J29453p1323j50841
16862B539937K19053n33233Q54776m57533K57246j70324K31358Q508P434L45126
16852C302348k55220o7754J39578M2519P0619J22655r7819K69014J07061j5240
$$ plain form
16842 3617761 3474925 3796173 3988364 4131769 3935356 3829125 4039998 3849052 4385104
16833 4385104 3894203 3994950 4274876 4718045 4151768 4774727 5034566 5021711 4955411 5525988
16823 5525988 5070781 5333880 5230647 5633629 5285616 5752910 5713318 5718342 6126824 6019237
16813 6019237 6227065 6353283 6460967 6572314 6898037 6941334 6949739 7290563 7212435 7584233
16803 7584233 7903555 8048439 8146749 8228170 8537562 8580027 8870859 9236308 9539235 9459028
16793 9459028 10210658 10300689 10105990 10387350 11034922 10962070 11704959 11748910 12398131 12452486
16783 12452486 13116708 13236120 13886169 14160508 14607303 15196003 15672642 16221972 16598556
16774 16598556 17263984 17733321 18373785 19142472 19880987 20476520 21236768 21903708 22760395
$$ packed form
16842C617761j42836L21248J92191J43405j96413j06231K10873j90946N36052
16833D385104m90901J00747K79926M43169n66277O22959K59839j2855o6300N70577
16823E525988m55207K63099j03233M02982l48013M67294l9592N024M08482j07587
16813F019237K07828J26218J07684J11347L25723M3297Q405L40824p8128L71798
16803G584233L19322J44884R8310Q1421L09392M2465K90832L65449L02927q0207
16793I459028P51630R0031j94699K81360O47572p2852P42889M3951O49221N4355
16783A2452486O64222J19412O50049K74339M46795N88700M76639N49330L76584
16774A6598556O65428M69337O40464P68687P38515N95533P60248O66940Q56687
$$ plain form
16765 22760395 23727072 24613862 25606522 27098726 28356622 29384389 30568618 31496073 32883595
16756 32883595 34573163 36094484 37468857 39473149 41417182 43707301 45567196 47876575
16748 47876575 50443267 52702195 55750582 58578170 61295567 64716781 68560934 72146833
16740 72146833 76261483 80348098 84933157 89543626 93981125 99351365 104876637 109948298
16732 109948298 115722800 121568547 127170122 132675693 138107872 143705846 148472894 152854786
16724 152854786 156984230 159868089 162191034 163984632 164802784 164528117 163274070 161273195
16716 161273195 158484980 155492871 150997132 146394935 140893730 135774337 130019513 124333537
16708 124333537 118913234 113081475 107304383 102100750 96707894 91586832 86946365 82405912
$$ packed form
16765B2760395R66677Q86790R92660J492204J257896J027767J184229R27455J387522
16756C2883595J689568J521321J374373K004292J944033K290119J859895K309379
16748D7876575K566692K258928L048387K827588K717397L421214L844153L585899
16740G2146833M114650M086615M585059M610469M437499N370240N525272N071661
16732A09948298N774502N845747N601575N505571N432179N597974M767048M381892
16724A52854786M129444K883859K322945J793598Q18152k74667j254047k000875
16716A61273195k788215k992109m495739m602197n501205n119393n754824n685976
16708A24333537n420303n831759n777092n203633n392856n121062m640467m540453
$$ plain form
16700 82405912 78155717 73826587 70202623 66493257 63080116 59887431 56859614 53918378
16692 53918378 51248256 48705448 46309512 44353514 42176207 40414000 38260647 37053191
16684 37053191 35410949 33588674 31981908 30608616 29508536 28379111 27142176 26171695
16676 26171695 25439744 24042419 23517861 22498737 21332028 21025915 20268149 19345996 19306067
16667 19306067 18480135 17630459 17341813 16423391 15955748 15344330 15185465 14640100 14149963
16658 14149963 13667714 13287076 13119434 12333590 12085991 11752793 11904448 11170667 10606171
16649 10606171 10817148 10342506 10053889 9814487 9427119 9425107 9230472 9193310 8792911 8222076
16639 8222076 8448879 8294500 7943698 7706616 7702258 6846181 7197963 6879960 7001823 6870142
$$ packed form
16700H2405912m250195m329130l623964l709366l413141l192685l027817k941236
16692E3918378k670122k542808k395936j955998k177307j762207k153353j207456
16684C7053191j642242j822275j606766j373292j100080j129425j236935r70481
16676B6171695p31951j397325n24558j019124j166709l06113p57766r22153l9929
16667A9306067q25932q49676k88646r18422m67643o11418j58865n45365m90137
16658A4149963m82249l80638j67642p85844k47599l33198J51655p33781n64496
16649A0606171K10977m74642k88617k39402l87368k012j94635l7162m00399n70835
16639H222076K26803j54379l50802k37082m358q56077L51782l18003J21863j31681
$$ plain form
16629 6870142 6671308 6544896 6195582 6198778 5875274 6051675 5825083 5767068 5614352 5498278
16619 5498278 5418001 5138253 5362268 5073355 4995417 4997376 4697200 4787998 4377141 4320731
16609 4320731 4397364 4259217 4324926 4362832 4279866 4241259 4085093 4205640 3559937 4064728
16599 4064728 3641929 3760207 3631368 3486806 3640810 3660502 3386214 3362099 3524643 3218267
16589 3218267 3237650 3045567 2981558 3112840 3134726 3015286 3048584 3004154 2659603 2604126
16579 2604126 2707556 2832892 2656057 2403007 2568648 2358570 2352827 2699639 2398915 2731622
16569 2731622 2691256 2568680 2285116 2544082 2324586 2399655 2562035 2352305 2073555 2258919
16559 2258919 2113787 1967042 1977166 1982056 1956243 1967335 2426931 1906051 2227635 1589924
$$ packed form
16629F870142j98834j26412l49314L196l23504J76401k26592n8015j52716j16074
16619E498278q0277k79748K24015k88913p7938J959l00176R0798m10857n6410
16609D320731P6633j38147O5709L7906q2966l8607j56166J20547o45703N04791
16599D064728m22799J18278j28839j44562J54004J9692k74288k4115J62544l06376
16589C218267J9383j92083o4009J31282K1886j19440L3298m4430l44551n5477
16579B604126J03430J25336j76835k53050J65641k10078n743L46812l00724L32707
16569B731622m0366j22576k83564K58966k19496P5069J62380k09730k78750J85364
16559B258919j45132j46745J0124M890k5813J1092M59596n20880L21584o37711
$$ plain form
16549 1589924 2208884 1958200 2062082 1743696 1744795 1689409 1837318 1785113 1903213 2000150
16539 2000150 1711081 1853014 1386131 2002207 1431256 1708381 1518274 1587495 1496043 1553515
16529 1553515 1544277 1649998 1598279 1495333 1906357 1342041 1362517 1401327 1389797 1280629
16519 1280629 1426146 1353405 1537080 1595414 1140895 1567827 1335387 1439038 1302598 1337919
16509 1337919 1098029 1147602 1250176 1061827 1315890 958516 1203899 1059966 1278485 1340824
16499 1340824 1345904 918696 1138782 1313868 1116365 734724 592800 1225471 931644 1333141
16489 1333141 1291854 1238913 1149120 1176348 1176059 808906 1361653 936174 841364 919082 1065741
16478 1065741 1147212 1559573 915550 1008053 1323275 792964 1033913 780246 1174870 801508
$$ packed form
16549A589924O18960k50684J03882l18386J099n5386J47909n2205J18100R6937
16539B000150k89069J41933m66883O16076n70951K77125j90107O9221r1452N7472
16529A553515r238J05721n1719j02946M11024n64316K0476L8810j1530j09168
16519A280629J45517p2741J83675N8334m54519M26932k32440J03651j36440L5321
16509A337919k39890M9573J02574j88349K54063l57374K45383j43933K18519O2339
16499A340824N080m27208K20086J75086j97503l81641j41924O32671k93827M01497
16489A333141m1287n2941q9793K7228k89l67153N52747m25479r4810P7718J46659
16478A065741Q1471M12361o44023R2503L15222n30311K40949k53667L94624l73362
$$ plain form
16468 801508 766074 614873 791753 771044 753424 580089 946358 612354 1028942 1020066
16458 1020066 987515 1008647 756889 656890 766505 736694 892182 725682 670610 994410
16448 994410 721911 735971 824966 785461 687190 859713 909226 825711 643935 665003 496686
16437 496686 830218 918343 682344 1016789 465936 775949 626385 1164561 348137 680324
16427 680324 702136 684366 928700 663001 647284 733051 593583 490265 786625 690078
16417 690078 544537 895899 533318 393789 695829 577408 548239 420544 735139 800795
16407 800795 755987 340332 215859 388809 432836 386152 586595 406433 451264 594621
16397 594621 595086 552140 505353 550196 558266 915610 343794 538482 381460 652156 282009
$$ packed form
16468H01508l5434j51201J76880k0709j7620j73335L66269l34004M16588q876
16458A020066l2551K1132k51758r9999J09615k9811J55488j66500n5072L23800
16448I94410k72499J4060Q8995l9505r8271J72523M9513q3515j81776K1068j68317
16437D96686L33532Q8125k35999L34445D65936L10013j49564N38176C48137L32187
16427F80324K1812j7770K44334k65699j5717Q5767j39468j03318K96360r6547
16417F90078j45541L51362l62581j39529L02040j18421k9169j27695L14595O5656
16407H00795m4808C40332j24473J72950M4027m6684K00443j80162M4831J43357
16397E94621M65m2946m6787M4843Q070L57344C43794J94688j57022K70696B82009
$$ plain form
16385 188498 634681 474973 441375 451780 626943 621801 631021 566101 457956 366232 478522
16374 478522 607227 196880 1097850 549625 198922 430151 660413 550123 477649 393860
16364 393860 165396 346090 655023 680922 477779 321348 644800 511217 295710 284052
16354 284052 548943 304671 357042 516911 483696 211517 525015 589108 345595 614829
16344 614829 666953 658113 156469 264323 437782 229108 606002 423551 334143 620905
16334 620905 319807 316836 220364 431148 565997 301888 298587 379119 523234 319176 205545
16323 205545 174415 528916 230162 552699 437404 143359 682374 412152 83267 164083
16313 164083 548159 295800 669972 282850 288749 467604 248438 183812 333263 508103
$$ packed form
16385A88498M46183j59708l3598J0405J75163n142R220o4920j08145r1724J12290
16374D78522J28705A96880R00970n48225A98922K31229K30262j10290p2474q3789
16364C93860A65396J80694L08933K5899k03143j56431L23452j33583k15507j1658
16354B84052K64891k44272N2371J59869l3215B11517L13498O4093k43513K69234
16344F14829N2124q840A56469J07854J73459k08674L76894j82451q9408K86762
16334F20905l01098k971r6472K10784J34849k64109l301Q0532J44115k04058j13631
16323B05545l1130L54501B30162L22537j15295A43359N39015k70222H3267Q0816
16313A64083L84076k52359L74172B82850N899J78855k19166o4626J49451J74840
$$ plain form
16303 508103 178516 553439 376356 74502 212381 752393 254006 543829 494012 226658
16292 226783 83881 454518 339708 15031 463379 265648 8884 403245 300160 243606
16282 243606 404034 140036 153971 158628 279793 266092 316860 375395 373095 99779 303708
16271 303708 259787 324904 525962 57076 373743 305571 73945 177091 316571 361067 517311
16260 517311 187525 37562 94229 227153 281698 223620 94857 208243 83798 431744 243087
16249 243087 239388 363244 374493 249318 256204 150816 43720 264788 400283 173850 185923
16238 185923 -135811 280256 207297 207668 157942 330566 6917 228317 232427 207477 316030
16227 316030 98971 277207 290135 232989 147609 -30060 14996 158375 507696 -229183 171318
$$ packed form
16303E08103A78516L74923j77083G4502J37879N40012B54006K89823m9817B26658
16292B26783H3881L70637j14810A5031M48348j97731H884L94361j03085n6554
16282B43606J60428A40036J3935M657J21165j3701N0768N8535k300I9779K03929
16271C03708m3921O5117K01058E7076L16667o8172G3945J03146J39480M4496J56244
16260E17311A87525C7562N6667J32924N4545n8078I4857J13386H3798L47946j88657
16249B43087l699J23856J1249j25175O886j05388D3720K21068J35495A73850J2073
16238A85923a35811B80256p2959L71m9726J72624F917K21400M110k4950J08553
16227C16030I8971J78236J2928n7146q5380c0060A4996J43379L49321b29183A71318
$$ plain form
16215 -122120 388577 514699 124352 161071 53769 445252 326652 -96760 430434 182562
16204 7915 343669 103109 106668 145356 117237 189569 194191 324160 361793 168091 278332
16193 278332 -71359 -70196 50743 185933 347967 265316 367073 155096 472854 107778
16182 271834 -71015 349408 252008 -50587 492568 137637 -139836 86101 211907 214704 84937
16170 -3822 -125975 -308116 -115641 328532 307247 195357 -207205 218790 182483 284028
16160 284028 419920 45164 42749 104454 146648 -60081 195841 389971 338283 79455 398716
16149 398716 9196 128700 117867 288459 132590 -194080 134089 480978 347034 291238
16139 291238 -352364 -6060 110014 149374 -220851 52989 140683 -115430 109713 109449 -180384
$$ packed form
16215a22120C88577J26122A24352L6719E3769L91483j18600i6760D30434A82562
16204G915L35754A03109L559L8688k8119P2332M622J29969L7633A68091J10241
16193B78332g1359J163E0743J35190J62034q2651J01757A55096L17758A07778
16182B71834g1015C49408r7400e0587D92568A37637a39836H6101J25806K797H4937
16170c822j22153j82141a15641C28532k1285j11890b07205B18790l6307J01545
16160B84028J35892D5164k415O1705M2194f0081A95841J94130n1688G9455L19261
16149C98716I196J19504j0833J70592A32590a94080A34089L46889j33944n5796
16139B91238c52364f060A10014L9360b20851E2989Q7694a15430A09713k64a80384
$$ plain form
16127 -136698 345385 -120992 17166 201531 -14446 96294 -45758 152892 183115 203936 209081
16116 209081 260602 122334 -147981 153227 -32432 -103620 333922 29725 281701 2326 -113987
16104 -90628 287328 553629 386246 79851 110286 88253 118148 26524 -170746 23538 304910
16093 304910 -122386 21247 -188338 244837 139008 375450 -30526 222642 81985 473944
16083 473944 -92172 -167950 163479 58870 85180 400962 -22474 260238 9471 66819 510098
16072 510098 -116611 253098 59120 217655 178932 -165439 -131033 58631 -161907 -185006
16062 -185006 -204218 379359 85783 -36886 208831 170051 -125078 -140832 -367532 -60712 32279
16050 -7581 291306 30263 -10790 141241 65824 -32497 -52926 -85500 126631 -24365 -120360
$$ packed form
16127a36698C45385a20992A7166J84365a4446I6294d5758A52892L0223K0821N145
16116B09081N1521A22334a47981A53227c2432p1188C33922B9725K51976B326a13987
16104i0628B87328K66301j67383G9851L0435k2033K9895B6524a70746B3538K81372
16093C04910a22386B1247a88338B44837j05829K36442c0526B22642H1985L91959
16083D73944i2172p5778A63479E8870K6310L15782b2474B60238I471N7348M43279
16072E10098a16611B53098E9120J58535l8723a65439L4406E8631a61907k3099
16062a85006j9212C79359H5783c6886B08831l8780a25078j5754k26700f0712C2279
16050g581B91306C0263a0790A41241F5824c2497k0429l2574A26631b4365r5995
$$ plain form
16039 -120360 56724 177974 -16399 -264288 8099 -201890 136684 -6703 201694 49891 -190618
16027 46330 268267 -45064 158516 -80733 -103285 12427 80080 169760 251088 42236 42520 -339874
16014 -105112 -252155 -18690 -130770 424559 234820 -283676 -126729 54534 43186 -94852
16003 -190195 119913 102789 38564 -38236 127649 152939 108660 10211 -206116 -53116 186346
15991 -45164 -52634 120497 111408 -104618 -186363 136166 250215 208828 -114985 233729 354019
15980 354019 -2027 -15724 226853 58259 -52027 372663 407116 277664 87894 25053 2518
15968 63695 -34856 68162 221455 231124 -34528 31854 -92153 98121 -184069 -170151 53521
15956 170018 -148502 -291772 93561 -170967 -68239 -139617 -40831 -201449 -64672 -308799
$$ packed form
16039a20360E6724J21250a6399k47889H099b01890A36684f703B01694D9891a90618
16027D6330K21937d5064A58516h0733k2552A2427O7653Q9680Q1328D2236K84c39874
16014a05112j47043a8690j12080D24559j89739b83676a26729E4534j1348i4852
16003a90195A19913j7124C8564c8236A27649K5290m4279A0211b06116e3116A86346
15991d5164p470A20497r089a04618q1745A36166J14049m1387a14985B33729J20290
15980C54019b027j3697B26853E8259e2027C72663L4453j29452H7894B5053B518
15968F3695c4856F8162J53293R669c4528C1854i2153I8121a84069J3918E3521
15956A70018a48502j43270I3561a70967f8239p1378d0831j60618f4672k44127
$$ plain form
15946 -308799 -69038 -181948 -235333 138896 -68421 -19368 -143561 -115875 -127088 37243 7943
15934 175757 148357 140399 33927 -71116 -20303 -219457 -214525 16473 -226486 -131600 -240855
15923 -240855 -183965 259250 116275 99485 -24824 296279 -73291 -57551 -210165 -188997 182581
15911 95262 121494 93162 285018 -140604 -93813 -306425 182684 -109388 38324 -142022
15900 -20032 87929 -329370 -173314 -41426 155947 -153943 14162 -134802 62509 70611 4261
15888 -84348 54299 462637 -70436 -216692 -177085 130635 -158506 -60895 5438 -42787 -42850 -28688
15876 -28688 -278352 180926 -194095 -240101 -133722 58637 -276854 -25450 196676 141025
15866 141025 9315 -222656 -194835 -215155 -178093 173759 -68043 238658 29475 156472 225463
$$ packed form
15946c08799f9038j12910n3385A38896f8421a9368j24193K7686j1213C7243G943
15934A75757k7400p958C3927g1116b0303j99154M932A6473b26486R4886j09255
15923b40855N6890B59250A16275j6790b4824B96279g3291J5740j52614K1168A82581
15911I5262K6232k8332J91856a40604M6791k12612A82684a09388C8324a42022
15900b0032H7929c29370J56056d1426A55947a53943A4162a34802F2509Q102D261
15888h4348E4299M08338g0436j46256L9607A30635a58506f0895E438d2787o3J4162
15876b8688k49664A80926a94095m6006J06379E8637b76854b5450A96676n5651
15866A41025I315b22656K7821k0320L7062A73759f8043B38658B9475J26997O8991
$$ plain form
15855 225463 -17154 -8043 224117 201133 -39755 88935 223581 97047 -205489 320004 81410
15843 91442 -113906 -91808 -1322 -52728 197354 -95018 -108953 -5915 515064 -21742 -228337
15832 -228337 -118684 -204677 -31406 24774 -43985 -107085 -173621 -156765 -9314 -90394 32235
15820 -261049 -51817 -99225 213070 -9721 -60238 -260185 96919 -176399 -206876 12162 -40444
15808 -122563 -19536 100065 686 -117571 -48771 152300 -1748 13452 -43419 -38249 -535450
15797 -535450 -255618 35656 70810 51386 -108732 -283245 -28136 242692 51480 -261959
15786 -46031 -165523 283836 -145553 -8054 -75898 -225106 -372805 -134458 211894 39452
15775 183311 -321557 -114369 -279528 -403631 -169543 -309591 -42895 55860 145447 -131466
$$ packed form
15855B25463a7154h043B24117k2984c9755H8935J34646I7047b05489C20004H1410
15843I1442a13906K2098a322n1406A97354i5018j3935e915E15064b1742k06595
15832b28337J09653q5993c1406B4774d3985o3100o6536J6856i314q1080C2235
15820b61049e1817m7408B13070i721n0517j99947I6919a76399l0477A2162d0444
15808a22563a9536A00065F86a17571d8771A52300a748A3452d3419N170m97201
15797e35450b55618C5656L5154j9424a08732j74513b8136B42692E1480b61959
15786d6031j19492B83836a45553h054o7844j49208j47699a34458B11894C9452
15775A83311c21557a14369j65159j24103a69543j40048d2895E5860Q9587a31466
$$ plain form
15764 -107391 13026 97908 -42875 170211 90071 -7891 365943 -13306 -78358 273890 -12795
15752 263974 105981 20089 9414 174010 102621 319431 2140 70283 162568 -141121 -232849
15741 -232849 34317 88296 -47145 23224 -104381 -424710 -107114 -39459 -101426 -374322 -82137
15729 168551 171602 -196306 243281 -72778 -70011 -41925 -65537 74678 -87421 -422776 42585
15717 -129995 -328993 -106924 131105 -119900 137989 -157212 -258192 40632 -23545 -191916
15707 -191916 -123640 51208 -181123 -70395 -31336 -189835 98365 -18619 -212848 58369 66710
15696 66710 -287290 -61959 -74575 23166 68152 -272969 125060 -197738 -267611 202335 12353
15684 -196820 -264896 166521 -305104 251134 -171158 -206595 -4304 7809 -82080 -174665 36867
$$ packed form
15764a07391A3026Q4882d2875A70211q0140g891C65943a3306o5052B73890a2795
15752B63974A05981B0089I414J64596p1389K16810B140O8143R2285a41121r1728
15741b32849C4317N3979d7145B3224a04381l20329a07114c9459o1967k72896h2137
15729A68551L051a96306B43281g2778K767K8086k3612G4678h7421l35355D2585
15717a29995j98998a06924A31105a19900A37989a57212j00980D0632b3545j68371
15707a91916O8276E1208a81123g0395c1336j58499I8365a8619j94229E8369Q341
15696F6710b87290f1959j2616B3166M4986b72969A25060a97738o9873B02335A2353
15684a96820o8076A66521c05104B51134a71158l5437d304G809h2080r2585C6867
$$ plain form
15672 -224680 -26996 -75540 -7193 29483 27820 -60382 -72889 125395 37422 -124214 -286032
15661 -286032 137977 -68606 445 -108673 248982 -43250 -11276 -24030 -52416 95704 -113918
15649 -251331 -24761 47105 23323 199580 -190978 175914 -139087 44511 -102033 -124687
15639 -124687 11843 37848 189407 236796 -45655 -70082 51295 -52814 54969 203180 35573
15627 -74491 158000 19887 -141181 -136886 -32362 -102008 286561 -85372 110007 -32128 -104580
15616 -104580 141062 -25727 -67437 -204550 -116155 -303721 -211635 -66517 -374236 -152353
15605 -16404 216237 -42405 257931 55313 -105691 -151951 -51727 117842 142017 -133859 161884
15593 -280217 -169984 -112512 22922 -257095 -90943 364767 -315208 200523 12640 -2114 179
$$ packed form
15672b24680b6996m8544g193B9483j663f0382j2507A25395C7422a24214j61818
15661b86032A37977f8606D45a08673B48982d3250a1276j2754k8386I5704a13918
15649b51331b4761D7105B3323J76257a90978A75914a39087D4511a02033k2654
15639a24687A1843K6005J51559M7389d5655k4427E1295e2814E4969J48211C5573
15627g4491A58000A9887a41181M295c2362o9646B86561h5372A10007c2128p2452
15616a04580A41062b5727m1710j37113Q8395j87566R2086f6517l07719a52353
15605a6404B16237d2405B57931E5313a05691m6260e1727A17842K4175a33859A61884
15593b80217J10233N7472B2922b57095i0943C64767c15208B00523A2640b114A79
$$ plain form
15581 -263703 -53737 345080 215147 35499 194767 -53874 170492 -31155 -300042 -213053
15571 -213053 89399 -101100 -19186 -128133 -297964 191329 -109167 66670 170490 170597 -55274
15559 184921 -96403 194508 261050 95568 -68466 -159996 204478 -126615 133650 -271961
15548 131768 231670 -75236 144168 -348890 208392 -290716 88937 75120 33334 158151
15538 158151 262077 -160608 195006 56060 125502 255158 -237959 489120 92515 -349501
15527 -526611 -153380 -275383 -366656 -192110 -294792 -98703 -130748 42679 415365 -57116
15516 -120259 105515 109386 251610 124587 167483 225703 -44407 -108336 128454 165470 -49068
15504 -241210 -283593 -102805 263216 -130388 138626 195710 -336053 -225309 -135050 118110
$$ packed form
15581b63703e3737C45080j29933C5499J59268e3874A70492c1155k68887Q6989
15571b13053H9399a01100a9186j08947j69831A91329a09167F6670J03820J07e5274
15559A84921i6403A94508O6542I5568f8466r1530B04478a26615A33650b71961
15548A31768R9902g5236A44168c48890B08392b90716H8937j3817C3334J24817
15538A58151J03926a60608A95006E6060O9442J29656b37959D89120I2515c49501
15527e26611a53380j22003r1273J74546j02682i8703l2045D2679L72686e7116
15516a20259A05515L871J42224A24587M2896N8220d4407o3929A28454L7016d9068
15504b41210m2383a02805B63216a30388A38626N7084c36053J10744R0259A18110
$$ plain form
15493 -28673 206510 -55850 -157015 -54380 -24684 230782 -95393 -56059 18189 144028 -252445
15481 286818 -135164 -271933 304292 -34846 240364 273697 -252848 75653 27717 109140
15471 109140 262242 -6496 -228844 47119 -187699 3841 -120893 44491 -32869 173001 -1658
15459 180561 227224 -102306 151663 -404684 -147792 -349027 5752 27698 -4846 191204 -374959
15447 -275508 -210935 371202 180268 16682 32297 -274623 -325050 173342 231229 -319429
15436 144075 2328 545576 129089 -18207 255636 -78896 68850 184095 -39618 113237 91180
15425 91180 -83450 71873 78575 83948 368066 -188098 -11775 269551 -9934 -30396 -15292 34685
15412 42444 -61065 56014 230470 -64686 138925 170682 -12845 -114794 -172501 135167 -17233
$$ packed form
15493b8673B06510e5850j01165e4380b4684B30782i5393L9334A8189J25839b52445
15481B86818a35164j36769C04292c4846B40364L3333b52848G5653B7717Q1423
15471A09140J53102f496k22348D7119a87699C841a20893D4491c2869A73001a658
15459A80561M6663a02306A51663d04684a47792k01235E752K1946d846A91204c74959
15447b75508O4573C71202A80268A6682J5615b74623n0427A73342N7887c19429
15436A44075B328N43248A29089a8207B55636g8896F8850J15245c9618A13237k2057
15425I1180h3450G1873O702N373K84118a88098a1775B69551i934k0462J5104C4685
15412D2444f1065E6014J74456f4686A38925L1757a2845j01949n7707A35167a7233
$$ plain form
15400 -9381 -202877 243039 -41691 -47540 101598 -170642 -427 215 81685 -97865 53882 211901
15388 211901 -165475 166246 -171654 -236533 -105858 99430 78860 16111 1314 15875 -273254
15376 163700 -134052 30040 -120966 311049 199122 -98579 25687 103485 -44575 -26817 251173
15364 157268 -328691 -99242 -237158 -114803 -177890 -114543 -81161 -283185 90128 133233 270114
15353 270114 252099 -139495 -2525 54502 116895 128151 -173185 -37931 -178096 -222756 161499
15341 -313460 -108321 -265148 -166011 423925 80158 -36365 -119704 -168114 -121309 186312 -73386
15329 -67992 47349 -45449 113185 137115 206204 -16413 -40074 -146614 99996 311118 -300924
15317 -14333 3713 -156720 -175973 97210 -190076 -294246 261355 -9591 -73043 302283 56595
$$ packed form
15400i381j93496B43039d1691n849A01598a70642d27B15Q1470i7865E3882J58019
15388B11901a65475A66246a71654o4879a05858I9430k0570A6111A314J4561b73254
15376A63700a34052C0040a20966C11049j11927i8579B5687P7798d4575J7758B51173
15364A57268c28691i9242j37916a14803o3087O3347L3382k02024I0128M3105J36881
15353B70114j8015a39495b525E4502O2393J1256a73185c7931j40165m4660A61499
15341c13460a08321j56827R9137D23925H0158c6365q3339m8410M6805A86312g3386
15329f7992D7349d5449A13185K3930O9089a6413k3661j06540I9996K11122c00924
15317a4333C713a56720j9253I7210a90076j04170B61355i591o3452C02283E6595
$$ plain form
15305 158263 68907 -136715 154028 -328979 252552 -106223 -216781 94263 -186345 -224430
15295 -224430 -194868 223853 -147966 112358 -177957 163192 -83357 -6993 347922 247059
15285 247059 323101 51483 83797 31188 179021 -20262 30068 -22765 -285225 35287 252134
15274 252134 324954 434015 -189822 -225992 -378084 -146693 66616 -102387 -99737 254860
15263 22984 -53418 52827 377395 -52927 352019 43354 -229991 339047 -238051 260190
15252 257397 278548 127805 517273 1120459 1295345 958285 844645 1692827 113135 495306
15242 495306 58651 -4302 363242 218837 213550 -72619 323005 181952 367405 76126 135592
15231 135592 93775 37281 172686 -126 -279189 255641 -61501 -49786 34005 -167044 294119
$$ packed form
15305A58263F8907a36715A54028c28979B52552a06223j10558I4263a86345l8085
15295b24430K9562B23853a47966A12358a77957A63192h3357f993C47922j00863
15285B47059P6042E1483L2314C1188J47833b0262C0068b2765k62460C5287K16847
15274B52134P2820J09061a89822l6170j52092a46693F6616a02387K650B54860
15263B2984e3418E2827L24568e2927C52019D3354b29991C39047b38051B60190
15252B57397K1151A27805L89468O03186J74886l37060j13640Q48182A13135L82171
15242D95306E8651d302C63242j44405n287g2619C23005j41053J85453G6126N9466
15231A35592m1817C7281J35405a26k79063B55641f1501J1715C4005a67044B94119
$$ plain form
15219 -83317 166050 -159674 75323 88942 32855 -465995 314567 28241 -34922 9098 115658
15208 115658 190358 -460337 -40853 373760 194179 -79612 -30180 80180 5009 -132558 155001
15196 52293 -133172 230257 -347910 -33153 242295 241688 -150700 -135742 -144851 30726 291176
15185 291176 -49572 -104714 -224277 60618 -26123 105056 104567 221586 -489514 46525 112780
15174 112780 272772 159401 -63821 309803 -82405 179098 -96965 121858 200704 -140385
15163 262376 209160 195975 404421 155627 128096 -40658 -37205 120146 -82022 -206973 -99864
15151 -97622 -53112 66872 -194371 503790 474424 -122212 -98451 39991 164508 231955 323649
15140 323649 72227 -79126 31856 167040 49212 -54665 100383 -115861 94034 -265615 -210371
$$ packed form
15219h3317A66050a59674G5323J3619C2855d65995C14567B8241c4922I098J06560
15208A15658P4700d60337d0853C73760j79581g9612c0180H0180E009a32558A55001
15196E2293a33172B30257c47910c3153B42295o07a50700J4958r109C0726K60450
15185B91176d9572n5142j19563F0618b6123A05056m89J17019d89514D6525O6255
15174A12780J59992j13371f3821C09803h2405A79098i6965A21858P8846a40385
15163B62376n3216j3185K08446A55627k7531d0658L453A20146h2022j24951i9864
15151i7622M4510F6872a94371E03790k9366a22212K3761C9991J24517O7447R1694
15140C23649G2227g9126C1856J35184D9212e4665A00383a15861I4034b65615N5244
$$ plain form
15129 -210371 219807 1083 46508 69073 344339 285947 156599 184288 -39040 -2713 -115355
15118 -115355 254407 88998 16823 -37239 73528 161675 282357 -68030 242860 51955 144846
15107 144846 204111 77308 316664 -11672 -324634 -10331 -76070 -125907 140607 346666 -26098
15095 -20681 128448 -168101 62055 -90995 268850 -346137 254378 69322 59618 188406 152523
15084 152523 6423 182042 -88446 17493 32677 347671 108509 79800 -70996 291859 19332
15072 389199 225883 329054 156065 -21917 -75247 -32123 138146 62488 39296 237365
15062 237365 151089 27430 107153 29251 324327 22920 264453 -187386 126597 52219 -187794
15050 295134 203561 52892 10062 229866 225207 37779 414699 8277 -132411 399245 107032
$$ packed form
15129b10371B19807A083M5425K2565K75266n8392j29348K7689c9040b713j12642
15118a15355B54407H8998A6823c7239G3528Q8147J20682f8030B42860E1955R2891
15107A44846N9265G7308K39356a1672l12962a0331o5739m9837A40607K06059b6098
15095b0681A28448a68101F2055i0995B68850c46137B54378F9322r704J28788l5883
15084A52523F423J75619h8446A7493J5184L14994A08509k8709g0996B91859A9332
15072C89199j63316J03171A56065b1917n3330c2123A38146F2488k3192J98069
15062B37365q6276B7430P9723B9251K95076B2920K41533a87386A26597E2219a87794
15050B95134r1573E2892A0062K19804m659C7779L76920H277a32411C99245A07032
$$ plain form
15038 254088 372401 26108 496978 159538 182697 91954 354779 179704 151250 311092
15028 311092 182998 304846 -108400 387147 -416074 350729 138342 95316 -171288 -134133
15018 -134133 -23607 355271 245378 329345 -107461 218069 279092 10191 108619 -13776 256404
15006 185265 358891 350075 256680 101758 74140 59970 -56255 246951 18341 104265 -14472
14994 135800 138592 72702 124798 -19562 450238 303246 602151 -10400 209383 250176 8692
14982 226536 413274 702860 253957 20001 145429 136811 176467 445765 51092 261469
14972 261469 -99245 354337 289696 242503 403999 14583 -101403 84298 -8511 262988 273404
14961 273404 -81940 383342 152439 297454 201386 193698 194470 225464 275479 162683 359369
$$ packed form
15038B54088J18313B6108M70870A59538K3159r0743K62825j75075k8454J59842
15028C11092j28094J21848a08400C87147d16074C50729A38342m3026a71288L7155
15018a34133b3607C55271j09893Q3967a07461B18069O1023A0191R8428a3776B56404
15006A85265J73626q816r3395A01758k7618j4170e6255B46951A8341Q5924a4472
14994A35800K792o5890N2096a9562D50238j46992K98905a0400B09383M0793H692
14982B26536J86738K89586B53957B0001J25428q618L9656K69298E1092K10377
14972B61469i9245C54337o4641m7193J61496A4583a01403H4298h511B62988J0416
14961B73404h1940C83342A52439J45015r6068p688P72L0994N0015j12796J96686
$$ plain form
14950 359369 47068 167551 167664 313735 259810 272073 30096 364365 352541 65360 203803
14939 203803 19830 465817 179531 523139 287554 75240 555096 8506 107925 317616
14929 317616 353519 290149 217674 308603 525799 433948 -122684 423066 253832 -30932 -109336
14918 -109336 98045 296490 240535 315481 85399 322960 273339 124247 334560 228566
14908 228566 251999 183914 334132 318476 406877 489121 379198 227150 467065 416838 180115
14896 381764 172286 247384 29085 187265 546096 329499 147901 70222 377565 327532
14886 327532 418618 402273 339396 496724 384647 123283 351479 182464 368306 224520
14876 224520 -91481 111041 201367 168097 494310 438623 503619 252672 566355 385665
$$ packed form
14950C59369D7068J20483J13J46071n3925J2263C0096L34269j1824F5360J38443
14939B03803A9830M45987A79531L43608k35585G5240M79856H506R9419K09691
14929C17616L5903o3370p2475R0929K17196r1851a22684D23066j69234c0932p8404
14918a09336I8045J98445n5955P4946H5399K37561m9621A24247K10313j05994
14908B28566K3433o8085J50218j5656Q8401Q2244j09923j52048K39915n0227A80115
14896C81764A72286P5098B9085J58180L58831k16597A47901G0222L07343n0033
14886C27532R1086j6345o2877J57328j12077A23283K28196j69015J85842j43786
14876B24520i1481A11041R0326l3270L26213n5687O4996k50947L13683j80690
$$ plain form
14866 385665 364987 197789 280193 370267 234410 426379 545623 415862 459762 447291
14856 447291 198465 577773 170101 313672 263412 545918 221671 494657 423751 278783
14846 278783 257207 510160 425655 359898 324982 309007 399453 128413 -31644 286014 430053
14835 430053 518146 559111 403757 568383 803002 409886 157319 440883 597319 186098
14824 282151 345168 55042 233482 405445 479461 122565 595231 436415 489568 314899
14814 314899 107048 114810 409747 233264 683546 227593 297404 281889 510476 368444
14804 368444 111215 254977 659514 191821 391585 91824 664236 611163 531455 200639
14793 404450 690582 363899 642245 731286 430420 577703 245333 404107 182880 294900
$$ packed form
14866C85665k0678j67198Q2404R0074j35857J91969J19244j29761M3900j2471
14856D47291A98465L79308A70101J43571n0260K82506B21671K72986p0906j44968
14846B78783k1576K52953q4505o5757l4916j5975R0446A28413c1644B86014J44039
14835D30053Q8093M0965j55354J64626K34619l93116A57319K83564J56436A86098
14824B82151O3017E5042J78440J71963P4016A22565M72666j58816N3153j74669
14814C14899A07048P762K94937j76483M50282B27593O9811j5515K28587j42032
14804C68444A11215J43762M04537A91821J99764I1824N72412n3073p9708B00639
14793D04450K86132l26683K78346Q9041l00866J47283B45333J58774A82880J12020
$$ plain form
14783 294900 576226 462486 812685 367628 314804 539564 706454 266872 432364 650444
14773 650444 579194 639890 256596 375030 184544 863107 405114 373096 419774 469807
14763 469807 478094 852229 703743 525329 417978 464121 726430 887283 664085 575820
14753 575820 408350 755751 594354 683324 719321 397573 452161 334028 786183 723721
14743 723721 636997 610732 586337 690732 658565 570623 722367 492737 472822 795909 631458
14732 631458 777242 830777 293692 653902 176584 576679 767502 350111 980259 617086
14722 617086 618378 554931 555252 739621 669902 244746 758255 691616 779205 615727 780260
14711 780260 576805 564244 1074779 498251 589726 537397 419560 802081 888958 654310
$$ packed form
14783B94900K81326j13740L50199C67628n2824K24760J66890B66872J65492K18080
14773F50444p1250O0696B56596J18434A84544O78563D05114l2018M6678N0033
14763D69807Q287L74135j48486j78414j07351M6143K62309J60853k23198q8265
14753E75820j67470L47401j61397Q8970L5997l21748N4588j18133M52155o2462
14743G23721q6724k6265k4395J04395l2167q7942J51744k29630j9915L23087j64451
14732F31458J45784N3535B93692L60210A76584M00095J90823C50111O30148l63173
14722F17086J292o3447L21J84369o9719B44746N13509o6639Q7589j63478J64533
14711G80260k03455j2561N10535D98251R1475n2329j17837L82521Q6877k34648
$$ plain form
14701 654310 862186 531488 763354 547192 635635 591075 757703 637206 773483 897812
14691 897812 958735 640514 818966 793609 820256 770173 659653 1040749 885649 784518
14681 784518 815267 1118212 1122558 972022 751545 778982 861019 696214 1057079 952685
14671 952685 685951 966909 1140073 879456 754534 921652 1162954 829574 824302 887341
14661 887341 942858 511654 1247874 972593 1121206 721992 940172 804279 1348987 1049632
14651 1049632 972634 1464915 1086561 936608 1031529 1148795 1037533 1273873 778800 1026345
14641 1026345 1184806 898735 1289629 1182182 1424252 1196018 1315738 901813 1013258
14632 1013258 1229282 1266321 982573 1107886 1094450 1006969 1032105 1129261 1629858 1603790
$$ packed form
14701F54310K07876l30698K31866k16162Q8443m4560J66628j20497J36277J24329
14691H97812O0923l18221J78452k5357K6647n0083j10520L81096j55100j01131
14681G84518L0749L02945M346j50536k20477K7437Q2037j64805L60865j04394
14671I52685k66734K80958J73164k60617j24922J67118K41302l33380n272O3039
14661H87341N5517m31204P36220k75281J48613l99214K18180j35893N44708k99355
14651A049632p6998M92281l78354j49953R4921J17266j11262K36340m95073K47545
14641A026345J58461k86071L90894j07447K42070k28234J19720m13925J11445
14632A013258K16024L7039k83748J25313j3436q7481K5136R7156N00597k6068
$$ plain form
14622 1603790 1178587 1126140 1215861 1377176 981142 1122950 1309915 1158017 1422979 1344574
14612 1344574 1383693 1389330 1340690 1403668 1366315 1173790 1054076 1444569 1351484 1429833 1267705
14601 1267705 1521695 1467492 1195971 1571183 1443443 1476588 1360811 1550797 1553194 1471229
14591 1471229 1542979 1279049 1610963 1573441 1652524 1364693 1773143 1711401 1419551 1496116
14581 1496116 1628180 1715626 1548441 1759794 2321152 1996823 1855513 1606160 1739763 1668345
14571 1668345 2112445 1904187 2088883 2185880 2161989 2225608 1966964 1959758 2066591 2112695
14561 2112695 2368428 2334247 2696203 2497198 2496519 3037236 2813969 3425291 3217981 3959471
14551 3959471 4242073 5359852 7308139 11340785 19503727 34380960 43023140 21169737
$$ packed form
14622A603790m25203n2447Q9721J61315l96034J41808J86965j51898K64962p8405
14612A344574L9119N637m8640O2978l7353j92525j19714L90493r3085P8349j62128
14601A267705K53990n4203k71521L75212j27740L3145j15777J89986K397q1965
14591A471229P1750k63930L31914l7522P9083k87831M08450o1742k91850P6565
14581A496116J32064Q7446j67185K11353N61358l24329j41310k49353J33603p1418
14571A668345M44100k08258J84696R6997k3891O3619k58644p206J06833M6104
14561B112695K55733l4181L61956j99005o79N40717k23267O11322k07310P41490
14551C959471K82602J117779J948287M032646Q162942J4877233Q642180B1169737
$$ plain form
14542 8673682 4212999 2641327 2243482 2147487 1698363 1785899 1892504 1739205 2078697
14533 2078697 1958020 1646888 2187303 1800872 1788511 1596755 1647378 1979526 2083247 2125492
14523 2125492 2529992 2289971 2118280 1730325 2333148 2287490 2282926 2228238 2077527 2513720
14513 2513720 2377168 2270306 2769565 2472720 2256586 2476614 2519719 2783748 2576954 2353469
14503 2353469 2609421 2474280 2743869 2786992 2669078 2906011 2573377 2702863 2839715 2992541
14493 2992541 2971391 3131793 3117391 3025105 3126009 3269055 3453089 3261333 3373687 3247710
14483 3247710 3080664 3358145 3146221 3349036 3608229 3476615 3226367 3493715 3394235 3854278
14473 3854278 3840087 3945271 3771371 3946314 3740450 3689168 4340382 4068090 3988777 4058664
$$ packed form
14542H673682D212999j571672l97845r5995m49124Q7536J06605j53299L39492
14533B078697j20677l11132N40415l86431j2361j91756N0623L32148J03721M2245
14523B125492M04500k40021j71691l87955O02823m5658m564n4688j50711M36193
14513B513720j36552j06862M99259k96845k16134K20028M3105K64029k06794k23485
14503B353469K55952j35141K69589M3123j17914K36933l32634J29486J36852J52826
14493B992541k1150J60402j4402r2286J00904J43046J84034j91756J12354j25977
14483C247710j67046K77481k11924K02815K59193j31614k50248K67348r9480M60043
14473C854278j4191J05184j73900J74943k05864n1282O51214k72292p9313O9887
$$ plain form
14463 4058664 4250694 4047975 4272593 4381925 4057455 4520243 4359435 4523423 4538677 4237751
14453 4237751 4594307 4728384 4725612 4799127 4710259 4992205 4719244 5120098 4911903 5464761
14443 5464761 5058765 5234652 4947319 5433094 5266477 5346568 5608668 5626155 5586638 5601230
14433 5601230 5618045 5967971 5605102 6102397 5755663 6099098 6184904 6181882 6318641 6748141
14423 6748141 6380035 6606855 6883915 6648531 7060972 7254936 7324173 7593292 7750492 7526807
14413 7526807 7403942 7783385 7961894 7923958 8236837 8158842 7990206 8511134 8303015 8532398
14403 8532398 8836000 9426387 9088230 8971776 9816829 9510670 9958379 10113993 10189058 10336286
14393 10336286 10542186 10788787 10808781 10857627 10969562 11224101 11635008 11717737 12305131 12244230
$$ packed form
14463D058664J92030k02719K24618J09332l24470M62788j60808J63988J5254l00926
14453D237751L56556J34077k772P3515q8868K81946k72961M00854k08195N52858
14443E464761m05996J75887k87333M85775j66617Q0091K62100J7487l9517J4592
14433E601230J6815L49926l62869M97295l46734L43435Q5806l022J36759M29500
14423F748141l68106K26820K77060k35384M12441J93964O9237K69119J57200k23685
14413G526807j22865L79443J78509l7936L12879p7995j68636N20928k08119K29383
14403H532398L03602N90387l38157j16454Q45053l06159M47709J55614P5065J47228
14393A0336286K05900K46601J9994M8846J11935K54539M10907Q2729N87394o0901
$$ plain form
14383 12244230 12416508 12998035 12702501 13272799 13535669 13450113 13738779 13740060 14045295 14621175
14373 14621175 15095478 15272906 15638123 15737470 16408131 16838882 16713282 17223451 17352213
14364 17352213 17854945 18105593 18347186 19208787 19416942 19829262 20014113 20576851 21502473
14355 21502473 21561109 22122187 22457216 23191927 23952268 24200197 25138416 25317152 25940694
14346 25940694 27003225 27652145 28041589 29033905 29574598 30569885 31408574 32243648 33309580
14337 33309580 33990838 35174161 36004047 37010807 38187966 39512254 40406490 41933616
14329 41933616 43296814 44607866 46140032 47535673 48916670 50495600 52652740 54009904
14321 54009904 55689847 57983152 60123049 62414471 64951810 67395873 69783668 72835496
$$ packed form
14383A2244230J72278N81527k95534N70298K62870q5556K88666J281L05235N75880
14373A4621175M74303J77428L65217R9347O70661M30751j25600N10169J28762
14364A7352213N02732K50648K41593Q61601K08155M12320J84851N62738R25622
14355B1502473N8636N61078L35029P34711P60341K47929R38219J78736O23542
14346B5940694J062531O48920L89444R92316N40693R95287Q38689Q35074J065932
14337C3309580O81258J183323Q29886J006760J177159J324288Q94236J527126
14329D1933616J363198J311052J532166J395641J380997J578930K157140J357164
14321E4009904J679943K293305K139897K291422K537339K444063K387795L051828
$$ plain form
14313 72835496 75294070 78576605 81570596 85093846 88688023 92412774 96701620 100984061
14305 100984061 105314809 110121045 115582169 120929587 126605711 132887765 139457697 146638353
14297 146638353 153664441 161673684 170045643 178779950 188087227 197854435 208433432 219558123
14289 219558123 231535520 243771714 257020864 270353909 284626903 299080217 314207823
14282 314207823 328990330 344210971 359472126 374385145 388568587 402328009 414654013
14275 414654013 425920568 435094915 442477739 444887181 445826188 446796867 448941408 447413829
14267 447413829 444785364 439546596 431013847 420356468 407739677 393490479 379027031
14260 379027031 363908764 347891969 331930375 316264096 300697010 286828819 272528024
$$ packed form
14313G2835496K458574L282535K993991L523250L594177L724751M288846M282441
14305A00984061M330748M806236N461124N347418N676124O282054O569932P180656
14297A46638353P026088Q009243Q371959Q734307R307277R767208J0578997J1124691
14289B19558123J1977397J2236194J3249150J3333045J4272994J4453314J5127606
14282C14207823J4782507J5220641J5261155J4913019J4183442J3759422J2326004
14275D14654013J1266555R174347P382824K409442R39007R70679K144541j527579
14267D47413829k628465n238768q532749j0657379j2616791j4249198j4463448
14260C79027031j5118267j6016795j5961594j5666279j5567086j3868191j4300795
$$ plain form
14253 272528024 258750626 245383595 232699050 220804671 209275739 198786685 188397143
14246 188397143 179146706 170282698 162098541 154271784 146889336 139675067 133022479 126839873
14238 126839873 121336277 116086472 110936142 105859672 101404198 96916559 93479854 89526630
14230 89526630 85842388 82464797 79322192 76005256 73406582 70700751 67786885 65252076
14222 65252076 63128651 60683858 58806427 56385236 54947873 53080641 51272519 49540113
14214 49540113 47890116 47026537 45410845 43919698 42195969 41107443 40208062 39092217
14206 39092217 38363724 37127744 35962629 34429878 34018560 32783429 32636995 31543329
14198 31543329 30393142 29700529 28954056 28284562 27779915 27218423 26304525 25216407 24733727
$$ packed form
14253B72528024j3777398j3367031j2684545j1894379j1528932j0489054j0389542
14246A88397143r250437q864008q184157p826757p382448p214269o652588o182606
14238A26839873n503596n249805n150330n076470m455474m487639l436705l953224
14230H9526630l684242l377591l142605l316936k598674k705831k913866k534809
14222F5252076k123425k444793j877431k421191j437363j867232j808122j732406
14214D9540113j649997q63579j615692j491147j723729j088526q99381j115845
14206C9092217p28493j235980j165115j532751m11318j235131j46434j093666
14198C1543329j150187o92613p46473o69494n04647n61492r13898j088118m82680
$$ plain form
14189 24733727 23920045 23811311 23046785 22606694 22293465 21742025 20983501 20471796 20121622
14180 20121622 19866376 19384842 19121850 18407802 18235491 17961025 17248431 17202761 16545858
14171 16545858 16006167 16111677 15927373 15718829 15181290 14698982 14464158 14288902 14130199
14162 14130199 13929927 13463332 13082751 13037783 13156223 12356470 12298675 12341546 11878500 11990034
14152 11990034 11740347 11465819 11004607 11151465 10652015 10850859 10819022 10228817 10272805 10099058
14142 10099058 9830119 9922437 9676433 9518233 9412076 8929565 9324325 9071648 8612455
14133 8612455 8878173 8796707 8371654 8382939 8261996 8277445 7874394 7918145 7877433 7650920
14123 7650920 7531511 7552773 6788789 6802926 6918987 7198192 7254572 6728457 6530803 6406147
$$ packed form
14189B4733727q13682j08734p64526m40091l13229n51440p58524n11705l50174
14180B0121622k55246m81534k62992p14048j72311k74466p12594m5670o56903
14171A6545858n39691J05510j84304k08544n37539m82308k34824j75256j58703
14162A4130199k00272m66595l80581m4968J18440p99753n7795M2871m63046J11534
14152A1990034k49687k74528m61212J46858m99450J98844l1837n90205M3988j73747
14142A0099058k68939R2318k46004j58200j06157m82511L94760k52677m59193
14133H612455K65718q1466m25053J1285j20943J5449m03051M3751m0712k26513
14123G650920j19409K1262p63984J4137J16061K79205N6380n26115j97654j24656
$$ plain form
14113 6406147 6385309 6776573 6291720 6437347 6512323 6112115 6101108 6177530 5927973 5914535
14103 5914535 5722357 5916190 5866608 5683175 5600331 5645370 5572663 5371654 5560204 5431967
14093 5431967 5101712 5166164 5291421 5021594 4879563 4917460 4823168 4864350 4679061 4559061
14083 4559061 4425154 4536273 4825868 4297504 4411721 4554797 4409671 4316705 4371698 4291007
14073 4291007 4357798 4321294 4195893 3995454 3793483 4039112 3811576 3525305 3666423 3322960
14063 3322960 3834839 3797189 3498673 3665939 3808372 3768919 3463220 3732876 3624808 3711611
14053 3711611 3457359 3154913 3332582 3117727 3143625 3295818 3117139 3219806 3046301 3366293
14043 3366293 2971484 3201266 2580927 2820336 2999881 2956976 2760204 3042645 2814260 2639511
$$ packed form
14113F406147k0838L91264m84853J45627P4976m00208j1007P6422k49557j3438
14103E914535j92178J93833m9582j83433q2844M5039p2707k01009J88550j28237
14093E431967l30255O4452J25257k69827j42031L7897r4292M1182j85289j20000
14083D559061j33907J11119K89595n28364J14217J43076j45126r2966N4993q0691
14073D291007O6791l6504j25401k00439k01971K45629k27536k86271J41118l43463
14063C322960N11879l7650k98516J67266J42433l9453l05699K69656j08068Q6803
14053C711611k54252l02446J77669k14855K5898J52193j78679J02667j73505L19992
14043C366293l94809K29782o20339K39409J79545m2905j96772K82441k28385j74749
$$ plain form
14033 2639511 2702221 2967532 2922959 3060939 2575384 2661151 2766811 2406593 2457372 2540366
14023 2540366 2721858 2449252 2690649 2379847 2594620 2581803 2708165 2431181 2293430 2257411
14013 2257411 2284538 2117041 2342123 2044743 1985577 2370786 2017185 2104795 2082093 2157429
14003 2157429 1997184 2120922 2414204 1973302 1939711 1655526 1834039 2286172 2099602 1753499
13993 1753499 2142315 2306753 2567999 2764362 3864936 6743914 13700781 28349276 42723418
13984 42723418 25706662 12790051 8067283 5602932 4199590 3793946 3114980 2880301
13976 2880301 2747516 2798304 2614011 2360324 2372165 2351287 2300265 2526591 2444219 2409549
13966 2409549 2222063 2078498 2153949 2088237 1948184 1681370 2121678 1845585 1993087 2290080
$$ packed form
14033B639511O2710K65311m4573J37980m85555Q5767J05660l60218N0779Q2994
14023B540366J81492k72606K41397l10802K14773j2817J26362k76984j37751l6019
14013B257411K7127j67497K25082k97380n9166L85209l53601Q7610k2702P5336
14003B157429j60245J23738K93282m40902l3591k84185J78513M52133j86570l46103
13993A753499L88816J64438K61246J96363J100574K878978O956867J4648495J4374142
13984D2723418j7016756A2790051m722768k464351j403342m05644o78966k34679
13976B880301j32785N0788j84293k53687J1841k0878n1022K26326q2372l4670
13966B409549j87486j43565P5451o5712j40053k66814M40308k76093J47502K96993
$$ plain form
13956 2290080 1985397 1990322 1714888 1775042 1924836 1882900 1743634 1720065 1647545 1913983
13946 1913983 1558790 1983629 1631064 1638627 1559436 1759585 1151177 1587802 1366846 1641436
13936 1641436 1730343 1517791 1593093 1197711 1414878 1826938 1613508 1733605 1633391 1733962
13926 1733962 1556450 1479483 1322087 1284946 1628638 1345850 1522384 1299678 1315368 1564420
13916 1564420 1427135 1410979 1094519 1452801 1335465 1468469 1403969 1290795 1161523 1440468
13906 1440468 1433770 1309233 1370727 1286575 1071897 948577 1527074 1284898 1422960 1272317
13896 1272317 1222948 1172833 1298723 1481352 1402363 1192277 1270844 1010859 1279998 1130712
13886 1130712 1054440 1286970 1487272 1009300 1052358 1391943 1173818 942473 1002899 1047631
$$ packed form
13956B290080l04683M925k75434O0154J49794m1936j39266k3569p2520K66438
13946A913983l55193M24839l52565P563p9191K00149o08408M36625k20956K74590
13936A641436Q8907k12552P5302l95382K17167M12060k13430J20097j00214J00571
13926A733962j77512p6967j57396l7141L43692k82788J76534k22706J5690K49052
13916A564420j37285j6156l16460L58282j17336J33004o4500j13174j29272K78945
13906A440468o698j24537O1494q4152k14678j23320N78497k42176J38062j50643
13896A272317m9369n0115J25890J82629p8989k10086P8567k59985K69139j49286
13886A130712p6272K32530K00302m77972M3058L39585k18125k31345O0426M4732
$$ plain form
13876 1047631 1135706 1392102 760017 1030861 1021039 1049398 1060672 1208473 1029486 816756
13866 816756 946284 1318698 1173834 830251 819288 1043268 1134865 692264 997859 1017061
13856 1017061 727808 877576 850675 721612 1226255 845651 466811 1179313 1083223 777779
13846 777779 905388 904050 1232194 880719 821689 1163066 969699 908894 951636 1081462
13836 1081462 1145109 716304 1250734 840332 1138684 731033 521081 1022639 1132594 743687
13826 743687 681836 829819 1117289 1127488 738848 678545 825339 689536 606820 698733
13816 698733 686307 873068 790711 1024918 812479 654002 699731 759224 857709 673720
13806 673720 873113 988477 639092 727822 686612 728705 974374 867614 741587 572255
$$ packed form
13876A047631Q8075K56396o32085K70844r822K8359J1274J47801j78987k12730
13866H16756J29528L72414j44864l43583j0963K23980R1597m42601L05595J9202
13856A017061k89253J49768k6901j29063N04643l80604l78840P12502r6090l05444
13846G77779J27609j338L28144l51475n9030L41377j93367o0805M2742J29826
13836A081462O3647m28805N34430m10402K98352m07651k09952N01558J09955l88907
13826G43687o1851J47983K87470J0199l88640o0303J46794j35803q2716R1913
13816F98733j2426J86761q2357K34207k12439j58477M5729N9493R8485j83989
13806F73720J99393J15364l49385Q8730m1210M2093K45669j06760j26027j69332
$$ plain form
13796 572255 746947 810668 1050838 1059540 841636 898190 759359 681667 626950 982042 686935
13785 686935 165161 455779 762880 765507 589335 527629 806229 376063 850104 442708
13775 442708 514766 578750 388322 593338 688984 855871 890286 485364 816974 445574
13765 445574 848044 735901 413543 417923 764298 786128 741623 100418 551944 608177
13755 608177 369006 865361 435480 770716 343222 560517 696892 646120 584735 768482
13745 768482 661729 647707 361171 571808 837748 538610 499276 438856 576945 484606
13735 484606 370274 717377 464349 569564 480580 821271 639009 778362 441779 547649
13725 547649 481360 467213 644328 579901 531055 508602 673068 444039 551193 742370
$$ packed form
13796E72255J74692O3721K40170Q702k17904N6554j38831p7692n4717L55092k95107
13785F86935A65161K90618L07101K627j76172o1706K78600C76063M74041m07396
13775D42708P2058O3984j90428K05016R5646J66887L4415m04922L31610l71400
13765D45574M02470j12143l22358M380L46375K1830m4505A00418M51526N6233
13755F08177k39171M96355m29881L35236C43222K17295J36375n0772o1385J83747
13745G68482j06753j4022k86536K10637K65940k99138l9334o0420J38089r2339
13735D84606j14332L47103k53028J05215q8984L40691j82262J39353l36583J05870
13725E47649o6289j4147J77115o4427m8846k2453J64466k29029J07154J91177
$$ plain form
13715 742370 938021 513082 282316 606424 620054 700889 774135 677548 476710 392248
13705 392248 865499 274524 569589 682094 570902 498256 334631 489614 765263 462622
13695 462622 306799 85859 413569 651685 500329 769623 640033 799380 631485 385708
13685 385708 297845 606596 534376 709814 166305 600180 154090 273118 437514 445687
13675 445687 654023 130098 195843 392104 421955 632980 442485 260631 688036 565154
13665 565154 423445 32246 104787 745161 361151 694230 350769 604100 230185 328159
13655 328159 585733 390526 503353 88162 381391 434537 121917 546905 480691 301076
13645 301076 375080 43291 159485 104941 289283 454244 664501 486390 206351 518634
$$ packed form
13715G42370J95651m24939k30766L24108J3630Q0835P3246r6587k00838q4462
13705C92248M73251B74524K95065J12505j11192p2646j63625J54983K75649l02641
13695D62622j55823H5859L27710K38116j51356K69294j29590J59347j67895k45777
13685C85708q7863L08751p2220J75438A66305M33875A54090J19028J64396Q173
13675D45687K08336A30098O5745J96261K9851K11025j90495j81854M27405j22882
13665E65154j41709C2246P2541O40374C61151L33079l43461K53331B30185R7974
13655C28159K57574j95207J12827H8162K93229N3146A21917M24988o6214j79615
13645C01076P4004D3291J16194n4544J84342J64961K10257j78111B06351L12283
$$ plain form
13635 518634 98143 192198 327357 181400 130740 196055 363071 335662 354979 413562 349907
13624 349907 553408 516871 566902 376423 318548 271869 220441 489924 505529 392636 273458
13613 273458 236986 176848 205575 -181081 280409 329254 17068 390718 336710 192401 226990
13602 226990 286311 581169 377364 358484 277951 478877 395363 248575 491431 82416
13591 157186 122427 773835 477678 509470 436368 346854 272958 560185 518035 406991 111917
13579 -164874 412508 333949 323870 385698 191115 131825 -219943 245101 594069 242069
13568 259369 508589 415806 261333 336684 322004 -144699 444826 253548 369823 536361
13558 536361 717673 646535 48606 209291 530979 39869 136922 -68941 278257 217721 293882
$$ packed form
13635E18634I8143R4055J35159j45957n0660O5315J67016k7409J9317N8583o3655
13624C49907K03501l6537N0031j90479n7875m6679n1428K69483J5605j12893j19178
13613B73458l6472o0138K8727a81081B80409M8845A7068L73650n4008j44309L4589
13602B26990N9321K94858k03805j8880q0533K00926q3514j46788K42856H2416
13591A57186l4759O51408k96157L1792p3102q9514p3896K87227m2150j11044A11917
13579a64874D12508p8559j0079O1828A91115n9290b19943B45101L48968B42069
13568B59369K49220r2783j54473P5351j4680a44699D44826j91278J16275J66538
13558E36361J81312p1138D8606J60685L21688C9869R7053f8941B78257o0536P6161
$$ plain form
13547 293882 316276 442565 307118 289649 134990 322084 388862 183015 274155 152478
13537 152478 320580 374370 220196 332420 453710 551019 94919 292100 330096 378264
13527 378264 496977 185324 195662 209095 167220 247432 56825 -62408 247288 69385 -125397
13515 342611 326143 105597 104420 409600 67346 281329 148104 293737 96918 141460 191634
13504 191634 -47437 338091 354607 3707 79729 293204 292439 274337 176812 62235 546585
13493 546585 353507 20758 353493 192358 340303 268916 172645 322807 42269 -64622
13482 113579 162845 -148315 83594 604662 287292 -64283 167324 44149 429695 298939
13472 298939 -15045 184558 289206 90323 10610 84519 -34577 48968 15031 -104657 8737
$$ packed form
13547B93882K2394J26289j35447j7469A34990J87094O6778A83015R1140j21677
13537A52478J68102N3790j54174J12224J21290R7309I4919J97181L7996M8168
13527C78264J18713A85324J0338J3433m1875Q0212E6825f2408B47288F9385a25397
13515C42611j6468A05597j177L05180F7346K13983j33225J45633I6918M4542N0174
13504A91634d7437C38091J6516C707P6022K13475p65j8102r7525F2235M84350
13493E46585j93078B0758L32735j61135J47945p1387r6271J50162D2269f4622
13482A13579M9266a48315H3594N21068B87292f4283A67324D4149L85546j30756
13472B98939a5045A84558J04648I0323A0610P3909c4577D8968A5031a04657H737
$$ plain form
13460 257043 202146 238738 136631 29371 417888 36069 244293 291628 207810 146735 16371
13448 409882 319197 9512 69365 19357 18494 291586 80355 576047 235284 408605 6382
13436 251200 171362 248698 456980 200891 -25647 145420 72313 423157 -30376 318987
13425 206984 408257 187608 601351 4647 244703 128661 329951 433965 -38630 250714
13414 324580 -176416 172553 240374 487232 460300 207510 -56634 308702 -75199 -81858 300739
13402 331381 402375 308897 264903 481743 257499 -42878 139364 28574 261852 153106
13392 153106 263707 287578 510610 515389 204761 186687 208649 17596 269308 69821 56632
13381 56632 84578 340495 580222 274315 -25105 54639 43526 236704 336797 185487
$$ packed form
13460B57043n4897L6592j02107B9371L88517C6069K08224M7335q3818o1075A6371
13448D09882r0685I512N9853A9357q63K73092H0355M95692B35284J73321F382
13436B51200p9838P7336K08282B00891b5647A45420G2313L50844c0376C18987
13425B06984K01273A87608M13743D647K40056j16042K01290J04014c8630B50714
13414C24580a76416A72553O7821K46858k6932B07510e6634C08702g5199o659C00739
13402C31381P0994r3478m3994K16840k24244d2878A39364B8574K33278j08746
13392A53106J10601K3871K23032M779B04761j8074K1962A7596K51712F9821j3189
13381E6632K7946K55917K39727B74315b5105E4639j1113J93178J00093j51310
$$ plain form
13371 185487 203278 237341 3913 265326 142658 511399 173270 -57288 97748 -109953 394327
13359 20421 152703 82284 441830 -76147 172262 64713 131746 199474 -143229 284906 193229
13348 193229 202405 33114 19693 614452 565348 84827 211384 192319 535479 169892 258606
13337 258606 180160 413830 121815 154240 195423 -49578 132860 138801 105749 -137915 475902
13325 467534 190336 255400 125095 105793 186833 40837 413836 540198 226940 69709
13314 268898 380493 122533 381350 133007 191606 80771 -134671 -14941 -268842 -148079
13304 -148079 195814 307767 180632 72969 166885 129515 -115938 16938 78691 139720 75034
13293 75034 155064 41210 340431 -190612 93084 -90788 178635 50405 64368 163446 280566
$$ packed form
13371A85487J7791L4063C913K61413j22668L68741A73270e7288I7748a09953C94327
13359B0421J32282p0419L59546g6147A72262F4713O7033O7728a43229B84906r1677
13348A93229R176C3114j3421N94759m9104H4827J26557j9065L43160A69892Q8714
13337B58606p8446K33670A21815L2425M1183d9578A32860N941l3052a37915D75902
13325D67534A90336O5064A25095j9302Q1040D0837L72999J26362B26940F9709
13314B68898J11595A22533K58817A33007N8599H0771a34671a4941k53901J20763
13304a48079A95814J11953j27135G2969R3916l7370a15938A6938O1753O1029o4686
13293G5034Q0030D1210K99221a90612I3084i0788A78635E0405J3963R9078J17120
$$ plain form
13282 280566 -53315 328491 450377 80277 78256 152865 203286 3952 16278 269750 -66795
13270 100799 198924 -9906 196501 287008 140605 -17918 25129 -94701 143591 183482 -101423
13258 -141142 302569 396310 203829 47727 249346 92240 355845 102840 229044 109416
13247 -191017 281223 157868 91432 -30017 183816 -18209 37423 -94930 56909 395081 -6823
13235 227690 -128422 419035 47206 275699 -78537 -114325 216591 475188 139247 -122428
13224 29710 217886 1189 -1210 82618 167149 18491 36186 303853 -185571 -38274 -148747
13213 -148747 11967 -229108 -212724 49824 134362 -67038 91533 13256 -31285 438971 -68104
13201 -118021 -149530 -133040 -110694 208185 324123 384536 71874 143822 186018 305636 4715
$$ packed form
13282B80566e3315C28491J21886H0277k021P4609N0421C952J2326K53472f6795
13270A00799R8125i906A96501R0507A40605a7918B5129i4701A43591L9891a01423
13258a41142C02569R3741j92481D7727K01619I2240K63605A02840J26204A09416
13247a91017B81223j23355o6436c0017A83816a8209C7423i4930E6909L38172f823
13235B27690a28422D19035D7206K28493g8537l5788B16591K58597A39247a22428
13224B9710J88176A189a210H2618Q4531A8491J7695K67667a85571c8274j10473
13213a48747A1967b29108J6384D9824Q4538f7038I1533A3256c1285D38971f8104
13201a18021l1509J6490K2346B08185J15938O0413G1874P1948M2196J19618D715
$$ plain form
13189 174587 61047 -1199 299277 378779 -170238 -205909 209146 -178515 -80680 140269 271220
13178 271220 192812 183037 147698 196979 28111 21648 -62296 209738 102479 -78588 -220078
13167 -220078 433333 112808 308654 -215116 338666 60676 61239 135311 189169 154591 -154676
13155 235777 315880 75577 -3923 166955 259154 475795 182585 217547 -199915 -51334 347012
13143 -191549 -111758 86998 217799 112107 -8563 -221406 30106 12947 -235178 191585 5758
13131 -34040 -282772 59703 122509 181107 -157658 295542 126098 -230829 -17039 105206
13120 190507 9916 96392 363796 31638 79649 66873 228682 -14679 -265443 116395 392042
13109 392042 217849 61357 372886 -43591 147954 86577 -5592 47150 553383 263437 -209950
$$ packed form
13189A74587F1047a199B99277P9502a70238l5671B09146a78515h0680A40269J30951
13178B71220p8408r775l5339M9281B8111o463f2296B09738A02479g8588j41490
13167b20078D33333A12808J95846b15116C38666F0676N63P4072N3858l4578a54676
13155B35777Q0103G5577c923A66955R2199K16641A82585L4962a99915e1334C47012
13143a91549P9791H6998J30801j05692h563k12843C0106A2947b35178A91585E758
13131c4040k48732E9703O2806N8598a57658B95542A26098b30829a7039A05206
13120A90507I916Q6476K67404C1638M8011j2776J61809a4679k50764A16395K75647
13109C92042j74193F1357L11529d3591A47954o1377e592D7150N06233B63437b09950
$$ plain form
13097 173728 -117390 62417 297165 82343 -3372 246645 -92161 -238430 -259455 131683 139638
13086 139638 460621 -71566 -441888 381768 117380 484303 180725 148208 4846 -113860
13075 165757 174640 24278 182986 -105191 63010 -81124 -19216 125489 199956 410570 -278207
13063 -33316 182673 115287 224504 418493 -42781 14809 134003 -92824 95172 116246 223298
13052 223298 234904 100467 340936 77607 175221 50933 313232 120992 17366 113739 294344
13041 294344 -86286 -39084 -37311 444588 57663 117045 70036 162284 -306245 45088 -24208
13029 182728 19578 117047 -97670 59185 72865 160005 221379 -313485 320444 26958 41858
13018 41858 159740 316721 68078 -28055 241949 294998 216467 236089 -37665 328396 -82736
$$ packed form
13097A73728a17390F2417K34748H2343c372B46645i2161j46269k1025A31683P955
13086A39638L20983g1566l70322C81768A17380L66923A80725l2517D846a13860
13075A65757Q883B4278J58708a05191F3010h1124a9216A25489P4467K10614b78207
13063c3316A82673o7386J09217J93989d2781A4809J19194i2824I5172K1074J07052
13052B23298J1606A00467K40469G7607R7614E0933K62299A20992A7366R6373J80605
13041B94344h6286c9084J773D44588E7663N9382m7009R2248c06245D5088b4208
13029A82728A9578R7469i7670E9185J3680Q7140O1374c13485C20444B6958J4900
13018D1858J17882J56981F8078b8055B41949N3049p8531J9622c7665C28396h2736
$$ plain form
13006 -183398 290338 -59493 -166395 81264 163191 170681 354294 -112130 -5241 -98818 334300
12994 -171703 4348 221175 83822 -161571 65819 53972 195150 203751 44862 211891 1394
12982 -133445 140797 -383154 -335407 -361771 275840 135844 -160766 42410 270398 269920 -22874
12970 6764 188095 -158346 317848 215880 346761 -76086 -240814 -12938 241677 -155595
12959 -22872 -63020 -174475 64438 247703 -165130 157567 464258 -121400 -42806 -64202
12949 -64202 3174 -17768 40951 87200 -226314 -116293 -76633 -124622 257119 11318 -92313
12937 202290 -136375 -189485 96231 375274 158159 163541 88978 -39560 -15389 -106693 49752
12925 -99042 -219343 -186484 170044 118475 166973 -61488 -235529 77604 49988 363472 127979
$$ packed form
13006a83398B90338e9493j06902H1264Q1927P490J83613a12130e241r3577C34300
12994a71703D348K16827H3822a61571F5819j1847J41178Q601D4862J67029A394
12982a33445A40797c83154M7747k6364B75840A35844a60766D2410K27988m78b2874
12970F764J81331a58346C17848j01968J30881g6086j64728a2938B41677a55595
12959b2872m0148j11455F4438J83265a65130A57567L06691a21400d2806k1396
12949f4202C174a7768D0951M6249b26314J10021L9660m7989B57119A1318i2313
12937B02290a36375n3110I6231K79043A58159N382p4563c9560a5389r1304D9752
12925i9042j20301L2859A70044n1569M8498f1488j74041G7604k7616L13484A27979
$$ plain form
12913 -70187 287107 131777 462716 125844 67435 56892 -214130 -105500 -25120 48553
12902 -144465 40175 143462 -74422 155115 -145848 86991 18353 208 -295939 13220 -15957
12890 40426 -86477 263115 93841 514239 124096 149838 115828 -12708 150870 198631 -45353
12878 46615 156234 -39178 317148 -116045 -16822 -46030 721 -251204 -120810 -107875 -70944
12867 -70944 33097 -84301 -57357 -196544 19073 -99669 -80282 345582 271651 -91892 -63230
12856 -63230 454672 132095 380769 -14584 -25401 105423 -93402 328459 55507 56362 395616
12845 395616 259927 77603 -125268 -79784 226079 213751 67528 -194463 -23652 -45659 370661
12833 184559 -66589 30597 -91 39381 73606 156759 17028 -245688 -101357 216198 50169
$$ packed form
12913g0187B87107A31777L30939A25844n8409j0543b14130a05500b5120D8553
12902a44465D0175J03287g4422A55115a45848H6991A8353B08b95939A3220a5957
12890D0426h6477B63115I3841M20398A24096K5742l4010a2708A50870M7761d5353
12878D6615J09619c9178C17148a16045a6822k9208G21b51204a20810J2935L6931
12867g0944C3097h4301K6944j39187A9073i9669J9387C45582p3931i1892K8662
12856f3230D54672A32095K48674a4584j0817A05423i3402C28459E5507Q55L39254
12845C95616j35689G7603a25268M5484B26079j2328F7528a94463b3652k2007C70661
12833A84559f6589C0597i1C9381L4225Q3153A7028b45688a01357B16198E0169
$$ plain form
12821 150208 1154 -63452 -170030 -117319 67902 -312021 -355679 116234 78059 401622 96144
12809 70487 -75474 148494 23871 72685 172541 95053 115525 11568 167310 113636 524371
12798 524371 -41055 88614 -211294 -57686 159413 -16144 -63732 206543 -74068 104392 -15120
12786 170018 -50375 40252 -94173 -259532 -115230 -122440 -101691 -107619 -125765 224607 70354
12774 -92142 -80354 -15091 61633 -161772 -212422 -327877 -358713 195892 -275009 352455 -33554
12762 77262 -60724 -128370 -154097 -147616 -375307 342961 173768 124368 -247115 -215916 -37667
12750 215600 88353 -108843 -188148 -17941 44611 171676 -114246 -109745 -150966 283338 199376
12739 199376 175247 -190434 375611 123051 151771 196356 192620 515748 220848 -160621
$$ packed form
12821A50208A154f3452j06578N2711F7902c12021m3658A16234l8175L23563I6144
12809G0487g5474A48494B3871M8814R9856p7488K0472A1568J55742n3674M10735
12798E24371d1055H8614b11294e7686A59413a6144m7588B06543g4068A04392a5120
12786A70018e0375D0252i4173j65359a15230p210K0749n928j8146B24607G0354
12774i2142J1788a5091F1633a61772n0650j15455l0836A95892b75009C52455c3554
12762G7262f0724o7646k5727O481k27691C42961j69193m9400b47115L1199c7667
12750B15600H8353a08843p9305a7941D4611J27065a14246M501m1221B83338q3962
12739A99376k4129a90434C75611A23051K8720M4585l736L23128B20848a60621
$$ plain form
12728 -326696 -227697 429985 -164598 68616 -331687 146450 13950 284570 61685 -155558
12717 -120513 -7893 -162442 9235 -120971 -48849 195596 147538 393945 292630 187717 -234687
12705 58171 239050 89287 270141 -29291 253753 -41072 295300 138560 333076 338520 155591
12693 214496 -297216 -23988 220158 6140 169009 147150 -3120 29722 -197623 -218244 -42066
12681 27393 78820 315001 208240 -10205 -914 10046 83798 242277 193187 -30571 -8628 77083
12668 -166879 -319477 3123 172445 -168396 -225652 115782 96226 -72540 473535 215089
12657 341198 471145 32278 195062 173932 -200025 -114482 369028 189636 6037 24341 111781
12646 111781 315133 25013 257594 104057 342725 -7763 -20538 30549 44570 168465 -80761
$$ packed form
12728c26696R8999D29985a64598F8616c31687A46450A3950K70620F1685a55558
12717a20513g893j54549I235a20971d8849A95596m8058K46407j01315j04913b34687
12705E8171J80879H9287J80854b9291B53753d1072B95300A38560J94516N444A55591
12693B14496b97216b3988B20158F140J62869k1859c120B9722a97623k0621d2066
12681B7393N1427K36181j06761a0205i14A0046P3752J58479m9090c0571h628G7083
12668a66879j52598C123J69322a68396n7256A15782j9556g2540D73535B15089
12657C41198J29947C2278J62784k1130b00025Q5543C69028j79392F037J8304Q7440
12646A11781K03352B5013K32581A04057K38668g763j2775C0549J4021J23895h0761
$$ plain form
12634 -56801 32335 164741 -2101 78487 249442 541395 340295 61178 251619 98462 226709
12623 226709 211398 -46283 75671 149745 134712 -144323 157716 -112729 41608 36766 75619
12612 75619 -137452 245398 57525 73598 -52573 -324138 -28062 332941 -41375 -129246 -27165
12600 -131868 -193958 418739 251718 -253867 45666 60346 73852 286805 152647 87130
12590 87130 -41073 146567 -59061 220179 -259762 119047 -235009 170857 -145625 150563
12579 135508 118906 -266521 62942 -247931 58631 -113787 -135074 -123161 216654 11223 -228143
12567 24330 19024 -25856 211178 -30640 -109051 -5929 142117 266177 -117773 -3407 -128826
12556 -128826 250847 -292525 -16311 116359 -28611 -139124 8082 -333371 99852 261364
$$ packed form
12634e6801C2335J32406b101G8487J70955K91953k01100F1178J90441I8462J28247
12623B26709j5311d6283G5671P4074j5033a44323A57716a12729D1608m842L8853
12612G5619a37452B45398E7525J6073e2573k71565b8062C32941d1375q7871b7165
12600a31868o2090D18739j67021b53867D5666J4680J3506K12953j34158o5517
12590H7130d1073A46567e9061B20179b59762A19047b35009A70857a45625A50563
12579A35508j6602b66521F2942b47931E8631a13787k1287J1913B16654A1223b28143
12567B4330n306b5856B11178c0640p8411e929A42117J24060a17773c407j25419
12556a28826B50847b92525a6311A16359b8611j10513H082c33371I9852J61512
$$ plain form
12546 261364 -242615 273283 -80220 -90114 115044 -134546 38488 -327512 -65014 30331 80515
12535 80515 98869 -64904 203630 139253 124627 -181707 362287 -118754 223779 -52702 -101361
12524 -101361 -164163 -129060 52859 119162 87644 65044 411650 368550 4774 188596 -296965
12512 52347 22141 10769 -99135 20 118644 -150118 16404 -115767 -219358 -134567 -108516
12501 -108516 54067 -107112 185382 -254926 -72342 -170622 408626 96004 -3440 -128417 182959
12489 249625 -39138 -98821 22154 11957 49575 186698 -13739 -269766 130988 349172 66763
12477 -118228 306574 -179888 139194 153917 -68832 -154553 -25794 -36776 -326951 -61627 -218600
12466 -218600 309448 -423071 145440 -52896 88678 413226 63661 -214483 -119921 -275710
$$ packed form
12546B61364b42615B73283h0220r894A15044a34546C8488c27512f5014C0331N0184
12535H0515J8354f4904B03630o4377j4626a81707C62287a18754B23779e2702m8659
12524a01361o2802L5103E2859O6303l1518k2600L46606m3100D774J83822b96965
12512E2347B2141A0769i9135B0J18624a50118A6404a15767j03591Q4791K6051
12501a08516E4067a07112A85382b54926g2342r8280D08626I6004c440j24977A82959
12489B49625c9138n9683B2154j0197L7618J37123a3739k56027A30988K18184F6763
12477a18228C06574a79888A39194J4723f8832q5721b5794j0982k90175f1627j56973
12466b18600C09448d23071A45440e2896H8678L24548F3661b14483R4562j55789
$$ plain form
12456 -275710 87735 -49207 12776 258558 -202890 -42958 131463 -64129 -55482 236663 314200
12445 314200 36012 3580 98479 -48601 -123876 -135290 -100803 216324 -111715 -33670 13252
12433 61754 -282473 103528 81993 361346 148016 34668 55595 155699 4857 276616 -102900
12421 207728 -209724 9190 -286443 -137413 -216938 -21142 -212680 -266816 -5013 -82939 -136911
12410 -136911 -131494 152951 -192203 -36114 43250 -11931 51369 121489 -33042 -185651 26336
12398 -109330 -84627 -288944 76563 -165245 -25922 77932 1363 -193868 -282809 299405 -98468
12386 200484 163973 447416 180670 -138541 43829 138896 -160330 224051 -531421 185742
12375 -289914 -32313 280639 100409 213375 6767 -56821 -178495 -24736 296646 -41285 -11045
$$ packed form
12456b75710H7735d9207A2776K45782b02890d2958A31463f4129Q647B36663P7537
12445C14200C6012C580R4899d8601p5275j1414L4487B16324a11715c3670A3252
12433F1754b82473A03528k1535K79353A48016C4668K0927J00104D857K71759a02900
12421B07728b09724I190b86443a37413p9525b1142j91538n4136e013p7926n3972
12410a36911N417A52951a92203c6114D3250a1931E1369P0120c3042j52609B6336
12398a09330K4703k04317G6563a65245b5922G7932A363a93868q8941B99405i8468
12386B00484l6511K83443A80670a38541D3829R5067a60330B24051e31421A85742
12375b89914c2313B80639A00409J12966F767e6821j21674b4736B96646d1285a1045
$$ plain form
12363 -61404 -167203 -104107 121286 66162 -110278 -98128 -202678 482084 -278114 -291702
12353 -291702 -279562 -399027 184368 152533 167865 -61815 280548 10855 182831 -238853
12342 -8847 -270643 32765 -333452 199450 82681 23308 80967 244248 250810 23644 267502
12331 267502 -100486 37159 -10442 223588 -241919 -52161 5618 -44718 -272254 162744 -84668
12319 -100346 -158704 214813 -47901 84087 187294 542142 -117318 -77964 425879 -51512
12308 100094 -140153 -55264 -406422 335560 135613 -111105 -143286 93419 223377 103452
12297 -69286 -201836 52090 30119 125518 67664 -167227 -158563 268242 -54395 148651 73318
12285 324335 146453 23770 30856 77299 -167407 -47244 86951 -110636 391723 270533 246917
$$ packed form
12363f1404j05799O3096A21286n5124a10278J2150j04550D82084b78114j3588
12353b91702J2140j19465A84368l1835J5332f1815B80548A0855J71976b38853
12342h847k61796C2765c33452A99450H2681B3308N7659J63281O562B3644K43858
12331B67502a00486C7159a0442B23588b41919e2161E618d4718k27536A62744h4668
12319a00346n8358B14813d7901H4087J03207L54848a17318L9354D25879e1512
12308A00094a40153e5264l51158C35560A35613a11105l2181I3419J29958A03452
12297f9286j32550E2090k1971R5399n7854a67227Q664B68242e4395A48651G3318
12285C24335A46453B3770P086M6443a67407d7244H6951a10636C91723j21190k3616
$$ plain form
12274 246917 -48852 129005 124461 -85644 -51208 162603 263597 265945 8583 -85659 -24732
12262 133559 -31868 -59078 -314002 97876 -58466 200658 48689 141134 99329 -26761 132534
12250 -38930 -216196 25523 288158 252308 156630 135474 -20694 -98646 -33699 57026 -69095
12238 38290 -150475 64549 -102152 226563 -129958 -79151 334742 -69919 310432 7544 148879
12227 148879 7415 177499 338551 362100 81471 261711 189484 62314 167355 230646 134345
12216 134345 211186 202850 265724 297569 183656 240232 -98845 365351 418472 190925 -152895
12204 147102 287936 -5233 124279 38707 -16052 110671 99216 419893 520047 252899
12193 343967 375645 216164 147243 277786 284625 -119595 96489 -22389 16391 -40202 86903
$$ packed form
12274B46917d8852A29005m544h5644L4436A62603J00994K348H583h5659b4732
12262A33559c1868k7210k54924I7876e8466B00658D8689R2445m1805b6761A32534
12250c8930j77266B5523K62635l5850r5678k1156b0694p7952c3699E7026f9095
12238C8290a50475F4549a02152B26563a29958N0807C34742f9919C10432G544J41335
12227A48879G415J70084J61052K3549H1471J80240p2227F2314J05041O3291r6301
12216A34345P6841q336O2874L1845j13913N6576i8845C65351N3121A90925a52895
12204A47102J40834e233A24279C8707a6052A10671j1455L20677J00154B52899
12193C43967L1678j59481o8921J30543O839a19595I6489b2389A6391d0202H6903
$$ plain form
12181 -122258 169717 303282 -13382 457946 -28662 -341094 50657 48811 357196 345291 67861
12169 218973 245453 103500 74374 30305 89084 175324 363241 135520 176339 330555 153003
12157 -149671 184728 51216 19228 -77969 264200 337275 53565 77854 -47335 -110747 62972
12145 -251510 -40244 128603 -17611 -134425 332706 288474 -207539 -18050 286256 113105
12134 -17138 -35718 126862 -139941 -37339 216092 -101313 -1836 137903 286262 2418 190965
12123 190965 326874 -25373 54286 187189 250224 150679 101959 116017 -9189 234622 -66864
12111 223502 -210871 -70169 84994 -5635 -45667 -72500 -11952 276411 215446 20521 -60145
12099 -151850 -131722 23291 -59780 -144437 -386481 -20498 68930 7385 -17725 302735 -295781
$$ packed form
12181a22258A69717J33565a3382D57946b8662l12432E0657j846L08385j1905F7861
12169B18973K6480A03500k9126C0305N8779Q6240J87917A35520M0819J54216A53003
12157a49671A84728E1216A9228g7969B64200P3075E3565K4289d7335o3412F2972
12145b51510d0244A28603a7611j16814C32706m4232b07539a8050B86256A13105
12134a7138j8580A26862a39941c7339B16092a01313a836A37903J48359B418J88547
12123A90965J35909b5373E4286J32903O3035r9545m8720J4058i189B34622f6864
12111B23502b10871g0169H4994e635m0032k6833a1952B76411o0965B0521f0145
12099a51850K0128B3291e9780q4657k42044b0498F8930G385a7725C02735b95781
$$ plain form
12087 153477 233783 -226576 152599 340962 -177068 -8167 422859 45616 -150096 162555
12076 54971 81517 -70321 277325 214560 45057 -66553 -135210 20259 63279 -121919 187388
12064 -76716 -6921 -170020 -271410 203828 107123 -75721 42970 113450 792090 1499019 262852
12052 -32278 -204187 23668 -222764 230877 135427 27440 -11148 72593 -347635 11944 131506
12041 131506 -272854 -108475 -240475 117065 -155726 77345 239461 -99663 -157331 -225151
12031 -225151 -25100 -39023 -221133 -43466 -254274 116760 -50401 277444 101377 211495
12021 211495 -21300 232540 412866 2799 -110518 96691 -415906 25726 -52356 152556 140896
12010 140896 106404 88114 -169980 61999 82287 235508 -132917 -227301 -112850 -110621 -171159
$$ packed form
12087A53477Q0306b26576A52599J88363a77068h167D22859D5616a50096A62555
12076E4971K6546g0321B77325o2765D5057f6553o8657B0259M3020a21919A87388
12064g6716f921j63099j01390B03828r6705g5721D2970P0480O78640P06929B62852
12052c2278j71909B3668b22764B30877r5450B7440a1148G2593c47635A1944J19562
12041A31506b72854a08475j32000A17065a55726G7345J62116i9663n7668o7820
12031b25151b5100j3923j82110d3466k10808A16760e0401B77444A01377J10118
12021B11495b1300B32540J80326B799a10518I6691d15906B5726e2356A52556j1660
12010A40896l4492j8290a69980F1999K0288J53221a32917r4384a12850K229o0538
$$ plain form
11999 -171159 45054 -29787 262459 266303 -94066 -15763 -61490 145858 -264593 -286080 -157879
11988 -157879 -182520 -211871 -46710 -47731 -200407 -98858 -110210 -96800 163850 -220185 -343333
11977 -343333 -252336 -186711 177157 63697 106403 -362776 -370955 -68574 -209596 -91245 131757
11965 143287 -137518 181956 203464 -153930 -121252 105725 -186640 -58728 -2025 -360940
11955 -360940 -342101 -83355 -36221 36208 -66806 -92926 24188 -179445 142535 3256 711 126377
11943 126377 352645 45669 72315 -154533 47433 85586 189417 140369 53479 -207082 -79812
11931 21793 -746 -194110 -336873 -35493 311476 -216055 45300 -350500 58456 -186556 373927
11919 -22334 47309 69987 78863 -72036 -20439 -93468 -16202 -229915 -211444 -99975 112222
$$ packed form
11999a71159D5054b9787B62459L844i4066a5763m5727A45858b64593k1487J28201
11988a57879k4641k9351d6710j021j52676i8858j1352J3410A63850b20185j23148
11977c43333R0997O5625A77157F3697M2706c62776q179f8574j41022i1245A31757
11965A43287a37518A81956K1508a53930L2678A05725a86640e8728b025l58915
11955c60940J8839h3355c6221C6208f6806k6120B4188a79445A42535C256G11J25666
11943A26377K26268D5669K6646a54533D7433L8153J03831m9048E3479b07082g9812
11931B1793g46j93364j42763c5493C11476b16055D5300c50500E8456a86556C73927
11919b2334D7309K2678Q876g2036b0439p3029a6202k13713J8471i9975A12222
$$ plain form
11907 -18499 -82701 -108304 82982 84312 -159043 194691 -46087 -233066 -39016 180800 195087
11896 195087 -152874 -83231 44781 170282 81781 347228 -261514 -47047 -246448 -129900
11886 -129900 153592 91475 -159027 -52696 -79655 241136 -66070 232580 -61695 -151489 -8802
11874 78695 58952 -280454 141458 -70678 187281 337602 45731 278421 146522 120329
11864 120329 -85672 -96413 -83287 43509 -46519 -143222 192411 242327 55225 70870 -194953
11852 195787 -119234 -244419 69814 -270310 -257430 -237859 -59255 55770 -380925 -59539 211279
11840 -18505 13034 185411 291110 294079 125148 163906 -292161 -305351 -351506 -254673 97979
11828 164755 13606 99552 -8052 32398 91994 -55189 -182891 -49064 114106 -132555 181266
$$ packed form
11907a8499o4202k5603H2982J330a59043A94691d6087j86979c9016A80800J4287
11896A95087a52874O9643D4781J25501H1781K65447b61514d7047j99401J16548
11886a29900A53592o2117a59027e2696k6959B41136f6070B32580f1695q9794h802
11874G8695j9743b80454A41458g0678A87281J50321D5731K32690j31899k6193
11864A20329h5672j0741J3126D3509d6519r6703A92411M9916E5225J5645a94953
11852A95787a19234j25185F9814b70310J2880J9571e9255E5770c80925e9539B11279
11840a8505A3034J72377J05699K969A25148L8758b92161j3190m6155R6833I7979
11828A64755A3606Q5946h052C2398N9596e5189j27702d9064A14106a32555A81266
$$ plain form
11816 18436 -9121 43581 261131 112649 84088 -72999 -123970 23866 -128841 -267437 -114402
11804 180693 -296771 -180947 -177184 255220 -41274 173059 -182077 -134456 -114310 -223227
11794 -223227 -43015 -187241 61263 -154002 10197 12182 70158 168122 153806 33978 -302562
11782 9050 245898 30417 -267934 172158 161444 -29763 316329 -374984 -89549 91015 152775
11771 152775 137785 106601 -503722 143941 -85862 52331 32874 -220003 6970 -259756 66821
11759 -210786 -50113 139330 -149897 127244 -74572 190823 298894 86090 36224 123203
11749 123203 188800 -43463 69173 -86127 -116481 -163434 55844 -234041 -51130 -24920 -221807
11738 -221807 149394 -78860 33487 -15926 250334 -66537 139938 183872 523684 -94493 220724
$$ packed form
11816A8436i121D3581K17550A12649k8561g2999n0971B3866a28841j38596a14402
11804A80693b96771J15824L763B55220d1274A73059a82077M7621K0146j08917
11794b23227d3015j44226F1263a54002A0197J985N7976R7964j4316C3978c02562
11782I050K36848C0417b67934A72158j0714b9763C16329c74984h9549I1015O1760
11771A52775j4990l1184e03722A43941h5862E2331j9457b20003F970b59756F6821
11759b10786e0113A39330a49897A27244g4572A90823J08071H6090C6224Q6979
11749A23203O5597d3463F9173h6127l0354m6953E5844b34041e1130b4920j96887
11738b21807A49394g8860C3487a5926B50334f6537A39938M3934L39812i4493B20724
$$ plain form
11726 -97415 -38565 121018 37025 -27391 104110 -55642 142838 192710 -34161 212496 296646
11715 296646 -147286 172753 94859 184338 -177112 80915 -394201 -176800 -68451 -241836
11705 -241836 119403 142374 -249348 79312 112777 64812 -14059 -128523 -180351 -66164 346334
11693 -147542 -111887 224567 86364 -146722 -8818 350025 -252886 353990 -126599 -94630
11683 -94630 -128871 235558 62540 172251 335958 -20825 -262058 232562 -133693 54280
11672 -123156 5026 140593 -46480 -126903 -61720 116903 -194893 -247410 161934 111775 -26539
11660 91490 19447 -239478 249224 -14485 -51237 -55706 -8271 402749 -58037 348304 -306444
11648 201916 53733 270110 164978 -166174 -50534 169833 -134854 194363 41121 277090
$$ packed form
11726i7415c8565A21018C7025b7391A04110e5642A42838M9872c4161B12496Q4150
11715B96646a47286A72753p7894Q9479a77112H0915c94201a76800f8451j73385
11705b41836A19403K2971b49348G9312L3465m7965a4059j14464n1828f6164C46334
11693a47542L5655B24567H6364a46722h818C50025b52886C53990a26599L1969
11683i4630l4241B35558F2540J09711J63707b0825k41233B32562a33693E4280
11672a23156E026J35567d6480q0423f1720A16903a94893n2517A61934n0159b6539
11660I1490A9447b39478B49224a4485l6752m469h271D02749e8037C48304c06444
11648B01916E3733K16377j05132a66174e0534A69833a34854A94363D1121K35969
$$ plain form
11638 277090 381634 26568 -291394 -356296 194751 -3182 -89115 255781 -11105 154211 40325
11626 153772 -120607 263679 -58719 104924 59462 -16093 -359206 -188611 45382 56642
11616 56642 307024 294662 -9966 -41509 83320 -30638 164497 52321 -149993 109801 77988
11605 77988 -156030 -93948 62364 -26164 -252880 77884 187670 -214571 145786 698 73747
11594 73747 -69634 -61991 1400 -33488 246251 400867 158472 217216 -143562 97126 -144274
11582 -109914 -138129 -301179 -7766 -40442 142173 -83830 137184 23314 129906 231776 -150293
11570 162865 -35311 309109 -38163 254818 -64309 -137503 -20770 -43019 -56387 -167860 22935
11558 407910 87577 -58409 -152285 -196712 -293979 250486 325538 -41787 15741 292707 12336
$$ packed form
11638B77090J04544B6568b91394o4902A94751c182q5933B55781a1105A54211D0325
11626A53772a20607B63679e8719A04924m5462a6093l43113J70595D5382J1260
11616E6642K50382j2362i966l1543H3320c0638A64497E2321a49993A09801l1813
11605G7988a56030O2082F2364b6164k26716G7884J09786b14571A45786F98P3049
11594G3747f9634P643A400c3488B46251J54616A58472N8744a43562I7126a44274
11582a09914k8215j63050g766l2676A42173h3830A37184B3314J06592J01870a50293
11570A62865c5311C09109c8163B54818f4309p3194b0770k2249j3368j11473B2935
11558D07910H7577e8409r3876m4427r7267B50486P5052d1787A5741K76966A2336
$$ plain form
11546 -40427 -109994 22541 -104533 116535 -39021 -294472 2667 138643 -880 189819 12497
11534 45059 106536 -79121 225399 145125 149613 -80158 312621 306657 179278 380834 -54876
11522 192604 227230 -87888 32409 79973 80631 144178 -360159 21010 -127157 101518 -122554
11510 180469 -147961 282799 102919 -1408 17205 165264 -62449 380912 -174617 166795
11499 493629 126249 -14485 -162816 274573 322335 3462 463546 267322 -105532 162154
11488 293110 -18551 133799 -85579 33225 503118 193455 146637 -44808 269925 -69459 325547
11476 322897 434268 493416 208101 140493 176816 245555 202744 293105 44080 51155 65183
11465 65183 213418 -13936 -71869 146941 -47824 69405 96338 64914 431066 39524 321485
$$ packed form
11546d0427o9567B2541a04533A16535c9021k55451B667J35976h80A89819A2497
11534D5059O1477g9121B25399q0274M488h0158C12621n964j27379K01556e4876
11522A92604L4626h7888C2409M7564O58O3547c60159B1010a27157A01518a22554
11510A80469a47961B82799A02919a408A7205J48059f2449C80912a74617A66795
11499D93629A26249a4485j48331B74573M7762C462M60084j96224a05532A62154
11488B93110a8551A33799h5579C3225M69893A93455m6818d4808B69925f9459C25547
11476C22897J11371N9148B08101o7608L6323O8739m2811R0361D4080P075J4028
11465F5183J48235a3936n7933A46941d7824F9405K6933l1424L66152C9524K81961
$$ plain form
11454 321485 194244 248456 -53831 -23003 -104176 485639 273591 -25913 -63393 23071 -136530
11442 -157854 231086 53624 281657 111667 -314320 433080 -86630 -221917 140107 138134
11432 138134 55476 183632 -279072 -47097 -10880 274676 -272779 -2834 7781 7537 -45130
11420 120777 229418 40663 51249 21387 403162 225049 135553 182065 -219204 -51328 -154859
11409 -154859 42265 -91494 -74803 203125 255130 126433 112240 160112 353564 360645 153003
11397 -72866 202204 -113912 -291138 176968 147387 -99371 84347 -211810 -242423 -262997 -32854
11385 85553 266408 130694 148076 -343427 223983 -65224 -338185 54547 67991 257265
11375 257265 32835 -39201 178427 -112235 356381 -56162 129506 121664 230619 70027 311566
$$ packed form
11454C21485j27241N4212e3831b3003q1173D85639k12048b5913l7480B3071a36530
11442a57854B31086E3624K28033A11667c14320D33080h6630j35287A40107j973
11432A38134E5476J28156b79072d7097a0880B74676b72779b834G781k44d5130
11420A20777J08641D0663J0586B1387L81775j78113q9496M6512b19204e1328j03531
11409a54859D2265i1494J6691B03125N2005A26433j4193M7872J93452P081A53003
11397g2866B02204a13912j77226A76968k9581i9371H4347b11810l0613k0574c2854
11385H5553J80855A30694J7382c43427B23983f5224k72961E4547J3444J89274
11375B57265C2835c9201A78427a12235C56381e6162A29506p842J08955G0027K41539
$$ plain form
11364 311566 124004 166260 -175145 -145747 -313300 87427 -117917 -53818 48330 143403 -80151
11352 -182000 28054 190261 421346 -120425 -115227 92308 233069 53775 19739 -4038 -225691
11341 -225691 -156145 -4234 20263 -138585 226375 103689 97023 58981 -303483 -99420 376130
11329 -160804 -172362 -44843 30690 87795 140492 213657 89168 144379 -20527 -67226 67880
11317 -42628 -99695 -225721 -28807 193636 -115728 14028 119803 59633 160399 -147239
11306 342552 -322171 205583 231853 -72525 -151585 94793 53241 356 108054 28626 -63313
11294 -163037 -55135 14929 47279 33789 -84919 -198882 -218522 -429294 -136985 23372 52150
11283 52150 -213800 141831 -164087 104753 502 -217024 -7944 -268267 -167407 204768 -102403
$$ packed form
11364C11566A24004M2256a75145K9398j67553H7427a17917e3818D8330R5073h0151
11352a82000B8054J62207K31085a20425N198I2308J40761E3775A9739d038k21653
11341b25691O9546d234B0263a38585B26375A03689o666l8042c03483i9420C76130
11329a60804j1558d4843C0690N7105N2697P3165H9168N5211b0527m6699F7880
11317d2628n7067j26026b8807A93636a15728A4028J05775E9633J00766a47239
11306C42552c22171B05583K6270g2525p9060I4793m1552C56J07698B8626f3313
11294a63037e5135A4929L2350j3490h4919j13963j9640k10772a36985B3372K8778
11283E2150b13800A41831a64087A04753E02b17024g944k60323J00860B04768a02403
$$ plain form
11271 57174 -57641 -121955 -16814 -125012 -311787 -229443 -95799 -37034 57315 -35473 58985
11259 167052 -119929 39080 104705 -212318 -578785 4716 -238493 -22851 -171837 33003 42508
11248 42508 47035 -59888 -208806 80614 -318176 -160164 -26446 -32298 -348407 198139 199078
11237 199078 -110550 50049 -120803 -308760 -132418 -291555 121693 -62133 -29151 -184723
11227 -184723 -42916 -39469 -60101 30249 -38413 -101794 103185 121333 -98950 185595 62426
11215 194811 110394 -126090 382355 -53106 98525 -17391 -250357 -376612 172202 -36712
11204 -70334 198661 -101655 58455 -30616 51537 116172 -189121 -122785 -157847 180403 -25839
11192 135346 -489113 224308 -210840 -117677 -221905 -56208 -140913 113562 -374837 22597
$$ packed form
11271E7174e7641o4314a6814j08198j86775Q2344i5799c7034E7315c5473E8985
11259A67052a19929C9080O5625b12318l66467D716b38493b2851j48986C3003R505
11248D2508M527e9888j48918H0614c18176J58012b6446n852l16109A98139R39
11237A99078a10550E0049a20803j87957a32418j59137A21693f2133b9151j55572
11227a84723d2916L447k0632C0249c8413o3381A03185J8148i8950A85595F2426
11215A94811q4417a26090C82355e3106I8525a7391k32966j26255A72202c6712
11204g0334A98661a01655E8455c0616E1537O4635a89121O6336l5062A80403b5839
11192A35346d89113B24308b10840R3163j04228e6208q4705A13562c74837B2597
$$ plain form
11181 146494 -194805 -286375 -157232 72025 -184315 -122779 141130 -272970 -166898 -163554
11171 -163554 278481 210632 237995 -55074 -181884 -80722 -102616 5670 -53278 213927 -195765
11159 260120 129602 -344490 -80557 237463 -117275 -193162 -382641 20294 6588 -80485 64923
11147 95232 178141 21591 -159976 227317 -77854 29420 -160527 43980 165486 -51302 100963
11135 -62786 115588 -160304 6461 -247634 32021 89495 129525 -97217 110812 283267 22815
11123 241929 -140032 46474 4217 380467 50968 120140 22341 -70962 23301 79849 131705
11112 131705 35955 162480 -13219 -69383 55927 -168356 197997 305011 385915 285904
11102 285904 -149610 315388 124164 457 339150 216213 265992 198640 51401 142665 -51759
$$ packed form
11181A46494a94805r1570J29143G2025a84315O1536A41130b72970J06072L344
11171a63554B78481o7849K7363e5074j26810h0722k1894E670e3278B13927a95765
11159B60120A29602c44490h0557B37463a17275p5887j89479B0294F588h0485F4923
11147I5232Q2909B1591a59976B27317g7854B9420a60527D3980J21506e1302A00963
11135f2786A15588a60304F461b47634C2021N7474M0030i7217A10812J72455B2815
11123B41929a40032D6474D217L76250E0968O9172B2341g0962B3301N6548N1856
11112A31705C5955J26525a3219n6164E5927a68356A97997J07014Q0904j00011
11102B85904a49610C15388A24164D57L38693j22937M9779o7352E1401R1264e1759
$$ plain form
11090 221805 16997 156261 36392 469873 122744 87469 377450 224468 234414 91557 259539
11079 259539 271797 199529 469236 451533 443116 581693 353122 360570 313250 59313 254091
11068 254091 331846 334283 259544 622594 748298 527707 554986 842357 497963 474922 49972
11056 804159 598899 833602 603262 485522 516220 913383 653291 950757 579999 1015173
11046 1015173 771793 760400 521484 883703 612892 768584 807208 979676 682153 418282
11036 418282 876675 579746 867143 798638 768308 685023 801309 863756 711359 510493
11026 510493 502466 1040418 867841 799336 552172 1108902 555763 329145 875406 539749
11016 539749 780609 988170 687336 829299 844972 749259 517432 695804 731528 759209
$$ packed form
11090B21805A6997J39264C6392M33481A22744l5275K89981j52982R946I1557J67982
11079B59539J2258p2268K69707j7703q417J38577k28571P448m7320E9313J94778
11068B54091P7755K437p4739L63050J25704k20591K7279K87371l44394k3041D9972
11056H04159k05260K34703k30340j17740L0698L97163k60092K97466l70758M35174
11046A015173k43380j1393k38916L62219k70811J55692L8624J72468k97523k63871
11036D18282M58393k96929K87397o8505l0330q3285J16286O2447j52397k00866
11026E10493q027N37952j72577o8505k47164N56730n53139k26618N46261l35657
11016E39749K40860K07561l00834J41963J5673r5713k31827J78372L5724K7681
$$ plain form
11006 759209 735008 506342 582397 389727 791424 652645 578532 767018 653586 858544
10996 858544 862140 551083 981122 675500 777426 967853 733560 696400 894151 477835
10986 477835 976998 1139509 1158663 1211082 930388 1204370 1135318 1704473 1447370 1748760
10976 1748760 1984244 2028535 2566991 3195910 3160444 3266066 3744989 3424686 2921369 3293513
10966 3293513 2781234 2322912 1935456 1814599 1702731 1766966 1946651 1649265 1420777 2085172
10956 2085172 1425750 1555444 1326256 1512888 1171912 1239208 1037795 961188 320712 467011
10946 467011 358267 598358 537579 249933 347389 312221 -32422 -34464 416929 415322 -166625
10934 -157893 128643 -15255 -117978 -7473 68650 -75866 162743 244242 154927 113513 -38999
$$ packed form
11006G59209k4201k28666P6055j92670M01697j38779p4113J88486j13432K04958
10996H58544L596l11057M30039l05622J01926J90427k34293l7160J97751m16316
10986D77835M99163J62511J9154N2419k80694K73982o9052N69155k57103L01390
10976A748760K35484M4291N38456O28919l5466J05622M78923l20303n03317L72144
10966C293513n12279m58322l87456j20857j11868O4235J79685k97386k28488O64395
10956B085172o59422J29694k29188J86632l40976O7296k01413p6607C20712J46299
10946D67011j08744K40091o0779B49933R7456l5168c2422k042D16929j607a66625
10934a57893A28643a5255j02723g473F8650g5866A62743Q1499q9315m1414c8999
$$ plain form
10922 -121248 -125019 -1429 138845 34067 142070 61286 432432 -64858 -63872 -238839 26659
10910 128866 19849 258861 3865 -70907 -96028 -28184 -28490 -188498 251718 -111099 10146
10898 768 87094 -52058 -3893 -42538 144336 183430 132615 208279 274794 -16740 148909 23834
10885 -225127 57258 132030 -189785 -176439 61093 -66975 36667 187490 64384 84270 -53812
10873 113879 442979 -124731 -88360 328060 246610 -21666 172592 20806 141994 -78731
10862 51062 77378 -65517 -55312 226882 -81337 27915 -106581 24675 153231 -459122 138206
10850 46687 125134 343889 12022 -254636 -80582 53665 -462915 -73860 166655 29898 -459565
10838 -66330 125328 -194507 -134491 -117773 -110524 261 84847 -302884 -300549 -17892 -7428 -355516
$$ packed form
10922a21248l771a429A38845C4067J08003F1286L71146f4858R86j74967B6659
10910A28866A9849K39012C865g0907k5121b8184l06j60008B51718a11099A0146
10898G68Q6326e2058c893l8645A44336L9094n0815P5664O6515a6740A48909B3834
10885b25127E7258P4772a89785J3346F1093f6975C6667J50823F4384J9886e3812
10873A13879L29100a24731L6371C28060q1450b1666A72592B0806J21188g8731
10862E1062K6316f5517J0205B26882h1337B7915a06581B4675J28556d59122A38206
10850D6687P8447K18755A2022b54636h0582E3665d62915g3860A66655B9898d59565
10838f6330A25328a94507O0016J6718P249B61Q4586c02884K335a7892g428l48088
$$ plain form
10826 -355516 149651 -207892 -8665 -287353 -103589 -68145 140848 -8306 -144250 -204503 288493
10814 -320424 79186 49685 -298059 -131188 23887 -118474 196478 -275956 127848 365397
10804 365397 -16312 -271437 32726 -283732 -294631 97010 -198026 -232975 9521 -90981 -68330
10793 -68330 -408789 -40670 -288122 45643 -343857 89317 161280 145750 60556 399691 -249052
10781 150705 -182369 -191713 318154 -296209 149857 71291 -15005 79591 -238337 -82043 -362343
10770 -362343 -246381 283528 -185112 -216745 70046 89204 23618 -9251 -62801 -27399 -333639
10759 -333639 68569 43814 46797 -25117 95790 313149 -148819 -78755 109762 -103364 -240786
10748 -240786 -53611 -230962 -40237 12909 -290701 233255 75209 -327075 24297 67935 -52611
$$ packed form
10826c55516A49651b07892h665k78688a03589L5444A40848h306j35944o0253B88493
10814c20424G9186k9501b98059a31188B3887a18474A96478b75956A27848K37549
10804C65397a6312k55125C2726b83732j0899I7010a98026l4949I521i0981K2651
10793f8330l40459d0670k47452D5643c43857H9317P1963j5530F0556L39135b49052
10781A50705a82369r344C18154b96209A49857G1291a5005G9591b38337h2043k80300
10770c62343J15962B83528a85112l1633G0046J9158B3618i251n3550b7399l06240
10759c33639F8569k4755K983b5117I5790K17359a48819P0064A09762a03364j37422
10748b40786e3611j77351d0237A2909b90701B33255G5209c27075B4297M3638e2611
$$ plain form
10736 -16176 -62540 53957 -57616 -211219 181559 21447 81891 189040 -191398 -37655 17221
10724 -235728 -147312 -11270 -112929 34725 -93896 -199920 -76003 -110740 134878 255429 -102419
10712 166466 11684 -150661 -407019 -70217 -123859 6496 -136314 94260 -3290 -266255 127672
10700 -242186 -101266 -152298 -247918 37888 219493 14411 150559 -400804 42285 -219744
10689 -56707 172098 -86754 22880 -275202 422794 208054 37279 -169966 -276392 -43116
10678 -273191 -355883 -418832 -70475 -212360 -68198 -134624 220129 55145 56286 -223756 -46088
10666 -319324 49956 18821 -132017 -404584 -187281 -13634 -34635 -157809 27282 161505
10656 161505 -164917 -171387 168243 166411 17905 51731 134540 -146031 2042 -286453 -40606
$$ packed form
10736a6176m6364E3957e7616j53603A81559B1447O0444J07149a91398c7655A7221
10724b35728Q8416a1270j01659C4725i3896j06024g6003l4737A34878J20551a02419
10712A66466A1684a50661k56358g0217n3642F496a36314I4260c290k62965A27672
10700b42186a01266n1032r5620C7888J81605A4411J36148d00804D2285b19744
10689e6707A72098h6754B2880b75202D22794B08054C7279a69966j06426d3116
10678b73191q2692o2949g0475j41885f8198o6426B20129E5145J141b23756d6088
10666c19324D9956A8821a32017k72567a87281a3634k1001j23174B7282J34223
10656A61505a64917o470A68243j832A7905L3826Q2809a46031B042b86453d0606
$$ plain form
10644 257121 26214 -211551 300757 -109874 323552 81549 114974 16815 -140402 58571
10633 28359 116068 -45101 -46044 -184103 -408155 -77532 -111277 47877 188788 -50859 153982
10621 -1780 -76162 207809 74546 -31209 -10262 22832 -189968 1515 -354262 204095 -222479
10609 -54374 -229860 45767 57506 144672 -36932 28229 -86338 -53814 -80837 -221512 -213477
10598 -213477 -193063 4999 -13016 -275164 -405825 -28970 -160180 -14418 -265762 -14986 -261194
10587 -261194 -36231 -127266 118793 -236100 -34718 -161623 212143 -48434 71617 -328473
10576 -135198 -23639 -136270 56871 -111813 -236585 -251244 -161215 -128364 -9642 -178022 60977
10564 249721 -212199 145025 18704 118426 57995 -103915 226993 166444 -164131 -11887
$$ packed form
10644B57121B6214b11551C00757a09874C23552H1549L3425A6815a40402E8571
10633B8359Q7709d5101r43j38059k24052g7532l3745D7877J40911e0859A53982
10621a780p4382B07809G4546c1209a0262B2832a89968A515c54262B04095b22479
10609e4374j75486D5767J1739Q7166c6932B8229h6338L2524k7023j40675Q035
10598b13477K0414D999a3016k62148j30661b8970j31210a4418k51344a4986k46208
10587b61194c6231r1035A18793b36100c4718j26905B12143d8434G1617c28473
10576a35198b3639j12631E6871a11813j24772j4659R0029L2851i642j68380F0977
10564B49721b12199A45025A8704R9722E7995a03915B26993o0549a64131a1887
$$ plain form
10553 -78024 148543 11694 -445966 -169685 208844 -128361 227373 -208499 61544 -56859
10542 263013 187824 54378 178493 -93342 -240280 -81098 302866 -68947 -520531 40746 -73956
10530 23389 -111191 -313168 95160 -98387 99967 2610 112170 -85753 -144605 83763 198515
10519 198515 -177825 -55106 -89870 116490 225172 -154537 -145702 -226226 62388 -20566 -141467
10508 -141467 102330 17357 -95252 -147232 135147 76290 131781 6422 78624 -177878 5595
10496 227221 -45420 -72139 -191658 -222366 -354574 290975 -2398 8045 -72700 222836 -199485
10484 31162 81493 379971 348256 301243 445692 26212 240759 139985 165631 30724 -46023
10472 182095 240402 20841 94835 328517 -162907 -113167 204620 -58706 241784 -49110 57304
$$ packed form
10553g8024A48543A1694d45966a69685B08844a28361B27373b08499F1544e6859
10542B63013p5189E4378J24115i3342j46938h1098C02866f8947m51584D0746g3956
10530B3389a11191k01977I5160i8387I9967B610J09560h5753n8852H3763J14752
10519A98515a77825e5106l4764A16490J08682a54537Q835q0524F2388b0566j20901
10508a41467A02330A7357i5252n1980A35147n8857N5491F422P2202a77878E595
10496B27221d5420k6719j19519l0708j32208B90975b398H045g2700B22836a99485
10484C1162N0331K98478l1715m7013J44449B6212K14547j00774K5646C0724d6023
10472A82095N8307B0841P3994K33682a62907M9740B04620e8706B41784d9110E7304
$$ plain form
10460 127602 -81572 -303616 15189 -373558 73245 113717 -74113 -47844 -235072 175858 -210535
10448 50099 177226 44800 -20219 14378 263312 -3745 54398 205083 55690 -28386 -247464
10437 -247464 -13769 -51130 -175734 139662 -119135 121031 126383 171107 244354 35116 41967
10426 41967 104386 -119105 64389 176569 -38080 -186158 187958 -87309 -351720 83114 -156238
10414 -96123 -205577 -15983 242793 -170326 144132 200938 195513 119938 -330584 -589055 -86318
10402 86951 -29619 80474 -25596 -70044 -35348 41162 93317 -94611 -57309 198854 41829
10390 -103399 112618 236390 91474 469661 -32041 369476 254690 -23468 374583 97270
10379 100082 197275 249309 112264 212286 640000 282064 128064 194543 -8616 61019 327262
$$ packed form
10460A27602h1572k22044A5189c73558G3245M0472g4113K6269j87228A75858b10535
10448E0099J27127D4800b0219A4378K48934c745E4398J50685E5690b8386k19078
10437b47464a3769l7361j24604A39662a19135A21031N352M4724P3247C5116O851
10426D1967O2419a19105F4389J12180c8080j48078A87958h7309k64411H3114a56238
10414i6123j09454a5983B42793a70326A44132N6806n425p5575c30584k58471h6318
10402H6951b9619H0474b5596m4448L4696D1162N2155i4611L7302A98854D1829
10390a03399A12618J23772I1474L78187c2041C69476j14786b3468C74583I7270
10379A00082R7193N2034A12264J00022M27714B82064A28064O6479h616F1019K66243
$$ plain form
10368 327262 434461 422580 570709 487357 592948 291936 35832 -55865 275193 352759
10358 352759 475095 490109 266617 299612 419496 224788 592753 118661 359290 707433
10348 707433 386800 210950 666262 402127 298927 477603 251149 373438 54615 260423
10338 260423 530832 427976 121260 62918 106646 279784 374533 396943 104502 -7060 -86410
10327 -86410 -256363 53115 250622 10717 213743 94352 41243 169298 322971 -137228
10316 142610 141888 238038 73659 161331 239912 87866 -100476 101436 -373092 358470 -254257
10304 -24200 251477 86315 -127492 -142098 89752 7219 -47263 -166597 84906 120462 -88481
10292 -55239 211818 56195 147575 178710 74423 -155207 -138196 -1792 -284307 -23245 -74021
$$ packed form
10368C27262J07199j1881J48129q3352J05591B91936C5832e5865B75193P7566
10358C52759J22336J5014k23492L2995J19884j94708L67965A18661K40629L48143
10348G07433l20633j75850M55312k64135j03200J78676k26454J22289E4615K05808
10338B60423K70409j02856A21260n8342M3728J73138R4749K2410A04502g060p9350
10327h6410j69953E3115J97507A0717K03026I4352D1243J28055J53673a37228
10316A42610p22R6150G3659Q7672P8581H7866a00476A01436c73092C58470b54257
10304b4200B51477H6315a27492j4606H9752G219d7263j19334H4906L5556h8481
10292e5239B11818E6195R1380L1135G4423a55207J7011a792k82515b3245n0776
$$ plain form
10281 -74021 -7510 -68590 -176092 -146275 -223399 -9641 -361580 32273 190390 -112575 -193834
10270 -193834 80431 194293 -343603 14203 87246 -148334 16214 175417 298308 248983
10260 248983 424238 55728 415630 528770 272160 100433 32561 165588 -184473 82721
10249 211631 32124 -198093 57593 13987 241549 16649 220033 130083 -102572 96975 25494
10237 54914 -167034 70773 -106451 -223383 245350 204052 -83938 -288959 -395889 -77262
10226 -69998 -274000 -100198 -8904 130020 -160486 437201 -84122 -310935 -320639 -245689 151780
10214 192945 -210202 -242500 -177518 260904 -120198 -245569 140292 273235 -297285 -106730
10203 49966 -231883 296903 -187303 -156612 -60880 237952 135753 -25900 -302532 64373
$$ packed form
10281g4021g510o1080j07502K9817p7124i641l51939C2273J58117a12575q1259
10270a93834H0431J13862c43603A4203P3043a48334A6214J59203J22891m9325
10260B48983J75255E5728L59902J13140k56610A00433C2561J33027a84473H2721
10249B11631C2124a98093E7593A3987K27562A6649K03384q9950a02572I6975B5494
10237E4914a67034G0773a06451j16932B45350m1298h3938k05021j06930g7262
10226f9998k04002a00198h904A30020a60486D37201h4122k26813r704P4950A51780
10214A92945b10202l2298O4982B60904a20198j25371A40292J32943b97285a06730
10203D9966b31883B96903a87303L0691f0880B37952j02199b5900k76632F4373
$$ plain form
10192 -28021 141941 60011 -193091 -118977 113349 1630 375359 -257684 22814 103562 -76044
10180 148762 -188536 190838 -170751 -21609 84087 181413 -52332 46821 56047 -164359 24388
10168 218437 151201 36505 -199056 -339452 -120845 -173151 -159599 164909 -74217 160530
10157 -81758 73437 -257199 235046 -211746 -59248 -192520 96173 50156 -132327 222087
10146 -191451 -237006 -63739 -146831 -419099 -112266 -136481 127593 -227596 61717 12141 139161
10135 139161 -173019 -52376 -103730 -147464 24285 43703 -174521 -36891 -27726 -235853 58944
10123 -104913 133482 286083 -66054 -191834 -101466 -123642 -25908 -126349 36501 17612 134835
10112 134835 116385 -450997 -224636 -238117 23368 119065 -223203 -44340 109387 -108898
$$ packed form
10192b8021A41941F0011a93091P4114A13349A630L73729b57684B2814Q0748g6044
10180A48762a88536A90838a70751b1609H4087R7326e2332D6821R226a64359B4388
10168B18437o7236C6505a99056j40396a20845n2306J3552A64909g4217A60530
10157h1758G3437b57199B35046b11746e9248j33272I6173m6017a32327B22087
10146a91451m5555f3739q3092k72268a12266k4215A27593b27596F1717A2141J27020
10135A39161a73019e2376n1354m3734B4285J9418a74521c6891R165k08127E8944
10123a04913A33482J52601f6054j25780R0368k2176b5908j00441C6501A7612J17223
10112A34835j8450d50997b24636j3481B3368R5697b23203d4340A09387a08898
$$ plain form
10101 65673 244476 124879 -197170 -104024 -200244 -178006 -152864 137128 43499 -184794 58231
10089 34149 -311006 78651 152595 -281389 77489 -183077 35965 -29358 -87890 91917 -273950
10077 2886 -31024 83952 -522780 124244 89005 -224185 -67525 -291151 371205 -82693 -323737
10066 -323737 -87233 47181 18079 50581 -37528 -165475 42985 -147662 -186739 154323 -345770
10054 49225 24167 -184410 -485743 -191887 -65511 -332007 -108903 -309985 -138950 -157631
10044 -157631 4809 278966 -63612 -167919 115505 -41797 -40353 75522 -400201 -287506 -95755
10032 195308 31496 54339 -22707 60508 -154902 139333 -340070 -586655 130054 32000
10021 -70538 -8463 213355 54457 57576 -52070 192094 -472355 -258299 -33105 -72285 48737
$$ packed form
10101F5673J78803j19597a97170R3146r6220K2238K5142A37128D3499a84794E8231
10089C4149c11006G8651P3944b81389G7489a83077C5965b9358n8532I1917b73950
10077B886c1024H3952e22780A24244l5239b24185f7525k23626C71205h2693k41044
10066c23737h7233D7181A8079L2502c7528j27947D2985a47662l9077A54323c45770
10054D9225B4167a84410l01333a91887f5511k66496a08903k01082a38950j8681
10044a57631D809K74157f3612j04307A15505d1797J444G5522d00201J12695i5755
10032A95308C1496K2843b2707F0508a54902A39333c40070k46585A30054C2000
10021g0538h463B13355E4457L119e2070A92094d72355K14056c3105l9180D8737
$$ plain form
10009 -37280 -312786 55428 18811 64357 -310614 132167 -206575 34907 -56430 -9690 -189120
9998 -189120 -196235 -152847 -258468 -214467 151568 -311994 -91421 49889 323545 68705 -127954
9986 -75253 162410 -342086 -157655 -122903 149931 -73161 -260889 87612 -175829 -118492 -28057
9974 73154 -312478 -15365 155682 -114650 10740 54727 -130890 8572 354076 -141433 276265
9962 -177792 -349223 -35872 204785 288600 -102601 -262334 -42873 -71404 212502 38073 -19481
9950 -91178 -141591 -268549 159831 -19673 -96532 -91680 85941 42492 -188963 -188265 -15736 46998
9937 216943 31812 -242468 9198 83806 -456193 -234950 86713 29961 86477 6636 60237
9926 60237 312254 -209600 -61160 -188256 400903 -151516 -271395 52335 -379382 120042
$$ packed form
10009c7280k75506E5428A8811M5546c10614A32167b06575C4907e6430i690j79430
9998a89120p115M3388j05621M4001A51568c11994i1421D9889K73656F8705a27954
9986g5253A62410c42086a57655L4752A49931g3161j87728H7612a75829N7337b8057
9974G3154c12478a5365A55682a14650A0740M3987a30890H572L45504a41433B76265
9962a77792j71431c5872B04785Q3815a02601j59733d2873k8531B12502C8073a9481
9950i1178n0413j26958A59831a9673p6859M852H5941D2492a88963O98a5736D6998
9937B16943C1812b42468I198P4608d56193K21243H6713B9961N6516F636N3601
9926F0237K52017b09600f1160j27096D00903a51516j19879E2335c79382A20042
$$ plain form
9915 -384449 -101134 -370620 100633 -145285 -220523 -113740 -205087 -128946 297026 -129694
9904 -133600 -244534 -302966 160543 -172656 -95120 -348789 79547 -34699 -210555 -267767 45836
9892 183929 17743 -362170 -100255 -45772 -111670 12089 34441 24907 -77493 284614 253719
9881 253719 12929 -117624 -467438 -173612 -24295 -223738 33986 84944 -343883 -70693 -109279
9870 -109279 -12529 180204 -97385 -245023 58273 -278639 26353 -68983 -137727 79815 -219662
9858 -58483 92544 -162204 60649 -256687 -11959 -311216 79951 44604 16614 -41422 22435
9846 127024 -50589 -3540 -161598 45484 -85300 74687 63928 111982 -48644 -171538 -65515
9834 -184151 -118259 -20857 255878 27605 188516 -101565 -426477 125138 109738 166309 -192286
$$ packed form
9915c84449a01134k69486A00633a45285p5238J06783r1347P6141B97026a29694
9904a33600j10934n8432A60543a72656P7536k53669G9547c4699j75856n7212D5836
9892A83929A7743c62170a00255d5772o5898A2089K2352r534g7493B84614l0895
9881B53719A2929a17624l49814a73612b4295j99443C3986N0958c43883g0693l8586
9870a09279a2529A80204i7385j47638E8273b78639B6353f8983o8744G9815b19662
9858e8483I2544a62204F0649b56687a1959k99257G9951l5347A6614d1422B2435
9846A27024e0589c540j58058D5484h5300G4687j0759M8054d8644j22894f5515
9834a84151O5892b0857B55878B7605J60911a01565l24912A25138j5400N6571a92286
$$ plain form
9822 507041 -101216 -187262 -105622 -178128 49854 39927 -55168 166301 138977 -56552 43861
9810 77891 105865 -264146 42653 7853 -54400 -82319 111226 278087 -74658 41617 -8303 -2614
9797 1951 -81958 -247713 -322254 98230 3366 -308216 -66187 25672 20298 95964 -15878 31381
9784 -256576 10389 -177177 -23119 -2063 89423 109570 -242234 74770 -63585 -254136 -147216
9773 -147216 175563 11287 88593 -184262 -289588 77571 116614 81753 -294712 -43765 228439
9761 10773 -381363 36122 -213899 19906 173664 -107469 7233 126091 -363855 240916 -177760
9749 156255 50319 -188866 -68415 59855 -79021 -40633 30905 -8488 69099 122632 -164250
9737 -107120 -54155 82823 137604 -156574 -19025 -138 -210210 -635140 -93442 93942 28675
$$ packed form
9822E07041a01216q6046Q1640p2506D9854r927e5168A66301k7324e6552D3861
9810G7891K7974b64146D2653G853e4400k7919A11226J66861g4658D1617h303b614
9797A951h1958j65755p4541I8230C366c08216f6187B5672n374P5666a5878C1381
9784b56576A0389a77177b3119b063H9423K0147b42234G4770f3585j90551J06920
9773a47216A75563A1287P7306a84262j05326G7571L9043l4861b94712d3765B28439
9761A0773c81363C6122b13899A9906J53758a07469G233J18858c63855B40916a77760
9749A56255E0319a88866f8415E9855g9021L8388C0905h488F9099N3533a64250
9737a07120N2965H2823N4781a56574a9025a38k10072m24930i3442I3942B8675
$$ plain form
9725 -5886 -267284 -356611 4975 5451 -284956 -89135 -34166 -111835 -54052 -35923 -175484 -253831
9713 -253831 -84759 -56788 -418499 -30873 55953 -32663 -273471 -272723 -349201 -170231 -42492
9701 -172610 -107871 -10075 78043 -134658 -383853 -220140 -229422 -206566 -197524 385055 -84300
9689 -19256 -7725 -76937 -60343 -328383 -165387 -146516 25971 -20967 -126706 232931 -280213
9677 -47478 161699 -169510 -291870 -55673 -102937 -48414 -271458 -203700 -139802 -202712 -330256
9666 -330256 136347 209359 99872 -8867 -192508 -152117 -59549 -28033 -79973 -280859 226868
9654 99861 -94428 83798 -180360 -402017 22881 193044 -101231 -3992 239196 -14306 -211351
9643 -211351 -377585 -186068 -64891 65599 -217354 199718 31843 -193239 -151229 -344473
$$ packed form
9725e886k61398q9327D975M76b84956h9135c4166p7669e4052J8129j39561p8347
9713b53831h4759K7971l61711c0873E5953c2663k40808P48p6478a70231d2492
9701a72610O4739a0075G8043a34658k49195J63713r282K2856R042C85055h4300
9689a9256g725o9212J6594k68040J62996J8871B5971b0967j05739B32931b80213
9677d7478A61699a69510j22360e5673m7264d8414k23044O7758O3898o2910j27544
9666c30256A36347P3012I9872h867j83641M0391e9549b8033n1940k00886B26868
9654I9861i4428H3798a80360k21657B2881J70163a01231c992B39196a4306j97045
9643b11351j66234a86068f4891F5599b17354A99718C1843a93239M2010j93244
$$ plain form
9633 -344473 -206657 -130801 -41275 -178919 -226580 -78161 -92549 144225 -254161 -35566 -209330
9622 -209330 -457972 173193 152245 166207 151767 -200783 -104217 221590 8233 177948 291685
9611 291685 -168049 459 -28590 117338 -61625 -112957 238003 -82458 -305195 247872 68269
9599 -91727 102155 271834 -196682 41162 -276103 -38618 -7491 155980 111641 216547 -96777
9587 247300 -126417 -96828 62272 11481 -478273 -255105 91260 -78241 98227 -33835 -285678
9576 -285678 -337511 -370169 137718 -201672 45183 -18544 352215 -163673 -271610 -65136 144070
9564 -187668 -10485 -108455 109473 35486 -182679 -57467 -97415 -363411 236338 63164 -461680
9552 233011 -451375 -135848 -53106 -106530 -87179 -79303 234470 -75856 -23637 -146720 -35779
$$ packed form
9633c44473J37816P5856d1275j37644m7661g8161j4388A44225b54161c5566j73764
9622b09330k48642A73193k0948J3962j4440b00783R6566B21590H233J69715J13737
9611B91685a68049D59b8590A17338f1625n1332B38003h2458k22737B47872F8269
9599i1727A02155J69679a96682D1162b76103c8618g491A55980m4339J04906i6777
9587B47300a26417K9589F2272A1481d78273K23168I1260g8241I8227c3835k51843
9576b85678n1833l2658A37718b01672D5183a8544C52215a63673j07937f5136A44070
9564a87668a0485r7970A09473C5486a82679e7467l9948k65996B36338F3164d61680
9552B33011d51375a35848e3106n3424J9351P876B34470g5856b3637j23083c5779
$$ plain form
9540 29003 45668 66462 -155895 330254 -64740 -557882 -262347 -12518 -104529 -247832 304183
9528 -24407 6295 153060 -207396 -256629 59286 -210184 -99852 -68741 -91792 25942 -237297
9516 215747 -160997 -38777 -249349 -150459 -427601 129119 -72257 89718 115554 -6155 -155438
9505 -155438 67438 -81451 53441 -268498 -136862 -8307 87586 -225422 -194209 -117689 356035
9493 -181225 70060 -169002 109014 66309 -370962 147812 104781 -164479 -364453 -140462
9482 -167628 -161714 221280 -53352 157903 114031 111404 -153238 70285 -147157 240622 350914
9471 350914 -83335 -96247 4425 -285934 -292039 -176708 170089 -63833 77045 32934 -68705
9459 -148083 -273748 -23680 -266579 113452 52426 -11431 -114400 -187993 234307 -6757 116247
$$ packed form
9540B9003J6665K0794a55895C30254f4740m93142b62347a2518r2011j43303C04183
9528b4407F295J46765b07396m9233E9286b10184i9852L1111k3051B5942b37297
9516B15747a60997c8777k10572R8890k77142A29119g2257H9718K5836f155j49283
9505a55438F7438h1451E3441b68498J31636h307H7586b25422L1213P6520C56035
9493a81225G0060a69002A09014m2705c70962A47812m3031a64479j99974a40462
9482a67628N914B21280e3352A57903m3872k627a53238G0285a47157B40622J10292
9471C50914h3335j2912D425b85934o105J15331A70089f3833G7045C2934f8705
9459a48083j25665b3680k42899A13452E2426a1431j02969p3593B34307f757A16247
$$ plain form
9447 -461398 -42878 102658 -29187 -34952 305861 12435 -40906 335791 8317 37124 -361452
9435 -43036 43652 -89800 2845 -12605 -230324 -201626 170676 -254164 -128949 -368574 84211
9423 -67924 -221474 -102102 -215292 -8624 63892 71860 -1154 77852 -3767 -217356 -82946 71806
9410 412 76059 143775 37163 -149520 115384 -3984 169250 53075 -146562 -406853 138617
9398 136006 -50654 -383688 122545 -79372 -75297 -102488 -166909 161663 454448 -105408 -354407
9387 -354407 -106409 -156792 -345655 -42098 -150240 194127 88028 -493289 119014 -117867
9376 -197380 31536 418177 -225586 -121107 -172520 -108784 -299773 110391 35646 427476
9366 427476 -313720 -366088 -109803 255277 -168797 -116204 190799 -273989 23850 -261290
$$ packed form
9447d61398d2878A02658b9187n765C05861A2435d0906C35791H317K8807c61452
9435d3036D3652h9800B845a2605k17719K8698A70676b54164J25215k39625H4211
9423f7924j53550a02102j13190h624F3892P968a154G7852c767k13589h2946G1806
9410D12P5647O7716C7163a49520A15384c984A69250E3075a46562k60291A38617
9398A36006e0654l33034A22545g9372M075k7191o4421A61663K92785a05408k48999
9387c54407a06409n0383j88863d2098j08142A94127H8028d93289A19014a17867
9376a97380C1536L86641b25586J04479n1413O3736j90989A10391C5646L91830
9366D27476c13720n2368a09803B55277a68797N2593A90799b73989B3850b61290
$$ plain form
9355 327129 -23303 -191075 -13894 -211043 78510 -395849 -240117 -177400 -27995 -70809 -282151
9344 -282151 -51279 114902 -130660 -241427 -144018 -166408 -135802 112317 -117634 -11054 70973
9332 178711 -256229 -330098 -209432 73894 142471 -58256 234951 32845 -37244 -41603 -221675
9321 -221675 -14956 65608 -128361 -71575 -162739 -120759 -276959 201720 105778 -71343 37423
9309 266915 -209606 -289471 -209442 38378 -361325 45867 -231973 -355599 191319 260990 13630
9297 295861 -466897 -131673 101374 -147977 9885 -70990 86854 -243181 -155778 -145995 -225427
9286 -225427 736 -271896 159738 -396821 -430400 -202050 -314706 -158100 307844 -66593 -63909
9275 -63909 11678 -42604 116189 -197053 -289177 -86577 -262082 -9884 -56529 -141414 -96454
$$ packed form
9355C27129b3303j67772a3894j97149G8510c95849J55732O2717b7995m2814k11342
9344b82151e1279A14902a30660j10767R7409k2390L0606A12317a17634a1054G0973
9332A78711b56229p3869J20666G3894O8577e8256B34951C2845c7244m359j80072
9321b21675a4956F5608a28361N6786r1164M1980j56200B01720r5942g1343C7423
9309B66915b09606p9865Q0029C8378c61325D5867b31973j23626A91319O9671A3630
9297B95861d66897a31673A01374a47977I885g0990H6854b43181Q7403R783p9432
9286b25427G36b71896A59738c96821l3579b02050j12656J56606C07844f6593K684
9275f3909A1678d2604A16189a97053r2124h6577j75505i884m6645q4885M4960
$$ plain form
9264 -96454 -17396 -130408 -36344 -113730 -114024 -328378 145943 -162760 -143159 275583 84087
9252 -245145 87519 -180574 68771 -64731 129020 -28335 -55734 -140618 -101015 -88440 147327
9240 217535 66407 -96122 125401 -52214 -193880 -109145 -282608 -178488 151526 -123174
9229 -314715 -88214 -180615 151 -106074 -86046 -249641 -239145 4443 196410 -207196 -314052
9218 -314052 -184369 7747 88518 111463 -286596 -219434 -199937 -8964 -63696 269808 364939
9207 364939 -196600 -134001 76465 -234860 132833 -57071 -343479 -107438 -306864 -175242
9197 -175242 -110952 -63477 28254 -128611 49193 -112073 80363 -12792 93651 -276676 132237
9185 31013 -57537 -253909 228591 -157140 -19774 -129915 118462 109807 97451 -142156 39632
$$ packed form
9264i6454a7396j13012c6344p7386k94k14354A45943a62760J9601B75583H4087
9252b45145H7519a80574F8771f4731A29020b8335k7399q4884L9603J2575A47327
9240B17535F6407i6122A25401e2214j41666Q4735j73463J04120A51526a23174
9229c14715h8214r2401A51a06074K0028j63595J0496D443J91967b07196j06856
9218c14052J29683G747Q0771K2945b86596O7162J9497h964n4732B69808R5131
9207C64939a96600O2599G6465b34860A32833e7071k86408a07438j99426J31622
9197a75242O4290M7475B8254a28611D9193a12073H0363a2792I3651b76676A32237
9185C1013e7537j96372B28591a57140a9774j10141A18462q655j2356a42156C9632
$$ plain form
9173 -63984 -408727 -158481 39543 -219943 -305597 53197 -184123 67382 80846 -37910 -178348
9162 -178348 18907 -136076 -40860 24716 -274890 -248569 -99306 -130874 -195523 -267318 -25487
9150 205353 174381 192864 -214095 218951 -310437 112643 -36942 -367992 -378786 40519 -266286
9138 -90481 -225232 -230490 -120799 -30087 113266 -359972 -172939 -95796 -12430 117117 -192757
9126 -56340 -105224 -261419 -113829 -126425 47834 250902 -122594 -83740 -24799 -27279 -5072
9114 2374 35496 146770 81412 -226020 152069 -65122 -190900 159855 184396 -330294 -146689
9102 -33509 -175343 -61541 -37072 103159 104986 84631 -383903 -113501 -230055 62683 -57635
9090 59741 -175560 20263 121394 -355 -105123 -53242 -37678 76422 34439 -168410 55018
$$ packed form
9173f3984l44743a58481C9543b19943q5654E3197a84123F7382J3464c7910j40438
9162a78348A8907a36076d0860B4716b74890K6321i9306l1568o4649p1795b5487
9150B05353l0972J8483b14095B18951c10437A12643c6942l31050j0794D0519b66286
9138i0481j34751n258J09691c0087A13266c59972a72939P7143a2430A17117a92757
9126e6340m8884j56195a13829j2596D7834K03068a22594L8854b4799k480e072
9114B374L3122J11274o5358b26020A52069f5122j25778A59855K4541c30294a46689
9102c3509j41834f1541K4469A03159J827k0355c83903a13501j16554F2683e7635
9090E9741a75560B0263J01131c55j04768N1881J5564G6422C4439a68410E5018
$$ plain form
9078 -21342 3137 83214 -237392 -175194 13459 -187302 -512677 27382 -74636 -87944 26100
9066 -150066 -110037 -257392 -183902 43477 -199680 97136 177074 -26347 -287306 -487416 69244
9054 213218 -2094 -90530 63983 88738 -132579 -273882 -132176 49995 85166 92110 -136619
9042 82700 -208619 -65742 -331849 311999 2600 -151447 33756 -65770 186446 30451 162063
9031 162063 -79207 -149405 70444 -223663 177495 -128512 -173470 -274718 -24113 -130656 185704
9019 147866 -300390 -125188 -5226 31133 -317941 287459 -249289 182319 169307 -10634 43205
9007 96007 60744 -184507 75336 -224045 -330396 48429 -67851 262446 -262976 140135 -159852
8995 31500 -270409 -30076 181125 -42067 -132765 -82986 273886 -89301 60888 -70593 -14701
$$ packed form
9078b1342C137Q0077b37392O2198A3459a87302l25375B7382g4636j3308B6100
9066a50066M0029j47355P3490D3477a99680I7136P9938b6347k60959k00110F9244
9054B13218b094q8436F3983K4755a32579j41303a32176D9995L5171O944a36619
9042H2700b08619f5742k66107C11999B600a51447C3756f5770A86446C0451J31612
9031A62063g9207p0198G0444b23663A77495a28512m4958j01248b4113j06543A85704
9019A47866c00390a25188e226C1133c17941B87459b49289A82319j3012a0634D3205
9007I6007l5263a84507G5336b24045j06351D8429f7851B62446b62976A40135a59852
8995C1500b70409c0076A81125d2067r0698M9779B73886h9301F0888g0593a4701
$$ plain form
8983 297907 -98114 -331594 -235813 -208684 -299159 -370879 34 -164787 -22363 -28839 -111370 -240968
8971 -240968 -467361 -137721 131761 -7425 273604 -135399 196279 102185 -28364 -187335
8961 -187335 120702 -203372 22057 24822 -47974 -92731 -338827 -314086 -45945 27112 183022
8950 183022 94615 -188874 -67594 -129173 -314829 128719 -329823 41095 -38885 -94460 -89986
8939 -89986 11489 -243486 -69144 -224888 -75053 -44852 -217521 105668 -105145 -186631 -185844
8928 -185844 196640 104751 -14307 95446 -238705 54378 648480 908457 357207 -199668
8917 22275 -95543 178527 -240551 -17311 -47505 49479 12624 -64991 -69682 -204366 107037
8905 -366985 59450 -225719 36343 24562 214738 -106537 -20237 -54791 1554 292636 -92175
$$ packed form
8983B97907i8114k33480R5781K7129r0475p1720C4a64787b2363o476q2531j29598
8971b40968k26393a37721A31761g425B73604a35399A96279r4094b8364j58971
8961a87335A20702b03372B2057K765d7974m4757k46096K4741d5945B7112J55910
8950A83022q8407a88874f7594o1579j85656A28719c29823D1095c8885n5575M474
8939h9986A1489b43486f9144j55744g5053L0201j72669A05668a05145q1486P87
8928a85844A96640r1889a4307I5446b38705E4378N94102K59977C57207a99668
8917B2275i5543A78527b40551a7311l0194D9479A2624f4991m691j34684A07037
8905c66985E9450b25719C6343j1781J90176a06537b0237l4554A554K91082i2175
$$ plain form
8893 82663 -30860 -384154 43835 -147236 74722 93182 -93862 -10268 30031 194674 275608
8882 275608 -204661 -1205 174810 -24716 -317699 -48814 -11438 68851 -208187 -220062 64123
8870 -259566 -303876 -248238 -71575 -165849 61444 204616 19129 -106435 -86906 132511 -209276
8858 124553 -25749 76368 93461 -129529 107670 -7129 114649 -158208 -414706 -144883 -13850
8846 -220156 190236 -117050 -50909 -220361 -395927 -232891 -38956 -28781 -120152 -86977 -122682
$$ packed form
8893H2663c0860l53294D3835a47236G4722J8460i3862a0268C0031J64643Q0934
8882B75608b04661a205A74810b4716k92983d8814a1438F8851b08187j1875F4123
8870b59566m4310N5638g1575r4274F1444J43172A9129a06435J9529A32511b09276
8858A24553b5749G6368J7093a29529A07670g129A14649a58208k56498a44883a3850
8846b20156A90236a17050e0909j69452j75566J63036c8956J0175r1371L3175l5705
$$ [...]
##END NTUPLES=NMR SPECTRUM
##END=
