##TITLE=AC1473_13FB002635_8026882_x02myc3yUk
##JCAMPDX= 6.0         $$ Bruker NMR JCAMP-DX V2.0
##DATA TYPE= NMR SPECTRUM
##DATA CLASS= NTUPLES
##ORIGIN= BRUKER
##OWNER= Administrator
$$ 1.72 TOPSPIN		Version 2.1
$$ 2013-07-18 18:26:58.114 -0700  Administrator@X
$$ Compression mode = diff/dup
##.OBSERVE FREQUENCY= 400.02188249412
##.OBSERVE NUCLEUS= ^1H
##.ACQUISITION MODE= SIMULTANEOUS (DQD)
##.ACQUISITION SCHEME= undefined
##.AVERAGES= 8
##.DIGITISER RES= 22
##SPECTROMETER/DATA SYSTEM= spect
##.PULSE SEQUENCE= zg30
##.SOLVENT NAME= COFFEE_meoh
##.SHIFT REFERENCE= INTERNAL, COFFEE_meoh, 1, 14.98509
##AUDIT TRAIL= $$ (NUMBER, WHEN, WHO, WHERE, PROCESS, VERSION, WHAT)
$$ ##TITLE= Audit trail, TOPSPIN		Version 2.1
$$ ##JCAMPDX= 5.01
$$ ##ORIGIN= Bruker BioSpin GmbH
$$ ##OWNER= Administrator
$$ $$ E:\/data/COFFEE/nmr/AC1473_13FB002635_8026882_x02myc3yUk/20/pdata/1/auditp.txt
$$ ##AUDIT TRAIL=  $$ (NUMBER, WHEN, WHO, WHERE, PROCESS, VERSION, WHAT)
(   1,<2013-07-18 18:26:51.629 -0700>,<Administrator>,<X>,<go>,<TOPSPIN 2.1>,
      <created by zg
	started at 2013-07-18 18:25:45.504 -0700,
	POWCHK enabled, PULCHK disabled,
       configuration hash MD5:
       C8 4E 4E 5D D3 5C D8 9E 9F 52 82 E0 59 8A DE 15
       data hash MD5: 64K
       A3 65 BE 0E F8 7A F4 C5 59 CC 68 14 6B 3D 5E 36>)
(   2,<2013-07-18 18:26:54.504 -0700>,<Administrator>,<X>,<proc1d>,<TOPSPIN 2.1>,
      <Start of raw data processing
       efp LB = 0 FT_mod = 6 PKNL = 1 PHC0 = 0 PHC1 = 0 SI = 32K 
       data hash MD5: 32K
       EE 03 B2 B6 B4 79 0F 5A B0 6A 95 51 23 67 F8 F4>)
(   3,<2013-07-18 18:26:54.801 -0700>,<Administrator>,<X>,<proc1d>,<TOPSPIN 2.1>,
      <pk PHC0 = 94.95483 PHC1 = 0 
       data hash MD5: 32K
       86 1D 11 DB 7A F9 B5 BF D0 F5 C4 14 18 55 B4 16>)
(   4,<2013-07-18 18:26:54.895 -0700>,<Administrator>,<X>,<proc1d>,<TOPSPIN 2.1>,
      <abs ABSG = 1 
       data hash MD5: 32K
       CF 47 21 D2 E6 FA CD 66 36 ED 7E FC A6 5B 8C A4>)
(   5,<2013-07-18 18:26:54.989 -0700>,<Administrator>,<X>,<proc1d>,<TOPSPIN 2.1>,
      <abs ABSG = 2 
       data hash MD5: 32K
       37 99 DA 0A 6B EE A1 4E A1 87 DD 7D 38 C6 FF E5>)
(   6,<2013-07-18 18:26:55.051 -0700>,<Administrator>,<X>,<proc1d>,<TOPSPIN 2.1>,
      <abs ABSG = 3 
       data hash MD5: 32K
       D0 48 1D 18 41 14 26 8D 5E ED CF 8A 7B EE CE C5>)
(   7,<2013-07-18 18:26:55.098 -0700>,<Administrator>,<X>,<proc1d>,<TOPSPIN 2.1>,
      <abs ABSG = 4 
       data hash MD5: 32K
       59 D5 BB 14 88 31 2A 23 79 72 53 C4 41 60 98 1B>)
(   8,<2013-07-18 18:26:55.145 -0700>,<Administrator>,<X>,<proc1d>,<TOPSPIN 2.1>,
      <abs ABSG = 5 
       data hash MD5: 32K
       9E B2 EB C9 EB 8B 4D C7 5B D8 B1 63 80 16 95 86>)
$$ ##END=
$$ 
$$ $$ hash MD5
$$ $$ 73 82 E4 C8 A7 F9 B9 EC 86 03 D1 B0 8F AE 38 27
##$RELAX= 
##$RELAX= 
##$RELAX= 
##$RELAX= 
##$RELAX= 
##$RELAX= 
##$RELAX= 
$$ Bruker specific parameters
$$ --------------------------
##$DU= <E:\>
##$EXPNO= 20
##$NAME= <AC1473_13FB002635_8026882_x02myc3yUk>
$$ [...]
150 150 150 150 150 150 150 150
##$TP07= 0
##$TPNAME0= <>
##$TPNAME1= <>
##$TPNAME2= <>
##$TPNAME3= <>
##$TPNAME4= <>
##$TPNAME5= <>
##$TPNAME6= <>
##$TPNAME7= <>
##$TPOAL= (0..7)
0.5 0.5 0.5 0.5 0.5 0.5 0.5 0.5
##$TPOFFS= (0..7)
0 0 0 0 0 0 0 0
##$TUNHIN= 0
##$TUNHOUT= 0
##$TUNXOUT= 0
##$USERA1= <user>
##$USERA2= <user>
##$USERA3= <user>
##$USERA4= <user>
##$USERA5= <user>
##$V9= 5
##$VALIST= <valist>
##$VCLIST= <CCCCCCCCCCCCCCC>
##$VD= 0
##$VDLIST= <DDDDDDDDDDDDDDD>
##$VPLIST= <PPPPPPPPPPPPPPP>
##$VTLIST= <TTTTTTTTTTTTTTT>
##$WBST= 1024
##$WBSW= 4
##$XGAIN= (0..3)
0 0 0 0
##$XL= 0
##$YL= 0
##$YMAX_a= 636009
##$YMIN_a= -539610
##$ZGOPTNS= <>
##$ZL1= 120
##$ZL2= 120
##$ZL3= 120
##$ZL4= 120
##$ABSF1= 14.98509
##$ABSF2= -5.573092
##$ABSG= 5
##$ABSL= 3
##$ALPHA= 0
##$AQORDER= 0
##$ASSFAC= 0
##$ASSFACI= 0
##$ASSFACX= 0
##$ASSWID= 0
##$AUNMP= <proc_prof1d_extract_pilot.lims>
##$AXLEFT= 0
##$AXNAME= <>
##$AXNUC= <1H>
##$AXRIGHT= 0
##$AXTYPE= 0
##$AXUNIT= <>
##$AZFE= 0.1
##$AZFW= 0.1
##$BCFW= 0
##$BC_mod= 0
##$BYTORDP= 0
##$COROFFS= 0
##$CY= 15
##$DATMOD= 1
##$DC= 0
##$DFILT= <>
##$DTYPP= 0
##$F1P= 0
##$F2P= 0
##$FCOR= 0.5
##$FTSIZE= 32768
##$FT_mod= 6
##$GAMMA= 0
##$GB= 0
##$INTBC= 1
##$INTSCL= 1
##$ISEN= 128
##$LB= 0
##$LEV0= 0
##$LPBIN= 0
##$MAXI= 10000
##$MC2= 0
##$MEAN= 0
##$ME_mod= 0
##$MI= 0
##$NCOEF= 0
##$NC_proc= -8
##$NLEV= 6
##$NOISF1= 0
##$NOISF2= 0
##$NSP= 0
##$NTH_PI= 0
##$NZP= 0
##$OFFSET= 14.98509
##$PC= 1
##$PHC0= 94.95483
##$PHC1= 0
##$PH_mod= 1
##$PKNL= yes
##$PPARMOD= 0
##$PPDIAG= 0
##$PPIPTYP= 0
##$PPMPNUM= 2147483647
##$PPRESOL= 1
##$PSCAL= 4
##$PSIGN= 0
##$PYNMP= <proc.py>
##$REVERSE= no
##$SF= 400.02
##$SI= 32768
##$SIGF1= 0
##$SIGF2= 0
##$SINO= 400
##$SIOLD= 32768
##$SPECTYP= <>
##$SREGLST= <1H.CDCl3>
##$SSB= 0
##$STSI= 32768
##$STSR= 0
##$SW_p= 8223.68421052631
##$SYMM= 0
##$S_DEV= 0
##$TDeff= 65536
##$TDoff= 0
##$TI= <>
##$TILT= no
##$TM1= 0
##$TM2= 0
##$TOPLEV= 0
##$USERP1= <user>
##$USERP2= <user>
##$USERP3= <user>
##$USERP4= <user>
##$USERP5= <user>
##$WDW= 1
##$XDIM= 32768
##$YMAX_p= 441487077
##$YMIN_p= -675832
##$CURPLOT= <Network HP LaserJet P1505>
##$CURPRIN= <$Network HP LaserJet P1505>
##$DFORMAT= <normdp>
##$LAYOUT= <+/1D_H.xwp>
##$LFORMAT= <normlp>
##$PFORMAT= <normpl>
##$SURQMSG= 1
$$ End of Bruker specific parameters
$$ ---------------------------------
##NTUPLES= NMR SPECTRUM
##VAR_NAME=  FREQUENCY,     SPECTRUM/REAL,   SPECTRUM/IMAG
##SYMBOL=    X,             R,               I
##VAR_TYPE=  INDEPENDENT,   DEPENDENT,       DEPENDENT
##VAR_FORM=  AFFN,          ASDF,            ASDF
##VAR_DIM=   32768,         32768,           32768
##UNITS=     HZ,            ARBITRARY UNITS, ARBITRARY UNITS
##FACTOR=    0.250966925370066, 1,           1
##FIRST=     8223.43324360094, -64086,       -26805
##LAST=      0,             63357,           -109123
##MIN=       0,             -675832,         0
##MAX=       8223.43324360094, 441487077,    0
$$ Real data points
##PAGE= N=1
##DATA TABLE= (X++(R..R)), XYDATA
$$ [...]
23824 -115383 -242972 -224842 -267531 298056 141320 33843 -78497 177182 127649 39880 -21294
23812 114859 -135057 -118148 -130227 258461 7621 83011 -316476 98613 -104250 82284 -122017
23800 -224971 -164189 -158308 87294 -43667 211593 -239530 -55128 -165708 -28629 -238374 74733
23788 81274 166236 -13000 94654 228337 -24235 199271 -334866 -16862 -129782 105820 -71266
23776 -120814 118824 -50079 -54207 -76463 -46195 59401 56600 -50152 -279934 -46165 409792
23764 57883 -54563 129847 -10839 61398 89607 194886 100294 239208 75315 68071 45170
23753 45170 -133637 107394 70045 116447 98752 -42332 -128985 -128743 -148128 124190 -250584
23741 -12362 -114312 -332752 -141641 -40514 3273 184437 -185665 -430380 86242 81701 157529
23730 157529 -49650 163851 99303 -246721 -325881 -296378 131629 1793 -177699 16815 190998
23719 190998 346103 50140 -29767 152667 74462 -46972 -186235 -227984 269358 13938 -342522
23707 205274 -175044 -11051 -162291 -76048 -126446 -250752 -300982 -21275 -91690 303362 169303
23696 169303 -40185 165145 206882 -192703 14685 1790 -90114 473024 1866 83374 282079
23685 282079 -34665 -280347 -348191 -346339 140853 81950 296321 -98677 -48236 -63243 -112655
23674 -112655 108364 147191 50980 266705 -4718 30343 -26986 -193736 38502 -40558 37801
23662 215554 -209100 -84761 254354 -90433 -12014 146873 -65808 -83945 312730 20383 247908
23651 247908 -14822 144210 23618 -75678 165243 -53468 184957 -221296 126370 -82069
23640 85818 -203258 -2810 -39149 104404 -24200 187211 -863 -322321 -129355 -128752 150533
23628 -415916 161052 -99291 98604 392944 96175 -49831 129137 -440564 -89987 -10473 -954
23616 -17912 -136936 -55233 88928 4629 89352 -142031 -374371 -5619 -191875 -79201 10183
23604 -16270 -240157 -75861 -24396 19009 -109032 101789 -182021 180898 -52090 22674 66501
23593 66501 121146 99564 186056 136292 -126105 145167 -53983 -96596 -165839 -84304 -71845
23582 -71845 73676 -110198 -60912 74802 -125529 -155161 65162 -86800 -97872 -183467 186120
23570 195261 50510 83239 10764 -130595 80296 160266 71091 224166 227422 11534 -17675
23558 -71567 126146 -191099 -129539 -388371 -203399 42222 -198628 -198214 93265 140066 -6045
23546 -43247 132379 -316964 -139129 -216164 -22212 50694 119072 120012 -172661 -181815 453831
23534 125912 225496 -114141 287229 247490 26977 97964 204472 -350354 -226137 -107309
23523 -173247 -220936 90338 68560 -29339 261904 -129451 137918 -106035 -56547 -225443
23513 -225443 105409 -63468 -85876 130729 167992 -244746 -4837 -102662 159271 86239 -139285
23501 -211593 -137218 218191 -53791 13348 -123282 173981 -193641 -183337 -49961 155540
23490 147574 288734 -440465 284957 33054 68013 -22059 200341 44495 60660 58942 -105050
23478 28691 -186004 314296 106387 -124128 -225737 61799 69471 22614 -156617 -99182 136434
23466 213081 121568 159359 -45495 -91854 -283493 -299715 -90423 -132130 -204778 -11990 171780
23454 145973 -132283 225826 109209 231074 -246636 101816 -314163 -133784 141285 -215452
23443 13101 -148773 -195833 18153 -109206 -48574 23994 -369546 -262355 -126575 -321288
23433 -321288 -98564 150753 26778 -73770 -463758 187553 113896 37318 -1224 -12773 409077
23421 -19802 392777 -141737 193275 99082 -64243 28698 -79100 -361480 -125717 -388031
23411 -388031 -316089 215731 -132389 -175282 63900 178921 -264208 13986 12980 22968 -51261
23399 -85333 -37163 -139332 273204 42594 -49846 82998 223386 136772 39357 -110924 -28607
23387 -269448 -182568 188500 176444 -60722 -121892 -52459 -231925 -75146 192495 67092 -139240
23375 -74484 -248397 67012 -114892 -43773 -252187 146277 -73130 -74277 38861 -153419 -118933
23364 -118933 -75157 -17010 -292337 79217 -200530 -28842 -194760 -106148 -202834 -188524 -40306
23352 -120197 -198766 -113787 101885 -142426 48712 38326 103955 135760 -359843 -321987 334908
23340 -337029 233326 -149755 102993 397423 -207083 20098 8880 -118192 150625 250978
23330 250978 -50998 -195567 -143837 -253145 123697 172639 -35084 -81667 -138324 -45947 -397381
23319 -397381 -227589 -70134 10392 146401 -144317 -136280 171594 68465 -92963 -163339 45853
23307 -158022 -9356 -231754 -153795 186430 15524 -260665 -274117 -274761 52102 -46254 -298131
23296 -298131 -293891 264102 -76866 46066 184239 -123633 67201 26643 52608 -118315 105801
23284 -84952 -332070 -198681 3124 -122537 -24784 70701 -91649 -274110 -279389 45554 199283
23273 199283 -264704 -117060 248971 310081 44115 41552 -164656 -116375 311043 -92577 -228909
23262 -228909 -97308 -126215 -47355 233160 -35705 13880 132522 154728 -144250 173700 -94868
23250 -29764 -14615 210354 241248 5840 178773 -60502 -186609 -77504 89679 -76399 -607 -44258
23238 -44258 -138232 -242947 -123557 94543 219186 -98174 97741 63935 208262 107251 -120707
23226 -241536 8180 -220948 112537 247320 213949 -103422 -285145 433300 148360 110740
23216 110740 45808 -110295 117326 -38657 105304 4486 6966 124486 -209249 144876 61992
23204 -176355 -235857 -85710 -73079 83674 57692 -139958 12192 68186 80910 -236255 2241
23192 -348781 -282286 -206851 103485 -96410 -49735 187374 -98149 -171066 21719 -142280 -193723
23181 -193723 112105 -260143 5361 -88011 -216761 353518 -127251 -152859 -240418 119477
23170 229797 270939 228009 -277156 109090 5072 -13704 -15520 115262 6966 -145909 -222305
23159 -222305 117019 -8018 -176656 -336299 -223214 -216184 146908 -44731 66466 156203 266509
23148 266509 25920 -52766 256722 -77400 -53976 -117437 120281 69231 48151 178393 -90949
23136 -8057 124660 -227531 246252 97265 -247151 34300 -215582 31189 27742 110514 -342678
23124 205502 -28969 -244188 150601 5932 240987 13030 8484 -223230 -4749 57798 222091
23113 222091 185820 76445 -48896 -254424 128913 125582 108408 -63165 -143893 178557 133121
23102 133121 -268788 -93322 -93962 226592 -175874 78808 -105360 422621 14087 -154121 -21933
23090 -81543 -247090 -59213 -127465 196073 -221723 -41628 101488 193691 5622 -170765 -282948
23079 -282948 -362462 163340 -91103 -365287 74611 18219 -190209 -149865 -22178 -171391 -169373
23068 -169373 -144790 80552 96494 -336933 -152401 -239301 -89948 194588 -261985 5437 119444
23057 119444 -58882 98409 144950 52556 -25361 -99130 294609 -85541 96504 41368 -27150
23045 45908 106849 -86665 35281 -359179 32948 1022 208695 -42230 -124604 24531 90188
23034 90188 333373 -146321 63508 6105 250798 -21723 96003 -258572 -77977 -178654 204389
23022 43979 185858 70920 -223600 -92204 -147144 -267310 -146897 -37498 -62579 21526 -143814
23010 70368 127949 -202860 -16867 80752 120743 159691 32703 -264425 34552 -155327 -9802
22998 -293307 -146905 -23505 -279567 70630 158864 9956 -372813 75470 -132261 -89944 132112
22986 -94541 -267658 150814 -216907 39796 -191914 300103 -421238 107804 27832 -175733
22975 -45603 -350527 -179396 -38016 -237551 177800 38088 173229 -49418 70723 -21150 195973
22963 30950 120241 8131 -31835 96983 -109746 -111774 -8409 201057 -1676 -72769 410350 231999
22951 231999 125613 57209 89381 211320 -270358 158055 238844 31571 -293676 -210545
22941 -210545 150602 520438 -93856 -123201 370400 135183 -186658 150311 204391 143030
22931 143030 -40879 -44044 -259829 200688 -36424 -50353 32407 101734 245536 -23348 42446
22919 201399 163072 42429 -18535 -250529 -62504 -173228 -367692 103108 -153572 197134
22908 -353148 82421 -54160 107933 84446 19968 -206492 -237515 -284636 133221 96075 -4020
22896 142090 -10555 183938 59219 -37578 192975 -119799 -282019 -303832 211312 213600 20540
22884 81812 25472 -96528 346611 -363763 -77449 46691 76516 54387 -156882 308421 211414
22873 211414 222453 -41665 125547 -269078 -113640 155888 206781 -167117 -299580 -446842
22863 -446842 -35832 -26092 10079 107565 -493384 30568 -49180 -27756 38038 -421954 -59318
22851 -25142 -175364 10289 -41622 -115011 18004 -272019 -318451 -216493 158859 -70078 111772
22839 -65027 -53373 32351 -87905 -259156 155767 -279250 214964 -39379 54681 136657 -378387
22827 77299 53741 12859 43896 72771 -252130 -217107 48975 149926 203509 248080 129569
22816 129569 -61525 96917 -110692 -317099 -46887 69834 -33339 -61308 -118420 -109093 95145
22804 101273 -65638 46233 118611 -193494 -176468 -70734 -111646 38123 31557 -55962 115466
22792 -208681 -184536 -33924 327915 -426860 9291 -42900 -253306 -192938 -445041 -25911 -215395
22781 -215395 -534131 -56864 81340 4136 -30019 121453 -26741 271995 -545763 -33446 -34760
22770 -34760 204200 -207744 256895 -118900 -123341 -279263 316343 -235881 -163801 -215551
22760 -215551 212960 105227 -175377 -222638 64102 176373 24099 -214006 -44574 98520
22749 61182 53931 -339039 -241132 -124497 -164832 140290 477210 -34437 -46701 74085 192646
22738 192646 -27808 11567 389915 23560 -211603 -230144 7430 -183207 45264 -82226 -212683
22727 -212683 214157 -235922 311 215917 5822 123120 -140591 -84848 52961 65830 -38945
22715 -337256 -374330 -357464 21078 173010 119037 108371 -100149 -67789 -16299 -86315 -31550
22703 102380 -140668 174546 227785 98056 -206208 72567 363506 -20009 -53309 -300799
22693 -300799 55591 -134072 -151067 119901 -238342 3895 -23133 -185490 -67148 -43959 47634
22681 -195565 270449 255460 212214 232403 201598 185398 -184933 -117326 135074 79485 -7720
22669 -1222 13754 -249881 -45315 -29103 46294 -163624 391 -317935 165106 1568 125229
22658 125229 -6028 -141596 -24752 268228 -287630 -281331 -179387 42822 153335 -187789 -76635
22646 227858 -34543 -227636 7151 39432 -159104 129846 -97759 -96594 -189866 -56535 -276869
22635 -276869 22719 -112044 -113939 121078 158902 136193 155081 -195379 13018 -456714 -170213
22623 69000 -169207 -123518 -342992 -160249 -56562 49248 -51092 35299 72968 -16665 -260757
22612 -260757 -92024 -150620 -149311 -43285 -100515 -235607 -74661 -14023 293327 -37485 -13980
22600 -251889 -85753 104151 -93606 -122651 6167 -171798 -59872 15415 -174596 -225415 -193898
22589 -193898 -235878 230727 209322 -366685 179083 188052 217780 -84596 50360 -106702 -44369
22577 310408 -124376 -36338 31114 -40809 207474 -71824 -76610 -174613 198494 -12515 133218
22565 -191454 196298 47474 -56817 -262563 -283677 -48830 -40377 -508495 -175393 70405 94684
22554 94684 -51027 -24972 59450 -36771 74713 -330650 -63170 125331 -8412 -110093 35549
22542 241417 -215690 592 103333 -159198 32103 51034 57276 122754 114624 91478 50033 -20031
22529 -108473 -45355 432372 -109893 -221755 45865 -31998 77766 68900 20437 -312497 -412463
22518 -412463 -280119 -230805 -84872 237813 -156227 -306671 156560 80995 -382504 -116003
22507 95111 67036 -176504 -206459 -151156 293435 -159871 129548 -296773 35557 30116 194848
22496 194848 51307 97797 -311441 58147 47956 -38923 -203867 -188916 -221892 -87007 -24972
22484 69608 -140760 237388 -282505 -15481 -391047 123076 150866 63996 603481 -68464
22473 -71318 256007 17704 -289183 -49300 -197654 -4443 31820 145879 -285769 -131015 -178665
22462 -178665 -45479 -130877 -186143 -195436 -24028 191024 -317338 -222417 -12286 -313603 58993
22450 162556 -86540 -44684 156309 -338760 24189 36438 -108361 -52010 -27336 -140339 -121812
22439 -121812 -269373 -144561 -215310 -376061 -360394 -83653 -105491 89940 -15395 -41178 66436
22427 147532 -107964 -13158 264313 -168027 15724 72283 233491 -401379 -233673 -129167
22417 -129167 -127849 -233936 -94634 323040 256735 266498 -252280 7146 -62876 227949 -8636
22405 -130616 -51942 433710 -208336 -202232 -184441 -81158 -161667 659355 51712 142558 -238862
22393 172493 125832 -355720 -58558 48716 -74017 301596 100534 -151497 55934 -503765
22382 -22569 198289 61489 -113340 245100 -228265 -100182 -98697 150073 18008 97692 -4884
22370 -21798 196360 -105652 -14440 112312 -81945 34813 108929 -175471 -162127 -52397 -39101
22359 -39101 -63468 -178785 22923 -12571 -152755 -16131 -81444 -338183 18225 66510 68868
22348 68868 -20932 67807 99211 16691 -80900 -59866 -48081 -107922 340046 -152623 -125808
22337 -125808 58471 117272 -109990 240510 350628 -132754 -51103 -276778 19290 -165359
22326 -38331 -30627 -473884 104886 -78852 -305454 -78533 145437 37946 -71706 -264736 35607
22314 146168 240031 -174331 -263523 123409 -434419 -114823 -6940 -36085 430710 -8983 -123624
22303 -123624 -172951 -163997 54631 212539 -81221 98785 123214 303116 -62404 -31226 96343
22291 244052 4715 34825 28932 -318796 197223 -346202 -138191 -168745 -15829 219421 -196777
22279 -223340 -319390 -57148 -19541 -284647 -71369 -53098 -272254 -39101 -73949 348485 -120007
22267 46471 33483 -167865 69851 -179764 -271007 -19706 257584 -388710 24900 -19321 -389184
22256 -389184 -37427 -110510 135708 114455 -238752 109093 -26731 46486 313218 19436 -12510
22244 126109 -82713 -156373 26605 258764 -96065 248819 99541 16747 -156135 -31131 -251967
22233 -251967 -292803 -90680 -49341 -269113 74331 -72043 226035 -98954 7573 -182744 -379134
22222 -379134 -975 48583 -45858 -223256 -201842 -204580 -290332 -24285 -203554 263671 -159394
22210 148982 38300 227301 168448 57678 -144412 233953 -113491 -273028 55095 -223930
22199 -196783 35680 132406 -20778 4390 -114676 -283070 57485 76559 -646 -178232 27643
22187 -97577 -79459 95566 91750 6396 -321454 -201196 112270 261582 339848 -256273 444611
22175 -13504 124987 118154 -186531 144929 -164406 -461592 39395 -66812 -122151 3270 175838
22164 175838 283182 -173411 -84695 -292789 -164796 -142735 10650 354804 -88319 -41371
22153 -318898 -184146 -391661 70346 8617 -5055 407717 19983 -89996 116934 -626 -124337
22142 -124337 -131385 -110590 141899 196349 -62668 -47518 -18870 178715 -67415 -283439 -162162
22131 -162162 -103184 -95183 184305 -71943 -216169 -33778 -331022 350894 -166338 -514185
22121 -514185 172429 96275 -243853 40676 126994 73777 -171157 261066 97741 -39153 54103
22109 -81959 66389 321120 24615 -260683 -301331 253148 -39207 -78335 -250112 15547 -45405
22097 -219335 -3196 -179469 166906 -53538 61339 -73616 -43471 35790 -13021 -320021 -53882
22085 11526 -122954 94945 -254609 -163595 -17895 -63624 -235209 -163083 18987 -145921 -417761
22074 -417761 -59988 8843 183561 46745 -195458 -61112 -34377 169404 -9942 -31422 8863
22062 -111823 68241 262447 213371 -129808 150528 293343 -188606 -3611 -28648 -11357 -63665
22051 -63665 148296 163215 297 -480918 -251 37108 -74474 68216 334441 -134250 -80253 -135134
22039 -135134 21074 -128918 -25917 -138983 -8681 -224822 192315 -151004 134576 -261688
22028 -390827 -305593 -35308 -61172 -415137 -4615 23908 -23390 42852 96646 144961 253074
22017 253074 -21149 -147994 275743 -144067 -41195 118601 -20332 68073 -7851 -135069 -105440
22006 -105440 -112803 131542 -135340 38751 -43840 -15161 -213566 202220 208300 -24541 -260729
21995 -260729 -218704 189971 150864 -12884 115480 -95241 -10912 69786 144106 48131 -315405
21983 -22177 60543 20955 133650 -33357 121159 -62431 -39104 -244746 -87550 153925 -38127
21971 108962 -180330 258771 233296 -165918 134536 137346 62624 -92544 -56951 -65837 -185851
21960 -185851 32767 -91317 77087 76485 281467 35397 -87878 -158595 108246 -273511 14564
21948 -75761 -90277 -247505 135677 170088 176615 -17792 -60596 -137378 -224412 -88115 165365
21936 -151872 -90574 -279349 -332982 -13832 -49404 211489 -362497 -375324 54454 -161101 255878
21924 122028 -247365 -93539 -287040 -24814 11208 -102443 380642 82474 -363989 -15372
21913 164293 80590 -183890 549 -35619 -64586 36090 54780 163868 -228949 311329 193471
21902 193471 -231502 202820 -18984 177171 -113816 -417397 -130048 168467 -90854 -80340
21892 -80340 232342 -197224 110705 107338 19508 -4973 107912 265525 -98229 163609 -316321
21880 -132638 -82842 2003 -92164 -97971 25468 140212 67097 116612 -91923 31622 -307525
21868 -39831 9766 104241 45210 27464 35384 -76540 23296 510285 -174551 -61619 -240760
21857 -240760 -217402 -158378 -4888 359446 85302 -110182 -168509 -5742 -141103 135821 -6173
21845 -71168 -174377 -341727 -196116 16615 -135 13324 -460290 -7168 23473 6298 66647 -189109
21832 -138497 -143703 -198451 -27861 177666 75435 79054 87980 230462 -115360 -101616 113143
21820 42226 45275 -86677 -67189 -53296 45987 232858 79003 75338 32042 -481584 -113455
21808 48169 215730 -113275 122732 32519 35553 64348 127676 197546 15553 -38974 -14027
21796 211605 -59907 -243296 -138809 180404 -356253 -138006 143761 -35317 -39581 -18885
21785 168773 -168005 38436 101089 -336112 -10022 97437 -76746 -207008 -76236 -244179 244307
21773 68713 9923 -145041 -90251 -149795 -92705 -182084 115244 173047 -88398 -72263 160736
21761 161030 33988 85825 -47496 -85612 -198865 -296205 -141359 216600 91502 -213659 5672
21749 140987 -66180 1767 -176515 48485 -43463 -17044 -88100 -77025 35950 -45514 24775
21737 -51588 -204499 -116603 -10988 233768 -206868 24272 -307973 -323083 -95305 129052 -422208
21725 118909 -178935 29957 -200437 111239 247183 -87737 226542 10372 157359 301775
21715 301775 -1658 111309 -152876 -778 -5793 -172807 -388239 -135554 -184857 -247747 -120870
21703 -45253 185642 -173687 41069 -195689 -93999 1064 343986 285519 262481 -365661 -242458
21692 -242458 -178504 -244157 46022 -78577 -25481 23420 -101499 -32089 23098 87749 -65562
21680 -23062 30542 598207 -89424 108161 -229216 -74273 -80145 132770 -2895 -134143 91348
21668 -45799 -19747 49050 -67309 -25424 -6912 -107760 -26139 -194155 45840 -544422 -158527
21656 -179025 44664 -71056 42164 194529 84663 -35280 -296231 29692 -6559 -2811 40002
21644 -192823 -76501 103713 41793 163724 -112117 -51961 -327597 94084 59907 67501 106809
21633 106809 -63877 -30036 -279585 -86619 -212526 118376 -146923 -153873 -141843 63518 137523
21622 137523 -188688 -144838 -45426 -107793 -333405 -146562 -317589 145893 44310 -346833
21611 -52181 -145791 -55877 34431 -66772 -19307 -57174 -92828 309425 -308109 116179 -249579
21599 -148331 -269340 156829 49991 38776 209676 81739 -356266 -119119 -35847 -197697
21589 -197697 -244145 -16426 306153 105775 -143752 127688 -5062 -75279 -8849 -83146 -937
21577 6338 -184383 -35266 -15273 4358 -193768 -89556 405957 72118 194006 57220 -82759
21565 -150029 -187409 -143075 -102332 -46004 14135 -60 -303837 43752 76111 -150007 85574 92900
21553 92900 12261 -154547 -169448 156629 -215425 -246009 -164202 -505316 -56516 -31253 62392
21541 152343 -127179 21760 63502 -222007 -175346 288768 -282959 -180630 -25832 -35187 -334914
21530 -334914 -71669 -215135 -338810 46558 94866 -207482 315488 142044 -211943 35730
21519 -212253 158906 -16793 -30273 -390254 5051 65002 143103 -139395 175325 -205584 -121981
21508 -121981 99199 65594 -37208 -167344 -267812 136956 312288 39202 -132665 -6714 68694
21496 212605 224824 44814 384120 173868 158310 -255202 -170847 -24624 -43005 170607 -50653
21484 4007 -38360 97491 -195184 -264434 -354964 34697 -75411 -214394 182936 -113310 -11998
21472 -44414 76172 209698 71097 -150985 161082 -250463 -353141 -121593 -45978 120868
21461 -165938 -125682 -19787 -10407 -88612 -142907 -159201 -9206 110661 195958 -75012 -153529 -261828
21449 -261828 121693 48998 96500 -289596 86794 -226961 9213 -214977 366886 525088
21439 525088 458022 240377 178028 80427 210877 200771 153464 -125584 155942 -170975
21428 62634 174421 62567 134276 25656 -63977 230426 -145768 73455 -322599 -200157 -21775
21416 159320 236747 145185 -24194 351419 -46675 6857 190828 162383 -65959 -210912 -50518
21404 -602457 -267445 -153128 42153 -311172 195796 -39284 16666 -108545 -246771 -40825
21393 -140914 -37949 7392 23348 111261 68700 40523 -105979 -187565 16540 244004 -44972
21381 -162439 -106033 289476 228756 43702 6261 -117102 -258063 -182007 -43505 151672 -329080
21369 -61295 -97785 -169890 -173554 -203509 72660 -194884 -223779 -90733 -292093 -135685 -9614
21357 -165955 94407 -173868 -203924 -115660 124311 -166008 -266793 -279574 60135 262225
21347 262225 90310 -287174 -163164 42849 -201884 192978 -401581 -27771 -245374 -50772
21336 36548 -196845 -104400 -126176 -49512 61514 -177680 -50490 32680 -208816 26542 -82059
21324 225253 11129 -149847 -52364 261562 -211255 115953 78778 -159636 -1780 -101291 155297
21312 -106520 -84116 275496 111361 -33052 -78659 171521 287168 85856 94400 10474 -220770
21300 -1896 386722 121164 53148 -145442 -311302 4805 22863 -130451 -306787 -26360 140677
21288 -162615 176182 90489 -125296 -60006 -202755 112421 133129 -467330 -340219 -334815
21278 -334815 116032 232213 136379 26205 -134706 -156399 67925 -73126 131998 -143092
21267 -121184 -758 158457 153509 -83292 121960 -218737 173559 -291774 90035 59674 21526
21255 -198515 -85614 82509 -174495 5741 -481123 -166063 -319805 110130 -231589 -116372
21245 -116372 21185 -216070 -202089 -146867 -117683 -124059 -30376 -435 113097 -55837 118632
21233 96486 105320 41596 -271461 126002 34827 -193288 268563 85480 -29376 -82821 -87584
21222 -87584 133244 115529 71642 81807 -89922 -74368 114007 151458 -24448 -186573 -203494
21211 -203494 124426 -199720 -35080 -3131 151641 15450 -175880 32877 -11543 -130079 -16592
21199 53635 150495 -129171 246065 76262 -238393 -301647 -314168 -39123 -210679 -41273 182541
21187 -186542 -127668 -91182 -159045 113465 -14845 61323 -62423 -208709 19119 -10544 -258646
21176 -258646 -125545 -6082 293778 158243 -209790 285779 -58986 73624 111119 120646 -219822
21164 -158293 114610 -125955 -218814 34005 1221 72403 -185567 173387 134248 52143 -113970
21152 -38624 -127216 215862 78804 149113 -102510 230848 -265755 -357412 -185133 47906 -77720
21140 -222644 -227172 -62940 152283 -80043 49527 14488 -112044 -106266 51750 120444 -73482
21128 33071 -212066 -209195 -126392 6742 -487140 -116022 -88711 -274502 -49699 -27049 -2170
21116 248106 -106484 -64321 -26405 96795 504 -42317 231920 -243111 -23495 -187374 55870
21104 -209428 -158324 103832 70986 172650 62346 -40553 16481 -115350 -99136 -2545 94179
21092 -192522 262645 133898 -138574 -72476 187589 -206905 33735 -424244 -274041 -168848
21082 -168848 170653 -231281 88902 48846 -46623 -300002 -174073 -223509 -159284 -104771 -349880
21071 -349880 6909 -178547 -83566 47855 30227 -60194 -135113 -496946 25198 -109467 388196
21059 -138371 -111360 -354291 -199735 9453 -141077 -221821 -143300 -353390 -279098 -189395 115326
21047 -34082 -86293 51452 234559 -248123 -94719 -165902 135236 56214 80034 32307 115856
21036 115856 -166945 -356914 -72671 -223669 94676 -245544 -276041 -129879 -287648 146049
21025 -221137 156103 -148820 45110 -8727 22760 -392063 29734 -220573 -223128 291148 140353
21013 -142673 196390 439850 37916 196962 -47909 108593 177851 244715 -289530 65073
21002 82296 -51217 -300391 -255397 -79456 -91088 97475 -112372 203155 158703 -474584 184345
20990 -216097 -67173 -23662 -143117 -108409 -299250 280355 66926 -132845 -351267 -125560
20979 169720 -26929 -49984 92654 172087 11393 32958 206004 184247 -20096 -192116 -82195
20967 149768 -164463 90158 -27178 -2539 -48119 -102380 132621 -156883 169291 184245 -64504
20955 -296505 -107112 -404854 91576 -48457 -119601 -68866 -381765 136081 -77323 -217609
20945 -217609 -189069 -10749 -75776 -3240 -145785 197882 57859 -288520 18008 -186255 -179129
20934 -179129 122674 -221561 127294 -39544 -15072 -9369 174919 -172836 -259917 221790
20923 -36165 -205008 256489 -129830 -99245 -45453 229501 -168776 202472 36359 -254516
20912 -46636 24864 333475 -358152 -239035 122619 -1462 18969 85416 172232 -449828 5667
20900 110192 -53201 150578 -282916 -170484 -138427 -138913 -133452 -219811 54933 -52030 -236272
20889 -236272 -66838 -140924 -20779 -47235 -30716 -128453 -298686 119483 374906 -84418 -15748
20877 -336680 -375059 462234 -96520 -332058 -323286 -107614 -80349 21464 62389 61469 -65736
20865 -178067 -40501 22402 118806 -82874 -36143 268453 -68791 -190005 214419 -263071 180609
20853 46981 -124394 -271613 129221 -61278 -164672 -245034 -139739 -180954 264559 -42907
20842 82393 -232187 55358 -99245 -111283 135644 -157031 -98477 -25595 -12819 -166745 -141281
20831 -141281 25732 -116054 136433 -62756 290122 -213734 -322942 -305675 18690 -183445
20820 44891 55955 -132181 -94080 183343 -210793 -222177 -240032 -140789 150728 -63703 76758
20808 -212144 -54025 6664 -5047 186171 -136982 -165579 64353 -106735 214325 -86296 443803
20796 -311818 52369 -309802 -249088 155677 -169791 -29784 -338415 8124 135823 -99637 -260576
20785 -260576 -33368 52773 -17714 29233 48256 -116725 261013 178747 61841 206006 -177199
20773 -181621 -158381 113197 155002 -194616 -106573 -75438 -163895 -38284 53434 -178365 -97588
20762 -97588 -426250 -333475 417410 -33563 192916 -77138 -108077 -82109 232383 157187 -265306
20750 -141144 87085 -136530 71568 -145400 -123046 -119247 119718 -132062 -35684 -26668 269183
20738 -151151 -105909 -33973 -202239 202631 40147 -453935 -37070 64304 180807 -212924
20727 170519 -152865 -136017 212899 -118323 187081 -359951 206690 -252980 -174127 -8472
20716 -67188 -194150 56073 -7870 -47889 -48482 -47472 39544 -107544 -330698 242842 -245717
20704 -74050 13836 -118321 374685 -191194 -141436 287437 -59015 -302439 36240 -222930
20693 200912 19369 243896 -220585 -62474 -149054 59078 -105588 -218018 -141398 78666 109774
20682 109774 42430 -212300 109341 -112889 -183346 -131908 95833 -49575 76925 95905 -160541
20670 -142008 89460 19275 -327488 -172352 59694 -142394 -160556 -160947 86377 146876 352470
20659 352470 15796 76268 3577 20666 -102996 -249908 -249794 164626 -197748 -122966 -543273
20648 -543273 -86394 -11373 25202 46406 -230374 -119441 -175677 -82402 -255862 112371 -328716
20636 -36628 -114497 -264707 6193 -296065 -107361 -114762 16606 -419036 278994 -49566 -264936
20625 -264936 -8298 70836 13337 -135301 -215715 248710 -378946 34211 133396 162900 -216821
20613 -58201 42625 230742 -9332 142281 -166388 56426 -250993 15837 -116843 239796 -14050
20601 -247426 -386990 -163841 -155851 14472 -122879 -3819 128218 -216490 147194 -264140
20590 183187 198047 102927 -34993 362651 284463 36858 83758 -5322 23312 35640 235589
20579 235589 155578 14631 77718 -99280 125037 -24776 88585 256315 -352279 94537 -267173
20567 124 28591 -196751 -24048 -117125 -15933 108859 -43215 -12499 -83705 -94562 -178610 -135978
20555 -135978 109022 -176148 -232795 277958 249230 12440 92084 -81249 -99197 124912 -7918
20543 -118247 125583 -26736 -188317 -8432 -424424 -48302 -146347 91917 56793 -158784 -228976
20532 -228976 52619 -155527 -22540 47409 -268721 -42545 35493 287493 -33057 169335 -117054
20520 85442 -301029 149079 -44144 84494 -66108 91169 69527 72020 -86762 -323991 -381796
20509 -381796 226039 -46291 -98738 -214134 253768 36981 246038 28984 64732 71713 170440
20498 170440 -140632 140581 -210818 -274072 -191800 -374414 -100720 -64916 -82162 143961
20487 -283245 207626 -43553 72454 150786 50217 -261123 -232297 -54383 -105596 28293 -27579
20475 -89378 -49024 -407629 11868 250729 -139168 -60214 -255118 -48433 15083 -46452 107024
20463 -61991 21307 67673 101236 -91747 -106339 169605 491438 -228197 166327 -173773 28878
20451 55590 -675832 167581 -120320 -133303 -276300 -237433 90492 -99446 -193972 -141474 -52291
20439 317392 -190464 129407 -50630 -251651 -159958 -414912 194615 -51915 -260330 -46946
20428 -226012 -205857 203892 -53635 202392 -171717 35994 -200691 -143736 -50747 -241423
20418 -241423 -117698 168720 -137916 -149765 -272934 -89810 -74152 239965 139810 -296189
20407 -134233 83155 23622 -102736 -102429 60102 133765 181616 -385679 -100503 -175918 -98178
20396 -98178 -156368 -120861 -221322 -292089 87826 -199343 -442534 -207013 -377833 162584
20385 -214466 -170501 -126306 -183522 -214875 -8673 -247465 74516 -228628 -111201 -506417 -186816
20373 -168276 -77784 -10431 -137360 60146 63500 -177866 169825 -234975 -230232 11077 245600
20362 245600 -213244 -420215 83997 150318 -64476 -157052 -177806 -218241 -218985 -253203 -31859
20350 168028 46711 -249821 78959 21765 -70294 180547 48722 -24299 -231229 211537 129341
20339 129341 9305 29621 48776 203741 256799 -138187 39905 438678 -89221 43901 -143508
20327 -309472 -323656 152695 -281505 -134038 -115579 45756 108673 171646 -25728 -197774 -204767
20316 -204767 14952 -234083 -156237 2153 81455 184035 -107972 -72500 93696 103808 -127915
20304 77855 74365 119617 -309209 -124607 170089 -241473 -11549 103079 142676 244397 -125165
20292 -198521 -31663 -77478 -78840 -27830 37311 -46621 -31820 103070 -46504 -175737 -130256
20281 -130256 28673 7418 220119 -120757 -28435 -217474 -282696 36079 -202151 17624 -10325
20269 -392657 -67582 -235594 162403 -231503 75090 -323575 -32932 -255054 -93965 162782
20258 -211133 -16667 -465963 -298864 -233710 158679 -167589 22917 35657 -5126 -159041 28800
20246 -425378 -372653 -274 -349286 29897 147645 -128893 -318927 42135 -152644 -43920 94083
20234 41073 -423885 -269539 294227 -127120 22746 -23456 144654 -158865 -349567 -98842
20223 298771 -270617 -135485 18281 64214 52649 10617 189045 -207756 42002 96526 -194259
20211 -192777 42684 102402 -451 184663 -119805 -164950 -208537 164657 -300364 223536 89190
20199 -224629 -191378 -33487 -198816 -17252 -203750 -143092 -95981 134633 34792 -41645 -179952
20188 -179952 -257498 -64108 -21495 -121148 -75925 -192036 -56652 40212 36696 52979 -133477
20176 -128057 173862 32936 62924 -246766 -278581 -168533 7986 148191 190890 -216825 -30044
20164 -423581 -321702 145435 -46675 -157424 -36179 247247 -33552 -6141 -216191 -350474
20154 -350474 -197575 293816 -84451 227013 149011 265070 107601 -193216 -141759 13537
20143 45377 35794 -108181 -571288 -328924 -88093 -342136 470911 107870 -12056 -103501 -270598
20132 -270598 -247785 69581 -146998 -224590 -92134 -84674 110979 29418 -57116 -175316 159028
20120 169662 -198069 128399 -251779 -105282 -142532 326623 -210199 -149206 -113580 -233643
20110 -233643 49787 -141789 -195377 37820 -354728 457262 156389 91913 -151869 -259447
20100 -259447 -177875 66420 188429 -326425 -271959 -234494 211169 -3641 177412 -12641 31337
20088 270058 -96117 -269919 71949 -221465 58659 -179381 52083 -10197 293778 -244380
20077 -15670 -77793 321220 92351 -61421 -81626 -61767 18965 158069 -122795 -236415 -211195
20066 -211195 83768 -8000 -289744 209353 -83837 -123980 217772 63424 139889 -70317 -211255
20055 -211255 167231 103137 -114221 -187096 77366 -69395 -161462 -33002 -77847 105506 15636
20043 -257839 49902 -136721 137275 78790 95808 -12448 -140798 71010 -68837 -69985 125794
20031 42444 -214032 -439926 26561 -654066 -313533 -328070 -59864 -379268 -129563 -7322 -61803
20020 -61803 208245 69137 -71124 -97408 134055 -194422 26979 267743 -65262 20411 45414
20009 45414 -114581 141288 63323 -311870 -76890 -105204 282978 -49417 -60253 101022 -23063
19997 -52999 -406820 -138451 389441 -304728 57948 -212710 -12048 -64431 229805 202691
19987 202691 -57102 342427 -174351 295964 -97567 -119290 -127027 167060 16263 -121996 -138071
19976 -138071 -126695 40064 -287785 -40460 -24779 -10353 -422849 -72986 -98902 95709 -24558
19964 -58426 26505 414286 66715 -52215 366164 -99546 -427187 -375552 1274 -208873 82542
19952 -178700 -68424 84872 97020 -168005 45799 -152532 -39722 17372 -68602 -117706 -180418
19941 -180418 -322868 -337964 -277400 -34292 -101244 250250 209615 -236022 -57012 -1119 -22523
19930 -22523 -97102 -54675 12163 -458000 -88192 -4221 106603 18671 198398 15423 -23846
19918 236488 -157678 -113717 -215495 -203874 -120490 -161063 249799 7049 -172038 -196391 -78884
19906 126360 115652 -18614 -245077 -280471 -375100 9210 35583 -340941 111432 24647 -49741
19894 72362 228743 253029 -220936 81834 -124949 133258 -214498 -164713 -417438 -53864
19883 -101035 25535 -226703 307917 -438095 -67525 -83854 -58329 -291460 31341 -248867
19872 31161 -180285 -229012 -13870 -2630 -226976 -250099 117843 -411546 -165498 -218677 -37161
19860 42791 -190819 27588 -56886 -138618 -7651 -367944 143510 232516 -6733 -127464 254155
19848 111704 133798 283264 -470007 -116785 -179562 -318436 -186338 -29669 100115 86778
19838 86778 122723 -31350 112738 172704 -407603 187179 -49447 195392 15245 -193696 -198356
19827 -198356 47754 70955 -133714 -51448 -32555 -35046 -51135 544903 -5036 -159000 -172395
19816 -172395 -154365 205306 -194522 33947 -141069 -283862 -52194 366896 -90104 -62668
19806 -62668 1533 192378 -116112 -34273 55528 -118804 19836 -122556 -260503 -71129 141414
19794 -78338 -129675 -17029 114624 66555 67092 48145 29939 -106587 28441 -87929 -306011
19783 -306011 29494 35116 104087 151392 -85723 -234470 -203784 23048 -218281 -3471 -275024
19772 -275024 -213608 133478 -32093 -8537 -273444 138931 -28002 167828 110694 151363 8152
19760 -12137 40713 -37378 -84665 212567 -58357 -163592 58033 -241639 16140 -147810 -53849
19748 122784 -282664 -208319 -102295 -124691 8530 -176499 100095 -118239 5146 -86391 72867
19736 -177384 -314120 48244 35830 45378 -178788 175287 54458 -4470 208593 -180893 -261975
19725 -261975 -25290 -171068 32806 226537 -313195 79736 -174490 111067 139001 -142589
19714 287519 -44176 160143 221770 33258 -68563 -148872 -211211 -177826 56907 178158 130041
19703 130041 -296134 -21654 336769 -47043 -136279 181965 -19898 -175335 -575632 -55961
19692 105137 -122676 119476 13188 143195 -5024 291803 63246 -57618 165064 157320 -186213
19680 144671 103359 20024 20686 -288007 -96178 -228618 -69507 -220076 -20014 -35902 190074
19668 9431 207398 -238900 -106384 -382109 -43736 196798 -201975 -361160 -358472 4635 -5693
19656 124442 -243960 79535 -215599 -229982 -205353 -80424 65683 105597 -140339 -319517 78444
19644 93274 -65662 25742 -172189 -93402 -11117 18195 -145200 46629 202987 -194435 -25641
19632 87588 -24416 253001 112260 246352 -390285 103943 210769 27271 27307 -95706 -75437
19621 -75437 -130588 -299149 -19813 -293146 3029 -41825 -41112 19988 -97643 128229 -28655 337702
19608 -35040 168484 -218799 -107344 -351709 97580 -418966 180679 308249 -10806 125760
19597 96114 -54095 189793 -315806 -148227 -75904 -186884 -28525 -15896 -186465 -177665 289166
19585 110834 42251 75266 239757 173747 9434 -439512 -58932 7212 -46686 -327406 -32919
19573 -11338 -252629 -150088 -202408 287984 -149862 -67393 -338797 -206149 -453964 44530
19562 165677 117478 34211 -150507 -447256 -125491 -336570 -201329 -253098 -217942 -81581
19551 61239 171088 -21314 -144531 -122108 55223 -3251 -242888 -77732 111890 219453 -115382
19539 -278477 -241653 -55118 115685 98917 41233 -244382 299928 -9362 92503 7254 221123
19528 221123 -192381 66559 -262675 -49053 -119469 -42547 -57081 164399 -45803 -40953 -177917
19517 -177917 401297 -9061 51722 -238609 97949 68011 -9683 -250921 -126938 129167 137183
19506 137183 -258642 3293 -21345 -106096 28043 -515061 60019 21454 -44206 14059 217110
19495 217110 -256851 -57788 -218790 -140072 -16642 73673 10596 123809 164481 114637 -178348
19483 -71042 -9852 49636 -175716 56287 54594 -211940 -61163 113394 -124632 7862 217858
19472 217858 304147 -3518 -358034 -179210 -260758 31237 107346 -287619 -48133 14056 -148002
19460 -179325 -12099 -50200 48362 65755 43704 -52426 -20660 321827 3257 121222 -271337
19448 -104296 23612 43707 12724 -124888 -115029 -110496 -83655 90854 321475 -9585 32069 -97423
19435 -335602 -21394 -204977 -14476 -239551 406927 -255434 385843 228493 -179299 122834
19424 175439 34108 -55863 112216 -290534 -2545 -62660 -260355 -249751 -248058 -10629 109017
19412 -19322 -213479 154741 -67961 220246 194744 131000 -96320 49484 -179893 -94186 -188383
19401 -188383 -74152 -360287 -101860 26 23946 26524 -48953 148689 -154626 -74871 -2868 -490525
19389 -490525 175700 98660 -414978 -57398 -252994 80817 -196472 28754 -264095 -103577
19378 109041 -39348 -90386 180830 -118197 34641 118704 -249037 212586 -49442 -224967
19368 -224967 -3036 199743 19305 45419 -277355 17631 -197531 241663 -96239 61531 -63266
19356 76621 -56838 -17100 -34548 -72198 -55198 -84692 75869 -14656 -156875 -235988 -17264
19344 -7599 -237525 -149591 -198775 241711 96952 -209368 -123529 62556 -361024 -230887 -282189
19333 -282189 171456 -146467 -52462 140972 -225363 -5672 -253741 -12436 -106177 15837 -175877
19321 -38288 25782 -256590 34601 244815 -285180 -334227 12910 -115912 -27788 -32476 -93602
19310 -93602 42119 -209170 -77880 -419390 -169076 -2366 -134514 -172201 -54331 -136529 4012
19298 131945 -194175 47142 261396 124833 -241836 -26963 -316657 58512 144450 -238715
19287 62927 173645 -20709 -23213 -298131 18350 74873 269296 32592 155346 1660 -78579
19275 18755 28931 -47670 224010 -125207 -108743 -92093 -225174 -52326 4282 -157408 -147051
19264 -147051 66062 48667 -27302 -181253 -38473 -119299 -328149 -137795 -170301 75072 152415
19253 152415 119475 118160 -66506 -112502 -171573 -28584 58349 -143251 93778 77284 -138272
19241 104541 -508119 -113477 -346566 -197367 -121897 -32827 -7379 -356664 -53864 63387 52573
19230 52573 -151948 -4219 174520 -271069 -186541 80996 12086 98109 -102320 -188281 -21359
19218 12847 -106250 -326772 146364 -170017 -164551 -18388 -15323 138492 -356044 146206 -210384
19206 -56443 -38804 99090 354624 -134893 -173019 -211737 57860 -14249 -175641 -275522 -129416
19194 -132334 -32099 -46944 268060 -151015 88869 -267395 -271965 -96195 100509 193284 -55806
19182 -136351 -164548 29855 -178820 42408 360126 -41194 -24490 -75181 14735 7131 -254926
19170 -489166 -213593 -86328 -29730 -61962 87063 -424914 6426 -126820 3040 -41720 54281
19158 80003 -273545 45598 -156051 11121 -540910 -112940 43852 1758 -392060 205728 56511
19146 174991 222779 83964 -2980 -189301 -319572 -62747 -142939 91063 94861 -104964 256083
19134 76998 -179087 -56556 65267 -373875 -64106 -107162 31774 -185153 39058 -171882 192274
19122 74627 42260 -23899 -140025 -2087 -75561 17660 -502900 -162282 -154242 -150205 -209752 -182338
19110 -182338 133944 250644 196733 -117735 133686 50275 -466165 -39376 -136311 -299436
19100 -299436 -240553 -104566 -8139 -267749 -93312 -157549 -236682 -207293 -135621 66901 -43349
19088 -117413 -97282 195424 110381 -70498 -202055 -301959 75725 -38933 -44992 -257555 -108233
19076 210946 23137 194583 78209 -102142 -122229 -132953 150510 -247638 -12463 274085
19065 294251 -89001 77523 -77055 24304 227015 -228677 84075 -10636 142147 91535 -211658
19053 -210409 -144257 174710 211061 -356347 -212926 -123142 -274306 75417 32770 -54068 -287737
19042 -287737 -200038 99791 -17611 899 -4111 -183739 -51276 77130 172534 42638 287402 24433
19029 -151503 46127 -8059 -417462 -19228 307345 -72210 348229 213704 117939 244287 -232354
19017 207603 -101221 -88211 51481 -143672 141623 284644 228355 -224246 -25053 47682
19006 -164532 -46129 52636 -156885 72982 -35102 -6477 -96600 -204608 -189188 -77418 121247
18994 47690 -192968 -115316 -71780 -310377 -30764 103517 -138038 -156675 146947 116535 -143556
18982 -77657 -122476 45170 -32177 -84806 -95804 -230333 -74577 -207897 -108772 -87739 -166873
18971 -166873 124247 118566 279185 -31935 185006 3832 -185235 46737 -152934 -37351 -79941
18960 -79941 -11419 -232840 62825 183155 -154807 -215095 -219538 -212889 150548 52208 -112517
18948 -180807 81342 154580 306483 -202103 211664 -212451 15527 -142841 -85792 33468
18937 259 -29095 101291 -67993 -161636 201020 67246 501855 -7456 -100192 79660 10451 31974
18925 31974 -299435 -95848 -340166 227423 -229637 1363 52873 -449917 162518 -306980
18914 23479 -181695 91624 -250934 -113022 -81177 -610 -9426 -167686 75118 97742 95962 174942
18902 174942 201855 40597 111669 -247176 -8577 -17779 -4817 114668 -133845 -187510 -33993
18890 -321834 -191154 115868 -53841 97393 -26367 -74865 18585 415052 -42355 229006 -1059
18878 -238117 175439 -188915 197027 -255163 72109 -287141 -64881 -51307 -359981 -193340
18868 -193340 102940 -286911 -202249 68659 -168100 -260895 -378274 120065 -307855 -40272
18857 -58930 236174 -278397 -256488 -68226 64072 -30001 -289313 144998 13994 142222 -176671
18845 189982 240216 -146188 -301400 135835 78227 -173887 51838 -105817 239634 -210780
18834 69467 -5612 -103630 43575 -19431 -23091 -89832 -226651 -88222 107335 -257405 -174936
18823 -174936 -45372 -47347 -138708 -167726 -61836 -19675 37303 -117470 46674 -104247 -71382
18812 -71382 281387 253787 119386 303752 260049 -46749 201264 254380 -125347 109284
18801 394386 21811 706 -297344 25574 -114325 -156653 37853 107477 -108454 -183220 -287367
18790 -287367 -88324 67898 -187715 448682 67609 -122269 164332 -172733 -222749 100224
18779 75769 -49527 -38055 82571 85184 -137943 -196592 296206 -50712 -203272 -35967 58933
18767 -96216 -30807 -459468 -19807 147832 86803 50385 115131 -233620 152570 132627 -33240
18755 -289863 -144630 280622 -43481 -117062 30424 -11155 240476 -348665 -211055 291079
18744 -369191 129288 94694 -27820 2452 -248407 -111736 -25523 -216519 69994 -151932 -11875
18732 -138305 126188 -215306 -379098 -321451 -367981 -7885 370300 141686 -48860 -164598
18722 -164598 -74050 -101257 60524 -295553 -325814 -21605 -323349 -201101 88510 212033 100810
18710 54995 -142290 -62377 7082 -288213 175585 63664 -254515 -164554 -83187 309441 178273
18699 178273 -28260 -13612 189900 363568 -140724 -198998 104553 253617 213008 96725
18688 83815 15466 -3865 -255797 -199174 -110891 -277184 41446 -325149 -179918 -113525 96680
18676 -266117 -92972 -5249 -78654 -89130 -52579 -446955 66872 -295193 154436 -103770 -31402
18664 227110 109431 236577 328517 -32512 -41949 -18518 130942 10762 169624 -70939 257139
18652 16579 -184298 -130096 246714 200460 -49141 26310 64275 -221579 -257126 -211446 177758
18640 52245 128393 -131140 -23302 -68084 -451407 -24012 -15360 57383 -52934 189787 -166542
18628 23267 -219940 -128941 180726 -55365 113556 -20920 -154098 -130669 -92002 35373 -59757
18616 -74129 -288028 38910 -54577 -92012 -85580 -109967 -54075 174399 -8012 -45780 -483175
18605 -483175 152083 -90445 -186535 -318623 28937 -257136 156231 151881 -40191 -267670 -363815
18594 -363815 132783 227464 -81055 -208623 -288559 -52584 -22294 -73104 -384813 -145110 168179
18582 7253 -48855 -157028 2404 65060 -348569 -152415 171586 -40095 -15333 119673 -278945
18570 -60478 184873 151023 -197840 -80360 65392 -68462 -327887 -86487 -37521 82656 -146070
18558 -159390 -241459 -429305 -157897 -30644 -151540 -265480 -74895 -270413 -160006 85381
18547 -163796 69606 -37372 -12151 -11854 168228 47257 243044 -293755 -73036 -148196 125534
18535 69973 60232 -62697 19307 76376 -68512 207653 -25575 -228114 -144432 -43899 -20495
18523 -171004 81812 -85300 236384 305577 -7761 -103875 -36254 -258567 74767 -4691 245129
18511 90264 -422149 -124217 -64348 -14528 -70035 554575 116943 138915 -74901 -8147 68978
18499 -189939 -192322 -224506 -46362 -62335 209145 50555 248304 -57670 171883 -203164 8205
18487 -101024 -200061 188239 -269815 193418 -138117 -36636 105119 96733 226516 -338928
18476 -28128 -231461 165090 -46066 67666 308005 -12862 87027 22774 43237 72482 138322
18465 138322 115331 -179421 -59939 -121525 16118 -49151 -136143 -169199 58675 -77682 -240258
18454 -240258 107011 -165736 181782 -312393 62304 49057 -153200 117659 -131224 46610
18443 -58888 -39432 228947 -234772 89241 139869 283041 338829 -248696 92132 19116 -125313
18431 -565288 -26742 -168873 173220 137659 197824 80177 207998 -123156 -27011 -219414
18421 -219414 -246628 5477 145051 -1328 16987 3631 24500 274880 -424780 26665 18069 -114375
18408 -172061 57128 -51116 -143748 440108 30049 -133090 17001 150368 144272 333592 -376004
18396 65810 -68504 -108250 56883 11759 -119330 46803 189174 -123400 14627 50495 -35785
18384 -368729 -70918 -142486 9273 51209 -251592 -186695 273801 -59766 307688 -281744 -130264
18372 -129335 -60930 -94495 -134718 -99779 -136362 227555 -37877 149008 76999 -108370 -138574
18361 -138574 -123032 -37079 -85538 40115 -16509 -5041 -172487 47618 -173342 12086 -182612
18349 -36952 -71105 79557 -45477 123630 11129 256501 -204977 156417 -147549 -135096 4133
18337 -254441 -146498 173633 -378014 -227895 12294 -107484 -277459 93640 -113418 -354865
18327 -354865 -240522 -104585 137485 168230 -259293 201603 -277151 -12431 -77784 -184647
18317 -184647 -56497 49244 60514 33046 -2984 -12222 -229135 -174665 6591 56431 -285098 -394813
18305 -394813 -52386 94557 -137415 -87848 -53519 40649 -127392 75698 -206143 -376146 107867
18293 -186397 49523 -172333 -14431 1718 -170642 279542 -45701 -229526 -217071 64521 -135240
18281 117230 -171748 346605 -72723 -17151 173121 17489 -25600 -42646 -227693 -194096 175730
18269 -132655 -276280 -80083 -11211 92222 17760 -126277 422633 -155078 242324 -94123
18258 50655 -320760 -368426 84759 78056 -38576 83402 -228861 59072 272049 -81245 160625
18246 73828 148710 -48142 -50366 -529470 -1726 -42578 -168185 226267 69045 452012 -21546
18234 -110279 90730 269157 25219 230002 71028 -217198 22366 278631 -27724 151876
18223 -138103 239581 -456734 38539 72384 -224 104438 152014 37716 -123058 -129155 90818
18211 -338909 -51188 215342 -1485 16406 128193 -275009 69299 -419966 -49325 -56795 -229263
18200 -229263 37646 -146020 -342955 -111896 147445 -263293 -53035 312415 162532 -133716
18189 237597 -228134 89468 34304 -660 -86926 -58427 -219183 -11188 125344 216930 344337
18178 344337 -25430 54770 -119410 -161908 104045 132884 -82831 -179906 114682 248135 270253
18167 270253 -140499 -33670 -182544 34430 -196561 346334 -264372 38083 -315169 -94026
18156 -84077 -9285 -36130 97331 275298 317908 21001 318266 -18862 -83640 179288 211304
18145 211304 -198082 -60600 -77650 -39950 -208241 -24411 -76630 90732 -221620 179889 -143780
18133 -109399 89754 -123731 -40718 31893 91449 19722 147487 -217548 180440 77312 148831
18122 148831 -134414 -161842 216324 -31233 44676 -129804 200443 99254 482974 -121390
18111 139487 -45981 -430135 -31310 32502 38135 -392154 86243 -118670 -19317 47055 -58261
18099 -298711 55564 75656 -163332 -217034 -95017 -226965 -183641 89098 8184 -16464 -67580
18088 -67580 174025 -51019 -21833 -202973 145780 164400 84534 200544 -179886 75262 -89874
18076 25992 -236592 228157 -251609 -312824 41817 -236188 -24141 103141 -190479 -123982
18066 -123982 -353305 208955 -103722 37142 -288 273395 -94806 -32270 -107344 84616 66978
18055 66978 -130351 -238889 -156511 -99380 -165174 276500 115671 -342613 217055 -229782
18044 114945 -76222 -92353 126867 -212130 198146 -6383 -97472 -52665 46244 -64944 105172
18032 -78262 246463 -26100 -115617 -273421 -267645 138319 10825 -375553 -104202 -187813 60025
18020 -49066 192487 -109693 -159981 -10601 -6738 253276 362074 304581 -57779 -290688 -170558
18009 -170558 -44204 -141953 252933 -151860 269799 79709 183422 -342751 -167653 -94102
17999 -94102 264496 -117106 78595 -79878 -258103 361903 -100690 66470 163188 -62011 -85902
17988 -85902 -393514 -394072 -24317 -2634 10516 299382 -192968 85864 130680 -199214 -10781
17976 166767 -264180 -271370 13683 -26250 57698 207721 -253916 -108540 9824 -130761 -241987
17965 -241987 17144 124111 -69131 -21762 -277386 -104363 -154274 211071 44386 231771
17955 231771 219136 -342679 11190 44922 122950 120248 205462 -29973 46476 249830 194164
17944 194164 100322 -251715 -129840 -193646 -189764 -466350 168140 -196002 34652 -218262
17933 -356314 -112424 -113559 197170 26852 -116346 10212 65344 -79914 137889 -86427 193068
17921 -35927 15742 -324941 65183 -75316 210144 146917 251786 -15967 87742 -25761 -198405
17910 -198405 -333681 -231290 -160203 -336339 -74646 180778 22649 77532 -36618 29219 -8512
17898 287452 93976 -337419 -127529 -112040 97563 107256 125214 -300531 154726 69542 280969
17887 280969 78752 -93173 -80282 240349 166173 107364 173755 303906 -170059 -277042 89407
17875 102220 -44638 43757 -375117 52072 117950 26600 72962 257329 -57854 -252956 38443
17863 12046 -126687 233395 -101850 100329 -2075 -180505 118783 -4895 -178160 -126352 3053
17851 37509 -260487 -94020 -192756 -41280 -7561 73675 -65256 149463 127712 -88069 50850
17839 -193737 -244053 -35148 56645 -241200 -69087 -160872 -215215 228904 -68903 155074 -48711
17827 195834 -221352 -31241 -51583 -5520 -247472 -158206 -277444 -162829 40034 -350788 258490
17815 117314 226939 17932 9550 167008 -84228 -301890 -166033 -168365 -65903 -207109 12037
17803 321697 201457 -95222 -274267 458448 147693 -159686 -100023 87503 -70712 221968
17792 -22617 -183419 132070 -117733 122122 8047 -6590 66906 -70036 -305205 -52610 -122464
17781 -122464 -336039 131450 -28162 41808 16981 -238861 20245 -96783 -73105 80321 81001
17770 81001 84193 202274 -270925 28589 29731 -130154 229711 -98914 -51866 -12882 204217
17758 -185225 -141030 36581 -144672 241493 90435 93163 156517 -50791 93650 -74511 -111333
17747 -111333 -67909 -77 573 -176145 -108520 -296123 33864 98202 -97411 19088 117261 134390
17735 134390 77228 -21653 -66248 166751 -237413 44936 -123795 -14105 -250410 -361699
17725 -361699 -188126 1288 -149771 91480 4635 -116282 -214650 -428807 270451 -115663 -112361
17714 -112361 76117 253940 5343 99113 -149050 178511 8802 213854 67173 -392852 279894
17702 -70530 22310 308824 71841 -34276 -44285 117344 114084 -24586 185426 153582 202876
17691 202876 65936 172992 -174348 333539 -38249 -41283 -110609 33930 31063 221562 324528
17680 324528 -109482 -708 -152785 109562 224878 104412 -133965 46340 71773 75415 335696
17669 335696 -5078 127123 -84399 273616 -113192 -104979 -90662 160832 317945 -67602 -43202
17658 -43202 102365 121080 266893 -65779 -82427 23433 -29490 -215668 204918 188614 -74455
17646 151979 211059 -273256 18313 88473 -134906 -110172 303534 41112 23498 190488 320074
17635 320074 -3712 -143984 -135522 179701 170427 -232073 14274 45047 311712 34175 25591
17624 25591 -52359 235763 108993 60282 165431 199571 114607 -212562 -222192 220599 147239
17613 147239 92191 -30593 183475 2218 -80441 -96394 25251 -258792 -159990 123348 -193711
17601 232166 46997 130539 -66590 -87603 -16026 71870 -192791 -248550 63153 -102097 -298281
17590 -298281 -65122 -41516 -50056 146638 83784 169906 149119 -222290 48043 -89683 -158060
17579 -158060 214635 218014 -206996 190694 -256490 64492 -63986 292809 267498 161055
17569 161055 61299 51696 -50562 122322 23476 91905 8369 -195589 132108 -197033 121947
17557 79891 263618 144135 315652 152979 201273 101328 250155 94464 -29396 127286
17546 5898 47125 -111652 421779 29937 189655 66448 -12004 270602 -149902 -243968 2217
17534 145301 287250 171421 74822 140276 86591 111043 -92735 65303 158027 -19331 -61534
17523 -61534 -882 15590 130765 32506 215942 -110140 -74593 -156272 469388 300718 94059
17511 -133197 252988 85436 -80812 40522 -62134 196200 -44269 164257 428543 -31148 -363267
17500 -363267 -30353 32163 -209336 44264 181291 -98508 273354 27259 -96976 -26791 328771
17488 15083 102889 351861 -197034 114394 -213790 191087 77312 314793 153365 210077
17478 210077 348445 357370 -6615 118787 -60765 743718 -16171 70427 -75929 -78453 354733
17466 77879 122037 132541 -133163 196042 -30591 277233 28675 37662 25779 154477 -43096
17454 266620 2878 147464 148788 415112 539710 389149 235092 285101 241044 142955 168618
17443 168618 206386 386 210154 181757 275536 286897 218810 321789 182633 276571 428160
17432 428160 325082 102256 248043 54278 37744 452549 32511 96202 513916 590953
17422 590953 449452 403210 193443 266833 10599 333778 47292 102887 392672 130630
17411 386760 269813 26741 447255 359682 393462 136765 89947 133144 221835 130414 92499
17400 92499 476948 -18199 -74948 -250855 336764 -180088 98111 -54207 241003 324417 -90003
17388 165445 106003 -174221 193782 206229 427202 397159 148482 -140129 193101 320830
17378 320830 169766 401784 30697 130147 219775 295063 -82090 115783 95360 290687 214358
17367 214358 42151 -117446 -78096 286902 101847 116435 144476 81622 306612 244769 231849
17356 231849 -107888 94908 -182208 -237831 286986 40948 419384 195850 92882 365072
17346 365072 -179832 57656 45409 415771 159984 240202 190562 124918 234561 -106956
17335 268669 123670 220184 -41140 287102 339452 101238 263588 -98100 -487 326381 337206
17324 337206 30845 235590 227885 -272410 55088 187467 241218 29881 91878 80858 261004
17313 261004 40946 61149 154387 233079 193083 193725 339511 404661 278878 159423 -111531
17301 -85869 326714 236257 -14443 -229928 157224 38879 -128596 181144 -312629 482338
17290 361736 198924 151553 -69989 -13778 76104 329451 54687 -20864 59425 181474 124343
17279 124343 140457 139877 116251 247057 96704 177369 213780 278952 369140 180917 -213109
17267 125317 182147 121200 206899 344931 535451 165301 27983 61299 363037 -176487
17256 153362 228506 55399 150501 105294 81098 402605 160028 149635 33557 -8437 400209
17244 -158535 475349 118460 -131043 -70496 210772 -67973 69528 216242 128259 247021
17234 247021 3423 29972 348285 316317 479975 268720 1999 -121936 174539 133252 359958
17223 359958 191985 307309 40301 41624 254608 -115430 167045 518135 283739 498302
17213 498302 181667 65659 285404 305165 290918 327181 279385 40558 280198 253826 354597
17202 354597 -87352 88551 -17288 331202 214521 401500 427235 407010 75764 113776 83038
17191 83038 222582 162258 172702 142446 506773 -39177 506096 -2299 128284 385503 296040
17180 296040 139354 442785 157395 189525 299659 121831 320738 276616 297395 407723
17170 407723 342260 153476 -25144 165846 111252 280182 182564 451928 492340 282462
17160 282462 272565 143698 238259 -61281 305464 198045 267924 197350 727822 146461 560405
17149 560405 -50269 260185 246122 109122 345972 211231 433059 395644 411641 211888
17139 211888 -100183 575835 90538 268357 354141 360207 456504 322935 536312 481037 376141
17128 376141 307371 557546 69542 474009 284466 264811 341138 520768 407818 514621
17118 514621 273329 317509 249841 200623 412027 619074 422274 490098 257435 482426
17108 482426 362707 427086 178750 21708 245500 299521 590946 609826 318681 406798
17098 406798 200925 823710 377218 747628 477378 398804 402986 599382 171510 332830
17088 332830 384108 -160690 111526 428892 146771 205576 635537 446982 691511 201023
17077 601414 545108 327233 161914 588064 450119 350358 593675 372311 214919 504681
17067 504681 537667 762323 626609 540384 851236 441991 582582 601735 651284 363885
17057 363885 463986 528292 887993 537270 378321 397688 664045 673234 564086 722835
17047 722835 605552 -16248 607177 699482 808809 168357 451342 812199 967778 685122
17037 685122 502996 718709 738042 446446 112981 698883 750462 448388 617118 613655
17027 613655 417494 285849 558254 684483 670422 907675 700770 605537 947113 700928
17017 700928 607893 515092 588478 557763 763028 805959 978415 804050 922614 767821
17007 767821 522092 863656 804506 843091 653672 585467 516626 724025 771726 524540
16997 524540 679416 644695 849407 712212 1025088 474619 451833 939024 576695 812047
16987 812047 889908 884996 742771 1247681 1169734 1204661 724743 859782 856539 778814 1054339
16976 1054339 907244 986104 1046235 677960 740037 786158 777715 1283493 637471 1191711
16966 1191711 876697 1048319 1164782 1105005 977257 1456658 1313799 1010985 991128 1136889
16956 1136889 1111948 1151945 1034132 1137266 1442249 916873 1393514 1055001 1279554 1358651
16946 1358651 1445187 1272522 1095207 1112689 1476545 1293987 1322360 1420519 1457398 1562675
16936 1562675 1430580 1436627 1280403 1441060 1378507 1215503 1416553 1669247 1314391 1179807
16926 1179807 1289200 1427641 1435949 1232786 1124329 1870201 1958971 1620391 1959648 1755627
16916 1755627 1952857 1581147 1861583 1899423 1952882 1710582 1735725 1702349 2162881 1848656
16906 1848656 1851384 2202579 2025201 1942965 1922002 1866322 1822594 1775085 2036239 1968560 2276236
16895 2276236 2147839 1934753 2131054 2147474 2396599 2506003 2080357 2190421 2347764 2330960
16885 2330960 2468973 2346411 2230017 2392331 2300687 2816397 2519682 2698390 2336115 2533768
16875 2533768 2580381 2613326 2726767 2496342 2690377 2965346 2853156 2998191 3058621 3098815
16865 3098815 3192090 2887389 3229706 3134967 3111679 3196424 3549237 3460155 3262726 3363355
16855 3363355 3549966 3523168 3806535 3609435 3765040 3756975 4054629 3856132 4095427 3892651
16845 3892651 3889129 4104194 4334307 4165393 4302323 4522946 4177204 4755580 4883513 4587439
16835 4587439 5032767 4934184 4778716 4761995 4918567 5329019 5248248 5176269 5357110 5725620
16825 5725620 5789810 5534519 5817337 6048757 6268708 6350994 6176983 6491777 6852877 6839190
16815 6839190 6906987 7169576 6932130 7314579 7613321 7541784 8156483 8397814 8467916 8401353
16805 8401353 8740276 8856230 9292731 9326544 9843280 9481977 10183712 10298716 10329564 10586081
16795 10586081 11163987 11607833 12161709 11805651 12373945 12820497 13045001 13557882 13601956
16786 13601956 13962292 14644194 15083703 15435348 15577895 16111478 16520540 17316810 17792077
16777 17792077 18297268 19358990 19659534 20419666 20699758 21450941 22383330 23083006 23754817
16768 23754817 24902018 25857397 26818948 27525482 28810452 29885398 31025337 32287057
16760 32287057 33630885 35372636 36466297 37796167 39584017 41324181 42819781 45008520
16752 45008520 47027862 49059037 51654070 53953260 56650768 59433955 62703731 65381002
16744 65381002 68981517 72472255 76100231 80014306 84152445 88362424 93047934 97831912
16736 97831912 103098441 108078076 113468353 118820480 124757938 130202719 136080932 141324228
16728 141324228 146634604 152096370 156171727 160288716 163802395 166481135 168219549 169667598
16720 169667598 169509065 168958714 166950843 164423593 161053055 157285425 152841455 148011487
16712 148011487 142284829 136665138 130984104 124874991 119009881 112896131 107362444 101822014
16704 101822014 96506202 91535740 86766100 82263532 77598769 73924222 69721352 66362652
16696 66362652 63089960 59775410 56771568 54232713 51167837 48747681 46640749 44272717
16688 44272717 42001012 40222149 38488949 36819854 35331736 33818082 32376124 30477659
16680 30477659 29493650 28633270 27271293 26498566 25283429 24219679 23294454 22503477 21772831
16671 21772831 20993908 20508089 19449480 19163958 18170263 17491683 17017866 16351410 16106643
16662 16106643 15641023 15053446 14745396 14173181 13613174 13366497 12873186 12467046 12135103
16653 12135103 11829658 11396119 11221841 10729182 10714553 9962236 10419946 9848543 9639412
16644 9639412 9479565 9057722 9004941 8705811 8266411 8415781 8112350 7983034 7506592 7340537
16634 7340537 7428336 7364984 7058593 7173194 6781509 6607513 6546712 6631664 6683212 6183323
16624 6183323 5888025 6036758 5993732 5501269 5533726 5352275 5398602 5195044 4912998 5322924
16614 5322924 4827340 4829788 5013182 4563242 4934506 4567407 4503605 4469580 4322331 4270291
16604 4270291 4350463 3999128 3826204 3604008 3831772 3690180 3521556 3803021 3672876 3405646
16594 3405646 3605968 3369895 3528124 3604739 3533914 3098013 3113474 3169452 2914283 3141164
16584 3141164 3275039 2948395 2909084 3141604 2663693 2936867 2792966 2987298 2634787 2414368
16574 2414368 2373127 2616974 2626379 2522550 2404951 2568836 2121283 2258102 2516116 2484296
16564 2484296 1979539 2205325 1863816 2168889 2121482 2207509 2272277 1836157 1852622 2312830
16554 2312830 2248971 2222416 2020172 1950772 1830759 1877558 1793645 1684566 1707761 1915125
16544 1915125 1908406 1483246 2030433 2121515 1913780 1753558 1710522 1494054 1458885 1653601
16534 1653601 1856898 1387455 1287528 1462491 1243617 1850869 1446872 1380726 1668761 1430158
16524 1430158 1170942 1192440 1439352 1500476 1493418 983537 1799965 1285780 1256626 1293492
16514 1293492 1532754 1058526 1143480 1399111 1020017 1376171 1149158 1237605 1276475 1156157
16504 1156157 1432448 964126 969395 1131931 1295069 1050953 1378452 1097069 927126 1148907
16494 1148907 1267751 1129409 690350 1083742 981861 977297 766694 941571 1175681 1065996
16484 1065996 1280488 1028563 804080 1108145 801461 898543 832138 830337 1029121 1277863
16474 1277863 1096487 1045258 883768 926801 573906 650415 909724 584227 961155 1073462
16464 1073462 944163 800956 759432 1034745 1029260 841014 618220 849683 991623 902425
16454 902425 803968 860232 940124 1034744 622660 700645 653832 654214 928176 811590 1102226
16443 1102226 487791 855102 506976 253467 693589 732331 1102129 667867 629068 613242
16433 613242 787233 655424 635598 488416 737084 514236 536707 505875 863989 490015
16423 490015 447687 749128 532219 865604 720227 452742 758906 425860 757993 803709
16413 803709 721252 707551 576649 457150 667669 276722 368722 404669 -1281 968724 638652
16402 638652 527816 436783 653767 353805 352797 305819 534351 588417 736973 524095
16392 524095 542322 547227 277852 440164 640921 547977 325235 182637 304044 320170
16382 320170 225725 629854 405957 363479 699917 688607 480443 528592 343898 615714
16372 615714 642454 361254 588520 694609 568576 415439 251174 446657 85562 696323
16362 696323 382028 396731 -87615 272947 256539 439777 260499 563013 458883 323078
16352 323078 323042 460306 443511 290981 762065 436191 295336 231258 239719 346591 80251
16340 379027 390322 461271 430229 257415 280180 652089 629168 311928 384948 331904 108230
16328 677570 320165 611033 340364 217653 593637 337362 263694 341331 421843 166218
16317 332973 360785 396223 143509 566095 79932 144836 105888 75771 543843 386520 377833
16306 377833 420315 201746 170255 216657 279725 215229 -27875 617718 198626 234581 147147
16295 147147 535764 422498 -53299 281471 36209 354691 173627 293979 292590 183702
16285 183702 105678 54161 371101 139952 -110175 412578 360607 290130 253458 111082
16274 215194 107133 78400 304012 134416 -185056 311740 276216 359198 430165 262635
16264 262635 167585 53010 335902 238161 236956 258527 308473 244856 104598 -73265 178952
16252 486957 362557 206879 -68319 252834 132232 265905 489472 163960 315999 236525
16242 236525 -26331 292371 -73539 399728 270125 253063 376547 168640 22803 151068
16232 151068 210968 75235 -12932 421401 248597 561816 -137137 -22722 187251 187486 482534
16221 482534 63427 60008 229343 94368 358207 40499 -185643 -69052 117936 38296 120169
16210 120169 -145264 205669 22232 363588 196473 138425 228966 155254 431380 417773
16200 417773 44638 131972 204036 251747 467526 14440 82089 22276 268725 356790 253146
16189 253146 147814 127802 220598 -25301 -77213 319656 109675 72875 80402 -29921 -42240
16178 -42240 198303 182361 172213 -596 -96797 498626 205432 136658 -148986 65466 125890
16167 125890 80317 -279784 -75346 95783 291746 541960 332113 389075 183707 -120559
16156 -202823 321852 95423 -254015 -91930 -4744 279904 239381 324902 8812 108993 83696
16145 83696 -24437 -44725 77856 -117160 158783 101372 11938 268461 -213801 156807 340485
16134 340485 16730 28761 144544 183646 -117602 -113338 162455 41199 73591 295194 101560
16122 212560 56975 -9471 -56358 38626 51297 -93521 206471 -68936 -398243 297990 2221
16110 304232 71740 101389 -138397 113680 374700 95838 252736 215663 2886 -87565 244730
16098 -8111 3300 -11605 -40156 338913 -47898 -182056 125017 26842 163415 -54166 -369579
16087 -369579 231077 39718 -87751 72494 -40156 78959 230430 -235415 268762 -103488
16076 -322485 -36512 307649 190923 258224 -3702 -160784 155764 -138462 134785 -13584
16065 25703 127102 334552 91691 7847 50575 -278026 -127350 298409 172689 106013 164206
16054 164206 69438 162457 -5534 -246314 -13260 110328 131232 85798 110525 -65124 217114
16042 101218 238547 68287 126099 -187618 193558 -127429 -290511 -128958 -57928 -396263
16032 -396263 -352061 -67557 74191 -293360 -166956 -439358 271252 -118185 150961 104403
16022 104403 -99821 17051 21728 170340 124639 -104782 -169570 45210 -51766 -3540 40523
16010 188008 -61306 163238 61629 121548 -93521 243000 185546 92868 343973 -110765 -8818
15998 360914 -116004 299360 -96226 169974 147774 -117041 226070 -80960 -33815 -187844
15988 -187844 304272 -146191 -138539 446535 138762 232754 239494 209150 175395 126990 -94205
15976 284852 -63508 56651 -112443 -210187 643999 -54834 276722 -55354 29616 -6085 -175012
15965 -175012 -8387 8199 118467 -47148 -133392 180551 1071 -305320 -248971 -57102 -174446
15954 -174446 -304360 79794 307529 15804 90720 -25488 86684 191037 -216994 -125340 -190327
15943 -190327 -105492 -69280 265176 94698 -219044 -163200 89173 -398662 13613 53026 -211252
15931 -506456 -225425 68462 -236799 230468 31729 -205358 166118 -350289 -388522 -19080
15920 -279209 52385 -112955 185253 465977 -411438 -175147 32079 -175 -80557 120588 84666
15909 84666 193623 -138990 21444 -203459 125022 -83084 7694 206125 105099 245845
15899 245845 -411280 -38722 -274437 170160 -204408 62021 -143661 50498 -115302 334412
15888 112329 -131975 71292 424040 -262833 -150607 -269923 -104933 36914 17404 -21007
15877 33626 -81263 65967 -67090 153354 212583 -302966 290585 -269348 61647 157036 210495
15866 210495 -106194 -291990 -33318 -8384 61926 78265 -197060 20099 -27060 -88373 -31034
15854 382893 -61057 -100181 -97366 43584 79403 -184434 -26595 47768 -25759 -172830 -218818
15843 -218818 -59883 19205 144715 110243 -408689 -105692 -347688 243428 -164440 -274840
15833 -274840 -76859 -104117 -150385 123846 121772 226676 52337 -77269 -6304 58266 44808
15822 44808 27305 4174 50621 -86983 -53616 -245129 21769 -230793 -327576 -129305 -330005
15811 -330005 -298647 134674 202577 -65611 -289739 -60455 161823 -135704 328810 -81454
15800 98488 16853 -63506 -194413 -62010 -81590 -107783 292934 127670 -90778 173601 -193104
15788 -126737 -216191 138285 105787 67198 96253 -18243 48470 138243 293910 36501 -146068
15776 24886 163921 43276 103373 -19525 -218147 124699 171688 -199516 298989 36405 -60283
15764 106691 68988 143364 -137642 41112 -58911 105480 -20717 231869 34528 210366 66254
15752 -93497 24509 -94538 -98251 -1630 -109733 270923 115808 52240 5086 -9770 -186074 -211151
15740 -211151 -54849 55605 -212765 7065 -222098 -85545 72249 28293 -513723 103538 9993
15728 104764 233760 -122798 -261166 40660 49612 -45919 160949 134798 -343270 -168986
15717 -86225 -218905 -105195 -5876 -287515 -80066 -64864 -387198 -19920 -238111 -91654 -118230
15706 -118230 -172142 -160678 -268141 -14690 -120314 -13473 -85509 59446 -196451 93071 161752
15695 161752 -31631 -152875 -41828 -181352 -34747 48711 182883 -51259 -241023 -266066 -147936
15684 -147936 -172293 -243302 150835 137566 -306036 -12977 93788 -41626 -176782 -113870 -155076
15673 -155076 -203453 -182648 60085 330365 -132034 67465 60414 -28806 84558 -118648 172268
15661 -74720 -2718 -62701 56189 -40890 -89071 -212632 -274804 -20356 62196 -221602 359113
15649 -51158 -227541 -84535 -76380 -283271 -334090 -93991 -176640 -290552 141425 43070 -42586
15637 178863 295931 -57380 -54556 347989 103331 13996 -162886 -85085 -60372 -19368 2641
15625 133250 65577 -223248 84954 531422 -6810 31004 79208 202757 203465 -62867 -112527
15614 -112527 56426 385666 32789 -8972 -143523 -84974 -7120 -2404 266144 143136 265870
15603 265870 62563 62847 -68296 -83993 -64065 -199612 -313063 -67850 -27817 129549 163944
15592 163944 -62841 7556 -189262 280228 398357 17853 6815 73292 -33125 -123630 -98422
15581 -98422 -32790 -69935 -523306 21414 -278587 -9886 -527152 -54771 -107839 -126827 -376648
15570 -376648 34536 41727 13787 -24201 -148829 265305 94552 95753 177365 -156859 -21833
15558 -33900 -35029 124577 486320 -133537 90085 -324137 8326 92255 -147564 -140677 56392
15546 323220 54863 47394 36594 -163201 -79220 -8149 -69913 54518 346126 -125866 -304353
15535 -304353 -30718 -38417 -95769 223960 -12222 -148382 3960 -113874 -101637 609 313837
15524 313837 -236166 27335 74146 -313531 90055 37917 99260 216863 54451 46478 -73283
15512 187078 314970 -120151 29065 -5775 -148549 -133937 22588 -211506 99197 -328336 175602
15500 36298 -213819 -171983 -18008 -65294 -120273 -223176 50532 101470 197664 -174614 2753
15488 56748 -22591 7246 -172909 -141364 -157025 84656 173197 -234472 -353722 -203801 -97778
15476 -68830 -7200 51905 98376 951 145306 27976 31225 265962 -383921 -140226 72691 -95651
15463 9341 241208 -136505 -49710 18491 30436 -58286 39750 34721 -19369 255727 32161
15451 82815 -71965 209953 -15629 -25333 -248588 282678 -111674 -244939 34677 38007 210126
15440 210126 -83924 194242 -247916 -168871 152100 -136817 32120 44937 110154 -117837
15429 133207 -143933 137134 -226448 -294934 -94914 93766 82351 31382 158612 61238 -38226
15417 -211281 292989 50439 349940 4218 191231 180104 -2103 42206 -113578 -48690 32547
15405 -93788 -48419 67168 -157178 -30544 26748 50891 167292 -66810 -37250 -88652 223189
15393 162981 -159421 102670 121473 -48706 179532 -383462 -122593 82416 70485 -72633
15382 53295 -115447 149964 601 -99890 57156 -91230 -112732 -355795 46771 -348032 -62045
15370 70566 65871 -40289 177136 -63950 -195843 -261422 -85957 -127997 310766 57472 -45895
15358 -79167 420624 225115 -110227 -220322 48608 34245 105794 233 5745 -84491 128832
15346 -31229 -228311 -176229 46575 -6621 198015 224400 -163995 326623 44017 -8002 -82623
15335 -82623 138444 187961 132241 11676 -332498 71598 243626 522422 17217 132265 111276
15324 111276 -41632 -276753 -185636 -34825 105105 107089 416369 -77993 -62837 83371 46732
15313 46732 -127546 -80780 289303 -6836 146608 283626 -182992 103335 -106738 -43101
15302 -41314 -36218 220304 320917 -119546 -68883 79169 189992 270113 -142178 77722 159145
15291 159145 210893 82805 129136 109282 -80599 10699 129389 431783 188251 -649 -138085
15280 -138085 -39930 153077 -48152 85136 332502 -119407 191917 10011 429834 155548
15269 20618 -63031 -230037 88392 -159634 87466 49930 7905 -30331 246086 44546 33282
15258 33282 40850 60220 117237 28598 288961 -102390 253470 -25303 411176 782748 1441881
15247 1441881 1230356 1265009 1316400 846001 363437 267136 122084 48676 264774 12804
15236 -29263 -50425 118854 -172371 -128595 94536 81601 -363575 208924 -87451 -53378 54683
15224 -140176 124913 19005 -156598 148830 126287 213966 132811 -18076 2722 110835 -218008
15212 -111591 277014 24104 -244069 -72194 31497 -99632 396758 251817 -48310 36751 -22794
15200 177841 -380094 246314 226175 297351 493264 -59684 -76607 -178232 28808 125550 -101332
15188 268200 227050 45597 -163017 201047 -86197 220914 181565 -13442 280728 141538
15178 141538 62536 391836 62212 238850 -112432 -197162 -194157 138807 140726 11664 277121
15167 277121 202245 -135487 351531 450763 162583 -159404 228389 -26406 -129141 46943
15156 -61689 239598 138164 173985 245832 63771 136980 160123 20488 89765 194568 -27747
15144 197871 128312 201543 -247130 183686 242031 103430 -103508 29288 191863 276803
15134 276803 205971 307888 5166 -32587 74212 -372393 116317 125199 429829 -376787 -119225
15122 -164755 71255 4556 -135521 111964 60138 434027 27057 -59902 306067 -35972 188756
15110 -113160 225650 -74384 -46179 154709 272706 444766 359982 313357 276987 158328
15100 158328 162070 124813 45445 30220 -111686 151904 46722 246971 104485 47100 134330
15089 134330 -41715 276731 159462 124164 256667 67597 12478 541017 41936 -84558 191793
15077 374671 -144068 204504 279238 -37531 226918 361284 257978 307973 -397420 157173
15066 -101884 395243 277060 31724 147594 64321 -256805 160772 357074 402566 369927
15056 369927 314904 53624 99541 115280 328884 212036 16212 -9711 356457 272673 -31834
15044 -14672 320316 245587 124814 315700 78664 400627 401039 -27135 -152244 -189431 205725
15032 -223996 249225 105153 46322 -284174 31161 46781 140241 603 250298 295921 24580
15020 213267 -6147 395149 33426 -97555 152970 552826 528240 42222 20105 306805 154698
15009 154698 28851 55880 401056 259869 101894 371427 201707 -129874 340763 405220
14999 405220 497629 193326 389784 -144195 -197019 343904 57029 250315 79583 358532
14989 358532 138254 318537 111370 175325 76859 137018 339262 329960 480025 286625
14979 286625 -165627 396319 86620 11273 -72947 256072 -90567 429764 262395 152750
14969 152750 140159 106025 201974 216137 224423 330819 177195 436502 -155661 169944 525521
14958 525521 52023 322428 39050 47485 498625 206726 492428 295847 276143 407730
14948 407730 382016 339317 504009 239852 215619 332945 434406 204151 -5277 150870
14937 424852 206414 348942 368300 191320 317928 305472 419706 405734 225170 -109613
14926 242049 519819 597920 193356 121268 152481 549188 222665 150546 392917 486321
14916 486321 87399 256096 335822 201645 373053 406595 308477 438261 368950 261284
14906 261284 68601 159865 395460 333504 349364 509330 591994 101617 551907 293036
14896 293036 564931 52683 293873 518777 385419 80425 123700 523793 81078 515470
14886 515470 457470 151094 397705 197343 353913 258433 339358 86783 208291 482496
14876 482496 248626 430441 837857 397951 412652 271393 280168 452386 12546 183895
14866 183895 309321 325698 520699 561004 279283 533191 452547 221724 606229 536740
14856 536740 649328 429732 718460 430692 427269 158011 365308 405740 602861 347385
14846 347385 331429 303217 186842 487305 502281 301215 335582 488898 295340 477960
14836 477960 865432 468567 488734 652082 505905 651988 560918 709993 568085 461023
14826 461023 535567 760089 591850 487521 570788 570551 589727 466927 540297 511262 414842
14815 414842 228033 425041 258018 431187 401691 258442 404759 621549 581919 611240
14805 611240 671383 549893 266385 479704 477146 348549 531350 478253 422086 745538
14795 745538 459173 350969 549321 702203 789763 711407 444619 691172 568028 514773
14785 514773 403097 414351 438087 508738 321660 482145 625855 699249 597443 576233
14775 576233 917170 613809 391192 790989 736714 802600 538131 680434 753537 641674
14765 641674 584510 583114 832124 619900 582282 763447 671179 533767 1017098 1067564 716256
14754 716256 845100 852259 711768 883737 787198 673554 312747 585561 696823 364408
14744 364408 788496 728681 552377 573274 486110 565953 765010 854621 303926 820670
14734 820670 439365 497728 785532 420666 664726 766944 840043 741897 731250 896416
14724 896416 671450 744936 886515 767305 689820 1082170 969650 529771 1172429 312859
14713 981898 920436 555669 935726 792837 779662 1016520 835029 865701 709415 830949
14703 830949 810545 1147105 1305135 953961 1046232 705500 1032028 936781 1045641 970314
14693 970314 1004429 722370 787279 976442 1019933 1083755 688899 738057 981571 1220661
14683 1220661 815002 962147 1175272 813655 1234045 964192 1143678 893521 800060 913436
14673 913436 1414304 847379 1265143 941729 1013594 1335919 985074 1079816 1361969 1132519
14663 1132519 1022715 1157895 1395615 1432845 1138535 1173800 794255 1025241 1183562 1151402
14653 1151402 1056635 1324221 959036 1017761 1218211 958838 1144755 1036594 1305298 1029350
14643 1029350 1218199 1272803 1398802 1004141 1183336 1413397 1504991 1439780 1394655 1270599
14633 1270599 1343025 1527192 1526788 963134 1521234 1440134 1502141 1584538 1403742 1495377 1534193
14622 1534193 1453121 1573984 1365363 1326822 1371279 1554771 1654767 1635952 1557683 1435694
14612 1435694 1472526 1521149 1654253 1754139 1791259 1600222 1786827 1420750 1757057 1298549
14602 1298549 1767280 1882170 1635931 1823036 1640738 1668237 1469569 1829858 1826488 1668996
14592 1668996 2054647 1691146 1971898 1930069 1757992 2195764 2058623 1730163 2012993 2035376
14582 2035376 2122403 2305913 2304261 1967060 1916732 2384709 2328063 2398310 2085524 2297570
14572 2297570 2163295 2474739 2433020 2433182 2697436 2588904 2425829 2604648 2991443 2554937
14562 2554937 2609371 2672426 3081601 3218080 3221016 3222835 3351584 3553931 4072527 4412130
14552 4412130 4526652 5601442 7037639 9316305 13567217 20814795 35214072 38212656
14544 38212656 21696944 10455774 4785609 3005485 2337716 2147020 2173061 1969650
14536 1969650 2260177 2081057 2287091 2320399 1916004 1958948 2329549 2056945 2305788 2225494
14526 2225494 2416593 2428915 2282847 2533891 2704334 2841343 2914961 2344658 2453926 2600347
14516 2600347 2526661 2756552 3098386 2818618 2989041 2844192 2831362 3013687 2906583 3135654
14506 3135654 2893617 3281528 3117637 3176733 3210331 3247312 3116910 3399875 3107176 3404494
14496 3404494 3386414 3305261 3358340 3423368 3497240 3676157 3993657 3750229 3641112 3898260
14486 3898260 3633002 3675077 4204060 4102530 4336403 4246265 4055872 4326275 4405476 4166256
14476 4166256 4116614 4389359 4378882 4362611 4173650 4809409 4530662 4490174 4777072 4886736
14466 4886736 4866357 4720847 5024761 5311980 5114207 5176991 5106337 5597015 5342645 5093477
14456 5093477 5531735 5546396 5561883 5179140 5746442 5635409 5754714 5970614 5820122 5878718
14446 5878718 6136505 6100122 6537370 6364295 6327597 6238113 6452189 6382945 6275929 6658396
14436 6658396 6661400 6983477 6782839 7011230 7385041 7273781 7304599 7398916 7373093 7763529
14426 7763529 7847751 7793330 8055077 8191756 8204988 8308430 8073402 8589796 8627599 8674049
14416 8674049 8783023 9127012 8971452 9141224 9295356 9517854 9502210 9888163 9622460 10258940
14406 10258940 10302062 10369481 10271153 10637150 10904944 11105126 11190004 11169324 11509827 11952125
14396 11952125 11803137 12305764 12504125 12603232 12808383 13105161 13239314 13622454 13787104
14387 13787104 13690229 14343235 14458381 14684870 15142494 15133837 15741895 16030864 16141352 16597297
14377 16597297 16819257 16890714 17213398 17848876 18120424 18455389 18826091 19251270 19793420
14368 19793420 19869368 20525767 20940487 21081351 21855113 22353277 22714993 23186139 23314464
14359 23314464 24138044 24689236 25172883 25877277 26471291 27266655 27594539 28521095 29137115
14350 29137115 29660300 30309140 31082517 32289361 32642703 33773519 34963559 35385631 36433539
14341 36433539 37483588 38449484 39312749 40752496 41522751 43018005 44109608 45258576
14333 45258576 46509601 48141591 49782518 51039497 52780090 54236307 55716633 57561150
14325 57561150 59728207 61445331 63323992 65741001 68518582 70443809 72761432 75301665
14317 75301665 78280724 80950523 83899488 87208696 90668938 94089557 97722483 101406250
14309 101406250 105472614 109793258 114331575 118568010 123792827 129116333 134724665 140521132
14301 140521132 147034763 153116023 160255733 167641913 174997000 183248701 191773218 201074431
14293 201074431 210312043 220521978 230871224 241828568 253001610 265105756 277503198
14286 277503198 289729434 302798737 316382459 329706559 343470360 356974405 370362004
14279 370362004 383419847 395946719 407709703 418042707 427078598 433880575 436912924
14272 436912924 437999451 439381226 441487077 440146357 437311487 434632683 430431212 422110114
14264 422110114 410697719 397708581 383775158 368970571 354106154 338817321 323750705
14257 323750705 308789488 294383653 280219636 267284530 254102747 241719441 229846034
14250 229846034 218263796 207551320 197325592 187420398 178537234 170194212 162257720
14243 162257720 154769038 147532619 140592486 134149282 128159927 122856603 117919221 112557403
14235 112557403 107818653 103666897 98674104 95101507 91362687 88014607 84469832 80999547
14227 80999547 78222299 75006334 72569172 69739405 67122819 64873863 62842292 60256877
14219 60256877 58452707 56683434 54808682 52734456 51178029 49503579 48571986 47084759
14211 47084759 45579260 44047289 42649620 41614516 40900547 39645441 38533175 37234423
14203 37234423 36377904 35338792 34328375 34049436 32936561 31999915 31260221 30282148 29524278
14194 29524278 28791705 28325079 27151736 26746466 26099874 25479051 25257256 24414319 23789122
14185 23789122 23244337 22829635 22295104 21672149 21431801 20540177 20602931 20202888 19492762
14176 19492762 19278848 18874476 18620855 18049244 17443558 17526737 17157859 16755687 16513819
14167 16513819 15919776 15964604 15575603 15028843 14843003 14898638 14693403 14046594 14063430 14131696
14157 14131696 13806837 13449152 12915260 12838987 12623546 12406169 12460415 12019030 11580000 11850310
14147 11850310 11584137 11010343 11153905 10830837 10903980 10421768 10329408 10253805 10080463 9944933
14137 9944933 9657299 9722507 9430324 9356649 9367055 9091089 9304491 8985896 8745422 9154787
14127 9154787 8513429 8641311 8372641 8478839 7868847 7925052 7787998 7845456 7453855 7508682
14117 7508682 7514487 7472525 6866606 6891127 7120200 6939244 6608537 7028532 6643340 6490492
14107 6490492 6567250 6449984 6304431 6059415 6344634 6194075 5899775 5984874 6242501 6048893
14097 6048893 5832499 5594473 5700599 5644345 5395305 5259407 5467935 5439825 5083504 4960362
14087 4960362 5143843 5249679 4989345 4919043 4991991 4681204 4704638 4811153 4818074 4688723
14077 4688723 4497615 4581503 4270930 4191595 4401600 4110806 4305952 4237963 4148629 4018046
14067 4018046 4156543 3797662 3889552 4018827 3881411 4131681 4058075 4023797 3941952 3892873
14057 3892873 3717285 3602938 3799169 3541272 3556782 3937407 3638527 3801171 3570267 3482607
14047 3482607 3599776 3575874 3518357 3405156 3451532 3262009 3295281 3215058 3140418 3197352 3423962
14036 3423962 3159045 3017408 3197269 3070158 3063140 3332090 3057820 2835022 3072832 3057495
14026 3057495 3047801 2853860 2674547 2873008 3021391 2862460 2459291 2762463 2733535 2887155
14016 2887155 2661668 2121679 2858547 2124195 2557588 2500759 2492951 2263281 2115302 2207978
14006 2207978 2534776 2170087 2483720 2283008 2237561 1975059 2601183 2091400 2460545 2400606
13996 2400606 2433118 2476240 2253462 2671736 2655008 2881534 3867781 5477684 8462644 14693810
13986 14693810 28511329 38882721 24473683 13743372 8229068 5859946 4420721
13979 4420721 3917173 3838779 3325874 3324067 2941385 2867796 2722454 2703973 2560936 2671636
13969 2671636 2604343 2641380 2352056 2274671 2429682 1870275 2314950 2134923 2183391 2160002
13959 2160002 2091971 1883833 2150804 1798859 2017587 1660575 1845157 1884123 1922628 1844062
13949 1844062 1890256 1556508 1793531 1975073 1966687 1847593 1683300 2004503 1612481 1907481
13939 1907481 1302989 1861969 1710997 1538096 1840953 1503146 1709348 1441136 1688091
13930 1688091 1646018 1676399 1441776 1752986 1838306 1637234 1552123 1673845 1638174 1566893
13920 1566893 1602704 1383856 1468005 1756787 1384115 1479215 1498382 1480522 1502919 1217758
13910 1217758 1319245 1506371 1269680 1529815 1266484 1309795 1317589 1394788 1337496 1349261
13900 1349261 1372792 1435623 1145755 1338293 1154430 1353575 1172715 1025724 1169600 1073158
13890 1073158 1517117 1328732 1322273 1081757 1531445 1069655 1170543 1522161 1175360 1223608
13880 1223608 1100146 1165524 1331508 1187456 1043857 1443632 1228826 939443 834733 1415631
13870 1415631 1206882 745061 890251 1038934 1130252 1012269 1004828 899540 1179545 1295602
13860 1295602 1098040 1202537 1500144 1272035 870542 977720 1241648 953654 985451 970803
13850 970803 877773 899230 930702 1055895 1062527 930317 731245 1167693 845299 918155 722567
13839 722567 736406 707720 744976 998699 998398 1111451 652409 1073488 908357 679184 981409
13828 981409 642056 928423 1175140 864348 614102 1210410 939606 906235 636656 926976
13818 926976 892577 946459 1012837 1030889 1106847 651000 845142 828340 1005794 1071340 853453
13807 853453 889246 766738 1042183 1026395 1087625 759834 884500 590845 782794 686935
13797 686935 579518 722381 655640 1228707 901015 517034 789071 526492 556134 1025601
13787 1025601 629132 857112 532569 644869 756659 678012 882042 580041 739335 466571
13777 466571 748027 685312 573886 789609 424898 632107 552945 650182 662881 381478
13767 381478 752603 680353 541590 341783 842220 505243 520352 449297 301575 750159
13757 750159 887990 725955 445091 587045 690317 321353 934930 556302 707074 646057
13747 646057 686132 628278 883806 796194 702619 684262 576575 633078 582963 529218 812824
13736 812824 595407 623125 742556 723714 553856 722811 783333 536267 403874 645053
13726 645053 731068 720425 784720 743637 312998 985656 425144 503757 387416 515109
13716 515109 730690 433676 827898 436376 215459 609352 422175 597223 545650 846756
13706 846756 594394 665955 612331 364762 331015 684731 700582 694294 417107 402695 579063
13695 579063 508701 660440 749083 99185 307959 721067 580226 702925 516815 533610
13685 533610 554442 552943 670922 341720 628611 437995 618387 316238 548216 736372
13675 736372 484599 455155 531674 444212 152871 558127 582406 479309 441732 416716 246150
13664 246150 453863 279589 381435 372513 449594 180044 482342 432583 406478 631877
13654 631877 233936 350766 557512 223183 602902 542275 459043 164527 385162 287472
13644 287472 265520 393552 249137 375643 815297 -84324 385298 246183 274667 -109252
13633 539848 578117 686632 394898 304600 517637 461031 293083 533268 193846 471323
13623 471323 317308 270278 441915 585558 310894 116968 278654 608232 167241 366338
13613 366338 624645 582286 346044 102362 222283 437160 455042 286864 485347 162941
13602 466848 490291 641017 732818 338810 190298 525201 536211 47313 327274 232906
13592 232906 333148 263662 397368 333448 568663 437634 176581 -97529 263126 76132
13581 317509 311301 272049 657050 -88915 412070 -55367 44692 388008 355824 -142868 452774
13569 94315 121932 135666 174176 390993 294592 534281 353345 324146 192334 372375 326660
13558 326660 241408 22427 123221 207170 380882 389057 211080 368782 384779 186721 398345
13547 398345 252881 143047 314226 97773 540158 376120 67971 156045 504276 268324
13537 268324 410878 178295 149734 385482 537866 175753 254644 317878 -24525 179457
13526 526972 557653 304545 359155 140905 -69597 246115 250518 162407 217075 238843 507531
13515 507531 197480 302401 -135866 19030 247055 187338 151887 312415 361403 56696
13504 135172 313108 -102993 293133 285847 131895 188507 169469 236740 272845 76171 248390
13493 248390 60652 99055 303509 468202 456989 -135754 85207 239504 138405 189522
13483 189522 617899 390808 -92346 28935 -119099 340097 190009 154512 9572 169410
13473 169410 206259 184487 493739 417352 352537 437274 64881 246348 60459 -177872 544996
13461 235705 473293 275479 321696 384984 133971 90396 319699 460770 380445 -42002
13450 59362 332848 88439 339260 246890 451840 243083 214399 162308 172468 388556 141181
13438 182314 228977 -192889 169484 76152 -160030 539264 87404 241312 130063 -47414
13427 269524 -52551 150498 133380 -25454 267922 138769 496691 138088 69948 525875
13417 525875 15939 33621 202018 -183927 69143 336602 4803 296200 193871 325138
13407 325138 38296 233004 129268 225388 332005 -137008 -66046 104652 224725 187309
13397 187309 238945 337634 -13701 432031 87503 455778 154723 -217401 373817 366746 155978
13385 153664 380809 -38637 243748 14961 210592 214134 175047 254841 -26252 282682 198949
13374 198949 220219 286648 -102604 225464 403179 393690 517131 315658 412651 242258
13364 242258 662314 195453 395449 624686 171444 20763 42855 166858 24705 334515
13354 334515 96799 -4297 154147 -22484 61927 311796 276856 329523 231348 14358 212532
13343 212532 157781 575674 50714 178630 45689 209958 -74211 249215 150892 27464 9224
13331 248913 196397 -213638 -80151 353418 135937 409746 556404 469816 501156 -26353
13320 53256 488096 184104 169719 -168039 227381 178546 77018 387562 339584 -64280 258892
13308 119317 286641 170113 376448 481847 -208184 -28392 115551 166460 189353 279063
13298 279063 -56519 334364 90560 -28459 160725 -48517 100876 57386 264322 225712 143594
13287 143594 139208 132904 86942 263620 158286 -71538 -190334 -27154 266353 89746 193274
13276 193274 411946 -3790 -95366 -61741 536340 177261 276823 303660 148826 201469 -104618
13264 -269582 133350 30894 200819 67984 138802 -195400 245097 264687 124735 140588
13254 140588 15365 -7957 226665 22842 -19505 216720 -32121 27160 415412 360878 103974
13242 483825 57611 437386 50772 124794 -28000 26336 -71420 -143204 164439 -294653 97530
13230 83467 238656 -60081 -182332 117444 146186 -171628 124368 -22526 -48927 -239923
13220 -239923 -129612 357555 -118785 52708 92306 -73578 82253 288459 -68046 -3467 -49952
13209 -49952 458146 216333 -13601 183058 -174116 198350 65077 -254896 -74891 -362972
13199 -362972 110864 140498 -9033 -31693 298560 -186604 -24424 384411 260936 -271712
13188 571690 -36681 45893 9644 86976 40666 96758 212216 -91458 44883 -366245 19642
13176 -171144 -226540 153436 112908 268837 -95566 125577 171335 68174 174858 186682 59004
13164 -116914 255653 98677 109884 37941 345082 -157289 -7432 72757 -146352 -37059 -189579
13153 -189579 165186 145985 209152 277841 81157 -18416 -151174 -116254 69671 53154 100958
13142 100958 20295 -153105 222367 47726 -111109 -140424 166568 212751 -39478 -17662 105620
13130 128505 -234690 180593 108131 -163921 33601 -107948 -56681 231296 -68213 118581
13119 -63439 88370 135654 -98481 298960 286943 301359 -29669 -176817 388353 134583 -45430
13107 404530 552764 94141 -33791 -198529 -27123 149377 244533 73458 -26048 346750 -146979
13095 192128 -76116 -30840 176743 109610 129547 49416 61368 -174058 65790 -161788 -123635
13084 -123635 1690 -3036 9222 -18116 -214107 -42971 121420 122235 72019 57121 -87949 -47552
13072 -47552 117475 107905 -208096 37770 32921 299533 292013 273010 -33869 236375 371808
13061 371808 87104 87926 -75883 16947 253907 26964 -271516 174667 150067 -35796 -23483
13050 -23483 -21325 121852 30701 138935 86112 312058 204424 -188431 -16181 72066 129113
13039 129113 -95034 246669 -79149 101453 280402 121460 57350 176674 157284 -60679
13028 96069 118454 116828 85486 163259 80645 300784 363663 67620 -96250 242519 -110488
13016 210494 46530 -16405 303774 -134428 419742 -46068 345869 -166664 248249 416576
13006 416576 178828 121801 16892 263075 136225 247471 109344 392684 -216499 44505
12995 57559 162084 158695 142570 253646 -95209 255993 -77653 -72759 211949 46259 -39336
12983 63354 111619 132678 211685 -32816 -19309 -64421 -106591 -114895 -108488 98463 228856 78784
12970 38417 3820 -280231 165755 72953 97855 149832 135321 156881 -364721 -128646 143004
12958 -73699 207309 -183206 4807 23662 -295631 198761 8183 -175872 -64820 -32790 -36001
12947 -36001 51940 -208949 34958 72642 95264 -59725 112063 -116147 307821 166208 -65699
12935 -276874 -42599 -62460 192021 -11733 -215872 76291 -23246 -314866 93346 228907 245322
12924 245322 -213986 13823 51938 179050 -42000 306731 -168692 319974 251679 -134638
12913 103511 -26217 261762 -107774 269888 253632 -48046 -16331 -184374 130650 -120602
12902 -148431 -1875 315604 -172889 -116895 -12167 1150 94234 452869 279264 -158440 188570
12890 166299 -185500 20834 201066 409804 114141 111086 234789 113554 6978 -192411
12879 -55223 84417 341627 -5211 124487 144298 -307176 -70654 27616 -317530 -191289 -320396
12868 -320396 -74109 -20189 209399 64612 -225179 12273 210777 -57192 152431 42234 -352637
12856 24054 410236 275079 63775 63710 144029 -98912 454301 -276164 -373169 -103398 -155784
12845 -155784 227984 -91003 50077 -47684 47845 485349 28015 -119125 -197926 -218527 -196273
12834 -196273 246663 -36875 194702 -168619 -175471 82040 220594 200226 -266487 -231162 -113242
12822 -32880 322528 -205882 -166595 -43367 -138629 31290 295498 -90380 -88719 8175 -64814
12810 -40944 66421 -119729 -125192 -18124 -155825 107787 127642 172836 173241 9112 -262403 -91005
12797 39559 -309738 11967 110972 46025 -100271 -45610 -168041 119769 176500 80278 78931
12786 78931 -27204 -82581 226 -100627 -111199 -171333 -255718 -3818 30671 -364976 -45828 133792
12773 -195380 78507 216886 266610 235840 -31882 61882 3804 214829 -3050 -17678 198471
12761 182461 100714 -154080 71131 117155 120067 301295 -82519 205055 233736 30906 88757
12750 88757 54184 -197013 -56030 87905 -70173 4838 38400 39198 157874 35805 154409 147982
12738 147982 -88021 464092 59282 414826 -27550 197176 258308 -7944 -80875 -245417 -49803
12726 191464 115863 41617 -325867 -24024 -253178 -466351 -283138 62418 -84671 -210446
12716 -210446 -178474 174415 179802 79492 278889 -11986 -165086 -146467 302401 210089 251343
12705 251343 195892 242934 447238 216022 75394 352067 -46472 348458 2088 216628 -86528
12693 -193550 13288 -100784 -184821 -40181 57535 -128657 6990 -157308 138401 311543 137897
12681 201794 -198617 153583 88123 188963 113009 -267249 83625 182869 199448 425136
12671 425136 -202020 -116116 124158 -112989 137286 11750 -14785 98758 128667 147335 203563
12660 203563 99232 142152 177792 303186 -8991 180371 -59522 338435 -83144 368653 7752
12648 -54704 -233148 -27742 236828 115250 -318793 -8812 33689 -145125 -154390 313921 90522
12636 408600 -121025 13110 13279 2453 4496 342611 193126 -233945 133034 -168891 62919
12624 266570 359888 219226 436343 -41639 11085 -32530 -144942 -8052 -42850 111022 75553
12613 75553 -215228 -75639 -114360 -85889 -54145 -44629 -98030 236970 -525337 148611 252100
12602 252100 58657 503615 174864 250534 112210 88007 11161 -60297 118384 -113397
12591 241783 181280 -232388 15742 76142 286015 -145008 -164344 -16416 -167006 110045
12580 115708 -201056 -482721 13849 214952 -331536 270826 35204 124056 154326 318033
12570 318033 188753 278326 -756 116388 -89716 173926 -42561 -30477 32067 -73168 84751
12558 122775 55009 -16687 -48250 288572 -226806 -235512 37855 179174 33646 -152608 -12195
12546 278275 229565 -369274 -92176 235799 -165964 -65990 35338 -88666 124601 281577
12536 281577 -147640 44715 13520 197343 -254737 -22797 178598 39007 237038 109333
12525 249311 -741 -314769 -119607 241799 -173356 213223 68963 329812 79805 -30796 -82854
12514 -82854 479984 199203 411858 59693 224936 4007 51262 72075 -28961 -67055 -34942
12503 -34942 133977 -263604 -108975 257662 377428 -3425 -38556 130342 250789 -124240
12492 227833 202781 432364 -122306 61224 118314 41242 56637 290949 111558 28078 519
12480 -126025 -171606 -201242 7970 369458 125259 338540 91351 -96566 33281 4333 185085
12469 185085 -247038 -47626 -80511 32753 130180 22587 -26535 -174768 -105941 -33633 244753
12457 13213 245828 138937 -17978 147742 -108594 56622 -30330 -96968 385100 -167936
12446 46902 -167209 -18629 83142 -702 -64286 46302 202249 -31100 -176575 398270 112809
12434 263153 -18475 162489 -139637 43417 135329 -106418 433 -73456 40418 -265286 108401
12422 -140313 49789 -231828 115303 -104035 38285 -167461 45094 -49351 -220417 -298002
12412 -298002 75660 232165 -130834 -363952 -6075 75233 -249829 -183456 9484 -235214 81331
12400 243064 14317 -159429 -189017 -164974 -49048 -115936 -13668 -167008 47157 10989 8215
12389 8215 136330 -142398 -95509 320311 -64171 -21707 -106479 168684 -130868 -9328 24595
12377 265881 -179285 165656 -240481 97437 -61279 -91658 70177 -409754 -99358 -66862 -110985
12366 -110985 -396656 -281916 -152670 110090 -259742 -53094 -169313 39054 -377729 -255903
12356 -255903 402990 -94933 74652 287943 56972 57031 -54710 -155263 -412779 -187774 57871
12344 118856 -28334 -3218 223105 40680 -319912 -196110 73350 -8245 -24233 -121205 -171429
12333 -171429 51299 211737 -146142 -85242 184809 142767 6516 -39464 -275134 167803 115100
12322 115100 -1573 137976 73798 -107881 -70989 -22987 74837 -105721 280785 40670 68588
12311 68588 28399 30892 230127 65463 -68921 3686 172641 -286569 105462 193095 -184120
12299 31924 -30492 -85835 207481 186421 -78137 332618 70495 122754 87042 -41642 81212
12287 -1371 -84494 -114660 -211474 -4214 -167578 60144 162182 85532 168592 221287 -98384 6630
12274 297254 -16903 333948 188413 134037 269379 50610 119870 152619 -214683 112833
12263 100298 62984 -19196 71346 32682 169842 351977 -35929 246010 80787 51282 173683
12252 173683 217939 28477 174879 198009 261128 576694 -40295 224108 -101162 102152
12241 -142069 72243 72717 238699 122798 -10352 233920 -291408 61190 -137188 244082 99974
12229 -5572 120416 460447 130507 106488 -48385 211760 237457 246230 285856 430413 117452
12217 34094 345643 -70242 371742 2665 -13612 37674 237687 63486 105911 247875 274777
12206 274777 338648 -189585 191260 -49440 276313 253278 -79177 242120 181251 295972
12196 295972 146640 506750 2191 390047 239403 351996 147471 105438 176686 279377
12186 279377 26347 44600 -139317 56987 -7242 -105394 237770 162650 84127 26179 104128
12175 104128 566383 76610 -43372 209021 152341 171495 209828 395252 475171 129585 -4188
12163 61675 239526 211199 -85488 -126800 -41643 51117 -169771 255495 233901 -86322 -159372
12152 -159372 -159217 -86813 88062 51845 51532 -42516 -150026 -101469 -152135 275407 20354 252242
12140 252242 177291 77152 152731 -228513 18073 123469 76098 -8197 229620 -227985 56115
12128 107871 -50395 235545 -101966 40417 45266 6513 -82430 37760 201832 -68383 44622
12116 -210263 -219503 159592 -155198 108872 -288466 266592 -38212 195656 40480 -136519
12105 -139781 46847 36115 -158370 251747 -175457 88531 264934 131375 118914 108094
12095 108094 -288829 363883 -273217 -128277 70234 -270905 -143651 15636 -15361 -45244
12085 -45244 -186395 -65428 152395 494009 78960 -283962 -354494 -185149 176450 32550
12074 -56447 -3842 -38218 -94495 20397 18502 98505 -109980 -72453 115733 -155227 -127903
12063 -127903 -108436 -203116 202949 79373 207718 274283 870442 1207735 668156 150005
12052 164117 -53672 -264146 2386 150889 -141943 -224335 129470 -261692 130210 -54743
12041 -327717 -232755 -361020 95714 -133481 -73271 24256 12019 30791 -44835 -349235 243269
12029 239387 -169650 183761 8129 21627 27690 -54935 -10695 -26395 6748 -122719 -208397
12018 -208397 -83273 41597 96702 60828 -14048 -170010 -7758 302559 93241 -10032 -128587
12007 -128587 -325553 120149 156794 75372 -51689 -42564 199087 -260580 -330598 32242 -245080
11995 191768 451460 125828 116503 -88544 287368 -354952 50939 -185369 216149 -197450
11984 -296286 -107405 -345218 -101261 -106246 118381 -58301 -120215 88075 -226833 133752
11973 83788 -12075 -261841 97248 -68469 38511 104601 -102023 -88732 -154573 178004 -49262
11961 90030 83906 16765 38641 -144481 -196963 188204 145728 27650 -21025 76432 32357
11949 154928 -12157 109204 78566 -273869 -324379 177040 153357 -220542 5676 24333 -211332
11937 -87693 105653 -240684 231261 -332700 727 281616 14683 33337 12383 -9203 -101813
11926 -101813 -132552 -72444 -130349 102134 -293998 -46668 -35549 40368 -208884 18614 239162
11915 239162 247499 -57415 -481127 -221989 262867 40061 -215896 -34102 -264492 64378 230443
11904 230443 -1182 37204 76423 -47894 -398140 -58688 -73487 -478 71610 312657 -85765 -238497
11892 -238497 -149376 35691 -63860 -161441 -27548 -259369 -27915 241603 38016 -265923 -120383
11880 195366 -8903 50880 -84040 -34231 28959 -23815 38423 -94511 169917 -314256 -80381
11868 86759 -86116 -203171 336592 114399 -221917 80840 -268315 -21033 282017 426012
11858 426012 -145109 43074 -156577 128567 58096 76283 -225746 -48320 -81327 138899
11847 -160069 261 156855 -177959 -320404 -149990 50009 -112476 220100 -28030 198471
11836 19337 -46282 26835 -73955 -108689 -195174 48434 -132896 -161582 -412151 168763 -98130
11824 -82145 -224827 91811 209117 -26006 104598 -95077 150015 176408 75442 -97220 266275
11812 180036 -86139 -131910 -113296 197223 -60415 -286800 10418 -56199 -77507 -198392 138031
11800 -233767 -33693 -7512 128389 11175 -327245 -51642 28418 139304 56814 -93393 -202908
11789 -202908 12816 213527 -155591 238614 -38576 -52033 -16398 161726 224666 109648
11778 39831 165135 -45125 -211854 -65989 -130657 -78201 -197521 -95335 100713 -306104 269225
11766 -181945 -69268 -11825 -107749 -131294 -45936 -190819 -90879 222462 -2507 41660 -70247
11754 -128397 -169266 123590 7376 322084 372792 145497 22920 -224617 -122636 75766 56520
11743 56520 -215341 7704 165945 -223515 -241774 -115832 -14376 -18697 -86029 -187997 -76911
11731 -36739 -15114 -111674 -145125 89036 41705 -286420 -39842 -57696 -63768 -143677 498655
11719 58657 -116908 95072 24071 23598 62439 58636 116925 117086 -417865 271276 14473 -261571
11706 483536 255649 -86470 358950 468945 -107406 95763 -19197 228915 13334 -287860
11695 137839 -149767 85840 122146 32188 -53121 -54801 209845 68780 99025 -207856 -4167
11683 273835 191046 -225865 19744 212557 -25004 -69618 228266 335792 -175341 361891
11672 254418 -44330 -48046 -187444 -98958 -42117 286180 118428 -306247 -15832 -35428 217268
11660 36404 256736 98791 284462 208532 51219 192414 -204000 236085 -80699 -97612 -68400
11649 -68400 127124 -74453 499835 167954 130422 1817 -169526 -153711 -216933 -49245 -224238
11638 -224238 -41605 168919 208380 62497 9773 186548 214679 -274198 -240889 -3702 -231564
11627 -231564 98050 6530 160495 2002 64567 -214186 -153550 -140319 -17757 76766 99456
11616 99456 355263 116176 -39681 -31128 -9924 -193697 -102754 -160780 68513 -99565 110426
11604 -50407 -28573 -119728 -150632 95270 109092 122291 92100 116927 -310135 178905 -305018
11592 163013 338597 53291 251722 11230 33587 -23521 -145871 36383 82720 -104270 -132843
11581 -132843 -25885 134374 -85872 -38094 159830 -241772 -108526 101900 92423 45766 244741
11570 244741 -156090 -158409 369722 106145 167709 94257 -279842 -83976 187105 -117424
11559 128436 404683 337571 -218517 -233508 197664 15677 11494 -9756 434004 25754 282951
11548 282951 -50677 13175 191622 112324 143060 -76082 148112 122356 75554 462389 10991
11536 -280814 -31125 311297 132203 554130 242786 541087 -170963 -114454 203191 336510
11526 336510 153236 -4888 340680 60716 340966 73697 -233501 -378578 34233 -75779 143920
11514 66132 257146 -290615 -99017 133184 198457 170990 5486 207887 -107122 -87224 262912
11502 157347 135358 199829 19016 114586 247337 77641 371734 218408 99878 34963 -20987
11490 -32234 -127942 62530 14452 345901 225397 516796 292410 -29776 205672 188831 -74861
11478 214181 67010 314000 122527 487634 128837 110898 120919 20067 475549 -118928
11467 -111282 6053 538303 302701 118187 85717 224871 323503 71822 -25343 340236 -3321
11455 25347 -171828 -170099 173736 367032 -72110 42557 219540 303608 356598 246326 37015
11443 -179241 114485 -101147 -43487 153580 261439 -153086 14806 318228 19535 72864
11433 72864 -201635 120587 329930 -27716 -61825 -49488 67052 47076 184592 302526 122437
11421 207743 -21979 -70830 -37433 -91895 -3070 122093 127906 -248424 150520 23371 13284
11410 13284 362393 21762 249215 88492 96569 -63364 106056 -409900 -50764 243015 -311920
11398 293005 268529 -254373 361736 281420 -34923 53215 80679 -17526 98089 57044 144320
11387 144320 -114734 4559 -140476 -63598 66217 -24962 -70179 225032 -9686 -15003 82142
11375 -29184 -125753 92506 115458 61836 492442 36689 -153059 -70634 -122729 -186034 -57509
11363 -971 135167 -284807 -72960 -96787 -118410 -104858 -212519 -336628 -103445 181006 -180994
11351 -123947 -157277 57948 -231757 51149 -43157 -299538 -339225 106889 209465 302953 -54294
11339 223594 -166069 218186 -13887 27510 13495 303302 368038 80375 262845 163247 -135640
11327 -117900 -87933 62394 -337264 -146334 202910 20680 213839 116841 146713 -27378 3660
11315 -58541 148291 8842 -40369 318912 -134321 -299055 225715 75753 -62747 -201754 -231612
11304 -231612 -431095 -100084 97824 14380 176596 31179 4741 -245994 -89432 -102020 219624
11292 -75620 323320 -143101 -197552 1461 -343181 -82725 -42627 -12780 -198715 -19625 -51879
11281 -51879 379139 -197992 -81143 -66498 -350181 -624661 137019 -243268 126045 44483
11270 87462 -105464 -259472 -168293 -262210 -116877 -189012 -148741 -410684 -159610 -80904 327993
11258 123982 -359459 146506 -125385 -186369 -27357 71536 104797 -78380 64316 -129023 -161429
11247 -161429 162853 -216703 92111 -138984 -30981 99297 -46224 -3829 -103649 -158011 -239595
11236 -239595 280101 214236 -137627 59600 296980 122833 -473539 -259748 124786 -15673
11225 292420 37796 -89343 -29175 253525 132297 -70124 305022 -289508 -176865 -33381
11214 -378938 -57054 -351745 -152179 -373127 -35891 -72329 20411 -159595 29167 -228005
11203 54638 160440 -216007 38088 -44372 -273051 130779 21363 76279 -51426 57885 -215477
11191 -106614 -229994 -286027 313850 42612 -291023 -201935 -98573 58979 20269 202611 -120711
11179 134395 -43290 -5143 -199440 -278153 439 -9141 326482 -120417 307245 -30339 -185196
11168 -185196 -3207 -207855 -405026 105715 -98338 -50454 -10928 233749 -25881 124041 -202750
11156 21914 -310150 -480863 -242150 -23735 80364 116301 -27686 251321 -17944 260767 -31083
11144 -48092 262011 25272 122512 12685 -242052 68528 -120669 -45265 -138032 -82011 -280134
11133 -280134 178980 109498 200032 -15386 -435285 23269 337971 -58567 102567 -9320 -6275
11122 -6275 -74893 -6203 153986 108667 -50232 -310682 160115 64350 -16885 403767 37133
11110 26418 56979 264566 63692 293898 -165730 -97902 -40145 -113133 3389 -2873 -94625
11099 -94625 311723 24282 309465 38938 64052 151096 -64920 119316 -81138 401791 54271
11087 224591 269531 221057 107660 495204 135743 6 54332 448773 -26195 317084 480967
11076 480967 381582 320410 258832 242003 176280 500078 246845 266748 398187 79880 474736
11065 474736 651741 520993 554014 566047 810839 776160 649506 500228 525797 478871
11055 478871 433082 419813 552255 727371 477934 765501 1162991 1295512 555677 1275787
11045 1275787 738624 984744 723172 818773 608614 809709 570505 1011891 777798 765911
11035 765911 1073414 401035 431437 908056 711747 942599 552333 875513 1118839 856394
11025 856394 778378 811667 757453 625113 737748 828064 785592 569701 478946 774941 837334
11014 837334 685394 891715 288000 758204 420735 740724 661322 784380 395458 561119
11004 561119 513948 644516 804298 597620 910654 729260 1121580 769359 931854 564200
10994 564200 798382 713272 731512 849564 551703 859438 1027505 789117 1112564 1324965
10984 1324965 1207424 1331091 1071394 1140450 1443086 1480910 1706893 1880849 1859064 1885156
10974 1885156 2529631 2632899 3004447 3146098 3004483 3388344 3105384 2733668 2633660
10965 2633660 2442718 2046718 2074771 1866080 1564116 1841078 1771182 1524479 1820982 1798748
10955 1798748 1794040 1440733 1233662 1278755 1327320 908599 722378 578351 574126 390935
10945 390935 387040 276962 299695 389711 420474 214948 185974 104241 168190 64157 529832
10934 529832 129645 11735 293830 115309 -273269 141881 -49531 120014 21739 -145263
10923 128472 243209 169693 170746 -68430 16002 16668 -68092 -173444 -145393 -4413 -259602 144544
10910 -246756 -139541 209824 -123 -16778 -5337 -446167 -200238 59989 79535 33769 264544
10899 264544 226900 -119574 216304 28184 266458 -930 -346 -473760 -22406 373597 -103084
10887 -42379 -131145 -65152 13775 86275 -129243 140576 171941 115175 -312861 336912 54265
10875 -199351 -136996 139692 149652 113298 -313613 221968 -34195 92146 296520 -150704 -212259
10864 -212259 56735 165717 -295764 323831 2621 -9110 243402 31774 138270 -19108 -179973
10853 -179973 -132165 -175987 -13579 143512 267415 -325753 86365 84492 381842 110435 -72654
10841 196336 -51593 142798 -47042 -316076 -14321 -113568 105660 -122079 -371003 -41758
10830 -73998 102362 -345021 142285 24598 24299 -392235 -154791 -222203 47726 -97290 -246190
10819 -246190 -201127 -262906 91493 109520 -56803 65151 -155245 -59225 237038 262225 295296
10808 295296 -276750 -54481 136374 -172249 26009 -154259 27069 -18391 -28480 77388 323836
10797 323836 -68070 -131663 156623 -2715 -316581 15429 -17881 261290 -261312 -268755 136259
10785 16370 -112167 -1408 -87492 -153568 -37829 53739 -525538 -204882 9143 -27045 -95675
10774 -95675 -81484 -269534 -347626 267610 114979 -212896 -77693 173782 -214831 -270780
10764 -270780 375925 365582 -39590 -461577 -315772 157157 204117 -339671 -7922 91223 -18886
10752 -191806 -29140 -40545 241842 -238976 252352 -337421 107032 192165 91926 -213528
10741 234858 -120692 115031 -91557 207123 -112884 31147 -73614 -67986 -46982 -219713 173836
10729 7997 12649 -155983 -531757 -168088 137298 94515 -96487 5553 -205469 -304050 -492111
10718 -492111 -112488 -149851 -460348 -46498 18415 -308918 -141516 -61480 -296524 -340512
10708 -340512 -147119 124104 -110766 218768 -88773 -171710 -208813 288741 -2280 136454
10697 -436518 -89107 -24400 -207489 265938 -103546 324781 157974 -47379 -131998 253379
10686 -205509 187125 -21956 -230171 263200 -272878 -220081 -57840 -189903 45423 -216208
10675 -3658 -229815 164076 -80372 18130 -12906 285331 5005 -14710 137279 -78424 -227728
10664 -227728 -353506 366503 83021 206297 106775 340958 -27802 45072 -296790 -319635
10654 -319635 -70302 -145721 146009 -277714 -64842 104560 11636 39554 -321594 -11843 64141
10642 316168 -6790 212096 170100 162776 81920 193518 48135 39333 13924 -13241 -44870 -164178
10630 -164178 -104048 117593 -224689 -246909 -270469 -320721 -39367 167940 92189 -79376 50767
10618 -54356 -191795 3235 39041 -191205 -24940 121729 -160025 59011 -74780 -111323 -115982
10607 -115982 189754 4637 -9893 233691 113675 168434 -342369 -1242 -112292 -28451 -264881
10596 -264881 -276848 295600 17535 -111570 48449 -18132 209686 -147025 91344 -7358 -368101
10585 -368101 -73360 -198110 -172659 184680 -299447 -220128 39413 85317 -251521 -84172 199472
10573 243736 167477 246906 -50998 -140994 -321270 -2508 7534 223059 37776 213584 -28910
10561 -243287 100233 56334 153076 -82070 -194024 -103115 -75840 -108278 -172137 -277627 -274647
10550 -274647 -94447 251159 -62442 -484414 -242449 -85497 -282409 -64229 113126 -9483 62906
10538 -95114 -30161 159048 -4833 254777 166552 100370 52797 -343895 -143079 114689 160282
10527 160282 -231211 259203 -125567 -230935 -79839 68496 -116254 -168016 -115546 -41909
10516 78382 -311475 31972 -34075 19109 80709 -25360 8285 -158154 128761 -350699 -123347
10504 -163891 -16495 17902 70133 -5360 -52613 48051 -135887 -56776 -125715 -196097 61515
10492 -228176 284528 261975 7712 329719 260978 -91246 -81079 170925 240336 88450 334763
10481 334763 490113 502815 521693 290399 267406 349470 -221869 -94259 -31204 139028 -57377
10469 253046 4262 39213 190952 -43250 -8690 367153 -187314 155766 70436 -33232 -271918
10458 -271918 -286355 348058 37872 -214590 -143786 -86010 -4422 133682 -77291 -111136 30677
10446 -30360 242683 -245719 25071 -26110 344208 87763 156770 -39738 413544 -179272 96164
10434 -207753 -203046 -196751 -42634 370095 -174098 -217214 -164558 -103395 227050 -42802 35158
10422 -152540 259078 116274 115025 96297 -24743 -289237 -33537 -37130 -131335 382533 -15547
10410 235968 -108398 92298 -46966 81832 36402 -63778 -201419 107261 -301531 38144 -4632
10398 -112124 2045 185886 -133299 -72287 7609 194790 230148 293928 134697 112194 -182123
10386 151314 116043 246890 -166234 99800 153540 205782 117655 164656 140833 403895 368657
10375 368657 112753 124275 -12458 283924 328643 140684 435431 350581 163404 530564
10365 530564 535007 168961 232804 -235 -66775 113365 180943 233343 580555 109560 205683
10354 205683 279900 171673 451915 476123 705568 545055 479731 504209 287339 395034
10344 395034 184817 683260 265326 255524 466184 187327 142307 -121014 -140746 156653
10333 20156 73419 77430 -133772 -177428 -29601 251918 57650 195239 -18638 281793 92901
10321 241371 147464 307976 -43015 13976 355880 106945 -94132 211743 -48487 132645
10310 -255338 -179713 64670 173893 13154 -221227 259662 79881 117606 -159227 -178811 -76834
10298 273342 -15361 13280 -43152 -12688 -19286 22140 -283936 -134316 -36963 237536 372609
10287 372609 -186333 -233903 -213160 -88039 -95585 -163732 213947 -260711 -168000 77834 -408097
10275 -2335 -159942 177314 -367580 -181399 -59796 13252 -968 302016 -102880 124731 -81605
10263 26128 -79580 41491 254201 547314 548147 232250 1263 268233 238697 126739 70181
10252 70181 238747 177449 -54335 233658 -59455 114921 -270463 -136253 138476 -17043
10241 388025 -292112 -134615 -165584 -104755 396868 119422 101985 -137402 60671 -43917
10230 36458 109507 -163472 -34321 -51483 156422 103441 -95347 134009 -189648 59372 -44701
10218 -219184 -204616 235168 -206031 266098 116491 91111 -47483 -36226 -151359 91584
10207 -261408 -5939 -77636 -232246 -51253 243589 177086 -492493 69921 81450 -298536 -222370
10196 -222370 49111 106214 -161928 -260808 -390537 -125968 -242956 -47276 -45855 -132481 178473
10184 -149783 9754 119624 8177 -116153 -386511 -257975 -261246 -234209 -37526 -181640 93048
10172 -32672 -60994 198908 107506 -75636 -128948 -180669 155599 31550 -162446 113052 16701
10160 -84607 411117 81997 -61877 -121783 -154481 62646 -270548 38869 -75852 220603 -135070
10148 53032 -395212 -114095 175858 -161425 -166767 409 -65262 -146908 -586818 -98753 -83950
10137 -83950 -62687 -19649 110372 1120 -128508 -30450 -29786 -287729 -161894 -154419 185286
10125 -314186 610 -71358 31551 293667 -232365 64069 -37268 147187 -71461 -141014 -122553
10114 -122553 -133405 -369101 -126757 -408098 -206041 7850 907 -58965 194272 -52053 44531
10102 -30543 -204040 208691 -236696 -47135 12800 -47602 -509858 -119214 184395 -173368
10091 -291116 -40643 -640 16925 -63233 -437810 -3026 -424404 -149297 -10728 24760 -53818
10079 39163 173785 -182091 -201216 -73316 24657 123274 34278 -90987 348859 184367 30215
10067 -78925 -91757 -124130 -34359 -27875 -42406 99945 -19045 -79810 -50214 25338 -255819 -171841
10055 -171841 23973 129059 -145862 -104014 -189490 -118117 14958 -151861 -60096 -10822 -163142
10044 -163142 124159 -49364 -442219 -8648 -479210 -301288 125036 -289538 -202541 -106444
10034 -106444 39993 -26463 108855 -162815 -239091 -106435 46860 -109702 119658 156208
10024 156208 -327126 109504 -123774 -270558 -30441 -7362 -355145 -111214 9020 -39349 53874
10012 -105342 -241228 -160399 57556 -284171 29566 -46956 401777 90414 -32540 76923 -8180
10000 5958 -125332 -208118 -105700 -52425 56662 -207140 59821 -52423 -356284 -540294 45487
9988 143574 -187096 -119735 -59060 -458627 -146072 157463 270335 -107010 -126929 373641
9977 326261 -196926 -465559 -195068 18593 -86908 -30056 61743 103483 -74702 72309 244779
9966 244779 -15372 -280391 -48722 94515 -113992 -294063 11205 74693 -75362 81293 -20580
9954 -73154 -121396 102203 -1891 -37078 -259887 -239533 -425422 -26472 -315371 -349446 -9434
9942 36741 -124395 -149973 56459 -213963 -117358 141668 69558 -243443 -171619 -201308 361897
9930 31646 -289689 70551 -73837 -17128 -16434 -96418 334714 -43807 208882 119743 -225262
9918 246973 -247238 -62768 -203256 181683 -137968 -77228 -237833 -106985 1298 -372812
9907 -86974 17929 -297897 18800 248451 -97729 -316165 -271869 3503 -222813 -185505 -118846
9896 -118846 -300466 -171698 -135230 -49024 -215285 -84202 136218 65522 95730 -65826 62770
9884 -58884 4571 9555 -63476 -22913 115855 8764 -379966 61274 -148127 83444 -401499 127135
9871 61497 184814 24571 249834 -76338 -160090 107626 -261511 6799 -63895 -263803 -186217
9860 -186217 111981 -28404 -75828 -175992 165538 210580 198003 -363853 62202 54106 -178221
9848 -372511 12894 114633 -280996 -190839 -55022 -213773 -189874 -125006 -110196 -35369 -278857
9837 -278857 -56038 135730 -52338 -360367 33007 65442 -334100 -2395 47216 -220441 -385103
9826 -385103 -489915 -55123 34580 63446 -57306 229888 12665 -145518 407512 1989 -188344
9814 -211179 -136842 -85839 -359352 87021 -12620 -463855 -11670 96199 -292816 217482 58308
9802 -99641 -51979 -67858 -379269 135744 184800 -41264 20038 -383659 -279700 73501 1108
9790 -55226 -72481 284803 -81067 -145116 -213968 -88439 -139216 16998 -48076 -49333 -203348 -142960
9778 -142960 38104 30124 49534 -96257 -47815 -128554 -107601 121948 -196458 -44569 -299222
9767 -299222 -234711 96699 -137748 243548 -51132 -211229 -188877 30424 -5247 -104381 5850
9755 97761 -332620 -323224 -80071 -285028 -50541 -226731 -147293 -221165 -133276 -324029 72714
9743 -30172 87390 83503 -457639 17822 -315102 214134 -124146 -84066 -276139 -7028 -119171
9732 -119171 -304925 -22570 173973 202644 -25690 18938 290704 -50030 -29051 -101487 65097
9720 -178780 180926 -69207 10327 199731 -160101 -140630 64283 -178835 -27973 168115 22265
9708 123620 -15780 65022 -163927 -65628 -161111 -79777 7738 -179270 -98507 110970 51677
9696 -187362 -167148 -90846 -11360 24193 -29096 -271237 227702 -42839 -236677 208097 -135706
9684 44371 86851 -224377 -243165 -141368 48946 -197441 -84462 -256795 -326674 18559 17046
9673 17046 -122445 -109602 121209 322958 275721 59736 -24908 -244803 -395152 -431491 -117729
9661 128769 -81419 15410 -234936 402052 180402 354988 -323787 -265867 56042 -157649
9650 -147431 156574 -309705 200693 -531582 -74461 -50592 -133329 385558 -62336 -308031
9640 -308031 72379 33134 55415 97149 126013 82102 -161934 157423 81390 19192 -109316
9628 -222539 12990 141318 -435759 34389 -53754 224764 86211 -196485 -226600 -5191 64572
9616 7171 127023 -86588 -113846 -33124 -186992 -123449 65271 40420 85120 -249881 -106304
9604 -185947 -90916 -148023 200077 108399 -414404 27733 -241684 -281610 48167 98594 -145948
9592 -205393 -52176 -103000 -259826 -194342 -130270 128020 -25519 299830 -9195 224338 26199
9580 -227717 -156859 -27196 18150 298034 -119455 -14610 -118136 200192 -217550 -140391 332926
9568 -130686 36313 -511301 24235 -84879 -154165 18397 -561865 108025 132545 -145452 -130420
9557 -130420 -173833 -118660 -475010 -104480 -152439 -91788 -27771 231226 -247832 -127963 -90042
9546 -90042 -141832 -186812 -144856 -311895 -8523 -109487 -29646 177232 174783 -350300 64555
9534 -174833 -434509 60974 216705 80544 -100672 -190519 -222600 -560389 7325 267852 -76161
9522 -131109 15782 331948 152298 -191337 -141542 -280030 58311 -129509 29792 -463724
9511 52335 12787 -144651 184519 -166157 50770 -272304 -99667 -93420 105187 -92247 48242
9499 52943 -328994 -5220 68919 -460188 -59913 -16968 -134686 471813 37169 68194 30941
9487 -54108 116502 109334 -58186 -286237 -197448 -18782 4230 -86437 79125 -18946 -73085 -93501
9475 -93501 -279067 -125683 -53147 120770 -263201 -110132 -169754 -101436 160137 -147612
9464 -11855 95345 115228 -242644 -62945 81164 -16445 -175095 10471 91455 -320491 -136704
9452 -273590 -81997 -52086 206301 47438 -105553 -86 -16743 -49639 160506 -113063 -42269
9440 -123078 26693 -21574 213857 127150 -182806 -37118 -123659 -189170 -313686 -56163 -32793
9429 -32793 -252756 -47757 -51030 201179 159607 -38247 302804 180599 -425181 -38924 -57779
9418 -57779 116157 73155 -23715 -256463 -66300 -354623 -157967 -112031 -70534 229939 -290692
9406 -85042 -422223 -56694 160808 -196100 -399199 166077 -177443 -166042 -34099 -24820 -153007
9395 -153007 -14898 106954 -144562 90373 -182296 136652 -4093 25752 415 159734 85575
9384 85575 60307 -114628 -47309 -19676 4160 -143721 -229670 249265 -192542 -189259 -418085
9373 -418085 -27151 -348319 58021 -53623 157803 -188306 165048 -193688 80480 -227566
9362 -146423 116939 37221 387194 238023 -133872 -222973 -481609 67910 -340695 72123
9351 7115 -116953 -79116 -404658 -197068 -214898 -94817 -187502 -227599 -385362 -223764 115092
9339 -126648 -102322 5939 15564 -161943 -401110 18825 44673 -104797 44112 297159 -100785
9327 152647 -325306 42446 -282624 -58379 46420 20400 194069 162010 181869 101415 -103229
9315 229148 15191 -97818 -425377 -241433 -184341 -208246 82797 10060 127645 -14728 -175281
9304 -175281 200416 -163684 190236 32251 111606 18467 -66546 91788 -174926 112251 -207895
9292 -155984 -358337 -164247 -346360 -185346 33159 -55711 83646 7012 275025 -40 -107190
9281 -107190 171631 71844 169749 -268562 -274401 23456 -154006 94246 -1994 65638 -468317
9269 -67915 -171919 -279867 -134786 23062 44954 -224893 -280212 -245684 -243574 -354402 -84788
9257 -124205 93316 77797 -43138 -21289 178701 -60262 -61031 120829 -13609 -113124 -228980
9246 -228980 -130700 -105691 76674 268445 -47072 -93254 130450 5443 -50921 -30439 145805
9234 -114483 -94470 62171 -104169 -181496 135163 -170756 -230577 -193539 20441 97268 -67148
9222 213336 -141143 61342 37305 -115275 -304127 -285931 245122 37561 -91493 262097 -28545
9210 -201802 69276 6143 88315 -152251 187459 -612211 -386815 48390 18435 -73476 -47237
9199 -47237 -457095 -32074 -128387 -268855 -57663 6924 -288837 130617 743 125824 -260827
9187 -219856 35393 -119943 -106172 222697 -40193 -30959 165123 -52926 -110038 404833 -183276
9175 -590969 128966 -53323 92843 141040 36555 -16522 -304438 -88838 -257773 -12417 12879
9163 105978 -212890 12746 35059 -127896 -373462 180579 -111982 -446862 294793 -360900
9152 -292126 -32636 -296013 -35132 -278516 -456784 220671 259326 174759 133639 57803 -283828
9140 143614 213535 -179705 -155066 36039 -208463 68265 231080 -221589 177520 -199950
9129 -111594 -196215 -182824 191973 -141617 -34123 -60305 -110877 -251172 -39958 80125 143864
9118 143864 219329 -145243 -281228 -247239 -154811 -290246 -168504 -43635 -33232 -32521 -180330
9107 -180330 -13357 -95492 16494 -96489 185075 118030 -97986 -22858 -136161 157013 102645
9096 102645 266938 52577 -43900 -184899 -26730 168793 -100106 -235801 -117124 128678
9085 49385 172753 -289555 -271572 -83408 95126 73854 16208 10870 -66439 -351103 237557
9073 221903 -21781 -123499 -129863 197551 -78081 -30827 -133518 -485210 165398 -63049 -124965
9062 -124965 -32900 71350 -67094 -57065 -424247 -158585 30055 193767 -49022 196702 -171561
9050 -39450 118157 -202066 182220 -22992 89301 -118864 -408214 -167397 1370 136422 -122108
9038 49976 -140265 -160144 85727 -21836 -133076 -218195 -173444 -86762 -151381 -60077 -81980
9027 -81980 -32800 -101892 -185206 14371 -83837 -309451 -54001 -230341 67449 37726 -133947
9015 -74102 -219894 51231 -66223 -136491 27702 -187530 -96906 -210293 4514 55171 -28920
9003 -226348 -231094 46360 -24838 -91827 191248 126885 -18751 -33487 -124131 182122 -347368
8991 218969 -37489 116205 -57383 250258 -34309 -215711 119220 142209 4718 166673 -133475
8979 -11487 -128942 -69169 -116187 37223 -121181 132422 293878 88146 -260926 283703 374518
8968 374518 337769 -65177 -114722 -75374 -330874 -100014 55253 272533 -42896 272169 244286
8957 244286 116183 -135425 -106391 -56855 117723 40255 78969 -24662 39642 291670 39362
8945 64652 326301 241056 54255 -128365 322124 194081 292023 44598 54443 286825 299232
8934 299232 158094 433895 73472 -133109 297010 348027 400725 346771 833372 1449231
8924 1449231 2728073 5087776 14398627 16096318 5160592 1912792 698490 320872 186680
8915 186680 10970 201060 -110593 -31223 61355 -76857 344962 594660 160485 190619 157682
8904 157682 -192670 -101896 -15736 -167031 94726 234311 -93393 -108531 87197 -133841 185033
8892 -79311 293955 147353 -32175 265941 -310656 -227235 -217823 -38683 -189506 -148130 -429461
8881 -429461 69835 -57575 100906 144958 119714 -306586 207066 -172201 122069 -246874
8870 -175754 -74544 -420927 -105878 -93186 158721 102423 75141 115605 -77020 -223876 -47446
8858 -32566 -215938 -130866 54546 106103 285093 81420 -160830 -118947 -37772 24705 399965
8847 399965 -23861 -160498 -74784 -210334 107054 -68903 92135 -92792 46278 -342616 -6470
8835 192103 -175429 35164 44341 86473 51027 104497 217661 -109754 -190177 42408 80798
8824 80798 67583 -9943 90095 56873 -200634 -8000 -190641 189004 29558 -63439 186948
8812 -226130 337729 -202708 -333779 -128801 157202 375880 -16771 -73487 -9876 -79673 -69586
8801 -69586 -56511 -162816 -204633 -177217 131666 173307 38349 85984 -278575 -157016 -179424
8790 -179424 -22927 269911 245098 52015 -11082 -76070 299576 -179145 -381445 -190449 -170860
8779 -170860 92063 46770 -219403 -250381 -43557 -70568 -204325 -77029 -91339 49382 29822
8768 29822 228781 -156361 -243851 -286688 395361 -180969 -161494 254210 137863 2458 436878
8757 436878 43056 -147903 77925 -23312 45884 -23202 -265495 -83618 -9284 -70885 48678
8745 -153576 372761 -9965 -343123 235434 97232 -569070 -351834 -5508 -191115 -270202 141516
8733 156372 113891 346710 -100286 246152 121415 -96277 2357 7355 -355190 -31559 20805
8721 -24028 32175 14521 -265236 -165264 -21593 22391 31109 14628 -365649 48270 222223
8710 222223 37434 -102607 -146661 -176044 246499 -133576 7741 -32460 -76104 116214 -289105
8698 -151055 -173105 30582 -14413 -233737 46906 -9540 -220543 -31859 15685 -140591 115690
8686 27635 458059 243367 283264 -192008 -313670 -381004 199478 -191699 -61538 -3263 -104767
8675 -104767 9348 84274 -102726 -204990 -101090 -290515 212651 10024 -269084 -93557 -223135
8664 -223135 -182954 -104020 -124979 124859 -31347 -140737 16393 -408975 -96816 -202613 115357
8652 -206485 -3452 111234 -97293 -92652 -91317 207100 165246 -89065 -214403 263714 106736
8640 -169345 -62642 -91732 10873 104864 -71499 74162 -160061 -69398 -255626 -188161 -173724
8629 -173724 84042 -69077 -120390 -149487 -1757 1826 -155609 -219315 -503316 240224 34842
8617 -227569 -34564 -41043 -300136 -74867 21477 299357 151078 192804 -56141 -26347 -10638
8605 5410 -111479 -99094 -301157 -43232 -47240 -51061 -60960 232785 -100355 137928 -347117
8593 -372864 72569 -217772 195557 106328 -42262 145214 73112 -11801 9926 -114056 -72613
8582 -72613 -78065 6368 -211612 -161523 -232990 -80767 -55279 -51941 -73203 -283894 166117 -97658
8569 72697 -11244 371981 85535 -139115 -153165 -13410 158040 182062 -45176 46304 -256726
8557 190184 -197049 -324021 -217497 -113684 -38935 55744 -211641 -21301 164870 20349
8546 155931 -85538 -50561 -12316 -154109 -129044 175981 -237333 -122007 -166009 -296114 119437
8534 26729 -228375 -90993 -13569 215957 32668 -300541 -57062 -476066 -371674 -116883 144326
8522 172871 -103840 -11233 -170545 53967 351659 73858 -178730 -57554 -136777 -288950 -60264
8510 -38896 63931 -64650 238409 -17251 -196611 -186643 -29943 -102449 -157674 -73959 92156 39659
8497 -13740 -153831 -56284 191960 -8559 -114282 47045 -168243 98969 -318299 -148669 -336744
8486 -336744 66300 -8229 -303585 159443 -317971 38120 23612 -8858 14418 -343782 160168
8474 105354 -268363 477952 -303588 -115190 -37576 -80944 -232678 21296 -187189 -284200
8464 -284200 165154 55147 -128883 -343511 -122744 143742 -447909 -4609 56419 4566 -9315
8452 -61104 -172542 320683 -167578 -22976 -50755 -18311 -160173 -155788 90842 107939 -186674
8440 -192655 399477 65153 70368 -181173 242864 111081 81814 -196991 -36635 46046 -76666
8428 158990 156240 -76590 270630 -73351 -77152 7205 144463 -184933 -30630 192330 -342939
8416 -428518 -267123 94979 -167594 -59379 -293225 -71348 270749 225386 -159656 132045
8405 -4759 51290 -16173 -114543 4763 44657 -157008 -224877 -171680 -68166 159852 -12111 105122
8392 28404 90921 -236898 -252290 191301 33923 -97235 -23152 50828 -355560 -222713 -62364
8380 -212200 68221 -89401 -145843 -284205 -242737 329154 146021 -18070 -115096 59150 32453
8369 32453 -88359 -295412 -203303 76038 105874 41026 242881 -68788 -146172 -172392 -282065
8358 -282065 -138514 -317503 14268 -208040 15566 5031 -126834 -306496 -4770 -83785 146827
8346 -114523 -220606 -288423 -252859 517997 192173 39156 215336 -26170 -224927 -121186
8336 -121186 52729 7380 -184369 -49260 -143485 212040 109738 -50757 -355450 -26538 -77082
8325 -77082 -2920 -118764 54342 -166321 -11317 -48742 -50988 49635 -113596 -141035 -63785 81306
8312 -241857 180039 -375863 277498 209308 95178 -99245 -310105 -309234 95895 -306814 206709
8300 284981 -157720 -76056 -189207 -111607 67037 55516 -198592 46215 -75782 -102385 -98342
8289 -98342 -84267 -182890 161638 -289586 159582 18797 30707 -24202 167252 -78357 26837
8277 -295888 -207927 22823 -35063 -229189 5334 -193457 -153252 -133179 153887 -224873 26135
8265 69178 68369 -260129 -6515 -7722 -181463 -153399 -244748 93666 -240615 -176366 22284 -127845
8252 -288996 -134589 -145571 -23082 84573 26851 190763 -131172 -131117 -5064 99267 -141415 -168214
8240 -168214 42419 -236739 197296 13256 -165298 77565 -166837 15540 -64354 189836 17665
8228 -224671 99555 -137024 -27366 80846 -150391 -203866 -250131 193933 54389 -206271 294493
8216 -215805 -64937 17926 -136260 -96398 -98069 -146139 46985 -5934 -190409 11848 -55699 -45547
8204 -45547 -262483 110061 -7511 221971 156552 -79386 48581 147619 210644 -231686 -222285
8193 -222285 88473 -61240 173068 -207386 -75762 -357243 52157 -395916 -53322 -230713 -60019
8181 126575 -122378 -101453 293412 297779 -325925 -76248 -95136 -49569 -21603 156487 76701
8169 -237385 -104048 39683 208071 211996 -170824 -328473 -360718 -214675 -258895 -229516 -145708
8158 -145708 -312677 -97805 -6285 -248305 7812 57232 40016 109483 -317621 91843 -3500 -40551
8146 -40551 -212643 -172033 47288 -348978 -144972 149071 5770 86378 224614 -179071 79602
8134 -4503 150020 -482978 -335426 336960 -166749 -358933 -310641 124767 70508 -40336 194260
8122 -146719 -343619 12860 19447 126246 -7714 -14709 48448 208959 45542 -24914 -810 162054
8109 -145872 10427 -149881 88407 19385 50335 -185928 247540 91262 -43943 -248714 -228044
8098 -228044 201055 -113298 29155 130990 -83403 -57859 -367806 -138721 -274781 -289663
8088 -289663 -188329 -6215 -19776 -119098 243950 56915 -125111 -64767 -111071 -103478 -242115
8077 -242115 -424289 -456857 -153309 -430828 133557 -164532 95076 264902 186983 53773
8066 212445 -247441 -111047 118104 -126173 107841 -173790 27556 -65366 180481 83372
8055 239719 2859 -110065 94396 42941 104230 -167170 310397 -80569 -123311 -56747 -32496
8044 -32496 75149 -32441 -111167 -39481 -108673 154450 -200202 76740 -207313 -61868 -88131
8033 -88131 -167569 -123337 113369 -16417 -136397 47254 -271143 -77170 49587 -4429 56864
8021 276061 -85022 226440 36586 -206445 46343 -170601 -56458 -139495 -151123 -187258 -140101
8010 -140101 68800 -1714 16080 21751 -45088 -116590 10194 -34853 -254501 -328269 95787 -60750
7997 208363 -100654 138425 10050 340106 -24850 86387 -7563 38875 78978 -284329 -4216
7985 -34216 113774 76596 -19403 -430160 136894 129322 38028 -69517 -143884 76371 -503448
7973 -179644 48857 34304 -178104 -19917 18832 226687 48131 -169916 -103973 -55655 -178110
7962 -178110 69151 -262197 37937 -60335 29090 -29579 90725 -56446 223941 172255 -61916
7950 -109386 -87129 -71192 -121582 -89647 127518 -27623 -61181 -252416 -281336 130782 -34136
7938 23601 81992 54551 -209234 -16332 -98229 311162 -190869 -340154 156979 -222267 8093
7926 -207502 -322778 158039 -129170 -135478 -132000 124423 73790 117396 250304 148526 -195061
7914 -22783 -33237 201771 -125123 42274 169703 -71697 -21155 343399 107594 -125071 -7757
7902 68580 220205 -48436 -130916 -43692 -203249 -40321 219493 11461 70920 -200184 -324330
7891 -324330 133645 -96420 -30486 -89856 -130274 -36467 -294695 -355937 -30379 -150042 113390
7879 -10505 105946 -102809 138572 127979 97383 17417 -68500 -342826 34428 -279791 -203938
7868 -203938 -54178 -130208 13321 -115252 115749 -192816 -95216 -101509 -101333 43778 121296 39056
7855 -120446 35140 -158855 228127 30638 -183872 -38457 -25518 -61302 -20681 -377144 124884
7843 -359022 -137075 11860 -52650 102573 -318773 120042 -210998 -358844 -324148 16533
7832 -8928 99278 -163848 5991 1813 34103 90410 -221779 -129849 35634 -255906 -154305 -86832
7820 -86832 990 -74655 -7537 -90173 -171448 42808 -89435 172085 -200546 -46818 -13487 17558
7807 76118 82894 86606 -273602 -115522 -177911 -250817 -40454 -397206 -269614 -297505 92697
7795 68696 -19076 -220677 -191866 -51067 -8452 -20862 -162286 -64396 -39079 210445 -242237
7783 41497 -160731 -194470 -38123 -276653 -228456 -27100 -203764 -281 -190671 21966 -541493
7771 94268 4293 -161118 -282011 164447 -62340 -172990 2241 -14044 31182 -120252 -237360
7760 -237360 -77872 -104284 -261405 -88663 61787 35714 5000 -58896 -14959 74558 -399404
7748 132563 -154440 73779 302545 -140305 173662 202317 -64037 61255 138564 -55714 -31438
7737 -31438 -21489 -233948 81411 76955 -31677 209904 -279572 -2073 -209442 36274 -98589 8136
7724 38551 68069 21086 -88485 -214280 299772 -32928 18613 -61046 -60679 84784 -409321 -137679
7711 -9232 52149 -38814 -220008 36440 -10690 -312812 176501 -83151 110520 257686 -73101
7699 60553 -92370 -44893 115930 -56461 -396039 101711 -100319 144873 -232945 115803
7688 -263351 -200277 -417155 176260 61843 24595 -46789 -127003 250907 441587 -170176 295032
7676 -73588 99882 -222917 -191280 42942 -143080 122276 131626 -120609 119408 248155 158196
7665 158196 224174 -228373 82470 -88707 79200 -355614 -55967 -111700 -76980 77760 94061
7654 94061 -96608 328971 -43288 -89830 173769 345654 -67115 22266 -49852 -82468 -18049
7642 -317408 -352233 246007 32754 -12892 57652 43366 138877 -178425 -339360 -293457 89288
7630 48575 -70444 -268653 -91545 -87362 -13783 -144399 33970 3930 177104 -162707 -69156
7618 -167995 -53254 -104517 -333308 -212796 -76546 -3862 70334 -48752 115080 -109038 -2667
7606 55135 149193 -68616 -229305 -9752 -85801 52044 230742 -99426 173479 233267 32606
7594 207560 -312583 202313 129113 196202 12277 -159450 -139612 -64993 58012 -19148 79473
7582 -27589 -257631 -162201 -100602 172161 -137920 175664 294863 -34851 7275 -191964 -306890
7571 -306890 5 31 84512 -148380 125234 61313 -91733 -238784 -257197 -59521 -105661 -63613
7559 -63613 -68896 89358 81203 -86666 347179 -276715 106566 -55724 65988 234041 -135366
7547 30617 -347864 33585 32738 -32859 122253 176972 -119564 -252249 -324201 321469 -112053
7535 -73787 197544 310075 161644 -199021 -105734 -117428 270474 -66582 291553 55231 8128
7523 -152097 -16304 -113924 -62449 78195 110424 -20578 37408 312789 114671 -103718 -390668
7512 -390668 519333 -102256 265024 -254452 -261004 -146180 118824 -148223 -60793 -96258
7502 -96258 78396 -8125 65065 -244197 9169 200387 31177 48762 40255 -8791 92855 45359
7489 26467 91872 -53341 -115208 -21379 -75449 -345090 9994 -83301 313511 112094 -242676
7477 -136690 -99312 -370724 -6685 50921 -62334 111811 86186 -52706 -210741 -285853 -132796
7465 -85826 -146047 181641 24685 79537 -476928 6426 -58525 -518398 -34677 -3220 -185706
7454 -185706 122268 -143029 129602 -52777 -5356 -36350 -114148 -79372 40623 302114 9547
7442 142844 144901 91397 -221500 4738 195568 -125137 -89974 -174577 -170830 -68513 -282210
7431 -282210 112843 -168073 189065 46491 35425 -84528 -189879 100483 245689 -111072
7420 -369930 -128651 -204392 -162502 -425896 -98131 -73716 -158269 -64883 -160657 -164198 137774
7408 85764 -2462 -258218 -150314 89235 6731 5374 267190 35798 -101336 -107804 -1230 -221663
7396 -221663 27545 -216147 67370 138969 314456 -264665 -29447 108044 51929 -345654 -390044
7385 -390044 261878 88654 -175296 -117570 173475 -156495 -93719 14158 201740 -224643
7374 59112 127864 -242306 -145514 -154288 -5827 -221793 -34166 43217 93511 130171 199433 -115681
7361 56680 -105158 -14972 161656 -272089 -117880 -132218 -98510 91253 -117088 6444 -106459
7349 15500 -162981 -243220 -12236 60165 -142402 -83848 -26860 167247 -171668 -72391 -150241
7338 -150241 -74639 197396 23060 -346213 -84719 -174584 16362 33960 229118 -86125 104176
7326 -42525 -180199 -262914 346513 287938 -67630 -81364 -146198 -279487 348607 -197233 -125400
7315 -125400 4902 -127064 -135608 52191 -55739 91337 -135605 100366 -103292 84513 68640
7304 68640 -272181 202132 87545 148031 -115778 -35177 -326048 304646 114831 -20162 44904
7292 -42068 -23961 -167073 54290 -264940 191972 82252 -124334 224959 -189815 -295058
7282 -295058 55965 40156 -237225 -256747 -92074 -278359 57242 64473 -12552 103036 -479417
7270 103352 -72034 -155412 30457 269831 -42412 89790 -106993 -208398 -97952 94085 -260916
7258 -40605 -78756 -80667 -990 106111 -56502 -116918 134756 123408 -23839 92612 -91953 119982
7245 45733 193058 -12660 219412 8415 -70460 -114101 -15642 -144066 -62340 156944 68359
7233 166118 -122680 -107034 172405 -12931 -40451 -259964 -43690 -430005 153738 -338287
7222 99437 346503 -217638 -62325 162623 -268734 -155134 15679 -144321 106056 361983
7212 361983 132280 57955 -208304 145025 93777 249696 -1838 -59884 -4305 -85445 -338978
7201 -338978 78505 42248 -267676 289081 123372 -34087 -292311 -103201 253525 -34949
7190 325083 -108313 -383037 -110208 235054 -118146 -292890 -339554 25026 -130546 -133249
7180 -133249 -148644 -29171 68027 -216771 -127309 22034 -71801 -300959 -50423 -15965 -123645
7169 -123645 3175 -6474 -60365 247023 416209 -89070 -121170 -87984 -17076 35639 -56504 85590
7156 -22028 -15143 297 42444 116583 -68693 -55886 -204042 23347 215078 178105 174880 -250699
7143 10851 73170 -154864 111983 81072 -24808 173624 45515 16231 222891 -301619 17175
7131 -65133 -34431 -22474 162592 87740 28219 -244003 139579 -299800 -173291 -22146 -238467
7120 -238467 173769 241639 46975 117938 1516 100535 214260 -109315 49050 209826 -190469
7108 302049 -111700 -236586 54421 6646 25355 1756 -163116 -243945 15103 -130887 934 16325
7096 16325 -5143 55450 -197810 102749 -241912 36088 -120378 -170277 98969 -478325 110499
7084 -167252 -121054 282346 -258085 30784 -24969 107916 212246 -422777 -20272 179503
7073 19762 -311906 168195 -95257 -244330 -53889 -136363 -89276 70367 1875 -2588 8527 228469
7061 228469 -406919 -227008 38689 7694 -90840 -21541 258489 138315 198014 -47656 305411
7049 5302 268372 281077 52049 44781 183485 -234315 -153394 276800 235885 -552926 182000
7037 218861 85393 -78988 74412 -215 245658 15387 165464 -71037 167067 -166650 -51321
7025 37543 -194063 161140 -125049 -157563 69565 -320872 187989 144588 90609 15970 -155217
7013 -328860 120622 353953 -151249 77124 -169782 -208642 106799 27836 225623 -145873
7002 92779 44853 -219254 210973 -92190 -53890 -6213 -49198 -25503 -157138 301954 15272
6990 263599 -149224 73526 278200 -123257 -278859 110936 -124623 -10025 51999 -56851
6979 -88248 -39245 -113934 -40683 290017 -194220 -93054 128285 -259086 -86193 -107116 116526
6967 3582 -9422 -20880 -27995 141151 -163361 321263 232194 -112731 126496 -5653 -199013
6956 -199013 -328837 -179132 -236375 33579 -74615 -115276 -15493 173230 -71479 62660 -92768
6944 108845 -316493 -219453 -52532 -135658 -69429 56873 -17485 106444 -362977 1614 -82201
6932 119974 -6034 -82163 22379 -448387 -149396 200149 -122072 -179422 211390 91887 49313
6921 49313 -33231 -133186 112281 -203183 -19671 19643 -199713 -32914 -141558 -122242 31412
6909 411818 -47481 -73730 -393004 -17419 -29568 -198593 -360447 -136312 59416 261777 158861
6898 158861 72454 -14363 111968 203366 -284 -250142 -100454 144938 -64259 34435 -161235
6886 -72890 89056 -228651 261554 -98345 -11664 -453463 30375 469364 -191682 211791 -9925
6874 -115618 57956 -225611 -166982 -15255 10593 99268 65723 -44523 -120679 -75782 -67009 -16838
6861 17164 -123979 147305 -104473 119669 -169839 -454164 -92519 -147790 -385139 249226
6850 10539 -124689 85132 94910 -108516 -241264 -19372 -146793 55385 47980 -172919 -58926
6838 -225414 -181617 37631 -10021 73125 189350 128172 145790 -121461 -5415 -80066 33922
6826 80310 -6294 -22848 206872 19988 -206761 149345 -129666 42470 48024 -86185 282624
6814 -39934 16571 -8673 146727 307859 -169414 -252896 -108221 -144366 50051 230805 -10845
6802 146571 -185178 80235 -166606 60110 -157112 -99636 272904 -96106 -247597 -74368 -371901
6791 -371901 -154263 -114374 -3999 -156389 -119509 81446 -262989 17519 185127 -81064 386568
6779 41388 -87825 -180152 157215 283414 -47771 93309 215156 -24963 155531 109188 162061
6768 162061 300036 -85558 -309953 -433409 -64184 41845 56402 -2580 -14743 258142 -234782
6756 233211 -387602 -173843 398596 -131904 -204070 -300646 168262 129257 -270395 222424
6745 217662 160612 222010 182557 79717 18888 372885 -155575 -110496 -148953 127885 -164034
6733 408245 -142862 163964 237220 -408081 -316437 -100047 207251 -137797 222998 -129611
6722 170276 105717 -167092 286461 -95392 127421 -88732 187994 -63901 -140363 45193 65408
6711 65408 -189150 -132602 -185715 -174954 -65493 -247759 -402525 -24754 -194181 228416 67519
6699 221046 -244705 -28452 270671 282280 77997 -111209 -151312 237262 21023 -38380 -297728
6688 -297728 62853 -24688 -59669 -217578 60456 -174833 -467600 -93897 84365 20130 13775
6677 13775 265657 -328463 -49474 110748 37342 -90005 117457 66516 193814 -64244 -373950
6666 -373950 -23042 141823 89776 302727 -71597 72042 -138135 -46584 -243908 -38530 3240
6654 -180793 -113893 31745 -189934 53621 -178652 -106732 93123 -118595 41706 -46467 -100075
6643 -100075 -260806 -245720 -172615 109408 486851 167484 -628981 -90573 -63704 206313
6632 -289956 247195 279597 160920 75748 162435 152232 -330103 -171348 -342210 173401
6621 27733 6316 170167 -181321 69988 172731 133025 139871 -412155 -9933 198550 128973
6610 128973 -159438 -28687 -203439 4080 141439 -167009 -57030 -25280 -110957 50497 113370
6599 113370 54882 -21821 -5129 -252291 384508 -231850 -120446 33829 167214 -57012 87941
6587 4505 37819 -175756 402219 83341 -17756 -61232 117014 214098 74443 162095 -116989
6575 -59101 22997 65727 66545 30156 -56813 -104859 -182487 -189887 -167242 -245228 35789 75682
6563 75682 72793 -87102 -188238 73653 -352062 -12430 57498 -9569 112523 -135389 -68055
6552 -68055 -245803 -359613 -206004 110160 -122920 -323641 -199716 -154718 71613 398467
6542 398467 -22148 49246 -160357 169830 123630 -45685 -37324 -270720 -254947 -132063 170151
6530 45230 -87489 -3997 66205 -275779 -224067 43762 73543 244066 -44119 -103654 -213945
6519 -213945 203898 -257441 35734 62396 6655 -196394 253235 115029 -147906 -115923 -41889
6507 -352096 124854 -107216 -117526 50956 277863 19196 -143139 -52568 89379 -260333 12701
6495 -40739 -289807 335021 228228 -114044 -249940 -275407 4264 74697 82557 -86768 -151476
6484 -151476 -124389 123514 -399999 -292269 39363 -116511 9085 190501 51610 92905 120645
6473 120645 -97005 -64476 297482 -37276 57272 230620 62965 61948 185088 -222170 -190329
6462 -190329 -263209 64699 487125 -193427 -348130 206190 -74932 -224642 -100724 87973
6451 -208307 -283237 -209637 19680 -78567 -216793 122421 -409544 -2595 95306 -87235 -115499
6440 -115499 -178604 -155125 109064 44912 -114514 7004 227157 2915 -163338 -41207 221563
6428 -96370 65270 361722 43919 -31990 -168617 -105697 -174562 -176856 -25884 76011 -121193
6416 8807 -111593 65163 -148664 93927 114237 -29783 -177380 -453484 -316595 182108 -137300
6404 283961 -151906 337300 105174 389096 170324 -65130 38106 55969 -148012 68028
6393 -251025 -182671 19855 65064 192957 364348 2828 -372804 -290238 -118352 96480 -64444
6381 -14342 40819 -477751 -191605 6677 207117 -12912 24060 88865 316930 53994 10335
6369 151535 -118126 -361346 -141103 55782 -298211 -333372 -37399 251174 -542142 -197895
6358 328605 -144254 -25412 19686 40844 68553 17025 75386 190708 388807 -30711 -87998
6347 -87998 34305 73856 -75232 57880 151922 -82193 133368 97679 -301312 -255365 -103553
6335 -154546 142920 55086 -90762 -57979 74436 -200499 53485 7990 206729 -111164 -144765
6324 -144765 93738 258404 -25408 203701 7011 123222 -356804 -127606 128787 -103223
6313 -374714 233565 -185610 -131704 -212175 87012 -21009 -257017 163106 -87314 111607 -96417
6301 -25267 -373450 -120005 292676 6484 196807 -105852 -275533 -43338 -32490 369922 204100
6290 204100 62274 -129657 -7283 -22340 -119200 209586 122077 6677 -196011 177745 -237831
6278 107580 248005 -43482 -82414 -20363 132672 63121 28896 206919 368129 -177914 -81273
6266 -38568 23591 94919 -7225 -171786 42726 -151645 11056 146466 -22413 68670 175222
6255 175222 531904 -160112 264615 -130076 211161 -163569 -257503 -41964 -191947 125387
6244 -138055 -82280 3702 -242541 132336 -159265 -226613 -118058 -64434 -57049 -29095 -87449
6233 -87449 253950 -389459 -21677 -501797 49193 124803 -116140 -71525 336711 -64533 -135369
6222 -135369 -214443 -88802 -89161 -89138 -334967 -210997 -57976 135139 80782 165190 84224 9900
6209 -20693 -146095 47301 359537 213068 207543 -228818 57105 105224 -174375 -214038 6247
6197 123181 -33170 -159446 -123212 128295 -167796 429147 -43194 98293 -140824 29554 149387
6186 149387 247691 10669 264271 64105 -129221 -112503 -166045 -228213 29229 24228 -198459
6174 -21223 -274312 -287360 -53149 29645 -35511 -226306 -272540 -113198 254657 -295042 210851
6162 -89755 9290 -55913 167544 122385 201812 -63228 -25938 61961 -140897 -94917 26135 29442
6150 29442 -73532 -336652 -15290 117340 -39940 258453 9915 -280155 -12025 -19945 122431
6138 418 -12226 -100938 -103715 -212021 214735 -127702 -142946 8920 51577 -4563 -76644 84955
6125 -83402 4284 64903 -117583 -308874 -109032 164314 194590 -95632 -114900 -40605 -123836
6114 -123836 -45881 -96185 93847 -113965 -198770 -55068 -196207 -73405 1867 -35454 -86978
6103 -86978 -60267 -30982 -90201 21758 -219682 -60543 -273448 -20975 94810 24019 82325
6092 82325 70376 -97112 -21461 162188 -152600 -63024 -138700 129313 76640 -192094 -30402
6080 -152241 -6975 332040 195152 78193 11943 289703 -36205 -18594 52781 25586 -226801
6068 -119374 139036 119004 -65048 318139 191807 355230 53036 22218 22054 -206808 -47259
6056 126924 -120622 146694 125355 199701 68945 66933 -19464 -27398 177380 236306 -252315
6044 -118971 25771 76710 -75130 -297395 322347 26732 61262 11277 -247837 7551 -27813
6032 -199657 -1209 172160 -76599 -165244 -66307 -139757 35268 132945 63996 -77096 26146 89145
6020 89145 -274679 -214056 89664 266820 -54237 64891 271493 -4131 -343819 -255779 -142823
6009 -142823 237705 -64995 322778 31346 -165115 -101406 148963 12023 -448998 234538
5998 -155570 -203927 64179 -207321 72683 -111357 217306 8229 -21092 54508 -115988 54978
5986 187868 100093 154613 -19552 138304 145775 -136750 -95115 -91162 -109566 209768 118946
5975 118946 -93458 85406 9013 187094 -102653 102995 182860 247825 108226 -24204 -253847
5964 -253847 72501 -130034 -7128 -42397 66723 -122381 39997 200137 -194878 -44246 -312257
5953 -312257 -33627 -51615 -241686 -190723 223416 -276411 111980 -213993 -351876 -27659
5942 -68744 -471660 16456 196532 -131973 -150406 80057 450536 817 -180530 -151000 -294677
5931 -294677 -191745 -74733 9391 -75809 -7133 4884 -94137 151975 8873 -247053 -21774 16697
5918 -187833 -250366 13752 93490 -54701 -113139 274351 -67556 2534 -240707 176187 101475
5907 101475 102680 73682 -195863 44062 -63508 -231907 249560 -64549 80770 264617 -138758
5895 -120410 221225 460478 54075 -73290 -24611 79914 -150045 -146023 109250 -46681 116776
5883 170543 177820 189850 135796 -191103 -11430 -59679 -92532 -141297 131771 -121682 68441
5871 -70338 -173099 -16517 62299 -124921 29833 293017 -229929 -164549 -28951 356248 -128167
5859 159216 319198 -397532 -48605 206406 -182957 -113559 -37863 68133 49287 263450 222000
5848 222000 12180 166544 26301 -122023 243880 -225764 154215 56491 -109048 209431
5837 -168593 143590 144113 -74510 271832 -163690 -127622 -143179 137464 302180 -213284 122129
5825 176740 -144974 41442 31397 -83351 28397 -131287 127686 -76441 288526 308680 -189357
5813 -138263 -216834 113515 382523 -23967 158066 191994 -247216 265614 142914 -108669
5802 -25645 85057 26542 -60901 20647 -84666 -6683 23452 -87037 31443 -119731 -48107 -255012
5790 -255012 -291280 371891 142566 166510 -65479 -310318 -20913 -30292 17172 695076 -287717
5778 -218904 285936 -28434 173428 96769 344876 100696 -246186 -123624 151819 -313384
5767 123677 -70817 -185925 -44092 96972 -192694 100976 -114895 402660 38269 37647 73866
5756 73866 5955 145971 317092 155618 -124542 -72682 18161 162899 39720 97238 198693
5745 198693 -171332 -84221 73539 -42112 -90655 -120003 51700 108309 -13408 -76580 -105063
5734 -105063 -45994 68828 82694 -149982 258564 260269 142145 43650 179096 -122059 25774
5722 233346 61968 -332823 -18701 -92115 -299247 124761 -286564 -29812 179500 19348 -142469
5710 37552 60101 123766 -205514 -186910 -55932 -179407 -12308 94149 168363 186267 -167793
5698 -329421 -154056 466927 -321584 31492 -99589 -290468 -6949 -212997 21059 49648 184094
5687 184094 204947 -36714 104812 -126620 -62200 199444 -27267 -211235 62558 -162376 113227
5675 -220076 -45362 199996 -390410 -205509 -136600 85888 -70549 -63680 -1854 -155351 160564
5663 -56753 27761 79932 511741 -223804 -59291 1667 -172757 71964 -1082 81200 47721 -312322
5650 -96866 66688 -301097 -86755 -132392 -197997 24582 202135 21075 -298598 27489 -141885
5638 185459 -423149 -76093 86048 76019 237213 114496 -162696 319703 -224497 -5217 31249
5626 112249 -225369 295545 -215562 -117232 -288162 108982 -42860 66508 42263 -272203
5615 -221439 -370929 -133883 -114436 -115383 357005 -159809 -116455 111967 70126 168923 54317
5603 -387415 -138764 28694 -161330 -19824 136338 1547 172935 87875 91512 -450960 124618
5591 81422 53593 63705 149447 -112640 74702 61311 -133315 -118132 -91692 -543315 -270982
5579 200157 150794 235051 -80956 112914 192345 183542 -195570 111028 -232701 81012 85606
5568 85606 109126 -94291 -84637 394178 -110067 325047 -59609 94886 -93219 -221695 -9997
5556 2068 -313789 275709 -19004 270817 -161946 -8119 213411 -185071 290360 173646 -32454
5544 142411 104944 -261719 -200859 -64795 -224821 192036 -167446 -147089 452487 -64031 159532
5532 203267 70511 27754 -4492 -80349 -106981 -24376 -146426 -222381 185605 -197400 170522
5520 34350 -39509 81841 -118301 -466710 50206 -41825 -199862 449424 -68200 33699 -53749
5508 -122159 -46440 7369 16262 -49394 -82167 47298 16284 315800 139825 -88848 -66318 -393189
5496 -393189 2983 57093 -50381 54374 2623 12058 228228 -139299 -292768 -10689 126560
5484 39240 -162488 -201628 -107532 -21062 134006 127097 261967 -44660 135837 -101636 246702
5472 -2233 -192321 -13232 -179001 -206952 -173829 -260362 118426 -63153 124125 -119757 368636
5460 -51954 202055 3023 82788 27919 -33920 -166019 -177067 -91772 59558 80020 -162125
5448 -169930 72441 -11148 61885 -100508 -116431 36974 31986 30759 -330061 1414 26088 -64368
5435 72685 3269 224334 -117594 98590 -62489 12499 -69158 163038 81868 119388 246539
5424 246539 -2476 115763 105541 -128721 -127806 -30510 -111937 110400 102381 -242204 44357 5986
5411 375213 180812 -224831 25407 -191584 -60931 9488 82126 -62370 152536 -62004 -85448
5400 -85448 -205164 259612 23859 97189 -14507 160262 28565 4842 -250367 162469 265396
5389 265396 399195 82036 117527 -111863 92057 277927 27674 115622 174191 93207 -93463
5377 -28299 -169888 72651 -224932 -61621 -155229 88734 147319 97229 61104 -210947 -213554
5366 -213554 -41523 10220 -160814 -262562 130625 -289926 -16494 113303 -189590 41253
5355 -236692 124146 45570 -56418 -2304 258761 252645 27169 -88712 15030 -135082 228156
5343 23510 33717 -124818 -32963 -239820 -353822 -439410 12085 149332 -141330 159867 -89146
5331 13704 244176 23867 -114089 -248609 214505 -119505 -211532 -9368 -13900 163204 -2052
5319 278481 315416 -51098 -72536 -485429 -251283 33712 -6818 134681 -46670 128176 -157636
5307 -273928 136427 -58054 56100 -136474 -32734 -21792 127868 -196995 184790 82737 -87968
5295 94703 -239495 -31273 -297511 30119 138238 35905 122205 -76802 -169127 165848 -74243
5283 -108085 -378457 77048 273077 68443 -43323 -355117 119281 -20690 -19928 -217221 -7416
5271 41167 -273388 -262016 301331 99250 -28216 153102 340528 211753 -4858 44122 149325
5260 149325 143626 43108 85595 -239830 209694 132707 79517 -358549 -354957 354547 8661
5248 -17953 54973 202916 -43864 76380 -78222 -99384 91540 20591 11070 113267 174022 -89854
5235 199941 282702 -64874 -177919 -96656 -27881 247408 20282 140326 -130882 99758 338588
5224 338588 35786 -55693 116389 -183033 -104012 -28446 -337766 -10997 -13247 375554 -148893
5212 177088 45120 -103852 -68087 89081 -128505 -184387 -282429 5128 -396625 3956 115396
5201 115396 67968 130281 -25848 9307 228718 188397 -235365 -23419 -238206 -33566 18188
5189 326493 -114989 62624 126026 -147483 -65928 173002 -85592 -301930 138708 -17372 110341
5177 -348984 246666 4334 -65753 142708 -120665 -36851 91322 228049 -136364 -135751 -113182
5166 -113182 304319 93359 -6122 6342 66938 147064 -210444 -61955 -128499 -80295 228035
5154 -86374 294661 -15196 41342 58950 -19731 -64985 4068 -222351 -335012 231413 324134
5143 324134 -340215 137103 80837 125453 -7903 -28493 -83830 28291 63875 159255 174572
5132 174572 66989 107621 -98787 115585 94127 -155492 184475 48210 -89998 -1223 -182363
5121 -182363 69387 220752 -253805 -337636 31979 94871 -174411 -214875 -110942 298807 146054
5109 215378 -31620 -196863 -186474 -317032 -28198 -231346 -135181 -43841 219363 246989 132107
5098 132107 -246598 199084 159510 -217456 192852 42821 -76932 529499 8440 125252 -266722
5086 -210295 230830 354172 -152282 29728 -33047 15144 105059 -135400 40889 -157528 241204
5074 -299750 76537 306851 280504 -183212 118272 75641 -32497 139882 60960 -90482 -137686
5063 -137686 358986 -23911 -172878 230262 255587 66248 -189974 -51050 -53632 18982 26497
5052 26497 58275 108142 116375 161192 184079 11966 40506 106736 -95766 68204 160024 77391
5039 -202653 -117445 -47722 131812 223826 -167315 -124943 99432 14972 -110997 -113603 491710
5027 -442506 232614 33981 -121199 -115716 24878 -124713 -58633 -385400 -12630 -38363 -2499
5015 70882 -80531 78631 -143702 57330 -339283 -50160 -137538 275652 -26430 61327 43262
5004 43262 -274302 96386 62335 -76770 -177830 219390 132946 203990 -71993 171857 192593
4993 192593 30825 47486 -171793 -166865 -480441 -20415 -159559 -372527 -70538 1281 -104536
4981 65857 142809 119698 -144370 422370 267698 -38490 -3725 125189 84977 -45714 266467
4969 272701 -106202 6373 -41269 121431 -53619 -407418 282394 -88054 176101 -138393 -146100
4958 -146100 -66123 144665 -208871 158092 144068 25123 -154914 102389 46601 91268 -69761
4946 217584 207080 171593 -311007 -75344 -129545 -22071 20847 71313 55376 65879 72627 105010
4934 105010 -109789 135801 -157978 271977 77039 196395 63389 -78809 -49462 64937 -36968
4922 -106626 -208476 -111126 325531 -175687 98102 72516 150845 -165183 53372 90704 171276
4911 171276 277100 153931 -62647 102804 46069 28774 18682 -166100 -134878 11433 37750
4900 37750 -39404 75874 118376 -278428 -81352 -88575 142789 81141 -39870 -246669 134769
4888 -26328 -1942 2494 -180484 135038 72364 28648 -271920 -214344 404117 203411 141695
4877 141695 201437 -19992 224715 163234 -225669 86422 -25561 38303 -11181 249493 64095
4865 95969 -94833 401622 231261 122830 45410 -162825 68300 -95859 11471 -87123 -62793
4854 -62793 -17801 208748 -241267 18843 -14441 119948 -89198 180447 141950 -42001 -259143
4843 -259143 12480 -140552 -378094 142337 -19235 -236301 -239655 210489 181610 162141 119100
4832 119100 -78603 162733 556428 224154 -43011 -187127 395149 -85751 52097 283484
4822 283484 -123924 159866 194713 312463 108880 -35853 -55433 -61891 -37909 145091 -20024
4810 -112873 -73763 -134923 143553 148259 -29050 -455666 -256628 221513 127072 83414 295111
4799 295111 -98842 -49948 176021 113412 -28623 8066 -93039 157076 85349 -47938 -217872
4788 -217872 81883 238326 -138817 -41907 -44559 -112100 406587 -77446 358196 -193327 -12235
4776 -1295 25678 -10070 68856 85964 -241449 196352 -61829 285289 -121758 11644 -55292
4764 5356 -188053 -85333 47931 -32542 -150251 -141264 -223285 90915 -18645 -93553 342823 -1420
4751 -309038 503347 -168173 -132746 138960 38374 -90164 -39203 7982 -235496 -346910 -100170
4739 2114 -210673 18514 -147198 195257 8206 35729 -24570 176131 324929 43943 -168015
4727 143226 -55519 59740 -45473 -23770 38409 -14965 256959 193972 90831 119489 54907
4715 151322 70839 247109 6342 109742 -108528 -342945 -65153 -85426 -11980 -194242 -230479
4704 -230479 -385558 50915 -266561 67037 25340 190146 15685 -64760 87647 224648 172358
4693 172358 96056 75170 202648 62827 -310753 536208 -421750 298531 65127 -34877 -331990
4682 -331990 92566 2475 -33926 63436 139048 -257665 -156896 188822 114772 129043 -269557
4670 -83833 54647 -66039 -145939 262447 135395 25110 -112542 129156 187903 -181769 -352196
4659 -352196 -3332 -27896 -77155 200679 37060 226455 295807 91322 5450 86031 -183873
4647 -80297 -240317 -282752 -46172 84548 -26743 -21094 223191 126273 -80810 47622 -318527
4635 138886 48771 147279 -333804 83534 53478 17299 133117 103924 -95616 154363 -140279
4623 -19919 -85807 98494 -103418 -54337 74071 -43993 -230076 115858 133073 -196556 -22236
4611 129277 -14822 111740 -184468 87965 -23324 228637 31737 69003 -92628 20832 76853
4600 76853 -89354 -59514 4518 -119111 -1830 -221795 3985 -233744 147267 -316149 -34318
4588 69993 80131 435809 967 20585 266603 -109635 -23599 -6100 151168 -52896 142103
4576 66103 126690 -81481 -73078 67161 87320 281321 -59139 -250900 -219415 -235582 7909 492125
4564 492125 252121 104490 294147 -184182 -179952 -318020 -139390 -268105 -256072 81069
4553 -191011 -26106 -88991 -69396 121918 -617 34596 -29701 -99325 -42618 23447 33460 -20334
4540 58126 115460 -54299 -204863 336485 -17797 235121 172868 103492 -281045 57815 175435
4529 175435 72988 17984 274458 -143195 -149713 -80053 -163071 -43839 -359686 -255647 -46994
4517 -255903 63117 145531 -123333 -138003 188592 -135557 170560 -29340 -323641 -58716 -74000
4506 -74000 73799 112803 288173 -56318 -244068 389878 160235 -10430 -123967 145481 -29068
4494 25689 115482 -75984 11621 170149 95736 -82419 83250 39108 -113541 -150654 -91449
$$ [...]
##END NTUPLES=NMR SPECTRUM
##END=
