##TITLE=AC1474_ZNESNA300_8100857_HIgwmcBgB9
##JCAMPDX= 6.0         $$ Bruker NMR JCAMP-DX V2.0
##DATA TYPE= NMR SPECTRUM
##DATA CLASS= NTUPLES
##ORIGIN= BRUKER
##OWNER= Administrator
$$ 1.72 TOPSPIN		Version 2.1
$$ 2013-07-31 15:12:31.306 -0700  Administrator@X
$$ Compression mode = diff/dup
##.OBSERVE FREQUENCY= 400.02188249412
##.OBSERVE NUCLEUS= ^1H
##.ACQUISITION MODE= SIMULTANEOUS (DQD)
##.ACQUISITION SCHEME= undefined
##.AVERAGES= 8
##.DIGITISER RES= 22
##SPECTROMETER/DATA SYSTEM= spect
##.PULSE SEQUENCE= zg30
##.SOLVENT NAME= COFFEE_meoh
##.SHIFT REFERENCE= INTERNAL, COFFEE_meoh, 1, 14.98509
##AUDIT TRAIL= $$ (NUMBER, WHEN, WHO, WHERE, PROCESS, VERSION, WHAT)
$$ ##TITLE= Audit trail, TOPSPIN		Version 2.1
$$ ##JCAMPDX= 5.01
$$ ##ORIGIN= Bruker BioSpin GmbH
$$ ##OWNER= Administrator
$$ $$ E:\/data/COFFEE/nmr/AC1474_ZNESNA300_8100857_HIgwmcBgB9/10/pdata/1/auditp.txt
$$ ##AUDIT TRAIL=  $$ (NUMBER, WHEN, WHO, WHERE, PROCESS, VERSION, WHAT)
(   1,<2013-07-31 15:12:24.931 -0700>,<Administrator>,<X>,<go>,<TOPSPIN 2.1>,
      <created by zg
	started at 2013-07-31 15:11:19.260 -0700,
	POWCHK enabled, PULCHK disabled,
       configuration hash MD5:
       C8 4E 4E 5D D3 5C D8 9E 9F 52 82 E0 59 8A DE 15
       data hash MD5: 64K
       C5 94 C5 07 E3 17 56 3D 2A FE EE D5 0D 7E D8 BA>)
(   2,<2013-07-31 15:12:27.806 -0700>,<Administrator>,<X>,<proc1d>,<TOPSPIN 2.1>,
      <Start of raw data processing
       efp LB = 0 FT_mod = 6 PKNL = 1 PHC0 = 0 PHC1 = 0 SI = 32K 
       data hash MD5: 32K
       7E 5D 55 9F EF 77 28 69 C3 BF E9 70 CD EA 9B D6>)
(   3,<2013-07-31 15:12:28.088 -0700>,<Administrator>,<X>,<proc1d>,<TOPSPIN 2.1>,
      <pk PHC0 = 100.7227 PHC1 = 0 
       data hash MD5: 32K
       1B 4C FB 2B D1 2B FE 56 8F 17 E1 F8 D5 24 45 32>)
(   4,<2013-07-31 15:12:28.181 -0700>,<Administrator>,<X>,<proc1d>,<TOPSPIN 2.1>,
      <abs ABSG = 1 
       data hash MD5: 32K
       E7 E6 FC 55 A2 F5 3A 1A 89 58 47 C2 E4 0B F8 87>)
(   5,<2013-07-31 15:12:28.228 -0700>,<Administrator>,<X>,<proc1d>,<TOPSPIN 2.1>,
      <abs ABSG = 2 
       data hash MD5: 32K
       D8 DA 2A 97 E7 44 1C AE 25 27 EA DD 7A 65 C0 7B>)
(   6,<2013-07-31 15:12:28.275 -0700>,<Administrator>,<X>,<proc1d>,<TOPSPIN 2.1>,
      <abs ABSG = 3 
       data hash MD5: 32K
       10 5B 74 10 E5 2D B2 32 AB 90 33 D6 2D B1 67 69>)
(   7,<2013-07-31 15:12:28.322 -0700>,<Administrator>,<X>,<proc1d>,<TOPSPIN 2.1>,
      <abs ABSG = 4 
       data hash MD5: 32K
       36 83 D7 03 DC 89 6E 5A C1 66 D1 DB 86 1E 24 27>)
(   8,<2013-07-31 15:12:28.369 -0700>,<Administrator>,<X>,<proc1d>,<TOPSPIN 2.1>,
      <abs ABSG = 5 
       data hash MD5: 32K
       98 CB 93 FD E6 F5 4E A9 27 6D 43 68 39 F1 A5 89>)
$$ ##END=
$$ 
$$ $$ hash MD5
$$ $$ 35 3A A9 85 56 97 B0 47 7C DB A8 88 51 9C 2E 9C
##$RELAX= 
##$RELAX= 
##$RELAX= 
##$RELAX= 
##$RELAX= 
##$RELAX= 
##$RELAX= 
$$ Bruker specific parameters
$$ --------------------------
##$DU= <E:\>
##$EXPNO= 10
##$NAME= <AC1474_ZNESNA300_8100857_HIgwmcBgB9>
$$ [...]
150 150 150 150 150 150 150 150
##$TP07= 0
##$TPNAME0= <>
##$TPNAME1= <>
##$TPNAME2= <>
##$TPNAME3= <>
##$TPNAME4= <>
##$TPNAME5= <>
##$TPNAME6= <>
##$TPNAME7= <>
##$TPOAL= (0..7)
0.5 0.5 0.5 0.5 0.5 0.5 0.5 0.5
##$TPOFFS= (0..7)
0 0 0 0 0 0 0 0
##$TUNHIN= 0
##$TUNHOUT= 0
##$TUNXOUT= 0
##$USERA1= <user>
##$USERA2= <user>
##$USERA3= <user>
##$USERA4= <user>
##$USERA5= <user>
##$V9= 5
##$VALIST= <valist>
##$VCLIST= <CCCCCCCCCCCCCCC>
##$VD= 0
##$VDLIST= <DDDDDDDDDDDDDDD>
##$VPLIST= <PPPPPPPPPPPPPPP>
##$VTLIST= <TTTTTTTTTTTTTTT>
##$WBST= 2048
##$WBSW= 25
##$XGAIN= (0..3)
0 0 0 0
##$XL= 0
##$YL= 0
##$YMAX_a= 656251
##$YMIN_a= -560165
##$ZGOPTNS= <>
##$ZL1= 120
##$ZL2= 120
##$ZL3= 120
##$ZL4= 120
##$ABSF1= 14.98509
##$ABSF2= -5.573092
##$ABSG= 5
##$ABSL= 3
##$ALPHA= 0
##$AQORDER= 0
##$ASSFAC= 0
##$ASSFACI= 0
##$ASSFACX= 0
##$ASSWID= 0
##$AUNMP= <proc_prof1d_extract_pilot.lims>
##$AXLEFT= 0
##$AXNAME= <>
##$AXNUC= <1H>
##$AXRIGHT= 0
##$AXTYPE= 0
##$AXUNIT= <>
##$AZFE= 0.1
##$AZFW= 0.1
##$BCFW= 0
##$BC_mod= 0
##$BYTORDP= 0
##$COROFFS= 0
##$CY= 15
##$DATMOD= 1
##$DC= 0
##$DFILT= <>
##$DTYPP= 0
##$F1P= 0
##$F2P= 0
##$FCOR= 0.5
##$FTSIZE= 32768
##$FT_mod= 6
##$GAMMA= 0
##$GB= 0
##$INTBC= 1
##$INTSCL= 1
##$ISEN= 128
##$LB= 0
##$LEV0= 0
##$LPBIN= 0
##$MAXI= 10000
##$MC2= 0
##$MEAN= 0
##$ME_mod= 0
##$MI= 0
##$NCOEF= 0
##$NC_proc= -8
##$NLEV= 6
##$NOISF1= 0
##$NOISF2= 0
##$NSP= 0
##$NTH_PI= 0
##$NZP= 0
##$OFFSET= 14.98509
##$PC= 1
##$PHC0= 100.7227
##$PHC1= 0
##$PH_mod= 1
##$PKNL= yes
##$PPARMOD= 0
##$PPDIAG= 0
##$PPIPTYP= 0
##$PPMPNUM= 2147483647
##$PPRESOL= 1
##$PSCAL= 4
##$PSIGN= 0
##$PYNMP= <proc.py>
##$REVERSE= no
##$SF= 400.02
##$SI= 32768
##$SIGF1= 0
##$SIGF2= 0
##$SINO= 400
##$SIOLD= 32768
##$SPECTYP= <>
##$SREGLST= <1H.CDCl3>
##$SSB= 0
##$STSI= 32768
##$STSR= 0
##$SW_p= 8223.68421052631
##$SYMM= 0
##$S_DEV= 0
##$TDeff= 65536
##$TDoff= 0
##$TI= <>
##$TILT= no
##$TM1= 0
##$TM2= 0
##$TOPLEV= 0
##$USERP1= <user>
##$USERP2= <user>
##$USERP3= <user>
##$USERP4= <user>
##$USERP5= <user>
##$WDW= 1
##$XDIM= 32768
##$YMAX_p= 452138371
##$YMIN_p= -665437
##$CURPLOT= <Network HP LaserJet P1505>
##$CURPRIN= <$Network HP LaserJet P1505>
##$DFORMAT= <normdp>
##$LAYOUT= <+/1D_H.xwp>
##$LFORMAT= <normlp>
##$PFORMAT= <normpl>
##$SURQMSG= 1
$$ End of Bruker specific parameters
$$ ---------------------------------
##NTUPLES= NMR SPECTRUM
##VAR_NAME=  FREQUENCY,     SPECTRUM/REAL,   SPECTRUM/IMAG
##SYMBOL=    X,             R,               I
##VAR_TYPE=  INDEPENDENT,   DEPENDENT,       DEPENDENT
##VAR_FORM=  AFFN,          ASDF,            ASDF
##VAR_DIM=   32768,         32768,           32768
##UNITS=     HZ,            ARBITRARY UNITS, ARBITRARY UNITS
##FACTOR=    0.250966925370066, 1,           1
##FIRST=     8223.43324360094, 14015,        -51081
##LAST=      0,             196470,          -71487
##MIN=       0,             -665437,         0
##MAX=       8223.43324360094, 452138371,    0
$$ Real data points
##PAGE= N=1
##DATA TABLE= (X++(R..R)), XYDATA
$$ [...]
23848 163262 179024 -203428 -164174 296484 98651 -425024 143073 -115664 -133331 -228183
23838 -228183 -86265 -156768 455073 79752 20704 -147737 4279 292586 -137550 105716 -25930
23826 248460 -349648 78902 -58482 -37297 115905 -228560 138110 -104701 212727 190444
23816 190444 -128984 -52412 -103696 15398 -116811 131750 118524 62397 -91573 -37031 -193626
23805 -193626 211743 -47516 -34542 191031 104688 -378193 -164180 -72976 102754 -36757
23794 -259822 -253676 -94342 -197725 210468 258624 20563 -60496 -268759 -43962 -82533 1992
23782 -189668 -53353 277983 -156146 -295502 87785 -111528 123637 93577 102317 132651 -152278
23770 -163328 222420 -35518 45261 36167 -295816 -199235 332810 -120553 -195983 120808 -11742
23758 98287 255412 181115 -132419 72831 -154602 -21889 -63110 109214 2489 95171 309163
23747 309163 171054 -21581 -76282 46653 -81304 10844 153079 -382632 189574 -198611
23736 -168866 -209763 -236411 234018 51978 -136719 91304 32974 50701 -281471 67304 -74721
23724 -31645 210706 -21610 64397 -246571 95327 -147609 325036 180168 37803 204962
23714 204962 -107613 -272600 -595 -252519 1643 169219 -39510 95972 -19014 62933 21633
23702 70919 164573 -12196 189477 114700 130307 -249049 298630 -6373 106173 -114561 -117786
23691 -117786 9517 152170 -151218 -274294 227060 88605 79074 51054 -316529 73057 -131895
23679 -146776 -157089 -149247 33840 209858 -24514 6713 206519 -191623 -143650 -102273 -72522
23668 -72522 -300001 -75854 -250481 -233482 -280054 126248 -7339 45156 -367373 142164 -245165
23656 -32578 30821 -189060 -84632 -162977 172678 -209679 189468 -152101 10438 -28930 -259734
23645 -259734 -364417 -204814 151402 -135815 -120898 156263 -50214 -134303 24980 -91111
23634 105897 5738 -195977 221051 -129386 -85190 -50013 -18263 196684 -100916 38921 -187804
23622 278273 -229937 -140147 64785 89908 -178656 216656 171604 171373 -20800 -29159 -266667
23611 -266667 -303273 376040 -369278 -39207 187390 203762 -280747 57408 202099 -191913
23600 -86689 -252503 180622 -410527 243685 -5394 -79090 -100109 236215 293116 -230451 -61254
23588 -105306 -129616 -31328 -134735 -80558 -20212 74347 1405 -40056 -179581 -181362 -66270
23576 -294243 -136571 -245809 -104172 -137166 278971 -61573 154764 27228 -140464 -77662
23566 -77662 270147 145618 42637 -59986 240841 -172120 -209831 -121731 55411 3912 126823
23555 126823 -179259 70383 253693 -273876 -429625 275560 -211129 137657 87893 74589
23545 74589 22241 -179672 -259981 -94768 57398 -39280 -275423 168942 15133 -194234 78469
23533 -69775 192156 253463 113486 170650 104712 -60698 106834 -37078 116748 -344906 129404
23521 -239624 -137399 -211707 187 -130966 159196 124048 290424 -286667 107612 185229 142279
23510 142279 -144814 89329 -89347 19980 -345733 145315 33728 462396 -109864 -95161
23500 -95161 -65153 -173635 -63608 -320599 152718 -95150 -34155 70067 -169988 360532 7193
23488 70006 -12958 -161185 50305 -82131 -39775 -63647 -138031 239580 236283 -97833 -29532
23476 -44206 166750 108600 -350785 -158644 117713 -71446 274412 4532 -159309 165903
23465 265531 -135418 -155845 -43394 -97987 -240197 73641 10671 571631 -95271 -51856 321294
23453 83152 -17471 -129248 -127858 209115 92839 -422597 -39180 112117 332331 26136 -62142
23441 -97392 -185436 185616 -317460 -9047 175831 -272304 -74339 -119810 -160101 80483 7116
23429 -267250 72704 198301 -6949 4850 138222 -102651 -179172 -173382 -80227 -534917 222362
23417 -106296 -12233 249294 -120807 24829 -230673 -404235 -434751 138458 -187583 -269474
23407 -269474 89586 183422 -367341 -420587 286835 -163229 50070 7913 -176936 335019 -196832
23395 40491 65783 -36354 94477 193427 -37716 -8064 -6649 82139 90880 -110824 128936 -55273
23382 -9950 -225284 -269195 -1942 -124332 144341 17204 -140376 -47019 -55143 350961 -24958
23370 41842 -82750 148262 55744 3114 123540 -31227 6033 30223 -379495 151226 219468
23359 219468 230051 224856 143934 96532 57803 -33418 -33793 -168472 -139545 68461 -116117 194311
23346 58202 -94337 79031 -231675 -70105 -361788 57939 135964 -171807 2447 175918 54499
23334 -208706 71613 -101289 100218 -215833 327234 57774 -96402 -37171 -84096 22192 48958
23323 48958 74257 81754 96061 -235444 317604 128110 -11799 63572 119241 258135 67063
23311 -138056 -303039 -146617 -225558 -170580 28950 57729 -153305 -311871 -159926 -115490
23301 -115490 157791 -31134 -55738 -132866 -16089 -130326 28665 -54984 29982 -136290 5086
23289 -335247 -8870 120790 2541 -5634 96929 374916 -229849 203028 70205 283039 93185
23277 99787 23337 -41800 490121 84012 177086 174069 -118004 207980 -134981 -28150 27918
23265 -35353 -207527 -255535 -32273 -15567 56807 -55170 68807 1203 -12052 -4433 10781 -262958
23252 -185697 -147330 -157652 -335481 188192 -91497 -44350 -266936 -502018 -91979 46872 -5725
23240 -79910 -38504 -4171 133787 7490 -32417 -274328 31306 260883 -82044 -39027 480470
23228 15925 -117784 117515 -168170 -139888 -175893 71172 -100967 -150045 9672 15741 -31681
23216 -322010 -158415 -48632 -211751 93791 194439 90993 135863 -198145 -203259 -261286 -115927
23204 75473 328039 -110095 -123529 160668 -209471 -61768 -354069 6338 77829 -139410 -274693
23193 -274693 -359899 -87686 -59206 -132670 191188 -110217 114381 -122921 -18086 125027
23182 249788 -239598 151334 196585 -146522 -83769 -66311 -242918 -88821 17102 242491
23172 242491 25607 -383453 -18786 95718 139003 -158655 -197735 13550 40795 -41735 -53771
23161 -53771 -223864 -45502 265448 -299509 242648 -93569 -98039 41284 154902 445325 132182
23149 177690 -247850 -182257 35632 -153313 194729 -150887 5772 48654 59507 -63726 90343
23137 79554 -97684 -164551 -123215 160879 101212 94419 -8989 194093 88859 164636 2852 -88917
23124 -154573 -33629 254469 162345 136774 -72585 141882 20737 -383053 -125291 191802
23113 -28454 167951 64098 -117897 71681 -375821 97558 -386872 219879 306129 185078
23103 185078 -6243 129934 -23453 -83807 -111009 -63388 -184770 -38781 -362500 31931 127890
23092 127890 72694 -432962 -37267 190211 -19546 -345637 103489 16444 -121699 47382
23081 37160 -152603 -71563 25192 -273023 -109781 -44079 -109562 -32918 -104963 312524 56697
23069 -133693 -158085 -60229 50749 48581 49924 -108545 -65785 -52261 -159646 175607 50588
23057 -455267 172463 198331 -93139 127413 212651 34092 -277217 -231955 30250 -59721 -181617
23046 -181617 -188166 249030 -52832 20225 -395164 -412538 -86416 -32861 -172361 -3989 26292
23034 -102522 42553 37453 -199972 11025 -347853 155986 -241122 -283656 7154 112542 -95323
23022 147093 -82852 -41622 -14225 164693 -7751 -112790 86261 53121 -282693 -183116 -97968
23011 -97968 -34892 -88306 -171813 23359 -75036 -113652 -5654 -205106 122912 -80862 137791
22999 -18544 -108323 39961 24980 11347 273901 -98323 -169717 247216 175868 -468080 62395
22987 -183931 376856 -281239 -321427 53141 -308228 43984 20362 103551 -43061 -193025 -97518
22976 -97518 -52432 107228 -3423 38921 -63267 84608 -257610 259656 -19541 47396 -333456
22964 -14021 164620 -60226 -280284 -61576 39342 -259771 -39806 -42422 296590 -53038 8887
22952 -90091 -100050 371444 -152504 103385 -85760 -69867 -133419 -206562 66380 255909 40096
22940 40322 -91167 -48372 -260099 -48017 -279367 -33504 313427 93167 -5302 13449 -27695
22928 -125949 138090 -200378 118708 37089 573 179098 -129980 21485 -80099 54481 -179276
22916 181109 -374737 -76046 -41048 -54289 204544 -163588 261355 176094 241923 102001
22905 133129 163348 206460 -125280 118960 204341 -129736 64984 -53935 -69657 67943 -23991
22893 -103404 159718 -90334 -121906 -128093 17654 -22906 -157206 91720 3811 -134059 -178508
22882 -178508 413960 -64394 -2031 -294792 259677 -125626 157826 362093 -101006 -56089
22872 -56089 221793 -7611 -103440 -34583 -83504 -80375 337273 281025 22758 271202 14581
22860 16195 -523283 233445 -89820 -137151 -95624 276134 -92406 -95806 26784 -121215 590788
22848 -500556 218693 -124535 173849 -140464 -255253 96619 -93948 23999 64726 11938
22837 128820 -219929 -104784 -32732 -173166 -101182 -102369 66392 67148 -11129 49526 -28445
22825 -153975 -60737 -24402 -178082 255968 21020 17126 106815 -10213 252881 127709 90815
22814 90815 -72702 250809 261030 6433 -159327 -100839 186226 119822 140238 5753 -225125
22802 -203067 -287093 242242 -69591 -349835 -157635 46142 122596 -227627 -65424 -179946
22792 -179946 -23418 60227 -649203 -116203 -11088 259306 129287 -145010 122514 -288267
22781 -141682 114994 -275472 94462 70167 137282 192687 -125651 125978 -299324 -208586
22771 -208586 -67630 43556 199256 65883 -236474 -57936 -33732 -33395 -221711 -363851 107042
22759 84475 -238951 -126857 118420 -54526 98857 -66467 -175657 -44278 154707 -299669
22748 -246790 127186 -154429 88169 -21681 -94757 -99273 59782 -338967 -52661 -145177 -360109
22737 -360109 -123014 134282 272062 -95110 257501 89685 16692 -3137 -462345 -160741
22726 -272851 126836 -181755 -126926 -119517 -10692 -93415 23500 -133734 -397486 187708 167437
22715 167437 -485856 -177623 -171938 97826 262088 270733 -338169 -217357 225816 -177855
22704 -17031 35919 186233 163949 13657 -396605 42012 -198261 -24315 -59571 292698 154591
22693 154591 176652 297563 -150299 67774 316267 -63803 13769 125508 -161323 -76773
22682 -57486 197708 -303972 -190434 10494 -163038 39855 -220314 -99677 -267797 -8113 -76573
22671 -76573 59745 -158490 -344800 -311734 -110736 -94702 -199880 266886 8208 -316489 264495
22659 69672 -41600 -192488 -177141 249604 -196588 -80566 150875 -273965 35052 -157393
22648 -112754 -7434 89117 -26456 -299878 -15666 -373252 -67484 -151433 -196476 -230379 -339561
22637 -339561 14047 -39609 28143 -124197 -4828 -237715 157861 169693 -289386 132644 -62538
22625 -356359 -39176 -61751 -211149 -170882 9977 -6583 -77539 -270239 -197015 110960 126706
22614 126706 -150416 -212852 -15140 99905 -47360 -78015 115133 -76279 187250 -253507 11150
22602 437063 -246443 -142737 -151589 31200 -170387 -9244 -42433 -58146 -107773 -111951 -123255
22591 -123255 27323 -328730 356303 41263 27338 -53573 -88324 -100374 345420 54284 65100
22580 65100 28327 -20846 -24821 169545 -148003 -103992 -11517 -46427 -124186 182524 -104855
22568 -276346 36991 -76086 208454 -1572 48557 -37611 -231801 -108876 -226943 -188226 97221
22556 133508 269229 -274564 -251120 -50110 -28535 247550 -22458 -234891 268052 166589
22546 166589 -91371 -110374 167956 106508 236117 -20092 -22562 218575 254125 132737 -252523
22534 84592 -8301 112236 -118663 -221860 56864 -80206 -72798 130679 -133619 10697 250032
22523 250032 -129108 -67824 151205 -518017 -228557 -325658 -521590 -42068 -115770 157808
22512 -35227 25994 176810 -201836 -42241 164087 -281009 -17139 94725 258279 -429078
22501 -239789 -150193 -116083 45993 -130473 104679 160950 165755 -353346 -448922 -136900 265116
22489 -52325 -113552 141219 -59699 12967 -40745 134718 -186253 -9376 -100406 -26231 -268236
22478 -268236 345281 -21292 -139694 -14391 -271383 -251786 -115593 -191180 -285574 -90842 145265
22466 27664 -70712 204799 -258276 12441 46765 -24840 -69677 20896 170279 -51342 187542
22454 116847 43115 -338472 75738 -193591 -176733 139273 -244023 59305 121973 360486
22444 360486 119195 -267032 58642 -43068 -60344 -94610 72430 -93346 -49238 35087 29403
22433 29403 141600 -2507 -243281 -288854 118873 67366 153993 8724 150728 -183576 345767
22421 -48818 318455 -41581 267687 86960 -218683 -315902 -96063 -56998 -353523 249850 72655
22409 170158 -136359 -28938 38281 114111 -181638 -1401 25308 -182997 -221110 -55926 -79042
22398 -79042 -19229 -137027 150099 -149853 -142226 -220812 20809 -48548 94396 91081 3817 123887
22386 123887 -279753 50053 40758 68659 -224657 173669 110135 -135560 122942 83410 280005
22375 280005 -105986 200670 -130465 76898 -48838 -57529 235950 74495 -13059 325254 79955
22363 92334 -36109 -197140 -110352 -158231 -127432 -196426 -44001 145530 -99091 -258356 162312
22351 -15148 -133371 -191229 -181929 -86962 -150251 -39187 -238284 197268 253574 129583 -97037
22339 65870 140924 168184 -297534 42635 -184260 391916 -38035 3563 -109581 -74862 -80851
22328 -80851 -153688 -261971 -391311 -552841 156013 -20057 114688 192512 -242862 363334
22317 72660 74216 239643 126549 74535 99557 -18744 -12822 -180849 -36650 -195377 80776
22305 -128332 -45031 -308388 -109015 -80015 236530 -353343 67766 -321862 -74056 -249191
22295 -249191 50487 39200 29846 -130367 19868 -249795 364425 -142756 -95098 39255 -88044
22283 -26211 -13951 88418 -235666 -29394 -262009 -272673 -48435 322493 -304195 -157405 97376
22271 -236593 78119 -348874 157374 -287308 -161799 -108758 -37461 -204639 15848 -177191
22260 -21384 36002 -10884 -364865 -230163 -63749 -37707 209889 127705 205844 239975 -154991
22248 150339 310623 -107046 27177 -441902 -245165 -18790 -338294 -303243 -176879 419162
22237 12563 162049 -131031 -58100 -51390 -242017 -37586 124945 19928 -20523 -59169 -85992
22226 -85992 85011 -121196 -361065 -123580 141983 -12473 -72129 -291233 71396 -63496 82397
22214 -114849 -57734 -93557 132056 61572 9660 331907 5934 136511 216573 -83153 -135129
22203 -135129 -168890 -106562 42126 -72561 -24131 -396549 248553 -27495 1727 106966 197118
22192 197118 134050 17334 -50846 -57521 -246323 -59179 -64035 248393 -173649 100187 -236838
22180 -183049 6364 -84617 -166557 -212069 169664 128902 210021 -137761 -261427 34686 27930
22169 27930 -116905 171882 -49049 -145406 210576 198025 -38044 -273489 -245690 -69116 44139
22157 26992 227983 72011 151297 -254535 94930 -28926 160993 -304264 137896 42380 -17883
22145 54062 -108350 38726 -70332 -456898 120270 35567 105048 -97108 19500 20411 -104312
22133 -77931 -157892 -170140 219434 -370481 -211730 -131041 -78039 -330051 -151552 62888 -215666
22121 -198656 -77202 -24216 202093 -63784 24653 -55267 239625 265481 -200003 254476 59944
22109 -151440 -12097 179215 -84882 83307 234242 -51691 -88144 -213568 33831 235338 69556
22097 -20122 -131940 51304 -59521 -193404 23113 252655 -57130 -124812 252341 -160921 -149982
22086 -149982 -25163 1250 95570 -88409 29645 -272689 38663 136551 -55055 260774 -287737
22074 -123148 204431 -177624 -232508 -157054 -237952 -99644 -203989 140470 -108384 127484
22063 -101187 15755 51333 -49856 -95871 -333725 104609 -75401 182796 117590 -238136 -189957
22052 -189957 -100405 -216216 -45799 -10115 -196074 35128 -84275 -61605 131202 -157660 -44185
22040 -237372 -160198 -128682 83385 16709 -226048 237452 42304 -64910 141187 -523498 -97766
22028 230274 79666 -117351 -312182 -390629 63820 -92387 -154629 -76051 16450 40754 238797
22017 238797 97171 64698 -271892 191560 -163438 214080 -98517 -344075 -140631 -194242
22007 -194242 293519 56057 -226161 -87210 -104726 63577 55653 -163655 -92526 -94201 -221840
21996 -221840 88448 -238509 -82905 34721 107599 -129245 5360 -60007 -65294 -139535 -139726 -18147
21983 -336174 -156762 87676 -100092 378632 -316912 -47409 39928 -104048 73669 59244
21973 59244 390308 -259499 -142775 -47533 83145 -98005 24857 -202491 -440838 98811 54160
21962 54160 39948 -189058 -215230 270430 -407632 -179518 374525 49011 -125884 -194386
21952 -194386 -46928 26934 -66316 -239203 -60126 -92227 176997 130155 98873 -212390 280402
21940 -116705 -14886 117388 -16702 -30107 -219892 270014 -119740 356939 -26512 53700
21929 -16914 -153083 136248 -93855 -157292 91857 -81270 -519771 40280 -176266 214478 68432
21917 -103775 -47661 -123567 1688 187750 -235764 -217467 220375 100351 -336387 -53554 -398513
21906 -398513 -78210 -197328 -144430 222259 20091 -203920 -44490 5119 -4074 189168 -129054
21894 230874 -11850 5730 64618 -42112 -145703 -146754 -8984 79218 -128606 1833 -136494 32365
21881 -238977 26289 -323625 101287 170813 -14726 -40863 7922 76824 96474 -57185 -388299
21870 -388299 -75381 225589 -15090 49567 64405 -234379 11015 -123737 22584 -155558 39570
21858 82739 -14026 -367778 -140979 108872 -367081 -61031 134879 29525 -25340 17536 79312
21847 79312 -96160 148560 -359833 64355 19932 -139142 -28378 -199049 -267753 252899 -503657
21835 -82214 124398 49095 94841 -412377 -299316 -191875 146342 90673 -174312 -31256
21824 -279419 -127114 -248894 -12109 -90846 -262149 -199165 -21322 -113157 -103339 -202893 -30823
21812 -240254 78210 -216558 -134047 -111317 64599 133753 -112273 117312 -92741 -16258 -99264
21801 -99264 -35593 147115 -160461 -17926 123374 35519 31758 59373 -117015 37834 72387
21790 72387 -266959 -3462 -149979 104318 134064 187854 -25113 188355 163895 276111 -113543
21778 46725 -130500 48658 -228256 -357306 -211894 -96050 -309374 53005 -36915 47826 1449
21766 137678 1625 -68059 99981 -73701 -15001 170568 -23286 143759 191846 170158 174508
21755 174508 -256223 -274617 12591 -64211 214857 88156 33459 -273805 46383 89639 275697
21744 275697 -90947 22907 -31118 241689 -245848 -288114 176364 -105523 117856 -82163
21733 -96394 13561 10550 -35707 -69595 -147064 -307086 -145432 -264586 -170723 176613 134407
21722 134407 100450 -102157 -198627 -203943 -244442 161738 -105510 -109300 -105902 -169748 -62043
21710 -22021 133241 -105682 122703 139307 -48755 -93631 111596 76622 -147537 -39603 -123689
21699 -123689 142140 138056 -317773 -4379 -39652 -265712 139598 -48475 155726 -301540 74880
21687 -75324 127983 141560 -56605 -110001 356191 -248799 96723 -32292 162755 -12696 191585
21675 -37652 92599 -25761 -37048 -215850 -164989 9005 -254663 35173 151108 67923 -176328
21663 -1989 10757 138477 -5708 61451 -149617 57962 -86069 -272368 -17744 288255 9820
21651 -209271 219547 2786 -57269 -408366 -150345 172841 -118136 -26034 -409265 -146712
21640 110838 112665 -257177 -58847 -66621 42358 14561 -73365 -47549 -382453 -93788 21970
21628 99999 -56942 -135761 -196983 144614 8505 208868 58561 337790 -248476 -438421 -181479
21616 162594 -42200 -119352 -276786 -84169 295772 25100 38897 19671 -99372 -32617 -299267
21605 -299267 -67358 -216729 -94989 -113149 -46715 187655 -268973 -322550 97369 -18221 149846
21593 -194719 99261 -319097 -108803 -24201 37693 371355 45707 -4882 -253319 116351 -101309
21581 417031 269584 -332339 50890 -54147 80761 -268455 238504 17405 -189989 13348
21570 -83198 106420 221001 240273 138980 134767 -406633 -231577 172398 -167900 -83081
21559 263560 -153550 -243602 45111 -34132 -129529 -152100 -67264 -522357 102654 -92953 -128660
21548 -128660 -291736 -209751 -123170 -101731 337780 -18735 -153039 -176388 172002 73831 11445
21536 183641 -201730 -71739 108027 -97294 -395705 -60081 -257185 -26675 -89065 -6775 174130
21524 -449281 -259689 -309479 20734 22516 -354963 8421 -241 30058 -120662 -6978 -46718 -93572
21512 -93572 -234244 -89679 -56560 153949 177650 -56831 -43652 -25236 -218345 106772 49607
21500 -75831 -196985 15230 -127505 -118704 -100244 58443 -103347 -5679 -189803 -242019 -159262
21489 -159262 -45403 -216807 14994 -388842 61685 -75792 -256182 -105248 239282 -529347
21478 -15943 -70210 -190603 -1544 -141821 -208034 6210 -142440 325040 -10232 267423 -74330
21466 57608 -210681 -250311 74434 -287052 -48848 -32434 -48767 -152603 87529 22670 90314
21455 90314 -212211 204830 -114187 -164036 -263847 -386241 -103957 55098 55204 9271 -141017
21443 -215671 -418284 -56854 7486 295419 228436 389612 232634 120641 296691 366220
21433 366220 236393 282137 287701 282531 103016 87510 220853 -111833 13527 39302 -144593
21421 -304321 -219961 -147648 -321601 -6923 28213 -52256 146089 -250917 -122986 134422 138468
21410 138468 -85059 -114098 -59724 63314 1154 -282409 99038 -126525 -328018 3119 -2739
21398 85984 -28960 27595 165052 -51086 -220443 -70832 -310507 -141212 -8035 149903 84794
21387 84794 -111547 -300043 -148990 46146 63623 -106600 139395 -26098 -452190 -49903
21376 -63773 170148 195656 12144 141492 -94601 36180 -150445 -259385 -393287 -110710
21365 367977 -341067 191743 -284499 -374742 245375 7374 -253679 149566 92738 -207353
21354 188982 260158 79614 325957 21999 -16529 -576818 -55407 -28121 119572 -110325 50137
21342 83737 -285169 -107619 179433 2023 100842 -315623 50968 47711 -58489 168248 -133793
21330 59043 -75126 -52103 -450233 -209918 -184443 277534 -131728 120571 -144608 170309
21319 161268 -212990 43934 60695 -275976 -217424 -42746 17204 -289157 9972 131549 316693
21308 316693 -36232 -254107 -7270 59518 1686 103209 167153 -190867 -336802 -429072 295743
21296 -216764 -311087 -248201 32851 76175 103041 -250359 95499 -444119 -108608 -181629 187163
21284 -204562 36672 -73666 -49161 203847 119871 157386 -108337 175082 -206360 -310030
21274 -310030 -174536 -76250 -427775 -146426 103415 -138995 -98109 -330099 -63456 -97210
21264 -97210 -16856 -98839 245292 13234 -115523 83798 -131623 -134554 257221 -1175 -109860
21253 -109860 88149 -466365 195425 -172229 110301 -11597 47348 220177 11533 54883
21243 54883 96109 -175613 61310 -366029 71370 120654 -347990 -52049 -262429 135186 -155347
21231 -280299 -233507 -215464 -4596 316351 236043 441444 -306574 -104168 103452 20007 -319803
21219 91634 -31059 1074 136309 -97010 112386 -10904 -72904 -6448 -42502 -75175 -186438
21208 -186438 -66892 307638 49121 -14845 61964 81460 -201342 -137415 75801 122722 -145046
21196 27372 -202473 -233496 -77943 154948 -68057 -22441 258847 82483 -381573 -96713 116529
21184 -39497 -125687 -141235 141880 -29690 -18322 319075 7310 36714 -136137 -211839 -167680
21173 -167680 -118710 77716 -227061 352378 -381323 127423 -186144 -112781 -242842 -66522
21162 -291415 151425 -85673 -6882 -175536 -209546 -412713 -63165 -395108 93109 -110928 -151144
21151 -151144 41814 -87585 234699 -291868 -40893 -144123 -224884 -411375 -12664 122868
21140 -89236 199662 165374 -117098 -122424 -19158 163512 -368023 -97433 -174878 -10021 -39785
21129 -39785 95378 -264964 -23027 -283975 -31711 101336 -113580 -339248 21734 -441622
21118 81841 165118 -377377 -101550 -194302 63542 -446364 -89144 -42068 77204 112922 174172
21107 174172 -22713 -159 -38339 -41827 72852 217560 -52555 -197893 -4040 -243237 -315405 -19770
21094 130537 -209623 202339 -126123 -47723 -128058 -231080 -268622 -52743 52548 -237899
21083 -204717 -16919 -295378 217207 -32583 232218 -259330 -249120 96763 -123799 346896
21072 -62674 -330540 -36808 -192429 197833 37723 173876 -141682 -247935 302564 -98137
21061 -404993 -292176 -122516 363499 77902 79373 -173187 -205040 57866 109797 -161847 142779
21049 -45803 -202272 -167479 -194902 -113954 14162 -303907 -21813 -274857 -82248 70938 182127
21038 182127 -231343 -163697 -382843 -65416 13825 85095 118498 3843 -196829 136997 -258367
21026 155322 457423 156116 -66985 -339053 3365 -36690 178145 -27673 -54472 -335934 -14508
21014 -111136 96551 -53284 17701 -47940 95895 -67638 91995 146506 -127800 -146143 -47817
21002 -82153 47358 -478475 -27907 245075 -141787 54022 -123291 -12259 -250420 -178824 -224042
20991 -224042 84640 389605 14620 -111014 -165849 125944 -75573 -125689 100535 -55217 -62934
20980 -62934 -46795 -118371 -85879 154143 116716 65331 -48828 187405 17904 17152 -305130
20968 -163687 -93441 78106 62315 -73287 -76703 25168 -12597 -389627 67678 -321548 -144210
20956 474783 9707 149799 -283905 -360597 -55153 -99147 21902 -217139 -80813 -274701 -340770
20945 -340770 -148980 -109169 79772 63934 -387706 85824 -205232 -232087 403008 -211669
20934 169995 -223370 144003 -212317 -333805 83378 244371 235610 -287510 171988 -95221
20923 76556 -110826 -87840 98046 -233065 -389707 86731 -95821 106403 -27490 -139262 3366
20911 -269968 -340740 -40880 -201231 -444079 -238595 39827 105217 -302560 -343649 -132936
20900 16275 -91687 -426856 35355 -217412 -16451 -10892 -242873 -88072 -117304 -64568 74860
20888 205312 196812 322503 99890 -161501 -198376 87321 -1346 -259354 -176299 -269326 -162034
20877 -162034 -198758 -350617 -205608 20064 136187 271198 -40610 34636 -372360 226542
20866 204235 18322 -364513 515445 -49270 143192 -446708 -157624 -120447 -78441 39350
20855 21241 -99177 40417 -233295 -158845 190448 -87673 -73791 85077 -230184 -205926 -248515
20844 -248515 -18747 -144368 250571 95875 -117647 -145534 -78499 15705 -112594 -349032
20834 -349032 -78090 -184667 -277815 195202 127248 100421 -181115 -23167 -128611 -201722 -60576
20822 -45581 -97624 -313447 46738 -133376 4699 198500 -259005 -270644 -101349 -25778 -147877
20811 -147877 -257854 126429 -22460 71328 -90394 175960 -124203 416332 -342966 -100582
20800 134659 -85716 -235463 373348 -346485 216157 -295113 28157 -297078 -363091 -115272
20789 -170904 217565 -31665 -229987 -442494 -117954 -24526 -17230 -62321 224967 345191
20779 345191 31212 -65177 52775 47843 208126 365313 -131800 -212888 -126209 56918 -125083
20767 11667 -37973 41330 137924 -231665 -54804 400729 -48586 -351002 -222907 323397 -136460
20755 -93417 101775 -265152 -128461 -63717 -246250 -298623 -44238 216312 -8303 -96194 65472
20743 -214529 -7749 181976 -391486 -313561 9904 113979 -545 -590 95354 -109790 -358208 -110528
20730 -139937 -328512 10883 -446885 -35258 -146555 -9738 -38023 237241 -174194 40952 12920
20718 -9999 -119365 -54453 81649 -18121 -174841 -260842 -153116 -95652 29656 -55944 51539
20706 -41352 186077 17244 -333111 101100 11882 180995 -37155 34099 -87061 -95515 -53003
20695 -53003 141299 60317 -156917 -120033 42923 -30020 128390 -62491 -172133 -72059 -206683
20684 -206683 5486 -39113 -62747 123032 143461 116576 -181621 -342958 -49625 -122389 -238228
20673 -238228 40131 153924 529 -108975 -140925 -38066 -25852 21268 -164374 -36821 -130972
20662 -130972 126905 31541 19766 139898 -209352 -370348 30180 -101212 -87184 146068
20651 -14393 26647 -45753 -122252 -197736 176623 -44735 -61744 116623 29964 -48246 -98743
20640 -98743 17439 -243356 -100680 -363321 -152530 25019 40165 128976 -82180 33705 -218132
20628 -225223 41742 -294426 -172023 96797 -119264 -76409 370901 -98085 -214555 172715
20617 -296906 -167153 165539 -229751 -407925 -251022 -145911 84382 109737 -281286 -237227
20607 -237227 -222717 -53789 107042 175257 -88590 -36688 41880 -8355 -313786 49744 -146883
20595 -157762 -115791 -214993 -255880 -55101 -70646 -276368 -49764 -130094 270811 -136710 255001
20583 -12390 204685 -15114 229948 25481 58565 55676 -4519 -41944 256908 -246806 89622
20571 -154576 87936 73460 -254592 -185011 -8923 219007 171499 -218664 75544 -81809 -170076
20560 -170076 47842 -116920 -85279 104048 30285 68557 -85868 -140244 -28360 -49027 -172598
20549 -172598 -144749 227169 92788 -51345 33387 181684 91788 39920 2534 -322854 -17160
20537 64187 37716 95084 147919 -219538 8836 -168032 -20526 9697 169288 -186537 -248886
20526 -248886 -237390 134593 345879 157595 -135592 -154188 -365654 89877 118461 -13237
20515 -134502 -101321 250772 -177545 -35046 -143756 -167535 -116906 -150388 -46578 -236863 -174078
20504 -174078 -298070 76320 -14266 -110814 -53820 201853 -12879 -2750 -160940 278962 -274830
20492 57358 -232584 -57323 -95782 199871 -93484 -43704 49800 -302265 362174 -76284 75683
20480 196801 -19596 -243935 63226 51825 181442 -23190 -161181 -182950 162524 4289 -219369
20468 423894 -122479 -383509 -221311 259934 -100043 -140491 -210816 33549 266564 181293
20458 181293 128050 -26597 -144553 58822 -311630 -2660 14706 15435 -120281 37786 124330
20447 124330 -117809 -226483 -8742 185785 70980 -221765 -159556 -50251 151129 -124711
20436 -440619 168333 152038 -125224 72243 -19759 118832 -112971 -153867 -1489 -44290 60978
20424 -137402 -27173 3466 16027 125613 48312 266836 -45077 45080 -365374 -17834 222187
20412 -364486 320545 233179 -531663 -70361 -334702 -64494 -89110 4193 -170340 -207847 -15539
20400 117802 316229 -184434 -202865 -246338 107777 -186353 -120752 -493867 -253122 -76914
20389 65782 124755 -166161 -242372 -26670 -135156 -266268 -197796 228146 71114 -233228 -212169
20378 -212169 120650 156742 157466 -10359 -31122 -95669 66307 -90205 50074 231530 -69110
20366 126415 -78821 -22254 -40980 -36553 55116 -266125 27999 -84072 -160435 95854 -47340
20354 -200488 -78720 -197940 -118183 -255480 130815 -226578 -123167 -45532 204703 52425
20343 -185234 -181034 -585635 -20327 -198468 -284468 146847 100819 -129913 -189235 -91321 -58643
20332 -58643 -25626 168810 194933 -171379 -401846 207303 -367954 44633 61138 -268563
20321 -94533 -31455 -504023 10783 -92033 291011 275938 -242356 -40496 -237321 -201663 -97143
20309 -115264 -34856 -103664 -123432 73988 374130 -226388 167944 -350535 -87178 122459
20298 81237 190106 -161394 36826 75642 -288315 -238974 -281411 -370900 45262 -206213 83943
20286 49993 -19594 -32799 -251246 -223576 -190826 189514 2097 10199 48364 -276155 264522
20274 -109631 -103117 49512 -113311 273170 64365 70415 -241749 52953 -75210 -69510 130833
20262 -98135 101955 -83711 -127455 -32243 -57959 -306900 -282022 -25078 -129073 -307902 -32316
20250 -116085 44015 122190 488 143954 -139990 -251410 78148 -53133 -241623 49755 -282429
20238 -33105 37082 -322730 -7442 6445 175272 143929 -20695 183024 -388094 57159 -12880
20226 -151523 90127 25685 -71240 148357 176749 211413 -100585 -623260 372775 -15595 -8252
20215 -8252 65157 22485 -97814 168455 -239371 -101853 -146645 -32014 145136 59927 42529
20204 42529 -104333 197257 -398957 12701 321764 6974 -46083 -318335 -149084 -108373 -188677
20193 -188677 -59921 -67226 -21839 159004 -82742 -261027 -810 -380979 -260049 -71983 207346
20181 -250309 48805 -76727 23171 398254 56464 167894 145558 -216838 -150249 -516203 -202826
20169 166261 -309359 -104989 -143663 -291685 -40297 -101023 -115360 84976 -225010 165674
20158 -129406 -119957 44054 -224866 -475115 -149437 -145620 70488 -440780 -209269 117769 -44504
20146 151411 -153932 -310696 -64027 194842 -24130 224322 212921 -156971 -220765 -28210
20135 253118 -24923 -15696 -72829 -440365 187738 -25520 171757 -204890 192333 49116 111862
20124 111862 141829 141055 -86482 -60516 237778 -22820 121315 -23028 -60673 84044 -296060
20112 -173079 -284518 234332 52029 -253876 -487748 69183 85886 279697 -23249 -144863
20102 -144863 50413 73295 61518 -72947 -78767 45853 15278 -82763 6577 -131666 -146885 249674
20089 -26355 86131 -16145 -37527 -105633 -157403 45609 103682 121527 5055 -29974 -9402 -125307
20077 -125307 -46829 -60470 -168300 11196 -159412 60302 -45915 26980 -246339 -65707 64295
20065 147385 25348 57006 -208230 -3721 87277 416587 -55294 -160407 -391400 -41837 -222750
20054 -222750 -197554 13248 -116447 -44690 149375 -89444 124613 -362288 -147740 26467
20043 -51983 225906 100664 -120761 -119491 -50506 42189 -175803 -169843 -322227 111461 -36326
20031 20272 -393282 -13027 -2975 -124425 -110920 293001 169654 40263 63688 -199377 -67190
20019 127762 -65328 -197805 -147063 142042 -109560 47235 163359 72952 13252 4344 288777
20008 288777 -410656 -221903 -55108 2335 -108724 -96923 -56972 -109630 183438 -38885 -214206
19997 -214206 297173 -210253 -102808 78140 172142 55460 -50371 132876 17396 -20134 4718
19985 -116201 -277580 -156784 -198825 -202331 56291 149878 -145557 64973 -308290 -203179 -187006
19974 -187006 -125155 -14362 -46225 -18962 -117416 32801 -90282 -68297 -241130 66184 -223134
19962 -8916 -78248 -446527 -102566 -241935 31385 -152724 -117151 -159554 -308122 37661 66072
19951 66072 -44866 -190403 -308299 105051 12863 -18940 -210961 307959 -185320 -413194
19941 -413194 -125184 -106906 -212226 -173211 -220168 -29976 -12785 280505 -95820 210758 -105382
19929 -178433 97131 -113714 -24911 -66099 -99397 317991 -190080 -88259 93271 72408 20795
19917 122558 -328136 211011 13751 -135582 158915 307148 55524 115391 -120545 156541
19906 -153173 36617 -178516 -286274 183983 -210645 -74495 -209086 246372 -449066 -129993
19895 137691 -383014 3138 -47363 49478 388513 -93708 25108 162507 159268 -329412 177180
19883 204860 -206681 122451 -297016 -211378 174271 -282346 -112357 -142982 -95613 -228216
19873 -228216 -2906 -42852 -354479 -358888 -59656 12619 -103183 -283067 -177380 -58956 -3681
19861 -64532 -268973 188662 -131583 -147152 118950 -448259 -49935 -82161 -31229 -108388 -149577
19850 -149577 132763 18994 -183478 -252259 -162616 -171571 175638 -145977 -173769 -154776 131808
19838 -209761 -198836 -357616 88622 -368207 -208441 16055 -250312 -215005 -119941 365085
19827 -61444 5326 246664 -67076 154165 -365197 -24081 117601 -56271 -392695 -211122 -203955
19816 -203955 -219993 351286 140489 -3819 -77963 -133543 104092 -37105 -286017 -182600 -68431
19804 225474 68766 -137777 -226897 -394606 -234273 -273330 107279 -122539 -44140 -129809
19794 -129809 -390279 134150 31075 118953 151354 -127971 -144743 -74557 -299216 -285057 -141727
19782 -372381 -331645 206409 -122674 71116 -66988 -67211 294082 10 59 -9148 -266555 2151 -202275
19768 -87555 109200 32141 28055 -166374 112452 -436960 -115295 -449727 78790 32187 125031
19757 125031 -90416 222029 -299086 47566 412398 31564 -126798 -125086 -102113 -241805 -168920
19746 -168920 -66363 -59738 102199 101606 24523 80249 -4152 124140 -41777 91171 -6528 -38695
19734 -38695 -80918 151399 95868 -228038 204226 -241660 106646 -64545 84553 72785 -164206
19722 83877 93295 -99894 320825 -204868 -84020 195413 -164583 -100612 -10988 -88591 127471
19710 -290051 -381554 -177730 359104 -129153 -11208 -128658 -29549 200877 212162 69948
19699 -213011 61702 -135304 -185690 4383 41649 -70376 -148052 14430 -322174 -118131 -366308
19688 -366308 -212480 -68741 -44625 77644 -27225 -78352 -221882 148287 37569 -213210 407184
19676 284716 234758 -61712 137497 -301058 30429 -88119 -174091 -35564 -221234 -80090 87071
19664 -207683 -54736 -190540 -53365 -143202 71712 -27968 84782 -415008 91202 86620 80436
19653 80436 -308873 352220 -21852 -53012 -82735 31739 -71254 89089 -227605 -244045 84821
19641 -136202 -140148 217849 -27273 -182620 224630 -8617 6930 -654 134742 35468 -179142
19629 196939 -180556 64105 -83866 160272 -397740 -36025 -23952 166371 148982 208007 -140981
19617 57860 -48457 -423605 189451 -7880 31043 -115539 -353290 -14774 102795 -148572 -115449
19606 -115449 -42093 -8341 -339402 -148920 183363 67863 239339 33221 -81849 154686 -158866
19594 -96321 -208379 -296528 -283057 -206823 -59684 -46462 51959 40688 -17316 -105397 87997
19582 84320 166092 -242234 -218429 -32171 119531 -12186 -257334 -67749 -209082 178988 -317178
19570 56388 -297325 -13003 -238269 -207599 -415811 86216 -71145 -330446 69371 -182974 -99913
19559 -99913 -163312 -253185 -31829 105032 -81132 148508 -129130 -125872 -24807 -59533 149348
19547 16369 -67316 445765 -84609 -93619 -211055 131399 79882 -224819 -180463 256610 131878
19536 131878 -103516 298296 53682 -41424 -6836 -69934 -213477 110338 89599 130986 59431
19524 67987 32490 -133003 -9095 82512 85023 236028 36962 -408745 193366 -24171 -96316
19513 -96316 47284 -62395 7440 63506 -78488 -181862 152671 90802 93644 -117038 124626
19501 -197125 -120439 20485 -79006 -481768 185323 345115 -380243 -469215 56473 238891
19491 238891 -72845 -77895 76333 -67194 -156418 -82508 -169498 -108388 -156455 64317 -118549
19479 -55850 -283604 -386513 -218213 297402 28393 -172625 -44186 -111041 5737 -270720 -165463
19468 -165463 -146237 -68931 -26706 -217766 -232071 -34656 -50803 162455 38105 227673 114354
19457 114354 -217383 -71657 172596 -435841 -347173 -118025 -316932 -97878 62535 39546
19447 39546 -8560 -56048 -261176 -139306 39073 -384785 -244058 317650 -158529 12448 -141268
19435 -472635 -135106 6645 1656 112076 -154729 -296863 20291 -23515 -21757 172291 -272322
19423 -222217 -311558 -17647 -92500 -139530 -106783 79476 57944 28233 416014 49941 145569
19412 145569 -305435 35774 164825 96923 53180 -207244 12045 13050 -133601 60919 -98952
19400 -394461 -218197 -64962 34567 64413 -283698 -117670 -26715 -225840 -386380 -103278
19389 35909 128280 -45018 -168377 -271096 212424 65608 -122435 71765 48979 63005 64020
19378 64020 52935 -51047 -388081 -127744 -330015 113168 -391239 157543 -99154 -238385
19368 -238385 114068 -159561 218952 -44166 -178461 -283452 -277660 308697 -25941 108016
19357 -394403 73534 -190576 198230 -72296 3014 106409 -136420 91682 -142225 -94945 123074
19345 -168371 -135232 222744 -25276 -178979 -55132 -304323 -142853 30652 49630 74330 -205887
19333 210833 -23978 -198661 56783 -279686 -220350 -70616 54342 -109444 74346 251730 118808
19321 83825 -175091 -55218 65561 -101177 -256264 -3322 -133468 64861 -169392 51501 -163749
19309 109329 73921 -47042 311062 393535 -67959 -213626 284620 -19515 29901 218922 -33856
19297 -9048 -241387 -61477 174728 -220119 105212 23884 -222693 -116129 -114549 -268351 -404599
19286 -404599 194322 -206368 186589 -141359 69890 70208 -545859 64598 81772 162454 -293575
19274 -261601 59018 -52256 159172 -161559 61924 -109901 -77968 48952 -18411 -70604 -180627
19263 -180627 -47292 -117470 125978 -262814 -13203 -359870 239793 -108407 -120972 -23348
19252 -217986 -443123 -140621 58561 70232 159252 -8040 73737 -201213 11015 -204114 -273059
19241 -273059 -122016 55028 -183424 81462 -200670 -133692 -103396 -7353 -92917 349381 -115904
19229 -92002 90726 -87129 -329807 -15952 -526853 63731 -108955 -376564 -247280 -17835 -95243
19218 -95243 277756 93424 239105 -142176 23906 -11269 -178059 -7160 -240098 5882 -522740
19206 48983 56094 32484 -46435 297156 10196 61668 85478 108776 56720 152721 -140669
19194 -258929 -213335 152089 -122108 -137714 -144974 152564 -27301 29014 184938 -141935 -35778
19182 -217415 -160473 -304361 -328214 -28873 96300 -129979 -157121 61506 -31363 -53153 -217072
19171 -217072 52282 -95264 16438 163462 48068 54200 53363 41806 -303191 -158575 8053 154886
19159 154886 -84087 -73474 -52023 198460 -156308 14451 -162265 -113822 -120202 -351948 -69257
19147 223750 -325460 -215843 -148198 -47167 -400980 201707 -10003 -114211 251978 36516
19136 -52799 -312670 -56858 97389 258196 -60345 242761 15841 99058 92418 -68310 99402
19124 -372287 208589 -186863 -87449 210890 117423 -416065 63526 -134263 -36462 -185861
19114 -185861 -35737 -295667 -256419 92995 -77693 8097 -162790 88830 -21836 17559 -178188
19102 -211496 -329753 266817 -262488 -261512 -98101 -121780 28035 -47873 -328079 -87546 1697
19090 -82579 197350 200859 -178581 -206478 -53303 37648 27368 -185492 -199145 404240 -80129
19078 98480 -5343 32305 76151 -7495 -137029 -167899 225626 -223228 -29579 -220593 240740
19066 -103445 -381329 -77392 -74716 -129093 -521245 -262664 -42293 -282868 -81042 -26605 -180877
19055 -180877 -76695 -90377 -75079 -194550 -149587 94845 -46916 -71116 11967 -99328 -50755
19044 -50755 43306 153346 -2782 150626 96513 -68281 -42613 269497 -125358 -154813 21441
19032 27123 264911 101628 -235453 65462 281085 -15983 -335698 -340715 -33359 -156186 -66901
19020 -135706 151787 -116183 100936 151961 33123 124080 -211507 145984 -318674 193995
19009 -205973 -290830 29659 -48287 -45571 -123649 3514 -390701 167826 179568 -22465 -106008
18998 -106008 100570 -171920 -140019 -93276 -205849 -99724 37888 -43607 -95974 34044 93339
18987 93339 -261703 -41076 117199 14624 -277367 -97867 -212120 -291166 -5322 -272690 -34597
18975 -273859 -101851 131265 -74039 -10926 -28705 -246487 138850 -204412 -109652 -23094
18964 16290 -10204 -129381 -31328 -174297 -467225 -180777 226371 11432 -93285 44764 -168704
18952 327401 245338 -211398 -18163 -7730 -16087 -67950 -96383 158217 -30597 302981 -76904
18940 99321 72765 292036 125712 -130892 -5956 137924 -199 -137232 218185 -36303 -187496
18929 -187496 -148793 213893 -203708 67170 -124176 218573 -4049 31550 -305571 -107844
18918 -91996 66246 -87520 -125572 268650 245011 203856 -469552 -7531 -48979 146390 -107915
18906 -37152 -144678 231551 294075 40672 -99288 -223932 -100515 -373405 239837 -125515
18895 -107841 207130 -111667 84065 -138718 -247229 -165468 -302175 -219947 103669 46006
18884 -68381 39014 80031 25290 158784 -17759 -14268 -137129 -301614 -301155 -136715 -312008
18873 -312008 14101 76748 -177185 -87683 -225356 208924 -53496 80601 15693 42154 -193083
18861 -78775 -71765 -226549 237718 -69286 -2406 130059 -243366 -336451 37886 -164196 -515011
18850 -515011 -170015 -241781 -235858 14108 70178 442673 -232098 14614 -1424 -329327 -367859
18839 -367859 -277108 -78180 -10786 -14943 -145401 -78916 53250 -2628 101337 -38569 -39666 -33840
18827 -33840 -106388 -291460 30015 -27638 138758 -80144 10067 18474 99598 94489 -48507 277624
18814 98858 -273379 30152 193208 -26196 -149177 -81657 -48606 106859 -34672 5469 246729
18803 246729 -119839 -181475 -136091 -75767 -45038 56238 -41393 -211238 68748 -134036 83316
18791 173874 146287 78939 -301673 129844 -103056 -60391 258387 -169547 -334587 -421713
18781 -421713 -64778 -350020 -47817 29052 -30446 -100235 -234239 8008 -60440 -415220 -211008
18770 -211008 178981 37656 71170 -147506 -84949 -248323 118774 -62428 -130691 -94536 -134314
18759 -134314 306838 86967 14308 -85549 -237972 -47559 -47825 -151383 -32349 -68577 -252826
18748 -252826 -152716 -80707 151638 174496 261754 -220727 -119039 152142 -198165 -129593
18738 -129593 -214588 -70677 49986 -11983 -148750 -81254 21522 151634 -129449 32983 -59601
18726 266953 -103786 -116218 -116422 -215181 139657 -379239 -35170 368069 44954 -93317 -212185
18715 -212185 -180455 37877 299591 -7557 -96881 -10716 -155838 -154919 -243085 -9167 -185737 -165738
18703 -165738 -16230 -34353 298646 -103081 -227650 -63970 43590 156995 -63982 167179
18692 358193 201398 -248511 -173722 -179032 -15134 91610 7121 13531 9055 139559 -29431 251700
18679 90951 -187747 82985 -119140 150096 -141318 -239961 -42014 22520 24837 -17228 -371958
18668 -371958 -380496 29836 -191166 -114416 400936 -132637 -454530 220895 59243 101348 -187912
18656 -53168 -194653 -230486 -18759 -256223 -32555 297860 -104588 -189220 83514 110470 18547
18644 -125713 6130 -21392 214832 23099 199291 191123 -365390 -219517 -350157 59176 -14
18632 -98453 -385640 -187854 -133312 215942 -243007 -221592 48671 -18296 -263090 -121840
18621 -188449 -6165 7597 -525824 -273058 110568 -271793 35093 -32649 -267441 -54944 -137752
18610 -137752 189166 -80805 -260459 107706 10515 180676 168070 -401029 -11216 119861
18599 -325401 -201411 -21729 -200377 -35596 167384 -70903 17108 154505 -195936 -110463
18589 -110463 56479 96467 -127893 47084 -197381 -154725 -85176 153268 66765 -436099 -260403
18578 -260403 78556 -168088 254485 -140328 -87256 -109813 -260911 -336373 100769 -178720
18567 33656 236595 -94228 -297437 -196908 -18128 -6396 63640 -69797 -349554 -69997 -133668
18556 -133668 140276 -322345 184722 -28168 -104543 -40228 -203218 289160 -164952 -99791
18546 -99791 176833 84375 -30064 -321706 -17614 15639 31022 116277 -160303 14917 108722
18535 108722 -234834 -131106 129056 -43856 323533 -137469 -396929 9987 -98359 134033
18524 -39493 35830 -197402 -281822 -256961 -63069 144881 19750 -185483 387251 144692 8042
18512 -83080 -121376 -192267 -76913 -98442 -153844 -93305 187740 -124108 -102666 55509 -278999
18500 -88014 -105101 -82910 -166621 -42807 -161931 121723 -75182 -152528 96113 -305124 99016
18488 -247574 211954 66675 338299 56694 209403 -29801 247266 -36310 -115388 -12027 -184804
18477 -184804 22446 197841 237304 -252218 -225534 -148760 -422979 198131 62490 -23473 -243023
18466 -243023 -182574 -65461 11999 64449 7445 -139342 24461 -126362 355091 -28979 150015
18454 -130512 21513 -287681 -218946 -79458 -49786 12871 81925 -155898 189833 -327110 -88755
18442 -172584 124969 -122815 -399747 -32805 70068 -239916 -223776 14850 -70630 97736 164726
18431 164726 -221905 -174491 -21795 -69758 -428553 -98261 -81177 -149485 -239585 -238818 -78327
18419 -5649 -33493 84592 49888 -91663 -162488 141708 295842 -386150 -146132 -361445 -104103
18407 -44969 -15133 39548 -178780 273476 61969 -245424 -397939 -4257 456342 4147 -175564
18395 104648 -63097 -76722 264160 76263 394006 -445485 191438 -212621 23287 -286791
18384 -96871 -111399 -57911 107855 -288706 115331 -85108 52647 -265424 -167943 -65216 98474
18372 160138 102698 -308886 105686 53133 76463 254058 -77641 -97168 -129335 119294 10035
18360 248945 218281 -232221 -202457 -54112 339777 70653 -124453 -39979 33708 48272 10864
18348 97623 -153853 -92071 13474 -236456 -574495 -217489 153811 22601 74950 226809
18338 226809 178324 -311193 -118203 253196 50811 -122791 -195935 -192430 25182 -239670 -71146
18326 -30632 107008 129836 121271 -98892 -301226 -65296 202887 116297 -80349 96673 69989
18315 69989 -158081 14267 -243416 -99838 -149811 -45109 318675 -209262 4368 142067 -145311
18303 197190 258896 -157411 -49073 10545 185250 -73631 -205610 -264584 -82063 -133073 251451
18291 288542 72893 -123410 -275823 -144770 187381 -221779 58134 60023 33200 107725 -13126
18279 -10390 114882 92186 -63063 53560 -265607 -55432 157903 -44198 -439238 70292 -160228
18267 -80575 -282037 -45137 -44539 -150605 -257320 -10417 -346383 -104151 907 -28998 41639
18255 78020 -186741 132736 232045 -232924 192007 -177932 -1240 -139128 -146479 -256711 -101558
18243 133843 -58736 -114419 183933 19268 -316814 38910 -93721 51364 -103841 -336673 151741
18231 -166239 -518841 -335454 -28344 195159 -143554 390147 42665 -8263 -98340 -238429
18221 -238429 45563 -249670 54186 114589 -129482 -90923 311579 -231238 -141255 27585 452544
18210 452544 188560 140829 -138560 66862 -249062 -42119 -309083 91095 -38594 55253 -233655
18198 182856 -338765 132942 318557 -36136 -88819 -270943 -22734 -125474 -6480 -118978
18188 -118978 -35241 59308 -144191 -172892 -21011 -195663 -111861 -63772 -108122 -329863 133805
18176 -70476 -361744 -134874 162951 197946 -184091 -104623 63537 -31245 129341 -181956
18165 255433 -59562 -185857 -443045 -63702 176461 20710 -86028 -17756 -9323 134496 67087
18153 -44139 -52378 120684 21665 -167221 181450 197979 -92560 243111 -71862 2264 -84997
18141 -90270 -146896 -159080 -194589 54697 -148806 -61790 106314 -47058 86375 19611 52745
18130 52745 -571433 -280742 -216421 -271365 -50917 -95639 -40143 -34878 -6522 -100950 -82998 -214835
18118 -214835 34985 -488701 -141692 -264706 -72280 -55318 -26074 -147496 196106 97601
18107 -37381 -214087 43121 -321576 156811 -70137 -156487 29673 128682 81950 -145120 187778
18095 -243246 169779 -145779 7315 -157537 -71394 2964 238081 -12655 -186338 -67318 -68163
18084 -68163 219334 -125375 420225 -15212 -8215 -148448 214598 252014 -303114 177088
18073 143345 -98830 -119047 186993 325775 347038 166133 -59479 78198 307521 -59695 -188546
18062 -188546 -140070 -113176 -148377 -65180 -9807 -29137 -238103 62414 106064 20297 164607
18051 164607 -423014 -646019 -139300 365144 -51963 -342940 -58207 -272651 266601 45224
18040 -25130 -347086 34988 219786 -83996 -18409 34100 -102939 -247584 -142819 3368 -377991
18028 -408540 21316 -197402 -13387 -155732 -44180 28193 12319 174486 -73079 -166423 -140153
18017 -140153 -63338 51003 -56688 -75890 163393 -213917 169737 -178700 75915 -77378 -67244
18006 -67244 -145350 26732 -247855 86518 325531 4729 -262975 -42800 -29074 -150772 95919
17994 -68450 -140807 37453 147456 90812 82098 -315108 -97310 -117553 -22702 194921 204327
17983 204327 -31000 -188395 -17322 -184725 13843 210846 -9873 80203 -258209 222553 -123285
17971 200550 104034 357092 99330 -149630 -198779 -236189 260482 98072 289507 -217999
17960 70239 -82990 -244478 218189 152359 -79803 -70302 -22653 137218 -89789 150238 24716
17948 -171228 12827 247879 -22585 -141328 -223962 -231635 122214 -134201 -266461 -296958 -77627
17936 -21516 96542 -50651 -94710 -291900 -34503 157571 -240607 122172 -43007 220844 -266778
17924 125150 2067 -71905 -173373 147928 107570 -182562 82870 188475 334612 185954
17914 185954 22001 16608 -318783 -60297 92380 291291 -64275 -15948 78124 -121302 -157745
17903 -157745 56788 -30723 -145523 -80495 121242 31993 -28000 -68984 -158189 295139 38560
17891 132753 100253 -180155 3900 -68945 152932 -52130 63411 30715 35881 327887 124949
17879 -8768 -33813 -8125 -214902 -76501 -44799 4798 -232031 -81922 -283488 -218116 -290931 6376
17866 95927 336151 -328234 158117 90803 -271823 217069 -31475 -113103 -241860 -226122
17856 -226122 -59190 -67021 9359 34415 -125099 125271 149089 -93582 -50159 -84065 165533
17844 27441 -401493 -261000 -24133 -92330 -172957 -140303 -105975 105150 -181924 4482 176043
17833 176043 390921 -22605 -108380 60547 -33018 105068 -79452 -176343 -159616 116878 -229917
17821 -179108 99697 -300460 248350 -24080 -87323 157700 -107957 -186668 436911 -24619
17810 42092 -324219 -168981 -15966 249036 -2862 241233 46878 126577 -455218 70357 -227168
17798 -145013 -24206 -21233 3486 285171 117432 74388 -168874 -44957 103056 153198 47107
17786 -257248 -76110 49063 376239 -1809 -127789 -35580 -245248 112794 412455 26042 220667
17775 220667 -103867 74649 -263742 177950 -114350 152697 -39482 274355 -62466 15446
17764 269776 -270818 -321687 -36256 -157030 381609 -82436 -97216 53086 299647 142228
17753 90414 332812 -65166 -23309 23400 259130 141983 159381 39092 388934 -55634 -59495
17742 -59495 137089 146283 172561 -259578 11613 78567 -194303 -47945 -92267 19504 -64100
17730 50238 -250447 173281 5831 -4880 -30386 1591 -221426 21380 -14632 -300204 132971
17718 155628 -145214 122838 39373 -136753 -67473 108089 176025 -8247 157119 -114274
17707 -197081 8753 -12542 26568 -102695 94110 172912 -145513 127503 232814 275739 96560
17695 -321721 181922 -33373 -203980 161793 160550 -7894 68266 -14677 -111808 -127535 -202122
17684 -202122 127172 -118829 156535 -109941 -137417 -65141 -128325 98023 115732 76367 -144957
17672 157189 51721 111928 -2463 99606 225360 184005 -202023 43380 -45325 -170017 -127834
17661 -127834 94362 303685 -84856 -155626 161254 -204541 90144 -133246 -225743 262042
17650 -70523 83140 127407 -109258 -153323 51327 35006 -22305 -17972 474345 -202337 -207571
17639 -207571 650 -495979 -226380 85631 58231 266 165129 -21852 -57899 -318035 202276
17627 248801 237761 191447 -90121 101477 113932 -85595 127339 204302 4969 498895 19746
17615 -205789 -244143 59362 -90669 -104115 -59030 -180143 -168109 -286050 -32599 -279683 192419
17603 73778 87297 110183 -177995 83344 -501569 129888 58005 -349041 107273 -41107 -89301
17592 -89301 208588 -18093 169920 -74638 13190 92838 17154 116278 90556 471402 -4905
17580 182452 -18517 375609 -107323 -12225 519833 -318700 -94961 -173471 145376 -131747
17569 29942 -258983 -133987 311041 -32399 -102208 414346 74216 -69835 110984 125081 379941
17558 379941 -90876 -53521 -42779 49710 36259 24123 -207380 206873 30261 -145778 60610
17546 53725 -180185 -37551 220988 -314261 56375 -94376 -100331 -184511 -108035 220301 88919
17534 -60761 278749 196296 -214603 -13789 20537 192517 -38186 -107064 71709 -50604 272824
17522 327666 759 -85126 393870 -203397 70846 -97919 22254 -33173 360769 -67065 -59323
17511 -59323 218070 -25072 -104796 4634 149100 -48666 24293 19813 87883 -21337 69293 165772
17499 165772 -27848 -172102 45545 -39529 44578 -141828 295739 -27108 356391 15433 59321
17488 59321 -98017 189887 134608 168713 -130586 116988 1813 -7929 186054 140497 60409
17476 75677 313453 172382 155603 20243 142286 150818 365160 207832 74628 -7259 327584
17464 117008 -31591 356679 34302 201253 -74390 212234 238171 233431 -150703 100734 316553
17453 316553 197874 -50012 287938 688793 325017 476815 141548 79603 399114 400686
17443 400686 65470 347843 91401 419648 282992 332521 125075 321058 196731 325713
17433 325713 154213 590704 266441 373006 302004 377715 94753 170174 314651 281532
17423 281532 344619 515404 -131191 69590 243407 394382 371855 91913 129183 245303
17413 245303 163240 177197 236796 252794 154233 455607 45201 100613 235268 221002 57021
17401 9086 -80210 348368 109159 118892 53495 208800 96466 87689 63448 147917 206476 31920
17388 369350 -268480 50222 81020 70458 -29696 144396 209945 18914 32652 -149023 88458
17376 151463 213163 439097 83891 -107358 -120221 80858 66268 243396 -3665 288166 297059
17365 297059 -80246 129505 73830 375270 34156 28242 61116 135848 227795 151256 492966
17354 492966 70048 236305 88673 -43372 -171122 -327518 269813 235408 -13449 193997
17343 390567 100279 270641 72797 430506 141094 201325 -120416 349626 103 145185
17333 145185 568314 58891 188935 235120 18071 -5095 514921 -166901 222456 -251300
17322 1355 110202 170227 -8398 208637 110905 253690 321601 95774 -81120 249763 -143461
17310 205090 52443 305028 436899 240764 -117548 129498 -217270 189204 8610 212178
17300 212178 -352753 315158 -174513 650400 -186069 361818 334301 92222 363867 285164
17290 285164 -6928 297099 112719 66171 -27230 194650 176882 17274 267101 100297 -120741
17278 97203 103680 30513 404946 139130 94557 485262 120162 381426 153854 130466 50687
17266 247169 -16217 199984 116036 17748 181881 328836 33883 -52717 15050 337803 224098
17255 224098 73115 236910 100228 468858 36088 -19727 632534 200950 218161 63229
17244 410105 53455 259920 261717 608387 131932 377152 144349 195774 362272 334010
17234 334010 401675 175323 521696 206083 203027 79911 230876 63469 119072 36398 503114
17223 503114 -56170 124201 -36828 620740 -46012 260456 118128 282565 212573 152694
17213 152694 397577 140337 -224398 75772 400045 174832 151228 272739 256666 394243
17203 394243 107600 465198 404635 157441 148699 54206 295183 -6570 235042 298308 406010
17192 406010 227467 36457 224225 312720 230636 260577 277417 265050 212653 25287 213331
17181 213331 575404 212023 485216 448226 366021 224472 243373 359833 321122 368270
17171 368270 157233 35614 -98272 -13175 34769 156697 565929 350287 151113 144439 427648
17160 427648 7393 363648 411253 344060 278739 134648 426307 11226 37760 319229 114116
17148 410943 373640 322822 361774 252458 309081 304251 79998 420733 228865 333152 -98617
17136 144308 321851 556792 288615 596506 35088 -49066 146632 581409 263958 376209
17126 376209 182127 333290 259270 658769 314338 413209 593875 287187 278852 660852
17116 660852 373434 274554 222542 274855 623723 354082 131654 556145 463947 246890
17106 246890 629652 660592 290979 650992 154557 441603 287914 267160 280231 392506
17096 392506 463871 187185 307261 541267 604345 415218 103461 394408 575546 338507
17086 338507 420968 454705 753784 557186 485093 298668 520108 908301 173299 31506
17075 532919 638785 436589 332848 797344 474227 344909 549931 570423 379592 626290
17065 626290 211917 678207 347366 265202 429590 545884 409071 392868 564878 360877
17055 360877 294970 442561 484803 650015 307466 396290 519511 479211 450663 645371
17045 645371 430464 418956 143844 507923 549868 586280 711363 419586 758691 578200
17035 578200 406182 635232 551832 648689 637073 643588 500436 652693 394540 672096
17025 672096 427619 499285 659473 629942 604539 597742 678896 608429 782144 644542 843214
17014 843214 670675 612708 919182 396477 661122 587893 906856 299788 819556 860789
17004 860789 398274 906001 801686 945917 655836 866229 890807 955004 667183 991416
16994 991416 1004282 1003772 860061 753456 864268 487461 856222 960791 680170 730310
16984 730310 1115448 717344 387254 960667 956530 750495 711541 858697 966508 811620
16974 811620 862434 862580 1193059 822496 1079147 1297275 998356 1117112 960815 1224540
16964 1224540 934670 1015651 1148775 1131787 1042150 913595 971522 1085281 919510 1181110
16954 1181110 1245819 1117578 1620714 1033435 1019766 1125905 956276 1075406 1286603 916672
16944 916672 1285641 1410079 1514812 882472 1083788 998446 1120644 1102183 1405765 1261201
16934 1261201 1130275 943975 1134439 1089842 1457226 1314529 1580840 1159230 1695978 1225952
16924 1225952 1501511 1381036 1561409 1354368 1691424 1352992 1474903 1567675 1825188 1427156
16914 1427156 1637438 1674854 1865013 1580512 1622038 1789609 1569295 1666579 1886028 1640784
16904 1640784 1821759 1876787 1395124 1966983 2008340 1843569 2069375 1924157 2064459 2016841
16894 2016841 2322556 1977781 1753043 1885358 2258891 2320770 2115649 2266473 1885593 2105178
16884 2105178 2373558 2103474 2597661 2328231 2242294 2523164 2016426 2121425 2243683 2431556
16874 2431556 2583308 2657157 2583341 2524971 2719279 2674291 2414336 2510745 2513539 2542073 2644978
16863 2644978 2847541 2455393 3039719 3130355 2897767 3022856 3089326 3284232 2945751 3311560
16853 3311560 3456498 3041905 3323577 3373307 2979330 3538585 3488323 3650474 3356281 3838286
16843 3838286 3821116 4006334 3882541 4079323 4079041 3903373 4116071 4373512 4096742 4389703
16833 4389703 4269326 4572896 4430675 4565363 4948906 5074947 5174585 5365805 5327582 5285130
16823 5285130 5357067 5552907 5604783 5770285 6368120 5845228 6112614 6198346 6490921 6780971
16813 6780971 6721258 6859466 6569967 7024588 7188755 7312667 7774836 7796201 7871823 8169296
16803 8169296 8264184 8499919 8490252 8848759 9151077 9334739 9425929 9781812 10169483 10308943
16793 10308943 10302737 10869476 11098314 11075877 11606565 11942563 12430854 12676221 13189509 13309567
16783 13309567 13636603 14228606 14525326 14908676 15348301 16093109 16456331 16744702 17651278
16774 17651278 18075990 18572505 19504768 19936202 20851237 21325969 22265552 23079666 24022348
16765 24022348 24803819 25754657 26753391 27742965 29130389 30215838 31484713 33092572 34192899
16756 34192899 35825448 37528116 39718069 40981355 43589744 45314351 47478046 49998849
16748 49998849 52592806 55261614 58389561 61003600 64535590 68445456 72028551 76466284
16740 76466284 80554445 85407585 90412944 95609797 101314484 107035525 113318474 119955508
16732 119955508 126850743 133655230 140692525 147931788 154666621 161950715 168451296 174305037
16724 174305037 179572521 184133951 187672896 189918823 191197971 191346396 189773630 187512421
16716 187512421 183557134 179090659 173509482 167248930 160575214 153548850 146017118 138675708
16708 138675708 131595973 124262311 117539699 110786119 104530813 98255354 92349666 87440236
16700 87440236 82221617 77345676 73141053 68993413 65277676 61450338 58130874 55172117
16692 55172117 52374988 49325056 46642985 44593495 42343033 40235334 38554058 36216782
16684 36216782 34757759 33364643 31935605 30354011 29248682 28024544 27081419 25438914
16676 25438914 24550742 23551024 22945312 21919882 21084242 20341818 19540876 18660611 18089618
16667 18089618 17916259 17042041 16217043 15678488 15544607 14766944 14463898 13876898 13074370
16658 13074370 13077431 12590611 12287444 11645938 11417552 11126640 10542809 10540192 9999323 10227764
16648 10227764 9662582 9470472 9178968 8964015 8876754 8493463 8202170 7895412 7493802
16639 7493802 7378926 7215990 7499230 6821154 7034949 6521824 6516084 6594378 6323916 6306558
16629 6306558 5947941 5526271 5750121 5739845 5229272 5234474 5022961 5242235 5151237 5102013
16619 5102013 5297746 4426966 4595496 4439026 4448373 4491707 4432446 4385879 4011928 4149025
16609 4149025 4008154 3846120 3910076 3806386 3624606 3682652 3474824 3508781 3446678 3583104
16599 3583104 3414335 3358777 3035531 3298157 3242229 2939512 2941843 3062923 2567166 2859830
16589 2859830 2711842 2531929 2551307 2563381 2729080 2580624 2865366 2432739 2628007 2430855
16579 2430855 2234889 2409651 2432531 2205549 2329957 2142156 2206364 2304520 2012612 1977613
16569 1977613 1992268 2178318 1958569 1990296 1870290 1949445 2091968 1866424 1762420 1772205
16559 1772205 2109726 1832492 1521824 1544645 1794845 2084400 1938874 2017994 1812201 1508666
16549 1508666 1634111 1552154 1369052 1849912 1243389 1302516 1552629 1058130 1139911 1366038
16539 1366038 1449271 1249309 1292713 1477993 1438473 1366162 1277682 1468747 1090025 1112707
16529 1112707 1073927 1031334 1009008 1175151 1239844 1248883 858001 958300 1379547 1215721
16519 1215721 1148747 1058835 943857 1069571 980617 1180438 1132834 1078657 1058335 892730
16509 892730 635074 1040184 1132851 1090909 1220590 838795 780481 990172 1052821 770433
16499 770433 1114900 1040962 641243 1097669 1123960 679337 661700 952744 1099862 543140
16488 818487 595957 709638 527240 1024442 654789 1051265 496850 617859 474886 423732
16478 423732 769874 758780 563242 728878 924840 652548 667135 427124 723510 421657
16468 421657 705038 696294 755502 655251 712219 448557 678598 579818 753031 555957
16458 555957 665258 667832 490969 961340 495855 603330 367735 541007 504003 503828 702261
16447 702261 557470 577828 341847 857946 368291 462395 422221 276741 628750 549740
16437 549740 657794 742970 461907 436341 255094 664545 399794 605436 221258 493543
16427 493543 361533 372449 512027 715237 175521 380781 549353 622058 224487 485899
16417 485899 543318 489454 234639 411066 381148 495348 871380 126147 423949 450601
16407 450601 434374 163491 442488 416964 286246 416735 225663 375749 -90708 326071
16396 385281 415010 355422 347402 299537 481135 421932 462533 162708 643613 521786 188118
16384 663888 437573 366701 652426 143500 598131 187334 118420 272761 345932 611149
16374 611149 371612 227650 541739 358330 550663 255519 -67291 436214 444544 494900
16364 494900 300407 272494 260584 147212 225909 20708 251834 271717 292060 307472 333865
16353 333865 418549 450434 4547 334298 -18181 135141 181919 78685 105933 283009 128217
16341 283169 282483 121172 282835 275076 -155700 -16732 344707 69635 79152 169541 -3269 204522
16328 407107 237147 408923 -5416 238231 254882 100220 397180 148094 446707 180185
16317 -36301 330569 132746 -5722 43295 187279 28571 256045 52012 238669 125927 228030
16306 228030 -4104 488474 212213 142477 34641 157335 284008 69256 -26673 -31726 193446
16294 346880 114435 394059 -18776 102877 91840 184790 260345 209394 209771 142370 133375
16283 133375 217438 149988 -27565 200425 189904 342326 43897 300837 251711 -11283 -19923
16272 -19923 157660 184 199676 -259987 121056 -1351 199687 123628 -52293 320405 225380
16261 225380 106057 180110 89645 246440 464948 215716 49 370980 -99832 368633 34887
16249 48499 -246752 -57628 31692 -27261 -19923 169702 20324 164144 191440 92679 -427085
16237 248004 -282549 396006 168760 405022 448712 -125136 -71336 -120324 13947 187557
16227 187557 -40274 -134602 -254479 -79167 254947 -110161 35606 156511 44439 188443
16217 188443 173274 187458 -40326 -75981 129639 98245 91904 -20868 -116321 75558 11003
16205 238335 -61804 226880 -122897 62769 273182 264213 157945 78179 -200194 105628
16194 49776 110203 183603 -55710 8849 -128490 -118478 -85463 151252 151995 67008 72025 192460
16182 192460 -120961 98776 74964 -33586 63893 -313023 -94598 344276 48853 -164540 184495
16170 -219693 63091 -117023 37562 51022 314174 -62504 17693 209822 119555 -193686 121022
16158 -208123 239061 -66348 176479 -266642 284862 -60923 86018 -269782 -5109 -223799
16148 -223799 -103065 28495 -55164 183969 169363 47913 -186214 -63269 -18617 -60436 7003
16136 -315763 -109287 136181 -280437 -29811 57586 -112972 -108680 -108808 -147534 -213294 -228147
16125 -228147 176520 -52438 -140352 127772 -188904 54920 -269561 124265 149351 215744
16115 215744 -68479 215228 18372 188888 156245 49889 215846 183157 33161 303273 488409
16104 488409 130311 -46627 309740 267786 386288 116581 163878 69233 -41015 -181722
16094 -181722 41643 57108 -8058 216803 -79307 73569 40389 -214356 -85863 269442 82755
16082 -195046 3849 155887 -197789 141100 -13772 130572 -1519 14540 -250020 43705 8972
16070 144275 -146295 -89258 -108381 -31033 90040 292496 81142 -21449 -493286 81296 -85256
16058 276153 -133072 -161593 -33977 -91913 -91729 26250 -221085 -124105 79427 -51519 189055
16046 -266474 362679 146831 -193513 71668 -16117 20319 -281964 -19008 -475679 -318893
16036 -318893 261830 -151764 -11636 -95218 -119273 158670 59587 -264474 311752 75048
16025 56550 74011 -36611 150891 225789 -93023 174267 28362 -173202 -9793 -339507 -4228
16013 -269899 -276552 -96157 -266998 32981 -191096 -44747 55009 227435 104060 -174450 112197
16001 -69245 -57128 273701 -60447 98494 -158424 -242868 283225 -92478 -85872 7310 -3801 59977
15988 63748 -18599 -19546 95412 318939 151378 -169257 214927 51839 50361 13603 -185201
15976 288968 -1234 112619 64730 -109800 61031 71094 11458 56352 -45376 -204323 -45898
15964 39989 -36685 12397 94579 397734 256765 48687 -93860 -83514 104164 167204 26114
15952 -90165 135102 273836 26873 146628 -70255 10373 -207804 -27848 52771 -119841 -131303
15941 -131303 -207282 -298379 -189604 -82046 185455 128306 -50753 -162861 60153 -167983 -9504
15929 3782 112341 -86167 163801 32525 43573 103479 21018 17968 -392531 -128117 -138977
15918 -138977 74066 106568 -303113 14437 -99354 -48022 -253739 1550 -128302 3805 360484
15907 360484 -1463 -368218 157987 -154953 -240699 -238419 -345102 1958 55209 -173732 90313
15895 -84862 89230 -111684 98070 63111 -48526 -348142 -212476 -71645 62443 -128185 -93806
15884 -93806 145896 -336907 107672 50261 -194927 -124534 -393072 69167 209544 -159006
15873 36520 -100368 -446191 -80640 -164420 -301159 -187959 33788 52571 -115521 -268240
15863 -268240 -17871 205818 -170842 -127303 -97945 -125610 78822 261550 14672 -64030 -106342
15852 -106342 152684 -86079 -42457 -63960 -183398 358400 24643 -358290 -163757 131385
15841 -18039 200372 -54284 -87728 -155177 33361 -28361 326906 -189437 -18375 -339688 10077
15829 119907 -32065 -347210 -215024 -95697 -97936 -35375 57077 -154033 30442 -13905 -316140
15818 -316140 98568 -60054 -49037 73026 -47004 -47899 -177226 -136208 -266733 -208546 40698
15806 49772 -68275 -190312 -101090 -71796 70806 106811 -1081 17276 -30642 121259 243625
15795 243625 7741 -465028 -53357 202903 396370 -136995 198941 -123245 -132183 113341
15784 -60620 9193 -302356 105977 177320 126149 313403 -107441 -170578 68241 -426067 48333
15772 188209 28783 -180705 8950 -351018 -144652 -134951 -186642 -44466 -51502 -61832 249323
15760 123260 78091 112073 124052 -91163 86426 88443 316805 49205 455511 154892 261548
15749 261548 -229388 11684 -123500 -79273 -8701 87689 260566 189603 -6609 -73257 24207
15737 145302 -274529 166561 217457 -44828 -128212 -112853 -2502 42995 -86944 16314 -3947
15725 39373 -28539 -96989 109443 -142909 -258408 -91944 79136 -106070 -36651 -280375 -482257
15714 -482257 -296528 -136290 191029 148 -285074 -46420 -64969 176884 83729 109208 -42501
15702 39149 -99100 -48029 -121397 -58362 -268828 -91437 123028 48237 -89957 246163 -114315
15690 -85002 113128 -21973 -21473 -200749 -2026 3834 181093 184271 -66812 -245665 -178614 178762
15677 109739 -85980 472725 162333 181644 -20567 187942 159075 93132 372706 -256661
15666 -252042 16393 307083 -332388 383996 -9904 27104 64561 46177 -429616 299708 23940
15654 61988 -304599 210549 -133088 65629 -4794 -57405 -92256 -362996 350829 -228374 -134925
15643 -134925 -123704 -43220 -163476 -103974 70624 -49163 -230917 -567401 104134 67950 172871
15632 172871 -31172 -193918 43975 186520 -141171 -94686 97684 -272946 -6305 -64216 -94975
15621 -94975 129273 10987 82156 190249 -198478 -130111 80492 185426 -313977 10845 20035
15610 20035 73537 223995 -273913 -124043 60584 -306126 119294 -112505 -269691 -172432
15600 -172432 211182 -138507 -232968 199689 48012 321724 -164436 -23032 -102995 4431 -362584
15588 11638 -206130 -197133 37693 44186 34673 48372 -139924 -280593 -168127 -307912 -138730
15576 -315911 152235 57808 -120911 235947 211876 -30591 112256 -195007 -378809 -97991
15565 -53330 125152 -24782 165774 317965 -183342 -100951 -198376 160416 198117 76175 -95598
15553 -178450 -78798 236669 -488073 56941 158298 -52649 39066 -127257 -13545 -69144 67372
15541 -258541 95539 -33727 95488 -72968 153333 136809 12489 6995 -122298 105936 -195658
15529 -22017 38719 144070 52029 196917 -226357 144751 129851 -106193 -341481 -67404
15518 251632 -220416 219556 296740 63363 36645 56750 -132704 -59499 216491 -119943
15507 311908 -189524 186136 -138862 81283 138019 77320 -181588 58176 178474 -71384
15496 -86966 14144 136725 -40661 -190387 59511 -38545 127351 -13165 -121447 180079 -101580
15484 -57486 -213898 -66827 39187 7280 -185173 -100198 -117475 -92969 42264 64206 53022
15473 53022 -396643 -108388 57255 -29380 215 93270 311476 -86925 -302282 -55720 -109360
15462 -109360 89445 212832 103601 -11394 130888 39927 33746 24774 153280 62163 143028
15451 143028 -564 -194646 -97620 -168717 183932 38646 -121907 156040 145516 94740 -31434
15439 -44757 70454 15923 129775 -160734 294050 32348 63009 19154 -108099 -237131 -333752
15428 -333752 -160911 11098 438427 -113757 255798 -74545 -13219 -199414 -202017 -52205 -245611
15417 -245611 260137 -11819 13047 -80793 -141403 -47338 -33119 -122133 247194 -142692 -363758
15406 -363758 -196444 167282 -3287 182010 -34033 69149 229755 26828 171087 -236264
15395 -96501 -166474 -29670 408616 -72721 95592 97764 -134815 -54947 -309276 -182611 -10574
15383 -214738 -171090 -187255 130908 107810 12581 -66322 -5340 6499 30579 -182700 130432
15371 -175266 -234616 -338253 -5175 -98596 -188789 -75387 -133291 128920 -40666 -394000 286405
15359 -100913 169190 110819 -216909 -180330 -142227 -167295 43861 -380272 -171602 -60684 128237
15347 80317 250032 163272 -79141 66487 100245 -66008 -43433 63464 -12724 34929 -259667
15335 117918 26484 -121775 -166312 151171 51622 21984 -171636 -237375 179398 -60291 115581
15323 173808 -16907 -162498 -218071 256693 -54662 254699 -410830 175880 272109 32407
15312 154672 -137936 -259466 179475 -128170 359247 110770 334072 -357154 85096 -14948
15301 184700 240370 153464 226515 20780 140911 45845 115461 -44685 67021 288398 21921
15289 118293 300419 263573 281528 165559 -43705 -314251 69215 79779 -88053 105533 135794
15278 135794 235045 18251 335817 44670 -153874 270793 106369 246839 -117353 13758
15267 125127 -126890 290971 203125 -89617 90838 307127 302539 72806 -19830 -28365 -32929
15256 -32929 51694 69100 198000 47904 -53846 -47746 530638 334011 116552 907675 1401611
15245 1401611 1516912 1475571 1268371 913167 497686 145074 -109985 277569 -73761 -1643
15234 151100 246080 -81186 376821 6414 228001 288587 98378 214822 38201 -171465 -87324
15223 -87324 182921 -183613 311299 -50731 -61387 -110897 6498 -20765 -62667 -401131 14599
15211 17964 60256 24674 443685 -369861 27146 -60793 127330 -10337 -165657 -59205 -180427
15200 -180427 -14389 159472 -35214 165567 151203 54036 -3864 271652 17047 52568 -66727
15188 362211 561173 91624 268666 -124270 -88315 -129609 188664 -131123 223333 83568
15177 349512 248489 17141 242734 -256189 -242980 -226661 -10994 -29611 128666 316239
15167 316239 138409 186137 157511 168774 -93833 -98845 149287 168877 -257054 321918 80437
15155 314130 -52146 115784 12338 221457 97257 97938 -16134 265921 428522 151266 218076
15144 218076 375478 130197 -46172 293632 202738 16368 -119272 -8974 -50664 193108 -40698
15132 -111439 108585 -117727 117850 214063 140636 178884 122061 255986 350874 123615
15121 217706 131088 -107261 -54113 319394 316937 -415011 306193 -80844 -31964 233862 -160213
15109 204922 307876 -155343 -91539 249607 97678 80044 570348 93731 -78136 170674
15098 76756 301099 -33061 98061 -56267 -130984 45753 180962 113902 20362 38722 97244
15087 97244 157396 -140556 26520 -263461 207681 26498 -78640 168052 293140 137399
15076 93333 508211 120472 246193 339389 135544 72550 131127 243710 160209 95067 192748
15065 192748 -333091 320886 301947 -162786 14422 447600 455646 245600 78138 17072 98880
15054 98880 -21928 295000 8063 339388 -36009 98807 40394 306156 100111 15471 102294
15043 102294 224859 278073 -100824 223911 341593 284746 336694 201752 -55539 56858
15032 68735 49307 266819 -75154 90542 95373 294159 -81957 131576 64656 71413 400970
15021 400970 62510 145683 213400 -79577 12676 134730 -110652 83408 456175 572089 287313
15010 287313 -29080 88083 398278 293605 49853 101173 249590 83147 305987 216976 114729
14999 114729 116851 101886 229910 -91098 265910 287396 427322 230146 214405 371204 126866
14987 244134 267274 406700 66352 204200 284313 235923 339294 -18845 -150451 283819
14976 310747 123224 139302 227241 221785 45707 -49074 -5299 -57732 337281 119628 356564
14965 356564 229637 304379 111086 267454 247237 129757 119475 154053 333650 -63358
14954 262670 136643 275194 -11474 213350 185365 380850 160168 -193849 376009 336066
14944 336066 232183 362550 211400 400903 324842 477096 27097 161786 408691 7323
14933 -85884 375967 -46200 246148 358798 181847 253870 -25757 146271 276207 158553
14923 158553 143461 492613 161278 -29111 42453 182422 69943 113887 325084 361834 59985
14911 334907 436309 259663 392579 328971 209518 397001 230069 351970 252723 243289
14901 243289 357691 458347 471725 462490 277444 60615 359224 536978 585561 324838
14891 324838 319863 272305 298248 382140 267665 366253 618876 217053 162944 345499 194165
14880 194165 449455 447263 287640 401128 302796 282789 300277 239657 567913 353113 823682
14869 823682 323794 188470 565063 113757 291720 454132 290177 317405 405295 504971
14859 504971 418651 535393 553868 750640 642351 596448 76412 195988 201515 374329 125501
14847 262178 104393 576925 474238 457984 238674 314100 197075 89578 531763 751234
14837 751234 708434 51573 415096 662432 34793 547203 202108 321367 361408 96904
14826 334023 442227 355157 609256 372598 694186 669971 655980 660523 634239 605331 541977
14815 541977 391001 421184 739019 667451 666453 497839 494052 487707 268385 507733 463801
14804 463801 646236 454158 728751 303791 250491 651679 383470 222702 553880 649652
14794 649652 752624 331639 815547 597480 606396 714967 340793 530852 564565 623043
14784 623043 520987 204907 894752 373211 607785 273308 518240 605431 590491 414628
14774 414628 718881 865306 505439 497788 699632 795358 468040 653258 744212 488741
14764 488741 581964 787737 417481 667853 746010 753691 618080 801842 627819 550588
14754 550588 662657 666525 456172 739624 630610 871929 600379 575328 729114 836446
14744 836446 558681 539457 719101 552325 1001307 722384 948274 407732 689078 313050
14733 966223 995245 890941 814185 677937 900805 999507 705187 596560 670468 821479
14723 821479 891252 1054178 860481 952841 1066381 661536 511040 757079 1104163 862295
14713 862295 694427 675707 796258 987897 934757 858734 772868 931443 668564 725707
14703 725707 538027 923237 834422 751779 798253 694145 638868 1142097 855346 833811
14693 833811 748704 976349 915033 855302 775571 996609 748505 941277 1068680 830747
14683 830747 909621 1016549 940742 688454 762077 647543 658634 806726 1073816 1093830
14673 1093830 1396973 1215792 964150 973935 1190442 1040140 1074160 976008 800655 911689
14663 911689 1050709 1078510 1172867 1047974 1155927 1080041 1131742 1050720 891911 1236156
14653 1236156 1103771 1098798 1222584 1115951 1344443 1139109 1060421 1271575 1214628 1155809
14643 1155809 1131235 1377292 1222210 1099774 1396420 1309472 1128073 1413902 1322430 1322020
14633 1322020 1303439 1063256 1335904 1456464 1251643 1339458 1044856 1422805 1334864 1231197
14623 1231197 1262172 1347566 1341657 1678864 1394993 1378874 1295800 1482116 1460014 1549135 1381253
14612 1381253 1850391 1395128 1533690 1723451 1421510 1464555 1582580 1136145 1673476 1681327
14602 1681327 1685262 1562252 1672791 1585923 1532053 1719516 1559473 1651002 1792941 1638073
14592 1638073 1559180 1918722 1807527 1839706 1815219 2063204 1883986 1936275 1924376 1974420
14582 1974420 1941668 2040890 2078152 2250952 2306415 1888088 2136676 2264048 2550331 2215066
14572 2215066 2234526 2250081 2428130 2331683 2479726 2442136 2398461 2350073 2781077 2541116
14562 2541116 2646866 2475507 2565950 3042760 2914737 3294339 3081806 3459137 3677811 3834006
14552 3834006 4379218 4673719 5685458 7413775 11894538 21173717 38843690 41400120
14544 41400120 20865431 10496430 7672708 5729938 3478873 2431404 2249907 1694732
14536 1694732 2073930 2158705 2040802 2013507 2050626 2136208 2314917 2056491 2261130 2331481
14526 2331481 2248836 2177007 2594348 2469110 2328776 2411435 2875236 2557480 2768235 2475770
14516 2475770 2697096 2624680 2954950 2506217 2985058 2578978 3023331 2760708 3198006 2897009
14506 2897009 2931078 3161530 2922380 2944167 3248523 3201764 3386425 3009377 3099065 3365808
14496 3365808 3170672 3572935 3294259 3462060 3651622 3246671 3456726 3404262 3527409 3803500
14486 3803500 3655762 3546998 3621429 3898651 4172977 4211899 4037083 3916048 3949111 4314017
14476 4314017 3976053 4177049 4120320 4281770 4235225 4447572 4087422 4600143 4450697 4605950
14466 4605950 4886187 4919933 4569695 4571628 4574612 5212764 4776552 5008199 4902452 5161057
14456 5161057 5010654 5268527 5167583 5317489 5264130 5232246 5597840 5499383 5423416 5749470
14446 5749470 5796936 5765140 5691360 5972662 6046900 6219142 6210109 6407673 6325480 6375166 6982888
14435 6982888 6582646 6516570 6914550 6790995 6814387 6996631 7165094 7242821 7161800 7124801
14425 7124801 7519299 7632296 7621274 7724060 7833006 8060043 8212697 8263591 8100768 8152055
14415 8152055 8859973 8861444 8935003 8892754 8851789 9283366 9202480 9624606 9710127 9571938 9974571
14404 9974571 9985137 10306177 10411020 10396844 10521333 10854797 11194363 10710779 11388549 11340418
14394 11340418 11693981 11957363 12334613 12137484 12861457 13107450 13334533 13530114 13387003
14385 13387003 13766468 14105992 14171217 14477308 15119887 15213848 15350396 15646012 16104379 16491748
14375 16491748 16672187 16847381 17022897 17671152 18234741 18437301 18871783 19202949 19476048
14366 19476048 20264429 20301113 20724460 21302587 21483727 21902164 22724051 23387478 23396277 24318732
14356 24318732 24449140 25179994 25370339 26527336 27112864 27637445 28420384 28884419 29608754
14347 29608754 30245558 30957544 32107028 32577161 33424388 34626651 35133588 36116403 37345486
14338 37345486 38222615 39106694 40525939 41591067 42647091 44051311 45059416 46715677
14330 46715677 48216313 49647317 51124581 53013609 54489030 56396327 58099275 59911825
14322 59911825 62003898 63961819 66456000 68707173 71366641 73564926 76332918 79454607
14314 79454607 82259506 85470203 88778129 92111117 95634636 99765241 103688518 108274408
14306 108274408 112626266 117694686 122631118 128394072 133708547 139693996 145755937 152703073
14298 152703073 159634741 167316488 175251944 183436235 192241586 201822581 211493423 221871543
14290 221871543 232846046 244239266 256180940 268491024 281550222 294802009 308131850
14283 308131850 322372974 336952074 351172327 365585415 380121512 393992564 407569487
14276 407569487 419910410 431438953 441140052 448025701 450964622 451404545 450166387 452138371
14268 452138371 451062809 447954095 443888598 437277817 429223432 418576229 406263472 393357811
14260 393357811 379625812 364880399 349715732 334687377 319378535 304509199 289801495
14253 289801495 276411724 263959400 251130107 238650326 227174031 216045201 205376321
14246 205376321 195456872 186484365 177980783 169335971 161311833 153906556 146890680 140013211
14238 140013211 134346750 128688456 123045583 117617104 112808330 108035352 103892507 100097973
14230 100097973 95848473 92478615 88835391 85248978 81882115 78713861 76174399 73179565
14222 73179565 70843282 68506859 65948179 63897069 61656436 59452174 57658584 55803916
14214 55803916 54283331 52465949 51080748 49612962 48000704 46336230 45400012 44595920
14206 44595920 43049800 41459531 40090821 39296768 38165974 37467150 36523609 35378600
14198 35378600 34371395 33533528 32581334 31777803 31248665 30122743 29554989 28720610 28258074
14189 28258074 27472458 26479243 26046232 25471130 24919966 24317755 23837941 23285297 22974557
14180 22974557 22508807 21776363 21690282 20933000 20491172 20086312 19849678 19378269 19087024
14171 19087024 18384390 18332381 18015090 17584294 17320741 16937687 16738314 16316158 15827011
14162 15827011 15887300 15360951 15459113 15068907 14369067 14387979 14258308 13843426 13830806 13578264
14152 13578264 13321469 12920422 13203342 12615771 12806943 12552855 12266419 11981620 11904082
14143 11904082 11740523 11255870 11484727 11035131 10989551 10864389 10764099 10635985 10548541 10391731
14133 10391731 9909825 10111805 9731189 9781378 9366750 9352210 9198005 9476532 9000343 9050137
14123 9050137 8623338 8748189 8830671 8051082 8121294 8060005 7708767 7940788 7663611 7451543
14113 7451543 7518435 7702446 7485080 7386371 6957164 6926322 6905041 7078640 6992939 6985079 6924202
14102 6924202 6691078 6370578 6810953 6309683 6365480 5989622 5868744 5916188 5871339 5769869
14092 5769869 6136541 6011584 5543839 5542969 5397543 4996464 5318998 5657471 4917705 5062914
14082 5062914 5637578 5157909 5194125 5173423 5205209 5077633 4785741 5081381 5000119 4549855
14072 4549855 4756445 4922658 4627991 4733288 4535283 4523141 4464646 4370659 4158521 4275167
14062 4275167 4282497 4200745 4329703 4210168 3912953 4079425 4267219 3768771 4119478 3938265
14052 3938265 3661482 3752864 3717554 3773596 3936369 3656223 3336734 4076840 3184873 3822282
14042 3822282 3578558 3312940 3458164 3347722 3201027 3553538 3531870 3326482 3315514 3389230
14032 3389230 3324777 3332016 3461664 3393916 3256237 3188253 3132147 3262925 2859591 2668121
14022 2668121 2913616 3051879 2765968 2907033 2609432 2943382 2555398 2680249 2820340
14013 2820340 2847506 2478402 2634884 2787270 2455822 2516528 2433310 2632553 2216968 2611472
14003 2611472 2419509 2474360 2279509 2520295 2211669 2103681 2658524 2201738 2482490 2712776
13993 2712776 2063461 2125042 2377053 2804516 3408334 6578647 14215156 32755172 43165394
13984 43165394 27279950 15168628 8946426 6132214 5017232 3737725 3737574 3377328
13976 3377328 3331861 3000458 3062836 2819688 2732459 2607995 2801073 2755573 2429226 2786717
13966 2786717 2536776 2425204 2379401 2390532 2162186 2308244 2463158 1934709 2206712 1835209
13956 1835209 2496469 1857743 2501088 2006967 2126393 2677492 2053668 1905734 1959832 2106842
13946 2106842 1986641 2067051 2056394 1867487 2079424 2012287 1937551 1579684 1886541 1881983
13936 1881983 1775520 1781073 1754411 1619367 1822267 1690185 1631574 1944178 1782554 1408517
13926 1408517 1926267 1987481 1547244 1624448 1761641 1946374 1599766 1512383 1466867 1725900
13916 1725900 1842566 1589514 1709661 1887938 1795702 1751027 1693241 1489388 1454898 1658488
13906 1658488 1237045 1679942 1542622 1791359 1660944 1360968 1285920 1398057 1207208 1567227
13896 1567227 1572262 1516970 961295 1463295 1400742 1397592 1304513 1384749 1424745 1555479 1702845
13885 1702845 1450170 1335058 1469083 1110366 1484973 1062716 1278236 1521221 1181993
13876 1181993 1563548 1285832 1077113 1324535 1133817 1295961 1335151 1394007 1257876 1040592
13866 1040592 1169373 1154980 1071830 1266467 721406 1277427 1128313 1561197 1254255 998292
13856 998292 1090415 1139759 1022650 1213262 1130283 915845 919628 1182425 1021437 788067
13846 788067 1221346 1220631 1305205 961819 1179645 1142844 903733 1114200 912128 1091918
13836 1091918 1192104 1299671 1085037 1007141 1060899 1069795 1152210 1150809 811218 852490 1016963
13825 1016963 897524 996742 1050667 1023618 674052 1421562 898031 1112389 1223361 1048426
13815 1048426 1018580 940792 1079449 1001633 1137220 1264688 683586 710563 919442 1025175
13805 1025175 862245 897480 1112791 675729 784174 765170 741384 421457 1064711 799005
13795 799005 585588 956003 1000233 833743 733557 967321 869259 872879 1053615 832829
13785 832829 731475 928203 578598 810859 809850 837371 926273 621202 1124047 331126
13774 903486 669924 559979 989767 446638 991338 656384 852681 471883 847790 1050983
13764 1050983 591111 704903 640199 423026 1162570 395674 762825 996908 840524 767109
13754 767109 615036 740468 587458 555688 616790 848015 786262 726455 768798 516656
13744 516656 717822 631328 663487 771938 489999 375269 389740 784168 560698 604267
13734 604267 520708 651456 324582 712930 622588 506700 666022 563617 447384 486431
13724 486431 393138 571800 215554 426168 461460 743680 358812 486967 811969 535811
13714 535811 615050 718493 641373 780291 453845 801988 713464 513623 684782 482773
13704 482773 629863 665286 489950 560028 378227 495645 588753 610835 734507 669577
13694 669577 831775 428621 630504 749705 658394 307260 391979 726563 574129 731623
13684 731623 515386 432689 710317 782311 216107 536660 694641 521364 762336 393774
13674 393774 495591 518884 678573 634049 645000 713086 684063 359533 530884 430873
13664 430873 433515 637350 544088 292940 604610 346086 397080 693127 440147 331809
13654 331809 562955 786161 847991 347242 125461 112178 605340 345566 473916 427067
13644 427067 253860 260956 284316 678987 -48264 130710 166240 300911 422327 586238
13634 586238 132757 449202 179050 156951 489623 277355 305980 486906 314528 415360
13624 415360 676430 117209 200221 143399 601581 720227 501239 390824 235656 438008
13614 438008 527611 81815 616379 660268 24828 410781 248348 361469 132544 707883
13604 707883 680265 525119 291896 577239 260916 177159 595501 343525 548261 350480
13594 350480 553136 256577 411266 666443 235577 296446 270952 503576 386547 326196
13584 326196 172787 505787 215540 -50626 447336 197547 462956 452027 373194 221239
13574 221239 107223 357359 363158 508720 323221 331602 528317 339026 -190978 176517
13563 458282 262915 265047 522318 765814 109896 569989 315902 551488 558280 500521
13553 500521 527243 503347 729065 129393 418967 206498 59840 398268 942373 323411
13542 434840 375717 212227 149297 419322 122607 166950 320829 359352 134539 351404
13532 351404 259122 14085 540577 177266 307713 480037 415953 494392 574657 607387 383114
13521 383114 357538 648029 357905 40534 374478 277949 353939 410557 619999 153751
13510 200922 373738 321615 410104 378398 400788 373483 336294 159960 429444 155460 547476
13499 547476 -63537 354538 342480 199694 728228 219485 457204 198567 188763 68429
13488 161574 136254 398835 288543 455354 242276 140622 -42975 433163 288530 -62408
13477 292236 157464 386527 182602 320742 184930 202518 482139 -97997 464056 103738
13466 269743 523817 233301 31952 249420 534858 69882 623486 276461 453397 105677
13455 143746 242943 288225 531226 389056 -283942 254823 19151 494477 124164 181470
13445 181470 283637 205530 181830 -28860 19965 449062 162498 559952 196242 216940
13435 216940 371874 161349 314011 376603 74143 -10232 -81496 333925 149703 309644
13425 309644 21206 248649 137952 223569 278666 -39788 328115 238386 162139 26804 441321
13414 441321 50033 268496 310991 137008 286692 262760 76448 267639 405921 176081
13403 188346 121567 348521 238066 150479 177574 -3344 -47128 122389 329632 100235 -34294
13391 465695 214504 13710 262017 187451 232833 237580 -13315 143967 321563 16417 61801
13380 61801 -135159 60428 309385 158500 -14467 303416 467986 200070 99242 252952
13370 252952 243693 324141 -44874 -59653 167227 312196 254683 151138 189653 9341 504091
13359 504091 236956 190722 536164 399654 292615 112719 201854 470070 -33239 344808
13348 289298 321453 -148833 154584 243660 463583 332912 157729 172345 17214 146492
13338 146492 97644 416264 421037 379675 413544 361366 66264 82329 -17223 88520 -14811
13326 43771 161108 123065 339178 152665 55203 -44270 338086 378355 410345 284250 -31163
13314 220833 631460 245352 210549 382326 137606 96278 224918 617571 135859 405952
13304 405952 182935 247681 105787 -65527 100518 327056 21950 42658 282800 -107480
13293 397322 112326 457281 70634 117426 132165 103442 77874 207553 177585 -15127 26143
13281 193159 89778 71761 3263 -49461 -91146 384271 -32103 200470 1282 273962 204248
13270 204248 -25747 199199 64486 98853 467302 53182 288997 116120 164931 85585 -283763
13258 46208 8899 255470 345673 59695 -131248 352864 96441 248921 -153510 255861 -47909
13246 306735 77488 171274 378807 83847 205019 356517 69984 266269 388508 63556
13235 290630 169551 321558 -34614 120607 174221 45049 271181 6429 259036 92330 -171702
13223 -97101 269688 152352 130628 104773 43514 87248 188658 -253856 -8866 175427 -180763
13211 530094 381651 19201 -33599 394050 246885 133869 101847 -74906 143872 282924
13201 282924 51114 153485 341388 211922 -106158 301886 84651 6528 72748 13031 74509
13190 74509 -212828 16573 75044 -66181 -82897 303280 -191867 100170 -41255 -26492 101216
13178 225549 78377 240728 201736 -192500 -105594 -173626 -55382 93105 157557 22901 69226
13167 69226 -65438 96727 380409 87993 117271 258316 -160022 -51119 204019 -184116 299178
13155 87227 -35359 334588 154672 148910 302898 20893 272294 199360 -174267 -24618 171510
13143 209045 -158204 132919 -216779 -132573 18364 298423 -350283 53811 276080 98344
13132 7627 -222348 77369 256373 344120 276524 415105 31299 320199 257364 122354 181490
13121 181490 55189 113206 105826 205408 284400 237962 122822 309798 -40820 246086 104012
13109 232552 135721 -226407 -270471 239189 -264213 98718 179361 243959 -280985 -9594 -60942
13098 -60942 -56895 -15472 78517 12986 129890 -15969 -77960 184744 30552 -187436 -37756
13086 98265 170509 518028 -65813 66835 53462 608 2830 341993 31122 -128266 223592
13074 -139763 -40899 -78017 211758 1180 153546 60116 173829 67804 52667 -89223 216586
13062 62617 150214 -96212 218232 363941 163532 -66073 418951 385761 -92592 -152551 158372
13050 109303 561301 24144 360156 -63456 51538 387333 212646 6094 83136 -118957 187302
13038 76509 -70604 191228 230950 103882 286773 -168615 -31795 47099 60979 34411 261903
13027 261903 -84806 129002 280752 164001 293066 -180685 71860 42410 -23241 54196
13016 -119299 -33245 134066 91856 515 48053 40095 295532 571951 351244 207657 285621
13005 285621 335547 90536 174760 448174 234298 218660 14531 124791 389809 -8551 140687
12993 504239 14535 404839 156905 251072 -1270 196303 155268 -122064 -130387 19262 414433
12982 414433 263778 186776 461646 -70690 3344 74055 21528 -30655 -309045 79313 154019
12971 154019 -164991 207304 207227 -273161 109743 227901 219926 234232 -118795 -133073 25767
12959 -9229 288117 150506 609292 -24886 85482 186761 586062 28477 223506 253954 47932
12947 328909 -130549 53414 -128857 -7443 -36001 -304182 13136 183086 85410 147820 -141288
12935 -231940 -321048 -42807 -94894 369 -144382 82671 -348101 436206 17278 341142 98640
12923 -111504 166208 140470 115007 162600 156031 -135569 280585 -256428 277538 68278 -112524
12911 379706 -227690 -100207 218814 -206662 183446 -210001 313214 -258464 259815 -149278
12900 40272 -50758 -156208 375470 4543 496838 5872 -66125 106873 59202 3219 136798
12889 136798 82281 -126768 105456 -18091 -138370 -74599 237148 107429 -56211 238893
12878 143631 237758 121327 -25983 158538 -62899 82230 -491211 123216 -43539 94371 182534
12867 182534 200310 -228727 -345568 317772 251986 -60056 -94522 -460 -134975 134173 -54552
12855 154716 -69005 -13108 -150886 252744 209761 228809 -56057 8488 215870 47085 71884
12844 71884 97396 55785 137877 166131 -216984 -89507 175941 157162 43434 -84667 20927
12832 44167 -18750 110813 168253 126985 -82269 46098 39211 -73463 31128 -62476 325686
12820 57872 170272 17663 67462 204491 214165 62952 -5554 41158 307247 -249084 -13574
12808 9126 84151 -87138 78575 -117487 -238185 132799 145091 29900 28343 215255 -400525
12796 -357015 61500 113023 -329102 43278 73168 178247 -185688 -226453 -54763 161234 94267
12785 94267 169441 -140250 -72092 264594 80228 185158 -107913 184545 108318 233418
12775 233418 -209272 -8260 85662 102845 -16279 77145 112036 -137224 -207483 282647 -115228
12763 210150 -169518 -81255 7795 163308 -247886 -35083 -175946 268393 -14135 172393
12752 -28336 -70409 -12720 178491 67757 135296 -205444 -116081 242567 -330454 -203153 64242
12740 -184069 76069 232910 192769 299586 91963 -154922 168551 236986 328351 81938 -96001
12728 264890 9844 368904 -79810 70485 -32551 178506 -279957 -149233 243206 147589 310671
12717 310671 126786 47679 231891 133697 101422 143312 -24249 -34197 61212 -107683 554387
12705 253213 164989 26312 114109 558562 182646 -249896 45971 340812 -336495 -81110
12694 57343 456255 103508 -68618 93230 74599 2918 -66541 6202 -223469 200501 -25722
12682 27011 151477 292739 238851 358087 152846 145330 92784 510039 571594 216036 205588
12671 205588 -22309 -273942 143758 -161069 173133 218263 -18552 -52121 165206 362503
12661 362503 266915 507084 249052 -99368 -87360 -272587 244626 36957 356774 193702
12651 193702 93031 555912 -9107 147623 -114419 182822 93471 93385 219747 -11511 -92231
12640 -92231 42511 101382 27089 -35258 41750 -24039 -3333 73542 -67913 64707 30913 58253
12628 58253 422102 203012 24162 412581 47421 230379 257826 361597 145141 64939
12617 159251 -231935 308913 -51286 -79953 13325 69870 -111593 85216 -38979 153613 69202
12605 -22472 -128274 -191725 280201 -102680 292669 109074 123005 297483 128212 47414
12594 78618 227761 41753 13934 270493 133155 -231855 -332028 -105006 -397695 189066
12583 157518 132829 422398 27907 71381 -184659 150249 36689 -284190 -237534 -386453
12573 -386453 20352 41353 -72516 112498 92193 -157622 330156 12049 243141 2762 -124580
12561 183922 -208113 -142452 -97947 -113415 360811 -148906 172120 33580 62305 89661 -232141
12549 -123457 287446 -210439 157703 30304 30595 -212235 -202050 289352 -80370 36328 -295552
12537 232087 395194 -34230 42280 42678 -70156 -26414 61790 221193 -3487 83104 123820 -16395
12524 144745 68009 146429 91922 188408 287945 84118 36818 271523 99096 -115327 87027
12512 55731 -244524 -148953 -44571 77151 151583 73299 -53223 113447 -81814 106982 170818
12501 170818 133059 241868 -16360 -1888 165112 -122817 85438 -246521 -172017 74593 -244037
12489 283261 62993 288131 -329099 -118430 -231502 -194650 371396 -108227 155884 42355
12478 9439 -105739 -76281 -29941 16968 203701 -219064 -175752 118294 193917 84880 -143182
12466 83782 -211657 47722 -151035 42844 51020 228348 187063 -291721 -84780 75028 145248
12455 145248 -22684 309807 188657 -166883 -100798 -115826 29498 171925 -372366 116864
12444 179908 -51568 45092 253403 124397 112203 -7008 134549 224318 309614 93173 186775
12433 186775 -318675 98641 -298455 -267799 -87435 -243165 127844 -124864 515875 -116496
12422 224944 -230274 -48975 -166068 -392983 37675 -78494 -112552 -135880 393352 -23348 217330
12410 -125378 15005 -225298 255522 -190700 328573 168451 56947 201887 -320030 87193
12399 104308 -287746 -25777 146036 11376 -13780 4044 -277720 -187880 -35688 -197742 -76453
12387 -120186 72895 32553 268302 96873 119429 -105107 -243777 -348456 -5557 390946 -215041
12375 87703 5362 67142 -219649 -223324 31060 37089 -46452 -95938 -46959 317919 -54098 369466
12362 -142832 -222551 397941 -66880 -72432 -19757 30699 66899 97413 335115 189855 -26896
12350 261611 192800 134270 143961 -207670 194552 62617 -161052 22655 -127084 -42355 240906
12338 77485 -111090 85363 255041 -206040 -157569 -52846 248704 151255 184863 44611 -186590
12326 350995 5121 240549 -159602 -87192 123760 40741 -61598 178074 -57860 63276 2111
12314 -363284 132443 -98937 -149853 265492 -92863 385570 -93457 3840 -108088 -132927 5877
12302 -46258 -124070 -182490 40592 -31737 248709 118689 -51136 161333 295158 109830 517317
12291 517317 497351 -11612 155002 -113265 68524 116918 -243456 -9665 -163045 112629 -78762
12279 206488 -44829 -137055 -257599 470791 122772 141376 266849 275709 188626 -31199 22746
12267 524971 429425 -76390 181617 152663 232678 -3516 -308717 306921 40507 291351 7847
12255 -102486 148543 78543 107580 -25331 161570 121699 180612 319946 80543 72427 274141
12244 274141 272426 -138402 199111 69472 -383392 329725 1615 15093 86195 61845 -130042
12232 -41094 123455 74651 144337 -33859 127258 368178 239740 194671 136884 137218 166271
12221 166271 421550 135609 302955 -169012 92795 428508 546776 168645 260333 326080
12211 326080 102053 53871 -132942 213367 19808 189350 284162 121328 8434 457357
12201 457357 128668 226340 400669 64618 124606 4373 136117 253949 111723 282913
12191 282913 120830 327564 3725 -111409 226576 20422 108705 400304 51030 156559
12181 156559 186904 68969 205654 166765 2183 74619 247694 -49313 74632 76296 224460
12170 224460 461251 344985 3917 -25365 188768 273893 -141308 -227059 39959 356903 343856
12159 343856 24220 334222 -77477 360540 347819 248708 41783 271725 289146 -120295 380503
12147 -14250 -288224 205192 150385 114381 168620 346135 -79521 188527 -275039 284177
12136 128884 -51586 3569 149961 26805 -86614 172408 -115272 -220782 368460 222737
12126 222737 -178678 80723 100994 134358 -160327 -174168 -50314 271244 -156405 -47363 -15856
12114 -309233 -93373 299052 212126 -64955 101177 -66047 181142 -233634 -329616 223691
12103 -91739 4050 41354 -31689 -36553 -19670 -316759 97534 -134872 72301 74040 36198 -102358
12090 -44484 -150442 207774 -137204 -22558 25273 79226 -11090 193103 31167 -40852 -108118
12079 -108118 -73239 183580 217319 -117044 -103073 268074 54971 59528 -113808 -120704 55848
12067 -26950 81910 -211046 91331 258736 96838 -90016 -133730 135681 103368 249195 462469
12056 462469 1828858 1426941 518320 451023 99205 238897 50938 142999 -104769 -40410
12045 234936 -119361 -79395 76394 260141 209719 11500 -181836 92417 82724 201791 -234694
12033 -265965 100511 107214 -13571 -27645 131530 53400 240745 -108167 -209624 -225303 -28430
12021 170768 -35853 37729 -198314 391784 140154 3595 135973 250352 114457 117410 341458
12010 341458 146470 168749 307921 133299 91737 -296301 133589 105216 126201 -43175
11999 -47034 -365846 -156365 -76808 -113508 175341 46852 -48122 -176233 251720 -167793
11988 -38541 101023 45629 86843 -70285 -290390 -63878 38153 -137860 -276331 52711 -12908
11976 22724 23481 256423 13025 -8561 30109 -74722 -160913 -38829 27515 142264 257351 182467
11964 182467 -99536 -34728 140699 163813 97019 -171195 -36159 -69543 -231766 76393 -163944
11952 -173101 108101 -143104 176757 -82426 71304 -17803 145787 28524 -114817 55119
11941 54609 352123 -54065 -166004 62583 138002 172334 162063 -202500 -151487 216699 2640
11929 224839 -44086 -371385 -271864 -200683 4179 -112884 -339314 -68360 325316 83954 112126
11918 112126 240061 37796 -361131 271596 149404 -3911 -106915 -19761 133130 76354
11908 76354 -9327 161669 -49120 245548 92524 17717 285750 81576 -34667 239551 126598
11897 126598 259782 -22737 -167893 -14960 -101875 -1299 -77198 -113812 -96260 68203 -156024
11885 -125320 -25034 266288 -210098 63153 -7423 -41911 106548 88955 -679 155123 78960
11874 78960 116371 53644 -145320 -213907 -125145 3404 177733 -221828 -15685 -193598 -377653
11863 -377653 -204694 -51275 -9168 -47411 221843 -80581 -18568 -181499 137888 145833 -183160
11851 39472 -228228 122967 40655 146611 -221965 289147 -312561 -217176 -65897 204171
11840 210586 335187 170779 79945 32208 19910 385878 -15757 -93872 -67929 -246397 368732
11828 -169276 -142116 -33624 -90133 -300415 47404 171681 109338 -61310 137506 -88963 134899
11816 244672 -126415 -71117 106297 165934 123687 63832 -154258 118938 -149806 -373195
11806 -373195 -382471 -19126 -148870 -199652 -6675 -31415 130801 69203 -15399 16837 178732
11795 178732 157087 323953 47134 -106765 -67549 -123703 70426 18330 -107992 -133608 -190856
11784 -190856 -45903 -206554 166394 -66957 -197046 -105560 -190347 80746 -132000 132881
11773 -6580 -230659 -60749 -205951 -80644 222152 26990 91851 236582 192942 -20410 98077
11761 -20437 -267176 -4152 10413 117528 34976 -123740 -115955 26762 176667 -115453 -149425
11750 -149425 35672 -221726 391994 -202856 -282964 57190 135159 -178758 59393 -207658
11739 138070 192462 54558 47214 -203950 -113669 153632 -11969 272352 174219 -371400 319435
11727 414190 64498 268103 127345 8301 70014 25483 107484 -100715 -20895 120346 91101
11716 91101 55924 31696 -30336 -33894 256416 301353 -101865 -41635 41048 201777 -286077
11704 -102794 -90910 364295 58058 -70479 -174563 -118901 322418 -4195 190175 39754 213408
11693 213408 148925 7502 -55569 49443 339182 -157863 -26054 -113623 -114940 -52964 393334
11681 297266 254362 220577 109917 67247 -97948 196292 21107 394925 247915 -88585 425762
11669 32322 10537 -366707 -10251 63774 -130304 -95538 25271 95377 78204 356495 155585
11657 204089 18454 -45556 177730 164528 247665 -111893 258326 117019 167512 57481 -81918
11645 -3306 140812 128560 -143732 -70702 236023 -214307 73258 236584 52573 -127275 -289819
11634 -289819 -26885 -155635 66022 101361 219858 157086 -404197 37037 243310 -166032
11623 -98407 -97128 144309 118480 -225311 104205 100413 308114 -247824 -50791 160102 225503
11612 225503 -419013 -61966 71300 -87509 -133380 -210225 110322 -224021 67698 132772 260972
11601 260972 -214390 -220881 101881 220973 -104425 266515 -166716 -110041 -1120 152541
11590 -28445 200362 170292 175829 64721 -119740 167899 132342 44290 92079 216991 231000
11579 231000 -13944 -20807 -55653 407178 463245 -235682 110113 -117062 37518 -57026 15171
11567 -117341 -82726 171308 36438 -14991 216401 335985 269778 245686 8718 231142 321473
11556 321473 -159849 115445 63178 10629 1194 309459 165562 296188 -61653 285757
11545 -214329 177772 205663 317412 112049 62486 259010 -231782 -62216 -22735 -36008
11535 -36008 90352 106293 -40121 217465 156645 377992 464854 12394 216794 -106388 188878
11523 -68488 260995 152481 180813 160656 192668 -39790 485857 15463 112179 234685 125382
11512 125382 342462 -12965 278359 151870 193559 215689 -78918 331599 61893 392703
11502 392703 346851 189797 -135489 -147341 327700 114908 224975 176640 68956 -26595
11491 402969 425025 147100 -24278 371341 70937 153260 358452 378813 260908 464060
11481 464060 321099 -11728 429562 -158183 107687 233199 135224 -316356 40967 204924
11471 204924 -80545 401210 138804 10290 -58914 104909 -111616 428551 240880 154059
11461 154059 -79050 494481 -227171 81007 414957 308326 160146 -64049 -243227 84224
11450 182005 73133 7173 -110007 256963 -123973 -541001 -64746 97837 -366658 20507 244122
11439 244122 343751 433877 -93096 -15795 -65712 224568 -68567 46440 220019 173580 -270054
11427 397828 216631 -30450 41923 -233119 -106666 -50880 265927 19922 -152420 24532
11416 162378 1566 -64954 -122030 -390626 1847 51856 -302405 -32159 -18012 -59208 -52495 -17289
11403 129784 57774 232142 160710 7325 -106476 282035 -70445 -113306 47824 138701 -62072
11391 -19719 -175692 -55362 125218 28602 -34636 157005 -165520 -40455 33172 128442 -343287
11379 -139322 -22516 4071 10605 284171 64972 201658 -84919 -296886 -131203 -298167 -47725
11367 217965 -223775 224184 -180604 -131957 37264 -119655 -63922 83323 166826 -82231 -343528
11356 -343528 43943 -67191 124932 -136716 204986 -216847 3925 21725 -23113 67493 23912
11344 52212 36064 -236449 129692 115081 -47068 -231439 22656 -146718 199941 52371 160020
11333 160020 -68903 -95213 30490 84141 269172 339873 64067 -107660 -171689 -101147 6896
11321 100802 202282 -83501 -132590 81500 39080 -77160 239189 -97787 -41355 142194 42443
11309 -160783 183367 114125 284203 179748 -109849 48229 -37699 -73187 -176350 -118892
11299 -118892 -259380 -150375 72658 -208631 -147396 398842 -322958 79544 43369 -52138
11288 110824 -123702 -192609 294875 196189 -2757 194225 44326 -100889 -165718 173753 47376
11276 -170045 -92069 114237 342010 -245270 -236676 -89689 -89488 58943 75390 -2538 201447
11264 -162117 -160590 153223 -199243 95906 179821 -51839 -240270 99632 -334355 -11043 165054
11252 11420 208621 174172 48547 239292 -311098 -222253 -94593 113743 -216874 75053 94025
11241 94025 -102058 -259083 231192 217261 412185 -150389 -184516 -5547 20406 -164210 -25771
11229 -122108 119626 115111 -307752 -77139 -133990 -198949 -372264 -37695 -343278 -599992 -341410
11218 -341410 -62917 15455 224367 -261797 -15972 147056 15890 100631 -80883 53736 -332433
11206 31298 100038 12324 -45657 -72052 -187562 15824 391121 234858 -192898 -88595 -106198
11195 -106198 305335 213913 -73578 -380342 86640 44773 -10020 50720 -16393 61110 -425645
11183 126701 149891 151407 71068 15032 28555 -298193 158802 -8000 315061 14193 -28093
11171 -94131 185778 -277069 70094 -185143 -146644 -190371 134616 255779 -80534 131028
11160 88256 -42405 -114399 -97087 -72359 361549 -112408 206485 145442 -56532 -92930 -87939
11149 -87939 69972 329180 -169242 153284 -166969 260110 324577 117526 241982 -67722
11138 -151747 37556 100401 109808 -267401 36602 493370 -885 196499 -204117 178124 -113346
11126 214889 -74453 27083 316701 29012 25408 9654 206270 190239 132020 -37595 75011
11114 61110 109511 216904 -42145 85722 46119 -104629 216612 -336830 191624 -73359 143636
11102 -35070 -44356 59885 141314 279752 355188 46485 89545 250324 68934 297559 42399
11090 226719 170134 -205018 47340 230780 147222 194471 151476 38710 376626 14703 276432
11079 276432 231016 211717 406318 296269 161715 304811 306867 86845 282612 262864 469102
11068 469102 248331 464427 118581 251563 7572 675984 388769 428267 634291 581354
11058 581354 156641 737826 605816 815528 907659 633786 493931 479216 694698 927198
11048 927198 686471 587850 736871 1132154 803288 727283 607859 925046 670477 842703
11038 842703 715456 442924 881510 695426 711263 699888 672802 755063 901302 451814
11028 451814 482485 679313 674166 711649 1005799 557437 683701 673215 150960 621200
11018 621200 802006 477757 706157 567217 238938 494279 890169 349671 500456 572711
11008 572711 528134 346296 618582 236735 770448 647421 873733 546900 1066212 1060163
10998 1060163 446804 990773 804824 659273 689029 677600 776237 506009 689142 406951
10988 406951 714074 942708 1017635 867755 916032 959788 1153089 1141627 1199540 1107281 1520951
10977 1520951 1325520 1288596 1855773 2141218 2078866 2736694 3044392 3114289 2600721 2660031
10967 2660031 2892826 2841728 2010969 2176129 1723621 1775751 1879045 1834397 1432785 1710792
10957 1710792 2088631 1776602 1586295 1602035 1349191 1394550 909268 790365 960476 638735
10947 638735 971436 348032 492240 -11860 501053 177657 136216 321311 225202 462923
10937 462923 245595 36183 583345 -172966 247669 50634 -91235 205595 101056 139705
10927 139705 -22059 160875 361281 -65062 319441 67430 4590 168431 111387 186009 -90590
10915 -295085 -122581 -12218 -10004 -16584 207522 113676 98239 75477 181294 -86768 -103062
10904 -103062 34149 145187 -268386 70018 -484122 -48512 8958 -160192 35294 6688 -276068
10892 162237 339524 -1915 -387291 -202100 17821 15729 165312 50092 33263 75657 -149447
10880 1524 -335452 -91416 154771 -104852 -46086 -180712 230158 79048 226646 -144193
10869 164665 50181 -143209 -70423 -72623 250794 139087 -206162 -203741 -231051 56726 127080
10858 127080 28049 -6902 197344 84150 22495 -136762 282499 187671 275151 -155250 59588
10846 -56297 100043 -57311 -134658 97172 61437 -92596 -70958 -227606 -11555 3697 -248084
10834 -237149 194164 -197663 84478 143112 203227 -385512 166186 -56559 -286184 175078
10823 7742 -254156 -16994 -218503 -209389 -83715 90326 300591 -28463 -11993 58019 -3769 -53657
10811 -53657 -123802 -38501 -119505 -70937 -220345 -319398 151031 -139222 15257 112616 -15817
10799 110400 -153478 -232346 -314023 37309 -74192 -113787 169916 -296746 330233 140364
10788 -51261 107093 -261277 -247995 -318683 -188667 -182439 152273 359874 -40396 17884 -3033
10776 -82476 -141990 91252 10252 -47062 116590 -201238 -288594 71732 58954 -19817 41272
10764 100052 -55932 119922 -262344 -174034 33990 -149011 -241499 -148095 32500 160490 -14478
10752 -238418 442494 -59324 -57342 216749 6311 -168178 245368 65106 93015 123175 -143400
10740 100666 -22013 47880 130256 -186392 -81916 21583 -121616 9060 -126964 -97212 -219830
10729 -219830 -107561 -172277 90902 16796 -267074 118830 -161060 125399 -7366 -8215 240774
10717 -274653 171499 -44335 -2261 -229547 -26188 29934 -29265 -14745 -120904 -252139 -91923
10705 126341 -219075 53065 -53578 -31899 2644 -225600 247116 83866 -61721 -137905 -125216
10694 -125216 -148737 67471 -14413 65907 74996 -106797 -18558 -54724 41115 -72822 -89220
10683 -89220 -312677 -207437 -378036 19110 114002 14262 -167099 -141414 206905 -6950 23976
10671 -24597 97711 -135080 130399 186542 67491 -204905 76784 -214153 -119925 -64626 141079
10659 97222 -21637 -120245 95444 -602533 -148582 -142 -14034 100497 -58411 -151905 261273
10647 1355 -334070 20850 326820 165797 21701 61492 -204284 -336589 181775 -66503 -20488
10635 1002 68269 -129914 -158971 -173581 318387 -207576 -57390 22094 -280737 -267004 87239
10623 47665 65826 41564 -70942 -20811 -5066 -22139 -248727 -88217 -74265 75539 -181157
10611 -245013 20129 -94030 -390000 -52119 279429 -44788 152675 122048 -60515 65219 12613
10599 -306720 138050 -221019 66444 -21726 107016 98743 352422 153581 285297 -32667
10588 -76320 160605 -213549 -154418 178242 116627 193486 40064 -194987 78369 -42014 -256417
10577 -256417 4796 173380 -65808 67133 -116024 -134909 245342 -102331 -34921 124093 -53924
10565 -364258 -241549 -11027 149743 -48894 75078 -47498 51935 -82601 -49542 446290 62613
10553 64690 -107959 215660 261899 -3808 -263615 -147963 -301890 -377734 89858 -271823 235733
10541 -370610 -303327 153380 11943 -190798 -287301 -439013 223068 81478 50572 130187 -195139
10529 81195 227803 -135155 52408 334199 -34858 -66155 -153908 203562 -192511 70071 -99753
10517 -60555 -155132 -62140 -107314 135222 174695 -148278 -102833 30579 74346 96278 -284301
10505 -9432 282670 -180746 292309 1616 -106477 -53556 -90065 -139612 -191702 -97235 -100741
10494 -100741 125239 -147407 180386 1580 -280000 63238 69394 134645 -18068 -23271 -85146
10483 -85146 20889 4324 16367 354275 66458 425765 595332 452732 298871 76028 19044
10471 300843 -79047 154017 -369447 -104956 -126458 -231631 -81177 -47795 231106 -115698
10460 360593 -123334 36536 41493 -250256 78059 170741 -23628 8740 21681 -19397 -173850
10449 -173850 151166 99131 -101974 -114348 379 119120 151261 56390 96860 -7874 -71534
10438 -71534 -20322 192216 -173774 -69776 42348 59054 -75385 36944 28071 -297080 347510
10426 -385799 191979 73132 158613 25117 -66737 82772 -110460 -239862 -134991 129395
10415 33023 199940 3063 -40039 -107215 -131647 2826 -448625 13917 13837 -170155 186036 84748
10402 -58589 -309541 -23429 40513 142279 -243151 -228552 -190873 -20941 291156 -96738 96078
10390 157409 -3850 -25121 -42641 90175 177788 24337 69764 341665 53130 -80315 -161444
10379 -161444 -105697 138175 352910 360924 328999 57336 199667 437106 276699 216062 348580
10368 348580 199244 93029 660965 525182 128490 517211 384979 -213177 350365 379766
10358 379766 40004 133407 35312 266488 184925 174737 61066 390780 421771 448719 671363
10347 671363 245797 371939 46333 491792 574146 116277 150516 246221 172487 -78347 222191
10335 282134 141964 280626 143850 153992 49331 -200654 253925 277391 21509 -108475
10324 -46073 165949 445780 364668 89326 326230 109064 11225 188554 -205707 335504
10313 -29790 323661 -221146 229166 -42589 -311528 54723 182576 -216009 359149 132097
10302 -237057 -850 627 -174443 -132395 -9730 -16601 -175596 152449 96434 202622 -27380 -10770
10289 339972 -92588 -383729 -63372 113484 232071 78247 -128862 44393 166482 -94367
10278 -45181 69683 -321625 191804 59871 254984 30891 263682 63730 -123403 10904 -291733
10266 -5762 120086 -21605 -180641 -37661 75350 -426190 -288383 160712 319525 430674
10256 430674 179049 321305 271398 -137938 -5181 158192 -263259 -236877 478965 242470
10246 242470 11926 -230712 5997 -47610 89273 15385 4840 68744 23535 84784 -186240
10234 -342199 73861 143094 -115329 -8552 69188 -388105 230760 -87967 -35390 -166104 -103757
10223 -103757 -102952 103440 278963 205679 -358232 -3985 113044 -49002 -50409 -203010 -79811
10211 -59180 176484 -125092 66845 -16584 -291995 -70195 -187093 547127 -41816 -113936 86895
10199 -426930 93864 -435244 -18017 -11871 -11960 -164095 110919 81209 -82072 -342872 -173717
10188 -173717 58721 189859 28809 -104579 -90413 105373 180088 -174288 -253432 4800 74501
10177 74501 -66171 160917 -224215 34901 -57462 -196151 -151317 197345 -290842 -23251 -69230
10166 -69230 -143546 62037 220073 261685 -225673 -341476 -48767 440 -228950 -30882 -281046
10155 -281046 49867 28164 16967 134735 -201970 115670 73983 -218627 -311844 -6006 106011
10143 -257290 -31097 250151 -36342 -26790 313883 16871 -54824 -100051 124907 80428 -116318
10131 70369 -274476 7365 -182463 -21941 -73608 220568 -373769 -238531 -328370 -2218 -159929
10120 -159929 -318247 -93883 -217236 -247280 -153529 281961 -86815 84025 192237 189615 -21310
10108 -228698 -166550 -80848 -102857 50140 -204751 101194 -72527 -129995 -501057 58838 -61006
10096 -167746 123361 -319960 -209579 51971 112454 -33391 183107 -6149 -29766 -192681 -237382
10085 -237382 -288058 -183297 273354 -103146 57519 -20758 33606 -277152 -137458 -146765 -229624
10074 -229624 20787 94724 134807 -10638 -15881 -164264 -63097 27995 241978 123677 -43547
10062 -134094 -77037 36628 191255 85094 -68596 59130 -48624 -389526 31573 -27751 -217811
10051 -217811 -96293 -266139 343169 135698 -60402 -208560 -28734 151102 248238 -33885
10040 -324058 -65653 -591435 149747 73653 474064 -427222 -119351 -30030 64806 144270
10030 144270 24119 -72686 -158379 -92649 -247936 -175412 -317786 -63163 -1099 -32956 69780
10018 -1545 -57317 -6702 -40894 133382 103943 -271399 -107140 -68890 -158344 24697 8109 -174080
10005 26866 195245 -173634 -69040 -86218 280640 -29642 -34498 -185928 -103540 -194786 -95025
9993 34577 -225134 4981 -145178 -10742 -169586 -88008 -37971 79295 83995 -95804 -303959
9982 -303959 -336401 -111930 -1001 -77779 -315271 -88128 -51166 114199 129 280093 -288323
9970 -117646 -301879 32583 -266201 -164005 238835 -350392 -15270 -214057 -313413 141008
9959 -19154 -48495 -336408 -122598 -113403 -241297 -176616 28270 -24173 -368967 -149612 191138
9947 -87651 -20611 -469167 -52254 -282842 229203 41187 -372764 21688 -3877 66540 -245567
9935 351531 -15565 274659 300924 -164824 68843 80408 -240336 337914 -247770 -175842 -132488
9924 -132488 68441 -13967 202794 -67856 131203 -106881 -184575 -152742 -26880 -351005 -222799
9913 -222799 -25519 -189501 81462 192722 207373 -65818 -176130 -371099 -181968 -291656
9903 -291656 149761 166276 16208 -469589 -250698 76417 115962 -272656 -53685 -56593 66621
9891 72990 -71389 51228 55955 5790 13910 -133451 -163439 50160 130006 136334 -250866 -344084
9879 -344084 -83535 -144491 -310901 -293537 -367418 129154 -102919 -266047 56157 93175 -213815
9867 -207623 239797 60417 -73062 -142457 -132072 89792 -69751 -367629 -237613 -131949 -304205
9856 -304205 -2644 -98576 -214033 73192 -106842 -234413 -128681 325789 -238932 -230142 -195475
9845 -195475 -175226 -144410 -168326 -205379 -402561 22855 257926 -56960 116322 -56313 215943
9833 -214409 -3732 -286969 -153155 131506 -57555 -109209 -106370 -376553 -202405 -153528 165896
9821 -230418 -174091 -53736 -107296 -56346 35786 -45357 156424 -48128 -63570 -73246 -186341
9810 -186341 -40097 -258086 -86551 43182 -148919 -80321 103536 108023 -279917 -134259 91684
9798 137728 69176 147035 -71227 -254715 -157099 -65223 -60492 154916 -30743 -80913 -505121
9787 -505121 -310897 -30762 28562 -155430 113310 48198 88964 -218183 -43477 -37447 -113173
9776 -113173 61505 377701 -203627 -159103 -20661 66242 -165117 -144608 -153727 66994 -129307
9764 -156379 28649 73122 -305817 209358 -223129 -142405 -149337 -139672 99064 -170763 -15155
9752 -280912 11525 272493 -136183 -106007 42905 19889 -266102 -276881 283107 7572 -298415
9740 -51897 180862 -77600 -194744 199789 176336 116084 -131234 12922 -26120 190792 -238409
9728 39991 -80253 93304 260298 221458 79356 -115690 140236 -216821 -306190 53531 25335
9716 -193416 -413778 -106683 137545 25372 70127 77268 -396486 79304 -350032 -562 34427
9704 -153748 -57464 18397 -149700 -178313 27667 148041 -95585 -36389 -129315 -218580 152564
9692 -118242 78158 -311158 -78356 -85314 223213 12328 -56861 -208786 214982 314648 -183110
9680 62664 -83842 155059 -62826 -162958 88118 -39023 -93425 -174257 -147132 30935 87717
9669 87717 -359294 -161871 138411 46813 -289267 -148562 -27192 117054 57812 196606
9659 196606 -258825 -133373 58829 44509 -125209 395073 38868 -435488 -297820 -219860
9649 -219860 -65798 -144863 -270128 -185301 39728 -97946 22082 -582551 -213353 -40406 -26033
9638 -26033 -507989 114727 161028 129425 1739 -169501 79211 212881 -239121 -463129 189401
9626 -150769 -106126 -49639 -123849 -121280 -255577 258236 -151843 -445008 -133402 -74962 -213282
9615 -213282 -68170 -69929 -147408 35563 -300427 -259117 8202 8540 -13834 271401 169733 153870
9603 153870 -220152 310471 64943 -52899 -120421 -37550 -359370 -305114 79505 23223 -344564
9591 -150834 75316 168487 135060 -104131 -77744 57390 -7517 -485184 119648 -5652 376117
9579 10412 288131 -215946 -229567 -204513 14253 -111661 -363372 -421109 -94686 179928 330296
9568 330296 -211308 -271025 -431025 175408 49236 159507 -131415 -245789 127195 3208
9557 -279726 532335 142420 -126737 -186201 -75335 28765 28948 -102269 82792 -302452 -180366
9546 -180366 -56563 -75625 181578 -332787 -130276 -160078 110432 -94506 -176675 -46847 -251260
9535 -251260 -156250 -415480 112432 110707 79884 -116675 -159104 -72240 34901 -344403 -418611
9524 -418611 -233153 185752 -128949 -171889 -7677 -550659 -59948 194136 90618 -90669 -181220
9513 -181220 -129606 121750 106911 9780 146048 -252534 42140 35852 82566 -225188 110349
9501 -127795 335744 -128162 -421252 -73594 47434 95541 -28855 -128514 -85339 -212795 -484712
9490 -484712 -303510 -173603 -159137 -21855 -480141 -12647 -331725 130827 -134217 205844
9479 -47907 27212 -134215 24353 29303 -194067 -85384 -191586 122144 -134028 -130583 -76747
9468 -76747 -91951 55370 187726 -203848 97456 -25798 36574 -6808 -4730 -294269 61576 -46665
9455 -288137 37018 7575 244583 98021 27104 8959 -149508 -120946 189609 107050 -80902
9443 15791 -144084 -19587 -123118 -335286 73648 -223926 -54745 114243 5466 -16404 280346
9431 194792 -221100 -169069 -122476 -299036 -117861 172305 -47015 182456 21581 -50805 82846
9419 44578 14162 -43510 -132166 -48462 91817 56554 -132000 21711 -113839 -5782 -42969 -356476
9407 -356476 -13234 -47578 -70363 -424949 -204596 -308508 -120295 -209786 -120326 128996 -101558
9395 -222516 -49920 -259948 -119997 -210997 192001 -29563 113913 229359 -463472 107192
9384 55499 -257997 41528 237770 -30188 70660 -203783 -270221 222817 -256800 -237170 -275976
9373 -275976 63672 -51082 -547662 -169421 -251005 -309994 33630 -242622 1841 239138 127079
9362 127079 -277817 183823 91 -204335 58481 199155 -393342 -338674 -254656 -23634 -415642
9351 -415642 -154295 90694 4964 -224923 -43255 -151312 23209 -49940 -263393 218413 -77877
9339 -160302 -32475 181681 66954 102565 143558 91388 -229796 -218762 -396226 2421 -103121
9327 -617 104204 -5940 -36924 -228316 -584813 -81680 107820 26954 -283336 -91262 141773
9315 -255326 261505 278150 -19596 -153391 -250308 -79517 134855 -194595 -178298 -17143 -155345
9304 -155345 -176933 -291237 143248 253388 158269 -319667 151992 -239492 8779 125669
9294 125669 -38745 -9440 -154850 146363 20937 -424744 -249360 -467900 -45524 -145315 -268956
9283 -268956 -15874 -277053 -69 -256198 -95693 245234 -45039 -108440 -1552 103711 91741 -90047
9270 -358091 122850 366022 340687 -103962 -169370 -19645 -209502 164883 -403567 -130263
9259 5149 -21168 -57970 -283949 37145 -149300 -424885 7242 -197414 93172 222265 -146733
9247 -136591 -271951 -107707 23179 -74165 111703 164659 -2707 21097 -252733 67276 -104270
9235 -134439 -75795 134507 -66615 -39932 -154918 249562 115071 -98748 92825 -71012 44973
9223 -164599 -97729 215077 99053 185857 -184741 -182492 149848 -24618 -299992 -64053 57245
9211 -343514 87494 -230213 -201334 332877 -176839 -146670 31615 -161258 94426 -257269 -78752
9199 415822 129306 -322777 25704 29380 128566 -214536 101989 45245 -412667 -130437 138988
9187 30986 -178800 -374501 -233842 -108673 -8738 -344499 -160015 50988 -166951 -98990 -15381
9175 49405 106737 109188 26901 46088 -407925 209525 -93898 -203525 -342068 28586 -79168
9163 -12408 -276912 464122 -71483 161622 49905 -97221 67576 -229086 -33812 -286056 4302
9151 199713 -102650 31341 -396747 -296987 90000 -381727 -378912 13800 30228 -185101 22387
9139 -16970 124238 -93915 -104825 -154882 21904 -283244 -279552 5551 -42468 305990 210796 -113327
9126 -111620 -95598 -144093 -94418 -247368 -33310 29593 -46769 237248 -102519 -160964 139217
9114 11984 -70766 -117026 -312026 30506 77398 85522 334220 25745 -222712 -55029 105198
9102 -172046 -33508 -39978 -224186 -194336 -65284 -98711 76218 -24403 -116047 -103743 -82936 -197445
9090 -197445 17786 -201591 -110475 18545 -98096 52570 -366906 -134332 -154996 -311053 -80601
9078 -82009 -104942 -163445 63537 21939 3378 -203768 -89143 -231523 -45557 88572 427228
9067 427228 87177 100085 64978 -258762 76830 -271760 -11170 -46177 51529 -132496 -30991
9055 -98066 -153191 69412 -57262 -345460 -48954 -211917 -165965 -68768 -53285 -63955 -154794
9044 -154794 111089 32168 191712 -385841 80151 165637 -79460 17325 22414 -71072 -24583
9032 -106345 -33359 134376 233189 -135115 -5280 -31965 -320872 -264540 -51959 39358 -34685
9020 -83338 -160301 -194569 369410 -109020 16370 -191291 -190734 30991 110359 -241113 -93171
9008 -172908 119859 109121 -137893 -244420 96230 -277631 91218 -85059 -95146 -113494 -375730
8997 -375730 -31192 -153625 41295 202728 -221823 -148824 -157418 -30881 161557 -102330 148069
8985 258489 431573 -129248 47286 -277645 -78745 178134 118066 -233474 25174 29820 -270555
8973 -34423 -73662 -101110 56806 -496 -381625 -183229 -152330 -232687 4752 -58755 124919 -119137
8960 -123958 6187 175919 -325266 157735 -496667 -140416 -346256 -5341 158537 63718 -205019
8948 310074 -48695 56116 -324488 -251265 81751 -347920 240321 102917 136927 -6827 42792
8936 -170968 112635 143437 599416 222219 -58805 356672 -33453 155943 84168 -70422 375475
8924 489920 763015 3116643 8834482 14834303 6871196 2787787 1079504 765628 59910
8914 122019 310871 353658 -22523 -127143 22691 43244 210508 333192 83324 -132124 -14564
8902 -125038 268699 -39949 -170447 141579 -16662 -247144 153811 -215563 130050 79097
8892 79097 -238729 -149249 -127947 128282 66606 -37113 153411 158027 199248 316218 -388967
8880 -198523 55293 228842 45585 -295513 -108940 210566 -90424 -130387 4846 98072 -188939
8868 -90558 36643 551729 -376725 -43627 -305456 -221551 -144825 31817 -118403 41044 -31957
8856 84781 12236 -176076 130903 70219 23719 -62801 189610 292747 -88895 -166887 -17921
8844 -255450 161049 191953 -279627 -376694 -198367 -109842 157683 -219941 74368 340724
8834 340724 199804 -59162 -47799 41594 -331682 272260 -27111 -41115 20073 -168205 -230443
8823 -230443 -429834 -305947 -105988 -333836 -121875 99306 99004 -186446 -307722 -105706
8812 3964 -32635 -64497 -223000 -199097 -138523 -73924 -63981 357514 -51811 -171337 -125352 -134571
8800 -134571 101737 -187049 -176480 -139593 -125745 -51798 -291322 -320840 -109544 18622 -146692
8788 -149891 18672 -131018 -52977 -249626 -53262 -274606 -375741 -59474 -178338 170841
8777 178350 -226693 -118860 -90542 -163115 -71025 217347 -1983 -71725 -221126 -175277 -12627
8765 -40332 -72677 -204517 -16980 -191298 114310 -138517 -99350 -46619 -281887 -152492 -137949
8754 -137949 499349 -228195 -184692 18615 -369049 -29812 -13219 102648 -103420 85735 -28305
8742 165983 -66292 16101 -397881 -338682 134140 -36870 165072 -114223 111107 508 -145525
8730 138258 66152 -56257 -80978 -222939 -81194 -127491 -244542 -161132 -45316 332721 -107609
8718 -18112 -245540 -43783 236762 -159661 -14944 9703 202625 179402 -31398 16911 -35728
8706 -156950 -190267 -385115 186205 -444052 -15283 -138751 209021 -138017 -121009 -54572
8695 -91616 239001 -239701 -204438 -39947 65534 -51628 -114564 -296602 287702 -358692 -210804
8684 -210804 -291620 73493 -92966 21345 -30674 242735 -393488 339810 -256134 89921 -176545
8672 302109 63293 -81014 -112950 47580 -52965 138823 100963 121278 -81390 -39535 -21630
8661 -21630 -229794 -44182 219178 96954 72709 21812 -193147 10343 -109837 329310 66762
8649 -323597 47775 -124562 -235177 293240 -19840 -125918 33165 307363 -43245 -134886 185419
8637 -280383 -102498 -287854 -3878 287286 115056 -40574 23267 -120932 48454 -283032 29079
8625 -252356 -205324 69952 -222885 131892 -284249 58965 -63995 61932 -112033 91928 -185638
8613 -169157 -159592 -135847 249407 -105745 -288986 19639 -215642 -86445 46369 135881 -67434
8601 -117548 -261587 -160221 -42839 -465277 43901 -168173 -180185 -64742 8896 -50568 -383126
8590 -383126 236295 -362490 -34293 340360 -4659 -8222 -130139 131944 -80246 -63105 -201292
8579 -201292 -46814 165219 -139674 137306 -13357 148288 -261647 -117311 -80869 -201750
8569 -201750 141441 -113668 -234311 145378 -211236 -11448 -330354 68100 -97868 214280
8558 -184350 73626 -134008 49552 -186680 -72492 32598 -108624 152234 -86352 153030 5072
8546 -70925 -129478 -6429 -249834 264375 16833 225020 -26173 116925 -148887 -241127 192217
8534 -128951 -306152 -270365 300404 110771 30377 -132232 79104 -118665 -279524 -39531
8523 -61074 -69260 -303692 -65646 -113062 -414422 -277256 15803 -85229 276836 -206 -327770
8512 -327770 283216 -110981 -142361 83325 -17137 -244593 -156268 -160683 43729 5388 -154984
8500 -29218 48420 16788 150136 -143779 -6089 -230281 -147739 -307750 95598 -146255 -145779
8489 -145779 74519 -260878 -95541 -417319 90426 -72177 -6318 93608 84826 -105877 13719
8477 5167 233808 -259450 190516 -58717 -143197 -268134 72469 26199 -206897 -68970 209201
8465 -139907 10402 207979 -20810 91259 -88850 -253851 -24185 -352375 -361672 54355 -234100
8453 -190236 -238229 -163908 179571 -186298 38463 -91948 -291649 -219042 -283675 122501 -145090
8441 -277625 308176 -178415 -78455 182517 -233838 -25830 -105738 320025 10101 12620 -98826
8429 181175 -25645 -14251 -112401 98193 -294494 68717 -62264 2028 -71818 88286 -78945 47226
8416 -290133 -321404 -190966 -272360 -53001 157500 272144 -273691 -64655 -185891 -122230 -10066
8404 262234 129380 92807 70285 131700 -159500 235042 45923 -40519 47208 -98812 -34968
8392 -28910 -149140 -561964 -70733 -128038 85211 -127459 -119520 65049 14638 -131194 82365
8380 -28513 -87991 208110 242634 11908 45146 -120570 -180978 -194153 -49229 -259868 90928
8368 -196287 104793 -160710 7174 -273788 -150035 -45748 -103849 275609 -348047 131642
8357 -246175 189035 128443 -196574 -129773 22687 -165664 -37010 -164732 107287 313005
8347 313005 -100835 -19597 -81517 -99315 41165 -77748 -170330 78324 -166208 -44995 -328448
8336 -328448 -186610 135988 -3048 -164298 167213 179207 22426 55766 -26740 -102786 -124143
8325 -124143 151204 36408 -107796 -187538 51152 125781 100846 51053 73145 -91230 -264935
8314 -264935 -232433 -60990 -186332 -94183 239804 -107306 -200491 -108157 -240642 -344309 4217
8302 87373 -213505 115732 97002 139109 -19499 -53999 -337301 145691 102253 -75886 -57298
8291 -57298 -122420 -326487 234634 -10713 222520 -55200 10993 -124137 162553 93975 -37633
8279 -341587 266256 -101780 -63886 214688 -73236 -13055 8301 -45134 -137193 -159181 -81393
8268 -81393 -94914 208650 -70093 -61851 -130047 -65400 -146244 80145 120860 -203571 -187386 144841
8255 -88325 -269876 238337 -150353 -72752 -33380 62399 -112754 4599 -168696 -79211 -152107
8244 -152107 1162 -186706 -191301 -103920 -63733 112358 -48183 -196874 -275076 -170360 -402179
8233 -402179 -35222 -40991 -158687 -85006 76673 -9425 273596 -4363 153701 98402 38034 189950
8221 189950 -322246 -167011 180346 2806 4810 -339081 -393608 -271641 245009 -86031 242158
8209 223550 -54256 -220188 -184846 -230294 -38018 -100719 28533 -142685 82824 -10136 180661
8197 -34976 94463 19276 56458 -206001 -116167 -8065 97048 -170350 18359 2593 -126304 -207886
8185 -207886 -231807 -83621 14095 193508 -326748 -281711 45722 -148725 357178 -114608 143328
8173 -371710 13111 -308359 -119078 -218157 -61195 -295781 153197 4181 -249441 -108130 -170325
8162 -170325 140430 273021 88242 27093 -260444 141260 -479562 110385 -122091 279596
8151 48723 160157 -221956 276826 -130845 -10992 169128 -161741 23516 -131913 408832
8140 -241250 -118496 -47310 -93767 95882 -14976 -141716 -191980 68014 -112124 -81853 -195591
8129 -195591 26178 109629 190393 59514 -431643 51288 2080 -307 -225852 -309301 -55931 1994
8116 222058 -304200 -173422 -154390 242461 -335291 -250120 -288818 21397 257066 54142 -94141
8104 197276 198074 214266 -37402 -105643 -24744 -263083 105283 53657 -204692 43252 -60848
8092 58876 209486 -151427 -225600 -134471 -424114 209953 254522 -437205 -24421 -159123 -157058
8081 -157058 221227 -103467 501944 18517 140017 -268602 -63105 -51977 -119014 -12323 -127620
8070 -127620 29757 -93175 52966 71527 -52028 -86905 -29689 120734 -249742 -23671 66843
8058 -50734 -313820 -74641 185843 -75420 26253 59015 211208 -281273 -114161 -323629 155031
8046 15523 71859 -144648 -35792 18628 -179432 36066 43167 -167701 -129012 -156920 12501
8034 -31321 92125 -53144 -328337 -15955 363411 268027 -210173 236863 71637 -116946 -80759
8023 -80759 125751 -451536 -181653 -170913 -258356 53624 38023 -42766 -65545 116956 109841
8012 109841 -149872 -81278 12758 46433 417910 -185353 -106291 59515 62663 146052 100052
8001 100052 -220688 -80247 -244469 -99644 -231424 -22023 37393 91358 84908 101077 -350996
7989 -72570 90678 -126490 -91031 193424 133159 23062 11550 -336803 -61118 57797 -47575
7977 193829 -60298 -316765 -88601 55553 47943 -98949 131524 -122277 -199224 -211889 -179439
7966 -179439 -473861 -245467 18894 -71203 191438 125611 64906 85345 -243494 -248671 42201
7954 -225366 55000 -292235 53249 -117086 3748 189214 -461057 -36435 293420 -3854 -20131
7943 -20131 -6967 -126244 -34475 -7343 111181 41289 -185293 -88073 -98282 160198 -262211
7931 23570 266360 21429 -251341 128735 -4071 27319 -95757 71229 110174 -193526 -293118
7920 -293118 -141759 48778 152927 -113953 -114796 12266 -124712 25925 362518 -80579 -4045
7908 -174472 118507 -23695 -97355 -440635 -122940 -80505 33539 83746 -41571 216070 -292526
7896 406426 -158925 -120175 -297102 155914 -150922 -69281 -56153 -110470 -205978 -110706 -135925
7885 -135925 -160460 -57925 38852 -193354 232356 46469 212299 -26428 -300468 -80598 -294752
7874 -294752 -176556 -106872 -217487 307524 -118506 -247278 207855 -105919 -159207 -90730
7864 -90730 -307280 148150 -189931 -244577 -49685 1695 119252 -122966 -81666 203652 -130685
7852 -25542 3970 -414058 -68541 69212 -347409 -101307 20032 -142633 -432188 -43544 -67777
7841 -67777 -411463 -107484 224076 -65348 -194092 -132193 -76189 -161675 -214099 49941 50812
7830 50812 91887 166113 -36208 -13197 105191 252512 -128630 250836 13969 -188835 129450
7818 -57648 66561 -238049 -81796 -83264 197535 -543262 -73824 -216450 -160743 -169348 252236
7806 49746 59033 -34229 30520 -276178 -97274 -1218 -2930 -13748 -144702 -133562 -38740 97624
7793 86901 31469 -98896 -169204 -112760 108126 -347127 -457329 -274643 -40650 143579 -169111
7781 -10838 37999 -248494 181334 243350 112576 203588 41869 -2914 259198 -211943 -146073
7770 -146073 -191053 9292 91999 335796 -166801 -358127 -148329 341838 -180954 216105
7759 181107 -180244 -118070 20118 228958 175374 187923 -110207 -253456 48335 15013 -106697
7747 193070 189656 -233555 21132 -94239 -127895 65119 -202741 31295 74444 100601 235615
7736 235615 -194436 -86035 28860 212771 -306002 85137 -294547 44053 -261293 -332497 50073
7724 -20220 132006 -211846 -173767 116212 24531 110837 -507435 -177092 214478 -331671
7713 142410 -348218 -401504 164551 -115736 34658 -108116 165323 42050 -301658 211947
7702 21831 83304 -211859 -12087 119852 -19194 -286548 2814 -260935 -63626 -166743 28947
7690 -94449 202381 -114163 17531 -112162 -369299 -43931 277156 423261 -62053 -216175
7680 -216175 -306352 -253350 -103519 12544 -217101 69587 24491 -454323 4240 -141583 119584
7668 284470 -205515 -394156 -5865 33486 232409 -250130 217208 10680 97867 -15143 183633
7656 -125813 -1323 266416 -33381 75537 187592 -272961 76870 -170022 225719 30331 17528
7645 17528 81267 32066 -5978 95921 -5008 -229294 -14625 -189410 -176859 60151 281171 353855
7633 353855 -60064 5699 -76921 229982 -151763 -257520 91311 93819 87314 -15730 -260348
7622 -260348 301307 -109761 -398516 -129523 174612 -103629 -113105 -140270 178320 -252091
7611 192602 -331302 -48598 -27136 177487 -74822 169438 -114894 -94769 214992 -276615
7600 28643 66797 -179445 -261392 -210720 -1878 72032 -275678 -34283 -419527 -149603 81874
7588 236365 -115518 46537 -115154 71567 149769 38342 39347 93522 809 -1428 -7959 -43453
7576 -43453 -64202 184734 34871 -232311 -296682 -53037 -100209 -215544 -367030 289155 45400
7564 -251255 -19001 -98428 -155603 296381 -265474 150034 173593 199588 -190753 46007 -67892
7552 -166097 -117680 -164655 -353120 88365 -100356 140188 -183640 -327491 -226120 127646
7541 180563 287399 -36275 -345503 -116993 -199952 -395471 112925 -93371 -75073 62153 -80208
7529 -147142 -92052 -228015 -98353 1720 100671 -323942 -76092 -111589 -126915 21531 -158468
7517 80773 110990 -19846 -53313 -279489 176287 216451 -49390 153166 -126172 132802 -30274
7505 -158076 16935 87153 104340 -177059 -201833 -170245 -5484 -277165 -176965 239246 80491
7493 -95735 -284800 -61838 -228885 130865 -221782 -95850 67022 -59837 -2966 -195243 -96668
7481 -62486 -13550 -61299 161325 -170689 -100158 -77050 -300070 -150285 -249472 260510 300449
7470 300449 108982 21126 -46766 27999 -154856 184215 -206065 -47796 91450 301439 130887
7458 -158900 19156 -25118 146902 90491 -261338 -113833 214313 -39129 -172403 -330244
7448 -330244 -81840 -150384 -101768 73335 11513 -71985 101126 -2194 417716 321711 44778
7436 -116877 96199 165582 -162016 -163363 3971 -132834 -14389 117828 189613 30680 -165304
7424 -156157 -80959 454715 -84623 -454909 179332 -18671 -295406 -226152 -59027 53208 -240277
7412 -84447 73088 -41835 -38356 -22040 -32219 -32949 -21534 29486 -38828 -164013 71293 -308790
7399 419684 70532 -92062 -198120 64826 259271 -62502 -96510 -176664 66956 -290194 -299647
7388 -299647 62811 213776 -263180 -342046 52202 -154630 88757 27257 -155233 -88094 149352
7376 -71719 19133 340546 -13234 -146911 65493 181811 159506 -183404 -52705 23191 233120
7365 233120 -227340 173490 -278358 -34230 -138519 122461 70741 45249 34671 -104185
7354 163522 -44428 308530 182374 270104 -194018 -36251 -94510 -168580 -407634 -461351 -88720
7342 -153787 -104638 64096 -171868 -101846 -281489 78934 -220450 -228368 -124259 205838 -48129
7330 -252112 112119 -6972 12980 -77490 191793 -268873 -256935 -133566 -138553 189335 -78871
7318 -58967 -227096 -216617 40904 -19774 -215525 55215 209734 -3233 326503 -149310 -50465
7306 279624 67919 -284319 -153739 -114046 161518 -173753 -250381 61471 -69706 10460 -97355
7294 -337303 49526 -90881 -106667 -669 -208351 66074 191439 -80225 174247 -111385 -166625
7283 -166625 100906 -128634 51126 79597 76149 -133648 66603 -244964 -273728 55441 -19220
7271 -30952 118938 99231 44234 382196 87702 52503 120786 -97509 65608 -32830 -232870
7260 -232870 52596 -343545 -198972 326959 146654 114144 -30918 149552 -124243 -85747
7250 -85747 -18283 166178 251964 -197080 -76015 -360500 112102 66830 -94984 196913 -53961
7238 -11295 94786 -243527 -137216 23590 -197491 -116501 148135 -354067 -67628 -185531 -269829
7227 -269829 29694 2649 34765 -109604 -125812 -118124 147420 75401 243037 192505 -73569
7215 -94148 379147 -89008 236863 -138118 61241 -282167 -44554 -146312 -177458 298041 11508
7203 142025 30971 132969 119780 -169079 -59145 -43215 -34243 172410 177448 263637 122574
7191 -166621 245182 41267 71925 -273133 -79782 54107 -111587 -3391 -7661 -136322 151282
7179 -172755 -9913 -52972 -208158 3437 -109702 -131361 -64138 114970 -70228 -149133 -216607
7168 -216607 261969 -241451 -85908 -64593 -78573 144097 -54342 138373 -26976 9420 206781
7157 206781 -51065 -137364 -20250 -198866 322173 -270876 147465 -141294 9366 551021 17057
7145 -103487 -166592 -44484 101560 2431 12247 -347204 -82131 -205092 -34046 -143900 222952
7133 -96796 40779 272231 -137039 73366 -66751 -88271 -95693 -38713 -20132 136655 -78209
7121 173987 -143438 197440 -128769 86654 198816 -66577 -135410 -69193 -145902 -193454 491566
7109 68400 221160 46048 -44471 57811 -26031 -36254 132382 -70250 -137483 -165092 -182625
7098 -182625 217458 93420 -101082 -94161 177489 -92910 -28653 -116132 58701 251267 -279491
7086 257955 -112512 -221206 -171479 -208567 -340982 -411752 4726 -299475 -270917 -71315 9593
7074 62458 -63569 -149221 -84651 97874 -28444 20301 -93489 2088 185314 101272 -244756 -80268
7061 -194289 382177 186320 -24455 -216454 -200358 -159552 -150463 22616 206385 68844 -29549
7049 128411 -289089 -193353 -134840 -276115 -131284 120543 -102745 -76984 -361543 168956
7038 355942 -53898 -361341 -49886 -176409 72385 179533 29149 70249 13444 268608 -334143
7026 13852 -19165 115172 11198 27330 -51959 -7224 238660 -146073 -64234 -206909 29084
7014 -91023 -79590 -186811 -292409 -42145 157513 -116874 137802 37222 -233619 334006
7003 145932 134481 -220944 -145162 -181408 136989 -190111 -209311 96100 -114153 46439 41932
6992 41932 -151829 -150834 188000 -51089 41259 130867 -222303 177702 60664 23887 164381
6981 164381 -218297 225192 -184807 -62741 64300 -12478 -6624 -174434 -27797 39319 -111831
6969 -422512 142307 -32121 196934 34197 -197499 -486231 36933 -158964 -74071 146605
6958 5233 168386 30966 -138812 239898 288529 -72969 166703 -165776 67166 -256046 4706
6946 93837 -8060 109713 -42912 251242 -22391 -215439 -222714 -139676 -100805 -147369 -49258 93064
6933 -93551 -73859 -170908 287989 119620 -103576 -439047 35725 280565 108321 105853 -52102
6921 125846 -22461 201625 -133360 81265 -53355 -53973 -56582 -119437 -4618 -44364 -64560 100375
6908 -103517 -89296 -149027 115562 128101 123526 255182 -104768 -163892 143551 -130028 -321678
6897 -321678 -39152 71117 -12043 233534 393955 -418493 425789 -176107 111590 100704
6887 100704 216611 -45194 26143 320369 -304029 -24047 180174 130947 -339576 78094 2886
6875 104280 -116233 138273 -341617 389040 -55709 -19174 -78665 -241230 -198434 117444
6864 -171060 -194372 26172 -143583 295849 149840 -291925 -2640 90471 -50511 -81403 -146702
6853 -146702 47162 87799 -57972 82024 273455 12810 -276414 -49640 -89558 -112346 -24121
6841 190287 176662 -175321 378711 -205671 144164 -225695 369427 -194649 -327546 74828
6830 78167 -347160 -40056 262828 134628 -192392 -76045 -34327 240779 101702 34583 34089
6819 34089 -167539 -9715 27680 -188540 260594 -135316 -91979 19406 -242241 -116341 249597
6807 116262 194935 -42774 -64067 -464023 -27776 -321966 -360584 48415 -128432 -51663 -57634
6796 -57634 96960 -35903 128748 -106127 -340292 86741 -143611 -372717 309932 255552 51936
6784 -103943 -82727 89833 65139 -196180 -104678 -132012 -257705 -103522 -192684 42841 -112550
6772 162516 -143449 78046 87460 -218032 186873 52015 -330730 74495 138941 90932 289917
6761 289917 256503 311956 -430236 -256675 -16956 -29987 -437329 46435 32921 -44738 270699
6749 -105851 -10863 -118268 43581 -54099 109248 -92954 247289 -67329 95807 168762 -352166
6737 -53746 -111174 205958 22813 69039 -310884 -38664 -5770 -137228 6443 15494 38887 156829
6725 156829 119429 202522 -3510 -211024 -266956 39138 -156988 -280480 -109250 356717 -178534
6713 -16594 -66408 46057 242164 195396 30099 127841 182186 -231366 228110 72691 -151423
6701 -197974 -170481 -499780 -210957 -4476 23644 371676 -279732 -143297 39001 -39200 -403117
6690 -403117 -155032 111952 -245972 -77805 -86813 210628 -119699 -150600 132213 2569 -231058
6678 -317999 23065 47153 -119137 -90378 -21970 -227846 51950 -176663 -135748 32048 -28997
6666 -72996 470582 153211 2718 230072 -278731 117284 -141521 137894 -36543 -69018 85961
6654 -16954 -288904 -97856 275108 14245 2341 -1875 102238 -141439 126659 -199442 -228943
6643 -228943 -149078 -35474 -172563 -26661 -189144 -47785 122947 -76408 162306 -250591 39592
6631 220449 96538 152731 7158 221934 113410 -101145 -197698 -30354 -283450 66535 85532
6620 85532 96543 213253 -23707 -197967 -240930 295598 -63946 130073 -115661 -158488 -4438
6608 -57075 146121 -67894 144338 257603 40130 31871 265879 111405 -151742 -81576 113913
6596 -66516 -171889 -50047 36567 173254 -273826 -140235 46361 11043 90123 -184276 98031
6584 3333 20245 -115409 -246772 -73930 38746 -234632 -331888 -176762 -283088 23860 60252
6573 60252 233845 -10908 239522 117592 77226 124473 -89854 76125 137930 -366010 -159606
6561 -277856 13945 -41912 141891 57609 -130014 285979 -34696 -88310 50041 200882 54079
6549 -22416 149856 -350704 185643 -132928 91506 -7519 -214807 -164611 440555 59481 47463
6538 47463 -284266 74443 -73616 138488 170576 -145387 -143121 48315 132172 -37778 -220507
6527 -220507 -83587 68614 -85003 -363209 -186769 -83455 143463 135284 -18065 -142271 -55833
6515 -97421 147106 -115360 -277413 -190461 -119740 -41206 131564 -349642 47192 -31786 105021
6503 -41080 -115369 24807 -81004 76991 28846 -29928 -26303 -9451 43436 142867 104027 -105555
6490 -145861 -287524 -206898 118323 -137498 -22599 -270454 -5011 -69525 142135 82104 -367271
6478 80110 2947 23252 -300674 -164237 179548 68715 -128240 54976 207172 -247319 200053
6466 -217645 -8356 170576 42926 -60466 117568 203238 -270341 -208852 11109 92430 -81847
6454 -307439 285596 178668 132461 -145354 -172457 157502 -128816 56533 -139260 -166953
6444 -166953 70316 -8062 242699 194788 136990 71636 -18759 -214258 -50484 -149903 -58700
6432 -200993 -182432 286567 -69737 -119833 -125525 291875 81324 285725 -167067 35217 -348084
6420 -100214 194104 81900 -330565 33775 -29706 -97046 100488 -65983 -160270 7312 -373760
6408 132475 -328883 -86221 -56009 141966 189048 -46377 -138256 -114392 51038 -107709 179031
6396 -30690 -155546 255734 -139943 -13665 -263368 43085 -131300 -137814 -98929 52266 -117891
6384 -33771 133303 19870 48051 -249559 -1394 76828 -75149 -217201 112475 97722 203464
6373 203464 -85240 -66434 -169135 -54106 -72137 114641 -50431 -2272 96175 315638 -97987
6361 -303771 67619 -116955 -155427 330007 31033 43805 84675 466139 135311 -37643 65069
6349 -85310 227594 416007 -72174 -138634 -125158 58946 314033 -223573 -198724 109923 30926
6337 110651 135550 -1742 -9764 -86027 179320 101188 95577 -37998 -346185 68381 77793 -32414
6324 44597 185055 -21839 201320 -70912 90632 292802 15676 26703 -55638 -170282 -126662
6313 -126662 160176 -61906 140938 98907 -259333 -103399 -205513 160493 -73897 82824
6302 131119 -46105 -43324 54153 -85487 63884 -28385 19782 -67027 -81441 145251 -266439
6290 -51269 220840 169036 -188044 -334553 -203990 60361 -59623 427794 334222 -97486 -209258
6279 -209258 176974 -23379 -54611 242498 -187038 384724 -143302 -102596 266988 74708
6268 -318452 -316098 164834 7997 79589 -53726 118470 -405920 -163421 -69804 -156008 165876
6256 -132142 -82937 152161 -60361 217158 -118518 -85947 -2909 129307 39479 76170 66814
6245 66814 -15649 -250440 -59325 85613 -29150 6887 371997 44112 260250 -309988 378692
6233 -15723 189881 181972 132962 331667 -143013 -100204 -170584 -284962 -39342 -156745 1445
6221 4565 -121116 56514 172930 -196172 158159 -127317 -76703 -41925 -346569 113360 213466
6210 213466 149980 39477 -220123 110325 104342 -158892 -107287 96646 -114163 -23272 127061
6198 -44426 49323 -66952 224348 -166170 236342 -241829 53114 92080 -33393 -237998 55521
6186 133918 232265 17419 51936 105171 -27516 94182 -147970 -303149 237764 377963 -42550
6174 121238 165222 86759 -66755 -253740 34825 67160 -251072 -285182 -216673 -181213 -104926
6163 -104926 -325908 -4445 323917 -71383 -63614 121101 17159 78388 -16138 4099 70468 -125484
6150 -55612 128043 -145981 35669 31158 -136422 -180972 -39448 173850 -174752 119449 -223906
6138 -107831 -175642 27239 -6030 1284 -292497 -284237 -65143 -64822 94775 265724 286214 -17650
6125 338572 15669 -149219 272134 -122926 103220 -278790 84186 210680 74742 -125223
6114 239538 126128 -165430 143853 207356 322225 -345738 -97504 -85306 87334 -334924
6103 -45753 560700 -95990 80228 -72095 -253269 -169985 -127633 1877 58689 -154886 -94090
6092 -94090 143128 153657 309321 127669 -79262 -199229 -310795 -23574 -6165 52729 -155447
6080 -295183 -25987 167335 262040 95616 -154692 -103638 219982 -133996 14157 -229015 -187691
6069 -187691 300733 -13303 -55753 -208549 -206234 140701 -241372 -92080 26518 92640 173469
6058 173469 56493 99779 -21573 -99217 -255062 -68666 13071 -235086 245353 139379 5531
6046 -413749 3105 -263680 -2987 -209278 224308 -245998 -15857 -371438 164159 -71984 -101925
6035 -101925 24994 89435 -45516 -16694 -201729 52761 153893 134572 88942 -18578 -214359
6024 -214359 274330 235768 226812 -118357 -77065 41863 6053 -58420 32189 -133686 -66976
6013 -66976 141587 15727 319844 105102 -7794 113089 -245286 -206859 6910 -261227 22361
6001 346031 120411 -206749 -80302 145061 -292455 95526 9368 92976 -357405 -107000 -168313
5990 -168313 -77646 421959 232274 -110526 -69592 116153 -49382 -69670 161858 103366 114415
5979 114415 -137984 -62094 143378 275481 343560 -161948 282626 -176357 34466 27006 133519
5968 133519 184538 179784 -51138 -101531 453971 23737 -153574 -41070 -29034 98228 -107143
5956 30523 21246 -122074 316815 -72629 140270 -92068 -143135 -76221 72942 -188418 -263830
5945 -263830 -97282 -156829 194808 204340 225723 -46338 96194 -237115 -19953 -126802 -12782
5933 100002 127841 -34749 -38001 194134 -465683 81298 2710 69317 -120990 195673 -113302
5921 70298 255700 -82687 -4941 -345473 -307268 176014 -218289 -130074 -291151 95526 -370066
5909 95791 -11476 10631 -331121 -26019 175295 48716 293723 223168 -290751 -274668 28003
5897 54656 -56826 160116 -18090 -247250 -129489 -62696 -52717 159580 -138295 -62618 55480
5885 -28515 -50254 -69761 -125097 238655 143249 -117094 -148888 -52404 -90332 -47033 -56999 6143
5872 -205669 -254899 10979 -894 -246908 79689 -216746 -18618 173256 54960 -20056 -207303
5861 -207303 -4696 -221873 135579 -254609 185702 -163930 -191434 -128544 -6118 -105179 136355
5849 128725 -174697 175546 188997 -23810 115498 -108195 -171419 46730 87413 -209893 366705
5837 221677 79795 -44138 -152692 48280 -67187 -61730 64063 103755 -58830 -69783 239984
5825 -118641 -346272 30939 300896 -195461 -130337 90906 41152 89826 -194175 -57211 146496
5813 -225249 154900 -216808 -108618 49791 79607 -45827 18831 269229 -52643 -239704 -42829
5801 180851 114949 -42501 -149008 -35040 60806 -192693 -301729 -294148 -113769 -78828 214915
5789 -185866 -176518 133980 -222756 -191175 -25002 -283300 281143 -499827 251289 284516 -447486
5777 282542 -214561 -3940 125765 -644821 -29989 -124859 313502 16904 350178 -234888 156336
5765 79727 183120 148626 176160 228733 83027 -24599 124016 -47313 -31021 134041 -121117
5753 -191560 247428 -55576 47943 22424 105475 -89316 242652 32890 -57759 -81414 151595
5741 141121 12508 236856 236914 169928 10734 108711 -256534 137877 -18466 145011 -271553
5729 -27862 -180665 -41121 4579 -121998 257961 6731 -140098 -55694 -429797 -105003 323769
5717 28305 -251519 218833 727 314716 -87520 -5031 -30874 34386 36098 55275 76339 -257263
5704 13299 -140842 99172 -128366 313173 150392 -93333 233884 -15453 -216361 -190884 -87493
5692 224771 -80229 25788 -280485 -161016 -196058 158951 -34075 -59220 224776 -135357 273876
5680 -343165 90782 244333 -33243 99207 101945 23389 209184 -166981 -179067 -51296 -84352
5669 -84352 42014 -60715 -337591 -128892 152771 -41971 92221 61100 -74542 185059 -139630
5657 274209 173015 4658 157144 -122236 164112 18021 -179909 73791 -27175 189779 253493
5646 253493 123581 113969 -89127 53376 -202002 -175176 19933 -122097 -79741 292279 -16662
5634 19129 -38202 -12154 62574 -29192 162088 14240 -150840 44243 -158571 -166210 206960
5622 163610 -67047 157390 88788 110893 65036 12303 -224286 154227 -125508 257232 108468
5610 -32704 304353 -44460 -101192 -27789 94804 310922 -137227 10103 -165773 79807 71346
5599 71346 -159360 -160843 208014 -56368 -438513 -102339 -23260 38391 -143076 187631 135839
5588 135839 -123117 -252839 270320 198302 114840 -143213 796 -134219 -90104 -141243 -67565
5576 24497 87966 -27173 -417072 119747 196330 266157 -139463 -117332 -99885 41891 49526
5565 49526 -240697 150471 -195609 -52587 138138 62286 136019 27660 -58113 575024 186817
5553 66184 66577 -256503 -115566 -79297 37514 -26263 71159 200371 -172056 154169 -37603
5541 37987 415496 273098 -208616 -208587 -9522 -163582 -112746 -55610 29478 112407 -208050 -3546
5528 -33534 -360751 -60364 -21867 16034 -62854 23475 17226 -19219 89292 173404 -63652 -481329
5516 -481329 -167396 267589 -264078 -25502 -300596 -49770 201147 67803 294860 -444980
5505 6118 -118435 46332 -8195 109150 -103055 37095 -83111 309273 169941 -4588 161509
5493 92650 30849 132869 134477 142415 -18722 276866 272921 93823 -173771 28577 14502 -271973
5480 172523 -26259 108795 236776 164808 -32911 90897 -152457 -148626 -28728 112741 -35008
5468 121369 -320487 -77767 -83029 161818 115369 -118451 17914 -195800 293359 -298870 -202922
5457 -202922 133787 190212 151825 -191550 -330634 44271 21859 130758 -144366 -238959 75247
5445 -11442 21912 -71389 -45120 -24214 216808 -206153 -38942 -278492 220083 7584 -132843
5433 66467 -79195 -71225 307176 -101611 -330764 162532 -130232 67586 -101212 156213 3804
5421 -23892 137501 26001 454554 216338 175408 24126 -110713 -140202 278458 -106700 274994
5409 193157 41237 33643 -123333 -216305 -46783 -20730 -108579 105942 -161017 10351 -235656
5397 352088 4699 33431 -86291 92378 -68117 -28785 209122 111482 -85555 169509 150310
5386 150310 22272 202065 151528 -340226 64245 196445 -295568 50578 -147567 -133096 -192628
5375 -192628 104220 96297 -110946 25511 -99878 -84271 465070 109535 -80955 -447299 -224124
5364 -224124 183734 55383 -222557 168856 -141403 304100 117746 -48986 91103 399589
5354 399589 -34601 5093 40891 -188063 -17359 -123498 -67368 -50228 -164676 -49444 26087
5342 -112342 766 -14283 -356809 -203203 140217 226136 395689 -70291 175053 -349733 -10923
5330 26067 65408 295935 157656 -28273 -257981 -59709 35177 47669 106522 33665 144386
5319 144386 -210940 -155852 -189753 115391 67635 135082 78608 -163788 -740 -317536 71480
5307 289647 -7127 142959 -122686 -225928 147340 51939 -114848 -29969 -15879 128792 44809
5295 -114951 -250272 438956 -76426 43851 172852 -183468 245795 -253560 -180876 -187968 -165269
5284 -165269 85812 -92785 -322260 -157716 183413 -116657 60339 113252 -405132 -37308 -13903
5272 58959 -142709 -93478 195798 478978 -319288 218092 100947 -367388 -24190 130637
5261 -96723 371153 415777 -213 45722 -132132 -127323 -194135 61427 -85734 189018 -176170 -27161
5248 -280497 69449 79703 59080 -375861 28110 33891 277252 187271 -307105 64594 82768
5237 82768 -18180 3389 38338 -252332 162389 224883 -179790 -390636 262511 -28697 66135
5225 15525 -50865 -103337 -245856 46676 21314 -97677 20488 100901 -94620 12370 -217310
5213 -136822 155975 -58399 156146 -226661 1947 258910 -71199 19745 -203856 -178927 -104389
5202 -104389 -198269 64026 7551 12826 201551 10168 50357 16755 -152718 -364959 -133043
5190 186938 222891 -63407 65964 -233469 104219 317974 -96983 -131266 273077 29451 37090
5179 37090 460495 57119 -466822 153578 -50935 66061 19246 178697 81650 -225953 -40242
5167 116890 -50253 11643 58994 -427497 -188728 260958 -255062 -146638 194800 -56574
5156 113986 -280960 192675 405538 58707 168851 75002 -70881 -283434 -100270 9653 64472
5145 64472 103218 -9364 146267 107398 124746 438 311233 -15185 -76200 -270498 -1398 80205
5132 118893 329518 37185 -96178 -19511 24194 54434 469347 -18655 -232094 16736 175270
5121 175270 111644 -143858 109412 -47730 195163 135960 -148140 -270164 -3159 -216408 -368358
5110 -368358 201734 -27284 121692 -46132 -246790 -57715 142273 140789 37868 -366189 -34485
5098 -94022 -83926 -51014 258988 84292 -320909 36330 -149449 -182733 -5580 111553 28195
5086 -21315 99902 102963 -70140 -1498 8998 -251397 -303749 41803 -10735 -203387 190523 -4654
5073 16395 291674 61934 -8876 -100289 -77318 284007 -62586 78140 62947 -129207 -41098
5061 177048 -253789 424696 -87619 78474 -158469 83974 260276 227024 137541 46207 -305945
5049 366463 312428 30739 -109934 -2418 338519 -271197 493704 318393 12480 155788 -176756
5037 -209422 -102849 241200 79672 84342 -210073 -292862 143219 -150717 -83973 -100881 45951
5025 185079 -147161 72187 110280 -296094 580230 -41328 205478 -6517 -18752 -123562 -178295
5014 -178295 -205011 50552 252909 165389 119804 -154308 117058 -183307 191268 -156833
5003 324547 24775 -173855 82073 -72981 -51414 -79429 -122247 155393 123026 -69749 13101
4991 200238 295660 -134381 -233129 109523 8631 -278317 199098 138803 -72695 73788 -85615
4979 327841 54214 -275417 -97945 309794 28381 33258 -42679 -2281 -87194 -162620 123158
4967 160533 -55306 -195933 84125 29162 104032 -32149 -186535 75178 -33000 59603 205983
4956 205983 -195716 -218283 -55304 -120315 -44211 -26690 344657 -159236 -120124 -43519 -18031
4944 -18380 -162051 44504 -143672 -159566 136526 81674 -145641 192766 2275 55103 154412
4933 154412 314649 -67905 135995 -148421 32181 -209910 -323379 -41202 -53053 -149226 77750
4921 -360160 -172617 430404 112851 244534 71708 -195841 83083 -27823 131927 -43605
4910 -9617 54601 143006 150924 44924 107098 78913 79801 80931 -152048 59481 -57685 47988 -6102
4896 157049 -224649 95211 -45153 126828 126497 95659 -151249 -56172 -129873 -53956 -268159
4885 -268159 163907 79740 175721 259049 224692 206842 -138234 196032 -102067 297726 128796
4873 -300848 -120051 -43621 -391388 170077 -343006 -27411 -61003 171910 -308586 -428963
4863 -428963 151257 -4122 71530 83866 146372 -146631 31126 -296119 157724 -163863 4843
4851 174499 -179814 -123878 204652 -19194 -288952 -108405 80874 -49709 106392 -193396
4840 9621 295626 -38102 -286211 -120886 -278400 -20425 179593 -30552 84868 -253149 181549
4828 391049 -81181 -234240 -102217 213576 102615 55043 -109741 89713 55767 244346
4818 244346 125617 75425 124165 -138553 247476 35062 -84810 -20425 93654 -133160 310588
4806 -22421 -134350 -281227 -159450 198469 -43150 -30761 30486 -98655 256887 127072 -94706
4794 -128090 87614 328436 301720 206645 27547 -39650 43424 -262873 -230446 -91600 387837
4782 -60828 -100189 -75858 -157160 -12767 55661 -87126 95991 -47990 -116940 -45154 258304 220394
4770 220394 72880 -74070 -166753 -72253 327310 -3439 367940 -1613 14054 -196228 -131527
4759 -131527 245957 -68837 -171884 161073 -215953 -215379 -58037 153777 150067 36305 431443
4748 431443 70704 -116010 19868 79415 18546 100174 -56084 157680 -101586 236188 160365
4737 160365 -299142 -47825 81391 -91435 -216817 35249 168163 9332 157556 -54756 -30268
4726 -30268 95849 -187582 226109 165143 122963 -36466 -105895 -134670 77112 -70663 -226695
4715 -226695 -162444 -26576 65956 -53755 -14259 -292832 -122784 -93964 -237944 210788 -41748
4703 7794 -138305 183271 200002 37246 149293 7879 378430 -161978 -10224 -486230 274262
4691 16133 -34778 231857 36487 -120484 6948 180730 238860 -72414 -51330 159566 -267478
4679 52977 2874 -291352 136314 -20885 161953 141997 18298 24234 -32337 139691 6231 546027
4667 546027 40603 125287 -364499 10356 -46741 -184457 388810 -26845 331776 670 184759
4656 184759 27719 124671 225749 183450 110232 16889 -65655 201572 33128 48347 -73338
4644 -8751 -262526 214132 -88987 -194392 67113 79054 9035 6625 -95801 -72906 -211431 118735
4631 79262 76683 -120564 -123308 -135017 32591 -303060 -85338 164314 -367454 208293 -91131
4619 78593 -10104 -269312 368978 -291371 1375 37521 -134504 -78909 89628 43672 -360095
4607 -8367 -396277 251142 81062 -117894 -103382 -14416 -50884 40910 2592 248405 24881
4595 314450 -86842 54515 -10032 122570 23932 -133637 -28838 82015 -53285 196870 165587
4584 165587 236161 -31408 -166042 48856 8939 -92934 -140970 292763 -297646 1065 174627
4573 174627 217472 -194063 -1638 221863 -145101 25428 337243 75753 -62158 -105102 -24567
4561 16971 -275212 -98077 118511 -49604 -221224 57308 -160202 -47773 50339 249474 138450
4550 138450 30356 194104 -369887 -13839 112819 240812 249428 -34675 -164170 -55501 -154700
4539 -154700 -163378 104299 -422353 -389362 235137 9772 -62876 -4935 126691 122446 174886 -213974
4526 -189722 -55320 -35577 -95740 97130 269537 48851 197010 235244 -101555 255545 50228
4514 64087 -60651 11335 -454026 376696 170099 -44552 280589 227610 -30068 34448 261339
4503 261339 -119479 -195236 69110 39281 964 -3091 99309 -289667 -134568 -217194 -19290 214518
4490 174572 -144944 72402 8060 -28450 111405 271089 159861 -167146 261793 -61789 1873
$$ [...]
##END NTUPLES=NMR SPECTRUM
##END=
