##TITLE=AC1475_ZNESTR301_8100901_303tCqPQpd
##JCAMPDX= 6.0         $$ Bruker NMR JCAMP-DX V2.0
##DATA TYPE= NMR SPECTRUM
##DATA CLASS= NTUPLES
##ORIGIN= BRUKER
##OWNER= Administrator
$$ 1.72 TOPSPIN		Version 2.1
$$ 2013-07-31 15:45:59.200 -0700  Administrator@X
$$ Compression mode = diff/dup
##.OBSERVE FREQUENCY= 400.02188249412
##.OBSERVE NUCLEUS= ^1H
##.ACQUISITION MODE= SIMULTANEOUS (DQD)
##.ACQUISITION SCHEME= undefined
##.AVERAGES= 8
##.DIGITISER RES= 22
##SPECTROMETER/DATA SYSTEM= spect
##.PULSE SEQUENCE= zg30
##.SOLVENT NAME= COFFEE_meoh
##.SHIFT REFERENCE= INTERNAL, COFFEE_meoh, 1, 14.98509
##AUDIT TRAIL= $$ (NUMBER, WHEN, WHO, WHERE, PROCESS, VERSION, WHAT)
$$ ##TITLE= Audit trail, TOPSPIN		Version 2.1
$$ ##JCAMPDX= 5.01
$$ ##ORIGIN= Bruker BioSpin GmbH
$$ ##OWNER= Administrator
$$ $$ E:\/data/COFFEE/nmr/AC1475_ZNESTR301_8100901_303tCqPQpd/10/pdata/1/auditp.txt
$$ ##AUDIT TRAIL=  $$ (NUMBER, WHEN, WHO, WHERE, PROCESS, VERSION, WHAT)
(   1,<2013-07-31 15:45:52.591 -0700>,<Administrator>,<X>,<go>,<TOPSPIN 2.1>,
      <created by zg
	started at 2013-07-31 15:44:46.888 -0700,
	POWCHK enabled, PULCHK disabled,
       configuration hash MD5:
       C8 4E 4E 5D D3 5C D8 9E 9F 52 82 E0 59 8A DE 15
       data hash MD5: 64K
       F7 CB 58 A0 6F 31 44 DE CB 7D F0 15 73 F6 43 7C>)
(   2,<2013-07-31 15:45:55.513 -0700>,<Administrator>,<X>,<proc1d>,<TOPSPIN 2.1>,
      <Start of raw data processing
       efp LB = 0 FT_mod = 6 PKNL = 1 PHC0 = 0 PHC1 = 0 SI = 32K 
       data hash MD5: 32K
       73 82 04 CB D4 3F 17 42 7E 0C 46 04 0E 31 DA 1E>)
(   3,<2013-07-31 15:45:55.779 -0700>,<Administrator>,<X>,<proc1d>,<TOPSPIN 2.1>,
      <pk PHC0 = 97.66296 PHC1 = 0 
       data hash MD5: 32K
       5D 6E 1E 70 DF DF CF 20 5E 3F 58 46 18 28 5A AF>)
(   4,<2013-07-31 15:45:55.872 -0700>,<Administrator>,<X>,<proc1d>,<TOPSPIN 2.1>,
      <abs ABSG = 1 
       data hash MD5: 32K
       4C D5 79 2C 0A 72 FE 3C 28 6B 6F 8D 01 6D B3 86>)
(   5,<2013-07-31 15:45:55.919 -0700>,<Administrator>,<X>,<proc1d>,<TOPSPIN 2.1>,
      <abs ABSG = 2 
       data hash MD5: 32K
       98 92 C3 51 A8 0A D5 84 B9 64 A9 BF C8 A3 76 0E>)
(   6,<2013-07-31 15:45:55.997 -0700>,<Administrator>,<X>,<proc1d>,<TOPSPIN 2.1>,
      <abs ABSG = 3 
       data hash MD5: 32K
       90 C4 F8 7B F0 E8 11 8A 15 1E 5B A2 1D C5 A5 A8>)
(   7,<2013-07-31 15:45:56.060 -0700>,<Administrator>,<X>,<proc1d>,<TOPSPIN 2.1>,
      <abs ABSG = 4 
       data hash MD5: 32K
       24 B7 8B 1D E1 8B 5F 28 B0 A7 0C 66 0E 68 41 CB>)
(   8,<2013-07-31 15:45:56.107 -0700>,<Administrator>,<X>,<proc1d>,<TOPSPIN 2.1>,
      <abs ABSG = 5 
       data hash MD5: 32K
       0B B9 00 79 21 4D BA 98 65 A5 79 AB 17 9D 3E BE>)
$$ ##END=
$$ 
$$ $$ hash MD5
$$ $$ 15 2D 8D 66 AE 0E 43 FF CC 49 74 6A 3E 61 60 7B
##$RELAX= 
##$RELAX= 
##$RELAX= 
##$RELAX= 
##$RELAX= 
##$RELAX= 
##$RELAX= 
$$ Bruker specific parameters
$$ --------------------------
##$DU= <E:\>
##$EXPNO= 10
##$NAME= <AC1475_ZNESTR301_8100901_303tCqPQpd>
$$ [...]
150 150 150 150 150 150 150 150
##$TP07= 0
##$TPNAME0= <>
##$TPNAME1= <>
##$TPNAME2= <>
##$TPNAME3= <>
##$TPNAME4= <>
##$TPNAME5= <>
##$TPNAME6= <>
##$TPNAME7= <>
##$TPOAL= (0..7)
0.5 0.5 0.5 0.5 0.5 0.5 0.5 0.5
##$TPOFFS= (0..7)
0 0 0 0 0 0 0 0
##$TUNHIN= 0
##$TUNHOUT= 0
##$TUNXOUT= 0
##$USERA1= <user>
##$USERA2= <user>
##$USERA3= <user>
##$USERA4= <user>
##$USERA5= <user>
##$V9= 5
##$VALIST= <valist>
##$VCLIST= <CCCCCCCCCCCCCCC>
##$VD= 0
##$VDLIST= <DDDDDDDDDDDDDDD>
##$VPLIST= <PPPPPPPPPPPPPPP>
##$VTLIST= <TTTTTTTTTTTTTTT>
##$WBST= 2048
##$WBSW= 25
##$XGAIN= (0..3)
0 0 0 0
##$XL= 0
##$YL= 0
##$YMAX_a= 660601
##$YMIN_a= -561885
##$ZGOPTNS= <>
##$ZL1= 120
##$ZL2= 120
##$ZL3= 120
##$ZL4= 120
##$ABSF1= 14.98509
##$ABSF2= -5.573092
##$ABSG= 5
##$ABSL= 3
##$ALPHA= 0
##$AQORDER= 0
##$ASSFAC= 0
##$ASSFACI= 0
##$ASSFACX= 0
##$ASSWID= 0
##$AUNMP= <proc_prof1d_extract_pilot.lims>
##$AXLEFT= 0
##$AXNAME= <>
##$AXNUC= <1H>
##$AXRIGHT= 0
##$AXTYPE= 0
##$AXUNIT= <>
##$AZFE= 0.1
##$AZFW= 0.1
##$BCFW= 0
##$BC_mod= 0
##$BYTORDP= 0
##$COROFFS= 0
##$CY= 15
##$DATMOD= 1
##$DC= 0
##$DFILT= <>
##$DTYPP= 0
##$F1P= 0
##$F2P= 0
##$FCOR= 0.5
##$FTSIZE= 32768
##$FT_mod= 6
##$GAMMA= 0
##$GB= 0
##$INTBC= 1
##$INTSCL= 1
##$ISEN= 128
##$LB= 0
##$LEV0= 0
##$LPBIN= 0
##$MAXI= 10000
##$MC2= 0
##$MEAN= 0
##$ME_mod= 0
##$MI= 0
##$NCOEF= 0
##$NC_proc= -8
##$NLEV= 6
##$NOISF1= 0
##$NOISF2= 0
##$NSP= 0
##$NTH_PI= 0
##$NZP= 0
##$OFFSET= 14.98509
##$PC= 1
##$PHC0= 97.66296
##$PHC1= 0
##$PH_mod= 1
##$PKNL= yes
##$PPARMOD= 0
##$PPDIAG= 0
##$PPIPTYP= 0
##$PPMPNUM= 2147483647
##$PPRESOL= 1
##$PSCAL= 4
##$PSIGN= 0
##$PYNMP= <proc.py>
##$REVERSE= no
##$SF= 400.02
##$SI= 32768
##$SIGF1= 0
##$SIGF2= 0
##$SINO= 400
##$SIOLD= 32768
##$SPECTYP= <>
##$SREGLST= <1H.CDCl3>
##$SSB= 0
##$STSI= 32768
##$STSR= 0
##$SW_p= 8223.68421052631
##$SYMM= 0
##$S_DEV= 0
##$TDeff= 65536
##$TDoff= 0
##$TI= <>
##$TILT= no
##$TM1= 0
##$TM2= 0
##$TOPLEV= 0
##$USERP1= <user>
##$USERP2= <user>
##$USERP3= <user>
##$USERP4= <user>
##$USERP5= <user>
##$WDW= 1
##$XDIM= 32768
##$YMAX_p= 462408326
##$YMIN_p= -744110
##$CURPLOT= <Network HP LaserJet P1505>
##$CURPRIN= <$Network HP LaserJet P1505>
##$DFORMAT= <normdp>
##$LAYOUT= <+/1D_H.xwp>
##$LFORMAT= <normlp>
##$PFORMAT= <normpl>
##$SURQMSG= 1
$$ End of Bruker specific parameters
$$ ---------------------------------
##NTUPLES= NMR SPECTRUM
##VAR_NAME=  FREQUENCY,     SPECTRUM/REAL,   SPECTRUM/IMAG
##SYMBOL=    X,             R,               I
##VAR_TYPE=  INDEPENDENT,   DEPENDENT,       DEPENDENT
##VAR_FORM=  AFFN,          ASDF,            ASDF
##VAR_DIM=   32768,         32768,           32768
##UNITS=     HZ,            ARBITRARY UNITS, ARBITRARY UNITS
##FACTOR=    0.250966925370066, 1,           1
##FIRST=     8223.43324360094, -103864,      -209037
##LAST=      0,             -277002,         -153454
##MIN=       0,             -744110,         0
##MAX=       8223.43324360094, 462408326,    0
$$ Real data points
##PAGE= N=1
##DATA TABLE= (X++(R..R)), XYDATA
$$ [...]
19543c75820a31258B0737J86083f4299A84377A3618i4720E533J50436a06677j9864
19532a26541B31752O6907A22861a25626P526G3249C428K65268f1901m3318l22417
19521d27636J16463B29326b1824A03695a64778A23764b1705A12873b30812A41443
19510H2316b99724a09553b8373j10618A33549B1805a08719A6630p588a00155j31132
19499b31287k082B29802d1370E3720b60159B47458m5186a76171l34459D3785c6871
19487h4687j51112A501a67248B4992a65266l14848g3041j82915A3227b37220A21648
19475a65867l22855c2558I0271g8067b0436j23679H1208l1596b76416G2750a22652
19463F5273k8166c70689B39993g9837q6592j33537R1776p3944f1453E827b06520
$$ y = [-375820, -131258, 20737, 206820, -64299, 184377, 13618, -94720, 5533, 155969, -106677, -126541, 231752, 298659, 122861, -125626, -118100, 73249, 3428, 268696, -61901, -105219, -427636, -311173, 229326, -21824, 103695, -164778, 123764, -21705, 112873, -230812, 141443, 82316, -299724, -109553, -28373, -138991, 133549, 21805, -108719, 16630, 9042, -100155, -231287, -233369, 229802, -41370, 53720, -260159, 247458, 202272, -176171, -510630, 43785, -36871, -84687, -235799, 1501, -167248, 24992, -165266, -480114, -73041, -255956, 13227, -237220, 121648, -165867, -488722, -32558, 90271, -78067, -20436, -144115, 81208, 49612, -276416, 72750, -122652, 65273, 37107, -370689, 239993, -79837, -166429, -299966, -208190, -282134, -61453, 5827, -206520]
19451a47629l24472a62678B03271q1609g3842j40072A01882a71509a4275B66531
19440B23192a4051j93268A36782b5301B3705M12091b35700c2470j46791d872B06274
19428a31617J2182B8764d5091o2700j18789a07497K7760D2670i3124j9021k02408
19417c14553k00376H9393a03978F1407K97233b9988F8063e4826k18369n6332a23007
19405D9051K72810A7128K5704J7881b61786H9969J70494h5520j20263j19562h4498
19393A48234J38887j24912c60206a49391j3647K0936i152A40323e12843e5397
19382B00015p5107d34610E4854d4528j2221A73734b9170m2342c0798j03716j3775
19371a48289M1011A07907a90102d0849k19648B58875a81105C770b24163B27857
$$ y = [-147629, -472101, -162678, 203271, 121662, -73842, -213914, 101882, -171509, -14275, 266531, 223192, -14051, -207319, 136782, -25301, 23705, 435796, -235700, -32470, -179261, -4872, 206274, -131617, -119435, 28764, -45091, -107791, -226580, -107497, -79737, 42670, -93124, -112145, -314553, -514929, 89393, -103978, 61407, 358640, -29988, 68063, -54826, -273195, -329527, -123007, 49051, 321861, 17128, 42832, 60713, -261786, 89969, 260463, -85520, -205783, -325345, -84498, 148234, 287121, 162209, -360206, -149391, -163038, -142102, -9152, 140323, -512843, -55397, 200015, 124908, -434610, 54854, -44528, -56749, 173734, -29170, -71512, -30798, -134514, -148289, -107278, 107907, -190102, -40849, -260497, 258875, -181105, 3770, -224163, 227857]
19360B41122a68604k97932C5592f134B67313c29451G1611b70745b2544k01721
19350b24265E8572e934j12648I241K8782a74812n1110A4617K8225b00003k17193
19339d17196J96870d9785E3704d3566k86141a13059l726o5801A78744A8343a39505
19327c1272A34094E0363c93865A5820J17016d89244f6074b1573A55110m6417a16749
19315a25507L8968m68619A057a48801b3088m50314I7841a13372A4375e793l88334
19304c94127I8919m1879J2558h2230n8215E2594a60058j72085O9758O7610D2877
19292A62940L11274f8587B95488a71431c5141C9328e0175K194l97237a06606K7422
19281g9184j90061a4116A63375G666b38906d3528j50577N3105K5044D73908a63559
$$ y = [241122, -168604, -466536, 35592, -6134, 267313, -329451, 71611, -270745, -22544, -224265, 58572, -5934, -118582, 9241, 38023, -174812, -225922, 14617, 42842, -200003, -417196, -220326, -49785, 53704, -43566, -329707, -113059, -116785, -182586, 178744, 18343, -139505, -31272, 134094, 50363, -393865, 15820, 132836, -489244, -66074, -21573, 155110, 108693, -116749, -125507, -86539, -555158, 1057, -148801, -23088, -473402, 97841, -113372, 14375, -5793, -394127, 98919, 57040, 69598, -82230, -140445, 52594, -160058, -332143, -262385, -194775, 42877, 162940, 474214, -68587, 295488, -171431, -35141, 39328, -50175, -47981, -445218, -106606, -79184, -269245, -14116, 163375, 7666, -238906, -43528, -194105, -141000, -115956, 473908, -163559]
19269c05900J4419g8686F2570i9533G2212b441D147K61058i0572d856A97397d51686
19256b83632a9020j21022m22558K64245i695r6213j51265o3373K6950a33786a793
19244B97417a37625r163B86211l4040e0416k73786A17170A3027O625e6613j02106
19233a58719A13654L90397A54632b07182d7357k47790J08736g9801F9512b8005
19222B06480a80340D7836a12534b1733k40880A8655R3480b48540l7037C37713
19211f8390p0487A78444a13973G9917G955J95553p5681J38306a14734o946a090
19199c26478Q1902E0259a9388I5929a95943q598f8906I6802b48953E3264P5993
19188A29257a3467n1012f868A72556a54713j5645k32759a98522D11L7481A2736
$$ y = [-305900, -291481, -78686, 62570, -99533, 72212, -2441, 4147, 265205, -90572, -4856, 197397, -451686, -283632, -19020, -140042, -562600, -298355, -9695, -105908, -257173, -320546, -293596, -133786, -1793, 297417, -137625, -146788, 286211, 252171, -50416, -324202, 117170, 13027, 19652, -56613, -158719, 113654, 504051, 154632, -207182, -47357, -295147, -186411, -79801, 69512, -28005, 206480, -180340, 47836, -112534, -21733, -262613, 18655, 112135, -248540, -285577, 337713, -68390, -138877, 178444, -113973, 79917, 7955, 203508, 127827, 266133, -114734, -121680, -1090, -326478, -244576, 50259, -19388, 95929, -195943, -204541, -68906, 96802, -248953, 53264, 129257, -13467, -64479, -6868, 172556, -154713, -170358, -403117, -198522, 411, 37892, 12736]
19176A2177L6676b68350h8103k66375P2632M0451a01951k24040i7605l00388e7370
19164a45515D6349O3816a04844j19285a06217I836J41583d32471E660a76855O9944
19153a06911K6353A54147b32047H5592R9926C3360g0717A40251c26701A74844
19142B0789a50617o1861C5152K492a44281J5162a3220l23800J00646i7665j7172
19131a14837B26852k8359a33919A49078g5966l40849B98061b58409B30868b03800
19120I9336M8859E1581a31185C20832k5009c03592B59862A2146J71657J588D2998
19108c15499a06168A73851o0160b68745n7996M2458a24612C4443j5534O5837K8442
19097A13188N0662b53575K2859A0804a64958k63204a86998B55321a07809M1223
$$ y = [12177, 48853, -268350, -88103, -354478, -281846, -241395, -101951, -325991, -97605, -397993, -57370, -145515, 46349, 110165, -104844, -224129, -106217, 9836, 151419, -432471, 5660, -176855, -106911, -80558, 154147, -232047, 85592, 185518, 33360, -70717, 140251, -326701, 174844, 20789, -150617, -212478, 35152, 37644, -144281, -129119, -13220, -337020, -236374, -97665, -114837, 226852, 198493, -133919, 149078, -75966, -416815, 298061, -258409, 230868, -203800, 99336, 148195, 51581, -131185, 320832, 295823, -303592, 259862, 12146, 183803, 185391, 42998, -315499, -106168, 173851, 113691, -268745, -326741, -284283, -124612, 34443, 18909, 84746, 113188, 163850, -253575, -230716, 10804, -164958, -428162, -186998, 255321, -107809, -66586]
19087f6586l24820I7924N7013A3804J89165r2687a22835d118B66535C3824o531
19076B7293M7936b94507g1930c4154j40816J9668R839d6748k23529H7053b0257
19064c47914a45844n6389a8187f199l13242A80671C611h8235C9515R4701k1117
19053A13099d4191A2671b11436k85432A00166g0389O577c912k79199h1086A51861
19041B92926b2608l9446k27676Q7452h468B87545p1251a92679j56928D17854a76691
19029a0718E1746K4886K02308G0266B7246a07539A52970c23386E8724g8530j73223
19018b51753b6026B54298G4795C3125J0573a12420b2883j0375o6292B88002h2007
19006d5022k3315A68205a97435e0144B8358d27053F5120a72041C0781K31573o5453
$$ y = [-66586, -391406, 97924, 154937, 13804, 202969, 110282, -122835, -4118, 266535, 33824, 27293, 75229, -294507, -71930, -34154, -174970, -155302, -145463, -46748, -270277, 87053, -20257, -347914, -145844, -202233, -18187, -6199, -319441, 180671, 3611, -88235, 39515, 134216, 113099, -44191, 12671, -211436, -496868, 100166, -70389, -63812, -3912, -283111, -81086, 151861, 292926, -22608, -62054, -289730, -202278, -8468, 287545, 216294, -192679, -349607, 417854, -176691, -10718, 51746, 76632, 278940, 70266, 27246, -107539, 152970, -323386, 58724, -78530, -251753, -26026, 254298, 74795, 33125, 43698, -112420, -22883, -33258, -99550, 288002, -82007, -45022, -68337, 168205, -197435, -50144, 28358, -427053, 65120, -172041, 30781, 262354, 196901]
18995A96901E3236B0107a8617k46322j52534K04518a03762M9431C5510h4307l1075
18984a15382B56329a39444C11521b30236p1760L7087a652j90175A29886i2305
18973B03856B1553h0547A0458a38817A48435j2157e2281j37286L4767f3538A05456
18961A27677h3711J0060l0921B5209a29179L5903c3391A5515a21169b9552A03136
18949a13782J1487k82634d9020A24518a74809p9558f0680I8007J76562b04878
18938a15863p1259C02533a6840C65276G7965a31329O5171p2943A81244d33181
18927a9991C5989a44081B20943b4577m15120B83090b05400C625h9560M377M0443
18916d4740j58405i5927b8165o5029I517c01601B05731B695d205j96038A01227
$$ y = [196901, 53236, 20107, -18617, -264939, -417473, -212955, -103762, -54331, 35510, -84307, -115382, 256329, -139444, 311521, -230236, -301996, -264909, -1652, -191827, 129886, -92305, 203856, 21553, -80547, 10458, -138817, 148435, 136278, -52281, -189567, -154800, -63538, 105456, 127677, -83711, -73651, -104572, 25209, -129179, -93276, -33391, 15515, -121169, -29552, 103136, -113782, -102295, -384929, -49020, 124518, -174809, -254367, -60680, 98007, 274569, -204878, -115863, -187122, 302533, -16840, 365276, 77965, -131329, -66158, -139101, 181244, -433181, -19991, 35989, -144081, 220943, -24577, -439697, 283090, -205400, 3625, -89560, -85183, -44740, -203145, -95927, -28165, -93194, 9517, -301601, 205731, 2695, -4205, -200243, 101227]
18904a26783j72064a8390B27246r8372a67630j4155F4745J6911A2762d55700K08155
18893b47545a7422B7799N0053a0772o7445p2330j07656N6821B78839A1197c02356
18881b48624k5827R4173E0698a18519c5299J0428B27171N5729c7388o8669j83888
18870b89945A0376d4258H7581a96887B46914E1943a39458f9103B45540a39809
18859c21782n8110A74113b87186g2441k92882A55654F4732J2708a8109C646L4803
18848C8449J93g4026j61719B6961K6582i2401E5897a85033m7071g9189k0164L2566
18836f6787D6820c57325F5085e2463j88832Q0506k90422a27892c8115C43790E7545
18824B72363B9394b43002Q4301M4090C48581g5109M316l6260o8020o5082A3930
$$ y = [-126783, -298847, -18390, 227246, 128874, -167630, -181785, 64745, 81656, 12762, -455700, -247545, -17422, 27799, 77852, -10772, -78217, -150547, -258203, -201382, 278839, 11197, -302356, -248624, -274451, -180278, 50698, -118519, -35299, -24871, 227171, 282900, -37388, -106057, -289945, 10376, -44258, 87581, -196887, 246914, 51943, -139458, -69103, 245540, -139809, -321782, -379892, 174113, -287186, -72441, -365323, 155654, 64732, 77440, -18109, 3646, 38449, 38642, -74026, -235745, 26961, 53543, -92401, 55897, -185033, -232104, -79189, -99353, -66787, 46820, -357325, 65085, -52463, -241295, -160789, -451211, -127892, -38115, 343790, 57545, 272363, 29394, -243002, -158701, -114611, 348581, -75109, -70793, -107053, -175073, -240155, 13930]
18812a9235B11245b04113a7759o824q2932N2388I2870J59799J31428A16333b02863
18800H9859h1720B28329h6686C42914A45935b89112A13502a73949d7122j52200
18790a99322R4105q3329A15253a35909E4699c7523K130p2738A62203b65223I3041
18778d84195B2172K61688d0800F2307J63317h7972j54295b557H8840a5935A81749
18766a9746A54481a76737P134g2656k62182D46796d8346j34242A07028e39645
18755e33361H6407a74918L4208A47794E6385C624K11097B5047b41743g2135q1437
18744a53572g2391C72102a08055d5929l18901a03221j40993B8709a53674j86305
18734c39979A84543E4412b20958B07119b62011a11220Q093l8487j99491h6343
$$ y = [-19235, 211245, -204113, -17759, -24583, -107515, -55127, 92870, 252669, 384097, 116333, -202863, 89859, -81720, 228329, -86686, 342914, 145935, -289112, 113502, -173949, -47122, -199322, -105217, -188546, 115253, -135909, 54699, -37523, -35393, -108131, 162203, -265223, 93041, -484195, 22172, 283860, -40800, 62307, 225624, -87972, -242267, -2557, 88840, -15935, 181749, -19746, 154481, -176737, -169603, -72656, -334838, 446796, -48346, -182588, 107028, -539645, -533361, 86407, -174918, -140710, 147794, 56385, 3624, 214721, 25047, -241743, -72135, -153572, -72391, 372102, -108055, -45929, -364830, -103221, -244214, 28709, -153674, -339979, 184543, 54412, -220958, 207119, -262011, -111220, -103127, -141614, -341105, -86343]
18723D4946c17705c6083P503A54368h8927C0890M9773a7293j15796l0800a5460
18711A1349b8844A60876F0529a90933B05658j0024b07337q0252B4354a38919B12727
18699b97553B67363b68073a5314q2227H2803K39869i0000B70698g7557j26494
18689b04051k7784O8434P4271M2413I1910J44384i2366o7973d3700B16143b59515
18677c284l0796j72956D0208A9837M6663f5022k39738E8930b23504j35800a17789
18665a28012A94704b41545J02937j31381A46382c4318A90477P8438i6018I2623
18654c25740e6668l7019A59702m3582j8489c99286O8705a53179H7548K1529b26296
18642C33296b15920d7821j50582f9572D70898H6607a29074B59792b72452a6349
$$ y = [44946, -317705, -36083, -28580, 154368, -88927, 30890, 80663, -17293, -133089, -163889, -15460, 11349, -28844, 160876, 60529, -190933, 205658, 195634, -207337, -287589, 24354, -138919, 212727, -297553, 267363, -268073, -15314, -97541, 82803, 322672, -90000, 270698, -77557, -204051, -231835, -163401, -89130, -46717, 91910, 236294, -92366, -160339, -43700, 216143, -259515, -3284, -34080, -207036, 40208, 19837, 66500, -65022, -304760, 58930, -223504, -359304, -117789, -128012, 194704, -241545, -138608, -269989, 146382, -34318, 190477, 268915, -96018, 92623, -325740, -56668, -93687, 159702, 116120, 97631, -399286, -330581, -153179, 87548, 109077, -226296, 333296, -215920, -47821, -198403, -69572, 470898, 86607, -129074, 259792, -272452, -16349]
18631a06408a67j86589A00175b36217A59917D8849a04385A3854a40866j0347B0946
18619e1068r0261O2780A47720a82338E5968A1532d07702i1428p108A94052c89485
18607h8995A07098a02190A34201l0830d02913a27687j85684P2659Q5361J086N7310
18596i6955G6191g0043B9566a99691A57516e02458b29779H1861c18429B3410b84142
18584e03688J29672J55706D4272a87551o083C6477e9225p9896n1724R0706l6172
18573a36311c0874I3938C5042c35668h275j48465N8461A29525E950d87652f8542
18561c10587j308g7045A61467a73627k0204j7637B26539b33672J16518B09884
18550g0705A624e8570A09893Q3025d74719b33905a05058c4500B56171H6701E279
$$ y = [-106408, -167, -186756, 100175, -236217, 159917, 48849, -104385, 13854, -140866, -151213, 20946, -51068, -141329, -78549, 147720, -182338, 55968, 11532, -407702, -91428, -98536, 194052, -389485, -88995, 107098, -102190, 134201, 103371, -402913, -127687, -313371, -240712, -155351, -154265, -96955, 76191, -70043, 29566, -199691, 157516, -502458, -229779, 81861, -318429, 23410, -284142, -503688, -374016, -218310, 44272, -187551, -193634, 36477, -59225, -139121, -190845, -100139, -136311, -30874, 93938, 35042, -335668, -8275, -156740, -98279, 129525, 5950, -487652, -68542, -310587, -311895, -77045, 161467, -173627, -193831, -211468, 226539, -233672, -117154, 209884, -70705, 1624, -58570, 109893, 192918, -474719, -233905, -105058, -34500, 256171, 86701, 5279]
18538d24799A52934a09389k9428J486A92496A2334c57224B29227a68282l57089
18528e25371a76637C98759b1401m273I2911b88251i4756G321g1364p3456f5154
18516h4287G3906a35137j0453c0510n6377j6875B8226J67638d9606k32645A56279
18504b89315A01266f8240A66303b04240a4910B10808d5014m3103I038f4984j38
18493f5122j09316A69985p2761a47211D3744c14020p1263J07886Q262d9539p9057
18482a28596F9999b28021P2317B64190A21097N0614a381j65124B97666b76606
18471a19820M2106A86130a60075l5459a4644j61944e3598H3303d216k64276J18824
18460a49668A86201a24144k6617K0549d6193k95772d1616o4315k89049H2922J78987
$$ y = [-424799, 152934, -109389, -138817, -137331, 192496, 12334, -357224, 229227, -168282, -525371, -176637, 398759, -21401, -25674, 92911, -288251, -94756, 7321, -71364, -144820, -65154, -84287, 73906, -135137, -145590, -30510, -86887, -103762, 28226, 195864, -49606, -282251, 156279, -289315, 101266, -68240, 166303, -204240, -14910, 210808, -45014, -88117, 9038, -64984, -65122, -174438, 169985, 97224, -147211, 43744, -314020, -385283, -277397, -269135, -49539, -128596, 69999, -228021, -155704, 264190, 121097, 171711, -1381, -166505, 297666, -276606, -119820, -77714, 186130, -160075, -195534, -14644, -176588, -53598, 83303, -4216, -268492, -149668, 186201, -124144, -150761, -130212, -46193, -341965, -41616, -105931, -394980, 82922, 261909]
18449B61909c81679B61115f8833A7768M4789c27682i5617k21198L4162N0236a1073
18437B62687E7229J66617b45663a05104A27098A0084a09228l4336d6008l1054
18427g7062E7126c39476a38736J2802M1312B84129a13338k4485d3621k43684G946
18415b66480A05692h1367B7494b2129k8717p6638A27231d7418j59486A11040d563
18403A48665q121d07594a40136j21383a19005A00306L2074a02504P189A48009
18392G7771A4039K14649a72022E1271g8209L1361J2398j20p8949H6247a95625
18380C87544D2336M7126e01786a19263e6232b7705H1572d1097A02737k9441j4528
18369E8768c5615A27257h8203J3290i891A31260E4425K03426b07797f1671l2416
$$ y = [261909, -381679, 261115, -68833, 17768, 62557, -327682, -95617, -316815, -282653, -232417, -11073, 262687, 57229, 223846, -245663, -105104, 127098, 10084, -109228, -143564, -46008, -77062, 57126, -339476, -138736, -125934, -84622, 284129, -113338, -137823, -43621, -287305, 7946, -266480, 105692, -81367, 27494, -22129, -50846, -127484, 127231, -47418, -206904, 111040, -4563, 148665, 140544, -407594, -140136, -261519, -119005, 100306, 132380, -102504, -95315, 148009, 77771, 14039, 228688, -172022, 51271, -78209, -46848, -34450, -34570, -113519, 86247, -195625, 387544, 42336, 89462, -501786, -119263, -56232, -27705, 81572, -41097, 102737, 73296, 58768, -35615, 127257, -88203, -74913, -9891, 131260, 54425, 257851, -207797, -61671, -94087]
18358i4087h197B66538h4001o7362F1882b73044C47055A19360c90779A26703J2160
18347A38863k185a647q4136A4278c42994A0277c9835p5842A17728B0409J10870
18336A31279c597k27705E0621g9602A48515F6904a89204k9940k11233A20150l8868
18325H1282c1595n7853H7536a77362a1996G3450e7427j08677c2630A93270O7213
18314B60483a66113B43902A6256i6277A2791d1691j69183I0612a14226A32105
18303b71293O4871k19797Q4040i349B29936a27354H3674a30208q6008O1471o6120
18292b20865A85896h7847A60892c5585k58539P1476N5919F7335a23405m8324N0992
18281a20737A18590e3542m1462j82999D07930j40218a06822B30899F9824f2831
$$ y = [-94087, -8197, 266538, -84001, -151363, 61882, -273044, 347055, 119360, -390779, 126703, 138863, 136678, -1647, -85783, 14278, -342994, 10277, -39835, -115677, 117728, 20409, 131279, -3597, -231302, 50621, -79602, 148515, 66904, -189204, -219144, -430377, 120150, 81282, -31595, -89448, 87536, -177362, -11996, 73450, -57427, -166104, -32630, 193270, 260483, -166113, 243902, 16256, -96277, 12791, -41691, -210874, 90612, -114226, 132105, -271293, -206422, -426219, -342179, -9349, 229936, -127354, 83674, -130208, -216216, -154745, -220865, 185896, -87847, 160892, -35585, -294124, -222648, -166729, 67335, -123405, -171729, -120737, 118590, -53542, -95004, -278003, 407930, 267712, -106822, 230899, 69824, -62831]
18270D6901d06905J99422O1310j47682J07082B27056b48760C4406H871a06846
18259h7353L8679B27682d6017b0872k4781k9403D1939P2053J53075h9084b2028
18247g41F7366i4926C314e5318o6713q0553q2596F7536e8571C15138f4151l582
18235f7733k28680Q5896h3369A4164c49089a56573P4614K5780k52970e2686p2924
18224a25610C9815J39327c6274j87468H2273f7642j8163L7940R4q4670A40077
18212d6154r3796k2642j29137A57367b37626d9493m0293j02306I3134c04028J9537
18201b84491h3861I4707a19954d1296I8284f6052L1981k5313A21698J65612F143
18189g4600B90250e9060j92964a16199E714J48104J3230h2474d0293m8867D80824
$$ y = [46901, -406905, -207483, -146173, -293855, -186773, 227056, -248760, 34406, 8871, -106846, -87353, -48674, 227682, -46017, -20872, -45653, -75056, 41939, 113992, 267067, -89084, -22028, -741, 67366, -94926, 3314, -55318, -122031, -202584, -285180, 67536, -58571, 315138, -64151, -67733, -296413, -210517, -83369, 14164, -349089, -156573, -81959, -56179, -309149, -52686, -125610, 39815, 179142, -36274, -223742, 82273, -67642, -85805, -47865, -47771, -132441, 140077, -46154, -139950, -162592, -291729, 157367, -237626, -49493, -89786, -192092, 93134, -304028, -284491, -83861, 94707, -119954, -41296, 98284, -66052, -34071, -59384, 121698, 287310, 6143, -74600, 290250, -59060, -252024, -116199, 5714, 153818, 167048, -82474, -40293, -89160, 480824]
18177a30081m5898k17486h9596o1593E640M6921a60912N6306l0535f2488A2989
18165A48336f1919d327B13979g991j11082j84813I429K1828g0825m4760h590D2795
18152E1628J25258K36923a6165A22821a20746A1784c48266a25356j13158G0500
18141g5404k23164B4441L25132d0710l6925k2166j06437A12242a55157A45286
18130b27969J13566j34995a6215B33228F8154c0625A85087a36737o2132a6061
18119f6449E052e0483K067j9840M205D19024G0907e62j03825B9265a60275C7402
18106b35208J4797A79428p1981b79348h5283r1046f8985f936A39442J47671n6903
18095B30210F6021K37035c10165a46112j91484A21598d4316A6303c37492I6915
$$ y = [-130081, -175979, -393465, -89596, -151189, 5640, 52561, -160912, -104606, -135141, -62488, 12989, 148336, -61919, -4327, 213979, -7991, -119073, -303886, 9429, 31257, -70825, -115585, -8590, 42795, 51628, 176886, 413809, -16165, 122821, -120746, 11784, -348266, -125356, -238514, 70500, -75404, -298568, 24441, 349573, -40710, -77635, -99801, -206238, 112242, -155157, 145286, -227969, -114403, -249398, -16215, 233228, 68154, -30625, 185087, -136737, -198869, -16061, -66449, 5052, -50483, -48416, -68256, -64051, 419024, 70907, -562, -104387, 29265, -160275, 37402, -235208, -220411, 179428, 107447, -279348, -85283, -176329, -68985, -6936, 139442, 287113, 230210, 66021, 303056, -310165, -146112, -337596, 121598, -44316, 16303, -337492, 96915]
18084f2839B95132g2836G4998a24068k5839D8168a85455j7804j53146D4226a6418
18072b29940n3820G8743O136J096b51423c2332j61538O0920N8894a9661j12951
18061a32612q5828k5933g8774E0989h3685A11216R946J28383f6074B0042b80691
18049c11752C17376H7148b31457A7818c04593J35310E24440b03990B77246b75701
18038b13686B23921b02260M3597G8397B2081K0784g8597j64029e7723n3257j31172
18027b42152B77731H5692Q6896D9548k598a49745k66914A45423F8533a05135A55965
18015g0155k57977a4487j76324R5062a1048B12810a28289D4898J5305O4695D8796
18003a85176I0289d14551a62380A44302m4632k287e4507k02701B46231b73449
$$ y = [-62839, 295132, -72836, 74998, -124068, -149907, 48168, -185455, -203259, -356405, 44226, -16418, -229940, -283760, 78743, 84879, 85975, -251423, -32332, -193870, -132950, -74056, -19661, -132612, -218440, -244373, -78774, 50989, -83685, 111216, 121162, 249545, -66074, 20042, -280691, -311752, 317376, 87148, -231457, 17818, -304593, -169283, 524440, -203990, 277246, -275701, -213686, 223921, -202260, -158663, 78397, 22081, 42865, -78597, -242626, -57723, -110980, -242152, 277731, 85692, 172588, 49548, 46950, -149745, -416659, 145423, 68533, -105135, 155965, -70155, -328132, -14487, -190811, -95749, -11048, 212810, -128289, 44898, 60203, 124898, 48796, -185176, 90289, -414551, -162380, 144302, 99670, 97383, -54507, -257208, 246231, -273449]
17992A13827N8999j9473o5871b80895H8736a71284L1526A91147K1523C7312a09468
17980a6566j20541a8390k13555D8746k0431J81286r2402j6152a28572q657j0394
17969a47623A46248c34075A01333J08359c51540A3747a26272b2747B6641J6608
17959D3249b58006f2898A54804b45215a0107l94734a51129j28958B21731e57863
17948C2723b951D6697L1492N8668a98385q8905C7138N728h4518J1501k2586B2091
17935b75992B48626a70846M2936H7490b1580D8827J12702p8634K00021b78111
17924D461c9116A31803b44695J01842A05338d3361k8737b4273j1020A67571i9849
17912a77819e5911A21163b52500j25487a76136e4599A86639d0347A53168J40028
$$ y = [113827, 172826, 153353, 87482, -280895, 88736, -171284, -139758, 191147, 212670, 37312, -109468, -16566, -137107, -18390, -231945, 48746, 28315, 209601, 117199, 101047, -128572, -137229, -147623, 146248, -334075, 101333, 209692, -351540, 13747, -126272, -22747, 26641, 43249, -258006, -62898, 154804, -245215, -10107, -404841, -151129, -280087, 221731, -557863, 32723, -2951, 46697, 78189, 136857, -198385, -287290, 37138, 42866, -84518, -73017, -95603, 22091, -275992, 248626, -170846, -127910, 87490, -21580, 48827, 161529, 82895, 282916, -278111, 4461, -39116, 131803, -244695, -142853, 105338, -43361, -72098, -24273, -35293, 167571, -99849, -177819, -55911, 121163, -252500, -377987, -176136, -54599, 186639, -40347, 153168, 293196]
17902B93196c0194j29882C3667c8044D7494a51663c0608j78865d6902A60049d52303
17890d1188E651c07736a06466B47914p9897F1190J8285g6290B02668p6907j7990
17879A07771b46785B44427a40659O2924m966k4728G4041i8351J6570K8547G5108
17867b86636b261k3059C82098A01811g3756J6197l9614B09203n2796O35F6725
17855a74151N2421A19407a52865A23175b4065j90611a03831k56235d3145k32652
17845b75797e7504C01539e0505E9122a68454L178A10359K2138a12217b9068r1710
17834a20778C04952b86022k945a16054b8092k4744C73223b60884j12746H2727
17823C12578I817K7523O3158D5669b1059O919k8458e907k03198A0155J4229a65243
$$ y = [293196, -30194, -160076, 33667, -38044, 47494, -151663, -30608, -209473, -46902, 160049, -452303, -41188, 5651, -307736, -106466, 247914, 168017, 61190, 79475, -76290, 202668, 125761, 107771, -246785, 244427, -140659, -77735, -82701, -107429, 74041, -98351, -81781, -53234, 75108, -286636, -2261, -25320, 382098, 101811, -73756, -57559, -97173, 209203, 156407, 157042, 66725, -174151, -121730, 119407, -152865, 123175, -24065, -214676, -103831, -360066, -43145, -275797, -57504, 301539, -50505, 59122, -168454, -165276, 110359, 132497, -112217, -29068, -120778, 304952, -286022, -288967, -116054, -28092, -52836, 373223, -260884, -373630, 82727, 312578, 9817, 37340, 100498, 45669, -21059, -14140, -42598, -5907, -209105, 10155, 24384, -165243]
17810a341k45717C3270d488D7849b15091A17702i7909j13259C78753c28534B06
17798D88688a33445A38703j3563b3988D0728f2540F0353J04833a11142C71014
17787a76482G1975a07852a8586j34849M5633B1555i908l17823D5651i3134K9211
17776f3923o31l71244a12898C955c8206I8847K07471a5424A68356F4218i0664
17764A54849d13499A83700d7354A79570L2292J40107a91136g3593j55054b1710
17753a23867m5339j09582A1241Q2495K58988B0672a67643B45189g6997B18487
17742b36705j89388A0787g1274r9401k23199a59596N272p7836D21996d05857g0558
17730A16243B7350i0836b8274P685H7214J05904D4753d7547B46580E386g6734
$$ y = [-1341, -247058, 33270, -4488, 47849, -215091, 117702, -97909, -211168, 378753, -328534, 206, 488688, -133445, 138703, 125140, -23988, 40728, -62540, 60353, 165186, -111142, 371014, -176482, 71975, -107852, -18586, -153435, -107802, 21555, -9908, -327731, 45651, -93134, -63923, -64554, -435798, -112898, 3955, -38206, 98847, 306318, -15424, 168356, 64218, -90664, 154849, -413499, 183700, -47354, 179570, 211862, 351969, -191136, -73593, -228647, -21710, -123867, -169206, -278788, 11241, 93736, 352724, 20672, -167643, 245189, -76997, 218487, -236705, -426093, 10787, -71274, -170675, -393874, -159596, -154324, -232160, 421996, -405857, -70558, 116243, 27350, -90836, -28274, -20589, 87214, 193118, 44753, -47547, 246580, 5386, -76734]
17718H6898C0562a28256B56836b6061q313G060a64041a8710D2209g3677j38505
17707b12182A64083b9542j33141n3267A07988g4396A55879a43351B80662b57719
17696f6577B01573d9058A7654d7191o2317A2649K01330K3541E4648a94463c3501
17684c27021F9523J39820c99761H9183R2709k6611l4078d8503A47132a26695F1348
17672C2015a35095F8413J95570b87491B46535a53718P1396H9878b51940B48764
17661a08600J6032C029a83386K0598A2939b2850j30257C9396c8125A13178L9473
17650A52651P2658R7310H5753e2114J0970A41678d5966J6737A78878e8554k50201
17639c08755a02647d7215k30050f6818o6777E4136a30920r3521P9334p1097L3170
$$ y = [86898, 30562, -128256, 256836, -26061, -34374, 7060, -164041, -18710, 42209, -73677, -212182, 164083, -29542, -162683, -215950, 107988, -74396, 155879, -143351, 280662, -257719, -66577, 201573, -49058, 17654, -47191, -109508, 12649, 213979, 237520, 54648, -194463, -33501, -327021, 69523, 209343, -399761, 89183, 181892, 155281, 121203, -48503, 147132, -126695, 61348, 32015, -135095, 68413, 263983, -287491, 246535, -153718, -82322, 89878, -251940, 248764, -108600, -92568, 3029, -183386, -162788, 12939, -22850, -153107, 39396, -38125, 113178, 152651, 225309, 322619, 85753, -52114, -41144, 141678, -45966, -29229, 178878, -58554, -308755, -102647, -47215, -277265, -66818, -133595, 54136, -130920, -224441, -145107, -216204, -183034]
17628a83034B21755m2529N7286A8054J15059a56765A49326a36038k5268F3472
17617A39393D3021M4960J53731a3969A65527o7102b0210j60107A24108E3831f3315
17605c0192C3135a22509B10385C0411K21478k0193a46903A15684M5165E1521K34883
17594B86404A9609M05111A4688K76993C8326M5504b01973E7439c1660A06968e3026
17582a40049H7283e084j59074B20981l2977D706a95180D1645J17868b41100a2252
17570A00228j6404O439c0385j38907A08556B4930K96037a5135k54169b0665A32271
17558A29909K73771A55761c12818D1375a5217C43315q6177A9055a19781j44844
17548b64625B23590J10595a06350A95915a01494N786A5664B545e4591k7538G0677
$$ y = [-183034, 221755, 179226, 236512, 18054, 133113, -156765, 149326, -136038, -161306, 63472, 139393, 43021, 87981, 241712, -13969, 165527, 98425, -20210, -180317, 124108, 53831, -63315, -30192, 33135, -122509, 210385, 30411, 251889, 231696, -146903, 115684, 160849, 51521, 286404, 19609, 424720, 14688, 291681, 38326, 83830, -201973, 57439, -31660, 106968, -53026, -140049, 87283, -5084, -164158, 220981, 188004, 4706, -195180, 41645, 159513, -241100, -12252, 100228, 83824, 90263, -30385, -169292, 108556, 24930, 320967, -15135, -269304, -20665, 132271, 129909, 403680, 155761, -312818, 41375, -15217, 343315, 257138, 19055, -119781, -264625, 223590, 334185, -106350, 195915, -101494, -95708, 15664, 2545, -54591, -82129, 70677]
17536B76435a0255F0101L99448h1587C52672I0353g1294A40372a16335C83735
17525C08592L191j5206A29178K9582n1298a65179I3318d7156k58761b1065B07695
17513D6329l396J37409a47492A37347h4521H5708M8333K22486a62315B71883B2925
17501G3324J46671n3845G1017B5522a30253M9951A37025R7219a45776L9449A94936
17489a5472H8821J23323n3431M4243J06090d0333H9835i7406B22294G6217A3490
17477A90732J23217a17426j8269D08998A90611I1929L34966c56606A20954g5128
17466d7835G3154a17350B99900j23587O0997c43335i0729n3965B59854E9565A2989
17454E5844J44962a5252B58833b53026C7895m815R5840m3804L30865j69086p1337
$$ y = [276435, -10255, 60101, 459549, -81587, 352672, 90353, -71294, 140372, -116335, 383735, 308592, 311783, 296577, 129178, 158760, 107462, -165179, 93318, -47156, -305917, -21065, 207695, 46329, 42933, 180342, -147492, 137347, -84521, 85708, 134041, 356527, -162315, 271883, 22925, 73324, 219995, 166150, 71017, 25522, -130253, -80302, 137025, 234244, -145776, -106327, 194936, -15472, 88821, 212144, 158713, 202956, 309046, -40333, 89835, -97406, 222294, 76217, 13490, 190732, 313949, -117426, -135695, 408998, 190611, 91929, 426895, -356606, 120954, -75128, -47835, 73154, -117350, 299900, 176313, 237310, -343335, -90729, -144694, 259854, 59565, 12989, 55844, 200806, -15252, 258833, -253026, 37895, 33080, 128920, 85116, 415981, 246895, 175558]
17443A75558F1808a4203A00154e4354C2605J36934J22980P167p6318l8985q8111
17432I6272L49244H4521K18910E4244L05822a45149E2026L36209A16788m0099
17422G6689K59437K1619a07310C27018k2242j8082j39450J36007K2482A27517
17411i9675p5103C03013A3244J28249B4378J47254g5200D46037i8045A11940d5351
17399A26982J00441Q6326F0808J72050L2645J8972q8967O1021i5815C30454q9013
17388B41441K8078j33145l8282a63151A36577B5939a75584B82443j18462P7489
17378B41470c62607E7611J07437J48467k266a13080B035K29593E8020L2468J35984
17367B26472D2007a87026D97441A31879J02013D4877M5900c8531B31723l2024
$$ y = [175558, 61808, -14203, 100154, -54354, 32605, 169539, 292519, 299686, 223368, 184383, 96272, 445516, 84521, 303431, 54244, 360066, -145149, 52026, 388235, 116788, 76689, 336126, 357745, -107310, 327018, 304776, 286694, 147244, 283251, 305733, 127517, -99675, -174778, 303013, 13244, 141493, 24378, 171632, -75200, 446037, -98045, 111940, -45351, 126982, 227423, 313749, 60808, 232858, 265503, 284475, 195508, 256529, -95815, 330454, 241441, 269519, 136374, 98092, -163151, 136577, 25939, -175584, 282443, 163981, 241470, -362607, 57611, 165048, 313515, 311249, -113080, 2035, 231628, 58020, 90488, 226472, 42007, -187026, 497441, 131879, 233892, 44877, 90777, -38531, 231723, 199699]
17357A99699J6831q5091E9873L01140j71295J66399j73964H6951k5312A2883a4517
17345I9387l585K5653J54651B9885f5697A14756l7516B4159K32338A07067c33172
17333h2563A13145c5206B02223k2812C3304H067J33813R7649j08434o2058K36073
17322C05110a58950B1575M1962L11860j71525r6008Q9603I0078J22364e9825B81547
17310D33035c2817q94J1540j97362g6826L7250B65558a49351I5030K62499A8335
17298A50071j5767N0189i7261D76999H8333R1112R2707r8762N8201a48369N2019
17287i6350B85286B4815e7745G0431a16722A87796L3774j3044n5907i65G6240
17275f1604B52170b9837C16101j11836q4371P1017i8710G9720L39017A27633J92885
$$ y = [199699, 216530, 131439, 59873, 361013, 189718, 356117, 182153, 86951, 61639, 12883, -14517, 99387, 95802, 121455, 276106, 29885, -65697, 114756, 77240, 24159, 256497, 107067, -333172, -82563, 113145, -35206, 202223, 179411, 33304, 8067, 141880, 239529, 131095, 69037, 305110, -158950, 21575, 63537, 375397, 203872, 107864, 197467, 90078, 212442, -59825, 281547, 433035, -32817, -33711, -22171, -219533, -76826, -39576, 265558, -149351, 95030, 357529, 18335, 150071, 134304, 184493, -97261, 476999, 88333, 179445, 272152, 173390, 231591, -148369, -96350, 285286, 24815, -57745, 70431, -116722, 187796, 221570, 208526, 152619, -965, 76240, -61604, 252170, -29837, 316101, 204265, 119894, 190911, -98710, 79720, 418737, 127633, 320518]
17264C20518A16650K19228N5058A65683a2428D00446m5261J55713A80279L9596
17254B19875R4891I6969K00803f1879k1180A05893c3574A84645q6666K57738M6184
17243D01901j15247n0639F8411O7808C5946K7469M69295h7689D55272c9513A96190
17231A49499K04391O9311j76139B9593K44282a2330C40449O8922a78581c2535
17220D61193j51821K2954q0858L4008A12212Q7830C9775b3700A97593B0180L02416
17209C22596j43936J50159j59926J04738J38690b1923D11708K8222a6817C15132
17198D0221J38178L96444A86362E4631L42746G8567J27237K07919j57033J84671
17188D41361A67521f1005H8379J50059J40524J8729m3440D5153L37851j73459
$$ y = [320518, 116650, 335878, 390936, 165683, -12428, 400446, 355185, 510898, 180279, 219875, 314766, 96969, 297772, -61879, -83059, 105893, -33574, 184645, 97979, 355717, 401901, 286654, 236015, 68411, 136219, 35946, 63415, 532710, -87689, 455272, -39513, 196190, 149499, 353890, 423201, 247062, 29593, 273875, -12330, 340449, 409371, -178581, -32535, 461193, 309372, 332326, 251468, 285476, 112212, 200042, 39775, -23700, 197593, 20180, 322596, 178660, 328819, 168893, 273631, 412321, -21923, 411708, 439930, -16817, 315132, 40221, 178399, 574843, 186362, 54631, 397377, 78567, 205804, 413723, 256690, 441361, 167521, -61005, 88379, 238438, 378962, 397691, 354251, 45153, 383004, 209545]
17178B09545J3523K97863A89829K0710J8422p7407c173A01608Q5590K79899A76373
17166A22886K11441L6403j63833E7392K54854L26174B65193m9167Q8507l8163
17156B66370O4533n5762A29822J75557N1419q3740j05426J4264b6927C08550o8434
17145B40116L5349q620L60191H5010J95196K00274p6812r4637A46468K33160A565
17133B66856I0612L5423K02706J2865j231k9733J01896a46292C87497P0582i4119
17121a353C39859l7356K21962j5943j33929A62422J42771l07P4755Q7715j18265
17110C49091j12738B7049J11057K66969a45526D23408K6834j17574p5797M4252
17100C01123K26710D1760K47086J83962j34596l8100A18198K96888j0235A67367
$$ y = [209545, 223068, 520931, 189829, 210539, 228961, 151554, -3173, 101608, 187198, 467097, 176373, 122886, 334327, 370730, 206897, 57392, 312246, 638420, 265193, 216026, 304533, 266370, 330903, 275141, 129822, 305379, 356798, 273058, 167632, 181896, -26927, 308550, 240116, 275465, 266845, 627036, 85010, 280206, 480480, 403668, 309031, 146468, 379628, 1565, 266856, 90612, 126035, 328741, 341606, 340375, 310642, 412538, -146292, 387497, 458079, -94119, -1353, 339859, 302503, 524465, 508522, 374593, 162422, 305193, 304886, 379641, 467356, 349091, 236353, 27049, 138106, 405075, -145526, 423408, 450242, 332668, 256871, 301123, 527833, 41760, 288846, 472808, 338212, 300112, 118198, 415086, 404851, 167367]
17089A10873K46765m8879N3935K65724r9629B00396C3763M4571J52876M50480
17079F81690l28727q07K33791k90430j7149L51029k9449B31550J90703k3415L5740
17068D34578J58814k10833A78533M57095j30546j78916K02876j02041A48967K58739
17058D07706K67442p0795K37402D18942K66971M6075L6854C60072K67985j21424
17048E06633M6394P5765j12234j59544O5418J0601J54449B41910L85458q8621
17038E38747M1607J64877j93974J38446J40225j07644C55009J73214j6980L07534
17028H18777l94521L224K96314k22925J35723J65240B32992L17945R6211o1817
17018E85331K56688M0686k9115q6563m5705j16025J89885k98434J00134J37533
$$ y = [110873, 357638, 308759, 362694, 628418, 528789, 200396, 33763, 78334, 231210, 681690, 352963, 352156, 585947, 295517, 278368, 629397, 599948, 231550, 422253, 398838, 434578, 593392, 382559, 178533, 635628, 505082, 326166, 529042, 427001, 148967, 407706, 675148, 604353, 841755, 418942, 685913, 731988, 768842, 360072, 628057, 506633, 553027, 628792, 516558, 357014, 422432, 433033, 587482, 241910, 627368, 538747, 580354, 745231, 551257, 689703, 829928, 722284, 355009, 528223, 511243, 818777, 424256, 427480, 723794, 500869, 636592, 801832, 232992, 550937, 647148, 585331, 842019, 882705, 853590, 767027, 721322, 605297, 795182, 496748, 596882, 734415]
17008G34415J54094B73846P00921q5148n9959J10094k49002k37762K25555K3682
16998G02227J32002j06123O9292K96210k08833o7126L4940n335C73398M06011
16988G79409P9960k3155k66010K90288J1137l94144J53054o27P0076J25914K86050
16977A111952k50925D28987L64727J72012k20407j43681M74127j99185J90374
16968A066954J35005m15846M5873J67668k49125M69962n89796M80602j88435j20692
16958H02170N9019L26132l00215J36905J31626k28241K59162J14820k36049l75629
16948F89700K40583j39240M92679k80777K15045k22933p123K33621K8700j14464
16938A135791J65708j27923j49416K08032R5457j06927j54929J89148M8282J76989
$$ y = [734415, 888509, 273846, 974767, 889619, 829660, 939754, 690752, 452990, 678545, 702227, 834229, 728106, 797398, 1093608, 884775, 817649, 852589, 847254, 373398, 779409, 859369, 836214, 570204, 860492, 871629, 477485, 630539, 629912, 699988, 825902, 1111952, 861027, 428987, 793714, 965726, 745319, 601638, 1075765, 876580, 1066954, 1201959, 786113, 831986, 999654, 750529, 1220491, 630695, 1111297, 922862, 802170, 861189, 1187321, 887106, 1024011, 1155637, 927396, 1186558, 1301378, 1065329, 689700, 930283, 791043, 1283722, 1002945, 1217990, 995057, 987934, 1221555, 1250255, 1135791, 1301499, 1173576, 1024160, 1232192, 1327649, 1220722, 1065793, 1254941, 1303223, 1480212]
16928A480212k88467K62085j49140j00183k3515K52455k6156j99124K63848j15112
16918A356903j00403L37110n28347K08386M01846n15840M52702J13150k19357
16909A506150m2465J58626j10101m3200r3278L28108j36950J44330j51056J87512
16899A747676P1609j26679o9641k9121J22805o6213K11767l01546L87324j07631
16889A840350l1176q0169O8582N28249m76288K07788k42076L65668o571J21174
16879B295531N788k45362M67435j10740j18134L06166l99945R8175P6329J44940
16869B520183l5040J5136r8194M7010M31878m25448j2998K25794o148N2714J97619
16858B912506O5383o2958m20797K91194J55521M38656m30412M5976K72070J05546
$$ y = [1480212, 1191745, 1453830, 1304690, 1204507, 1180992, 1433447, 1407291, 1208167, 1472015, 1356903, 1256500, 1593610, 1065263, 1273649, 1675495, 1159655, 1612357, 1725507, 1506150, 1463685, 1622311, 1512210, 1469010, 1375732, 1703840, 1566890, 1711220, 1560164, 1747676, 1819285, 1692606, 1622965, 1593844, 1716649, 1650436, 1862203, 1560657, 1947981, 1840350, 1809174, 1729005, 1797587, 2325836, 1849548, 2057336, 1815260, 2180928, 2174357, 2295531, 2301319, 2055957, 2523392, 2412652, 2294518, 2600684, 2200739, 2298914, 2375243, 2520183, 2485143, 2500279, 2402085, 2449095, 2880973, 2455525, 2442527, 2668321, 2662173, 2714887, 2912506, 2977889, 2914931, 2494134, 2785328, 2940849, 3379505, 2949093, 2995069, 3267139, 3372685]
16848C372685q6232O4702J00478K5467J6921L36000k00927Q5161R657k40194L60796
16837C844514p2036J00688K25958J2575K60939k9915J82106k95034J37274q5475
16827D281594N55608j85587M40712n2921J92077j14112M36964j82442P1686M28315
16817E871894k1572M38795l85150L74778L28614l05369O2326M80914l01117M26941
16807F971054J04650J60352M68362l31253O38586m18695N55725K46052j37794
16798H257039Q37131k68142J79092L31745L1413N64810M95102o3281L59125K92823
16788A1016857M52382L0023M54163L96901r6751Q37865L10448M07780k419P18672
16778A4525921P05077O89453K06120M66808P76850M63375N91986O36746P35907
$$ y = [3372685, 3286453, 3351155, 3451633, 3477100, 3494021, 3830021, 3629094, 3714255, 3723912, 3483718, 3844514, 3772478, 3873166, 4099124, 4111699, 4372638, 4342723, 4524829, 4229795, 4367069, 4281594, 4837202, 4651615, 5092327, 5039406, 5231483, 5117371, 5554335, 5371893, 5443579, 5871894, 5850322, 6289117, 5903967, 6278745, 6607359, 6301990, 6364316, 6845230, 6544113, 6971054, 7075704, 7236056, 7704418, 7373165, 8011751, 7593056, 8148781, 8394833, 8257039, 9094170, 8826028, 9005120, 9336865, 9368278, 9933088, 10428190, 10364909, 10724034, 11016857, 11469239, 11499262, 11953425, 12350326, 12253575, 13091440, 13401888, 13809668, 13807249, 14525921, 15230998, 15920451, 16126571, 16593379, 17370229, 17833604, 18425590, 19062336, 19798243]
16769A9798243P07320M73611J052711R25649N84995R73830J195329Q53176J332790
16760B7897654J015963J599765J178140J057009J847713J304696J825071J647947
16752C9373958J931343K161706K200122K565987K268694L184123K901274K733188
16744E9320395L481255L567318L899899L803525M687437M702474M952683N303969
16736I3718955N651168O384307O593603O880022P247220P355887P351238P869289
16728A49051689P857254P651258P636535O857786N907337N707971M061377K832081
16720A97563288J904565K45997r23509k334761l406589n186578o028315o453270
16712A75380828p100901p238397p844154p844053p684964p708995p446358p465833
$$ y = [19798243, 20505563, 20979174, 22031885, 22957534, 23542529, 24516359, 25711688, 26564864, 27897654, 28913617, 30513382, 31691522, 32748531, 34596244, 35900940, 37726011, 39373958, 41305301, 43467007, 45667129, 48233116, 50501810, 53685933, 56587207, 59320395, 62801650, 66368968, 70268867, 74072392, 78759829, 83462303, 88414986, 93718955, 99370123, 105754430, 112348033, 119228055, 126475275, 133831162, 141182400, 149051689, 156908943, 164560201, 172196736, 179054522, 184961859, 190669830, 194731207, 197563288, 199467853, 199713850, 198790341, 196455580, 193048991, 187862413, 181834098, 175380828, 168279927, 161041530, 153197376, 145353323, 137668359, 129959364, 122513006, 115047173]
16704A15047173o778634o206772n783778n775841n316896n146260m756624m366293
16696G0916075m058697l288596l767478l471494k982081k643645l046007k019583
16688D5638494k610973j793809k144717k194279j182712j797229j775956j351350
16680C0787469j427123j410243o64705j284504j279478r26317p60792o36922j166419
16671B1230966o86839o79396j108490o77200m87534o40126q39153k02173n82934
16662A5327121l92452p13171J2828p57602l93028q83068J20759n43306k48052
16653A1530029o92142J07935K1473n39177l41477l96721l92736k93832j93983
16644H809369K35590o88961j3832m36388L1135k81938j19926k44124K20403o05902
$$ y = [115047173, 108268539, 102061767, 96277989, 90502148, 85185252, 80038992, 75282368, 70916075, 66857378, 63568782, 59801304, 56329810, 53347729, 50704084, 47658077, 45638494, 43027521, 41233712, 39088995, 36894716, 35712004, 33914775, 32138819, 30787469, 29360346, 27950103, 27285398, 26000894, 24721416, 23795099, 23034307, 22397385, 21230966, 20544127, 19864731, 18756241, 18079041, 17591507, 16951381, 16112228, 15910055, 15327121, 14934669, 14221498, 14234326, 13476724, 13083696, 12200628, 12321387, 11778081, 11530029, 10837887, 10945822, 10967295, 10428118, 10086641, 9689920, 9297184, 9003352, 8809369, 9044959, 8355998, 8342166, 7905778, 7936913, 7654975, 7535049, 7290925, 7511328, 6905426]
16634F905426k30963M54853m29764n92357J31091j27692l01485Q8568l4796k44432
16624E618449j1513j91549j71729o6284j13087l25134P4203j07823J4955J02252
16614D822740m87784L75875o15837J11230r9542p2899K9436p2252k68236R8812
16604C821543k10779j3478J93175j36212l51581K7028j26668k31092L24965k58267
16594C038634m6036L08947m18532N07700j55250n67953L45374k14777k04127K51209
16584B845189l45920L18097k5160k92428K2256R2149k11416K30242l9462k37775
16574B355772J76417j25109q2097R0993m86771M37946p4726l04492q7578L83291
16564B283646k05163j21506K27782l0552p5859l0937j70319r4669J18791j25643
$$ y = [6905426, 6674463, 7129316, 6699552, 6107195, 6238286, 6110594, 5809109, 5897677, 5862881, 5618449, 5606936, 5415387, 5243658, 5177374, 5064287, 4739153, 4813356, 4705533, 4720488, 4822740, 4334956, 4710831, 4094994, 4206224, 4106682, 4033783, 4063219, 3990967, 3722731, 3821543, 3610764, 3597286, 3790461, 3654249, 3302668, 3329696, 3203028, 2971936, 3296901, 3038634, 2992598, 3301545, 2883013, 3390713, 3235463, 2667510, 3012884, 2798107, 2593980, 2845189, 2499269, 2817366, 2792206, 2499778, 2522034, 2614183, 2402767, 2633009, 2593547, 2355772, 2532189, 2407080, 2324983, 2415976, 1929205, 2367151, 2292425, 1987933, 1900355, 2283646, 2078483, 1956977, 2184759, 2154207, 2078348, 2047411, 1877092, 1782423, 1901214, 1775571]
16554A775571j84108M28651k81405j60973J62413n04306K09776K14397K9826q802
16544A681040K12532n86115J44028K55615l85526K28464n4667K2535l47025k0178
16534A150703K66334m3351o8497J69828k01179J45767q7881J13201k83976O7720
16524A228669J28050r8184K32402o70260L57479m3690K47752l12767N9440k74367
16514H54524K27725J82019J44174m71494J60709l28980N70561j79595k83748M84936
16504A360831J36640m98206J15809k167k21242Q4796J13202k37673K99672k18012
16494I33650k33994K31221O6731m5715J28281k99742K19572k93939K27827j00384
16484H33508J20820j34348j64271q7467L26441J88595m86276J44433K73494j04216
$$ y = [1775571, 1591463, 2020114, 1738709, 1577736, 1740149, 1235843, 1445619, 1660016, 1689842, 1681040, 1893572, 1307457, 1451485, 1707100, 1321574, 1550038, 1495371, 1517906, 1170881, 1150703, 1417037, 1373686, 1305189, 1475017, 1273838, 1419605, 1331724, 1444925, 1160949, 1228669, 1356719, 1258535, 1490937, 820677, 1178156, 1134466, 1382218, 1069451, 1128891, 854524, 1082249, 1264268, 1408442, 936948, 1097657, 768677, 1339238, 1159643, 875895, 1360831, 1497471, 999265, 1115074, 1112907, 891665, 976461, 1089663, 851990, 1151662, 933650, 699656, 930877, 997608, 951893, 1080174, 780432, 1000004, 706065, 933892, 833508, 954328, 819980, 655709, 568242, 894683, 1083278, 597002, 741435, 1014929, 910713]
16474I10713N7158L6462l92189O1804L25453m70121L96284L6034m22196N38885
16464A078287j83962l29435R2199J45920k29868K7940j01663J80614m5391L3545
16454F68186L66932j06679k64478K40727l42359j55545K64291M4961q3772C01707
16443E70435O4605J54754C28818J72882L51265j35959K95517C43238N07796l50297
16433E00737M39627k89980j80035M3274j30841P1892L4213A07888N99799j11294
16423E96393j66645R9226K62860A30710L70543L36626l75985A93390N30663k20761
16413E03292j23111J07068n5785J93970k03020k7506Q0061n9853j565K42597r709
16402F46439B97447K03252j88425Q3759j36704J97275J7962k29164K12756N5353
$$ y = [910713, 967871, 1004333, 612144, 673948, 999401, 529280, 925564, 961598, 539402, 1078287, 894325, 564890, 657089, 803009, 573141, 601081, 499418, 680032, 634641, 668186, 1035118, 928439, 663961, 904688, 562329, 406784, 671075, 716036, 632264, 301707, 570435, 635040, 789794, 328818, 501700, 852965, 717006, 1012523, 343238, 851034, 500737, 940364, 650384, 470349, 513623, 382782, 454674, 488887, 107888, 707687, 596393, 429748, 528974, 791834, 130710, 501253, 837879, 461894, 193390, 724053, 503292, 380181, 487249, 431464, 625434, 422414, 394908, 474969, 415116, 413551, 656148, 646439, 297447, 500699, 312274, 396033, 259329, 456604, 474566, 245402, 458158, 513511]
16392E13511O316K36755C72609J65017j7740j41971H8272M82623f3322B41409
16381C95874J82293K683A58132J80871N2529j07828A39882J55753M0937G0970
16370A89080L74494j01760D4320M67805B05577R7088R9342j41984A29525B0994
16359C77236A42660C5733J81416R5178J21977J54641j10310A11817A334Q9793
16349I1127J78471m5797B6425M15685f463C88139q2662N7296Q3157j51624L7417
16338C31723L83k5330a91671A61261L87167h0960C65669A17481J8137J76293r5002
16327B16909b0423B31651L74504k81434k3101l3039r7322N14455k66007K78808
16317F98515F3476K98713m2136j24506J4072r5471L58171m8423B7579J56312J87701
$$ y = [513511, 519827, 756582, 372609, 537626, 519886, 377915, 88272, 570895, -63322, 241409, 395874, 578167, 580850, 158132, 339003, 391532, 283704, 139882, 295635, 336572, 70970, 189080, 563574, 461814, 44320, 512125, 205577, 302665, 402007, 260023, 129525, 20994, 377236, 142660, 35733, 217149, 312327, 434304, 588945, 478635, 111817, 1334, 91127, 269598, 223801, 26425, 442110, -6463, 388139, 305477, 362773, 445930, 294306, 331723, 332106, 306776, -191671, 161261, 548428, -80960, 365669, 117481, 135618, 311911, 216909, -20423, 231651, 606155, 324721, 301620, 268581, 171259, 685714, 419707, 698515, 63476, 362189, 320053, 195547, 209619, 114148, 472319, 423896, 27579, 183891, 371592]
16306C71592Q8848D5857K37501k194K49286j26608j27878A33173J52329B6445
16295C12125J90364k49047e2239n6050C07974K85492k12095A80238k0153K03417
16285C63502l0066A66579J68229B8312R5125K06101C2672L95584A2833J63129
16275A75962H1162J3934b8101C76093j45571j09606N3853H6506l0358e4752B70145
16263B88808O3368A08462J28423A07336K26583D8992K3189a41376e8906j48154
16253b07060I1107K23752J8040p146r5674A6793J32430D3313K62693n0587A4847
16241B18295a19698b5725G975J61853E2314J68443K2023O4273I8843J61714j9510
16230B41047B9952O9358O4649b2519B0995N6153l6183M0063K67029o0882E040
$$ y = [371592, 460440, 45857, 283358, 281164, 530450, 403842, 275964, 133173, 285502, 26445, 312125, 502489, 253442, -52239, -108289, 307974, 593466, 381371, 180238, 160085, 363502, 333436, 166579, 334808, 28312, 123437, 329538, 32672, 428256, 12833, 175962, 81162, 95096, -28101, 376093, 230522, 120916, 174769, 86506, 56148, -54752, 270145, 288808, 352176, 108462, 236885, 107336, 333919, 48992, 72181, -141376, -58906, -207060, 91107, 314859, 332899, 325753, 230079, 16793, 149223, 43313, 306006, 255419, 14847, 218295, -119698, -25725, 7975, 169828, 52314, 220757, 242780, 307053, 98843, 260557, 241047, 29952, 99310, 163959, -22519, 20995, 77148, 40965, 81028, 348057, 287175, 5040]
16218F5424J24088j3964B879K14159F3289c2207A45585k5671l5230M0146m011
16207A20819K13904M0777A83333Q5192j23597b64078D9244J10446J79020c1195
16196H1100N0482k9860i4645B3820J08967h1728j8268B02357b40929H7779a84331
16184C01180r7151h3711P081C71626a33271a4672k8932C13221P2520F4311b31275
16172g4673B44948a01434j1628A9564Q3537a1305E1604a37675A81002F9129a63416
16160a00855k8736G7869K11361a37753O1515A54687F0702i3082B60436b9742C928
16148D70210C0002a59972B37092a94405r9896H7761j5779J30279C4825O8087O189
16137A09101c1568I009K89029E2968J78338I3415A1147a29565g814j05436D61124
$$ y = [65424, 189512, 175548, 2879, 217038, 63289, -32207, 145585, 119914, 84684, 124830, 120819, 334723, 375500, 183333, 268525, 144928, -264078, 49244, 159690, 338710, -31195, 81100, 131582, 101722, -94645, 23820, 132787, -81728, -99996, 202357, -240929, 87779, -184331, 301180, 204029, -83711, -76630, 371626, -133271, -14672, -43604, 313221, 385741, 64311, -231275, -74673, 244948, -101434, -113062, 19564, 103101, -11305, 51604, -137675, 181002, 69129, -163416, -100855, -129591, 77869, 289230, -137753, -76238, 154687, 60702, -93082, 260436, -29742, 3928, 470210, 30002, -159972, 237092, -194405, -294301, 87761, 71982, 202261, 34825, 102912, 109101, -31568, 9009, 298038, 52968, 231306, 93415, 11147, -129565, -7814, -113250, 461124]
16125E4562a00379D30634d4908C26579b95261J7745D9123L8264L30137B02664
16114A0466c15408g2607H0965C6129a0698r6086J807A66739d2630A8739J23985
16103A42724P1214m4906Q0928o933j14632o4086E367K5955J6049j9942J40581
16092A68010I511L80J44409J0307l2480a127A20748C6685J75866a67394n3971
16081b21365j13693J21494i6597C4776N5757J21242b02636o4379R0596A39613
16070a90457M1615o3745D8529c8883H8813C3165a62631J9634C10603b25858k5394
16059b51252N8326L6747A64690J8096M8477F4692b62266A18220J8502K9631E634
16047D06111e7367L367k9130K7495C10237a66379k1585C4459c7266A81926g823
$$ y = [54562, -100379, 430634, -44908, 326579, -295261, -277516, 49123, 87387, 417524, 202664, 10466, -315408, -72607, 80965, 36129, -10698, -106784, -104977, 166739, -42630, 18739, 142724, 213938, 169032, 249960, 243027, 128395, 64309, 5367, 31322, 47371, 27429, 168010, 9511, 9891, 154300, 164607, 132127, -1127, 120748, 36685, 212551, -167394, -221365, -335058, -213564, -96597, 34776, 90533, 211775, -202636, -267015, -176419, 139613, -190457, -148842, -212587, 48529, -38883, 88813, 33165, -162631, -142997, 310603, -225858, -251252, -192926, -156179, 164690, 182786, 231263, 64692, -262266, 118220, 136722, 166353, 5634, 406111, -57367, -54000, -83130, -55635, 310237, -166379, -187964, 34459, -37266, 181926, -7823]
16035h2790l08438B16419k312D2947c65665A51551l1625b22085J10165N2176C4117
16023C84846A43584C8187J49032R7839H7443c24106e1426p8226C32705D0127J57298
16012A97425d2694q5853L5448d0921k15824a6564k8248k1206m2192I5066C6687
16000e1388l8326b8170r8614j39791R7177B68091p1815H2011b8436A30626j2645
15989A17981i2220C23260a21904m2619b942B04236l6307L5547k5450b08024A51211
15977b53525j11101D3496N2282a74465F0457a03822L9020k04126d197A72683g7391
15965a61491B65700I9475J2063C2334a44268L1391B3547b1915j3718J1309j92955
15954b17279L1868c9039o3286A73059i8297B60740h2881A2778b6347o7086n8015
$$ y = [-82790, -391228, 216419, 214107, 42947, -365665, 151551, 119926, -222085, -111920, -59744, 34117, 384846, 143584, 38187, 187219, 285058, 87443, -324106, -51426, -129652, 332705, 40127, 197425, -42694, -128547, -93099, -40921, -256745, -16564, -44812, -66018, -108210, 95066, 36687, -51388, -89714, -28170, -126784, -266575, -169398, 268091, 196276, 82011, -28436, 130626, 117981, -92220, 323260, -121904, -164523, -2942, 204236, 167929, 203476, 178026, -208024, 151211, -253525, -364626, 43496, 95778, -174465, 60457, -103822, -64802, -268928, -4197, 172683, -77391, -161491, 265700, 99475, 111538, 32334, -144268, -112877, 23547, -21915, -35633, -24324, -217279, -185411, -39039, -102325, 173059, -98297, 260740, -82881, 12778, -26347, -93433, -151448]
15943a51448k25568G2081n96b31755A6964a24574C10379a96250J028m8841k0635
15932b64698A2418b83418B5379b36050a11923E3257J9692b01896C5828J45492
15922A81320h7789p258A19099b43336A14868b42983A67185p0271b33287G6767
15911a59015L6055k43153B15242a3006j46183k5057L6025A59242k8173n5801a87468
15899A66329c8533A10526c68179a8928F5352a57195d1229j19202E4600e1346n3131
15888a04477j2485I757L6417d4383r9399g0490A05907b31315A8330L29284c8674
15876I218i3704B20572j05089M100a15106k2959E1153c55234a4764l232j17037
15865a35033j23541a16876C6700b00300d4644k4930b9740j30643D5916g1943j13572
$$ y = [-151448, -377016, 72081, 71485, -231755, 16964, -124574, 310379, -196250, -195222, -244063, -264698, 12418, -283418, 25379, -236050, -111923, 53257, 72949, -201896, 35828, 181320, -87789, -95047, 119099, -243336, 114868, -242983, 167185, 96914, -233287, 76767, -159015, -122960, -366113, 215242, -13006, -159189, -184246, -148221, 159242, 131069, 75268, -187468, 166329, -38533, 110526, -368179, -18928, 65352, -157195, -41229, -160431, 54600, -51346, -104477, -116962, 9757, 46174, -44383, -143782, -70490, 105907, -231315, 18330, 347614, -38674, 9218, -93704, 220572, 115483, 119583, -115106, -138065, 51153, -355234, -14764, -17996, -135033, -258574, -116876, 36700, -200300, -44644, -69574, -29740, -160383, 45916, -71943, -185515]
15854a85515j49128E8170c18480a38055D4953a88274L6946k0153o6476H327K18592
15843B26919m7491a68420j9571C12584a83122A22957b37220R8968H9056j6871
15833G2185a59176k1283h8596B75938r8146b6920C57285b37441A99330a38172
15822B5197e8702m25198B5940c34280b4400j46251B88699f2686E619J50961c2205
15810B3983b53658f578p1704l0957b3857B7055K3709b82786A91325c46702B91247
15798b7875p964j66553A09617c1176A90247g7280c6403k4468I5868a53199A89421
15786b18169H9788J00663B7486L951a67627f8676j33485K9118A0746h6772j38673
15775b25445L1816F2884b33418B1067M9167K25318b47003a08200A2337e4007j98956
$$ y = [-185515, -334643, 58170, -318480, -138055, 44953, -188274, -151328, -171481, -237957, 8327, 226919, 179428, -168420, -187991, 312584, -183122, 122957, -237220, -138252, 89056, 72185, -159176, -180459, -88596, 275938, 177792, -26920, 357285, -237441, 199330, -138172, 25197, -58702, -483900, 25940, -334280, -24400, -170651, 288699, -62686, 5619, 156580, -32205, 23983, -253658, -6578, -78282, -109239, -23857, 27055, 50764, -282786, 191325, -346702, 291247, -27875, -35839, -202392, 109617, -31176, 190247, -77280, -36403, -60871, 95868, -153199, 189421, -218169, 89788, 190451, 27486, 31437, -167627, -68676, -202161, -173043, 10746, -86772, -225445, -193629, 62884, -233418, 21067, 70234, 295552, -247003, -108200, 12337, -54007, -252963]
15764b52963A9622K5682p352a76880g2136l03930B46132b09047C61263A1294K81190
15753B92484f1849A28949a82175c1802k94829A60355a99972c7542n4674I5077
15742c8360C4238L8405f6393j51353d1335j66053b6217j09737d6990A02007a6514
15730A67079d4290j95817D7762b38972j39705a33569m6105f497E2598c64886e6122
15718F7764b46135i4355k37898p5511a02256D34648c3508j56622Q8121K2302m5391
15707a25098a1984B56660a36736h191k38470B21037b12754H765K0316Q7352a16742
15695A41689l7577N4820o942b8274A22334A7393O1848i741B0982K88744a34237
15683A14701c22162l9577R7736c4360j35822I2769a58254k95849C68017j32498
$$ y = [-252963, 19622, 45304, 37952, -176880, -72136, -376066, 246132, -209047, 361263, 11294, 292484, -61849, 128949, -182175, -31802, -326631, 160355, -199972, -37542, -92216, 95077, -38360, 34238, 72643, -66393, -217746, -41335, -207388, -26217, -135954, -46990, 102007, -16514, 167079, -44290, -240107, 47762, -238972, -378677, -133569, -179674, -6497, 52598, -364886, -56122, 67764, -246135, -94355, -332253, -407764, -102256, 434648, -33508, -190130, -102009, -79707, -125098, -11984, 256660, -136736, -8191, -246661, 221037, -212754, 8765, 29081, 116433, -116742, 141689, 104112, 158932, 151990, -28274, 122334, 17393, 79241, -9741, 20982, 309726, -134237, 114701, -322162, -361739, -264003, -34360, -170182, 92769, -158254, -454103, 368017, 235519]
15673B35519a24379q505I1345K77249A3588B127K466J82548k1905l8219j045I335
15660i115k41478g0463j84593B82674a21993A07279e7039j32012K7911c0355l0522
15649f0877A10582J06001A6868a12998c6595q429j65958A24504H824K59618q8483
15638A79959c20691C44343B8531R73a58963j5745l8619q3867f9047b9578A15482
15626d9671B47016a5789j08441d6603r9775D5068b46136d9559G0627b85512R3219
15615a92293K6999A56559b76705Q7942f9308k2546O326J5369G1064b0750n8372
15604g9122H3738a5778k92710L523I2919Q9511A8767N6917g9296F655a11014A19030
15591B28825j12452B5091a8488m0588D9280B1012B331K4132J3949a10916j16043
$$ y = [235519, -124379, -132884, 91345, 368594, 13588, 2127, 4593, 187141, 165236, 127017, 125972, 9335, -9115, -250593, -70463, -255056, 282674, -121993, 107279, -57039, -189051, -161140, -30355, -60877, 110582, 216583, 16868, -112998, -36595, -45024, -210982, 124504, 8824, 268442, 179959, -320691, 344343, 28531, 29504, -158963, -174708, -213327, -297194, -69047, -29578, 115482, -49671, 247016, -15789, -124230, -46603, -146378, 45068, -246136, -49559, 70627, -285512, -192293, -165294, 156559, -276705, -188763, -69308, -91854, -85528, -70159, 71064, -20750, -79122, 83738, -15778, -308488, -304965, 92919, 182430, 18767, 75684, -79296, 6655, -111014, 119030, 228825, 116373, 25091, -18488, -59076, 49280, 21012, 2331, 26463, 40412, -110916, -226959]
15580b26959G1472f7511B1012g9491j99481a06619M5717q2253p9021I0156g0720
15568C0192J86454a34518d0226E022a09910M7441B09533a85342A5768e2874a0557
15556a19641d794B13147c0435O90j56144j25272d7595j16321A01157c79498b6372
15544h6583H5324J22816a62540g4776A58587c6859B61431a05673J7293n4238O8447
15533g4171B3547a54602a3230C18437j55645j416c29383J02667a10366A78811
15522b29367g0297r9E9054A9281i5208F7802e1421j52895A62111c15155A64821
15510a10516g772k38187c5962k54045J33309I1220l2848a8437D40823d5347k58170
15499c03517e2257I4821b23113B8405a35631O7193A8947k265K86677i9284A85685
$$ y = [-226959, 71472, -67511, 21012, -79491, -278972, -106619, -60902, -143155, -222176, 90156, -70720, 30192, 216646, -134518, -40226, 5022, -109910, -62469, 209533, -185342, 15768, -52874, -10557, -119641, -4794, 213147, -30435, -29745, -185889, -311161, -47595, -163916, 101157, -379498, -26372, -86583, 85324, 208140, -162540, -74776, 158587, -36859, 261431, -105673, -88380, -142618, -74171, 23547, -154602, -13230, 318437, 162792, 161376, -329383, -226716, -110366, 178811, -229367, -70297, -70396, 59054, 19281, -95208, 67802, -51421, -204316, 162111, -315155, 164821, -110516, -7772, -245959, -35962, -290007, -156698, 91220, 58372, -18437, 440823, -45347, -303517, -52257, 94821, -223113, 28405, -135631, -68438, 18947, 16682, 303359, -99284, 185685]
15487B73396b06103g3457D0538K36331b36366A90210R669D5694J06595a53288
15476A12505k1764J3212c49666A02835J0238n2035L5261C3138c4166j2928j39352
15465a86446D5093b52173q9645a55148A1843b85871D35417c9667j08273B2423
15454b9711A42778a7714j57672C8040a95511G1012L2308A2139D495g2732j80677
15443b53409J05235A91935G6236a63005j465N3771H5956J25496p1720k3479h3279
15431c2605A56536a88332f6638B02366d3321m1097B19623G6490k7780f4404B21840
15419G624i2597B59183A052b01126F3162J12483p2234A3175h3020A34844O8764
15408B03608f9197B62298A8253J86947a68374J8267f5446l20277g6320j41192
$$ y = [273396, -206103, -73457, 40538, 276869, -236366, 190210, 199879, 45694, 152289, -153288, 112505, 90741, 103953, -349666, 102835, 113073, 61038, 96299, 33138, -34166, -47094, -186446, 45093, -252173, -341818, -155148, 11843, -285871, 435417, -39667, -147940, 22423, -29711, 142778, -17714, -175386, 38040, -195511, 71012, 103320, 12139, 4495, -72732, -253409, -148174, 191935, 76236, -163005, -164470, -110699, 85956, 211452, 139732, 116253, -83279, -32605, 156536, -188332, -66638, 202366, -43321, -84418, 219623, 76490, 48710, -64404, 221840, 7624, -92597, 259183, 1052, -201126, 63162, 175645, 103411, 13175, -83020, 134844, 203608, -69197, 262298, 18253, 205200, -168374, -150107, -65446, -385723, -76320, -217512]
15398b17512G9752b84431J3400M717g7211C55513A63475O0036F9387a44248A67499
15386c95952J08944C5788i0986B38855a41962E5951J51361a06746m736c4301j22667
15375a56968M5092B29906a30593j56216a9088j449j57104g6174A33119a48310
15364h5570k39199a05504a0356I9736J0098b09257B9290a24528B90168M0359A19353
15352B18732j06280b20455B70558a2282j7039q5684k7082j92745B65347I2873
15341H527N1518J07979d63140A75598N015b12651B452e4612k89267D5524J10475
15330A55999C0944Q8029a94086Q191Q8677A1658b78255A67533d2667m7154C00424
15318A64311F134L03163g709j63037g2725C03291q0623l7559q2043g0688A33949
$$ y = [-217512, 79752, -284431, -271031, -266314, -77211, 355513, 163475, 223511, 69387, -144248, 167499, -395952, -287008, 35788, -90986, 238855, -141962, 55951, 207312, -106746, -111482, -34301, -156968, -111876, 229906, -130593, -286809, -19088, -20537, -177641, -76174, 133119, -148310, -85570, -324769, -105504, -10356, 99736, 109834, -209257, 29290, -124528, 290168, 330527, 119353, 218732, 112452, -220455, 270558, -12282, -29321, -115005, -142087, -334832, 265347, 92873, 8527, 60045, 168024, -463140, 175598, 180613, -212651, 2452, -54612, -343879, 45524, 155999, 30944, 118973, -194086, -185895, -97218, 11658, -278255, 167533, -42667, -89821, 300424, 164311, 6134, 309297, -7709, -170746, -72725, 303291, 222668, 185109, 103066, -70688, 133949]
15306A76446a60565B8169J76085F9867L1416C3695L5201e4155B64709H7790b10246
15294a11197c685B12266K5819C7885Q1913J9274a63985a8179I0580P4338K7177
15283A92095g8940k4068E8024d16798a00888A19921b4843C07857l9230C4598Q1586
15272A16184J71296b13950b8798I1544l9554a72461K7322m4296M4406A27302a50593
15260C02500B933K25884e8826j64562A86158c5995A21003J21888f4431A27771
15249A69130J69510L86485J101610k15849l79522P95064r44954D30495j51385
15240B79110H9434A0477K4193R8601n4648J61808a11765o3810l3076M7544A62324
15228B98110b50348B57762r0213b50837B25499A01695N4416L8421a6044G8579
$$ y = [176446, -160565, 28169, 204254, 69867, 101283, 33695, 68896, -54155, 264709, 87790, -210246, -111197, -3685, 212266, 238085, 37885, 119798, 139072, -163985, -18179, 90580, 164918, 192095, -78940, -103008, 58024, -416798, -100888, 119921, -24843, 307857, 268627, 34598, 116184, 287480, -213950, -28798, 91544, 51990, -172461, -145139, -189435, -145029, 127302, -150593, 302500, 2933, 228817, -58826, -223388, 186158, -35995, 121003, 242891, -64431, 127771, 169130, 338640, 725125, 1826735, 1610886, 1231364, 2026428, 1081474, 430495, 279110, 89434, 10477, 34670, 133271, 78623, 240431, -111765, -175575, -208651, -161107, 162324, 298110, -250348, 257762, 167549, -250837, 225499, 101695, 156111, 194532, -16044, 78579]
15217G6474K94642K7377A60837B7679Q8133m8054L8695J87741a95994D1267e9363
15205B84909E6857J90950b20310c6640o7830j15035C64727a58480F3440J41223
15195B04663H9187K76813c8033A61376a5563k30977J18400A3647P9908J92990
15185B86545a77162h8315b7973K223C02185i2516j30961F0913c22574f781j19283
15174a26064c6706j66348G5267Q4782C7318b0507B61735d3760A55877d6909B06786
15162A22670h2772k6497A33215P4849H0958l2077J32182C2622K18834b82945A90087
15150a39743D1283L130P7616i3118B19387b27831C1285l223J80003a76286B95245
15138B07278b9976a2340A9036i2102I2592J47419i2676C23725j09213p9397i8972
$$ y = [76474, 371116, 398493, 160837, 27679, 115812, 67758, 106453, 294194, -195994, 41267, -59363, 284909, 56857, 247807, -220310, -36640, -104470, -219505, 364727, -158480, 63440, 204663, 89187, 366000, -38033, 161376, -15563, -246540, -128140, 13647, 93555, 286545, -177162, -88315, -27973, -25750, 302185, -92516, -223477, 60913, -322574, -6781, -126064, -36706, -203054, 75267, 160049, 37318, -20507, 261735, -43760, 155877, -46909, 206786, 122670, -82772, -109269, 133215, 208064, 80958, 48881, 181063, 32622, 251456, -282945, 190087, -139743, 41283, 44413, 122029, -93118, 219387, -227831, 31285, 28062, 208065, -176286, 295245, 207278, -29976, -12340, 19036, -92102, 92592, 240011, -92676, 323725, 214512, 135115, -98972]
15126B97834r9468f8073H4668O2585n5771C4843J21201i1538B25297l106a18569
15114C6474f829G1894N3857a65181B9798L28311g508A72559j6191a95278A2401
15102C45019A68549N1105F7738M3358l8756K7280a18285A53528g3880H7334J75423
15091B62757j22908J8121c69851C82135A75989P1278J86139j87653g8222A00726
15080A99693a13423B20345M2753Q7394A26083a00957a3765B37983h401r2207A42691
15068C71043l6864d0444C12732q5275J58044c6822B19780B8617j3991a03182C90909
15056a10170d6371C24839m9450K8212B7337J91751p8403b25098A89349J92414
15046C81763q8867J6371i8871a193j55181G8513B2596O8586j2873k7246J54445
$$ y = [297834, 198366, -68073, 84668, 147253, 91482, 34843, 156044, -91538, 225297, 222191, -118569, 36474, -6829, 71894, 125751, -165181, 29798, 358109, -7508, 172559, 156368, -195278, 12401, 345019, 168549, 219654, 67738, 111096, 72340, 99620, -118285, 153528, -73880, 87334, 262757, 139849, 157970, -369851, 382135, 175989, 247267, 433406, 245753, -78222, 100726, 199693, -113423, 220345, 263098, 350492, 126083, -100957, -13765, 237983, -8401, -100608, 142691, 371043, 334179, -40444, 312732, 227457, 385501, -36822, 219780, 28617, 14626, -103182, 390909, -110170, -46371, 324839, 275389, 303601, 27337, 219088, 140685, -225098, 189349, 381763, 292896, 309267, -98871, -1193, -156374, 78513, 22596, 91182, 78309, 51063, 205508]
15035B05508L61247A67245d5753E3775b7126C81315e6036m748A2669K56075d3448
15023E63114A22558J63678I9863Q1058D5177J62269f318B38037K2641c31082C21746
15011H8491P4697O0776j7707a42602a0694B90610J5059R9580j95548K5653i660
14999C91942a2887F26995a6432B42654A11287a87206D80279G6285J67699K09771
14989D53755A50675b3326q9453A23069K57627F4877j4432L46218M6860o8754j82892
14978A91877J41514q6044a0876C89961o0368P7880B01700k4072f22B53996j08239
14967A45757L45262j99227j29023L64342I2680M56001A83051J22048J33497A73185
14956B24826I1900J46596J08378l4306H022L34850J52847A50820b02893A35070
$$ y = [205508, 566755, 167245, -45753, 53775, -27126, 381315, -56036, -60784, 12669, 268744, -43448, 563114, 122558, 286236, 99863, 180921, 45177, 207446, -6318, 238037, 260678, -331082, 321746, 88491, 163188, 223964, 206257, -142602, -10694, 290610, 305669, 405249, 209701, 235354, -9660, 391942, -12887, 626995, -16432, 242654, 111287, -187206, 480279, 76285, 243984, 453755, 150675, -23326, -112779, 123069, 380696, 64877, 50445, 396663, 443523, 374769, 191877, 333391, 247347, -10876, 389961, 329593, 407473, 201700, 177628, -622, 253996, 145757, 491019, 291792, 162769, 527111, 92680, 548681, 183051, 305099, 438596, 173185, 224826, 91900, 238496, 346874, 312568, 8022, 342872, 495719, 150820, -202893, 135070]
14945A27821J27387p0934a45780C06631K68784o9812j78391k0898n5968K95933
14935E46279j83821J7678a95173B39602J14855I872K72103j30574K46929A42384
14924C81492A00467K11327o3273J0394l8880K54984e1909G2704L6037N1879K64870
14913D25490A66379M78861C09019A32688K57673j0718n321P1455j57700o0937
14903B27140C8776R8330P4918e259B90877P275i098D70018j78958E3476J12853
14892A66329Q1516j11517K8434J71285Q8707j2123K23774k42097n1285O5962H9983
14880f1880C17270p9709L8222K90462B30095J89647J32480j49638a41985D79810
14869E55587q6573M43088B86204J92653j11341q630M11534k42222r2841p022j83129
$$ y = [127821, 255208, 184274, -145780, 306631, 575415, 505603, 327212, 306314, 250346, 546279, 362458, 380136, -195173, 239602, 354457, 9872, 281975, 151401, 398330, 142384, 381492, 100467, 311794, 248521, 258915, 220035, 475019, -51909, 72704, 108741, 160620, 425490, 166379, 645240, 309019, 132688, 390361, 379643, 374322, 445777, 288077, 227140, 38776, 137106, 212024, -5259, 290877, 298152, -9098, 470018, 291060, 53476, 166329, 247845, 136328, 164762, 336047, 424754, 412631, 636405, 394308, 343023, 408985, 89983, -61880, 317270, 237561, 275783, 566245, 230095, 419742, 552222, 402584, -141985, 479810, 555587, 469014, 912102, 286204, 478857, 367516, 358886, 770420, 528198, 435357, 428335, 245206]
14858B45206R2029K79636j29058j43146A12778M56088j88155k9346R8649K61459
14848G11473k36364j65111p0134r6891J96907N6566j89456K76100A40859K06955
14838C47814n5801K06923k8639j15809J98017B56030J28894O2878K6935B27869
14827A50750J46122C6385M56748A35281L88329L3761B54026L27804M9128k90789
14817C40169o1233M27166C10293R7181M0362O4130G7316M05006B26099C1747M99131
14806E30878j67858L17542C25042J49945k3670A34367L77151K23807J27037C66745
14795D85928j64237M28960C69744j01050K13581P5306B36572K31187L57193l80733
14785D44219r10L03911j1470k48136k7743O1278K76626j91714j28560L85060l86605
$$ y = [245206, 337235, 616871, 487813, 344667, 112778, 568866, 380711, 351365, 450014, 711473, 475109, 309998, 239864, 142973, 339880, 396446, 206990, 483090, 140859, 347814, 292013, 498936, 470297, 354488, 552505, 256030, 384924, 447802, 474737, 227869, 150750, 296872, 36385, 493133, 135281, 523610, 557371, 254026, 581830, 630958, 340169, 278936, 706102, 310293, 407474, 447836, 511966, 77316, 482322, 226099, 31747, 530878, 363020, 680562, 325042, 474987, 451317, 134367, 511518, 735325, 862362, 366745, 485928, 321691, 750651, 369744, 268694, 482275, 557581, 236572, 467759, 824952, 444219, 443309, 747220, 735750, 487614, 459871, 521149, 797775, 606061, 477501, 862561, 475956]
14774D75956L1921J70341N0897k35509K42677j98363j5562j1550J85663K88452
14764I84923l83530Q3871O4461C09901L33883j63376J77914k89871P6221J79298
14754F23970m6645J65148K43970D75564j98000M35477O1056C52099L22362L1171
14744G05632M9031j42228B42383N26602j91868J87530J00031k98613J1155K6746
14734F03966J55894n2970j50891K18529J80951k59522j13567J759k52541Q65051
14724A196659m86314J71851j78781m5578L05006k7509j66531K45246j76758K6179
14714H63470j31533j62807J79667J5969K56500k4160l97563K60013j85255J19004
14704G93305L4569k78326J85848K20174r9720k14507K89852l30183K42273J51167
$$ y = [475956, 507877, 678218, 729115, 493606, 736283, 537920, 522358, 510808, 696471, 984923, 601393, 685264, 749725, 309901, 643784, 480408, 658322, 368451, 444672, 623970, 577325, 742473, 986443, 475564, 277564, 713041, 774097, 352099, 674461, 705632, 754663, 612435, 242383, 768985, 577117, 764647, 864678, 566065, 577220, 603966, 759860, 706890, 555999, 774528, 955479, 695957, 582390, 584149, 331608, 1196659, 710345, 882196, 703415, 657837, 962843, 935334, 768803, 1014049, 837291, 863470, 731937, 569130, 748797, 764766, 1021266, 997106, 599543, 859556, 674301, 793305, 827874, 549548, 735396, 955570, 855850, 641343, 931195, 601012, 843285, 994452]
14694I94452K27183m59996J08498k59543L39318L12847o02010R6065J17807j86627
14684F87994M03555n21295N50147k49892L92861k58551l0165K83104m92350L1931
14674G97339J39877J28975L5769l38822K86692k00190M1310P0606M62672k76872
14664A147356j63028M0370K59000p7851J20376j98860K11275l83563L20093q6273
14654A188895j38553P9176r6757N6731L0774o8931J96892m112l04063l5047L67221
14643A272226q6815k6145O5255O3188O890j02066K74834l47590J66109L6748j53913
14632A168721K18357k7109o0905J29907j12457j38584j22164J29951j6578Q271
14622A177410M46874k48674J99340j55033M20356k79048k55096N08527n42077
$$ y = [994452, 1221635, 761639, 870137, 610594, 949912, 1262759, 660749, 756814, 874621, 687994, 1091549, 570254, 1120401, 870509, 1263370, 1004819, 974654, 1257758, 765408, 797339, 937216, 1066191, 1101960, 763138, 1049830, 849640, 890950, 961556, 1424228, 1147356, 984328, 1024698, 1283698, 1205847, 1326223, 1127363, 1338638, 955075, 1275168, 1188895, 1050342, 1129518, 1032761, 1089492, 1120266, 1051335, 1248227, 1244115, 940052, 905005, 1272226, 1185411, 1159266, 1224521, 1287709, 1294599, 1192533, 1467367, 1119777, 1285886, 1322634, 1168721, 1387078, 1359969, 1299064, 1428971, 1316514, 1177930, 1055766, 1185717, 1169139, 1177410, 1624284, 1375610, 1574950, 1419917, 1840273, 1561225, 1306129, 1814656, 1272579]
14613A272579J27024J04887N6473Q7927l6725M6934M33965l62143l14743J47095
14603A563273J16019j23551M448K8445N9872J52906K05979j67698N6518j92814
14593A703397r9432K04666k69188J04939K63579m73516K66645L97109l15166j856
14583A781177p4167K28061j52418J56690k37319J06695Q3723J56128M5977K93012
14573B387559j21856K02669l18506j56074q6399K82667n9775J86130J48385L13716
14563B778516l94316K97543M9200k1101j52664N17128j80157R2388L46926L39926
14553C673389N8231L94374O71339L92050K069796L471821Q794972K2040864K35581
14544D1802417k0330231p995016n304367l516523j376542q48045n8632j25105
$$ y = [1272579, 1399603, 1504490, 1560963, 1648890, 1612165, 1659099, 2093064, 1730921, 1416178, 1563273, 1679292, 1555741, 1560189, 1588634, 1648506, 1801412, 2007391, 1839693, 1896211, 1703397, 1603965, 1808631, 1539443, 1644382, 1907961, 1434445, 1701090, 2098199, 1783033, 1781177, 1707010, 1935071, 1782653, 1939343, 1702024, 1808719, 1892442, 2048570, 2094547, 2387559, 2265703, 2468372, 2149866, 1993792, 1907393, 2190060, 2130285, 2316415, 2464800, 2778516, 2384200, 2681743, 2730943, 2709842, 2557178, 3074306, 2894149, 2986537, 3333463, 3673389, 3731620, 4125994, 4797333, 5189383, 7259179, 10731000, 19525972, 41566836, 41802417, 21472186, 13477170, 8172803, 4656280, 3279738, 2431693, 2373061, 2247956]
14536B247956j23783m0646N7514Q2175K2656j5284K88456k95368J56093r5924
14526B283845o629M23720m11340K66797j63940K15056k72249K91114K83253l45544
14516B564083J95681L8940k23655J89254l07485M37470P073J01667J58377j28661
14506C032744n0256j67123M28736k42183p4132m6113J09684J85449J2945L71467
14496C561218k52501l82108L27228m7063L53042p4778K10275K9700k32950J9428
14486C511491K26534J54071p4789k52336L51641K5862K26393j07129P0547j31424
14476D000861L18217j35459k59537R5448L96533M5026N5867l18910J17296K05383
14466D520725K64724j48061K80630l28221K19742n0169k50154N2661N28506j12363
$$ y = [2247956, 2124173, 2083527, 2141041, 2223216, 2245872, 2230588, 2519044, 2223676, 2379769, 2283845, 2277216, 2700936, 2289596, 2556393, 2392453, 2607509, 2335260, 2626374, 2909627, 2564083, 2759764, 2798704, 2575049, 2764303, 2456818, 2894288, 2901361, 3003028, 3161405, 3032744, 2982488, 2815365, 3244101, 3001918, 2927786, 2881673, 2991357, 3176806, 3189751, 3561218, 3308717, 2926609, 3253837, 3206774, 3559816, 3485038, 3695313, 3725013, 3492063, 3511491, 3738025, 3892096, 3817307, 3564971, 3916612, 3942474, 4168867, 4061738, 4132285, 4000861, 4319078, 4183619, 3924082, 4019530, 4416063, 4461089, 4516956, 4198046, 4315342, 4520725, 4785449, 4637388, 4918018, 4589797, 4809539, 4759370, 4509216, 4561877, 5090383, 4978020]
14456D978020J31360N6778o285M433J87963M5266N9386J34594L1417L3356l4394
14445E621894K01513J18489J5951J94803k38571L72400L43610k62338J98536q1791
14435F484496M08585l33722L51199Q0022k37951J74673N6477M84082j28548Q2460
14425G421773L34024l90038K68969J80966p2639M83556m628J55115l9008L15903
14415H653993K4880o3700M82278j14590R3161O1328m4099L51846J72203J86331
14405I803631M50555j14439J02865p767M30585p2307L83093J75437L28437p8733
14395A1401357O54790Q6817O6134Q8472K28627J28742L33513M92070J44574k03418
14385A3421678N94035L31131j32663M97512K19788J16269L01886L73972O02004
$$ y = [4978020, 5109380, 5166158, 5159873, 5164306, 5352269, 5397535, 5456921, 5591515, 5622932, 5656288, 5621894, 5823407, 5941896, 5957847, 6152650, 5914079, 6286479, 6630089, 6367751, 6566287, 6484496, 6893081, 6559359, 6910558, 6990580, 6752629, 6927302, 6983779, 7467861, 7339313, 7421773, 7755797, 7365759, 7634728, 7815694, 7743055, 8226611, 8221983, 8377098, 8338090, 8653993, 8678873, 8615173, 9097451, 8982861, 9076022, 9137350, 9093251, 9445097, 9617300, 9803631, 10254186, 10139747, 10242612, 10234845, 10665430, 10593123, 10976216, 11151653, 11480090, 11401357, 12056147, 12142964, 12209098, 12297570, 12526197, 12654939, 12988452, 13480522, 13625096, 13421678, 14015713, 14346844, 14214181, 14711693, 14931481, 15047750, 15349636, 15723608, 16325612]
14376A6325612L53096O0978L69675K293N77373J91261O46014K88209K15037M88607
14366A9518155O19621J66090K67033O57260P25953L26569M48715L82614Q02136
14357B3914146N26407K21393R88865O47105K80052J011508L92245O45605Q56756
14348B9484082P36787O64363P39311O41589Q22613R40919Q75936J022421J073475
14339C7001496J052490R14016J081488J171761Q31696J341611J128090J754264
14331D6276912R54745J872436J394380J664851J315061J783007J781115K305571
14323E9348078J548659K377230J921042K228901K475168K540368K647768K488731
14315G7575945L033759L310629K943856L683058L347464M195878L706872M525761
$$ y = [16325612, 16678708, 16739686, 17109361, 17111654, 17689027, 17880288, 18526302, 18814511, 19029548, 19518155, 20137776, 20303866, 20570899, 21228159, 21954112, 22280681, 22729396, 23112010, 23914146, 24440553, 24661946, 25650811, 26297916, 26577968, 27589476, 27981721, 28627326, 29484082, 30220869, 30885232, 31624543, 32266132, 33088745, 34029664, 34905600, 35928021, 37001496, 38053986, 38968002, 40049490, 41221251, 42052947, 43394558, 44522648, 46276912, 47231657, 49104093, 50498473, 52163324, 53478385, 55261392, 57042507, 59348078, 60896737, 63273967, 65195009, 67423910, 69899078, 72439446, 75087214, 77575945, 80609704, 83920333, 86864189, 90547247, 93894711, 98090589, 101797461, 106323222]
14307A06323222M323882M721836M840171N197517N768977N803999O556915O417033
14299A49953552O811335P678212P815018Q386959Q595897R574178R908293J0009035
14291B18732479J0880434J1283845J2155963J2518121J2876165J3550122J3890528
14284C05887657J4098147J4613735J4573481J4836651J4575820J4422853J3673611
14277D06681955J3110182J2058691J0805257R050140O272952L475512R53637q38273
14269D61570053m960552l087423n167825o402689o236556q738211j0012743j1953975
14261D05010079j3084667j4026184j4850153j5212215j5382446j4863342j5053271
14254C02537801j3945026j2927029j3228145j2691201j2024756j1425801j1036344
$$ y = [106323222, 110647104, 115368940, 120209111, 125406628, 131175605, 136979604, 143536519, 149953552, 156764887, 164443099, 172258117, 180645076, 189240973, 198815151, 208723444, 218732479, 229612913, 240896758, 253052721, 265570842, 278447007, 291997129, 305887657, 319985804, 334599539, 349173020, 364009671, 378585491, 393008344, 406681955, 419792137, 431850828, 442656085, 451706225, 457979177, 461454689, 462408326, 461570053, 456609501, 453522078, 448354253, 441951564, 435715008, 426976797, 416964054, 405010079, 391925412, 377899228, 363049075, 347836860, 332454414, 317591072, 302537801, 288592775, 275665746, 262437601, 249746400, 237721644, 226295843, 215259499]
14247B15259499j0283760r846189r227538q624383q066631q096484p261087p164182
14239A46689245o656081n734915n347568n677482n565793n078103m688559l862194
14231A04078550m024151l820418l701321l823061k966775l578519l218542k559805
14223G6385958k861232k454367k581212k211186j895757k715644k102594j918874
14215E7645092j796636j159218j730544j619802k021802j395436j420830j375857
14207D5124967n43076j458434j155061j456683r23264j360217o00392j078277
14199C6549563j005955r98543j016263p88656q54690q39074m07908n94946j094636
14190B8948892o87585n29408o57197p66666p09656n30460k09757n89970p13631
$$ y = [215259499, 204975739, 195129550, 185902012, 177277629, 169210998, 161114514, 153853427, 146689245, 140033164, 134298249, 128950681, 123273199, 117707406, 112629303, 107940744, 104078550, 100054399, 96233981, 92532660, 88709599, 85742824, 82164305, 78945763, 76385958, 73524726, 71070359, 68489147, 66277961, 64382204, 61666560, 59563966, 57645092, 55848456, 54689238, 52958694, 51338892, 49317090, 47921654, 46500824, 45124967, 44581891, 43123457, 41968396, 40511713, 39588449, 38228232, 37627840, 36549563, 35543608, 34545065, 33528802, 32740146, 31885456, 31046382, 30638474, 30043528, 28948892, 28261307, 27731899, 27074702, 26308036, 25598380, 25067920, 24858163, 24268193, 23554562]
14181B3554562o77219j97052n93113n43521l26541j30970k82604p30362m51467
14172A9621713m62456j59246n92262l19131p4625j22165n38558o01514j87384
14163A6564372l43617o3643m53719j18483l14249p23716J50261k93025o7760m24153
14153A3912268m03751l34143J90831j19662l77833l76364J61046k42630k12209
14144A2197553l99836P0221p8854j65595o03611o2034n68527K71851q9865j52817
14134A0418486j21587m59116L33524o10385M39450k58535j12102j49297k88356
14125I192082j92982k96314q5612J90694j07814l09392P1336k98674k9282m8918
14115H085124L420j69540O2681m76271L5246J41646m20494L2841j04171k68674
$$ y = [23554562, 22877343, 22680291, 22087178, 21543657, 21217116, 21086146, 20803542, 20073180, 19621713, 19159257, 19000011, 18407749, 18088618, 18013993, 17891828, 17353270, 16751756, 16564372, 16220755, 16157112, 15703393, 15584910, 15270661, 14546945, 14697206, 14404181, 14336421, 13912268, 13508517, 13174374, 13365205, 13245543, 12867710, 12491346, 12652392, 12409762, 12197553, 11797717, 11867938, 11789084, 11623489, 11019878, 10957844, 10389317, 10661168, 10571303, 10418486, 10296899, 9837783, 10171307, 9560922, 10000372, 9741837, 9629735, 9480438, 9192082, 8999100, 8702786, 8617174, 8807868, 8700054, 8390662, 8461998, 8163324, 8134042, 8085124, 8088544, 7919004, 7981685, 7505414, 7540660, 7682306, 7261812, 7294653, 7190482, 6921808]
14105F921808K38940k23851k59143J0347k07637p8724K67657l56364K08010P5813
14095F596856o56044M4479j39122K89853k69814j76822J25061k5481j84240p9771
14085E524955o5131K23198Q8768n47711O4951k93961j32134j16643L07509k5513
14075E028288k3809o4397k75540j47720N74707j81098k25511J86129k74376M7805
14065D644478k77995K3003L30595l36863l7962J01757l3051j37010j45635o881
14055D124436L5146j80122p8358L37000j451j45812m10316J23501j26979L94102
14045D071147k50376m17427L92042j4101j69296l45092N5846L21375k57324n1702
14035C335092k33263J21770k9898N05498k74078j05837j72786R9835J79646k06110
$$ y = [6921808, 7160748, 6936897, 6677754, 6688101, 6480464, 6401740, 6669397, 6313033, 6521043, 6596856, 5940812, 5985291, 5846169, 6136022, 5866208, 5689386, 5814447, 5788966, 5604726, 5524955, 5459824, 5683022, 5771790, 5224079, 5289030, 4995069, 4862935, 4746292, 5053801, 5028288, 5004479, 4940082, 4664542, 4516822, 5091529, 4910431, 4684920, 4871049, 4596673, 4644478, 4366483, 4389486, 4720081, 4383218, 4345256, 4447013, 4413962, 4276952, 4131317, 4124436, 4159582, 3979460, 3901102, 4238102, 4236651, 4090839, 3680523, 3804024, 3677045, 4071147, 3820771, 3403344, 3795386, 3781285, 3611989, 3266897, 3322743, 3644118, 3386794, 3335092, 3101829, 3223599, 3193701, 3699199, 3425121, 3319284, 3146498, 3246333, 3425979, 3219869]
14025C219869k15349J23669k75230J54495J33967j92819k5990M6612k15940K73929
14015C027213q0623k71167J36317J5940k23426p779j41407J06536j7377J5508
14005B559735J85749P4995o09173M96484m53820j56562L46959j23956p4926q634
13995B236851L3700j594L14699m95956L96859L859Q68975K307580O412851K2008341
13985C4086165J0830879j8472404j1336028n164331k675180j711917n48636r91043
13977D017505O3187o71877k7215l15817L03234l49135l34609q2388L18215l41706
13967B579394j9628j48196J2872n1357R8959n4621j08974J83128j81766K7710
13957B337521j17444N4648j64532j30834J79006k18375k2875J20708J40048j96602
$$ y = [3219869, 3004520, 3128189, 2852959, 3007454, 3141421, 2948602, 2922612, 2969224, 2753284, 3027213, 2946590, 2675423, 2811740, 2827680, 2604254, 2596475, 2455068, 2561604, 2544227, 2559735, 2745484, 2820479, 2211306, 2707790, 2253970, 2097408, 2444367, 2320411, 2245485, 2236851, 2270551, 2268957, 2583656, 2087700, 2484559, 2488418, 3357393, 5664973, 12077824, 34086165, 44917044, 26444640, 15108612, 9944281, 7269101, 5557184, 5008548, 4017505, 4080692, 3408815, 3381600, 3065783, 3369017, 3019882, 2685273, 2602885, 2921100, 2579394, 2559766, 2411570, 2424442, 2373085, 2472044, 2417423, 2308449, 2491577, 2309811, 2337521, 2220077, 2274725, 2110193, 1979359, 2158365, 1939990, 1917115, 2037823, 2177871, 1981269]
13947A981269J68973J59125n21059L17196j2394J9050k30755l332p2202J91162
13937A997033l82185K00757j03317J62650J90182n1091O5496j72488k56866J86318
13927A836489J01561l43635J59104j10612J0885K89781l41390J03895L10531n88279
13917A428330K71791O71R9662j62227J82177k1722j51574r0218J78698j54716
13907A580872j18027j77584L29046L9841k19945J98071m4910m743m8020J87874
13897A722475j59412q0036J7523M7948k05017J43321j21811J59943j23831K31020
13887A632123m24918J04331J49070j59775K63018j41650k76005J78696R2069R6623
13877A513582L748l58321K14962o7927k68643J59179K34477l08810j0866P2887
$$ y = [1981269, 2150242, 2309367, 1788308, 2105504, 2093110, 2112160, 1881405, 1878073, 1805871, 1997033, 1614848, 1815605, 1712288, 1874938, 2065120, 2014029, 2079525, 1907037, 1650171, 1836489, 1938050, 1594415, 1753519, 1642907, 1653792, 1943573, 1602183, 1706078, 2016609, 1428330, 1700121, 1700792, 1800454, 1638227, 1820404, 1798682, 1647108, 1556890, 1735588, 1580872, 1462845, 1285261, 1614307, 1654148, 1434203, 1632274, 1587364, 1582621, 1534601, 1722475, 1563063, 1483027, 1500550, 1548498, 1343481, 1486802, 1364991, 1524934, 1401103, 1632123, 1207205, 1311536, 1460606, 1300831, 1563849, 1422199, 1146194, 1324890, 1416959, 1513582, 1517330, 1159009, 1373971, 1306044, 1037401, 1196580, 1431057, 1122247, 1111381, 1184268]
13867A184268q8957K05355k22172Q4378j10021L1270M29711k50876P7303k4168
13857A316091l19583j97131J05798J74168o071J95615p6293L4723l23723O1845
13847I65439k3866N4243K52907o1028j45562J02777J55131l55071j68523L71894
13837A148341J28429j08625P8773N7000j46185q5137o12k60673q1974M70506j28282
13826A071561r2367O9501k06337j7683J35930n8594L4890n1658k10532M66801
13816A141512E01329L51692J5839J30327q4583m8945r5440L33385r0416k16850
13806G96338P492L13967M9177l80663J70264J41857l02364K72380l76187K95967
13796I88228o6802k02484P5691J05928M777J4243k83047j2692J03211J34095p1931
$$ y = [1184268, 1095311, 1300666, 1078494, 1162872, 1052851, 1084121, 1513832, 1262956, 1340259, 1316091, 996508, 799377, 905175, 1079343, 1073272, 1268887, 1192594, 1227317, 903594, 965439, 941573, 995816, 1248723, 1187695, 1042133, 1144910, 1300041, 944970, 776447, 1148341, 1276770, 1168145, 1246918, 1303918, 1157733, 1072596, 1071984, 811311, 729337, 1199843, 1071561, 979194, 1048695, 842358, 824675, 960605, 902011, 936901, 885243, 674711, 1141512, 501329, 853021, 868860, 999187, 914604, 865659, 770219, 1103604, 1013188, 796338, 803830, 1117797, 1166974, 786311, 956575, 1098432, 796068, 1068448, 692261, 988228, 921426, 718942, 794633, 900561, 905338, 919581, 636534, 623842, 727053, 861148, 789217]
13785G89217J8536P5782k2860n4156K54613j20628k71286L40941q5655k55718
13775F68786K25581n1272q6610J0204o9119K91802j22551o5022k87566M3755M07646
13764I65634k11092J0996J1759R1778l47643R4830j3925m9630O815K09199K45569
13753A014290l66294J19652J52348m03528j145M21263j94326B78945N32977j2107
13743G99815P3165C00662L66933N1093R5224M079n4773j08003k4203R6403K05231
13732I32646l93653J26320N2799N9256P979l1349k49883q4617J24728L6606m5016
13721E35816j848L2265A99988M61229l3549n3462R3143Q5237j18056k2356P5222
13710F87396B30314J55339N73408k50624P933p1921J3170M9252j78893n361o2038
$$ y = [789217, 807753, 883535, 860675, 806519, 1061132, 940504, 669218, 1010159, 924504, 668786, 894367, 843095, 756485, 766689, 697570, 989372, 866821, 801799, 514233, 557988, 965634, 754542, 765538, 777297, 869075, 521432, 616262, 602337, 552707, 559522, 768721, 1014290, 647996, 767648, 919996, 516468, 515323, 936586, 742260, 278945, 811922, 799815, 872980, 300662, 667595, 718688, 813912, 817991, 763218, 655215, 631012, 727415, 932646, 538993, 665313, 718112, 777368, 785347, 753998, 504115, 419498, 544226, 580832, 535816, 533968, 566233, 199988, 661217, 627668, 574206, 667349, 752586, 634530, 612174, 687396, 230314, 385653, 959061, 708437, 716370, 644449, 657619, 706871, 527978, 522617, 460579]
13699D60579K02177k45879J61731M5357Q4235j95366K38084l51492L62345l29863
13689D31908K70299j44473q8890J42964o0614J18627j14583j16336J96983k20963
13679D14922K12848M6450k84408o0802K10538j9512n3669j17201K41225M16167
13669A006558k64324j24113k39951M9933J61981k74223K18768J54757o2728B66405
13658E52734j41722j522J81368A795L06145J16071j22559K27868J15095k70610
13648C73805K55861k85793L2126L94553l19171K2230j32865L01159j31169k35891
13638B74845L27385j18038O2809k11383J88022B61153N93862C12176o2084K98722
13628E48814R0701j36867q7367L6835M4281L56839k48468A70596P47260m27367
$$ y = [460579, 662756, 416877, 578608, 623965, 708200, 512834, 750918, 399426, 761771, 431908, 702207, 557734, 468844, 611808, 551194, 669821, 555238, 438902, 635885, 414922, 627770, 674220, 389812, 329010, 539548, 520036, 466367, 349166, 590391, 1006558, 742234, 618121, 378170, 428103, 590084, 315861, 534629, 689386, 626658, 266405, 552734, 411012, 409490, 590858, 1795, 307940, 424011, 301452, 529320, 644415, 373805, 629666, 343873, 375999, 770552, 451381, 473611, 340746, 641905, 510736, 274845, 602230, 484192, 547001, 335618, 523640, 261153, 855015, 312176, 250092, 548814, 639515, 502648, 415281, 452116, 496397, 853236, 604768, 170596, 917856, 490489]
13618D90489L85765A46627K74817j22033J23752J25317j01970l306A19649K27097
13608C46746J3397J38223o8818m0125j01870J72358o8841R1397k15004l9818K08865
13597D36510O850j66699L01153B18646L70647B62465J64439k00403J00641P3332
13587D00474j41639j21377L20666Q3551K7442j17631R7829k12379K77684k67803
13577C46817J32127l3519Q8259k39639K03455k46047J12914n0332o758K94211
13567F01488J98195A10109K13712p1128L5412A15381P7816m6688K49726j15111
13557B81124J72497o8388o0165q9516J94256n6036j86782J21663J0468K29127
13547E48248j22442j8571j89836L1677M93072Q6360B97141o9128K35678D3833
$$ y = [490489, 876254, 146627, 421444, 299411, 423163, 548480, 446510, 443204, 119649, 346746, 360143, 498366, 429548, 389423, 287553, 459911, 391070, 482467, 267463, 227645, 436510, 443360, 276661, 577814, 218646, 589293, 262465, 426904, 226501, 327142, 400474, 258835, 137458, 458124, 541675, 569117, 451486, 549315, 336936, 614620, 346817, 478944, 445425, 533684, 294045, 497500, 251453, 364367, 314035, 307277, 601488, 799683, 110109, 323821, 252693, 288105, 115381, 193197, 146509, 396235, 281124, 453621, 385233, 325068, 235552, 429808, 373772, 186990, 308653, 319121, 548248, 425806, 407235, 217399, 249076, 742148, 828508, 297141, 228013, 463691, 43833]
13536I6078L12539m8712q3889J4177J1144J11761A26129L36003k03406K31261
13526D89987m0357J40868B55098D9933K75797k8763k9913J55370M4431J00265
13516E67120A59331K42434A79389M2222J02672j16649J17874J33865k0294j65121
13506B73958M1220n1953L7267m7674j23577L23250j42665A16542K54065A75526
13495C43930J17068A34797L16892k16454J52674h8279A67271J63043b933D23600
13484E17992B05611J59204q0699B3732L32204R4853B15247L22969B24083K43476
13474D67559J57160B66226K24576j85509p0320r7928L54187j91616j05837j9531
13464A74248Q7708J46555A74911L38569k52986L31571A77775G3270d1385A17077
$$ y = [96078, 408617, 359905, 276016, 290193, 301337, 413098, 126129, 462132, 258726, 489987, 449630, 590498, 255098, 49933, 325730, 296967, 267054, 422424, 466855, 567120, 159331, 401765, 179389, 221611, 324283, 207634, 325508, 459373, 439079, 273958, 315178, 263225, 300492, 252818, 129241, 452491, 309826, 116542, 370607, 175526, 343930, 460998, 134797, 451689, 235235, 387909, -88279, 167271, 330314, -2933, 423600, 517992, 205611, 364815, 284116, 23732, 355936, 450789, 215247, 538216, 224083, 467559, 624719, 266226, 490802, 305293, 234973, 137045, 491232, 299616, 193779, 174248, 261956, 408511, 174911, 513480, 260494, 592065, 177775, 73270, -41385, 117077]
13453C68353K25854A52912L66868B39261J34898j05297J8061K90529m0187j1421
13443E25844A33364P5133J38582I1051r656K10748q4317J09886b32946A11056
13432C59277N6633e0103A74549M2878G4678b0047D39514j79377J29441F7862J21482
13421A89344F4398K41631k3310R2798p6498L11908g1842I9317K08379A21039J70620
13410B91659B3518J82421B303M61333A37645J94344e2840H1472K52009j00856
13400B32625g6796C56292M3744j35321d532I748Q2299h3567B20332G2262K33524
13389C05786O4910A36304o3016K68951L5424n0018m5772j15728K40589k03312
13379B03422l9124N1634J3008r9693J26583E5170J43731J24492K70753F4968K58176
$$ y = [368353, 594207, 152912, 519780, 239261, 374159, 268862, 286923, 577452, 537265, 525844, 133364, 208497, 347079, 91051, 81395, 292143, 207826, 317712, -232946, 111056, 359277, 415910, -50103, 174549, 217427, 74678, -20047, 439514, 260137, 389578, 67862, 189344, 64398, 306029, 282719, 375517, 299019, 610927, -71842, 99317, 307696, 121039, 291659, 23518, 205939, 2303, 463636, 137645, 331989, -52840, 81472, 333481, 232625, -76796, 356292, 400036, 264715, -4532, 9748, 92047, -83567, 220332, 72262, 305786, 370696, 136304, 73288, 342239, 377663, 327645, 281873, 166145, 406734, 203422, 164298, 215932, 228940, 129247, 255830, 55170, 198901, 323393, 594146, 64968, 323144]
13368C23144A15726J08288l6573m5914J85936k6812p9049K15698j43508A44254
13357A59766J03092F5644N65474A56120L52850j82560A47606K84160A47230M87368
13347F34598A26561B6363M26927r4020j72719k8564K60797j29760m52J20048n4765
13336C53855c7975A67423K38767j45970A2456J03114J31324K1567j32610L46722
13326D82573E4169L54965F1564f0197A66763A5549g4045A9817J54934N0863k8691
13315A96923K51977k6441j09452l8473r5730K65730i2505A5196J30555J91539
13305C37290L12812B03914l9424K53755j46396b7373B78648J78606k02554q6259
13295A68441h0185C27219e49490B34319G3961J05816p1489J47357j10969n78O7626
$$ y = [323144, 115726, 224014, 187441, 141527, 327463, 300651, 221602, 437300, 293792, 144254, 159766, 262858, 65644, 631118, 156120, 508970, 326410, 147606, 431766, 147230, 634598, 126561, 26363, 453290, 359270, 186551, 157987, 418784, 289024, 288572, 408620, 353855, -37975, 167423, 406190, 260220, 12456, 115570, 246894, 268461, 135851, 482573, 54169, 409134, 61564, -60197, 166763, 15549, -74045, 19817, 174751, 225614, 196923, 448900, 422459, 313007, 274534, 178804, 444534, -92505, 15196, 145751, 337290, 650102, 203914, 164490, 418245, 271849, -27373, 278648, 457254, 254700, 168441, -80185, 327219, -549490, 234319, 73961, 179777, 108288, 255645, 144676, 144098, 211724]
13284B11724l6144E2150J18854N4447i6067C01788r0137K62806j76013r6170d6467
13272B07872e0331C35729j540L8065q4541h062D35811H1187J84179F6619J46881
13261B13500A9825J26379K40548G8780L52597A50810K09602A32854O4451J51070
13251C48375j15756a5180A74134J18346n8117J07278A58282J23548A36667B8146
13240d476D3367j6588L97931A81633k4056N3336C3761K9120J13862K6021N5199
13229B57963p9626J63517b27189G9957l1282J75531J62200c8400C16535d53j61489
13218a61942C08598j51695n2156J69640J03030m3834j06787e4693H5649g16C9252
13206i1300E19333B33332n8509b57450b2863A93416j3634a1136C13320j33986
$$ y = [211724, 175580, 52150, 171004, 225451, -96067, 301788, 211651, 474457, 298444, 202274, -46467, 207872, -50331, 335729, 334189, 372254, 287713, -8062, 435811, 81187, 265366, 66619, 213500, 19825, 146204, 386752, 78780, 431377, 150810, 360412, 132854, 197305, 348375, 232619, -15180, 174134, 292480, 234363, 341641, 158282, 281830, 136667, 28146, -4476, 43367, 26779, 424710, 181633, 157577, 210913, 33761, 62881, 176743, 202764, 257963, 178337, 341854, -227189, 79957, 48675, 224206, 386406, -38400, 316535, -453, -161942, 308598, 156903, 104747, 274387, 377417, 333583, 226796, -54693, 85649, -716, 39252, -91300, 519333, 233332, 174823, -257450, -22863, 193416, 179782, -11136, 313320, 179334]
13196A79334K633b47947H3265j6193l1689J28474b20773A80940J68176A42044
13185a56598E59294A30134B6200K56664j34848P682R1199J21673A41150k5338
13175A15812N7839j4131B0955b7009j269i852B15892J2354b31715B54831h5971
13163B05709J73726A06403A7716K15088j6165D5797J79934r7663K3296N8356n1902
13152A57818d971A87723L9154B4077L9447a34138d9321B62343A0258K54737C4074
13140B7188c15098c1154j18941A63454o5815L36938A84667a43113C26619m2151
13130B84468E2417J01525B026J92520d0396m5078j80369B23030P3697a41753G0041
13118a93750A69624m5382K11826A27909J04617n2084a88023d4746B56493a62257
$$ y = [179334, 181967, -247947, 83265, 67072, 35383, 163857, -220773, 180940, 349116, 142044, -156598, 559294, 130134, 26200, 282864, 148016, 155698, 246897, 368570, 141150, 115812, 173651, 159520, 20955, -27009, -28278, -9852, 215892, 228246, -231715, 254831, -85971, 205709, 379435, 106403, 17716, 232804, 216639, 45797, 225731, 128068, 151364, 209720, 157818, -4971, 187723, 226877, 24077, 63524, -134138, -49321, 262343, 10258, 264995, 34074, 27188, -315098, -31154, -150095, 163454, 97639, 434577, 184667, -143113, 326619, 284468, 52417, 153942, 2026, 194546, -40396, -85474, -265843, 223030, 296727, -141753, 70041, -193750, 169624, 124242, 336068, 127909, 232526, 180442, -188023, -44746, 256493, -162257]
13107B64207j23735B0152K63485j12108N1781f6501C9852J6936h6729C04154f9589
13095H6978J87125C1405L11727A39605B4500K05888G1911a7787n0807k9404B66030
13083B76832E0425g9611B68J07027b10398A16478j6313Q7341p0804J17697o7304
13072A67095G2251R6284J05055F3438B1205J14134m6895K10633C0638L62916a3273
13060a7255q6721A49441K7601J30744a82157C12558j21334l6756o0301J50420
13050B44587L0874a07357I8353d0143A79123A3882a58130A81485P1886P0300a23308
13038C36246A65660p0970l0062g9695A84207e7275B41786r4834O5587h8163A34667
13026a9253C60202a69537A17490m8216J03228G9622P0304a2359B15900q4515J39909
$$ y = [264207, 140472, 20152, 283637, 171529, 223310, -66501, 39852, 56788, -86729, 304154, -69589, 86978, 274103, 31405, 343132, 139605, 24500, 230388, 71911, -17787, -68594, -97998, 266030, 276832, 50425, -79611, 268, 107295, -210398, 116478, 100165, 187506, 116702, 234399, 167095, 72251, 168535, 273590, 63438, 21205, 135339, 88444, 299077, 30638, 393554, -13273, -17255, -103976, 149441, 177042, 307786, -182157, 312558, 191224, 154468, 94167, 244587, 275461, -107357, 98353, -40143, 179123, 13882, -158130, 181485, 253371, 323671, -123308, 336246, 165660, 94690, 64628, -79695, 184207, -57275, 241786, 146952, 212539, -88163, 134667, -19253, 360202, -169537, 117490, 69274, 172502, 79622, 149926, -12359, 215900, 131385, 271294]
13015B71294A06645a44130A69497o5081K3250J93344f4034B71291J03448H6378
13004A97836a04676B13343J55993C4783J92529r9087p893J33480J75482A12786
12993D1926K64428A23259E1365e1678a0418E1879R3506i9854I9217D7403p908
12982C9495e6313A95233M8632a14517B42284a60767H6639e680l20226A49102b60974
12970B26856A12529b37k31236B30601j10647l5554B3515c02505a7984d215D5185
12958f2001p1218e9660A76582c8055B47895j00544J44846F1246B7989J32493g1167
12946B45920d5127m1083r1255C6683a1470I2441K4173J05044q6937J35e7400A00203
12933A1936M0189L4500K56069A29295P798o558L5537b21385K3818B81042b47794
$$ y = [271294, 106645, -144130, 169497, 104416, 127666, 321010, -64034, 271291, 374739, 86378, 197836, -104676, 213343, 369336, 34783, 227312, 128225, 120332, 253812, 429294, 112786, 41926, 306354, 123259, 51365, -51678, -10418, 51879, 145385, -99854, 99217, 47403, 39495, -56313, 195233, 243865, -114517, 242284, -160767, 86639, -5680, -325906, 149102, -260974, 226856, 112529, -237, -231473, 230601, 119954, 84400, 23515, -302505, -17984, -4215, 45185, -62001, -133219, -59660, 176582, -38055, 247895, 147351, 292197, 61246, 27989, 160482, -71167, 245920, -45127, -86210, -177465, 36683, -11470, 92441, 116614, 221658, 134721, 134856, -57400, 100203, 11936, 52125, 86625, 342694, 129295, 137093, 130535, 166072, -221385, -197567, 281042, -247794]
12921b61912C3014K84845I23a41604D01771A00098b1473B97010M236a01124A98377
12909b40715d2216j3446j8975K0264B8224L35429A09784m8183b56012A18836n098
12898A13738J24516a82647A39330a19562A72709B072K50928q4970K14325c43696
12887B98397d0058n8345A19936D1999b02174B73389a04316D0989K53998n4051
12877B40936a66813C11674H2868A699J153a86412a7334B05403i6271C67171N3059
12866D20230e5340A91558f4449p16H1008b6470j98403A05542c4398D8743a23424
12854A32266J31328h6923f451l3505J7433C01524j40760B50b8132j43870I8696
12842c3063A2190J73735l2018L6569N6879c3414A18710J43397A28998e9409D50867
$$ y = [-261912, 33014, 317859, 923, -141604, 401771, 100098, -21473, 297010, 301246, -101124, 198377, -240715, -42216, -55662, -74637, -54373, 28224, 363653, 109784, 61601, -256012, 118836, 113738, 238254, -182647, 139330, -119562, 172709, 2072, 253000, 168030, 382355, -343696, 298397, -40058, -98403, 119936, 41999, -202174, 273389, -104316, 40989, 294987, 240936, -166813, 311674, 82868, 1699, 2852, -186412, -17334, 205403, -96271, 367171, 420230, -55340, 191558, -64449, -65165, 81008, -26470, -224873, 105542, -34398, 48743, -123424, 132266, 263594, -86923, -6451, -39956, -22523, 301524, 160764, 250, -28132, -172002, 98696, -33063, 12190, 185925, 153907, 190476, 247355, -33414, 118710, 262107, 128998, -59409, 450867]
12830A70321d1826d104C08874G3805K68531q2402a61897O0160A76306j1037f9509
12818b8992c961C1292c38823A74258a01830A56415f5427A18472P2375a47363A41000
12806B8972A0315J07862J33145c62632i5243B730b5825D2722e0169C6550Q7082
12795A23632M1031B6395J71596K6340G8043P2005A018Q2577O2033B8276c8249
12783b73784A97627a21379G4915J14683a11232C86577A14693B3791K15609j15900
12773A23500A9853J28546K32273A07177a84678G7542b99714D55084A9265a1447
12762b00411E319P420h5296B3953L11930A28561c599k24383h2164J1317C97951
12750G7224a56514I1328D712N0169P9986J48842k5000f228j12699D682e9221j13395
$$ y = [170321, -41826, -4104, 308874, 73805, 342336, 259934, -161897, -101737, 176306, 165269, -69509, -28992, -3961, 31292, -338823, 174258, -101830, 156415, -65427, 118472, 190847, -147363, 141000, 28972, 10315, 118177, 251322, -362632, -95243, 2730, -25825, 42722, -50169, 36550, 123632, 164663, 26395, 197991, 224331, 78043, 150048, 1018, 83595, 145628, 28276, -38249, -273784, 197627, -121379, 74915, 189598, -111232, 386577, 114693, 23791, 239400, 123500, 19853, 148399, 380672, 107177, -184678, 77542, -299714, 455084, 19265, -11447, -200411, 5319, 12739, -85296, 23953, 335883, 128561, -3599, -227982, -82164, -70847, 397951, 77224, -156514, 91328, 4712, 54881, 134867, 283709, 258709, -6228, -118927, 4682, -59221, -172616]
12738a72616C63162N5501j51933a85151A41530M3325Q2772b15271B10780e6402
12727g8468l8684M8385q186A4672J31560K47547l9645C2190M2529J31612l8009
12716A68322a34694A06653P0811d2295k38332A86191R4499a7075o9062A76210
12705C90490h7665B79433A30676c4649A58430J46957a58503J3484B04076q6847
12695A17229f4853A22692J31533A03200D8824c9390A31706n925h5965G3332J6173
12684H9505b5869r2248A53645a50316f9309K0625C40109j39179c1311l0591b4002
12672H2638h2522B60263C9918J79691a14821B40053L4347a8368C93448o2758j04760
12661B25930d594k9362n3434E1389a16168C82750L5755C9498K20260p6627Q9405
$$ y = [-172616, 363162, 418663, 266730, -185151, 141530, 184855, 267627, -215271, 210780, -56402, -78468, -117152, -68767, -76953, 14672, 146232, 393779, 354134, 32190, 74719, 206331, 168322, -134694, 106653, 177464, -42295, -280627, 186191, 280690, -17075, -86137, 176210, 390490, -87665, 279433, 130676, -34649, 158430, 305387, -158503, -145019, 204076, 117229, -64853, 122692, 254225, 103200, 48824, -39390, 131706, 125781, -85965, 73332, 89505, -25869, -118117, 153645, -150316, -69309, -48684, 340109, 200930, -31311, -61902, -24002, 82638, -82522, 260263, 39918, 219609, -114821, 240053, 274400, -18368, 393448, 330690, 225930, -4594, -33956, -87390, 51389, -116168, 382750, 418505, 39498, 259758, 183131, 272536]
12650B72536O141a3681B37945h2234j1060C21132a39555C10735j29202b440k1251
12639b3691j75522k1689h0425C29090F4980M23383A37458K10195j27993J86382
12629D06042F1515f6335A49664J55511A04068l6955J66240a24167C33843b8437
12618A22844L15622d747D75198A14647D7033g024C17853P6379a46387F9301a04259
12606B70287A21232J01528r7024b64571D9619d0680m2557A71852n0525a52057
12595B50971d4350q5272e3870r5059B17728L6622j7909j06988R6724j2998i0327
12583A80783b62912G2393J31115a7255B22875a17064H6717m889C2510f1035A5103
12571B67570A22144a46873j58187A52261G896a19445C01961a9906r3823j48095
$$ y = [272536, 278677, -13681, 237945, -82234, -93294, 321132, -139555, 310735, 181533, -2440, -23691, -199213, -220902, -80425, 329090, 64980, 488363, 137458, 347653, 219660, 406042, 61515, -66335, 149664, 305175, 104068, 67113, 233353, -124167, 333843, -28437, 122844, 438466, -4747, 475198, 114647, 47033, -7024, 317853, 394232, -146387, 69301, -104259, 270287, 121232, 222760, 125736, -264571, 49619, -40680, -83237, 171852, 121327, -152057, 250971, -44350, -129622, -53870, -148929, 217728, 254350, 236441, 129453, 226177, 213179, -90327, 180783, -262912, 72393, 203508, -17255, 222875, -117064, 86717, 81828, 32510, -61035, 15103, 267570, 122144, -146873, -305060, 152261, 7896, -119445, 301961, -19906, -113729, -261824]
12561b61824F6918c92854b1900I7791R4708a41148H3797K99269g6063K7796A13720
12549D6421a3097j98622A24483m5326a74432b6793B02994J2214A2387a87748i1753
12537A3731K93545B7060b63066D03071j01317A5417L5728a64739G0726L30884
12527D01610q6317i6019A51450a4644G5254a20861J2289A67815h941j41098e9080
12515e5044F5850K43433C2978i0237A3227L63067A40639F8171A5227K06820f7391
12503B10250J1068J27798n3395A9789b8977h567m9993A17419b07556j3657A11913
12491b4219A7480M35419A23414m3269e8714j52033B19826b57486G4088i0364D82371
12479f9165j09372B0227c39445c3086A12493a7636A49933J05625a4828k8807I1157
$$ y = [-261824, 66918, -392854, -21900, 97791, 192499, -141148, 83797, 383066, -76063, -48267, 113720, 46421, -13097, -211719, 124483, 79157, -174432, -26793, 202994, 215208, 12387, -187748, -91753, 13731, 307276, 27060, -263066, 403071, 301754, 15417, 51145, -164739, 70726, 401610, 315293, -96019, 151450, -14644, 75254, -120861, -108572, 167815, -8941, -150039, -59080, -55044, 65850, 309283, 32978, -90237, 13227, 376294, 140639, 68171, 15227, 222047, -67391, 210250, 221318, 349116, 295721, 19789, -28977, -8567, -58560, 117419, -207556, -221213, 111913, -24219, 17480, 452899, 123414, 80145, -58714, -210747, 219826, -257486, 74088, -90364, 482371, -69165, -178537, 20227, -339445, -33086, 112493, -17636, 149933, 255558, -14828, -43635, 91157]
12467A96790i6467K5136B4465b25910C1397a16329B13112Q8229c9627C08357a66409
12455F5625a86315c619A66550k7426Q086A256K23082p7626g815A27682l1690e2177
12442D68677A97400c07220i7412E2778A7842L59477a24935E935d1473k1056A63374
12430a51206B57416a21408e5637j1166p4545e5665D27594C6541K63156K6150m7171
12419B78676j39105F7600i5780j87395B88803a86016f5230J8245j31360j956C8734
12407A36516m8744K07036A3865a44114k6973Q2069H7038a80689d1266A7402J4779
12396C2181J28951R1901A24334m8031K83150b22201B13492e5151l27004B00849
12385I4397i95p8934C5900a18209D6976J55831G7435Q555e9096B12124G8754b3979
$$ y = [196790, -96467, -71331, 24465, -225910, 31397, -116329, 213112, 301341, -39627, 308357, -166409, 65625, -186315, -3619, 166550, 139124, 147210, 1256, 224338, 146712, -7815, 127682, 95992, -52177, 468677, 197400, -307220, -97412, 52778, 17842, 377319, -124935, 5935, -41473, -62529, 163374, -151206, 257416, -121408, -55637, -66803, -141348, -55665, 427594, 36541, 299697, 325847, 278676, 139571, 67600, -95780, -283175, 288803, -186016, -65230, -46985, -178345, -180301, 38734, 136516, 87772, 294808, 13865, -144114, -171087, -89018, 87038, -180689, -41266, 17402, 32181, 161132, 253033, 124334, 76303, 359453, -222201, 213492, -55151, -382155, 200849, 94397, -995, -79929, 35900, -118209, 46976, 202807, 77435, 85990, -59096, 212124, 78754, -23979]
12372A45062Q2914p2427g5519p8654e4348k07587J08683Q621j07015G4027a8470
12360D99005A63744a3379b261l2165A543b54657a08357H164J70383H0634J18262
12349A98896q1339e8041k61186A80805a18142B19200n6759a80717c3844A00200
12338C6845b55056G404N175i2302l50156B20005I814c15272A37451c68029A8299
12326B51472a77251A89811q621a95044B81613h7790D912K4981L0338c3053A37595
12314C59349j8079j24499a14902B00348J09223A21871a82508k69812a33037F711
12303F3840J15711o8119b02935B54846j1502c14584A52379g0727A08777a32642
12292f0472J4961A66225n5991J08353a2197E8875a03572C73287j70123L8074Q335
$$ y = [145062, 227976, 155549, -75519, -154173, -54348, -261935, -153252, -144631, -251646, 74027, -18470, 499005, 163744, -13379, -2261, -34426, 1543, -254657, -108357, 8164, 178547, 80634, 198896, 117557, -58041, -319227, 180805, -118142, 219200, 162441, -180717, -33844, 100200, 36845, -255056, 7404, 12579, -92302, -442458, 220005, 9814, -315272, 137451, -368029, 18299, 251472, -177251, 189811, 181190, -195044, 281613, -87790, 4912, 29893, 60231, -33053, 137595, 359349, 341270, 216771, -114902, 200348, 309571, 121871, -182508, -452320, -133037, 6711, 63840, 179551, 111432, -202935, 254846, 243344, -314584, 152379, -70727, 108777, -132642, -60472, -45511, 166225, 110234, 218587, -12197, 58875, -103572, 373287, 203164, 241238, 249573]
12281B49573N6937c2480H1780a38838H7515i7771C51642I659L56241H6995g0317
12269G6402Q0668K4184K9308r4528j2648d8212A24224d5874A54526d8963B03270
12257d3408H6421B8078f2951j4110A5956P4021J84350g426F9822b79465A28493
12245A88597m4810j4369P8911D4496k1143O0422R7348k4022c3849p820J946B65246
12232E33021B09430D789J76761b9325A66761F3800k8293K69979A24618K00370
12222C24988L8336A18082K7391J94054J09357B04002g0641C09478L8239h401A51461
12210C42M6133J05332j0791R3461D3482e9116D66727j46390A05392f8637B10629
12198c2746j64003j11980E9639K422B6877L11608I414J84872m5614J04708K97693
$$ y = [249573, 306510, -32480, 81780, -138838, 87515, -97771, 351642, 9659, 365900, 86995, -70317, 76402, 157070, 181254, 210562, 116034, 103386, -48212, 124224, -45874, 154526, -48963, 203270, -43408, 86421, 28078, -62951, -77061, 15956, 89977, 274327, -7426, 69822, -279465, 128493, 188597, 143787, 129418, 208329, 44496, 23353, 83775, 181123, 157101, -33849, -41669, -39723, 265246, 533021, 209430, 4789, 181550, -29325, 166761, 63800, 35507, 305486, 124618, 324988, 363324, 118082, 145473, 339527, 448884, 204002, -70641, 309478, 347717, -8401, 151461, 342, 46475, 151807, 141016, 234477, 43482, -59116, 466727, 320337, 105392, -68637, 210629, -32746, -196749, -308729, 59639, 62061, 26877, 338485, 9414, 194286, 148672, 253380, 551073]
12187E51073A54993J98309I2724f919A40082k508b97337b6255A07150K78786D1830
12175A5573b53399a06257k24284C1965J29487C1339J59802I3842J88720i7015
12164B3108N369K53830e209H5660j0369j1550b398B07145K1759g0848b567D7754
12151c7374a8498C18503k4338A45616J16172c0060D0704B963J09207B6954J60933
12140A87887B0185R8513K19666b5887A76391C6044d2544D534J01359l1770J42175
12129B16298b64697L1640N9759F2952L0187L55828a01236B58599a48614f7967
12118C2498g0010B01082a29132m4880C0211a08741k4827A4797M05K44492e1625
12106d8709B21237k0627b2403B81534a12879A96899g8498A28908m4343N3475i2798
$$ y = [551073, 154993, 353302, 92724, -6919, 140082, 137574, -297337, -26255, 107150, 385936, 41830, 15573, -253399, -106257, -330541, 31965, 161452, 31339, 191141, 93842, 282562, -97015, 23108, 28477, 282307, -5209, 85660, 75291, 63741, -2398, 207145, 228904, -70848, -2567, 47754, -37374, -18498, 318503, 294165, 145616, 261788, -30060, 40704, 2963, 112170, 26954, 187887, 20185, 118698, 338364, -25887, 176391, 36044, -42544, 4534, 105893, 74123, 216298, -264697, -233057, -173298, 62952, 93139, 448967, -101236, 258599, -148614, -67967, 32498, -70010, 201082, -129132, -174012, 30211, -108741, -133568, 14797, 15202, 259694, -51625, -48709, 221237, 200610, -22403, 281534, -112879, 196899, -78498, 128908, 84565, 138040, -92798]
12094A01595C9833L40049b5727A97319a22427B29221F1761g6118j54861C090J31435
12083A34525E8988O0697n366K19973E1666i581j3790K230o9247D28894b79754
12071C904R8969b5398A76573a49498N8711G310L04570H609J03887c01588a39908
12059A92000N3600q8206g0146p9913d3444j6193C6433b98534A00948a14343N51
12048a13792b530B22327a77581E08968J99740J160620F50809A72405d1393B72995
12037f4520j05536C8208a82614B17324G7467e02k43359B09098b5465m7628o9772
12026a42865j45299C6711b55814H6081J13712D7013L15937A61695b3626C44113
12015e1817A36165P7274c8373B45533a0959b295A96453C7978b06178R9046n0726
$$ y = [101595, 39833, 379882, -25727, 197319, -122427, 229221, 61761, -76118, -230979, 3090, 134525, 58988, 119685, 114319, 334292, 51666, -9581, -23371, -21141, -90388, 428894, -279754, 3904, 102873, -25398, 176573, -149498, -90787, 7310, 311880, 8609, 112496, -301588, -139908, 192000, 245600, 157394, -70146, -150059, -43444, -59637, 36433, -298534, 100948, -114343, -113792, -2530, 222327, -177581, 508968, 708708, 1869328, 650809, 172405, -41393, 272995, -64520, -170056, 38208, -182614, 217324, 77467, -502, -243861, 209098, -25465, -73093, -142865, -288164, 36711, -255814, 86081, 199793, 47013, 362950, 161695, -23626, 344113, -51817, 136165, 213439, -38373, 245533, -10959, -2295, 196453, 37978, -206178, -107132, -157858]
12004a57858D9503J9160d9248A36244Q8401D7423J09269O4914D2277b8037A57128
11992a85165N2978H8044B0313a40753n4402i6958B804b10541O3260B38791A2781
11980a54069l038B05941J64342c48459a15101L5601a7137B87994a30441A06594
11969C3036L4078D307c7995l0896j3030B10039a4464m6842k32460A03450C1051
11957G1549a58580f9865B30072C1252M3763a76205i225p2191M0223p0816B11704
11945a84545g5106A19720a51122f884A40912b194n2540K465D3408f9543A48884
11933i0615j02792Q2357a396j28095A27124L15704j48672j01539J22265A03336
11922A76643E6663h1082I1327k3951a3976A407a26553b9167C654b61903b3264
$$ y = [-157858, 49503, 68663, -49248, 136244, 224645, 47423, 156692, 221606, 42277, -28037, 157128, -185165, -132187, 88044, 20313, -140753, -195155, -96958, 2804, -210541, -147281, 238791, 12781, -154069, -157107, 205941, 370283, -348459, -115101, -79500, -17137, 287994, -130441, 106594, 33036, 67114, 4307, -37995, -68891, -81921, 210039, -14464, -61306, -293766, 103450, 31051, 71549, -158580, -69865, 230072, 31252, 75015, -176205, -9225, -81416, -41193, -112009, 211704, -184545, -75106, 119720, -151122, -6884, 140912, -2194, -54734, -52269, 43408, -69543, 148884, -90615, -193407, -111050, -1396, -129491, 127124, 442828, 294156, 192617, 314882, 103336, 176643, 56663, -81082, 91327, 67376, -13976, 1407, -126553, -29167, 3654, -261903, -23264]
11910A54190c80186O0653c1074C3540g6129J1810A97956C4134J14794J87519j63042
11899A73405F4356L0511b47960L6078P6831n8465O90A42038E614a7518A5782g8812
11886b3216j14622N0345j08827g7672q0160A35760g7864A33466c250G5870a47874
11874a67037J6767P0222D28778B04906C3263J32735a6883j00763A04520a35044
11863b1336C7417a99551B702K2454J36856c2608k50958C71334i6236C6267K19589
11852B55856G5411a98858Q7065N5731B00596K2392a785l6313h554o1423A1700
11840a46548C42510A23068a44831C14019c6586B37073c51494A44867c33785i5170
11829A51062a40794H4924a08273k06202O4668g9752G7430k060A3041b32058A53116
$$ y = [154190, -380186, -319533, -31074, 33540, -76129, -64319, 197956, 34134, 148928, 336447, 173405, 64356, 94867, -247960, -211882, -135051, -193516, -192826, 142038, 5614, -17518, 15782, -78812, -23216, -137838, -87493, -196320, -77672, -157832, 135760, -77864, 133466, -3250, 75870, -147874, -167037, -150270, -80048, 428778, 204906, 33263, 165998, -16883, -117646, 104520, -135044, -21336, 37417, -199551, 2702, 25156, 162012, -32608, -283566, 371334, -96236, 36267, 255856, 75411, -198858, -111793, -56062, 200596, 222988, -1785, -38098, -8554, -69977, 11700, -146548, 342510, 123068, -144831, 314019, -36586, 237073, -351494, 144867, -333785, -95170, 151062, -140794, 84924, -108273, -314475, -249807, -79752, 77430, 75370, 13041, -232058, 153116]
11817b3172A1432f5970D0258b0499C96641a33319J5663a5461A48395f3892A90289
11805A9559L4166k907j9949a97689H3660e5204A00184b58367A559a48707l7860
11794a86567B66217a1006G3247c840A47533D3146a13101A14307e5226G2047K43141
11783C15188C0533b8369A49436B4073J4927J95689n0773E7841c31785a50898C91258
11771A12130d16887A50333i433I1309l6592N474j3470e2652n2622n0502O6131
11760h9645L5285j729C0702D396c57848C20078j31732J31952b27319Q211J1554
11749b07554B24678i8176j80253d5280k68041d770j41158A28931P4165a89228
11738G4320e4370H6108h6972A17140c72920C1557O3882a83583A4717N06288G3452
$$ y = [-23172, 11432, -65970, 40258, -20499, 396641, -133319, -117656, -15461, 148395, -63892, 190289, 19559, 53725, 50818, 30869, -197689, 83660, -55204, 100184, -258367, 1559, -148707, -186567, 266217, -11006, 73247, -3840, 147533, 43146, -113101, 114307, -55226, 72047, 315188, 30533, -28369, 149436, 24073, 39000, 234689, 183916, 57841, -331785, -150898, 391258, 112130, -416887, 150333, -9433, 91309, 54717, 60191, 46721, -52652, -105274, -155776, -89645, -54360, -56089, 30702, 4396, -357848, 320078, 188346, 320298, -227319, -219108, -207554, 224678, -98176, -278429, -45280, -313321, -4770, -145928, 128931, 203096, -189228, 74320, -54370, 86108, -86972, 117140, -372920, 31557, 95439, -183583, 14717, 521005, 73452]
11726c5810a2502C0769b85756b1448m91295E521h5424a53A26855c0386I6078R1059
11714A87137F0943K01810L187e0061l00889F3386A085J97780h0722A37279Q5922
11703B23201I0386m4900J18969B407J69350Q5978B0917g9409D5488a97488i7293
11691A49990A9389J35492b77918a28147c0982K20e911C22804b23043B65607K1699
11680B87306D769M17233q1696a45942A1525b81382h4893G4710a99435E2831K7695
11669H0526a32751H3488b19976B13270k0077p4271N8844C5856a09310B99376a18468
11657d4351C4184L3388b19326F4179J69271I7529D936J03672L5644h1781B9261
11645B16536q9399L22016b67741a06882B3545J3215a35489j10059D1975K00560
$$ y = [-35810, -12502, 30769, -285756, -21448, -512743, 5521, -85424, -153, 126855, -30386, 96078, 187137, 60943, 262753, 265940, -50061, -350950, 63386, 1085, 198865, -80722, 137279, 223201, 90386, 45486, 164455, 2407, 171757, 257735, 20917, -79409, 45488, -197488, -97293, 149990, 19389, 154881, -277918, -128147, -30982, -30762, -5911, 322804, -223043, 265607, 287306, 4769, 422002, 340306, -145942, 11525, -281382, -84893, 74710, -199435, 52831, 80526, -132751, 83488, -219976, 213270, 193193, 118922, 177766, 35856, -109310, 299376, -118468, -44351, 34184, 67572, -219326, 64179, 233450, 97529, 4936, 108608, 144252, -81781, 29261, 216536, 127137, 449153, -267741, -106882, 23545, 36760, -135489, -245548, 41975, 242535]
11635B42535b21119A07885J33417q9205J39969D614J14880h8021H6729g2046k70098
11624c42144J29236A69830F958a25215F385M371a67866B80219E372J6895a52457
11612c7974G1477E485O8169P5927b59290I640J7740d45756a97335B2274E126K98833
11600C03959j34066b09533B32901b7128B12093J69525A0775K32468b19232M3396
11590a75836O6151B18525o9309L9786J25565O9504j02011F6176e6087B73129M650
11579B77779C9657c4636C0112P1897C7537d6433D28K23095b5020B59566k6335
11568B33231j00053c5746C0567c0526B4800b54273a04457B40383c2068A41109
11557A27338g4073E3746J70953b60084C67792h0383j7312A50857C6816J45280
$$ y = [242535, -221119, 107885, 241302, 152097, 292066, 4614, 119494, -88021, 86729, -72046, -342144, -212908, 169830, 6958, -125215, 6385, 10756, -167866, 280219, 5372, 22267, -152457, -37974, 71477, 5485, 73654, 149581, -259290, 9640, 27380, -445756, -197335, 22274, 5126, 303959, 169893, -209533, 232901, -27128, 212093, 381618, 10775, 243243, -219232, -175836, -109685, 218525, 149216, 189002, 314567, 384071, 282060, 66176, -56087, 273129, 277779, 39657, -34636, 30112, 102009, 37537, -46433, 428, 223523, -25020, 259566, 233231, 133178, -35746, 30567, -30526, 24800, -254273, -104457, 240383, -32068, 141109, 127338, -74073, 53746, 224699, -260084, 367792, -80383, -97695, 150857, 36816, 182096]
11547A82096J38774D4853d3960B52087q6500o7288g8729C14002j03818q9862L07691
11536D28013A87764F6247b47555e7266B36475b4428C7704q872a49466B49124f4521
11524A9236L13422B2964K574J4934b3960i498A36185m623R6954B2232b38586A12580
11511a66951A89255J55754A53579Q3857L2891i4844A79263B9263J86115c07058
11500G2893K45813b04064C2144R7766C6179J29318a35152N7890A30067K78718
11490D08785H0504M91559A46159n1915e8772G7587K65183p5481M8403B9231K15355
11479B44586D8567Q8964L5550J87856j07351g732A19356B3697J89822d5806A19108
11467B90741j2120a01377A81953C7241K33600A00209J36265o1331q002K18586
$$ y = [182096, 320870, 44853, -43960, 252087, 165587, 98299, -78729, 314002, 210184, 120322, 428013, 187764, 66247, -247555, -57266, 236475, -24428, 37704, 28832, -149466, 249124, -64521, 19236, 332658, 22964, 25538, 40472, -23960, -9498, 136185, 131562, 228516, 22232, -238586, 112580, -166951, 189255, 345009, 153579, 237436, 270327, -94844, 179263, 29263, 215378, -307058, 72893, 318706, -204064, 32144, 129910, 36179, 165497, -135152, -77262, 130067, 408785, 80504, 572063, 146159, 94244, -58772, 77587, 342770, 267289, 315692, 29231, 244586, 48567, 137531, 173081, 360937, 253586, -7732, 119356, 23697, 213519, -45806, 119108, 290741, 278621, -101377, 181953, 37241, 270841, 100209, 236474, 175143, 167141, 385727]
11457C85727j35741I3379i982j52716C73432F1763L07396a50066p691G686K25271
11446B32957r1647B6547J26873J78069J65184j90532I3561J43522k3926d2201
11435C11058R4859c6231A8576J2436f7845e173B6113f9525l84598J45072b1206
11423g8694n6290m7349P936A12501b32013A46745M2371a57608C02043D7551A7052
11411A59455G7053l4920Q3634k0990K416e8692A73166L0139N631A6952b28177
11399a68354B27679a48805A77960N4023H1013O0533R6301o7041m3313o555C9664
11387f3841D9161d35808I5859a09214a6963B47098I0583a83607H8073e8375A24560
11375b2960l30686J60799F2205J74491I0315b73912A18204L21773H0763J42989
$$ y = [385727, 249986, 93379, -9982, -162698, 373432, 61763, 369159, -150066, -157757, 7686, 232957, 141310, 26547, 153420, 331489, 496673, 306141, 93561, 237083, 213157, -42201, 311058, 405917, -36231, 18576, 31012, -67845, -5173, 26113, -69525, -454123, -309051, -21206, -78694, -134984, -182333, -174397, 112501, -232013, 146745, 189116, -157608, 302043, 47551, 17052, 159455, 77053, 42133, 125767, 104777, 107193, -58692, 173166, 203305, 208936, 16952, -228177, -168354, 227679, -148805, 177960, 231983, 81013, 141546, 237847, 170806, 127493, 120938, 39664, -63841, 49161, -435808, 95859, -109214, -16963, 247098, 90583, -183607, 88073, -58375, 124560, -22960, -353646, -192847, 62205, 236696, 90315, -273912, 118204, 439977, 80763, 223752]
11365B23752F7254b02371o2635A19923C9182M3088c9823B05724h389B29387H985
11353A51095a91143n5797c0084j8092A68778i4725E7278K93851j01738e4674A80549
11341a8728C40609r8456a46870O7205j83533A19379a324j55671A16983h7356j70971
11330b58327B7650O232f9001j21636h3855K6256B94303J36765a5904l50289J70393
11319a95800a0477r6444N2680J5996a0245j37914p1332B68341d6158j86995B49252
11307C44314j49131b65903L4894O6876H4823e3538C7349J147P1812a7814n4297
11296g2111G5504b64009g0813E0520c20545A26333c27450b1875B1559b36891R8324
11285a38567j3900p9034A80747c75142A7280K687k537K34791j8163B3824K3798
$$ y = [223752, 67254, -202371, -265006, 119923, 39182, 82270, -39823, 205724, -8389, 229387, 8985, 151095, -191143, -246940, -30084, -48176, 168778, -94725, 57278, 351129, 249391, -54674, 180549, -18728, 340609, 242153, -146870, -79665, -263198, 119379, -1324, -156995, 116983, -87356, -258327, 27650, 33882, -69001, -190637, -83855, -57599, 294303, 431068, -15904, -366193, -195800, -10477, -106921, -54241, -38245, -10245, -148159, -219491, 268341, -46158, -233153, 249252, 344314, 195183, -265903, -231009, -164133, 84823, -53538, 37349, 38496, 110308, -17814, -72111, 75504, -264009, -70813, 50520, -320545, 126333, -327450, -21875, 21559, -236891, -138567, -152467, -231501, 180747, -375142, 17280, 19967, 17430, 252221, 234058, 23824, 47622]
11274D7622J31042h7283o2098B2022J27913n7563b242H6336K02381H1996O842
11263H8838d7369F0897a70119Q3665n1873A76849a96317C72028A3085J10681o1312
11252F2454a63262A01683a13181g753p0691j44156G2628L5409b62575j05271e6426
11240C4211a72750J8746b5447k55988a01320k6740j83693D3632a60276M5371A57304
11228h1472H2497k4296d74955b8476C90202g6785C83562a46580b1751j52460G3809
11216A60864C2328Q6509K15524A62768a99552P1972A63963a50785e0568l01696
11206c52264A28933c23504A37451R5039n0345b15010A58054c8684A61549a85588
11195h722A19001d0688H461L5817P9179J17524A12971j101g7485A57327a67070
$$ y = [47622, 178664, -87283, -149381, 22022, 149935, 92372, -2242, 86336, 288717, 81996, 88838, -47369, 60897, -170119, -86454, -138327, 176849, -196317, 372028, 13085, 123766, 62454, -163262, 101683, -113181, -7753, -78444, -222600, 72628, 108037, -262575, -367846, -56426, 34211, -172750, -154004, -25447, -281435, -101320, -128060, -311753, 43632, -160276, -114905, 157304, -81472, 82497, 58201, -474955, -28476, 390202, -76785, 383562, -146580, -21751, -174211, 73809, 160864, 32328, 118837, 334361, 162768, -199552, -127580, 163963, -150785, -50568, -352264, 128933, -323504, 137451, 232490, 182145, -215010, 158054, -38684, 161549, -185588, -8722, 119001, -40688, 8461, 44278, 123457, 240981, 112971, 111870, -77485, 157327, -167070]
11183e0188q307A71151i7709n7066I689A276J25063b89057B2947J92484g4418
11171a22759J6252j70313C759M4502a23899O290A88477k2046f8582j23276H2152
11159B17434b83603f7492j71774P0226f9147H3764a06371D6613J06983B8841c2141
11147a70526G7233l4153c30050g4125j10981n2366A95579H9100e8034G2938N7402
11136A30340F66d6949F0465J20285F8936b84682P1047O743B3953f1089A22615
11124D64444d5488o2354B308a8589A11409B7029K91931G296L53234r8109A04588
11112G0270c10740a31613M6652k4941D50051A91699e0756A04320R1869K45117
11102D41306A43369K42279A13529D3438L6815a10115M3092g571C71038j18522
$$ y = [-50188, -58495, 171151, -97709, -154775, 9689, 1276, 126339, -289057, 22947, 215431, -74418, -122759, -106507, -276820, 3759, 48261, -123899, -117609, 188477, 166431, -68582, -191858, 82152, 217434, -283603, -67492, -239266, -169040, -69147, 83764, -106371, 46613, 153596, 28841, -32141, -170526, 77233, 43080, -330050, -74125, -185106, -237472, 195579, 89100, -58034, 72938, 130340, 666, -46949, 60465, 180750, 68936, -284682, -213635, -206892, 23953, -61089, 122615, 464444, -45488, -107842, 2308, -18589, 111409, 27029, 318960, 7296, 360530, 262421, 104588, 70270, -310740, -131613, -84961, -109902, 450051, 191699, -50756, 104320, 196189, 441306, 143369, 385648, 113529, 43438, 80253, -110115, -67023, -7571, 371038, 252516]
11092B52516H313J05819J66344j31537N8085N0587a7629j24821E9977M0112J4588
11081A14677N1191K0246R3622P9716j54970J56438i6974A79794M3471K00281j44833
11070B78713L37456k20665J49118j47600j07136K87918j26016I9896K75716K33231
11060F08843j63995P0909n7486j85733O45251j56264j70862J98281r2795K18060
11050I14209j65183O7205L5299J21419J11325E38074K37509K36433K0081k09694
11040H22403j00922P0287J30460j3717l43120L25337k45635K02732l60491K26831
11030G14165Q4688J47151k90914J36568J00154k34724K98876M8610m13891K51541
11020H42224O2633C68967J61880J02537M7313q028q0921K60849j53760k30961
$$ y = [252516, 8313, 114132, 280476, 148939, 207024, 257611, -17629, -142450, 59977, 100089, 114677, 165868, 186114, 279736, 359452, 204482, 360920, -96974, 179794, 223265, 423546, 278713, 616169, 395504, 544622, 397022, 289886, 577804, 451788, 99896, 375612, 608843, 444848, 515757, 458271, 272538, 917789, 761525, 590663, 788944, 696149, 914209, 749026, 816231, 851530, 972949, 1084274, 538074, 775583, 1012016, 1032097, 822403, 721481, 791768, 922228, 908511, 565391, 890728, 645093, 847825, 487334, 714165, 798853, 946004, 655090, 791658, 891812, 657088, 955964, 1004574, 590683, 842224, 904857, 368967, 530847, 633384, 680697, 672669, 591748, 852597, 698837, 467876]
11010D67876L06117k40514L64229j53560L3327k27638P0639M5526j04235K51846
11000H13613r1721k2402k52539L65642p9141j31955j58334K89823N7810K02418
10990I93214l5630k197J93317l07467j51891K27444J46629K46920l68679K87785
10980A229445K32184J55138L0268L5724K3629K44160N66627L67652j98887O43396
10970C329336J54719J176l17282k64115k13175j47481p38523r2306k10605J55153
10960A656897l54080K80252k41347J66870m2448j41219O3530m40279J84209E24377
10949E57361K28716A93209M76242J1539M5518k54063A33469J9142J31115j27652
10939A56074i2034B92476A6302K34435J95243a33983g290A04896E1499b7149l2894
$$ y = [467876, 773993, 533479, 897708, 744148, 777475, 549837, 620476, 666002, 561767, 813613, 721892, 699490, 446951, 812593, 733452, 601497, 443163, 732986, 790796, 993214, 957584, 955387, 1148704, 841237, 689346, 916790, 1063419, 1310339, 941660, 1229445, 1461629, 1616767, 1647035, 1682759, 1706388, 1950548, 2517175, 2884827, 2685940, 3329336, 3484055, 3485231, 3167949, 2903834, 2690659, 2543178, 1804655, 1712349, 1501744, 1656897, 1302817, 1583069, 1341722, 1508592, 1466144, 1324925, 1388455, 948176, 1132385, 524377, 557361, 786077, 193209, 669451, 680990, 726508, 472445, 133469, 152611, 283726, 156074, -92034, 292476, 16302, 250737, 445980, -133983, -7290, 104896, 51499, -27149, -60043]
10928f0043B44460A12722b42488A71453a6659A36941P0207a53948C64391A9555
10917E2023K18473a74262H3784J69799o8786E655a7948q5266K8802B03577J4273
10906B17850K2036f9895C4657L37439c7462E7634a19604B47539b11083j9971f2170
10894A33751e584A78566f8244K9520E0294e07821a3414l55012J63337B51048e0968
10882i0563k4466B408a49577A19727E3555i8828q7990G7758J10241D2792j3536
10871B9256o740a3842B90184A5652g9221c6442k37545i4301k30641A0307O2621
10860G2928J13123O5340H5487M3515A164a32168o4568i3529k38105M7785j87429
10849d71278a26352A49753b25120D2596c08993A15080b9353G0438J69808b94223
$$ y = [-60043, 244460, 112722, -242488, 171453, -16659, 136941, 207148, -153948, 364391, 19555, 52023, 270496, -174262, 83784, 253583, 184797, 5655, -17948, -103214, -74412, 203577, 217850, 239886, -69895, 34657, 372096, -37462, 57634, -119604, 247539, -211083, -231054, -62170, 133751, -5584, 178566, -68244, -38724, 50294, -507821, -13414, -368426, -205089, 251048, -50968, -90563, -115029, 2408, -149577, 119727, 53555, -98828, -186818, 77758, 187999, 42792, 29256, 22516, -13842, 290184, 15652, -79221, -36442, -273987, -94301, -324942, 10307, 72928, 186051, 251391, 85487, 129002, 1164, -132168, -196736, -93529, -331634, -283849, -471278, -126352, 149753, -225120, 42596, -308993, 115080, -29353, 70438, 240246, -294223]
10838a36694B51648A21069b43661P9201A72571H97J21330b87647a02279A67584
10827f3825j74817L3561l5052A2360b18071B02028b97456a32699C18033a651C0860
10815b75224a21439A27488b24188j40200C8997i8880d0951C5421J61658d04861
10804D0112O8605M768a2100D17418h1889B83907D6307A9559d901l50158a5339
10792I8191b42322A69692E7653K4768c90507a36817H3963a25795r2162a6349l68024
10781c84373A33970b84187A14368a28520l5293C9506J97444J0574b89636P3777
10771b15859o5044H4513f5538j27590C7998i8021k55385d4686B78859A2222a91408
10759B00359C4892a81391L3778c9874k15733r8986a49651A05546m1982a68187
$$ y = [-136694, 251648, 121069, -243661, -164460, 172571, 897, 122227, -287647, -102279, 167584, -63825, -238642, -205081, -240133, 12360, -218071, 202028, -297456, -132699, 318033, -1651, 30860, -275224, -121439, 127488, -224188, -364388, 38997, -98880, -40951, 35421, 197079, -404861, 40112, 108717, 113485, -12100, 417418, -81889, 283907, 46307, 19559, -4901, -355059, -15339, 98191, -242322, 169692, 57653, 82421, -390507, -136817, 83963, -125795, -217957, -16349, -384373, 133970, -284187, 114368, -128520, -163813, 39506, 236950, 247524, -289636, -215859, -280903, 84513, -65538, -193128, 37998, -98021, -353406, -44686, 278859, 12222, -191408, 200359, 34892, -181391, -147613, -39874, -255607, -354593, -149651, 105546, 63564, -168187]
10748A30441c01484A46018b28600H3317b4073A21979a60528K1130A92018F9487
10737a06531k321A04883a33765h353B98433G9565h0679B4154J49452Q4988A6566
10725a38622A03867a71894L8626b7352C32439E864L0559K7817e36858A00605k8501
10714G2104a7107o1406L2802j48115l506A24826h9171B42270D1672O813a44420
10702e5441k19101A46737A9400c0839j55210D6488L7345d9812K1927p6981B8623
10690H9743K29737q7861l9807a40826d8827G6260a42393n9448H126R7079a68021
10678F5825m162a73759l158j20015A38871A96a89753j38925a2078j73943G0282
10666B62345A07505O4156e8645A18198M4157a06826Q992C49266I0031C092a39473
$$ y = [130441, -301484, 146018, -228600, 83317, -24073, 121979, -160528, -139398, 192018, 69487, -106531, -108852, 104883, -133765, -8353, 298433, 79565, -80679, 24154, 173606, 258594, 16566, -138622, 103867, -171894, -133268, -27352, 332439, 5864, 36423, 64240, -536858, 100605, 72104, -17107, -78513, -45711, -193826, -197332, 124826, -89171, 242270, 41672, 48485, -144420, -55441, -274542, 146737, 19400, -30839, -186049, 46488, 83833, -49812, -27885, -104866, 28623, 89743, 319480, 231619, 191812, -140826, -48827, 76260, -142393, -201841, 8126, 105205, -168021, 65825, 61663, -173759, -176917, -296932, 138871, 196, -189753, -328678, -12078, -186021, 70282, 262345, 107505, 171661, -58645, 118198, 162355, -106826, -97834, 349266, 90031, 3092, -139473]
10654d588j19478M8242q6487J8278L5791M5839j90761q0627A41092a44496B16712
10642A24114n0906i8988I3382b74493H0373a69913I3553J21143a70061j63003
10632c33064i7328r3893d4030l33978A12863a98657P7426b4902k03943O8234G7268
10620b76402P2943c7298B1953c64119A4108c15518J46038B95864H1121e1825A68135
10608A75736p0715e6243B4376b06424b9727G8873K85481A59270b21005l1547g2720
10596D7334b7863A05561b3550j52314L3982B40802e7287m91A11264a46964p4012
10585b20976A80542p3807a79443I4712h0719D9351a05469j51903A37831C7702
10574c29688A24840m8729b88440A36999c85428a27428b4605j92456C96564D1792
$$ y = [-4588, -124066, -75824, -162311, -144033, -108242, -62403, -253164, -333791, 141092, -144496, 216712, 124114, 73208, -98988, 93382, -274493, 80373, -169913, 93553, 214696, -170061, -333064, -97328, -191221, -44030, -378008, 112863, -198657, -121231, -24902, -228845, -160611, 77268, -276402, -203459, -37298, 21953, -364119, 14108, -315518, -169480, 295864, 81121, -51825, 168135, 175736, 105021, -56243, 24376, -206424, -29727, 78873, 364354, 159270, -221005, -252552, -72720, 47334, -27863, 105561, -23550, -175864, -141882, 240802, -57287, -57778, 111264, -146964, -220976, 180542, 106735, -179443, 94712, -80719, 49351, -105469, -257372, 137831, 37702, -329688, 124840, 76111, -288440, 136999, -385428, -127428, -24605, -217061, 396564, 41792]
10563f9173C26922a27995e8083B70017a88898A41614E2366d3193A79080a72919
10552b50930b5360H8659a18101l43430a50622M0876i066A2304N8207Q6681C1116
10540b0179k66458a8948j94840j02069d9565A56317a0155k31539I1072k4791a56831
10528B586a24885j96832A50226j7840a11731B33605b66862F7548a48697A73547
10517a35867I1868D2291j7069J07478E6648L04697e3894p7463j16538a09814j33491
10506b43305A05523K06644a73024D3133a51017f7896j43532d1355F9339a71811
10495b38473e0041l9489j39466B83448h3163D34047D4347a02453d4327j15001
10485a59328E0567b7800n5205D43394o5643f9011A17499J35270j02758l040J19502
$$ y = [-69173, 326922, -127995, -58083, 270017, -188898, 141614, 52366, -43193, 179080, -172919, -250930, -25360, 88659, -118101, -461531, -150622, -109746, -9066, 12304, 70511, 157192, 31116, -20179, -286637, -18948, -213788, -315857, -49565, 156317, -10155, -241694, 91072, 66281, -156831, 2586, -124885, -321717, 150226, 132386, -111731, 233605, -266862, 67548, -148697, 173547, -135867, 91868, 42291, 25222, 132700, 56648, 361345, -53894, -131357, -247895, -109814, -243305, 105523, 312167, -173024, 43133, -151017, -67896, -211428, -41355, 69339, -171811, -238473, -50041, -89530, -228996, 283448, -83163, 434047, 44347, -102453, -44327, -159328, 50567, -27800, -83005, 443394, 377751, -69011, 117499, 252769, 150011, 146971, 266473]
10474B66473G9154J23245g2849b3331j64523j35389b027j483A61059l419c9775
10462c7519E4733b90565O2867A39608b59311F9708k9962a81844C7773J51624o2075
10451A27322a5648l77l67676o5148D8781e1289b1734B7445b3639B99508A7150
10439b00175j58718i3707J237A39378h1820l6793B12850a62083d0377C50642A22481
10427B68760A6347f594k13562A33032e1114r331o7186C49373d783A22447a67247
10415c23522c9229B98426p1329A03333J25497r0076b38854P3379B38751a97186
10404A71699A2419P9216a59679A36350J01381F5535a57576C03744e2668C6302
10393F8189k6076g8718D37648B08241L26262A00419a04414C05193F5870J27956
$$ y = [266473, 79154, 202399, -72849, -23331, -187854, -323243, -2027, -3510, 161059, 157640, -39775, -37519, 54733, -290565, -227698, 139608, -259311, 69708, 39746, -181844, 37773, 189397, 127322, -15648, -16025, -383701, -448849, 48781, -51289, -21734, 27445, -23639, 299508, 17150, -200175, -358893, -93707, -92470, 139378, -81820, -118613, 212850, -162083, -40377, 350642, 122481, 268760, 16347, -6594, -220156, 133032, -51114, -60445, -127631, 349373, -4783, 122447, -167247, -323522, -39229, 298426, 227097, 103333, 228830, 138754, -238854, -165475, 238751, -197186, 171699, 12419, 91635, -159679, 136350, 237731, 65535, -157576, 303744, -52668, 36302, 68189, 42113, -78718, 437648, 208241, 534503, 100419, -104414, 305193, 65870, 193826]
10383A93826J39732R4677H5887J69981b7336A67253G3579M37843A00130Q7605
10373A87735O4146J75815p4648O5719j44230A6842M05188P4751K59796k13683
10363E42894j84606L30526j65569A28887K32511n1647c2072I911J82897P5026
10353B67834H3525J36864J55207L43234K1379k40570p7489j12617j6495Q122K08669
10342E09829f8121C49465L0803g8164D50382j63259j084a01888I5976L1508L3698
10331A61182a05082B45089K32236E5538Q0417k9704J07399m0388J68553C1109
10320A08648M36340A88147p2157l2495a10252d046E27077a88397K1609A41089
10309A47022k5182l8248b63789f8980B28223a19090b9082j43874I1440g7526B92433
$$ y = [193826, 333558, 428235, 85887, 255868, -27336, 167253, 73579, 511422, 100130, 187735, 251881, 427696, 353048, 418767, 274537, 16842, 422030, 496781, 756577, 542894, 358288, 688814, 523245, 128887, 361398, 309751, -32072, 9911, 192808, 267834, 83525, 220389, 375596, 718830, 740209, 499639, 422150, 309533, 293038, 301160, 509829, -68121, 349465, 380268, -78164, 450382, 287123, 286039, -101888, 95976, 127484, 161182, -105082, 245089, 477325, 55538, 135955, 106251, 213650, 173262, 341815, 31109, 108648, 544988, 188147, 115990, 83495, -110252, -4046, 527077, -188397, -166788, 141089, 147022, 121840, 83592, -263789, -68980, 228223, -119090, -29082, -172956, 91440, -77526, 292433]
10297b38000C45606D8286A8814b0366l8584C50002E0195R7186a37448H3969e3062
10285A33789B0620a58400A03341l6499g3585K0907g637k04174b3614B1025a90147
10273b06463f6293F2247h1966e140k7041C05165A43652k0119a06426n1739A26838
10261D05849A15958d5376B34532o0812n2773L00891I8972J37551F3434C906L8453
10250D2359k246K32738b1974i587k71432C19721b6127B54573b12661E7995b4934
10238a76230r4799d8790j60247N9990c6038k45042D3964e6655A78124b37814N4290
10227a83524d1578j73238j74124j03768f4839L0337m3866a1164B33887j08682
10217A25205J0909a15553k2335B0621g253j1551l3888C60827b6196D57219A68627
$$ y = [-238000, 345606, 48286, 18814, -20366, -58950, 350002, 50195, 147381, -137448, 83969, -53062, 133789, 20620, -158400, 103341, 66842, -73585, -52678, -7637, -211811, -23614, 21025, -190147, -206463, -66293, 62247, -81966, -5140, -32181, 305165, 143652, 123533, -106426, -158165, 126838, 405849, 115958, -45376, 234532, 173720, 120947, 421838, 98972, 236523, 63434, 3906, 42359, 40113, 272851, -21974, -9587, -281019, 319721, -26127, 254573, -212661, 57995, -24934, -176230, -271029, -48790, -209037, -149047, -36038, -281080, 43964, -56655, 178124, -237814, -183524, -41578, -214816, -388940, -492708, -64839, -34502, -78368, -11164, 233887, 125205, 136114, -115553, -137888, 20621, -7253, -18804, -52692, 360827, -26196, 457219, 168627]
10205e6534k34346O6407j87163P9084a0942D483b74390A18755c34416a12738L3990
10194g8748l2293A81056f6693k40631b1340H9297c4509A67645E4877Q1846K4444
10183A61167B0890K2296a75610a8684r1498C9459f3197k44752J45536j08734i2941
10171a95693C2995f5278G4744L37989a70632A03249K00525a30538A58005g9347
10160A19911A5470P2668c47738b7672k73917a05095D4306e2176I9415a93948B10151
10148a12011j14698L2296j9160k81053a9889K665k57985A84926c43410G734K8671
10137C6405J1534q679a11652o7236a8677B26804A9782J07768f7050B03807r8672
10126A05135b55561a8497q3515J9678j1988A97739b2823r0560E1488a85949F1437
$$ y = [-56534, -290880, -224473, -411636, -332552, -10942, 4483, -274390, 118755, -334416, -112738, -78748, -111041, 181056, -66693, -307324, -21340, 89297, -34509, 167645, 54877, 136723, 161167, 20890, 43186, -175610, -18684, -110182, 39459, -63197, -307949, -162413, -271147, -92941, -195693, 32995, -65278, 74744, 412733, -170632, 103249, 303774, -130538, 158005, -79347, 119911, 15470, 88138, -347738, -27672, -301589, -105095, 44306, -52176, 99415, -193948, 210151, -112011, -226709, -194413, -213573, -494626, -19889, -17224, -275209, 184926, -343410, 7734, 36405, 47939, 39260, -111652, -178888, -18677, 226804, 19782, 127550, -67050, 203807, 105135, -255561, -18497, -102012, -82334, -94322, 197739, -22823, -113383, 51488, -185949, 61437]
10114c00177j40726a07965q1158J1607M7305r4123B46943a34843A29593c59641
10103h4461j67072A29105a19780B12233a96102f365k70216A07330n717K0449a81611
10091a38501A24957a81377j07203P9951I8939l2834R6230a18702I7244J34050
10081B31294A5086c54291a03080A95501H1648M0731l9094H747M5094c01772a29324
10069a53797E873a75572e3363j74030Q5059A06506a98043A28732d1494A11580
10058b07809B58514a01770D9312a79423j02985g8892k40651F4325c70509f7045
10047c542k92075J45510C3671a18093C54347j07466c49427J12526A36906b59632
10036B07279a44882D6197J1819K24246i0719A62141K0435J45341B2076h0550n8408
$$ y = [-300177, -440903, -107965, -189123, -177516, -130211, -224334, 246943, -134843, 129593, -359641, -84461, -251533, 129105, -119780, 212233, -196102, -6365, -276581, 107330, 101613, 122062, -181611, -138501, 124957, -181377, -288580, -208629, 98939, 66105, 162335, -118702, 97244, 231294, 15086, -354291, -103080, 195501, 81648, 122379, 83285, 8747, 53841, -301772, -129324, -153797, 5873, -175572, -53363, -227393, -142334, 106506, -198043, 128732, -41494, 111580, -207809, 258514, -101770, 49312, -179423, -282408, -78892, -319543, 64325, -370509, -67045, -3542, -295617, -150107, 33671, -118093, 354347, 246881, -349427, -236901, 136906, -259632, 207279, -144882, 46197, 58016, 282262, -90719, 162141, 182576, 327917, 22076, -80550, -138958]
10025a38958N8098j15081J5816n2397R0471j32581A0211Q0615h1152o8383r1333
10014b40868Q4621n2782h9081j42084A20037k0171K21376g5253j5372l2871B46849
10002c10156A70699b57421f947j07285k09603B36008c85942A3208b06224j8558
9992b24782d2980j75629j30090J51723A34087c3600D4332e2971j03942F4685P2568
9981A37253d9192g236A96223a086k01164D269R7513A6495a73686O9899k3383B18136
9968A93938p697A9748d8111A42992D354M6399a53277A24991c3004j68769G2534
9956d436B34918a14913j15211m28916a61256A03424h6054b7673D5282a72405D11652
9944a27475r9945P4090b7099o8120F9935a04093H54a46082c0985j46428j26812
$$ y = [-138958, -80860, -195941, -180125, -232522, -142051, -274632, 10211, 90826, -81152, -149535, -240868, -156247, -209029, -89081, -231165, 120037, 99866, 321242, -75253, -90625, -123496, 246849, -310156, 170699, -257421, -6947, -114232, -323835, 236008, -385942, 13208, -206224, -224782, -42980, -218609, -348699, -196976, 134087, -33600, 44332, -52971, -156913, 64685, 137253, -49192, -7236, 196223, -1086, -202250, 4269, 101782, 16495, -173686, -103787, -127170, 218136, 193938, 186241, 19748, -48111, 142992, 4354, 50753, -153277, 124991, -33004, -201773, 72534, -4436, 234918, -114913, -230124, -659040, -161256, 103424, -86054, -27673, 45282, -172405, 411652, -127475, -227420, -153330, -27099, -95219, 69935, -104093, 854, -146082, -30985, -177413, -304225]
9933c04225A19839d30199D7817b66374I3499k8580N1564a65335E7081A4884a91427
9921d9955k26672c1494l41717a53960a7050H9634K108j8976J9190b3269p092m4080
9909g4441C22549c56671B15814Q4481d4822j56k64611J30359k0310I930a30829
9897e8258a9322C52908b05083g1138q0504M6442j53922D3146J73641a31280M1266
9886i0014q6336j34268C8566a33289A41176b530l38745G606b09671B21534a36404
9874b9444C62750g3479j37263b6387A75023a81507C75004E2995D298a34316A15525
9862e3472q1172j26059C710a1473o4530J3594j18255m6298k13148A08090J23679
9851B31769g8251C61652b2604r6981e721n1385B15671h8755B9016j927J65794
$$ y = [-304225, 119839, -430199, 47817, -266374, 93499, 64919, 116483, -165335, 57081, 14884, -191427, -49955, -276627, -31494, -373211, -153960, -17050, 89634, 91742, 72766, 91956, -23269, -30361, -74441, 322549, -356671, 215814, 300295, -44822, -44978, -309589, -179230, -199540, 9930, -130829, -58258, -19322, 352908, -205083, -71138, -151642, -105200, -259122, 43146, 216787, -131280, -90014, -176350, -310618, 38566, -133289, 141176, -2530, -341275, 7606, -209671, 221534, -136404, -29444, 362750, -73479, -210742, -26387, 175023, -181507, 375004, 52995, 4298, -134316, 115525, -53472, -134644, -260703, 3710, -11473, -76003, -62409, -180664, -226962, -440110, 108090, 231769, -78251, 361652, -22604, -119585, -5721, -57106, 215671, -88755, 29016, 27089, 192883]
9840A92883c65535a23292l7314d9634k15770e6644A15105c51058n8774a8586j21694
9829a40280A01986j958M01908a45928L5935b8309G1158a53512H3129K52727A9232
9817B69521g1397l25956J38897A02735J14384c72344B17254b36033q0556e845
9806B60535f7529j01684P5351j42864H1697P5948E032a08584G5634b5051k05628
9795b30679A00554c7316k36628a24129q1480A56303i1606j05591f1441a4164E23279
9783c13746N2766c2175C3465h9847a6163j53560j6343c2414j85786H9727a9278
9771H4929h602j26390l56051b4830B4872a45521F4942A5688P1813K3719C0969
9759B09123F0239f17935c6618A39635c12188J12381D9930a20376d25C9001c9123
$$ y = [192883, -365535, -123292, -160606, -49634, -265404, -56644, 115105, -351058, -409832, -18586, -140280, 101986, 100028, 501936, -145928, -109993, -28309, 71158, -153512, 83129, 335856, 19232, 269521, -71397, -397353, -258456, 102735, 217119, -372344, 217254, -236033, -316589, -5845, 260535, -67529, -169213, -93862, -236726, 81697, 157645, 5032, -108584, 75634, -25051, -230679, 100554, -37316, -273944, -124129, -205609, 156303, -91606, -197197, -61441, -14164, 523279, -313746, -260980, -32175, 33465, -89847, -16163, -169723, -186066, -32414, -218200, 89727, -19278, 84929, -8602, -134992, -491043, -24830, 24872, -145521, 64942, 15688, 87501, 111220, 30969, 209123, 60239, -617935, -36618, 139635, -312188, -199807, 49930, -120376, -425, 39001, -39123]
9747E7422d63235o8134K42847a02285F085Q3750K90892d0356j14954l5859C4962
9735c87446J52884J0594P8903F7506a93231p9604B4985c08841a41964J3338e8379
9723b9192k12129B17407c08645D55453B483J19123a75578e2881k04467R8109A69567
9711d3219k15411a20767K9950E1449a62472F2952b70941A88868b05310A25614
9700G0434a99279a9475k02576o2277f2409j08338A01746f4075K375r5088B29481
9688b67728h3821c4849k16914J13281C1791b31174o5849a11236j0766B04905H674
9676g2923p2583A235J5233P6075a71203K7538k8438B22144b87413j25532N0395
9665c62550j66139B03356L0346b7787j34894a3700C6721A2889b43889B2391L3915
$$ y = [57422, -463235, -531369, -288522, -102285, 6085, 89835, 380727, -40356, -155310, -191169, 34962, -387446, -234562, -223968, -145065, 67506, -193231, -272835, 24985, -308841, -141964, -128626, -58379, -29192, -241321, 217407, -308645, 455453, 2483, 121606, -175578, -52881, -257348, -159239, 169567, -43219, -258630, -120767, -90817, 51449, -162472, 62952, -270941, 188868, -205310, 125614, 70434, -199279, -19475, -222051, -284328, -62409, -170747, 101746, -64075, -61700, -156788, 229481, -267728, -83821, -34849, -251763, -138482, 31791, -231174, -297023, -111236, -122002, 204905, 8674, -72923, -145506, 1235, 16468, 92543, -171203, -143665, -172103, 222144, -287413, -412945, -362550, -528689, 203356, 233702, -27787, -162681, -13700, 36721, 12889, -243889, 22391, 56306]
9654E6306a69619D06893C2491a59371f5299m7254a7755j84558B28599a98218p0733
9643b68951C8302a37333n9849j63513g7435A69036F1403a19095C1870c9759l7438
9632g7197L813G1539R1748b32529l8215a01228B2176N7086a52480H5040k6457
9621E8583a4852j5884D2500q521J07184d0465D3803r732c36868a02483r3046A99677
9608a8793j98117k6593D6270a29365C79021E4309b88475A80734M3837a56912A75351
9596a35657A99641a5260E9766h583o4503k0906J8709F6939a7199j9479c553q5007
9584h8560A72475c9985A39566i018B15160b38643B20281a57182F5923d193B89373
9572b71396l16004E143K86194e7243b798k69274a03353N0305n70001d8353A86338
$$ y = [56306, -169619, 406893, 32491, -159371, -65299, -112553, -17755, -202313, 228599, -198218, -268951, 38302, -137333, -197182, -360695, -77435, 169036, 61403, -119095, 31870, -39759, -77197, -73384, 71539, 163287, -232529, -270744, -101228, 22176, 79262, -152480, 85040, 58583, -14852, -30736, 42500, 33979, 141163, -40465, 43803, 34071, -336868, -102483, -195529, 199677, -18793, -216910, -243503, 46270, -129365, 379021, 54309, -288475, 180734, 224571, -156912, 175351, -135657, 199641, -15260, 59766, -8583, -73086, -93992, -75283, 66939, -17199, -36678, -3553, -88560, 172475, -39985, 139566, -9018, 215160, -238643, 220281, -157182, 65923, -4193, 289373, -271396, -587400, 5143, 291337, -57243, -2798, -272072, -103353, -53048, -623049, -48353, 186338]
9560A47304a09391k34700c5462E4174j5673O5395R9528c651k03226H1173a86421
9548b20165C20624j25150e6736B2832a55599A28685a00918o5927h1158A82026
9537b63296I429b36864a17564k41476a62288J7686d30A41265c59819J26531A8045
9525d6297O03B2657J1099f4294m5092j06840k0723f9901l29739F7070g0684L4699
9513c5985A50422F7849a14639H1119k7571b29260j40684J38645A47856b31870
9502c09098D4719b84222D9819J19233c0559j22469j11491i3009a9566m59767c5777
9490A53053g7981A54861c19748J33241K8825B70693i142j25087A68021b47937
9479a35316J7870N7253l09803Q6173A18528c0784a4196l05973j6641e2635b1246
$$ y = [147304, -109391, -344091, -35462, 54174, 38501, 103896, 203424, -3651, -206877, 81173, -186421, -220165, 320624, 195474, -56736, 22832, -155599, 128685, -100918, -166845, -81158, 182026, -263296, 9429, -236864, -117564, -359040, -162288, -144602, -430, 141265, -359819, -233288, 18045, -46297, -45694, 22657, 33756, -64294, -109386, -216226, -236949, -69901, -399640, 67070, -70684, -35985, 150422, 67849, -114639, 81119, 53548, -229260, -369944, -231299, 147856, -231870, -309098, 44719, -284222, 49819, 169052, -30559, -153028, -264519, -93009, -19566, -479333, -35777, 153053, -77981, 154861, -319748, -186507, -157682, 270693, -9142, -134229, 168021, -247937, -135316, -117446, -60193, -369996, -283823, 118528, -30784, -14196, -320169, -336810, -52635, -21246]
9467b67401j4997L0347i2555A19146d3866A50830n1026m8072N6723a38177L0925
9456a07252k638j75938c8368j09927o4579M6253j08078f2824j34765k59932g1583
9444b34658b0787A9649a5636M491P58G188K24682a29140C7160a75435F4760B3398
9431A03573c22107g8802J5279C6204J37150e6074q6414G7056e4842l0354m855
9420i0051a8048j02075B67453j02090F5746c01474a34985A64184e3033o3735B67787
9408F9681d9669B09943b8851l6461m4102j66463f6045l96576b07236R5825A84921
9396g8179C1336a28923O3906l5401A29496Q4294b19579r8179f7247B89454a99437
9384A66312b07468i3960A97679b49257a04687j12378N840H2401O3592e3794j1499
$$ y = [-267401, -282398, -252051, -92555, 119146, -43866, 150830, 99804, 51732, 108455, -138177, -107252, -109890, -285828, -38368, -148295, -212874, -166621, -274699, -62824, -197589, -457521, -71583, -234658, -20787, 19649, -15636, -11145, -10387, 7188, 231870, -129140, 37160, -175435, 64760, 23398, 103573, -322107, -78802, -63523, 36204, 173354, -56074, -142488, 77056, -54842, -85196, -90051, -18048, -120123, 267453, 165363, 65746, -301474, -134985, 164184, -53033, -116768, 267787, 69681, -49669, 209943, -28851, -65312, -109414, -275877, -66045, -462621, -207236, -111411, 184921, -78179, 31336, -128923, -65017, -100418, 129496, 213790, -219579, -317758, -67247, 289454, -199437, 166312, -207468, -93960, 197679, -249257, -104687, -217065, -211225, 82401, 145993, -53794, -65293]
9373f5293C4802h9133L5169k82560B20484a05734k3587A97654h8573B96699a69266
9361H1289b40563c6134n1802q806q9110k13664g9063D4393i2642j62334A6489
9349a28160A86474a7603j99059m8617j4881o873a18943A64908O8989d5238q476
9338e3714j8936k07990i1704c1252l18890J29090e6833B20696b44605C9129L307
9327D2436b17510B46543E1283c38290A91368d21064g9487q8289h3780p8526P9435
9316h2871p0916K6873A10820c47758A55731F7513b96538O3035E7767b26795R1662
9305a35133b7350j52446C29311a25443P21k54327J68948M3027O8862d0557a995
9293d02540J43871a22530L2745j5483B39354r3626g1965b4768g507j21192n7072
$$ y = [-65293, 34802, -89133, -53964, -336524, 220484, -105734, -129321, 197654, -88573, 296699, -169266, 81289, -240563, -36134, -87936, -96742, -185852, -399516, -79063, 44393, -92642, -254976, 16489, -128160, 186474, -17603, -216662, -265279, -280160, -287033, -118943, 164908, 233897, -45238, -53714, -72650, -280640, -91704, -31252, -350142, -221052, -56833, 220696, -244605, 39129, 42436, -217510, 246543, 51283, -338290, 191368, -421064, -79487, -167776, -83780, -162306, -82871, -153787, -126914, 110820, -347758, 155731, 67513, -296538, -233503, 57767, -226795, -135133, -27350, -179796, 329311, -125443, -124722, -379049, -210101, -167074, -98212, -40557, -1995, -402540, -258669, -122530, -89785, -105268, 239354, 145728, -71965, -24768, -7507, -128699, -185771]
9282a85771A00824Q633a34723O0527j95017f4146C2699d9726a8387k34195j8804
9271b71386o0594I197a76392b2570j16850N2260q4208c7036p7890A98099c54237
9259B21399c57744a02590A51999a00576A54316d10820d8064j50891H7207a27927
9248A96265b01678B10275b46914B40739a22910A6627a43789m0745j83629g4898
9237e5942o991A96340a5005k29543A45861g5518L138A91983a32953d2029j6435
9226e8464B79749a76404p3099d0396k26814B327a68082o2549h4088j78804A15873
9214a79563b9178m1980H1051E366b90996a03701n7330O0373j00865e3207A3792
9202B38538a3971A7034M5381b90948J12054b9395G6373i224E9895L724g464n7934
$$ y = [-185771, 100824, 109457, -134723, -74196, -269213, -64146, 32699, -49726, -18387, -252582, -271386, -331980, 9197, -176392, -22570, -139420, -87160, -171368, -37036, -114926, 198099, -354237, 221399, -357744, -102590, 151999, -100576, 154316, -410820, -48064, -198955, 87207, -127927, 196265, -201678, 210275, -246914, 240739, -122910, 16627, -143789, -184534, -368163, -74898, -55942, -62933, 196340, -15005, -244548, 145861, -75518, -72380, 191983, -132953, -42029, -58464, 279749, -176404, -249503, -40396, -267210, 2327, -168082, -230631, -84088, -262892, 115873, -179563, -29178, -71158, 81051, 5366, -290996, -103701, -161031, -100658, -201523, -53207, 13792, 238538, -13971, 17034, 62415, -290948, -178894, -29395, 76373, -9224, 59895, 63619, -7464, -65398]
9190f5398C08962b12864l8473m6095f7839c0781j26141k78997K16525G2524a47910
9178c0344j05707B05919e6396j56534A30287f7625k3070l964j5925d893j42521
9167a47414A3092g4442j23963A13776b4016j92861N7718e784j27843L3447p6063
9156a76243k0244Q9958H9607b3488a155o3083j4774C5348J86117a32380Q514M2418
9144h1448B0025K3404e0376B47160g5885A60274b39503B05881D0090a57360b4923
9132b37856C1677M45c82101c176A21539b53726A11289a56230C6816a26139e4922
9120b26867j29569a35001A34893A4882G129a9900m6964A90580a05837B01443K6109
9109B27552E348J14491b16365B26676e05921F6827O1420a93351h7344B9234b35829
$$ y = [-65398, 308962, -212864, -251337, -297432, -67839, -30781, -156922, -435919, -219394, 72524, -147910, -30344, -136051, 205919, -56396, -212930, 130287, -67625, -90695, -94659, -110584, -4893, -147414, 13092, -74442, -198405, 113776, -24016, -216877, -159159, -5784, -133627, -100180, -176243, -196487, -106529, 89607, -23488, -1155, -64238, -79012, 35348, 221465, -132380, -123866, -81448, 20025, 43429, -50376, 247160, -75885, 160274, -239503, 205881, 40090, -157360, -24923, -237856, 31677, 32122, -382101, -3176, 121539, -253726, 111289, -156230, 36816, -126139, -54922, -226867, -356436, -135001, 134893, 14882, 7129, -19900, -66864, 190580, -105837, 201443, 227552, 5348, 119839, -216365, 226676, -505921, 66827, 128247, -193351, -87344, 29234, -235829]
9097d2363D6216K0613J33339m5518b52796h5769A95350r2081a80528J5420O1316
9086a03792j39727F7434i3869q6780b4840k25647n476R2028A45016n3622c43152
9074A01897k8459R6259I473b90567M9717m9335e6964q6328O4883l5812B22967
9062a29767K8295A29407b85486a22298D3443C526J53866g1804B67590h1439B52408
9050f2549k7348B60996b588A0185K7966L2546d3773j57519p184h0315k23693J20305
9038a83703A10133F480J55107b12772I1236K34930H2386C3698a16336q422F1965
9026a74172I6431J17457e2071m4001j15442i353m8658j25946E3282d15116A49957
9014a78960c9892C58923E7722f8836A31353a36471d8967l27986g7841j80016g7946
$$ y = [-42363, 46216, 66829, 200168, 154650, -252796, -85769, 195350, 103269, -180528, -165108, -103792, -243519, 67434, -93869, -180649, -24840, -250487, -255963, -163935, 145016, 91394, -343152, 101897, 73438, 169697, 9473, -290567, -240850, -290185, -56964, -143292, -78409, -114221, 222967, -129767, -101472, 129407, -285486, -122298, 43443, 3526, 157392, -71804, 267590, -81439, 252408, -62549, -89897, 260996, -2588, 10185, 38151, 70697, -43773, -201292, -208476, -80315, -304008, -183703, 110133, 6480, 161587, -212772, 91236, 326166, 82386, 33698, -116336, -124758, 61965, -174172, 96431, 213888, -52071, -96072, -211514, -9353, -58011, -183957, 53282, -415116, 149957, -178960, -39892, 358923, 57722, -68836, 131353, -136471, -48967, -376953, -77841, -257857, -77946]
9002e7166j16597j60441A36331i5612A23746b95029N4655A65012b45450G8451
8991A67844F2272a77898a6972l10656a6683A34695a00274K4561C7747a03819p789
8980a11608N2340D7648E48a4572I735R1336a69662D0099P0531b42401H5191b20400
8967b37948O9517h3875A55562b20379m05651b09467j50713J15943O5687a4649
8956I728Q7728R4713J9411d1208l11678O5813A26850a33273D85058b43385h9252
8944E6266B1022a49253A44587b1166j09524h821B37056F9132a02543E54363f748
8932B12613M207B0112f0418G9420J20659F1038J76780J86405M40398J742741R622315
8921A2229677K457054E445474A750102p21548k28326C64074j12433D3982R3090
$$ y = [-57166, -173763, -334204, 136331, -95612, 123746, -295029, -240374, 165012, -245450, 78451, 167844, 62272, -177898, -16972, -327628, -16683, 134695, -100274, -75713, 37747, -103819, -111608, -59268, 47648, 548, -14572, 9735, 101071, -169662, 40099, 110630, -242401, 85191, -220400, -237948, -168431, -83875, 155562, -220379, -626030, -209467, -360180, -244237, -178550, -14649, 9728, 97456, 192169, 211580, -41208, -352886, -287073, 126850, -133273, 485058, -243385, -89252, 56266, 21022, -149253, 144587, -21166, -130690, -8821, 237056, 69132, -102543, 554363, -6748, 212613, 216820, 20112, -60418, 79420, 200079, 61038, 237818, 424223, 864621, 2607362, 12229677, 14686731, 5445474, 1750102, 1028554, 800228, 364074, 251641, 43982, 137072]
8912A37072h8051H7021a31879A55067K55642A15434a20163d1552B69753h8298
8901F4346b65850m445A30420C5032M2132e6698A5238a64967g9818k8591A16301
8889b22852R9836B3669M5668a6713B3943J95091d8852j46059g289A46336F9593
8877C4451b64011A80390G2524L2083P6971e5502g458n1577j05545M6488m50599
$$ y = [137072, -88051, 87021, -131879, 155067, 410709, 115434, -120163, -41552, 269753, -88298, 64346, -265850, -270295, 130420, 35032, 77164, -56698, 15238, -164967, -79818, -108409, 116301, -222852, -123016, 23669, 69337, -16713, 23943, 219034, -48852, -194911, -7289, 146336, 69593, 34451, -264011, 180390, 72524, 104607, 181578, -55502, -7458, -59035, -164580, -118092, -568691]
$$ [...]
##END NTUPLES=NMR SPECTRUM
##END=
