##TITLE=AC1475_ZNESTR301_8100901_303tCqPQpd
##JCAMPDX= 6.0         $$ Bruker NMR JCAMP-DX V2.0
##DATA TYPE= NMR SPECTRUM
##DATA CLASS= NTUPLES
##ORIGIN= BRUKER
##OWNER= Administrator
$$ 1.72 TOPSPIN		Version 2.1
$$ 2013-07-31 15:58:57.279 -0700  Administrator@X
$$ Compression mode = diff/dup
##.OBSERVE FREQUENCY= 400.02188249412
##.OBSERVE NUCLEUS= ^1H
##.ACQUISITION MODE= SIMULTANEOUS (DQD)
##.ACQUISITION SCHEME= undefined
##.AVERAGES= 64
##.DIGITISER RES= 22
##SPECTROMETER/DATA SYSTEM= spect
##.PULSE SEQUENCE= noesygpps1d.comp
##.SOLVENT NAME= COFFEE_meoh
##.SHIFT REFERENCE= INTERNAL, COFFEE_meoh, 1, 14.96097
##AUDIT TRAIL= $$ (NUMBER, WHEN, WHO, WHERE, PROCESS, VERSION, WHAT)
$$ ##TITLE= Audit trail, TOPSPIN		Version 2.1
$$ ##JCAMPDX= 5.01
$$ ##ORIGIN= Bruker BioSpin GmbH
$$ ##OWNER= Administrator
$$ $$ E:\/data/COFFEE/nmr/AC1475_ZNESTR301_8100901_303tCqPQpd/12/pdata/1/auditp.txt
$$ ##AUDIT TRAIL=  $$ (NUMBER, WHEN, WHO, WHERE, PROCESS, VERSION, WHAT)
(   1,<2013-07-31 15:58:52.357 -0700>,<Administrator>,<X>,<go>,<TOPSPIN 2.1>,
      <created by zg
	started at 2013-07-31 15:47:22.810 -0700,
	POWCHK enabled, PULCHK disabled,
       configuration hash MD5:
       C8 4E 4E 5D D3 5C D8 9E 9F 52 82 E0 59 8A DE 15
       data hash MD5: 64K
       45 8D A6 2B 2D 78 36 EB 46 B8 F4 43 E1 FE 78 A7>)
(   2,<2013-07-31 15:58:55.325 -0700>,<Administrator>,<X>,<proc1d>,<TOPSPIN 2.1>,
      <Start of raw data processing
       efp LB = 0.3 FT_mod = 6 PKNL = 1 PHC0 = 0 PHC1 = 0 SI = 128K 
       data hash MD5: 128K
       82 C0 C9 18 02 61 E7 8F A3 33 0B FD EA EC 24 9B>)
(   3,<2013-07-31 15:58:56.279 -0700>,<Administrator>,<X>,<proc1d>,<TOPSPIN 2.1>,
      <pk PHC0 = -80.29358 PHC1 = 0 
       data hash MD5: 128K
       28 40 45 72 40 02 EA A2 29 19 73 78 AB 6A AC 34>)
(   4,<2013-07-31 15:58:56.747 -0700>,<Administrator>,<X>,<proc1d>,<TOPSPIN 2.1>,
      <abs ABSG = 1 
       data hash MD5: 128K
       60 CC B4 B1 C3 42 D7 95 5E 6E D9 0B 86 F7 03 6D>)
(   5,<2013-07-31 15:58:56.841 -0700>,<Administrator>,<X>,<proc1d>,<TOPSPIN 2.1>,
      <abs ABSG = 2 
       data hash MD5: 128K
       F0 4F 59 63 DE 1A 0A 5F A3 53 E4 98 33 BF 83 C9>)
(   6,<2013-07-31 15:58:56.904 -0700>,<Administrator>,<X>,<proc1d>,<TOPSPIN 2.1>,
      <abs ABSG = 3 
       data hash MD5: 128K
       B4 85 1E FF 95 59 70 84 68 33 F9 AB DE 81 95 F8>)
(   7,<2013-07-31 15:58:57.013 -0700>,<Administrator>,<X>,<proc1d>,<TOPSPIN 2.1>,
      <abs ABSG = 4 
       data hash MD5: 128K
       F6 EF 22 39 77 60 F0 4A EA 0C 6F F4 23 94 4F 52>)
(   8,<2013-07-31 15:58:57.107 -0700>,<Administrator>,<X>,<proc1d>,<TOPSPIN 2.1>,
      <abs ABSG = 5 
       data hash MD5: 128K
       CB 66 0D B9 4D 29 4D EF 26 2D 2B 1F F7 40 F9 ED>)
$$ ##END=
$$ 
$$ $$ hash MD5
$$ $$ 63 98 8C 79 4F 05 FF E9 7B FE 4F D9 CE D9 D2 29
##$RELAX= 
##$RELAX= 
##$RELAX= 
##$RELAX= 
##$RELAX= 
##$RELAX= 
##$RELAX= 
##$RELAX= 
$$ Bruker specific parameters
$$ --------------------------
##$DU= <E:\>
##$EXPNO= 12
$$ [...]
##$TP07= 0
##$TPNAME0= <>
##$TPNAME1= <>
##$TPNAME2= <>
##$TPNAME3= <>
##$TPNAME4= <>
##$TPNAME5= <>
##$TPNAME6= <>
##$TPNAME7= <>
##$TPOAL= (0..7)
0.5 0.5 0.5 0.5 0.5 0.5 0.5 0.5
##$TPOFFS= (0..7)
0 0 0 0 0 0 0 0
##$TUNHIN= 0
##$TUNHOUT= 0
##$TUNXOUT= 0
##$USERA1= <user>
##$USERA2= <user>
##$USERA3= <user>
##$USERA4= <user>
##$USERA5= <user>
##$V9= 5
##$VALIST= <valist>
##$VCLIST= <CCCCCCCCCCCCCCC>
##$VD= 0
##$VDLIST= <DDDDDDDDDDDDDDD>
##$VPLIST= <PPPPPPPPPPPPPPP>
##$VTLIST= <TTTTTTTTTTTTTTT>
##$WBST= 2048
##$WBSW= 25
##$XGAIN= (0..3)
0 0 0 0
##$XL= 0
##$YL= 0
##$YMAX_a= 6602939
##$YMIN_a= -13864917
##$ZGOPTNS= <>
##$ZL1= 120
##$ZL2= 120
##$ZL3= 120
##$ZL4= 120
##$ABSF1= 14.96097
##$ABSF2= -5.597212
##$ABSG= 5
##$ABSL= 3
##$ALPHA= 0
##$AQORDER= 0
##$ASSFAC= 0
##$ASSFACI= 0
##$ASSFACX= 0
##$ASSWID= 0
##$AUNMP= <proc_prof1d_extract.lims>
##$AXLEFT= 0
##$AXNAME= <>
##$AXNUC= <1H>
##$AXRIGHT= 0
##$AXTYPE= 0
##$AXUNIT= <>
##$AZFE= 0.1
##$AZFW= 0.1
##$BCFW= 0
##$BC_mod= 0
##$BYTORDP= 0
##$COROFFS= 0
##$CY= 15
##$DATMOD= 1
##$DC= 0
##$DFILT= <>
##$DTYPP= 0
##$F1P= 0
##$F2P= 0
##$FCOR= 0.5
##$FTSIZE= 131072
##$FT_mod= 6
##$GAMMA= 0
##$GB= 0
##$INTBC= 1
##$INTSCL= 1
##$ISEN= 128
##$LB= 0.3
##$LEV0= 0
##$LPBIN= 0
##$MAXI= 10000
##$MC2= 0
##$MEAN= 0
##$ME_mod= 0
##$MI= 0
##$NCOEF= 0
##$NC_proc= -2
##$NLEV= 6
##$NOISF1= 0
##$NOISF2= 0
##$NSP= 0
##$NTH_PI= 0
##$NZP= 0
##$OFFSET= 14.96097
##$PC= 1
##$PHC0= -80.29358
##$PHC1= 0
##$PH_mod= 1
##$PKNL= yes
##$PPARMOD= 0
##$PPDIAG= 0
##$PPIPTYP= 0
##$PPMPNUM= 2147483647
##$PPRESOL= 1
##$PSCAL= 4
##$PSIGN= 0
##$PYNMP= <proc.py>
##$REVERSE= no
##$SF= 400.020009648498
##$SI= 131072
##$SIGF1= 0
##$SIGF2= 0
##$SINO= 400
##$SIOLD= 131072
##$SPECTYP= <>
##$SREGLST= <1H.CDCl3>
##$SSB= 0
##$STSI= 131072
##$STSR= 0
##$SW_p= 8223.68421052631
##$SYMM= 0
##$S_DEV= 0
##$TDeff= 65536
##$TDoff= 0
##$TI= <>
##$TILT= no
##$TM1= 0
##$TM2= 0
##$TOPLEV= 0
##$USERP1= <user>
##$USERP2= <user>
##$USERP3= <user>
##$USERP4= <user>
##$USERP5= <user>
##$WDW= 1
##$XDIM= 131072
##$YMAX_p= 428585831
##$YMIN_p= -11570
##$CURPLOT= <Network HP LaserJet P1505>
##$CURPRIN= <$Network HP LaserJet P1505>
##$DFORMAT= <normdp>
##$LAYOUT= <+/1D_H.xwp>
##$LFORMAT= <normlp>
##$PFORMAT= <normpl>
##$SURQMSG= 1
$$ End of Bruker specific parameters
$$ ---------------------------------
##NTUPLES= NMR SPECTRUM
##VAR_NAME=  FREQUENCY,     SPECTRUM/REAL,   SPECTRUM/IMAG
##SYMBOL=    X,             R,               I
##VAR_TYPE=  INDEPENDENT,   DEPENDENT,       DEPENDENT
##VAR_FORM=  AFFN,          ASDF,            ASDF
##VAR_DIM=   131072,        131072,          131072
##UNITS=     HZ,            ARBITRARY UNITS, ARBITRARY UNITS
##FACTOR=    0.0627417313425164, 1,          1
##FIRST=     8223.62146879497, 542,          -69943
##LAST=      0,             2793,            -70650
##MIN=       0,             -11570,          0
##MAX=       8223.62146879497, 428585831,    0
$$ Real data points
##PAGE= N=1
##DATA TABLE= (X++(R..R)), XYDATA
$$ [...]
61517C92765k280j077K08O16M02L95O65N30k70j117j382j196j049j059j006r03
61501C84242r83j186j140p39l90m79q88j242j372j354j331j446j751j992j753
61486C66196j036m20m55j035j581j643j164l75L28O20N75N99Q56J032Q33M22J54
61469C63906J28K66N39Q14P31J45n54r10r69j045j118r38n01n1L72Q98J350J313
61451C64376P18N6j32J80O02P94P86Q24R47Q24J66o56p71K29J754K836L109K926
61433C79568K833L089L582L922L773L255K807K503J944J065N92J156K286K964
61419D15339L033L361M453N616N811N004M169M049M327M108L024J492j2j573l407
61404D58794n129n973n751n120m765m718m622m299l838l433l302l426l350k598
$$ y = [392765, 390485, 389408, 389616, 390232, 390634, 391029, 391694, 392224, 391954, 390837, 389455, 388259, 387210, 386151, 385145, 384242, 383259, 382073, 380933, 380194, 379804, 379325, 378437, 377195, 375823, 374469, 373138, 371692, 369941, 367949, 366196, 365160, 364740, 364285, 363250, 361669, 360026, 358862, 358487, 358815, 359435, 360010, 360609, 361465, 362497, 363330, 363752, 363906, 364034, 364300, 364839, 365653, 366384, 366529, 365975, 365065, 364096, 363051, 361933, 360995, 360494, 360443, 360815, 361713, 363063, 364376, 365094, 365150, 365018, 365198, 365800, 366594, 367380, 368204, 369151, 369975, 370141, 369485, 368714, 368943, 370697, 373533, 376642, 379568, 382401, 385490, 389072, 392994, 396767, 400022, 402829, 405332, 407276, 408341, 408933, 410089, 412375, 415339, 418372, 421733, 426186, 431802, 437613, 442617, 446786, 450835, 455162, 459270, 462294, 463786, 463774, 462201, 458794, 453665, 447692, 441941, 436821, 432056, 427338, 422716, 418417, 414579, 411146, 407844, 404418, 401068, 398470]
61390C98470j449p64q75j171j018n51k38j74k60n18q23p99m45m04j098j980k173
61373C83730j465k34J097K052K110J398Q64J103J553J568J623K411L331L215K242
61358D06598J756K151K400J982J865K941M648N912O596P193P768Q131Q656R992
61344D78589J2092J4216J5802J6728J6841J5915J4200J2545J1539J0810R472P201
61332F35950M619K476P89r48k864m508n626o612p821q912r336r091q515p602o247
61317E65752m964m515m782m763l958l020k716k841k700k203j853j842j709r80
61303E22906K65J628K974M538O485Q518R986J0397R677Q089O034L899J806m73
61289E96729l043n335o496o473o141o153o213n839n225m700l966k625j049Q6Q36
$$ y = [398470, 397021, 396257, 395382, 394211, 393193, 392642, 392404, 392230, 391970, 391452, 390629, 389830, 389385, 388981, 387883, 385903, 383730, 382265, 382031, 383128, 385180, 387290, 388688, 389552, 390655, 392208, 393776, 395399, 397810, 401141, 404356, 406598, 408354, 410505, 412905, 414887, 416752, 419693, 424341, 430253, 436849, 444042, 451810, 459941, 468597, 478589, 490681, 504897, 520699, 537427, 554268, 570183, 584383, 596928, 608467, 619277, 628749, 635950, 640569, 643045, 643834, 642886, 640022, 635514, 629888, 623276, 615455, 606543, 597207, 588116, 579601, 571999, 565752, 560788, 556273, 551491, 546728, 542770, 539750, 537034, 534193, 531493, 529290, 527437, 525595, 523886, 522906, 523171, 524799, 527773, 532311, 538796, 547314, 557300, 567697, 577374, 585463, 591497, 595396, 597202, 596729, 593686, 588351, 581855, 575382, 569241, 563088, 556875, 551036, 545811, 541111, 537145, 534520, 533471, 533557, 534393]
61274E34393J721K706L359L870M825O053O706O629O625P058P311P041O919P500
61260F12716Q218Q358Q395R389J1455J3653J5335J6818J8685K0886K2642K2983
61248G89533K1381J8084J3773Q927L724j420n789r096j1832j4452j6584j7531
61236G78718j7261j6392j5350j4073j2535j1035r778q556p122n743n010n015m965
61223F45883l910j840K89J721K683L632M311M143L351K766K598K215J329N59M81
61208F70211Q49J223J705K466L117L162K738K310K034K053K902M827P047Q632
61194G15276R975J2375J6080J9787K2457K4687K7605L1085L3907L5279L5320L4188
61182A018021L1699K8140K4611K2000K0000J7797J5405J3680J2990J2563J1342
$$ y = [534393, 536114, 538820, 542179, 546049, 550874, 556927, 563633, 570262, 576887, 583945, 591256, 598297, 605216, 612716, 620934, 629292, 637687, 647076, 658531, 672184, 687519, 704337, 723022, 743908, 766550, 789533, 810914, 828998, 842771, 851698, 855422, 854002, 848213, 839117, 827285, 812833, 796249, 778718, 761457, 745065, 729715, 715642, 703107, 692072, 682294, 673738, 666616, 660873, 655863, 650848, 645883, 641973, 640133, 640422, 642143, 644826, 648458, 652769, 656912, 660263, 663029, 665627, 667842, 669171, 669730, 670211, 671060, 672283, 673988, 676454, 679571, 682733, 685471, 687781, 689815, 691868, 694770, 699597, 706644, 715276, 725251, 737626, 753706, 773493, 795950, 820637, 848242, 879327, 913234, 948513, 983833, 1018021, 1049720, 1077860, 1102471, 1124471, 1144471, 1162268, 1177673, 1191353, 1204343, 1216906, 1228248]
61171A228248Q995N859K428q30l580o016q794j2130j5370j7889k0056k2629k5517
61158A112719k7960k9661l0839l1237l0135k7627k4926k2933k1232j9003j6295
61147H30871j3725j1511r410p285n068k558J39K138K404Q74j471l606n136o094
61133G70562o528o410n687m347k578p24J012K724M588O765R546J3161J7234K0856
61119H20174K3601K6071K8999L2200L4939L7011L8776M0348M1468M2183M2997
61108A208767M4104M4983M4908M3569M1152L8121L5010L2127K9330K6265K2741
61097A611077J8689J3975Q620L007k631q711j5702k3026k9314l3872l7217l9983
61085A464912m2026m3019m3312m3528m3639m3088m1655l9692l7592l5478l3388
$$ y = [1228248, 1237243, 1243102, 1245530, 1244700, 1241120, 1235104, 1226310, 1214180, 1198810, 1180921, 1160865, 1138236, 1112719, 1084759, 1055098, 1024259, 993022, 962887, 935260, 910334, 887401, 866169, 847166, 830871, 817146, 805635, 796225, 788940, 783872, 781314, 781453, 783591, 785995, 786869, 785398, 781792, 776656, 770562, 764034, 757624, 751937, 747590, 745012, 744288, 745300, 748024, 752612, 759377, 768923, 782084, 799318, 820174, 843775, 869846, 898845, 931045, 965984, 1002995, 1041771, 1082119, 1123587, 1165770, 1208767, 1252871, 1297854, 1342762, 1386331, 1427483, 1465604, 1500614, 1532741, 1562071, 1588336, 1611077, 1629766, 1643741, 1652361, 1655368, 1652737, 1644026, 1628324, 1605298, 1575984, 1542112, 1504895, 1464912, 1422886, 1379867, 1336555, 1293027, 1249388, 1206300, 1164645, 1124953, 1087361, 1051883, 1018495]
61074A018495l1324k9043k6196k2844j9590j7011j5058j3144j0789q179o006m695
61062H14616l851k711j090M47J499K407L615M842N523N876O827Q725J0786J2109
61048H69620J2828J3775J5364J7335J9487K2049K5125K8231L0741L2681L4640
61037A121876L6974L9350M1251M2547M3390M3764M3618M3288M3370M4080M5148
61026A588656M6412M7962M9606N0767N1216N1290N0941M9347M6315M3457M3033
61015B119002M5848N1263N8770O8336P9330R0563J01604J12983J25276J39681
61005B992656J59486J88842K29538K80893L43304M19287N10651O18888P50822
60996F494367R19845J139104J419113J773664K207918K669138L004024L004097
$$ y = [1018495, 987171, 958128, 931932, 909088, 889498, 872487, 857429, 844285, 833496, 825317, 819311, 814616, 810765, 808054, 806964, 807411, 808910, 811317, 814932, 819774, 825297, 831173, 838000, 846725, 857511, 869620, 882448, 896223, 911587, 928922, 948409, 970458, 995583, 1023814, 1054555, 1087236, 1121876, 1158850, 1198200, 1239451, 1281998, 1325388, 1369152, 1412770, 1456058, 1499428, 1543508, 1588656, 1635068, 1683030, 1732636, 1783403, 1834619, 1885909, 1936850, 1986197, 2032512, 2075969, 2119002, 2164850, 2216113, 2274883, 2343219, 2422549, 2513112, 2614716, 2727699, 2852975, 2992656, 3152142, 3340984, 3570522, 3851415, 4194719, 4614006, 5124657, 5743545, 6494367, 7414212, 8553316, 9972429, 11746093, 13954011, 16623149, 19627173, 22631270]
60988B2631270K547343J719917P88470L7198l77522m40095k05403K29943O92008
60979B7623129R33372P48033J16774p64956j613499k221939k530648k586283k468595
60970A7235388k250120j987996j721916j472634j247779j050733q83055p42296
60962E878859o23427n23237m40894l74825l21866k79305k45301k17325j92571
60953B660108j70215j51189j35387j20904j06364r2226p9302o7673n7712n0635
60943A628501m7099m6219m6575m7316m7834m7469m6133m4419m2618m0421l7976
60932A134422l6235l5723l5718l5186l3856l1946k9557k6940k4723k3307k2400
60921G98831k1410k0083j8564j7219j6345j5621j4153j1707r534q954r319q682
$$ y = [22631270, 25178613, 26898530, 27687000, 27724198, 27346676, 26906581, 26701178, 26931121, 27623129, 28556501, 29304534, 29421308, 28656352, 27042853, 24820914, 22290266, 19703983, 17235388, 14985268, 12997272, 11275356, 9802722, 8554943, 7504210, 6621155, 5878859, 5255432, 4732195, 4291301, 3916476, 3594610, 3315305, 3070004, 2852679, 2660108, 2489893, 2338704, 2203317, 2082413, 1976049, 1883823, 1804521, 1736848, 1679136, 1628501, 1581402, 1535183, 1488608, 1441292, 1393458, 1345989, 1299856, 1255437, 1212819, 1172398, 1134422, 1098187, 1062464, 1026746, 991560, 957704, 925758, 896201, 869261, 844538, 821231, 798831, 777421, 757338, 738774, 721555, 705210, 689589, 675436, 663729, 654195, 645241, 635922, 627240]
60909F27240o481m198l120k831k446j965j680j340p64m23o17r31j160j883l359
60894E94042m691m960m491m218m380m696n108n555n530m748l853l689m209m711
60880E29203m768m366l563k596j922j616j196m28L12P99J328J856J726R93R30
60865E16692K226L631L574K443J895K433L062L075K807K609K308J835J397Q98
60851E50885L0j001j604j776k049k479k464j776r87o97q93j326j949k785l764
60836E25365m776n643o048n858n366m882m279l335k237j274l25Q12J863K477K921
60821D89415L675M582N023M874M572M346M053L589K962K056R84L80O74J310J468
60806E33963J323J640K329K462J774J026O52J19r42j938k257k283k799l833m801
$$ y = [627240, 620759, 616561, 613441, 610610, 608164, 606199, 604519, 603179, 602415, 601992, 601375, 600444, 599284, 597401, 594042, 589351, 584391, 579900, 575682, 571302, 566606, 561498, 555943, 550413, 545665, 541812, 538123, 533914, 529203, 524435, 520069, 516506, 513910, 511988, 510372, 509176, 508748, 509060, 509859, 511187, 513043, 514769, 515762, 516692, 518918, 522549, 526123, 528566, 530461, 532894, 535956, 539031, 541838, 544447, 546755, 548590, 549987, 550885, 550915, 549914, 548310, 546534, 544485, 542006, 539542, 537766, 536779, 536082, 535189, 533863, 531914, 529129, 525365, 520589, 514946, 508898, 503040, 497674, 492792, 488513, 485178, 482941, 481667, 481342, 482154, 484017, 486494, 489415, 493090, 497672, 502695, 507569, 512141, 516487, 520540, 524129, 527091, 529147, 530131, 530511, 531185, 532495, 533963, 535286, 536926, 539255, 541717, 543491, 544517, 545169, 545288, 544346, 542408, 540151, 537868, 535069, 531236, 526435]
60791E26435n463o095o863p454p384o504n240m345m244m613m790m608m487m702
60777D49643m870m360l008j401m57o88j684k491k499j867r87KR38J492J757K453
60761D31973L916N257N339M338L492L493L979M477M909N119M903M657N123O156
60747D97131O680O278O033P037Q754R589Q844P287N900M692L042Q25j192k168
60733E68732k236k389l257m317m622l970k940k011j317j103j712k958m083m595
60719E27222m683m691m649m563m661m986n209n131n072n393n915o167o018n650
60705D54434n075m125k991k317k476k991k952k012o52N01J290J733J699J275J150
60690D36491J889K996L465L289L532M709N979O455O385O376O205N353M188L595
$$ y = [526435, 520972, 514877, 508014, 500560, 493176, 486672, 481432, 477087, 472843, 468230, 463440, 458832, 454345, 449643, 444773, 440413, 437405, 436004, 435547, 434859, 433175, 430684, 428185, 426318, 425331, 425333, 426271, 427763, 429520, 431973, 435889, 441146, 446485, 450823, 454315, 457808, 461787, 466264, 471173, 476292, 481195, 485852, 490975, 497131, 503811, 510089, 516122, 523159, 531913, 541502, 550346, 557633, 563533, 568225, 571267, 572092, 570900, 568732, 566496, 564107, 560850, 556533, 551911, 547941, 545001, 542990, 541673, 540570, 538858, 535900, 531817, 527222, 522539, 517848, 513199, 508636, 503975, 498989, 493780, 488649, 483577, 478184, 472269, 466102, 460084, 454434, 449359, 445234, 442243, 439926, 437450, 434459, 431507, 429495, 428843, 429344, 430634, 432367, 434066, 435341, 436491, 438380, 441376, 444841, 448130, 451662, 456371, 462350, 468805, 475190, 481566, 487771, 493124, 497312, 500907]
60676E00907L675L636K936J773N55m53j087j474k150l361m482m754m358m091m152
60661D83120m045l579l150l003k950k844k692k336j558n80J94Q35J697K667L344
60646D65120L830M583N421N522M530L028J758R90P67J020J334J213P34M94Q21
60631E01165J557K496L480M139M247M318N105O502P699Q335Q714Q918Q664Q231
60617E83570Q478R600J0678J0916J0620J0537J0881J1425J2046J2787J3701J4866
60605G20105J6167J7061J7067J6517J6227J6373J6358J5908J5550J5792J6508
60594H99633J7288J7855J7961J7575J7277J7805J9085K0318K1035K1307K0903
60583A108042J9255J6516J3689J1309Q752N301J116l182p241j0943j4234j7236
$$ y = [500907, 504582, 508218, 511154, 512927, 513482, 513029, 511942, 510468, 508318, 504957, 500475, 495721, 491363, 487272, 483120, 479075, 475496, 472346, 469343, 466393, 463549, 460857, 458521, 456963, 456383, 456577, 457412, 459109, 461776, 465120, 468950, 473533, 478954, 484476, 489006, 492034, 493792, 494782, 495549, 496569, 497903, 499116, 499850, 500344, 501165, 502722, 505218, 508698, 512837, 517084, 521402, 526507, 533009, 540708, 549043, 557757, 566675, 575339, 583570, 592048, 601648, 612326, 623242, 633862, 644399, 655280, 666705, 678751, 691538, 705239, 720105, 736272, 753333, 770400, 786917, 803144, 819517, 835875, 851783, 867333, 883125, 899633, 916921, 934776, 952737, 970312, 987589, 1005394, 1024479, 1044797, 1065832, 1087139, 1108042, 1127297, 1143813, 1157502, 1168811, 1177563, 1182864, 1183980, 1180798, 1173557, 1162614, 1148380, 1131144]
60571A131144k0013k2154k3232k3599k3905k3856k2598k0367j8447j7255j5794
60560H99924j3516j1312j0050r416r001r268j0459j1661j2094j2333j3163j4128
60548G63523j4377j4068j3729j2966j1162q916p391o602n630m217k864j580J48
60535F60169K130L391L458K777J723K10j609l136m145n019n911o323n885m964
60521F36866m185l622k871j654k32P51Q10J72l57j75N78J403K038K418K397J930
60505F36267J313R05P50P36R30J519K584M096N897P663R259J1154J4041J7868
60491G14982K1864K5597K9255L2535L4086L2698K8402K1943J3746M129o090j5915
60479I37232k4712l1865l6417l7880l7005l5021l2434k9179k5565k2248j9462
$$ y = [1131144, 1111131, 1088977, 1065745, 1042146, 1018241, 994385, 971787, 951420, 932973, 915718, 899924, 886408, 875096, 865046, 855630, 846629, 837361, 826902, 815241, 803147, 790814, 777651, 763523, 749146, 735078, 721349, 708383, 697221, 688305, 680914, 674312, 668682, 664465, 661601, 660021, 660169, 662299, 665690, 669148, 671925, 673648, 673858, 672249, 669113, 664968, 659949, 654038, 647715, 641830, 636866, 632681, 629059, 626188, 624534, 624302, 625053, 625863, 626035, 625678, 625503, 626081, 627484, 629522, 631940, 634337, 636267, 637580, 638485, 639235, 639971, 640901, 642420, 645004, 649100, 654997, 662660, 671919, 683073, 697114, 714982, 736846, 762443, 791698, 824233, 858319, 891017, 919419, 941362, 955108, 959237, 953147, 937232, 912520, 880655, 844238, 806358, 769353, 734332, 701898, 672719, 647154, 624906, 605444]
60468F05444j7033j4959j3347j1934j0315q568p164o345o071o254o611o523n629
60455D84691m412l679l632l804l720l217k411j684j475j735j952j932k027k345
60441D46666k352j749j026o60m71l64q83k181l208k946j865j113q31l94J65K35
60425D27023j30l04k89o63j269j209k73O85J056J151J336J299O52l73j138j123
60409D26431k10J136J944J674R83R64J642K017J588J032J099J564J661J084K34
60394D44843k67j15M40Q44R18J059J560K014J918J507J470J935K359K279J700
60379D64464Q67J55RM87R99J056R51J175J466J225O10L87P62J073P79O7m96m70
60361D75566K67J313J865J521Q12M56L84J50j08J16O85R38P49O45R39J445J972
$$ y = [605444, 588411, 573452, 560105, 548171, 537856, 529288, 522124, 515779, 509708, 503454, 496843, 490320, 484691, 480279, 476600, 472968, 469164, 465444, 462227, 459816, 458132, 456657, 454922, 452970, 451038, 449011, 446666, 444314, 442565, 441539, 440879, 440408, 440044, 439161, 436980, 433772, 430826, 428961, 427848, 427017, 426623, 426788, 427023, 426893, 426589, 426300, 425637, 424368, 423159, 422886, 423571, 424627, 425778, 427114, 428413, 429065, 428692, 427554, 426431, 426221, 427357, 429301, 430975, 431958, 432922, 434564, 436581, 438169, 439201, 440300, 441864, 443525, 444609, 444843, 444576, 444461, 444901, 445745, 446663, 447722, 449282, 451296, 453214, 454721, 456191, 458126, 460485, 462764, 464464, 465331, 465486, 465495, 465982, 466981, 468037, 468988, 470163, 471629, 472854, 473464, 473851, 474613, 475686, 476465, 476532, 476036, 475566, 475833, 477146, 479011, 480532, 481344, 481800, 482184, 482334, 482226, 482342, 483027, 483965, 484714, 485359, 486298, 487743, 489715]
60344D89715K474K794K923L408M704O308P318P736Q342R336R982R640Q383O520
60330E79583M299K157M97q56k384m048n368o217o776o874o182n017m077l430k601
60315E32706j620r83o50l3Q60J292J059R45J700L237N115P007Q602R889J1705
60300E80831J5197K0352K5678K9524L1104L0254K6977K1426J3786M208o444j6087
60288G76806k2627k5697k6387k5437k2895j9299j5781j2738r671o665m703m139
60276E80767l974l238k035p89M32J361J462Q87N38N61l6j716l537m616n307o062
60260E54698o346n712m956m994n384n121m272l655l401k972k257j650j262r30
60246E01786p89j024j251r75m03j82m34p11p36o26n19m83o03p63n82N2P49J261
$$ y = [489715, 492189, 494983, 497906, 501314, 506018, 512326, 519644, 527380, 535722, 545058, 555040, 564680, 573063, 579583, 583882, 586039, 586536, 585680, 583296, 579248, 573880, 567663, 560887, 554013, 547831, 542814, 538737, 535307, 532706, 531086, 530103, 529453, 529420, 530280, 531572, 532631, 533576, 535276, 538513, 543628, 550635, 559237, 569126, 580831, 596028, 616380, 642058, 671582, 702686, 732940, 759917, 781343, 795129, 799337, 792893, 776806, 754179, 728482, 702095, 676658, 653763, 634464, 618683, 605945, 596274, 589609, 584906, 580767, 576793, 573555, 571520, 570731, 571163, 572524, 573986, 574873, 575411, 575972, 575936, 574220, 570683, 566067, 560760, 554698, 548352, 542640, 537684, 532690, 527306, 522185, 517913, 514258, 510857, 507885, 505628, 503978, 502716, 501786, 500997, 499973, 498722, 497747, 497344, 497162, 496728, 496017, 495281, 494655, 494136, 493653, 493050, 492287, 491705, 491757, 492506, 493767]
60228D93767J935L006L943M167L977M035M251L954L077K358K307K600K734K785
60214E38896L186L986M672M780M526M568N136N772O064O252O631O857O469N765
60200F13560N309M870L751K085P77J89j37m23m55m95j089j818j540l45J96o58
60184F23777j743j950j867k339k791k380j768k194l427m159l984l582l288k799
60170E85506k142j770j642j207l69M05Q13Q57M70k19m94K53J571K456K573K329
60154E89390J981J558J376J722K206K228K002K241K986L622L953M319M747M897
60140F29228M940N478O403O884O775P172Q996J1666J3695J4258J3662J2616J1447
60127G53220R898P457L956p4l755o527q330r203r047p825n857l823k481k214k693
$$ y = [493767, 495702, 498708, 502651, 506818, 510795, 514830, 519081, 523035, 526112, 528470, 530777, 533377, 536111, 538896, 542082, 546068, 550740, 555520, 560046, 564614, 569750, 575522, 581586, 587838, 594469, 601326, 607795, 613560, 618869, 623739, 627490, 629575, 630352, 630541, 630404, 629981, 629526, 629031, 627942, 626124, 624584, 624239, 624435, 623777, 622034, 620084, 618217, 615878, 613087, 610707, 608939, 606745, 603318, 599159, 595175, 591593, 588305, 585506, 583364, 581594, 579952, 578745, 578376, 578781, 579594, 580451, 580921, 580702, 580208, 580461, 582032, 584488, 587061, 589390, 591371, 592929, 594305, 596027, 598233, 600461, 602463, 604704, 607690, 611312, 615265, 619584, 624331, 629228, 634168, 639646, 646049, 652933, 659708, 666880, 675876, 687542, 701237, 715495, 729157, 741773, 753220, 763118, 770575, 774531, 774457, 770702, 764175, 755845, 746642, 737595, 729770, 723913, 720090, 717609, 715395, 712702]
60112G12702l147l123k799k450j921r37K61R16M21j047k518k943k274j641k093
60097F87407l279m003l967l963m286m037k601p49M68J184K171L480M572N352O169
60082F83918P050P716Q149Q499Q651Q462Q037P238N333J935k096n445p740r473
60068G30234j0881j1774j2202j2418j2294j1467j0021q406o915n799n491n954
60056F16612o205n421m244l977m646m936m082k739j812j311p01L42J810L439M700
60041E86829N205N289N681O575P497Q027Q054P434O088M493L373K748J902M54
60027F59649j151k396l359m401n631o906q059r029r972j1175j2513j3197j2571
60014E59289j1048r691q970q478p829p102o352n369m113k903j982j346j061j205
$$ y = [712702, 709555, 706432, 703633, 701183, 699262, 698325, 698586, 699502, 699923, 698876, 696358, 693415, 691141, 689500, 687407, 684128, 680125, 676158, 672195, 667909, 663872, 661271, 660522, 660990, 662174, 664345, 667825, 672397, 677749, 683918, 690968, 698684, 706833, 715332, 723983, 732445, 740482, 747720, 753053, 754988, 752892, 747447, 739707, 730234, 719353, 707579, 695377, 682959, 670665, 659198, 649177, 640771, 633856, 628057, 622566, 616612, 610407, 604986, 600742, 596765, 592119, 587183, 583101, 580362, 578550, 577239, 576538, 576880, 578690, 582129, 586829, 592034, 597323, 603004, 609579, 617076, 625103, 633157, 640591, 646679, 651172, 654545, 657293, 659195, 659649, 658498, 656102, 652743, 648342, 642711, 635805, 627746, 618717, 608745, 597570, 585057, 571860, 559289, 548241, 538550, 529580, 521102, 513273, 506171, 499819, 494450, 490337, 487434, 485452, 484106, 483045, 481840]
60000D81840j488j389r05n56n49l62N32J927L130L647L493L054K859L217L938
59985E02388M535M721M582M252L748L105K496K023J544P11p18k468l708l772k967
59970E20472k309k308k447k085j436j195j565k040j984j188l5O81M52l18p12m72
59954E01511j98k74l27n3J98Q5j56k80m13m40N8P96P16k91p35L86J876J974P67
59935E05200m02j150k081l105l400k838j983r07O00J799J628N22J41J039K077
59920D97140K342K208K167J917J254O78N96Q01J092J562J991J896J445J363J793
59905E20245K183K431K997L691L544K282Q01j33n83n09N01K053K806K294J715
59890E46318K166L119L542L509L724M239M700N226N990O514O316N915O265P414
$$ y = [481840, 480352, 478963, 478058, 477502, 476953, 476591, 477123, 479050, 482180, 485827, 489320, 492374, 495233, 498450, 502388, 506923, 511644, 516226, 520478, 524226, 527331, 529827, 531850, 533394, 534105, 533387, 530919, 527211, 523439, 520472, 518163, 515855, 513408, 511323, 509887, 508692, 507127, 505087, 503103, 501915, 501880, 502561, 503013, 502695, 501983, 501511, 501313, 501039, 500712, 500659, 500857, 500942, 500786, 500506, 500093, 499653, 499711, 500507, 501223, 500932, 500197, 500583, 502459, 504433, 505200, 504798, 503648, 501567, 498462, 495062, 492224, 490241, 489334, 489934, 491733, 493361, 493883, 494024, 495063, 497140, 499482, 501690, 503857, 505774, 507028, 507706, 508302, 509103, 510195, 511757, 513748, 515644, 517089, 518452, 520245, 522428, 524859, 527856, 531547, 535091, 537373, 538174, 538041, 537458, 536949, 537450, 539503, 542309, 544603, 546318, 548484, 551603, 555145, 558654, 562378, 566617, 571317, 576543, 582533, 589047, 595363, 601278, 607543, 614957]
59876F14957Q484Q807Q326P086N055K533K15j348k171k787l750n053o085o382
59862F27887o270o361o591o392n695n026m612m150l529k920k140p98P90J853K494
59847E78540L679N616P322Q331R578J1752J3854J4330J2917J0358P147L587O25
59834F87636n74K49K470N376Q185R707Q989O296K769q15m363p725j0393j2023
59820F95784j2780j3075j3225j3382j3473j3263j2577j1425r806p727n523l830
59808E65698l019k961l355l881l965l021j313M3L24k3k48m44j172k369l292l471
59792E33531l190l015l178l498l682l633l479l281k847k057j210p19n40l36o3
59777D98803O0N6J55L40N14R48J901K881L058K440J847J675J571J355J365J628
$$ y = [614957, 623441, 632248, 640574, 647660, 652715, 655248, 655463, 654115, 651944, 649157, 645407, 640354, 634269, 627887, 621617, 615256, 608665, 602273, 596578, 591552, 586940, 582790, 579261, 576341, 574201, 573403, 574193, 576046, 578540, 582219, 587835, 595157, 603488, 613066, 624818, 638672, 653002, 665919, 676277, 683424, 687011, 687636, 687062, 687311, 689781, 695157, 703342, 713049, 722038, 728334, 731103, 730288, 725925, 718200, 707807, 695784, 683004, 669929, 656704, 643322, 629849, 616586, 604009, 592584, 582778, 575051, 569528, 565698, 562679, 559718, 556363, 552482, 548517, 545496, 544183, 544226, 544550, 544527, 544279, 543835, 542663, 540294, 537002, 533531, 530341, 527326, 524148, 520650, 516968, 513335, 509856, 506575, 503728, 501671, 500461, 499742, 499202, 498866, 498803, 498863, 498919, 499074, 499414, 499928, 500876, 502777, 505658, 508716, 511156, 513003, 514678, 516249, 517604, 518969, 520597]
59761E20597J685J508J702K400K803K347J528J109J190J488J895K288K445K495
59747E47480K836L326L336K877K767L289L627L173K463K168K062J705J327J270
59733E83706J178O27m3k85j61P3N91J426J854J248J76k06M24J323J645J083j04
59716E94555j178j365p00r6j91n63m84N3M98N51L34J49L46J012J647J680J397
59699E97645J602K267K522K191K135K730L268L482M233N791O682N519K966O79
59685F43712q30j978k654k407j648j191r77l83M49P15J69p10j545k212k507k449
59669F23554k508k731k248m92J662K961L285L070K012k47k736m006m078m168m683
59654F08647m903m493l844k934j275Q31K281K766L128L810M012K838M85k122m079
$$ y = [520597, 522282, 523790, 525492, 527892, 530695, 533042, 534570, 535679, 536869, 538357, 540252, 542540, 544985, 547480, 550316, 553642, 556978, 559855, 562622, 565911, 569538, 572711, 575174, 577342, 579404, 581109, 582436, 583706, 584884, 585511, 585468, 585183, 585022, 585095, 585686, 587112, 588966, 590214, 590390, 590184, 590608, 591931, 593576, 594659, 594555, 593377, 592012, 591312, 591216, 591025, 590462, 589978, 590031, 590529, 591080, 591414, 591563, 591909, 592921, 594568, 596248, 597645, 599247, 601514, 604036, 606227, 608362, 611092, 614360, 617842, 622075, 627866, 634548, 640067, 643033, 643712, 642882, 640904, 638250, 635843, 634195, 633004, 632027, 631644, 632093, 632808, 632977, 632267, 630722, 628510, 626003, 623554, 621046, 618315, 616067, 615575, 617237, 620198, 623483, 626553, 628565, 628318, 625582, 621576, 617498, 613330, 608647, 603744, 599251, 595407, 592473, 591198, 592029, 594310, 597076, 600204, 604014, 608026, 610864, 611349, 609227, 605148]
59639F05148m781m230l309k990l157k865j763n02L59J017J808K651L293L549L229
59624E97457K419J746J800K360K894L531M669N763N547L592P83j881m064n549
59610F21067n914n128l791k440j104K48J424K326L051L496L365K630J548K02j449
59595F19531l052l966l952l320k467j694j342j495j661j356r00j007j657k036
59581E89626j654r52p60j542l060m370m430l206j957j863k686l346l312k767j857
59566E51864p34M2J35K35J184K552L115K626K013J834J711J371J105J029Q89P74
59550E71745J168J981K462K306K051K137K393K644L017L453L721M146N450P692
59536F16366J0161J2719J6282K1280K6122K7856K4455J6564P318L80k433j890
$$ y = [605148, 600367, 596137, 592828, 589838, 586681, 583816, 582053, 581551, 581910, 582927, 584735, 587386, 590679, 594228, 597457, 599876, 601622, 603422, 605782, 608676, 612207, 616876, 622639, 628186, 631778, 632561, 630680, 626616, 621067, 615153, 610025, 606234, 603794, 602690, 602938, 604362, 606688, 609739, 613235, 616600, 619230, 620778, 620980, 619531, 616479, 612513, 608561, 605241, 602774, 601080, 599738, 598243, 596582, 595226, 594326, 593319, 591662, 589626, 587972, 587020, 586260, 584718, 581658, 577288, 572858, 569652, 567695, 565832, 563146, 559800, 556488, 553721, 551864, 551130, 551172, 551307, 551542, 552726, 555278, 558393, 561019, 563032, 564866, 566577, 567948, 569053, 570082, 570971, 571745, 572913, 574894, 577356, 579662, 581713, 583850, 586243, 588887, 591904, 595357, 599078, 603224, 608674, 616366, 626527, 639246, 655528, 676808, 702930, 730786, 755241, 771805, 779123, 779503, 777070, 775180]
59524G75180L14L404P325J1369J4208J5221J4837J3578J1594R139O561L683J8
59511H86431m275q338j1594j4010j5482j5794j5274j4610j3888j2663j0980r475
59499G40048q331p033n349l726k491j387j53J066K065K801L263L631M403N655
59485G34462O537O394O013O790Q859J1258J3666J6581J9898K2888K5766K9733
59473I08845L4970L9827M2466M2026L7950K9718J8209O121l949j1161j5697j7475
59461A111850j6439j3193q462k396M937J2876K0522K7329L3111L7951M2269M6312
59449A296667M9669N2255N5678O2306P2325Q2611Q8625Q6438P3158M7670J2634
59438A980036k5180n7920q0312r0876r1279q5313p7180o9423o2620n7123n3788
$$ y = [775180, 775494, 778898, 786223, 797592, 811800, 827021, 841858, 855436, 867030, 876169, 882730, 886413, 886431, 882156, 873818, 862224, 848214, 832732, 816938, 801664, 787054, 773166, 760503, 749523, 740048, 731717, 724684, 719335, 715609, 713118, 711731, 711578, 712644, 714709, 717510, 720773, 724404, 728807, 734462, 740999, 747393, 753406, 760196, 769055, 780313, 793979, 810560, 830458, 853346, 879112, 908845, 943815, 983642, 1026108, 1068134, 1106084, 1135802, 1154011, 1160132, 1156183, 1145022, 1129325, 1111850, 1095411, 1082218, 1073756, 1071360, 1076297, 1089173, 1109695, 1137024, 1170135, 1208086, 1250355, 1296667, 1346336, 1398591, 1454269, 1516575, 1588900, 1671511, 1760136, 1846574, 1919732, 1967402, 1980036, 1954856, 1896936, 1816624, 1725748, 1634469, 1549156, 1471976, 1402553, 1339933, 1282810, 1229022]
59427A229022n2465n1243m8311m3648l7983l1296k3473j5447q240j628N009J1178
59415I31475J5954J9493K2496K4662K5481K6301K9562L4977L7800L2354J7334
59404A217889k788k1281l3632l9045l9005l5406k9627k2069j2260n68R478J2128
59392A003814M428j0079k4136l3048l6859l7314l5236l1351k7175k3721k0648
59381G28675j7616j5161j3451j1661r529q086p799p436n973m277l537l224k172
59368F18753o82K9k17n99p18o68k36P55J766K280K750L736M831N524O392Q221
59352F51917J0585J2617J4553J7205K0369K3147K5439K7753K9857L0989L1222
59341H95653L1335L1485L1073K9780K7616K4212J9154J2895O308l89p279j3753
$$ y = [1229022, 1176557, 1125314, 1077003, 1033355, 995372, 964076, 940603, 925156, 916916, 915288, 920297, 931475, 947429, 966922, 989418, 1014080, 1039561, 1065862, 1095424, 1130401, 1168201, 1200555, 1217889, 1215101, 1193820, 1160188, 1121143, 1082138, 1046732, 1017105, 995036, 982776, 982208, 991686, 1003814, 1008242, 998163, 974027, 940979, 904120, 866806, 831570, 800219, 773044, 749323, 728675, 711059, 695898, 682447, 670786, 661257, 653171, 645372, 637936, 631963, 627686, 624149, 620925, 618753, 618071, 618100, 617883, 617284, 616566, 615898, 615662, 616417, 618183, 620463, 623213, 626949, 631780, 637304, 643696, 651917, 662502, 675119, 689672, 706877, 727246, 750393, 775832, 803585, 833442, 864431, 895653, 926988, 958473, 989546, 1019326, 1046942, 1071154, 1090308, 1103203, 1109511, 1109122, 1101843, 1088090]
59329A088090j9024k3295k7147l0123l1194l0588k9736k9404k9051k8045k6361
59318G84122k4031k1037j7875j5183j2817j0281p957o814o816o796n956m472k662
59305F41425p21O76Q01J75K74J585L111M065M935O443Q593J1398J5390K0510K5055
59290G43715K6507K3273J5505M997n351j2763j6145j6406j5079j2995j0360p409
59278G17489m524j952K79K421M931P964J1041J3647J6109J9132K2491K4961K5749
59265H59738K5258K4117K2208J9090J4906J0254N469M83m713r745j3971j6874
59253I36220j8495j9413k0116k0394j9693j7988j5923j4099j2525j0843q808o438
59241G51485m017j921k67J247L017N167P622J0282J2868J4868J5941J6073J5127
$$ y = [1088090, 1069066, 1045771, 1018624, 988501, 957307, 926719, 896983, 867579, 838528, 810483, 784122, 760091, 739054, 721179, 705996, 693179, 682898, 674941, 668127, 661311, 654515, 648559, 644087, 641425, 640704, 641380, 642181, 642356, 642630, 644215, 647326, 651391, 656326, 662769, 671362, 682760, 698150, 718660, 743715, 770222, 793495, 809000, 813997, 808646, 795883, 779738, 763332, 748253, 735258, 724898, 717489, 712965, 711013, 711292, 713713, 718644, 726608, 737649, 751296, 767405, 786537, 809028, 833989, 859738, 884996, 909113, 931321, 950411, 965317, 975571, 981040, 981523, 976810, 967065, 953094, 936220, 917725, 898312, 878196, 857802, 838109, 820121, 804198, 790099, 777574, 766731, 757923, 751485, 747468, 745547, 745280, 746527, 749544, 754711, 762333, 772615, 785483, 800351, 816292, 832365, 847492]
59228H47492J2683Q773M348M01l049o567j0194j3473j6224j8593k0377k1118k0824
59215G43278j9988j8803j7045j4770j2542j0794r416q142o935n879m991m268l769
59202F05936l571l744m158m337l807k798k133k152k200j526k59R79J913K540K764
59187E83447K747L185M428N649N678M486L103K283J960J904K103K477K881L436
59173F29767M435N851P419R020J0678J2300J3885J5765J8166K0676K2594K3598
59161G94154K3723K2994K1421J9096J5928J1704O655J492l385q073j2261j5068
59149H78380j6353j7184j8246j8757j7894j6380j5400j4743j3413j1517j0099
59138G08394r435q961q602q808r307r145q052o670n460m389l627l343k943j596
$$ y = [847492, 860175, 868948, 873296, 873697, 870648, 864081, 853887, 840414, 824190, 805597, 785220, 764102, 743278, 723290, 704487, 687442, 672672, 660130, 649336, 639920, 631778, 624843, 618964, 613973, 609705, 605936, 602365, 598621, 594463, 590126, 586319, 583521, 581388, 579236, 577036, 575510, 575251, 576230, 578143, 580683, 583447, 586194, 589379, 593807, 599456, 605134, 609620, 612723, 615006, 616966, 618870, 620973, 623450, 626331, 629767, 634202, 640053, 647472, 656492, 667170, 679470, 693355, 709120, 727286, 747962, 770556, 794154, 817877, 840871, 862292, 881388, 897316, 909020, 915675, 917167, 913782, 905709, 893448, 878380, 862027, 844843, 826597, 807840, 789946, 773566, 758166, 743423, 730010, 718493, 708394, 698959, 689998, 681396, 672588, 663281, 654136, 646084, 639414, 633954, 629565, 625938, 622595, 619652, 618056]
59124F18056M50K168L266M310N441O250O832P797R080J0017J0614J1563J2851
59111G08695J3661J3782J3876J4134J3982J3395J3197J3596J3686J2941J2061
59100H57006J1668J1244J0059Q268O385M455K423O67l86p29n62j30N9m35j261
59085I08731j617j544k051l662n716p476r083j0924j2790j4219j5116j5609j5711
59072G93213j5468j4988j4211j3048j1790j0796r852q551p194o422o034n155l692
59059F66012k621k482k716k746k813l252l806m138m279m214l728k987k545k485
59045F21200k318j944j852k082j936j116k63J33N73J681L201M432N073N215M955
59030F34952M537M386M691N341O428Q263J0743J3243J5414J7513J9771K1966K3676
$$ y = [618056, 618506, 620674, 623940, 628250, 633691, 639941, 646773, 654570, 663650, 673667, 684281, 695844, 708695, 722356, 736138, 750014, 764148, 778130, 791525, 804722, 818318, 832004, 844945, 857006, 868674, 879918, 889977, 898245, 904630, 909085, 911508, 912175, 911789, 911060, 910498, 910368, 910427, 909992, 908731, 907114, 905570, 903519, 899857, 894141, 886665, 877582, 866658, 853868, 839649, 824533, 808924, 793213, 777745, 762757, 748546, 735498, 723708, 712912, 703060, 694509, 687315, 680893, 674859, 669704, 666012, 663391, 660909, 658193, 655447, 652634, 649382, 645576, 641438, 637159, 632945, 629217, 626230, 623685, 621200, 618882, 616938, 615086, 613004, 611068, 609952, 609689, 609822, 610395, 612076, 615277, 619709, 624782, 629997, 634952, 639489, 643875, 648566, 653907, 660335, 668598, 679341, 692584, 707998, 725511, 745282, 767248, 790924]
59017G90924K4404K3479K0552J6226J1581P039K434j964n374p416q207p633n518
59004H60527k540R3K016L815N795P709R658J2047J4486J5919J6069J5568J4625
58991I75787J2877J0678R060Q044O431L617K13l525q148j3316j7283j9038j9500
58978I45897j9713j9260j7510j5048j2682j0211p311m610k709j077R74L206N274
58965H45220P623J0451J2833J4084J5098J6886J8670J8770J6843J3792J0047N338
58953A005655m2n031q956j2002j4591j6944j9023k0348k0241j8823j7174j5919
58941H36561j4367j1764q645n997l796j467P17J809J537M77j013l099n787q595
58927G76571j0874j2127j2232j1641j1002j0247q767o741n404n360n510m510k603
$$ y = [790924, 815328, 838807, 859359, 875585, 887166, 894205, 896639, 894675, 889301, 881885, 873678, 866045, 860527, 857987, 858080, 860096, 863911, 869706, 877415, 887073, 899120, 913606, 929525, 945594, 961162, 975787, 988664, 999342, 1008402, 1016446, 1022877, 1026494, 1026707, 1023182, 1015034, 1001718, 984435, 965397, 945897, 926184, 906924, 889414, 874366, 861684, 851473, 844162, 839552, 836843, 835766, 836740, 839946, 845220, 852843, 863294, 876127, 890211, 905309, 922195, 940865, 959635, 976478, 990270, 1000317, 1005655, 1005613, 1000582, 991626, 979624, 965033, 948089, 929066, 908718, 888477, 869654, 852480, 836561, 822194, 810430, 801785, 795788, 791992, 790525, 791242, 793051, 794588, 795065, 794052, 790953, 785166, 776571, 765697, 753570, 741338, 729697, 718695, 708448, 699681, 692940, 687536, 682176, 676666, 672156, 669553]
58914F69553j068l65J99J314L055N088O880P878Q077Q113Q528R398J0933J3629
58900G51212J7329K0914K3446K4892K5363K4615K2898K1253K0151J8954J7440
58889I88467J6838J8279K1327K5126K9792L5259L9748M1131L9355L5988L1842
58878A323152K6528K0041J3171O278j043r009j7363k5882l4128m0800m4465m4973
58866A171507m3284m0163l5979l1547k7911k5176k2580j9808j7388j5729j4613
58855H77329j3804j3379j3285j3215j2978j2550j1762j0477q992p746o833o159
58843G46149n876o093o504o853p384q276q935q609p439o264n619n441n538n733
58829F51585n775n629n589n684n365m295k964j988j206o6J454K894L956M621N010
$$ y = [669553, 668485, 668120, 668319, 669633, 672688, 677776, 684656, 692534, 700611, 708724, 717252, 726650, 737583, 751212, 768541, 789455, 812901, 837793, 863156, 887771, 910669, 931922, 952073, 971027, 988467, 1005305, 1023584, 1044911, 1070037, 1099829, 1135088, 1174836, 1215967, 1255322, 1291310, 1323152, 1349680, 1369721, 1382892, 1389170, 1388127, 1379118, 1361755, 1335873, 1301745, 1260945, 1216480, 1171507, 1128223, 1088060, 1052081, 1020534, 992623, 967447, 944867, 925059, 907671, 891942, 877329, 863525, 850146, 836861, 823646, 810668, 798118, 786356, 775879, 766887, 759141, 752308, 746149, 740273, 734180, 727676, 720823, 713439, 705163, 696228, 687619, 680180, 673916, 668297, 662856, 657318, 651585, 645810, 640181, 634592, 628908, 623543, 619248, 616284, 614296, 613090, 613024, 614478, 617372, 621328, 625949, 630959]
58814F30959N462O232O786O142M323K713K274K290J551N1j307j970j921j313p17
58799F61555j030k231l010k452j336q84j047j126j165j516j675r27L79J400K249
58784F47184L642N551P281Q509R171Q877P618O583O884P824P656N847L367J072
58770G37066r24k453l149l176l077k930k537k264k626l280l403k935k479k134
58756F99699j427k69J016K395L951N178N422M891M394M225M107M030M256M697
58742G46565N114N667O514P167P098O628O409O426O287O109O262O625O945P463
58728H37279Q430R508J0364J1171J1772J1280R510P815P255O878N352L438L074
58715I43126M581O496P921R294J0847J1877J1804J0750R004O797M466K048r73
$$ y = [630959, 636421, 642653, 649439, 655581, 659904, 662617, 664891, 667181, 668732, 668783, 667476, 665506, 663585, 662272, 661555, 660525, 658294, 655284, 652832, 651496, 650612, 649565, 648439, 647274, 645758, 644083, 643156, 643535, 644935, 647184, 650826, 656377, 663658, 672167, 681338, 690215, 697833, 704416, 711300, 719124, 726780, 732627, 735994, 737066, 736142, 733689, 730540, 727364, 724287, 721357, 718820, 716556, 713930, 710650, 707247, 704312, 701833, 699699, 698272, 698003, 699019, 701414, 705365, 710543, 715965, 720856, 725250, 729475, 733582, 737612, 741868, 746565, 751679, 757346, 763860, 771027, 778125, 784753, 791162, 797588, 803875, 809984, 816246, 822871, 829816, 837279, 845709, 855217, 865581, 876752, 888524, 899804, 909314, 917129, 924384, 931262, 936614, 940052, 943126, 947707, 954203, 962124, 971418, 982265, 994142, 1005946, 1016696, 1025700, 1032497, 1036963, 1039011, 1038038]
58702A038038m698q202j0872j3521j7018k0678k3375k5323k7135k7949k6513k3538
58690H09216k0971j9197j6924j3695j0562q250o539n579o040p630r075r776j0184
58677F64794j0336r545p700n516l399j288M04J132J439K463M193N669O816Q623
58663F57749J1464J4582J7259J9105J9292J6967J2580P642L246j06j725j411n96
58650G76048j093k871m470n314n985o551o524o225o319o183m721k558j371j139
58636G14724k68J521K827L307M356O387P666O780M447K004j89k090l241l529l420
58621G41282l025k016o32O22K235N055Q522J1353J3891J7552K1848K4300K3833
58608H64820K1980J9987J7086J2652P984M660K699J374M05n89k294m475n903o174
$$ y = [1038038, 1033340, 1025138, 1014266, 1000745, 983727, 963049, 939674, 914351, 887216, 859267, 832754, 809216, 788245, 769048, 752124, 738429, 727867, 719617, 713078, 707499, 701459, 693829, 684754, 674978, 664794, 654458, 644913, 637213, 631697, 628298, 627010, 627414, 628546, 629985, 632448, 636641, 642310, 649126, 657749, 669213, 683795, 701054, 720159, 739451, 756418, 768998, 776640, 779886, 779780, 778055, 776644, 776048, 774955, 772084, 767614, 762300, 756315, 749764, 743240, 737015, 730696, 724513, 719792, 717234, 715863, 714724, 714456, 715977, 718804, 722111, 726467, 732854, 740520, 747300, 751747, 753751, 753562, 751472, 748231, 744702, 741282, 738257, 736241, 735609, 736231, 738466, 743521, 752043, 763396, 777287, 794839, 816687, 840987, 864820, 886800, 906787, 923873, 936525, 944509, 949169, 951868, 953242, 953647, 953058, 950764, 946289, 940386, 934212]
58594I34212o257o692o799o254n877o077n989m863l003p36K167N480Q321J0448
58580I08081J2435J4278J5239J5310J5247J4879J3130J0064P181N351M121L322
58568A038638L530M623N750O968R058J1614J3441J4917J7510K0715K2219K1586
58556A190569K0896K0893J9487J5400J0454O563K952j759o808j0515j2608j3663
58544A241861j3829j3519j3841j5013j5823j5794j6152j7656j9173j9596j9359
58533A062106j8951j7740j5560j3674j2834j2013j0217p935n758l287m56J770
58521I45451L025M150N419O061O146O744P490O615M281L101M095N025M259L348
58507A015210L905M795M643M564N963P947R348J1117J4233J7188J8041J7169J5719
$$ y = [934212, 927955, 921263, 914464, 908210, 902333, 896256, 890267, 885404, 882401, 881665, 883832, 889312, 897633, 908081, 920516, 934794, 950033, 965343, 980590, 995469, 1008599, 1018663, 1025844, 1031195, 1035316, 1038638, 1042168, 1046791, 1052541, 1059509, 1068567, 1080181, 1093622, 1108539, 1126049, 1146764, 1168983, 1190569, 1211465, 1232358, 1251845, 1267245, 1277699, 1284262, 1287214, 1285455, 1278647, 1268132, 1255524, 1241861, 1228032, 1214513, 1200672, 1185659, 1169836, 1154042, 1137890, 1120234, 1101061, 1081465, 1062106, 1043155, 1025415, 1009855, 996181, 983347, 971334, 961117, 953182, 947424, 944137, 943681, 945451, 948476, 952626, 958045, 964106, 970252, 976996, 984486, 991101, 995382, 998483, 1002578, 1007603, 1011862, 1015210, 1019115, 1023910, 1028553, 1033117, 1039080, 1047027, 1056375, 1067492, 1081725, 1098913, 1116954, 1134123, 1149842]
58494A149842J3181Q970M543J407j395n273r157j1172j1822j2814j3882j3386
58482A099042j1216q690o228l267J93L675P199J0593J2748J2943J1864J0138P194
58469A146188K837j710n614r495j3369j5595j5557j5174j5908j6333j4723j1973
58457A013574r706p584m820k368j128J94K836N381N885M988M225L042J85l414
58443A011290n843p056p910p880o302m525m064l906k217M57K324L390M738N979
58429I78475O114N888O654P924Q492R031J1052J4215J6979J8963K0523K1126K0196
58416A145632J8497J6554J3167P483J111l862p385r986j0888r898r117j0140j1378
58403A129790j0811r360q790q292o236l418j508k7K107L799L601K573K243J650
$$ y = [1149842, 1163023, 1171993, 1176536, 1177943, 1176548, 1171275, 1162118, 1150946, 1139124, 1126310, 1112428, 1099042, 1087826, 1079136, 1072908, 1069641, 1069834, 1073509, 1080708, 1091301, 1104049, 1116992, 1128856, 1138994, 1146188, 1149025, 1147315, 1141701, 1132206, 1118837, 1103242, 1087685, 1072511, 1056603, 1040270, 1025547, 1013574, 1003868, 996284, 991464, 989096, 987968, 988162, 990998, 996379, 1002264, 1007252, 1011477, 1014519, 1014704, 1011290, 1005447, 998391, 990481, 982601, 976299, 971774, 967710, 963804, 961587, 962044, 964368, 967758, 972496, 978475, 984589, 990477, 997131, 1005055, 1013547, 1022578, 1033630, 1047845, 1064824, 1083787, 1104310, 1125436, 1145632, 1164129, 1180683, 1193850, 1201333, 1202444, 1198582, 1191197, 1181211, 1170323, 1160425, 1151308, 1141168, 1129790, 1118979, 1109619, 1100829, 1092537, 1086301, 1082883, 1081375, 1081348, 1083455, 1087254, 1090855, 1093428, 1095671, 1097321]
58389A097321m88k718l332l781o046q667r137q279q272q212n949k607r22m58J183
58374A029636L585M378L840M229N360N133L768L415M164M452M707O624R426J0821
58360A103538J1047J2183J4148J5138J5151J5286J4545J1289O931M188K679K70
58348A226393k393k889j573p16j82J736M141M719M217N239P501Q790R573J1992
58334A276548J5170J6356J5938J6503J7779J7409J5894J5716J6323J5069J2472
58323A451177J1346J1443J0140P759O926P300O393M882N510P387P200N539O092
58310A549094Q932J0681J1052J3019J6503J8161J7620J7906J9438J9558J8257
58299A720221J8308J9571J9143J7252J6931J7850J6777J4205J4143J7059J9446
$$ y = [1097321, 1096833, 1094115, 1090783, 1087002, 1080956, 1072289, 1063152, 1054873, 1046601, 1038389, 1032440, 1029833, 1028911, 1028453, 1029636, 1033221, 1037599, 1041439, 1045668, 1051028, 1056161, 1059929, 1063344, 1067508, 1071960, 1076667, 1083291, 1092717, 1103538, 1114585, 1126768, 1140916, 1156054, 1171205, 1186491, 1201036, 1212325, 1219256, 1223444, 1226123, 1226393, 1224000, 1221111, 1219538, 1218822, 1218640, 1220376, 1224517, 1229236, 1233453, 1238692, 1246193, 1254983, 1264556, 1276548, 1291718, 1308074, 1324012, 1340515, 1358294, 1375703, 1391597, 1407313, 1423636, 1438705, 1451177, 1462523, 1473966, 1484106, 1491865, 1498791, 1506091, 1512484, 1517366, 1522876, 1530263, 1537463, 1543002, 1549094, 1558026, 1568707, 1579759, 1592778, 1609281, 1627442, 1645062, 1662968, 1682406, 1701964, 1720221, 1738529, 1758100, 1777243, 1794495, 1811426, 1829276, 1846053, 1860258, 1874401, 1891460, 1910906]
58288A910906K0384K2179K4618K5195K4866K6750K9472K8970K6348K6277K8062
58277B194027K6661K2457K1303K4464K7382K9035L3448M0753M6036M8509N2798
58266B566873N9485O3565O4078O6050P0926P4254P4922P7275Q1937Q3901Q2030
58255C365296Q0981Q1625P9361P4141P1967P4041P4830P3410P5838Q3428Q9871
58244D224789R3166R9106J09424J17997J22576J28756J38532J46615J51900J60462
58234E493323J73358J83953J91271K02835K20222K35569K46724K61462K82110
58225G490827L01067L16614L37386L65743L93221M18115M50231M91977N33168
58216A1098349N71431O18406O78456P41790Q06716Q86726R86708J095477J211842
$$ y = [1910906, 1931290, 1953469, 1978087, 2003282, 2028148, 2054898, 2084370, 2113340, 2139688, 2165965, 2194027, 2220688, 2243145, 2264448, 2288912, 2316294, 2345329, 2378777, 2419530, 2465566, 2514075, 2566873, 2626358, 2689923, 2754001, 2820051, 2890977, 2965231, 3040153, 3117428, 3199365, 3283266, 3365296, 3446277, 3527902, 3607263, 3681404, 3753371, 3827412, 3902242, 3975652, 4051490, 4134918, 4224789, 4317955, 4417061, 4526485, 4644482, 4767058, 4895814, 5034346, 5180961, 5332861, 5493323, 5666681, 5850634, 6041905, 6244740, 6464962, 6700531, 6947255, 7208717, 7490827, 7791894, 8108508, 8445894, 8811637, 9204858, 9622973, 10073204, 10565181, 11098349, 11669780, 12288186, 12966642, 13708432, 14515148, 15401874, 16388582, 17484059, 18695901]
58207A8695901J353201J528018J726952J953317K233158K582461K997056L489754
58199C6559818M101365M858244N759969O829443Q131334R724247J1656773J4041981
58191A01663174J7068662K0904238K5654048L1363020L7701242M3290797M5496429
58184C23141610M1554700L0554388J4513515k588503j7004020k6786495l1820167
58177C31565028l2938205l1204708k7737469k3730053k0281579j8034849j6941853
58170A60696312j6427152j5858115j4928378j3675937j2259429j0800103r384238
58163F7362960q089022o953332n965901n108876m383935l784966l281560k847819
58155B6947549k480538k175497j912399j677497j477348j316079j179854j056518
$$ y = [18695901, 20049102, 21577120, 23304072, 25257389, 27490547, 30073008, 33070064, 36559818, 40661183, 45519427, 51279396, 58108839, 66240173, 75964420, 87621193, 101663174, 118731836, 139636074, 165290122, 196653142, 234354384, 277645181, 323141610, 364696310, 395250698, 409764213, 407175710, 390171690, 363385195, 331565028, 298626823, 267422115, 239684646, 215954593, 195673014, 177638165, 160696312, 144269160, 128411045, 113482667, 99806730, 87547301, 76747198, 67362960, 59273938, 52320606, 46354705, 41245829, 36861894, 33076928, 29795368, 26947549, 24467011, 22291514, 20379115, 18701618, 17224270, 15908191, 14728337, 13671819]
58147A3671819r50797q67344p96470p28746o67524o15775n65731n12371m63015
58138G504046m23308l86768l47598l11054k82188k56718k31842k14066k07223
58129D843281k03744j96391j88130j82484j74842j61753j48869j41190j34456
58120C311422j24173j14303j09209j05311r8463r1716q8434q5256p8943p2977
58110B342637p0596o8409o3350n8943n8154n7174n2659m8290m7607m7134m3317
58099A727004l9727m0461m2339m0679l7275l5909l5107l1998k8572k7696k7273
58088A339968k4405k1154k0373k0010j7239j4216j4164j5534j5324j4567j5390
58077A147592j6357j5664j5316j7311j9302j8766j7792j8970k0288j8967j6753
$$ y = [13671819, 12721022, 11853678, 11057208, 10328462, 9660938, 9045163, 8479432, 7967061, 7504046, 7080738, 6693970, 6346372, 6035318, 5753130, 5496412, 5264570, 5050504, 4843281, 4639537, 4443146, 4255016, 4072532, 3897690, 3735937, 3587068, 3445878, 3311422, 3187249, 3072946, 2963737, 2858426, 2759963, 2668247, 2579813, 2494557, 2415614, 2342637, 2272041, 2203632, 2140282, 2081339, 2023185, 1966011, 1913352, 1865062, 1817455, 1770321, 1727004, 1687277, 1646816, 1604477, 1563798, 1526523, 1490614, 1455507, 1423509, 1394937, 1367241, 1339968, 1315563, 1294409, 1274036, 1254026, 1236787, 1222571, 1208407, 1192873, 1177549, 1162982, 1147592, 1131235, 1115571, 1100255, 1082944, 1063642, 1044876, 1027084, 1008114, 987826, 968859, 952106]
58066I52106j6482j6712j4721j1781j0562j0216q600o687o366o647o148o507r170
58053H21507j1709j1483j0124j0277j0874r802q267q199q131o056l754l821m954
58040G14056m513l395l915n105m574l124l167m349m749m814o132p917q416q238
58026F41648q819r243q022o222n577n358m343l741m806n777m705l120l253l932
58012E64730l001j632k115l438l182k065k315l200k463p86m81r12M27L161M580
57997E47308M279M179M557L972K852L248N114O257O052N926O278N944M750L771
57983F14487L149K158J091O67J07j705l835m624m609n473o897p244o619o469o735
57968E67449o264n460n727o682o654n536m498l470j518O13J164K89k62r9m17j506
$$ y = [952106, 935624, 918912, 904191, 892410, 881848, 871632, 863032, 856345, 849979, 843332, 837184, 830677, 821507, 809798, 798315, 788191, 777914, 767040, 757238, 748971, 740772, 732641, 726585, 722831, 719010, 714056, 709543, 706148, 702233, 697128, 692554, 689430, 686263, 681914, 677165, 672351, 666219, 658302, 649886, 641648, 632829, 623586, 615564, 609342, 603765, 598407, 594064, 590323, 585517, 579740, 575035, 571915, 568662, 564730, 561729, 560097, 557982, 554544, 551362, 549297, 546982, 543782, 541319, 540533, 540052, 539140, 539567, 542728, 547308, 551587, 555766, 560323, 564295, 567147, 570395, 575509, 581766, 587818, 593744, 600022, 605966, 610716, 614487, 617636, 619794, 620885, 621552, 621659, 619954, 616119, 611495, 606886, 601413, 594516, 587272, 580653, 574184, 567449, 561185, 555725, 549998, 543316, 536662, 531126, 526628, 523158, 521640, 522253, 523417, 523706, 523444, 523345, 522928, 521422]
57952E21422k413k845l208l054j754k47P0k74L32J824K796K969L091K990K047
57937E23746J120J649L220M199M331M606N101N087M722M593M208K959J785J682
57923E73008J596P2j981k758k784l949o098p396p528p757q261q183p811q066q197
57908D93907o808m645l596l451k622j629k569n192o809o374n674o014o649o933
57894D24942p243p285o114m355l812m397m013j970O7J047J927L361M553N140N959
57879D07807P084P360O545N820N534M556K604R72K95l87j534k182j921j812k390
57864D38351k646j881r19o94j098j838k898l659l200j891j040p08L21K085L074
57849D21359K830K755L659M437M089L244K756K463K121K070K201J816J020P42
$$ y = [521422, 519009, 516164, 512956, 509902, 508148, 507901, 507971, 507697, 508029, 509853, 512649, 515618, 518709, 521699, 523746, 524866, 526515, 529735, 533934, 538265, 542871, 547972, 553059, 557781, 562374, 566582, 569541, 571326, 573008, 574604, 574676, 572695, 569937, 567153, 563204, 557106, 549710, 542182, 534425, 526164, 517981, 510170, 502104, 493907, 487099, 482454, 478858, 475407, 472785, 471156, 468587, 463395, 456586, 450212, 444538, 438524, 431875, 424942, 417699, 410414, 404300, 399945, 396133, 391736, 387723, 385753, 385820, 386867, 388794, 392155, 396708, 401848, 407807, 414891, 422251, 428796, 434616, 440150, 444706, 447310, 448282, 448577, 448190, 446656, 444474, 442553, 440741, 438351, 435705, 433824, 432905, 432211, 431113, 429275, 426377, 422718, 419518, 417627, 416587, 415879, 416200, 418285, 421359, 424189, 426944, 430603, 435040, 439129, 442373, 445129, 447592, 449713, 451783, 453984, 455800, 456820, 457562]
57835D57562R00K94j211k185j968j667k118k666k668k489k193j054P69J795J417
57820D42518Q99J276J877J889J801K264K925L416M087M828M613L148J621P73l96
57805D77539k977o426r483j1612j2658j2277j0775r475r285r720r917r613q651
57792C54670o830m816l946m378m778m366l927m008l743k411p96J02N04R89J380
57777C13646J450J708K503L314L714M091M657M934M839N097N789N809M609L241
57763C69401K687K423J649O86M3p94k399m175n290n916o471o460n277l478k256
57748C34373k075k575l190l280k373r56k25n46j058j175j341j746j684r71o91
57733C10487j499k424k451k079k104k008r81L53O82l5o56n05J38Q02J247J382
$$ y = [457562, 458462, 458756, 457545, 455360, 453392, 451725, 449607, 446941, 444273, 441784, 439591, 438537, 439306, 441101, 442518, 443417, 444693, 446570, 448459, 450260, 452524, 455449, 458865, 462952, 467780, 472393, 475541, 477162, 477935, 477539, 474562, 468136, 458653, 447041, 434383, 422106, 411331, 401856, 392571, 382851, 372934, 363321, 354670, 347840, 343024, 339078, 334700, 329922, 325556, 321629, 317621, 313878, 311467, 310671, 310773, 311277, 312266, 313646, 315096, 316804, 319307, 322621, 326335, 330426, 335083, 340017, 344856, 349953, 355742, 361551, 366160, 369401, 372088, 374511, 376160, 376846, 376889, 376095, 373696, 369521, 364231, 358315, 351844, 345384, 340107, 336629, 334373, 332298, 329723, 326533, 323253, 320880, 319924, 319699, 319153, 318095, 316920, 315579, 313833, 312149, 311178, 310487, 308988, 306564, 304113, 302034, 299930, 297922, 296941, 297294, 297976, 297941, 297285, 296780, 296918, 297720, 298967, 300349]
57717C00349J453J792K011J204m84j550j043J27N41lr62k111l207l538k894k167
57701B89518k003j695m66J034J657J451J272J346J300J140J122J073P00J90j44
57686B97495l29k88L24J219J396P00M91J841M050N857P178Q528R738J0576J1905
57671C60681J4958J9970K6505L4512M3964N4037O3297O9774P0068O0066L8725
57660H56557J0641j6649l7689n0803n6386n5826n1688m6660m1758l6577l1110
57649D42052k6025k1497j7205j3453j0944r520q339p206o466n747m269k349j210
57636C07822j072q56oP18O21J08k04l21l56r0M08N00j19q52j020p73o86r02j096
57617C01824j066r23q49q70q69p27m49r7L20P48R61Q76Q27J079J201O63m3J53
$$ y = [300349, 301802, 303594, 305605, 306809, 306325, 304775, 303732, 303859, 304400, 304397, 303435, 301324, 298117, 294579, 291685, 289518, 287515, 285820, 285354, 286388, 288045, 289496, 290768, 292114, 293414, 294554, 295676, 296749, 297449, 297639, 297495, 297166, 296878, 297202, 298421, 299817, 300517, 301008, 302849, 306899, 312756, 319934, 328462, 338200, 348776, 360681, 375639, 395609, 422114, 456626, 500590, 554627, 617924, 687698, 757766, 817832, 856557, 867198, 850549, 812860, 762057, 705671, 649845, 598157, 551497, 509739, 473162, 442052, 416027, 394530, 377325, 363872, 352928, 343408, 335069, 327863, 321397, 315650, 311381, 309032, 307822, 306750, 305894, 305888, 306606, 307227, 307335, 307131, 306810, 306454, 306364, 306772, 307272, 307153, 306301, 305281, 304508, 303822, 302920, 301824, 300758, 299835, 298986, 298116, 297247, 296520, 296071, 295974, 296294, 297042, 298003, 298879, 299706, 300785, 301986, 302649, 302606, 302759]
57599C02759J187J699R95M4o9M11P56Q99Q60J20j303k112j411k99l95j457j893
57582C00791j260o97r92j662j961j724j074k73J37j64o74o70j97K46N97J005J106
57565B92534N69j8J59Q26J005M90nj3L20Q25J428J823J840J771J669R34m62j164
57547C04531j36J500J871J021N43Q87J018P08J130K665L919L764K968K902L666
57532C32957M271L963K714J074n5j01L69K47o72j518j666j326o77M66J818K493
57516C44357K154J530J335J450J563J768K132K369K437K749L405L815L580L149
57502C77793L090L238L017K346J796J894K463K581J451n16j806j465k41N24O69
57487C96834R88J629J909J583J172Q79L37l80m91L26J391K019K284K475K530K412
$$ y = [302759, 303946, 305645, 306640, 306684, 306615, 307026, 307782, 308681, 309541, 309661, 308358, 306246, 304835, 304536, 304141, 302684, 300791, 299531, 298834, 297842, 296180, 294219, 292495, 291421, 291148, 291285, 291121, 290447, 289777, 289580, 289826, 290423, 291428, 292534, 293103, 293085, 293244, 294070, 295075, 295565, 295560, 295547, 295867, 296692, 298120, 299943, 301783, 303554, 305223, 306157, 305695, 304531, 304395, 305895, 307766, 308787, 309330, 310217, 311235, 311943, 313073, 315738, 319657, 323421, 326389, 329291, 332957, 337228, 341191, 343905, 344979, 344924, 344823, 345192, 345439, 344767, 343249, 341583, 340257, 339580, 340046, 341864, 344357, 346511, 348041, 349376, 350826, 352389, 354157, 356289, 358658, 361095, 363844, 367249, 371064, 374644, 377793, 380883, 384121, 387138, 389484, 391280, 393174, 395637, 398218, 399669, 399153, 397347, 395882, 395641, 396165, 396834, 397822, 399451, 401360, 402943, 404115, 404994, 405331, 404951, 404460, 404786, 406177, 408196, 410480, 412955, 415485, 417897]
57471D17897K404K627K747K480J973J538J429J818K513K849K397J682J502J809
57457D47665K016K142K646L303L416L121L290M001M265L612K767K403K263K037
57443D88947K136K978M209N090N180M424L264K667L240M223M300L420K800K993
57429E39871L281L196L307L936M396M242M097M478M811M508M026M004M091L696
57415E95940L150L258M085M989N399N047L976K931L009M279N375N191M359M217
57401F55205M899N371N023M355M167M747N747O392O066N058M427M799N649O168
57387G28073O248O191N988N579N389N898O864P501P336O548N742N588O366P504
57373H16815Q034P707P290P446P895Q066P990Q039Q142P941P448P078P189P812
$$ y = [417897, 420301, 422928, 425675, 428155, 430128, 431666, 433095, 434913, 437426, 440275, 442672, 444354, 445856, 447665, 449681, 451823, 454469, 457772, 461188, 464309, 467599, 471600, 475865, 479477, 482244, 484647, 486910, 488947, 491083, 494061, 498270, 503360, 508540, 512964, 516228, 518895, 522135, 526358, 530658, 534078, 536878, 539871, 543152, 546348, 549655, 553591, 557987, 562229, 566326, 570804, 575615, 580123, 584149, 588153, 592244, 595940, 599090, 602348, 606433, 611422, 616821, 621868, 625844, 628775, 631784, 636063, 641438, 646629, 650988, 655205, 660104, 665475, 670498, 674853, 679020, 683767, 689514, 695906, 701972, 707030, 711457, 716256, 721905, 728073, 734321, 740512, 746500, 752079, 757468, 763366, 770230, 777731, 785067, 791615, 797357, 802945, 809311, 816815, 824849, 832556, 839846, 847292, 855187, 863253, 871243, 879282, 887424, 895365, 902813, 909891, 917080, 924892]
57359I24892Q679R275R201Q636Q174Q089Q205Q484R114R884J0177R821R350R161
57345A051142R092R039R275R812J0146J0057J0021J0383J0800J0836J0533J0000
57333A171136R210Q524Q677R688J0586J0721J0589J0802J1028J0786J0554J1102
57321A293403J2174J2736J2330J1480J0879J0752J0954J1264J1613J2126J2764
57310A422475J3020J2506J1780J1843J2789J3763J4298J4772J5307J5390J5013
57299A572956J5010J5689J6164J5807J5276J5363J5744J5825J5866J6311J6752
57288A746763J6668J6439J6732J7398J7908J8278J8667J8763J8444J8393J9096
57277A943549J9897K0032J9986K0679K1890K2647K2711K2638K2703K2830K3206
$$ y = [924892, 933571, 942846, 952047, 960683, 968857, 976946, 985151, 993635, 1002749, 1012633, 1022810, 1032631, 1041981, 1051142, 1060234, 1069273, 1078548, 1088360, 1098506, 1108563, 1118584, 1128967, 1139767, 1150603, 1161136, 1171136, 1180346, 1188870, 1197547, 1207235, 1217821, 1228542, 1239131, 1249933, 1260961, 1271747, 1282301, 1293403, 1305577, 1318313, 1330643, 1342123, 1353002, 1363754, 1374708, 1385972, 1397585, 1409711, 1422475, 1435495, 1448001, 1459781, 1471624, 1484413, 1498176, 1512474, 1527246, 1542553, 1557943, 1572956, 1587966, 1603655, 1619819, 1635626, 1650902, 1666265, 1682009, 1697834, 1713700, 1730011, 1746763, 1763431, 1779870, 1796602, 1814000, 1831908, 1850186, 1868853, 1887616, 1906060, 1924453, 1943549, 1963446, 1983478, 2003464, 2024143, 2046033, 2068680, 2091391, 2114029, 2136732, 2159562, 2182768]
57266B182768K3949K4484K4231K3574K3272K3248K2934K2345K1863K1387K0683
57255B434738K0239K0648K1523K2024K2154K2471K2868K2787K2374K2255K2371
57244B676452K2099K1442K0972K0756K0380J9919J9892K0301K0646K0740K0651
57233B904250K0131J9124J8486J9079K0321K0861K0548K0477K1116K1653K1420
57222C127466K0702K0032J9584J9525J9936K0263J9733J8477J7391J6871J6523
57211C336503J6131J5909J5789J5405J4891J4742J4852J4666J4345J4653J5604
57200C503490J6268J6251J6297J7083J8212J8847J8646J7800J6738J6004J5854
57189C691490J5921J5756J5571J5785J6087J5772J4818J3764J2739J1557J0565
$$ y = [2182768, 2206717, 2231201, 2255432, 2279006, 2302278, 2325526, 2348460, 2370805, 2392668, 2414055, 2434738, 2454977, 2475625, 2497148, 2519172, 2541326, 2563797, 2586665, 2609452, 2631826, 2654081, 2676452, 2698551, 2719993, 2740965, 2761721, 2782101, 2802020, 2821912, 2842213, 2862859, 2883599, 2904250, 2924381, 2943505, 2961991, 2981070, 3001391, 3022252, 3042800, 3063277, 3084393, 3106046, 3127466, 3148168, 3168200, 3187784, 3207309, 3227245, 3247508, 3267241, 3285718, 3303109, 3319980, 3336503, 3352634, 3368543, 3384332, 3399737, 3414628, 3429370, 3444222, 3458888, 3473233, 3487886, 3503490, 3519758, 3536009, 3552306, 3569389, 3587601, 3606448, 3625094, 3642894, 3659632, 3675636, 3691490, 3707411, 3723167, 3738738, 3754523, 3770610, 3786382, 3801200, 3814964, 3827703, 3839260, 3849825]
57178C849825J0255J0197R476Q158P148O623N861M759M228M762N738O511P152
57165C940693P880Q664R666J1117J2566J3197J3087J3131J3612J3828J3302J2248
57153D082991J0716Q454N792L499J491j109m376p295r404j1400j3672j5418j5779
57140D034490j4766j2616r304n132q04L505Q098J2588J5991J8284K0449K2597
57128D093380K3437K2234J9890J7458J5019J2721J1520J1981J3661J6554K1758
57117D279613K9729L9140M8589N8327O9165Q0825R2625J04869J18404J33576J50703
57106E205565J70941J95826K26686K65166L13424L73211M45920N34336O43373
57097H374448P78398R43826J143632J381418J658827J975064K327987K713050
$$ y = [3849825, 3860080, 3870277, 3879753, 3887911, 3895059, 3901682, 3907543, 3912302, 3916530, 3921292, 3927030, 3933541, 3940693, 3948573, 3957237, 3966903, 3978020, 3990586, 4003783, 4016870, 4030001, 4043613, 4057441, 4070743, 4082991, 4093707, 4102161, 4107953, 4111452, 4112943, 4111834, 4107458, 4100163, 4090759, 4079359, 4065687, 4050269, 4034490, 4019724, 4007108, 3997804, 3992672, 3991868, 3995373, 4003471, 4016059, 4032050, 4050334, 4070783, 4093380, 4116817, 4139051, 4158941, 4176399, 4191418, 4204139, 4215659, 4227640, 4241301, 4257855, 4279613, 4309342, 4348482, 4397071, 4455398, 4524563, 4605388, 4698013, 4802882, 4921286, 5054862, 5205565, 5376506, 5572332, 5799018, 6064184, 6377608, 6750819, 7196739, 7731075, 8374448, 9152846, 10096672, 11240304, 12621722, 14280549, 16255613, 18583600, 21296650]
57089B1296650L119489L529033L918615M261593M526293M679229M693692M550751
57081E4575345M227683L694135K936478J993863R64095l5687r20378j658475k257770
57072F3519289k739608l122136l414634l618508l732506l758812l705326l583788
57064C5843971l407642l191371k949536k694968k437890k186595j948043j727525
57056A5300401j528381j352086j198226j064680r48655q47843p60424o84516o18401
57047F297189n61077n11611m67914m27176l87845l50491l16301k85342k56849
57038B732583k30498k06574j85043j65261j46681j29257j13108r8243q4687p2388
57028A300843o0872m9428l7704k5593j2516K567K0662M3213P2389J07626J39802
$$ y = [21296650, 24416139, 27945172, 31863787, 36125380, 40651673, 45330902, 50024594, 54575345, 58803028, 62497163, 65433641, 67427504, 68391599, 68355912, 67435534, 65777059, 63519289, 60779681, 57657545, 54242911, 50624403, 46891897, 43133085, 39427759, 35843971, 32436329, 29244958, 26295422, 23600454, 21162564, 18975969, 17027926, 15300401, 13772020, 12419934, 11221708, 10157028, 9208373, 8360530, 7600106, 6915590, 6297189, 5736112, 5224501, 4756587, 4329411, 3941566, 3591075, 3274774, 2989432, 2732583, 2502085, 2295511, 2110468, 1945207, 1798526, 1669269, 1556161, 1457918, 1373231, 1300843, 1239971, 1190543, 1152839, 1127246, 1114730, 1117297, 1137959, 1181172, 1253561, 1361187, 1500989]
57017A500989J51452J27852P0333k594o8148j13035j36265j43103j39351j29611
57007A118519j17152j03838r0789p9239p0067o2860n6417n0178m4580m0130l6766
56996C66503l4034l1434k8746k6299k4540k3093k0862j7437j3601r964n913p19
56984A29861N110J0384J4305J6109J4489Q921J184n685j0023j2260j3431j3985
56972A44979j3899j2901j0635p323m085j848k80J472L540N778Q753J3016J7783
56959A44350K1793K5255K9314L3493L5114L1750K3306J1598r04j1718j9067k2776
56947C01508k3911k3311k1226j8271j5517j3261j0682p239l458RL346P034J1098
56934A86119J5371K0003K5261L1035L6439L9380L6907K7368J2618k784j5097k3495
$$ y = [1500989, 1652441, 1780293, 1850626, 1848032, 1779884, 1666849, 1530584, 1387481, 1248130, 1118519, 1001367, 897529, 806740, 727501, 657434, 594574, 538157, 487979, 443399, 403269, 366503, 332469, 301035, 272289, 245990, 221450, 198357, 177495, 160058, 146457, 136493, 130580, 129861, 134971, 145355, 159660, 175769, 190258, 199179, 200363, 194678, 184655, 172395, 158964, 144979, 131080, 118179, 107544, 100221, 96136, 94288, 94008, 95480, 99020, 104798, 113551, 126567, 144350, 166143, 191398, 220712, 254205, 289319, 321069, 344375, 355973, 355069, 343351, 324284, 301508, 277597, 254286, 233060, 214789, 199272, 186011, 175329, 168090, 164632, 164641, 167987, 175021, 186119, 201490, 221493, 246754, 277789, 314228, 353608, 390515, 417883, 430501, 427717, 412620, 389125]
56922C89125k8789l1431l1501k9671k7075k4447k1950j9525j7003j4292j1787
56911A31654j0122r226q216o548m740l504k719j848q84k20J23N55J263K041K736
56896I0345L472M363N256N959O733Q272J1010J4462J7696K0486K3394K6281K7455
56883B65184K5125J9377J1953M362k839r122j3551j5622j5742j4565j2392r491
56871B32677o348l289l31K502N238Q438J2933J8822K5308L1845L8861M6872N5013
56858D68541O0606O0215N1512L4980J4138o171k2182l2397l7269l8345l7236l4646
56846D81746l0339k4320j7527j0849m118L139J0589J7820K5629L5287M6837N9448
56834E93342P2985Q7146R8622J01058Q9385O3821K9601o141l7052n9120p1593
$$ y = [389125, 360336, 328905, 297404, 267733, 240658, 216211, 194261, 174736, 157733, 143441, 131654, 121532, 112306, 104090, 97542, 92802, 89298, 86579, 84731, 83847, 83627, 83750, 84305, 85568, 87609, 90345, 93817, 98180, 103436, 109395, 116128, 124400, 135410, 149872, 167568, 188054, 211448, 237729, 265184, 290309, 309686, 321639, 326001, 323162, 314040, 300489, 284867, 269125, 254560, 242168, 232677, 226329, 223040, 222709, 225211, 230449, 238887, 251820, 270642, 295950, 327795, 366656, 413528, 468541, 529147, 589362, 640874, 675854, 689992, 683821, 661639, 629242, 591973, 553628, 516392, 481746, 451407, 427087, 409560, 398711, 394593, 397732, 408321, 426141, 451770, 487057, 533894, 593342, 666327, 753473, 852095, 953153, 1042538, 1106359, 1135960, 1129819, 1092767, 1033647, 962054]
56823I62054p6393p5996p1887o4920n6186m6859l7727k9238k1504j3951n639L703
56811D65457J3520K3622L4722M7341O0377P0870P4773O8364N0428K3885n209l0905
56799H97245m9791o1002o5253o4214n9820n3506m6328l9444l3528k7878k1416
56788C75065j4564q801m215R15P604J4848K1530K7988L4322L8313L6596K7688
56776E57289J3151l494j8415k8992l4962l7851l8853l7883l4971l1268k7838k4507
56764B51406k0929j7809j5888j4526j2569j0112q182p079o198n237m517m212m157
56751A19991m258m448m406l975l546l429l180k244r23o5l1n50j210j590j227j99
56735H4710O44N91j8l30r6K98M65K68k86r14j188j101j117j341j275o88p3J67
$$ y = [962054, 885661, 809665, 737778, 672858, 616672, 569813, 532086, 502848, 481344, 467393, 461754, 465457, 478977, 502599, 537321, 584662, 645039, 715909, 790682, 859046, 909474, 933359, 928150, 897245, 847454, 786452, 721199, 656985, 597165, 543659, 497331, 457887, 424359, 396481, 375065, 360501, 351700, 347485, 348400, 356004, 370852, 392382, 420370, 454692, 493005, 529601, 557289, 570440, 566946, 548531, 519539, 484577, 446726, 407873, 369990, 335019, 303751, 275913, 251406, 230477, 212668, 196780, 182254, 169685, 159573, 151391, 144312, 138114, 132877, 128360, 124148, 119991, 115733, 111285, 106879, 102904, 99358, 95929, 92749, 90505, 89582, 89517, 89486, 88936, 87726, 86136, 84909, 84710, 85354, 85945, 85927, 85597, 85501, 85799, 86264, 86532, 86246, 85332, 84144, 83043, 81926, 80585, 79310, 78622, 78549, 78716]
56717G8716L39P92J352J840K392K869K786K302K229K599K330J073J51O32J567
56702A03969J403K47o30q07q32q54n34k4K11L12P19J170J047M80R6q5n43j220
56684A04125j540j344r96o92l67q5J06L98Q03R44P38O14N38k74j858k769j958
56667I6383m32J75j03j08L41N18M06O34J049R25M37M45R25J000N83M80Q60J008
56649A05526P45P72J308J661J465J224J310J349J012M96M1l27m03J7N57N93K50
56632A17596K38P45J269J489J501J238O02L9J15N01L70k59n54k68n2k31k49K88
56614A24378R11R26K44o03q18J46J942L298L313K524K058K068J784Q97n8m76k20
56597A42314N46J302J342N94q1o9J92L00Q70K267L268K524P55j40K02M86Q5k52
$$ y = [78716, 79055, 79847, 81199, 83039, 85431, 88300, 91086, 93388, 95617, 98216, 100546, 101619, 101770, 102402, 103969, 105372, 105619, 104989, 104182, 103350, 102496, 101962, 101938, 102149, 102461, 103180, 104350, 105397, 105877, 105973, 105888, 105345, 104125, 102585, 101241, 100245, 99553, 99186, 99101, 99207, 99605, 100408, 101352, 102090, 102704, 103242, 102968, 101110, 98341, 96383, 95951, 96126, 96023, 95915, 96256, 96774, 97180, 97814, 98863, 99788, 100225, 100670, 101595, 102595, 103178, 103658, 104518, 105526, 106271, 107043, 108351, 110012, 111477, 112701, 114011, 115360, 116372, 116868, 116909, 116582, 116179, 116196, 116753, 117346, 117596, 117834, 118579, 119848, 121337, 122838, 124076, 124678, 124717, 124832, 125333, 125703, 125444, 124890, 124622, 124570, 124339, 124090, 124378, 125289, 126215, 126459, 125856, 125038, 125184, 127126, 130424, 133737, 136261, 138319, 140387, 142171, 143068, 143010, 142534, 142314, 142860, 144162, 145504, 146098, 146017, 145948, 146140, 146440, 147310, 149577, 152845, 155369, 156124, 155984, 156186, 156672, 156757, 156505]
56579A56505o4J36Pk10n51j315k098k130j563j100n70O65K029K192J341J182K326
56562A56782L428L420K950L077L909N158O647P675P206N296L185J643M60k00M14
56547B11050K019L043K707J893J339M45j124k287k086j271j156j780k240k099
56533B08453j572r93q11j386k267k435j746j208j413j684j378q79o64m47n4j54
56517A89362j183k404k827k397j634q12j33Rm13q53r86j064j183j018o02m42n85
56500A70835m90j20n9k94j35L40J35q33j279n69K09J11j76K48R02R22N56M24K50
56481A70977m54j176j102l86J89L08R6k99m23L66J755K393J749J054J459K308
56465A78814K282J386N76K13M6Q9L60L33l12r19q15m11l40k23O07J731K119J610
$$ y = [156505, 156441, 156577, 156584, 156374, 155823, 154508, 152410, 150280, 148717, 147617, 147047, 147712, 149741, 151933, 153274, 154456, 156782, 160210, 163630, 166580, 169657, 173566, 178724, 185371, 193046, 200252, 205548, 208733, 210376, 210836, 210636, 211050, 213069, 216112, 218819, 220712, 222051, 222496, 221372, 219085, 216999, 215728, 214572, 212792, 210552, 208453, 206881, 205888, 205077, 203691, 201424, 198989, 197243, 196035, 194622, 192938, 191560, 190681, 190017, 189570, 189516, 189362, 188179, 185775, 182948, 180551, 178917, 178105, 177972, 177981, 177568, 176715, 175729, 174665, 173482, 172464, 171862, 171420, 170835, 170345, 170225, 170166, 169872, 169737, 170077, 170212, 169379, 168100, 167531, 167740, 167851, 167675, 167923, 168825, 169747, 170303, 170727, 170977, 170523, 169347, 168245, 167859, 168048, 168356, 168452, 168153, 167730, 168096, 169851, 172244, 173993, 175047, 176506, 178814, 181096, 182482, 183058, 183271, 183317, 183406, 183766, 184099, 183787, 182868, 182053, 181642, 181302, 181079, 181686, 183417, 185536, 187146]
56447A87146Q21K5p68j071l81O98R58J28q79j221q69j63O41J294J569J434R91
56430A90353L79n9L6N74J081J452J939K340J945P17l05k77M41R90J051O83n8q20
56412B02462r01p4J007J591J537J048M49L13Q97J355O33p23r45L80J586J451Q69
56395B12935J096J714J606Q50L20J29j92n70n10oN16Q33R06P33O08R80J622J778
56377B25348J364J186J587J972K031K249K674K531J631R11Q55P50K26P7P03J189
56361B47284R46Q15J400J763J045Q4J2M35M25K05M16O36K14l56k14L68O22O63
56343B56763J019J452J377R44O16L88J72K01L77J51k65J79J506K202J524P98J215
56326B70619J901J566O62L75O78R25J222J804K129J935K032K787L144K386J447
$$ y = [187146, 187967, 187992, 187224, 186153, 185772, 186470, 187428, 187556, 186677, 185456, 184587, 184424, 185065, 186359, 187928, 189362, 190353, 190732, 190673, 190709, 191283, 192364, 193816, 195755, 198095, 200040, 200757, 200452, 200175, 200616, 201606, 202657, 203340, 203282, 202462, 201561, 201487, 202494, 204085, 205622, 206670, 207119, 207432, 208329, 209684, 210317, 209594, 208649, 209029, 210615, 212066, 212935, 214031, 215745, 217351, 218201, 218521, 218650, 218458, 217888, 217378, 217372, 217888, 218721, 219627, 220360, 220968, 221948, 223570, 225348, 226712, 227898, 229485, 231457, 233488, 235737, 238411, 240942, 242573, 243484, 244339, 245089, 245315, 245392, 246095, 247284, 248230, 249045, 250445, 252208, 253253, 253337, 253349, 253784, 254209, 254414, 254830, 255466, 255680, 255324, 255110, 255478, 256100, 256763, 257782, 259234, 260611, 261555, 262171, 262559, 262731, 262932, 263309, 263460, 263195, 263374, 264880, 267082, 268606, 269404, 270619, 272520, 274086, 274748, 275123, 275801, 276726, 277948, 279752, 281881, 283816, 285848, 288635, 291779, 294165, 295612]
56311B95612J112N71p19j448n43P56R35P15J458K547K679K485L439N204O310O501
56295C27614O316N408L461J706J254J062k17j534j147J72L86k50K11J848K797
56280C49087K431J945J987K151K583L743M827M715M147M667N837N902M852M316
56266D03190M722N053N236O179P555P999P592P765Q752R403R526J0100J1130J1619
56252E15821J1713J2678J4658J6593J8319K0648K3415K5605K7391K9881L2890
56241G49612L5108L6374L7656L8915L9158L8406L7416L5654L1735K5782J9167
56230A124983J2293M822k369q044j2946j8638k4348k7784k8870k9743l1099l1559
56218I26698l0755l0071k9896k8964k6917k4865k3073k0685j8031j6546j6108
$$ y = [295612, 296724, 297295, 296576, 295128, 294585, 295341, 296276, 296991, 298449, 300996, 303675, 306160, 309599, 314803, 321113, 327614, 333930, 339338, 342799, 344505, 345759, 346821, 346604, 345070, 343923, 344095, 344481, 344231, 344442, 346290, 349087, 351518, 353463, 355450, 357601, 360184, 363927, 368754, 373469, 377616, 382283, 388120, 394022, 398874, 403190, 407912, 412965, 418201, 424380, 431935, 439934, 447526, 455291, 464043, 473446, 482972, 493072, 504202, 515821, 527534, 540212, 554870, 571463, 589782, 610430, 633845, 659450, 686841, 716722, 749612, 784720, 821094, 858750, 897665, 936823, 975229, 1012645, 1048299, 1080034, 1105816, 1124983, 1137276, 1142098, 1139729, 1131685, 1118739, 1100101, 1075753, 1047969, 1019099, 989356, 958257, 926698, 895943, 865872, 835976, 807012, 780095, 755230, 732157, 711472, 693441, 676895, 660787]
56207F60787j5048j3160j1987j1831j1221r747q675q310p468n963m947m444l249
56194E44737j667j423k454k690j573q04j007o94O83J679J733K206L574M339L803
56179E50442L271L531L645L179L073L478L189K040J495K092K721K880L222L542
56165E91800K894J984K547M131M533L669L704N021N728N635O891R690J1321J0696
56151F70244J0149J1209J2335J2433J3029J5067J6898J7411J8213K0803K4413
56140H42204K8183L2598L7368M0908M3520M8116N6310O6717P8335R2132J07569
56129A473960J20910J28858J30990J27280J16820J00990Q4595P1671O2726N7294
56119B476094N5480N5092N1045M0355K5213R437m993j6421k2500k3471k3668k7426
$$ y = [660787, 645739, 632579, 620592, 608761, 597540, 587793, 579118, 570808, 563340, 557377, 552430, 547986, 544737, 543070, 541647, 539193, 536503, 534930, 534126, 533119, 532425, 533108, 534787, 536520, 538726, 542300, 546639, 550442, 553713, 557244, 560889, 564068, 567141, 570619, 573808, 575848, 577343, 579435, 582156, 585036, 588258, 591800, 594694, 596678, 599225, 603356, 607889, 611558, 615262, 620283, 626011, 631646, 638537, 648227, 659548, 670244, 680393, 691602, 703937, 716370, 729399, 744466, 761364, 778775, 796988, 817791, 842204, 870387, 902985, 940353, 981261, 1024781, 1072897, 1129207, 1195924, 1274259, 1366391, 1473960, 1594870, 1723728, 1854718, 1981998, 2098818, 2199808, 2284403, 2356074, 2418800, 2476094, 2531574, 2586666, 2637711, 2678066, 2703279, 2712716, 2707723, 2691302, 2668802, 2645331, 2621663, 2594237]
56107B594237l5886m8962o6712q6755j03828j14387j19029j18903j13385j03066
56097A683324r1231q0025o8557n6714m7015m0457l4420k7174k0740j6807j3639
56086A186545r634o249m690l303q34J242K118L561O068P075N589M556N958P689
56072A205691Q019Q807J1324J3290J3266J3651J6050J7963J7520J7155J9072K1263
56060A383071K1586K1496K2242K1760J9032J7047J7789J8690J7716J7196J8844
56049A596469J9981J8806J8442K1291K4356K4651K4329K5819K6961K5814K5210
56038A852129K7385K9206K7995K7059K9961L4216L6313L8053M2129M6216M7437
56027B238099M8045N1010N4524N6418N8970O3810O7270O6595O5341O6840O8158
$$ y = [2594237, 2558351, 2509389, 2442677, 2355922, 2252094, 2137707, 2018678, 1899775, 1786390, 1683324, 1592093, 1512068, 1443511, 1386797, 1339782, 1299325, 1264905, 1237731, 1216991, 1200184, 1186545, 1176911, 1170662, 1165972, 1162669, 1161835, 1163077, 1165195, 1168756, 1174824, 1181899, 1187488, 1192044, 1198002, 1205691, 1213710, 1222517, 1233841, 1247131, 1260397, 1274048, 1290098, 1308061, 1325581, 1342736, 1361808, 1383071, 1404657, 1426153, 1448395, 1470155, 1489187, 1506234, 1524023, 1542713, 1560429, 1577625, 1596469, 1616450, 1635256, 1653698, 1674989, 1699345, 1723996, 1748325, 1774144, 1801105, 1826919, 1852129, 1879514, 1908720, 1936715, 1963774, 1993735, 2027951, 2064264, 2102317, 2144446, 2190662, 2238099, 2286144, 2337154, 2391678, 2448096, 2507066, 2570876, 2638146, 2704741, 2770082, 2836922, 2905080]
56016B905080O6566O5758O9068P2798P3247P3933P8651Q3968Q6228Q9239R6890
56005C761426J04914J08428J11043J17721J25427J29816J34241J42873J51929
55996D887818J57369J63910J76438J90059J99041K07779K22058K37693K49288
55987F691453K61718K80845L01606L18070L36191L63142L93459M19891M48276
55978I814651M86676N29937N70896O16282O74816P40858Q07628Q84503R82292
55969A6108539J094356J213042J350793J522945J725118J952456K224900K566893
55961B9759042K980663L469530M067439M812685N716390O795308Q110099R732529
55953G5443685J1715238J4150627J7218244K1110094K5953725L1814906L8477718
$$ y = [2905080, 2971646, 3037404, 3106472, 3179270, 3252517, 3326450, 3405101, 3489069, 3575297, 3664536, 3761426, 3866340, 3974768, 4085811, 4203532, 4328959, 4458775, 4593016, 4735889, 4887818, 5045187, 5209097, 5385535, 5575594, 5774635, 5982414, 6204472, 6442165, 6691453, 6953171, 7234016, 7535622, 7853692, 8189883, 8553025, 8946484, 9366375, 9814651, 10301327, 10831264, 11402160, 12018442, 12693258, 13434116, 14241744, 15126247, 16108539, 17202895, 18415937, 19766730, 21289675, 23014793, 24967249, 27192149, 29759042, 32739705, 36209235, 40276674, 45089359, 50805749, 57601057, 65711156, 75443685, 87158923, 101309550, 118527794, 139637888, 165591613, 197406519, 235884237]
55946B35884237M4783038M8175311M5540121L5264776J8804255J34093j6497203
55939D12088628k8537458l5499029l8153504l7678941l5235315l1780375k7971587
55932A77232419k4197284k0690887j7587826j4920257j2649270j0731101r133001
55925F7322793p806282o691976n753543m973432m323499l768084l290255k887596
55917B7828126k547101k248342j985572j763201j574212j404039j250694j120813
55909A3934152j010444r08686q15587p38319o73935o13060n56379n10760m73054
55900G633928m33993l94570l62957l38266l12415k85326k63766k47484k30185
55891D764966k12118j98654j88355j75084j59942j48985j41087j30020j16676
$$ y = [235884237, 280667275, 328842586, 374382707, 409647483, 428451738, 428585831, 412088628, 383551170, 348052141, 309898637, 272219696, 236984381, 205204006, 177232419, 153035135, 132344248, 114756422, 99836165, 87186895, 76455794, 67322793, 59516511, 52824535, 47070992, 42097560, 37774061, 34005977, 30715722, 27828126, 25281025, 23032683, 21047111, 19283910, 17709698, 16305659, 15054965, 13934152, 12923708, 12015022, 11199435, 10461116, 9787181, 9174121, 8617742, 8106982, 7633928, 7199935, 6805365, 6442408, 6104142, 5791727, 5506401, 5242635, 4995151, 4764966, 4552848, 4354194, 4165839, 3990755, 3830813, 3681828, 3540741, 3410721, 3294045]
55882C294045j07327j01285r2011p9275o8881o1139n0873l8711l1738l2512l6930
55871B593363m2996n2489o3847p2287p7277q1901q5195q3182p7007p1851o8144
55860A817187o1883n3301m7137m4319m1204l7196l5528l6300l6038l4484l4787
55849A355010l6761l6821l4875l4451l5723l5075l1996k9843k9298k7355k3450
55838I99362k0500j9267j7548j5439j5577j7609j8057j6237j4954j4894j3754
55827H15526j1426j0537j1277j0962r327r147j0927j2024j1656j1889j3045j2986
55815F80323j1617j1336j2342j2088j0057q616q454p587n540m227m021l120j297
55802E80021j96L93K473N674P390P268P403P836O352L091Q36J50j357m255o235
$$ y = [3294045, 3186718, 3085433, 2993422, 2914147, 2845266, 2784127, 2733254, 2694543, 2662805, 2630293, 2593363, 2550367, 2497878, 2434031, 2361744, 2284467, 2202566, 2117371, 2034189, 1957182, 1885331, 1817187, 1755304, 1702003, 1654866, 1610547, 1569343, 1532147, 1496619, 1460319, 1424281, 1389797, 1355010, 1318249, 1281428, 1246553, 1212102, 1176379, 1141304, 1109308, 1079465, 1050167, 1022812, 999362, 978862, 959595, 942047, 926608, 911031, 893422, 875365, 859128, 844174, 829280, 815526, 804100, 793563, 782286, 771324, 761997, 752850, 741923, 729899, 718243, 706354, 693309, 680323, 668706, 657370, 645028, 632940, 622883, 614267, 605813, 598226, 592686, 588459, 584438, 581318, 580021, 579825, 580218, 582691, 588365, 595755, 603023, 610426, 618262, 624614, 627705, 628541, 628691, 627334, 623079, 616844]
55787F16844o617p531r530j0246q638o729n929n343m781n818q633j1174j2485
55774E13390j3630j4550j3445j0076o391l086J187O414J0313J1495J0470P138
55762D99229Q34o640j1674j3365j4084j4998j4661j2736j1244j0915r890p333
55750C72523n064m331m056l551l854n161n848n256m695m666l904k167j114j350
55736C17506j340k31P95R18Q04O39l36j741k242k272l723o401p879p389o692o533
55720B73883n592l773k999l631l542j944q29j225j327J01J628K097K720M472O130
55705B66169O508O126N248K889p65l656m900n981p629q329p353o351o399o229
55691B29348n063m307m666m452k767j491k043k709j548M27J336J495K104K803
$$ y = [616844, 610227, 602696, 593166, 582920, 574282, 567553, 561624, 556281, 551500, 545682, 537049, 525875, 513390, 499760, 485210, 471765, 461689, 455298, 452212, 453399, 459813, 470126, 481621, 492091, 499229, 500063, 493423, 481749, 468384, 454300, 439302, 424641, 411905, 400661, 389746, 379856, 372523, 367459, 363128, 359072, 355521, 351667, 346506, 340658, 335402, 330707, 326041, 322137, 319970, 318856, 317506, 316166, 315935, 316730, 317648, 318452, 319091, 318755, 317014, 314772, 312500, 308777, 302376, 294497, 287108, 280416, 273883, 268291, 264518, 261519, 257888, 254346, 252402, 251573, 250348, 249021, 249122, 250750, 252847, 255567, 260039, 266169, 272677, 278803, 284051, 286940, 286175, 282519, 277619, 271638, 264009, 255680, 248327, 241976, 235577, 229348, 224285, 219978, 215312, 210860, 208093, 206602, 204559, 201850, 200302, 200729, 202065, 203560, 205664, 208467]
55677B08467K779K607K908K819J628L39j64p29k023k854k279j473j655j924j140
55662B07306k25m78j120o40O39J329J241J159J373J903L095M636N218M403L530
55647B33369L604L852L481L129L114K186l37k880l850m018m841o012o517o676
55633B17604p171p277o126m606m163m501m257l132j829o77K12L42k85o10j17J44
55617A73551p02j696j591q70q05j483k113k386k278j547n46l90j213j566o74J52
55601A53843l26j257j368j121j482j912j428n22k53l82j62m9q23j876k063j520
55585A37299j088p12N6P48O46R1k17l95o45l04R19J816J310K99L12J190J714J634
55567A44673J575J661J744K220L135L331K055N26K61O58P1j496k554k545k269
$$ y = [208467, 211246, 213853, 216761, 219580, 221208, 221547, 221383, 220654, 218631, 215777, 213498, 212025, 210370, 208446, 207306, 207081, 206603, 205483, 204843, 205482, 206811, 208052, 209211, 210584, 212487, 215582, 220218, 225436, 229839, 233369, 236973, 240825, 244306, 247435, 250549, 252735, 252398, 249518, 245668, 241650, 236809, 230797, 224280, 217604, 210433, 203156, 197030, 192424, 188261, 183760, 179503, 176371, 174542, 173865, 174077, 174419, 174134, 173524, 173407, 173551, 172849, 171153, 169562, 168692, 167887, 166404, 164291, 161905, 159627, 158080, 157534, 157144, 155931, 154365, 153691, 153843, 153517, 152260, 150892, 149771, 148289, 146377, 144949, 144427, 144174, 143792, 143630, 143581, 142758, 140882, 138819, 137299, 136211, 135499, 135555, 136303, 136949, 137040, 136823, 136428, 135783, 135479, 136398, 138214, 139524, 139823, 140135, 141325, 143039, 144673, 146248, 147909, 149653, 151873, 155008, 158339, 160394, 160920, 161181, 161839, 161910, 160414, 157860, 155315, 153046]
55552A53046k216k119j951j974j999j743j527j575j287l53K56k91j116r64k38
55537A33949j11m15j54M65L49n01j027q63n27j84L41O07J59l34K9P03M49n31q59
55518A31545j92M15L08j25o02j303j966j912j196o54o67q48q98q35n28J50P60
55501A21452P44K40k61p00j180j358r71m28j10L03R41J055K16o14m45J16r3p99
55483A18108q29m1O66P85L97n32j718k133j358o32j062j591o07J210J691M79o52
55466A12181o70l92n72q18p84p03m27N32J681J815R30L12M79N52N6k21K07N98
55448A14756L67J14M34P94M12m72r97p51JO85O97j05r84j010k73K12j13p30r05
55429A12132m87K27P66O31k22j028r59j00Q50J530J865J496K71r13r30K4O70L95
$$ y = [153046, 150830, 148711, 146760, 144786, 142787, 141044, 139517, 137942, 136655, 136302, 136558, 136267, 135151, 134187, 133949, 133838, 133423, 133269, 133734, 134083, 133582, 132555, 131692, 131165, 130981, 131322, 131929, 132088, 131754, 131783, 132486, 132935, 132404, 131545, 131353, 131768, 132076, 131951, 131349, 130046, 128080, 126168, 124972, 124318, 123651, 122803, 121905, 121070, 120542, 120692, 121452, 122196, 122436, 122175, 121475, 120295, 118937, 117966, 117538, 117428, 117731, 118672, 119727, 119943, 119329, 118884, 119000, 118907, 118108, 117279, 117238, 117904, 118689, 119086, 118554, 116836, 114703, 113345, 112713, 111651, 110060, 109453, 110663, 112354, 112833, 112181, 111511, 111119, 110547, 109729, 108945, 108242, 107815, 108347, 110028, 111843, 112773, 113085, 113564, 114116, 114172, 113951, 114158, 114756, 115123, 115237, 115671, 116465, 116877, 116405, 115408, 114657, 114658, 115343, 116040, 115935, 114951, 113941, 113668, 113880, 113767, 113037, 112132, 111645, 111872, 112638, 113269, 113047, 112019, 111060, 110960, 111810, 113340, 115205, 116701, 116972, 116059, 115129, 115153, 115823, 116218]
55411A16218k13n30n22k03M69J039Q40N7l56j2M54L83j72q33j325j429j121p70
55393A11974o97o59l20O1J18J31N16Q81N84q5k47K34P14Q79R04P29K13j87P3N70
55373A16386M20k58n27j77M0k40m92l00J18N25R56J256J156Q37O80N81K11k01
55355A20971k41j62m91r83r52l89K11P98J489J703Q26m90r93o24l61n11m74j23
55337A19204J9k6K53N79J27q86j324r79p88r96p49J21N63J62jQ42J780J581M06
55318A19888p07j239j334j233j138j125q78j33N78M67j93l61J32L63J2j05M38
55301A13432Q82O05J09J1R7L5J14N89J073J185J045P20lq83j127m87L64R54J542
55282A20257K150K081J011k91r92j107r59n34J9J49l13p83q46p77p89n55M7N21
$$ y = [116218, 116005, 115475, 114953, 114750, 115219, 116258, 117098, 117155, 116799, 116787, 117241, 117624, 117452, 116619, 115294, 113865, 112744, 111974, 111277, 110618, 110298, 110359, 110477, 110608, 111124, 112005, 112589, 112504, 112257, 112491, 113205, 114084, 114988, 115717, 115930, 115743, 115816, 116386, 116806, 116548, 116021, 115844, 115884, 115644, 115152, 114852, 114970, 115495, 116451, 117707, 118863, 119700, 120380, 120961, 121172, 120971, 120730, 120568, 120077, 119094, 118142, 117753, 117964, 118762, 120251, 121954, 122780, 122290, 121297, 120673, 120312, 119801, 119327, 119204, 119223, 119197, 119450, 120029, 120156, 119270, 117946, 116967, 116179, 115183, 114434, 114555, 115118, 115280, 115279, 116121, 117901, 119482, 119888, 119181, 117942, 116608, 115375, 114237, 113112, 112234, 112101, 112679, 113146, 112953, 112592, 112724, 113087, 113099, 112994, 113432, 114314, 114919, 115028, 115039, 115136, 115171, 115285, 115874, 116947, 118132, 119177, 119897, 119894, 119011, 117884, 117397, 117761, 118715, 120257, 122407, 124488, 125499, 125208, 124216, 123109, 122150, 121616, 121635, 121784, 121471, 120688, 119842, 119065, 118276, 117721, 117768, 118289]
55264A18289O00O53P87M54n13j343j385r67o16k70K19N31M99M96O69N51K1j50
55246A18525N71J498J587P12m66j333j520q67K55J091J327J200O17q32k616l157
55230A16592j767K54J270J221J064J067P97K12k43l77k35L30J350K212K151J150
55214A27048q9r26j162r20n56m47n95o75n54l19J90J228K301K364J172j85o29
55197A27246k90J8j09m84p70o18N9P25O83O8k82r9j5l35l94L29J320J735J356
55178A30143M22p82j745j879j264n97j81K88P45O55J37O0N86Q30M61L72J079J745
55160A31075J681J540J965K237J491K67l50l28k45j11J80J9r79j930j852j275
55144A33385j325j820j736j105q97j251j237m59M36R30J197J352J133N69J00j12
$$ y = [118289, 118889, 119542, 120329, 120783, 120270, 118927, 117542, 116575, 115959, 115689, 115908, 116439, 116938, 117434, 118103, 118654, 118675, 118525, 119096, 120594, 122181, 122893, 122427, 121094, 119574, 118707, 118962, 120053, 121380, 122580, 123197, 122365, 119749, 116592, 114825, 115079, 116349, 117570, 118634, 119701, 120498, 120710, 120467, 120090, 119855, 120185, 121535, 123747, 125898, 127048, 126959, 126033, 124871, 123951, 123395, 122948, 122353, 121678, 121124, 120805, 120995, 122223, 124524, 126888, 128060, 127875, 127246, 126956, 126974, 126865, 126381, 125611, 124993, 125052, 125777, 126460, 126528, 126246, 126147, 126132, 125797, 125403, 125732, 127052, 128787, 130143, 130565, 129783, 128038, 126159, 124895, 124298, 124117, 124405, 125150, 125805, 125942, 126002, 126588, 127418, 127879, 128251, 129330, 131075, 132756, 134296, 136261, 138498, 139989, 140256, 139906, 139578, 139333, 139222, 139402, 139421, 138442, 136512, 134660, 133385, 132060, 130240, 128504, 127399, 126502, 125251, 124014, 123555, 123991, 124921, 126118, 127470, 128603, 129172, 129272, 129160]
55128A29160k99m63l18J04M20M59L71J99r1k97j96K1J0k65o33r47q99j29R97J400
55108A28604O70j70l7P64J242J239J200J089O20J99M45J020J067O31N40R54J157
55091A41234Q37N01N25O96Q37J048J167P84m0p36j001j076j152j157j115j196
55075A40156j320j232r20n39n1N28P92M08k51n83o32q43j171j162p35j56M92J133
55057A33914J257N48k59j49O75J063O88M24P98J124O33m10j228j531j418q78L8
55040A35289Q52R90M85mJ43Q46J400J251O71L92N46M48l01j101j165o44k84l34
55022A39480m21k93q7L0n2m57j019j093l00Q81J661J854J747J423Q93M90M03J74
55004A45314n93j335j193l41K28J48%K54P00J042J310J547J632J505J177O30J26
$$ y = [129160, 128861, 128398, 128080, 128184, 128604, 129063, 129434, 129633, 129542, 129245, 129049, 129070, 129080, 128815, 128182, 127235, 126336, 126207, 127204, 128604, 129274, 129104, 129067, 129831, 131073, 132312, 133512, 134601, 135221, 135420, 135865, 136885, 137952, 138583, 139123, 140077, 141234, 142071, 142572, 143097, 143793, 144630, 145678, 146845, 147629, 147589, 146853, 145852, 144776, 143624, 142467, 141352, 140156, 138836, 137604, 136684, 136145, 136094, 136622, 137414, 137822, 137571, 136988, 136356, 135513, 134342, 133180, 132445, 132289, 132781, 133914, 135171, 135719, 135460, 135311, 135986, 137049, 137737, 138161, 138959, 140083, 140716, 140306, 139078, 137547, 136129, 135251, 135289, 136141, 137131, 137616, 137612, 137755, 138601, 140001, 141252, 141923, 142315, 142861, 143309, 143008, 141907, 140742, 140098, 139814, 139480, 139059, 138766, 138679, 138709, 138657, 138200, 137181, 136088, 135788, 136669, 138330, 140184, 141931, 143354, 144247, 144737, 145140, 145314, 144721, 143386, 142193, 141852, 142080, 142228, 142228, 142482, 143182, 144224, 145534, 147081, 148713, 150218, 151395, 152025, 152151]
54987A52151K06Q68J216O29k04l19j7k95j099j454j148r01q36j85J114J880J325
54970A52931J81m16l36j59j14k0K86Q61J612K074J731Q25K66M64Q17O91K85J67
54952A62146M04O18N31J73k46m41k68R9L60M14K58j78p14p35M5Q97R04K72o0O7
54932A64546j32r30j561j371n92L14J249K055K331K158K282L097M073M579M723
54917A86821M918N233N550N874O019N506M210K628J158m07k278m025n064n408
54903B10735n437n278m813m143l586l308l175k920k362j614j062r29r48p85n80
54888A69795o31o82k38N12Q21N20K82N88J144J589K073K754L422L985M796N971
54872A96701O957P172O658N700M297K421L75j544l352m988o051o324o155n851
$$ y = [152151, 152357, 153225, 154441, 155070, 154866, 154547, 154530, 154235, 153136, 151682, 150534, 149633, 148797, 148612, 149726, 151606, 152931, 153112, 152696, 152360, 152201, 152087, 152067, 152353, 153214, 154826, 156900, 158631, 159456, 159722, 160186, 161003, 161694, 161979, 162146, 162550, 163168, 163699, 163872, 163626, 163185, 162917, 163016, 163376, 163790, 164048, 163870, 163156, 162421, 162466, 163363, 164267, 164539, 164479, 164546, 164414, 163484, 161923, 160552, 159960, 160274, 161523, 163578, 165909, 168067, 170349, 173446, 177519, 182098, 186821, 191739, 196972, 202522, 208396, 214415, 219921, 224131, 226759, 227917, 227510, 225232, 221207, 216143, 210735, 205298, 200020, 195207, 191064, 187478, 184170, 180995, 178075, 175713, 174099, 173037, 172108, 171160, 170375, 169795, 169164, 168482, 168244, 168756, 169577, 170097, 170379, 170967, 172111, 173700, 175773, 178527, 181949, 185934, 190730, 196701, 203658, 210830, 217488, 223188, 227485, 229906, 230281, 228737, 225385, 220397, 214346, 208022, 201867, 196016]
54858A96016n153l832k516k158k809l464l237k270j343r09p26l70R6J80l38j019
54842A66148j313j166q30l50K62N74Q9r69j796k002j840j466p13K42O79K73l67
54825A55455m95j73Lj60k67N3O78J162J198Q95N54J87m44j169j265l96P21J185
54807A57722J142J373J901J925J190M52L88Q01J227J521J571J132L17k72l25j57
54791A71908o3J02L83M27Q5j92J2N04Q82J085J227J188P94J06o48j176j170n61
54773A74893K55Q55J368K105K805K979K914L439M618N595N924O124O585O894O630
54758B33983O002N206L961K163L09j303k983m816o155o506o249n927n467m731
54744B07487m084l849l739l429l118k905k346j271l57k18m39l05J19L59M51O85
$$ y = [196016, 190863, 187031, 184515, 182357, 179548, 176084, 172847, 170577, 169234, 168325, 167599, 167229, 167325, 167505, 167167, 166148, 164835, 163669, 162839, 162489, 162751, 163325, 163414, 162445, 160649, 158647, 156807, 155341, 154628, 154870, 155549, 155822, 155455, 154960, 154787, 154790, 154630, 154363, 154416, 155094, 156256, 157454, 158349, 158903, 159090, 158646, 157477, 156212, 155816, 156537, 157722, 158864, 160237, 162138, 164063, 165253, 165705, 166093, 166894, 168121, 169642, 171213, 172345, 172662, 172390, 172065, 171908, 171845, 171947, 172330, 172757, 172842, 172650, 172662, 173166, 174048, 175133, 176360, 177548, 178342, 178448, 177800, 176624, 175454, 174893, 175148, 176003, 177371, 179476, 182281, 185260, 188174, 191613, 196231, 201826, 207750, 213874, 220459, 227353, 233983, 239985, 245191, 249152, 251315, 251624, 250321, 247338, 242522, 236367, 229861, 223612, 217685, 212218, 207487, 203403, 199554, 195815, 192386, 189268, 186363, 184017, 182746, 182389, 182171, 181732, 181427, 181546, 181905, 182356, 183041]
54728A83041Q80P70O65R82J501J824K195L064M201N065N726O538P114O599M909
54713B35074K873J145l52j860l308m553n554o197o321n964n349m656l978l372
54699A87628k711j858j053p73r65r84n87l85q31j398j376r16o14n74n61o78j043
54682A70321j199o64J77N42L53J42L2l05q31j055p95l61L9M77Q95J061R24N91
54664A70344M9o41j030o83J66P89P33J72l70l33M26J268J295N30K4L57Q53P75
54646A74724N20O75P62j6j248j812j435p28j7O25O11m92j652j278M74J710J334
54629A72757K93j42O4L26M94N57K77k30l23J70N49L14r8k21l38p28q57j50J053
54610A73767J953K297K252J772Q11j56n54m45k93k60k52l83q04j230j204p57l59
$$ y = [183041, 183921, 184691, 185356, 186338, 187839, 189663, 191858, 194922, 199123, 204188, 209914, 216452, 223566, 230165, 235074, 237947, 239092, 238740, 236880, 233572, 229019, 223465, 217268, 210947, 204983, 199634, 194978, 191000, 187628, 184917, 183059, 182006, 181233, 180268, 179284, 178697, 178312, 177481, 176083, 174707, 173791, 173177, 172603, 172042, 171364, 170321, 169122, 168458, 168635, 169177, 169530, 169672, 169704, 169399, 168568, 167513, 166718, 166357, 166396, 166873, 167768, 168829, 169753, 170344, 170393, 169752, 168722, 168039, 168205, 168994, 169727, 169899, 169529, 169196, 169622, 170890, 172185, 172715, 172739, 173096, 173949, 174724, 175244, 175919, 176681, 176665, 175417, 173605, 172170, 171442, 171425, 172050, 172661, 172169, 170517, 169239, 169713, 171423, 172757, 173050, 172908, 172972, 173298, 173792, 174349, 174626, 174396, 174073, 174243, 174792, 175106, 175008, 174787, 174449, 173721, 172864, 172714, 173767, 175720, 178017, 180269, 182041, 182852, 182696, 182142, 181697, 181404, 181144, 180892, 180509, 179705, 178475, 177271, 176514, 176155]
54593A76155k27j92j16n3N1L42O75O13m4q46j023k15J111J970J676M96o20r50
54575A78803o27l34m96q60p95QJ083J552J063K42l4L48P40P18N82P79J205J377
54557A85354J091O66N10O16N74R6m88m72L50J263J295K41j152j962j813j014j85
54540A84970K48L92O01Q47P48L35L06J037J862J922J410J199J407J286N82R6M60
54523A99708J131J099K22o69p74o3Q39J214Q01m6p30r84r66r03q27o80m47k04
54505A97721j28l22n13k06N60R77M43n00q48m57n2OJ03N01Q73R31P87M59k26r67
54485A99142r58k0R32J057O70N82Q32Q94O97O82R59J145J118J244J704K095J936
54468B14711J263N23J17K19P30J218J135L93l76m32K02P69O79J51k26k38j00K1
$$ y = [176155, 175928, 175736, 175620, 175567, 175618, 175960, 176635, 177248, 177204, 176358, 175335, 175120, 176231, 178201, 179877, 180373, 179753, 178803, 178176, 177842, 177346, 176486, 175691, 175699, 176782, 178334, 179397, 179639, 179605, 179953, 180693, 181411, 181993, 182772, 183977, 185354, 186445, 187111, 187621, 188237, 188811, 188907, 188419, 187947, 188297, 189560, 190855, 191096, 189944, 187982, 186169, 185155, 184970, 185218, 185610, 186211, 187058, 187806, 188141, 188447, 189484, 191346, 193268, 194678, 195877, 197284, 198570, 199152, 199248, 199708, 200839, 201938, 202160, 201491, 200717, 200654, 201493, 202707, 203508, 203462, 202732, 201748, 200782, 199879, 199052, 198372, 197925, 197721, 197593, 197271, 196758, 196552, 197112, 198089, 198532, 198032, 197184, 196727, 196675, 196681, 196784, 197285, 198158, 199089, 199876, 200335, 200109, 199142, 198184, 198164, 199096, 200153, 200823, 201405, 202237, 203131, 203828, 204510, 205469, 206614, 207732, 208976, 210680, 212775, 214711, 215974, 216497, 216614, 216833, 217563, 218781, 219916, 220309, 219933, 219501, 219703, 220472, 221151, 221302, 221076, 220838, 220738, 220759]
54450B20759J69L48M81N67N71K48m68j028q37k61l13j129j667j281p27r06j381
54433B13145j168l47J09j36n32p39r46j123r05l28J97O65J376J994J719O34j01
54416B13514K19R24J028M30l16p64o64K9P81P85O9l38J35O23L5j318k078j521
54398B11573k55O20N68n3m00k0N26L23m73o04N63J974K267J562R44O76K4j170
54380B18645j971j664p96l09k80q6M95J000R96O45L82L35L12K08J84L92P47J093
54362B20328J318J213N65l36n68M55J976K524J543r4j328j928k084j687o75L62
54346B21584O17L5o69r15p83o40o04n63m89n68r59j510j840j747j401r63l14N69
54328B08840J168R37O0p35j115j285j339j106p41o49o54n3J161J948J614Q03M93
$$ y = [220759, 220928, 221276, 221757, 222324, 222895, 223143, 222675, 221647, 220810, 220549, 220236, 219107, 217440, 216159, 215432, 214526, 213145, 211977, 211630, 211739, 211603, 211071, 210332, 209386, 208263, 207358, 207030, 207227, 207892, 209268, 211262, 212981, 213615, 213514, 213733, 214657, 215685, 216115, 215799, 215035, 214371, 214400, 215181, 215966, 216035, 215697, 215832, 216455, 216490, 215172, 213094, 211573, 211318, 211938, 212506, 212453, 212053, 212033, 212559, 212882, 212409, 211805, 212368, 214342, 216609, 218171, 219115, 219791, 219815, 218645, 216674, 215010, 214214, 213905, 213625, 213539, 214034, 215034, 216030, 216675, 217057, 217392, 217704, 217912, 218096, 218488, 219235, 220328, 221646, 222859, 223424, 223088, 222520, 222975, 224951, 227475, 229018, 228924, 227596, 225668, 223584, 221897, 221222, 221584, 222201, 222236, 221567, 220652, 219869, 219229, 218625, 218062, 217573, 217005, 216046, 214536, 212696, 210949, 209548, 208585, 208271, 208840, 210008, 210945, 211005, 210270, 209155, 207870, 206531, 205425, 204684, 204035, 203381, 203328, 204489, 206437, 208051, 208854, 209347]
54311B09347O48O18L56K84L40R2l75n54m35n21q48q05j64M51M54P8j34j55l21
54292B08356n96o25l49j51k49l11J15R61J690J886J549Q44n7q09r54m95l5j3l8
54273B10719N02J427J924J597P44l19j420k086j778q73m50p88q79K3J172J451
54257B10966R83P81J192J660J808J818J778J429O78j79q51j226j199p91m10m93
54241B17944q74j032r35j067j562j838j373l99M07O71N27K99J86J22p8m17o03
54224B09978m57l21o90j488j942j424j82Q73J027L98k40k40K94O47L14n14j248
54207B04785j520j400j175j083j054p37R5J034J352R22M37M62P09O08K67K40N99
54190B04541P43J90q10j533j359k38J194K004J772R41J60m26r76j325j122n51
$$ y = [209347, 209995, 210613, 210969, 211253, 211593, 211685, 211310, 210756, 210321, 209800, 208952, 208147, 207983, 208434, 208888, 208966, 208832, 208677, 208356, 207760, 207135, 206786, 206635, 206386, 206075, 206190, 207151, 208841, 210727, 212276, 213120, 213063, 212254, 211300, 210805, 210770, 210757, 210719, 211221, 212648, 214572, 216169, 216913, 216594, 215174, 213088, 211310, 210437, 209987, 209199, 208320, 208343, 209515, 210966, 211949, 212730, 213922, 215582, 217390, 219208, 220986, 222415, 223093, 222914, 222063, 220837, 219638, 218847, 218437, 217944, 217070, 216038, 215103, 214036, 212474, 210636, 209263, 208864, 209271, 209942, 210469, 210768, 210954, 211076, 210998, 210581, 209978, 209521, 209200, 208510, 207022, 205080, 203656, 203474, 204347, 205374, 205772, 205532, 205292, 205586, 206233, 206547, 206033, 204785, 203265, 201865, 200690, 199607, 198553, 197816, 197911, 198945, 200297, 201219, 201656, 202118, 202827, 203435, 203702, 203942, 204541, 205284, 205474, 204664, 203131, 201772, 201534, 202728, 204732, 206504, 207445, 207605, 207179, 206203, 204878, 203756, 203205]
54174B03205l14p59j389j424o97K66Q70J031J046J034P26J5n46l33L25L67n29
54157B02894j362j142j72N49P33P60O93K58k86k13N48J124Q02j10p47n80K38R91
54139B04978Q52k99j421j295m4R61R32N72P98J278J023m5r53r42k10O39J236J473
54121B09533J382J201J223J385J314Q49K91l2q7J12O95J598K267K219J682J319
54105B26951J347J445J492J775K304K443J673K93r88j886k503k823k754k474k241
54090B24054j965j457r35q08j113j547j899j971j412l26L69N5m73l1J027J230
54074B12798L50j75M33J100P58P5K13R53J257Q92L00m34j310j662r43J26L95q5
54056B15041l36j03L5p5K6L58M66M15P34J248J165M58N1M20J050J529K058K505
$$ y = [203205, 202891, 202132, 200743, 199319, 198622, 198888, 199758, 200789, 201835, 202869, 203595, 203610, 203064, 202731, 203056, 203423, 202894, 201532, 200390, 200218, 200767, 201500, 202260, 202953, 203211, 202925, 202712, 203260, 204384, 205186, 205076, 204329, 203749, 203987, 204978, 205830, 205531, 204110, 202815, 202771, 203732, 204664, 205236, 206034, 207312, 208335, 208290, 207337, 206395, 206185, 206824, 208060, 209533, 210915, 212116, 213339, 214724, 216038, 216887, 217178, 217146, 217059, 217171, 217866, 219464, 221731, 223950, 225632, 226951, 228298, 229743, 231235, 233010, 235314, 237757, 239430, 239723, 238735, 236849, 234346, 231523, 228769, 226295, 224054, 222089, 220632, 219697, 218889, 217776, 216229, 214330, 212359, 210947, 210621, 210990, 211045, 210572, 210541, 211568, 212798, 213148, 212973, 213406, 214506, 215264, 215339, 215552, 216505, 217762, 218654, 218954, 218520, 217210, 215548, 214605, 214731, 215126, 215041, 214705, 214602, 214637, 214562, 214588, 214946, 215412, 215827, 216561, 217809, 218974, 219432, 219483, 219903, 220953, 222482, 224540, 227045]
54038B27045K123Q24j54L63K097L818M675M523L653K801K813L666M227L584K279
54023B68337J618J985K512K337J669J402J862K231J472k27j415j143j92O3m70
54008B82041q60r03j348k298k821k631k787l944m966m370k442p49j01QJ06J9m82
53991B51472j080j272r31m32l60r94j855k066j365m81j96m57p54r37j105j123
53975B36064q30m84m19m94l77j85k25l29q2L60L67j65n95m14J01L71K68J51L81
53956B33464Q91J147O35m04r57l52Q25J413J185J014J493K132K256K021K022K297
53940B51082K394K212K070J981J608J145J496L033M618M741L494K582L118M243
53926B89817M435L531K643K355K086J270L44J33P89J820K724L215L151K703K427
$$ y = [227045, 229168, 229992, 229838, 230201, 232298, 236116, 240791, 245314, 248967, 251768, 254581, 258247, 262474, 266058, 268337, 269955, 271940, 274452, 276789, 278458, 279860, 281722, 283953, 285425, 285198, 283783, 282640, 282448, 282511, 282041, 281181, 280278, 278930, 276632, 273811, 271180, 268393, 264449, 259483, 255113, 252671, 251922, 251821, 251829, 251935, 251954, 251472, 250392, 249120, 248189, 247757, 247397, 246403, 244548, 242482, 241117, 240636, 240440, 239983, 239229, 238292, 237187, 236064, 235234, 234750, 234331, 233837, 233460, 233275, 233050, 232721, 232639, 232999, 233366, 233201, 232606, 232192, 232293, 232664, 232932, 233083, 233464, 234355, 235502, 236137, 235733, 234776, 234424, 235249, 236662, 237847, 238861, 240354, 242486, 244742, 246763, 248785, 251082, 253476, 255688, 257758, 259739, 261347, 262492, 263988, 267021, 271639, 276380, 279874, 282456, 285574, 289817, 294252, 297783, 300426, 302781, 304867, 306137, 306481, 306614, 307403, 309223, 311947, 315162, 318313, 321016, 323443]
53911C23443K740L420L914M033M064M263M561M732M614M095L125J833N87k34n63
53896C68627o78q47r44o78k14j65p19j146p34P3K31k60o2J811M736P366R240J1029
53878C96666J3565J7205K1918K7424L3024L7464L8863L5015K4620Q959p923k1585
53866F25215l0023l4123l5601l5165l2723k8720k4471k1120j8602j6018j3008
53855C35641j0368r028q763q428p345n892m673l774l112k807k721k166p53P92
53841B66603J335O96k21n94m71l25m24p24j095j433j664j771j754j610j353r78
53825B54217l71M52J070R83L05l20o35j053j640j592l61J193J657Q78K6L1P33
53808B55573J577K235K324J519L40P7J288K901L506L089K816L334M044M123L538
$$ y = [323443, 326183, 329603, 333517, 337550, 341614, 345877, 350438, 355170, 359784, 363879, 367004, 368837, 369424, 369190, 368627, 367949, 367102, 366158, 365480, 365266, 365101, 364382, 363236, 362502, 362575, 362806, 362546, 362484, 364295, 369031, 376397, 385637, 396666, 410231, 427436, 449354, 476778, 509802, 547266, 586129, 621144, 645764, 654723, 646800, 625215, 595192, 561069, 525468, 490303, 457580, 428860, 404389, 383269, 364667, 348649, 335641, 325273, 316245, 307482, 299054, 291709, 285817, 281144, 277370, 274258, 271451, 268730, 266564, 265811, 266603, 267938, 268634, 268413, 267819, 267348, 267023, 266599, 265875, 264780, 263347, 261683, 259912, 258158, 256548, 255195, 254217, 253846, 254298, 255368, 256351, 256656, 256336, 255701, 254648, 253008, 251416, 251055, 252248, 253905, 254783, 254809, 254840, 255573, 257150, 259385, 261709, 263228, 263568, 263645, 264933, 267834, 271340, 274429, 277245, 280579, 284623, 288746, 292284]
53793B92284K801K195J686J304J176J196J090Q92J016J571J978J630P72K49L61
53778C12201N31K14m01r09j371j984k485k509k262k226k355k195j782j645j864
53763B88958j835j301r09j329k223k673k320j595j036p70o56n51m34m82q99j510
53747B68435j742j302o76m99o35l76L35O05j64j195j080N07K342K946K057O51
53731B70209j50L2Q55J729K190K013J322N81L49Q21J626K203K398K525K833L068
53715B94604K782J982J193Q54Q75R16Q71R56J393K159K987L561L735L613L404
53700C25885L214L136L348L913M479M604M439M621N258N573M959M015L895M830
53686C86169O016O849P659Q978J0741J2586J4615J7374K1142K5260K8121K7769
$$ y = [292284, 295085, 297280, 298966, 300270, 301446, 302642, 303732, 304624, 305640, 307211, 309189, 310819, 311591, 311840, 312201, 312732, 312946, 312545, 311636, 310265, 308281, 305796, 303287, 301025, 298799, 296444, 294249, 292467, 290822, 288958, 287123, 285822, 284913, 283584, 281361, 278688, 276368, 274773, 273737, 272967, 272311, 271760, 271326, 270844, 269945, 268435, 266693, 265391, 264715, 264216, 263581, 263205, 263540, 264145, 263981, 262786, 261706, 262213, 264555, 267501, 269558, 270209, 270059, 270091, 270946, 272675, 274865, 276878, 278200, 278781, 279130, 279951, 281577, 283780, 286178, 288703, 291536, 294604, 297386, 299368, 300561, 301415, 302290, 303206, 304077, 305033, 306426, 308585, 311572, 315133, 318868, 322481, 325885, 329099, 332235, 335583, 339496, 343975, 348579, 353018, 357639, 362897, 368470, 373429, 377444, 381339, 386169, 392185, 399034, 406693, 415671, 426412, 438998, 453613, 470987, 492129, 517389, 545510, 573279]
53674E73279K2893J3655J818r891j8813k3493k4310k2958k0922j8519j5606j2708
53662D44425j0774r974r476q587p456o465n522m350l050k004j470j429j651j780
53648C70437j608j308j119q84l35L03N09L06K43N53R77J479K318L184L209K194
53632C80458J019L15m03j653k932l485l353k817j544O12K551K981K234J814K268
53617C78065K735K673K679L278L971M178M198M538M882M490L335K191J714J896
53603D24823K372K865L304L689L933L854L421K974K931L248L376K868J852Q42
53589D66352J66k86q38j531j968j701q59r4J16j43o47j446k498l261l175k442
53573D45745j824j796k202k735l176l211k559j456o50o68j226j563j238n18n4
$$ y = [573279, 596172, 609827, 611645, 601754, 582941, 559448, 535138, 512180, 491258, 472739, 457133, 444425, 433651, 423677, 414201, 405614, 398158, 391693, 386171, 381821, 378771, 376767, 375297, 373868, 372217, 370437, 368829, 367521, 366402, 365518, 365183, 365486, 365995, 366301, 366544, 367097, 368074, 369553, 371871, 375055, 378264, 380458, 381477, 381792, 381389, 379736, 376804, 373319, 369966, 367149, 365605, 366217, 368768, 371749, 373983, 375797, 378065, 380800, 383473, 386152, 389430, 393401, 397579, 401777, 406315, 411197, 415687, 419022, 421213, 422927, 424823, 427195, 430060, 433364, 437053, 440986, 444840, 448261, 451235, 454166, 457414, 460790, 463658, 465510, 466352, 466518, 466232, 465394, 463863, 461895, 460194, 459335, 459241, 459357, 459214, 458567, 457121, 454623, 451362, 448187, 445745, 443921, 442125, 439923, 437188, 434012, 430801, 428242, 426786, 426136, 425468, 424242, 422679, 421441, 420923, 420869]
53558D20869j31l37o9O42J148J119J019J299J620J341N89J65N26J324J988K338
53542D35450K473K466K320K134K223L004M484N912O411O182O519Q238J0643J2512
53528E10971J3587J4387J5123J5668J6305J7594J9504K1462K3104K4248K4372
53517G16325K3081K0971J9114J7688J6107J4524J3934J4594J5483J5867J6350
53506I04038J7699J9603K1281K2544K3493K3869K3579K3245K3384K3484K2832
53495A149051K1867K1741K2697K3745K4091K4015K4143K4525K4757K4547K3857
53484A409036K2751K1451K0349J9737J9465J9005J7937J6474J5370J5149J5424
53473A612148J5230J4045J2192J0193Q111N766L215O49j940m678p454r943j1924
$$ y = [420869, 420738, 420401, 420332, 420974, 422122, 423241, 424260, 425559, 427179, 428520, 429109, 429274, 429800, 431124, 433112, 435450, 437923, 440389, 442709, 444843, 447066, 450070, 454554, 460466, 466877, 473059, 479578, 487816, 498459, 510971, 524558, 538945, 554068, 569736, 586041, 603635, 623139, 644601, 667705, 691953, 716325, 739406, 760377, 779491, 797179, 813286, 827810, 841744, 856338, 871821, 887688, 904038, 921737, 941340, 962621, 985165, 1008658, 1032527, 1056106, 1079351, 1102735, 1126219, 1149051, 1170918, 1192659, 1215356, 1239101, 1263192, 1287207, 1311350, 1335875, 1360632, 1385179, 1409036, 1431787, 1453238, 1473587, 1493324, 1512789, 1531794, 1549731, 1566205, 1581575, 1596724, 1612148, 1627378, 1641423, 1653615, 1663808, 1671919, 1677685, 1680900, 1681549, 1679609, 1674931, 1667477, 1657534, 1645610]
53460A645610j3357j4299j5004j5962j7489j9236k0419k0707k0665k1119k2148
53449A445205k2920k2662k1541k0332j9325j8046j6144j4021j2240j0769r372
53438A257833q355q275r092j0335j1938j4067j6162j7054j6313j4639j2607r904
53426A109092o360k864m48J083K787N137P701J0116J2542J5127J7603J9662K1336
53413A212514K2819K4143K5221K6068K6949K8306L0378L2850L5048L6702L8274
53402A539272M0396M3076M5794M8180N0377N2760N5456N8142O0236O1401O1920
53391B117010O2424O3213O4029O4589O4989O5430O5765O5523O4271O1877N8627
53380B817747N5103N1712M8261M4286L9878L5815L2628K9869K6579K2321J7536
$$ y = [1645610, 1632253, 1617954, 1602950, 1586988, 1569499, 1550263, 1529844, 1509137, 1488472, 1467353, 1445205, 1422285, 1399623, 1378082, 1357750, 1338425, 1320379, 1304235, 1290214, 1277974, 1267205, 1257833, 1249478, 1241203, 1232111, 1221776, 1209838, 1195771, 1179609, 1162555, 1146242, 1131603, 1118996, 1109092, 1102732, 1099868, 1099420, 1100503, 1103290, 1108427, 1116128, 1126244, 1138786, 1153913, 1171516, 1191178, 1212514, 1235333, 1259476, 1284697, 1310765, 1337714, 1366020, 1396398, 1429248, 1464296, 1500998, 1539272, 1579668, 1622744, 1668538, 1716718, 1767095, 1819855, 1875311, 1933453, 1993689, 2055090, 2117010, 2179434, 2242647, 2306676, 2371265, 2436254, 2501684, 2567449, 2632972, 2697243, 2759120, 2817747, 2872850, 2924562, 2972823, 3017109, 3056987, 3092802, 3125430, 3155299, 3181878, 3204199, 3221735]
53369C221735J3045R315N933J746m159j1493j9188k6784l4819m3544n1930n8503
53357C001354o2874o5781o7908o9275o9759o9618o9242o8665o7532o5517o2801
53346B262382o0126n8202n7056n6223n5517n5154n5028n4425n2834n0608m8380
53335A658829m6211m3772m1121l8664l6412l3781l0234k5925k1741j8771j7480
53324A304717j7215j6735j5436j3830j2613j1727j0707r487q331p230n967m641
53312A170798l591k821j945p22P40K272L793N166O218O952P545Q291R600J1813
53298A224109J4750J7682K0125K2322K4622K6674K7892K8460K9303L0929L2837
53287A499705L4105L4213L3247L1638K9824K7923K5794K3487K1400J9691J7851
$$ y = [3221735, 3234780, 3244095, 3250028, 3251774, 3247615, 3236122, 3216934, 3190150, 3155331, 3111787, 3059857, 3001354, 2938480, 2872699, 2804791, 2735516, 2665757, 2596139, 2526897, 2458232, 2390700, 2325183, 2262382, 2202256, 2144054, 2086998, 2030775, 1975258, 1920104, 1865076, 1810651, 1757817, 1707209, 1658829, 1612618, 1568846, 1527725, 1489061, 1452649, 1418868, 1388634, 1362709, 1340968, 1322197, 1304717, 1287502, 1270767, 1255331, 1241501, 1228888, 1217161, 1206454, 1196967, 1188636, 1181406, 1175439, 1170798, 1167207, 1164386, 1162441, 1161719, 1162459, 1164731, 1168524, 1173690, 1179908, 1186860, 1194405, 1202696, 1212296, 1224109, 1238859, 1256541, 1276666, 1298988, 1323610, 1350284, 1378176, 1406636, 1435939, 1466868, 1499705, 1533810, 1568023, 1601270, 1632908, 1662732, 1690655, 1716449, 1739936, 1761336, 1781027, 1798878]
53276A798878J5342J2436R827P575N016J790j629m563o802q576j0214j2041j4281
53263A792758j6895j9720k2744k5986k9133l1693l3505l4870l6127l7400l8662
53252A466023l9702m0102l9601l8475l7241l6043l4729l3403l2411l1724l0920
53241A071672k9859k8865k8129k7453k6830k6674k7132k7543k7065k5590k3632
53230G72900k1563j9336j6899j4516j2582j1361j0857j0816j0813j0534j0010
53219F23613r493r187r143r357r754j0127j0234j0119j0171j0647j1193j1162
53207E03026j0430r618r182q756p771o470n678n670n982o323o900p630p851p240
53193C97525o345n708n156m469m055m219m336l750k945k862l357l457k972k681
$$ y = [1798878, 1814220, 1826656, 1836483, 1844058, 1849074, 1850864, 1849235, 1844672, 1837870, 1829294, 1819080, 1807039, 1792758, 1775863, 1756143, 1733399, 1707413, 1678280, 1646587, 1613082, 1578212, 1542085, 1504685, 1466023, 1426321, 1386219, 1346618, 1308143, 1270902, 1234859, 1200130, 1166727, 1134316, 1102592, 1071672, 1041813, 1012948, 984819, 957366, 930536, 903862, 876730, 849187, 822122, 796532, 772900, 751337, 732001, 715102, 700586, 688004, 676643, 665786, 654970, 644157, 633623, 623613, 614120, 604933, 595790, 586433, 576679, 566552, 556318, 546199, 536028, 525381, 514188, 503026, 492596, 482978, 473796, 465040, 457269, 450799, 445121, 439451, 433469, 427146, 420246, 412616, 404765, 397525, 391180, 385472, 380316, 375847, 371792, 367573, 363237, 359487, 356542, 353680, 350323, 346866, 343894, 341213]
53179C41213k919l048k636k102j852j594j030m10K3M62R46J002M18k25l88l54
53163C27506o16r21o08L42J259J580J215L33p19j365j229o07r5K13O91J365J642
53146C29986J095J53l22l5M41L88k31p14l74Q29K265L112K839J612L51J11J055
53129C42561K209K523K021J510J417J407J166Q78Q24R58J176J570K111K395K033
53114C66759J091n4j050j636j630j171p74q95j485k144k625l011l447l855l920
53099C40153l398k460j623j217j034p53n32q06j530k079j985j441r32o42m17j36
53083C19168R1On19j197j465j131p11p80j147j114m98J61M21M19L92K65l1k75
53065C12055k89k03j31O4M62Q48J005J034J116J216J177Q85L00m23q37n65J59
$$ y = [341213, 338294, 335246, 332610, 330508, 328656, 327062, 326032, 325622, 325645, 326107, 327053, 328055, 328473, 328248, 327860, 327506, 326890, 325969, 325361, 325703, 326962, 328542, 329757, 330090, 329371, 328006, 326777, 326170, 326075, 326288, 326979, 328344, 329986, 331081, 331234, 330912, 330877, 331318, 331706, 331475, 330761, 330387, 331216, 333481, 336593, 339432, 341044, 341395, 341506, 342561, 344770, 347293, 349314, 350824, 352241, 353648, 354814, 355692, 356516, 357474, 358650, 360220, 362331, 364726, 366759, 367850, 367796, 366746, 365110, 363480, 362309, 361535, 360640, 359155, 357011, 354386, 351375, 347928, 344073, 340153, 336755, 334295, 332672, 331455, 330421, 329668, 329136, 328330, 326800, 324721, 322736, 321295, 320363, 319721, 319304, 319168, 319259, 319265, 318746, 317549, 316084, 314953, 314242, 313462, 312315, 311201, 310703, 310864, 311285, 311704, 312096, 312361, 312330, 312055, 311766, 311563, 311432, 311496, 311958, 312806, 313811, 314845, 315961, 317177, 318354, 319239, 319539, 319116, 318279, 317714, 317873]
53048C17873P09Q62R30J013P21j33j106j683j857j851j715j493j364j303j029
53033C08574n69m12p63j110r28l65J80O86J257J674J742J658J551J100J94m55
53017C14014j00R11J562J495J148P70K05l85m09K39Q35P10K3n89p25m04R2L44
52999C19736P8m79p58n06n2J06k31q92j443j381n97K89N06J37O1P63J610J758
52981C18705J379J395K106K646K000K71j409k065j708j011m83k02j35k63l83j03
52965C20740O79J526J865J531Q47K96K37O85J224J295P93J46l04p29j314j708
52949C27809j481r29q59j504k188k242j840j587j552j147p5R84R63l63j931k467
52933C09591j741n93J92N32N93K96m28j230j631j540j165o39n2L54M04K70K25
$$ y = [317873, 318582, 319444, 320374, 321387, 322108, 321975, 320869, 319186, 317329, 315478, 313763, 312270, 310906, 309603, 308574, 308005, 307593, 306830, 305720, 304792, 304427, 304607, 305293, 306550, 308224, 309966, 311624, 313175, 314275, 314469, 314014, 313914, 314825, 316387, 317882, 319030, 319800, 320005, 319620, 319211, 319450, 320285, 320995, 321018, 320429, 319704, 319300, 319392, 319736, 319814, 319335, 318577, 318071, 318019, 318125, 317894, 317002, 315559, 314178, 313581, 313870, 314376, 314513, 314574, 315337, 316947, 318705, 320084, 321479, 323585, 326231, 328231, 328502, 327093, 325028, 323320, 322309, 321826, 321624, 321489, 321226, 320843, 320740, 321419, 322945, 324810, 326341, 327188, 327484, 327721, 328406, 329630, 330925, 331718, 331864, 331560, 330831, 329517, 327809, 326328, 325399, 324540, 323036, 320848, 318606, 316766, 315179, 313627, 312480, 312405, 313389, 314352, 313989, 312058, 309591, 307850, 307257, 307449, 307981, 308574, 308870, 308442, 307212, 305581, 304041, 302876, 302237, 302185, 302539, 302943, 303213, 303438]
52916C03438J99m0m04n39k64K96R58J487J490P85j53n39j61M29O62N15K21j92
52898C08188p44j165j039l08N51R05N80M9k0N23J127J203Q15M97M64K42p67k481
52880C08620l959m104k671o06P62Q93L44j11k73l14j97K27P44Q33L01m50p90l88
52862B98861N71J529J936J699J231J006J125J392J590J545J143N46J53J50K10
52847C14687o2n95r72r00m01K36N02rr88j509j059k53Ol05m97k90q4j93m18n02
52827C06394m69l94j88K09O92J071J106N61n02j632k427k847k874k300j263n00
52811B94637l90j54J123K965M097M390N054O654Q058P793N623K295j381m572o396
52796C29796o655o198n887n622m935m057l661l812l877l390k476j479o55j90j20
$$ y = [303438, 303637, 303597, 303193, 302654, 302390, 302686, 303644, 305131, 306621, 307406, 307253, 306714, 306553, 306982, 307644, 308159, 308380, 308188, 307444, 306279, 305240, 304932, 305483, 306388, 306968, 307017, 306997, 307520, 308647, 309850, 310665, 311162, 311626, 311868, 311101, 308620, 304661, 300557, 297886, 297280, 298042, 298935, 299279, 299168, 298895, 298581, 298384, 298611, 299355, 300188, 300489, 300039, 299249, 298861, 299432, 300961, 302897, 304596, 305827, 306833, 307958, 309350, 310940, 312485, 313628, 314174, 314327, 314477, 314687, 314625, 314030, 313058, 312158, 311757, 311993, 312495, 312486, 311498, 309989, 308930, 308677, 308683, 308378, 307881, 307591, 307507, 307314, 306896, 306394, 305925, 305531, 305343, 305552, 306244, 307315, 308421, 308982, 308480, 306848, 304421, 301574, 298700, 296400, 295137, 294637, 294247, 294093, 295216, 298181, 302278, 306668, 311722, 318376, 326434, 334227, 339850, 342145, 340764, 336192, 329796, 323141, 316943, 311056, 305434, 300499, 296442, 292781, 288969, 285092, 281702, 279226, 277747, 277092, 276902, 276782]
52781B76782k98n65r01j121q17J67J378K191K405K189J736J249R38P33K86l77
52765B85975o80l35L3k84r88j152m90M81J356K194K827K653J403k91j527j964
52749B89211j793j232l83N34J158J295J122R69R29Q11N39M06O60R71P71J45j32
52732B95981L08Q98J030Q76Q26O23j22r36q88L8Q32P84J73m36q85j177j217j159
52714B95549j410j948k139j603q06m09m20m63m57n53o12l07L31Q89J062Q98N88
52697B88190L00J75K64M47N11K53m05j176j345l94J133J900J261J28j49O06J408
52680B93107J511J145R28J158J696K092J762N47q41j394r11j12M15P98J248J495
52664C04644J251P95N36M02J52K4M19J137J486J259J021J278J853K304K606L071
$$ y = [276782, 276484, 275919, 275018, 273897, 273080, 273247, 274625, 276816, 279221, 281410, 283146, 284395, 285333, 286066, 286352, 285975, 285295, 284960, 284993, 284709, 283721, 282569, 282079, 282560, 283916, 286110, 288937, 291590, 292993, 292702, 291175, 289211, 287418, 286186, 285803, 286337, 287495, 288790, 289912, 290881, 291810, 292621, 293160, 293566, 294226, 295197, 295968, 296113, 295981, 296289, 297187, 298217, 299093, 299919, 300542, 300420, 299484, 298596, 298634, 299466, 300250, 300423, 299987, 299102, 297925, 296708, 295549, 294139, 292191, 290052, 288449, 287643, 287234, 286814, 286351, 285894, 285341, 284729, 284422, 284753, 285642, 286704, 287602, 288190, 288490, 288665, 288929, 289376, 289887, 290140, 289735, 288559, 287214, 286820, 287953, 289853, 291114, 291242, 291093, 291699, 293107, 294618, 295763, 296691, 297849, 299545, 301637, 303399, 303946, 303105, 301711, 300800, 300688, 301103, 301901, 303149, 304644, 305895, 306690, 307226, 307628, 307780, 307804, 308223, 309360, 310846, 312105, 313126, 314404, 316257, 318561, 321167, 324238]
52648C24238L719M065L578K181L24j374k492k960k967k822k763k744k402j512
52634C16069m62K0k39n47k41M79R45R82J033J391J879K214K217J632L19j201j990
52617C24500j708r91o16p01j034j504j815j343MJ173J031j13q59n77j16l76j015
52600C13940j112n72j50k22k43M24J551K219J792N54o16j035o99p2M30P46J013
52583C17948J287J422J285J046J097J611K168K116J313L26k30l04k08r4O9J92
52567C31044J74K14N95J110J154N58n3l1M27N53N8m68l04M70J023O96k37q10m00
52548C35773O09J268J101N16K03L49O55Q81J082J223R16j89j763k872k829j828
52532C35095o39J66N45O82P02O55M76m2r10j509j002N67J959K015R99J99L27Q87
$$ y = [324238, 327957, 332022, 335600, 337781, 338105, 336731, 334239, 331279, 328312, 325490, 322727, 319983, 317581, 316069, 315607, 315627, 315388, 314841, 314600, 315079, 316024, 317006, 318039, 319430, 321309, 323523, 325740, 327372, 327691, 326490, 324500, 322792, 321801, 321185, 320484, 319450, 317946, 316131, 314788, 314792, 315965, 316996, 316883, 316024, 315447, 315331, 314955, 313940, 312828, 312256, 312106, 311884, 311641, 312065, 313616, 315835, 317627, 318181, 317565, 316530, 315831, 315759, 316189, 316935, 317948, 319235, 320657, 321942, 322988, 324085, 325696, 327864, 329980, 331293, 331619, 331389, 331085, 330877, 330783, 330852, 331044, 331218, 331432, 332027, 333137, 334291, 334849, 334796, 334765, 335192, 335745, 335803, 335335, 335031, 335501, 336524, 337220, 336983, 336173, 335773, 336382, 337650, 338751, 339267, 339470, 339819, 340474, 341355, 342437, 343660, 344576, 344387, 342624, 339752, 336923, 335095, 334456, 334622, 335167, 335849, 336551, 337206, 337682, 337640, 336730, 335221, 334219, 334786, 336745, 338760, 339759, 339958, 340285, 341172]
52514C41172J196J350J767K244K119J363Q99J545K866L581L027J792P78M5q98
52499C64846k057k797k812k593k698l061l339l399l154k302q47M75Q83N15J58
52484C37818J99L94N97R99J581J968K018J999J959J462L33p88j066m09N70J297
52468C50931J617J621J473J373J417J539J756K317L312M217M211L068J442J10
52454C80404r10k177l816n091n155m023k525j389p55m94n83r88j532k060k465
52439C46441k430j592k28O97N75o9l07M9M34M29J06l12o42p37q15j381k343k591
52421C35284j308N36J093M5r68n51Q02J760J883J644J448J374J576K252L331M549
52405C54750N672O583P462Q925J1418J4320J6181J6119J4324J1063O118j82o222
$$ y = [341172, 342368, 343718, 345485, 347729, 349848, 351211, 352110, 353655, 356521, 360102, 363129, 364921, 365699, 365744, 364846, 362789, 359992, 357180, 354587, 351889, 348828, 345489, 342090, 338936, 336634, 335787, 336262, 337145, 337660, 337818, 338017, 338411, 339008, 340007, 341588, 343556, 345574, 347573, 349532, 350994, 351327, 350539, 349473, 349064, 349634, 350931, 352548, 354169, 355642, 357015, 358432, 359971, 361727, 364044, 367356, 371573, 375784, 378852, 380294, 380404, 379494, 377317, 373501, 368410, 363255, 359232, 356707, 355318, 354563, 354069, 353486, 352498, 350966, 348906, 346441, 344011, 342419, 342191, 342888, 343463, 343394, 343087, 343136, 343570, 343999, 344105, 343793, 343151, 342414, 341599, 340218, 337875, 335284, 333976, 334512, 335605, 335650, 334682, 334131, 334933, 336693, 338576, 340220, 341668, 343042, 344618, 346870, 350201, 354750, 360422, 367005, 374467, 383392, 394810, 409130, 425311, 441430, 455754, 466817, 472935, 472753, 466531]
52392D66531j0307j2106j2332j1575j0267r148q601p861n893l143j245r64j300
52379C71789j028k24J86j57o91o64J79J561K994M107M727M772M271L593L298L464
52363D02177L404K443P82q06j947k755l215l003k054q41J23O84R26R64R42R24
52347C98748P93M90K32J81R0j82n3J164L008M048L640K763K652L241L609L523
52331D27947L667M475N486O122O560P393Q693R834J0309J0334J0541J1238J2156
52318E34755J2792J2765J1916J0438Q986Q315Q598R346J0173J1257J2698J3870
52306F65909J4032J3449J3250J3999J4983J5209J4707J4345J4583J4901J4565
52295H23932J3558J2479J1597J0483Q690O456M361K560Q66n44j236j427k015l324
$$ y = [466531, 456224, 444118, 431786, 420211, 409944, 400796, 392195, 384334, 378441, 375298, 374053, 373089, 371789, 370761, 370537, 370723, 370566, 369875, 369211, 369390, 370951, 373945, 378052, 382779, 387551, 391822, 395415, 398713, 402177, 405581, 408024, 408806, 408000, 406053, 403298, 400083, 397080, 395026, 394185, 394308, 394992, 395918, 396882, 397824, 398748, 399541, 400031, 400263, 400444, 400534, 400352, 400299, 401463, 404471, 408519, 412159, 414922, 417574, 420815, 424424, 427947, 431614, 436089, 441575, 447697, 454257, 461650, 470343, 480177, 490486, 500820, 511361, 522599, 534755, 547547, 560312, 572228, 582666, 591652, 599967, 608565, 617911, 628084, 639341, 652039, 665909, 679941, 693390, 706640, 720639, 735622, 750831, 765538, 779883, 794466, 809367, 823932, 837490, 849969, 861566, 872049, 880739, 887195, 891556, 894116, 894982, 894438, 893202, 891775, 889760, 886436]
52281H86436m451m503l812l274k976k414j733j668k242k543k066j367j021p21
52267H51645O7J121J873K346L068M273N678P056Q553J0314J2051J3183J3406J3068
52253I47702J2903J3255J3748J3864J3620J3303J2697J1241Q934O508M526K883
52241A075184J479O88O56O91J8j142j997k360k726l201l247k764k632l629n225
52226A049793o090n700m786m250m193m255m366m708n133n183m644l681k472j110
52212I89222R9P69J016J457K311L056L270L370L927M722N081M910M622M317L806
52197A035955L377L644M495N080N153N585P011Q667R267Q593P516O713O022N005
52183A122083L542J777j18j971l597m897n876o605p225p842q329q371p845o951
$$ y = [886436, 881985, 877482, 873670, 870396, 867420, 865006, 863273, 861605, 859363, 856820, 854754, 853387, 852366, 851645, 851712, 852833, 854706, 857052, 860120, 864393, 870071, 877127, 885680, 895994, 908045, 921228, 934634, 947702, 960605, 973860, 987608, 1001472, 1015092, 1028395, 1041092, 1052333, 1061267, 1067775, 1072301, 1075184, 1076663, 1077351, 1078007, 1078698, 1078716, 1077574, 1075577, 1073217, 1070491, 1067290, 1064043, 1061279, 1058647, 1055018, 1049793, 1043703, 1038003, 1033217, 1028967, 1024774, 1020519, 1016153, 1011445, 1006312, 1001129, 996485, 992804, 990332, 989222, 989321, 990090, 991106, 992563, 994874, 997930, 1001200, 1004570, 1008497, 1013219, 1018300, 1023210, 1027832, 1032149, 1035955, 1039332, 1042976, 1047471, 1052551, 1057704, 1063289, 1070300, 1078967, 1088234, 1096827, 1104343, 1111056, 1117078, 1122083, 1125625, 1127402, 1127284, 1125313, 1121716, 1116819, 1110943, 1104338, 1097113, 1089271, 1080942, 1072571, 1064726, 1057775]
52169A057775n881m591l123j884j289j228j174p06K49J559K963M016M269L641
52155A054596K536J594J190J118P44k80j432j745r27L26J279J989K849L654L789
52140A071280L179K472K105J733Q15n66j780k365k426k393k557k839k899k424
52126A061335j340K34K170M343O548Q531J0231J1854J3651J5568J7258J8381J8884
52113A187648J8937J8724J8420J8293J8494J8734J8389J7244J5888J5050J4759
52102A380580J4600J4711J5778J7767J9388J9454J8440J7951J8700J9643J9198
52091A576210J6805J2981Q485L847o22m852q980j2801j5470j6205j5360j4153
52079A529885j3191j1831r406o571m730m400m796m985m718l999k622o39J241K305
$$ y = [1057775, 1051894, 1047303, 1044180, 1042296, 1041007, 1039779, 1038605, 1037899, 1038148, 1039707, 1042670, 1046686, 1050955, 1054596, 1057132, 1058726, 1059916, 1061034, 1061778, 1061498, 1060066, 1058321, 1057394, 1057720, 1058999, 1060988, 1063837, 1067491, 1071280, 1074459, 1076931, 1079036, 1080769, 1081584, 1081018, 1079238, 1076873, 1074447, 1072054, 1069497, 1066658, 1063759, 1061335, 1059995, 1060229, 1062399, 1066742, 1073290, 1081821, 1092052, 1103906, 1117557, 1133125, 1150383, 1168764, 1187648, 1206585, 1225309, 1243729, 1262022, 1280516, 1299250, 1317639, 1334883, 1350771, 1365821, 1380580, 1395180, 1409891, 1425669, 1443436, 1462824, 1482278, 1500718, 1518669, 1537369, 1557012, 1576210, 1593015, 1605996, 1614481, 1618328, 1617706, 1612854, 1603874, 1591073, 1575603, 1559398, 1544038, 1529885, 1516694, 1504863, 1495457, 1488886, 1484156, 1479756, 1474960, 1469975, 1465257, 1461258, 1458636, 1457997, 1459238, 1461543]
52065A461543K687L127M067N329O492P186P214O803O649P251Q280Q918Q813Q338
52051A552697P996P935P945P592O400M400K353J029K66p81k450m184n370n961
52037A579867o102n725m843l887l360l307l379l251k867k503k623l442m574n333
52023A524671n480n339n284n439n898o685p385p390o667n788n006l840j970j4
52009A452486J039Q97R2p39j424k270l790o213r210j2323j5658j9598k3757k6907
51995A332625k8261k8264k7723k6745k5049k2761k0288j7838j5738j4757j5334
51984A089867j6591j6961j5755j3617j1588j0362j0301j1470j3396j5333j6838
51973I37655j7787j8003j7421j6492j5743j4881j3004r899o536l937k080k36J965
$$ y = [1461543, 1464230, 1467357, 1471424, 1476753, 1483245, 1490431, 1497645, 1504448, 1511097, 1518348, 1526628, 1535546, 1544359, 1552697, 1560693, 1568628, 1576573, 1584165, 1590565, 1594965, 1597318, 1598347, 1598613, 1597832, 1595382, 1591198, 1585828, 1579867, 1573765, 1568040, 1563197, 1559310, 1555950, 1552643, 1549264, 1546013, 1543146, 1540643, 1538020, 1534578, 1530004, 1524671, 1519191, 1513852, 1508568, 1503129, 1497231, 1490546, 1483161, 1475771, 1469104, 1463316, 1458310, 1454470, 1452500, 1452486, 1453525, 1454422, 1454514, 1453775, 1452351, 1450081, 1446291, 1440078, 1430868, 1418545, 1402887, 1383289, 1359532, 1332625, 1304364, 1276100, 1248377, 1221632, 1196583, 1173822, 1153534, 1135696, 1119958, 1105201, 1089867, 1073276, 1056315, 1040560, 1026943, 1015355, 1004993, 994692, 983222, 969826, 954493, 937655, 919868, 901865, 884444, 867952, 852209, 837328, 824324, 814425, 807889, 803952, 801872, 801636, 803601]
51960H03601M251O246P860R172J0078J0086Q561N288Q66l682p617j0690j2763
51947H31257j3694j3615j2940j1886j0241p840m953k047P39L524O233Q428R678
51934G82643J0014R834R464Q873P863O369M345J523k360o914j1025j3718j5036
51921G91875j5828j6791j7783j7995j6762j4376j2143j1265j1542j1500j0107
51910F35783p856n869m388k806q47J084K762M589O923R410J1355J2558J3571J5101
51896F91370J7077J8256J6976J2580O039j025p623j3397j7816k0135k0268j9003
51884F63031j7182j5058j2526r577o337k992J80L031N798Q828J2032J5001J7647
51871F61876K0202K2458K3538K2714J9965J5570R673K711m180r798j3771j6467
$$ y = [803601, 807852, 814098, 821958, 831130, 841208, 851294, 859855, 865143, 866009, 862327, 854710, 844020, 831257, 817563, 803948, 791008, 779122, 768881, 761041, 756088, 754041, 754780, 758304, 764537, 772965, 782643, 792657, 802491, 811955, 820828, 828691, 835060, 839405, 840928, 838568, 831654, 820629, 806911, 791875, 776047, 759256, 741473, 723478, 706716, 692340, 680197, 668932, 657390, 645890, 635783, 627927, 622058, 617670, 614864, 614017, 615101, 617863, 622452, 629375, 638785, 650140, 662698, 676269, 691370, 708447, 726703, 743679, 756259, 762298, 761273, 753650, 740253, 722437, 702302, 682034, 663031, 645849, 630791, 618265, 608688, 602351, 599359, 599539, 602570, 608368, 617196, 629228, 644229, 661876, 682078, 704536, 728074, 750788, 770753, 786323, 795996, 798707, 794527, 784729, 770958, 754491]
51859G54491j8169j8772j8190j6612j4258j1248p800m385j483O95K152K914K986
51846F52321K531J890J266M34r49k699m013m337m137m422n488o466o280m760k640
51831F12251o21J249L269N390P059P774P556O731N395L525J509J04l39j41M67
51816F61178J838M287P487J1028J5081J9658K3426K4275K1254J5294P929J13p524
51803H05324j4085j8793k1584k2830k2749k1495j9575j7654j5950j4097j1723
51792F04789q961o459m817m042l610l121k722k672k775k550j873r34J88J407K124
51777E63972J546k80k342l720m310m293l601k236n82J110L167N924Q912J1151
51763E74418J2157J2363J2517J2808J2560J0760P114K496j868n505q581j0907
$$ y = [754491, 736322, 717550, 699360, 682748, 668490, 657242, 649442, 645057, 643574, 644269, 646421, 649335, 652321, 654852, 656742, 658008, 658442, 657493, 654794, 650781, 646444, 642307, 637885, 632397, 625931, 619651, 614891, 612251, 611630, 612879, 616148, 621538, 628597, 636371, 643927, 650658, 656053, 659578, 661087, 661191, 660852, 660711, 661178, 663016, 667303, 674790, 685818, 700899, 720557, 743983, 768258, 789512, 804806, 812735, 812848, 805324, 791239, 772446, 750862, 728032, 705283, 683788, 664213, 646559, 630609, 616512, 604789, 595828, 589369, 584552, 580510, 576900, 573779, 571057, 568385, 565610, 563060, 561187, 560253, 560441, 561848, 563972, 565518, 565238, 562896, 559176, 554866, 550573, 546972, 544736, 544154, 545264, 548431, 554355, 563267, 574418, 586575, 598938, 611455, 624263, 636823, 647583, 654697, 657193, 655325, 649820, 641239, 630332]
51751F30332j1938j1806j1470j1374j0787r080o975n684n293m807l563j794J15
51738E35876K134M339O673R136J1774J4398J6609J8011J8196J6689J3377Q885
51726F76097M246K83k403l228k010M44K648L419K313n44m447q013r785r198o756
51711F43066l426k24J769J792J07k058l492l685k555M0M311J0132J6546K1420
51697F83743K2130J7522R481J815k802m424m313k788P76O176J1524J4200J2486
51684G65526O571j491q910j3941j6689j8124j8507j7289j4339j0516o735l119
51672F42437L99L140M083L149J432K9p55q40L20L058O466Q841R292Q261O322L229
51656F98863j279o271j0053j1689j1501j0102p573l889M36M602Q197J1226J3381
$$ y = [630332, 618394, 606588, 595118, 583744, 572957, 563877, 556902, 551218, 545925, 541118, 537555, 535761, 535876, 538010, 542349, 549022, 558158, 569932, 584330, 600939, 618950, 637146, 653835, 667212, 676097, 680343, 680626, 678223, 674995, 672985, 673429, 676077, 679496, 681809, 681265, 676818, 668805, 659020, 649822, 643066, 639640, 639416, 641185, 642977, 643084, 641026, 637534, 633849, 631294, 631334, 635645, 645777, 662323, 683743, 705873, 723395, 732876, 734691, 731889, 727465, 723152, 720364, 721140, 727316, 738840, 753040, 765526, 772097, 770606, 761696, 747755, 731066, 712942, 694435, 677146, 662807, 652291, 645556, 642437, 642836, 645976, 650059, 653208, 654640, 654669, 653914, 653074, 653394, 656452, 662918, 671759, 681051, 689312, 695634, 698863, 697584, 691313, 681260, 669571, 658070, 647968, 640395, 636506, 636942, 641544, 649741, 660967, 674348]
51643F74348J3687J1070N353k241r687j5292j8478j9574j9166j7736j5698j3400
51631E73186j1055q847p088o000n318m423l061j673q06l60L00J532K944L775L596
51616E36702K631J528Q51P11P66N81M3n86r90j164j421k057l007l878m291m203
51600E22216l902l727l671l319k151r5K290M287N733P192R322J2153J4926J6573
51586E77827J6251J3693R378M559Q86m19O37K897N108P009R303J2677J7261K3006
51572G00073K9969L7511M3680M6424M5856M4735M6054N0197N4649N6251N3570
51561A208969M7594M0937L6580L6714M2029N1666O3798P6324Q7071R3492R2652
51550A877826Q2274O2516L6569Q961j7012m0161o0113p6179q7843r5592j00330
$$ y = [674348, 688035, 699105, 704458, 702217, 692530, 677238, 658760, 639186, 620020, 602284, 586586, 573186, 562131, 553284, 546196, 540196, 534878, 530455, 527394, 525721, 524915, 524555, 524855, 526387, 529331, 533106, 536702, 539333, 540861, 541712, 542423, 543189, 543770, 543813, 543227, 542237, 541073, 539652, 537595, 534588, 530710, 526419, 522216, 518314, 514587, 510916, 507597, 505446, 505351, 507641, 511928, 517661, 524853, 534175, 546328, 561254, 577827, 594078, 607771, 617149, 621708, 622594, 622175, 622812, 625709, 630817, 637826, 647129, 659806, 677067, 700073, 730042, 767553, 811233, 857657, 903513, 948248, 994302, 1044499, 1099148, 1155399, 1208969, 1256563, 1297500, 1334080, 1370794, 1412823, 1464489, 1528287, 1604611, 1691682, 1785174, 1877826, 1960100, 2022616, 2059185, 2068146, 2051134, 2010973, 1950860, 1874681, 1786838, 1691246, 1590916]
51539A590916j02206j00707r5906q8887q0777p1904o2257n2374m3309l5850l0015
51528H26724k5403k1723j8956j7042j5610j4110j2151r813p630o329o312p175
51516F64470p814p298n709l934k599j498j38J492K851L302K420Q1l357p029r941
51501F25299j1464j1573j0797r932r486r197q336o594m501k843j944j553j114
51488E35965m0J859L984N335N513M976M152K865J011q20k086l092m362n488n537
51473E44235m460l280k809k925l211l642m297m941n293n346n169m693l855k835
51459D87479j925j301r63p18l34K04P04J187K003L176M062M189M152N040P063
51444E14018R537J2092J5172J9336K4761L1390L8397M3332M3004L6250K5395J4411
$$ y = [1590916, 1488710, 1388003, 1292097, 1203210, 1122433, 1050529, 988272, 935898, 892589, 856739, 826724, 801321, 779598, 760642, 743600, 727990, 713880, 701729, 691916, 684286, 677957, 671645, 664470, 656656, 649358, 643649, 639715, 637116, 635618, 635480, 636972, 639823, 643125, 645545, 645626, 642269, 635240, 625299, 613835, 602262, 591465, 581533, 572047, 562850, 554514, 547920, 543419, 540576, 538632, 537079, 535965, 535925, 537784, 541768, 547103, 552616, 557592, 561744, 564609, 565620, 564800, 562714, 559622, 555260, 549772, 544235, 539775, 536495, 533686, 530761, 527550, 523908, 519611, 514670, 509377, 504031, 498862, 494169, 490314, 487479, 485554, 484253, 483290, 482572, 482238, 482442, 483146, 484333, 486336, 489512, 493574, 497763, 501915, 506955, 514018, 523555, 535647, 550819, 570155, 594916, 626306, 664703, 708035, 751039, 787289, 812684, 827095]
51432H27095O094J481Q56L757P882R333N097m554j6143k5446l0164l0762k9121
51419G25405k6576k3346j9471j5548j2184r238o247l371j259%J108K520L703L850
51405F19346L106K511K721L253L218K508J827J717K055K652L740N497P480R078
51391F70709J0281J1489J2742J3778J4844J6708J9700K3341K7216L1771L7864
51380H90443M5865N5468O6021P6788Q7165R6932J06135J14482J20916J23769J21133
51369A905117J11350R3994P0708M4551J8031q004l3386n7157p7667r3819j05663
51358A868055j13732j18178j18620j14773j07208r7488q7224p7009o6591n6117
51348I11115m6601l9039l3522k9477k6307k3549k1020j9053j8029j7392j5859
$$ y = [827095, 833189, 834670, 835526, 839283, 847165, 856498, 861595, 857041, 840898, 815452, 785288, 754526, 725405, 698829, 675483, 656012, 640464, 628280, 619042, 612795, 609424, 608165, 608165, 609273, 611793, 615496, 619346, 622452, 624963, 627684, 630937, 634155, 636663, 638490, 640207, 642262, 644914, 648654, 654151, 661631, 670709, 680990, 692479, 705221, 718999, 733843, 750551, 770251, 793592, 820808, 852579, 890443, 936308, 991776, 1057797, 1134585, 1221750, 1318682, 1424817, 1539299, 1660215, 1783984, 1905117, 2016467, 2110461, 2181169, 2225720, 2243751, 2235747, 2202361, 2145204, 2067537, 1973718, 1868055, 1754323, 1636145, 1517525, 1402752, 1295544, 1198056, 1110832, 1033823, 967232, 911115, 864514, 825475, 791953, 762476, 736169, 712620, 691600, 672547, 654518, 637126, 621267]
51337F21267j3101j0408r023q472p451n691m092l267l073l263l678l912l705l581
51323E38550m254n409o030n773n173m456l311j962j290j516j726j256o30m99n04
51308D94761M8J009J669J842J940K261K766L382M050M681N286N886O020M904K523
51293E43028N4j427k216l291m712n566n327m447l524k571j339K17J961L724N217
51278E19781O105O266N768M614K881J032l49j202j993k964l738l803l080j899
51264E27419o75K55P46R56J097J087O82qn80r41j385j929k095j714j380j547j696
51247E18292j061J15R64J498K774N236P758Q921Q606P686O573M927K604J04k063
51232E72934l820n135n790n810n661n718n835n746n472n013m079k592j187n68
$$ y = [621267, 608166, 597758, 588735, 580263, 572812, 567121, 563029, 559762, 556689, 553426, 549748, 545836, 542131, 538550, 534296, 528887, 522857, 517084, 511911, 507455, 504144, 502182, 500892, 499376, 497650, 496394, 495764, 495265, 494761, 494809, 495818, 497487, 499329, 501269, 503530, 506296, 509678, 513728, 518409, 523695, 529581, 535601, 540505, 543028, 543082, 541655, 539439, 536148, 531436, 525870, 520543, 516096, 512572, 510001, 508662, 508879, 510840, 514564, 519781, 525886, 532152, 537920, 542534, 545415, 546447, 546098, 544896, 542903, 539939, 536201, 532398, 529318, 527419, 526744, 526999, 527745, 528701, 529798, 530885, 531567, 531559, 530979, 530038, 528653, 526724, 524629, 522915, 521535, 519988, 518292, 517231, 517346, 518310, 519808, 522582, 527818, 535576, 544497, 553103, 560789, 567362, 572289, 574893, 574997, 572934, 569114, 563979, 558189, 552379, 546718, 541000, 535165, 529419, 523947, 518934, 514855, 512263, 511076, 510508]
51218E10508n51l79R6K23k65o30j06R76J580J211L08m81q90r06m74M26J668L088
51200E15402M600O045P087P431P145O602O054N318M018K097K1j547k225k060j308
51185E64680k66Q21J774K510K992L238L381L601L768L448K525J589J282J240L62
51170E96945j698l857m845m740m718n496o591p128o815n953m887l752k611j595
51156E32259q77n55n46o06n93n97p10p49m38K25J018J847K731L453L650L346L013
51139E45871K893K549J433l51k221l801n010n576n150m012l165l212l485k812
51125E13951j087M79Q28K96K9N49J449K301L122L836L990L435K827K834L188L172
51109E45199K817K824L335L611L217K739K823L141K985K356J775J274L94q54j771
$$ y = [510508, 509957, 509578, 509674, 509897, 509632, 509002, 508896, 509872, 511452, 512663, 512971, 512490, 511600, 510694, 510220, 510646, 512314, 515402, 520002, 526047, 533134, 540565, 547710, 554312, 560366, 565684, 569702, 571799, 571820, 570273, 568048, 565988, 564680, 564414, 565235, 567009, 569519, 572511, 575749, 579130, 582731, 586499, 589947, 592472, 594061, 595343, 596583, 596945, 595247, 591390, 586545, 581805, 577087, 571591, 565000, 557872, 551057, 545104, 540217, 536465, 533854, 532259, 531382, 530827, 530281, 529675, 529082, 528485, 527775, 527026, 526588, 526813, 527831, 529678, 532409, 535862, 539512, 542858, 545871, 548764, 551313, 552746, 552395, 550174, 546373, 541363, 535787, 530637, 526625, 523460, 520248, 516763, 513951, 512864, 513343, 514171, 514467, 514496, 515045, 516494, 518795, 521917, 525753, 529743, 533178, 536005, 538839, 542027, 545199, 548016, 550840, 554175, 557786, 561003, 563742, 566565, 569706, 572691, 575047, 576822, 578096, 578490, 577636, 575865]
51094E75865j855j325o31L2N31O20L03LJ21P13J767L367N181O239N700L784J540
51077F01955k19j459k434l188l603l749l853l969l810l045j798p03k69k64O7J135
51061E70794K664M130N235N913O297O798P724Q543Q058N810K945J169J143K368
51047F39591M240O433Q344R151Q714P839P350P288P289P245P254P348P760R062
51033G44908J1511J4261J5705J4747J1588P281K770j537n464q714j1060j2776
51021G83220j4489j6347j7587j7308j5504j2995j0402p719m898k284j54J716L669
51008F68918N596P072P877Q176Q350Q834R850J1040J1630J1229J0242R224Q130
50995G86168O633M957L770L223K711J850J179J478K594L493L566L443M302O585
$$ y = [575865, 574010, 572685, 572054, 572086, 572617, 573237, 573540, 573543, 573664, 574377, 576144, 579511, 584692, 590931, 596631, 600415, 601955, 601736, 600277, 597843, 594655, 591052, 587303, 583450, 579481, 575671, 572626, 570828, 570125, 569856, 569592, 569659, 570794, 573458, 577588, 582823, 588736, 595033, 601831, 609555, 618098, 626156, 631966, 634911, 636080, 637223, 639591, 643831, 650264, 658608, 667759, 676473, 684312, 691662, 698950, 706239, 713484, 720738, 728086, 735846, 744908, 756419, 770680, 786385, 801132, 812720, 820001, 822771, 821234, 815770, 807056, 795996, 783220, 768731, 752384, 734797, 717489, 701985, 688990, 678588, 670869, 665971, 663687, 663533, 665249, 668918, 674514, 681586, 689463, 697639, 705989, 714823, 724673, 735713, 747343, 758572, 768814, 778038, 786168, 792801, 797758, 801528, 804751, 807462, 809312, 810491, 811969, 814563, 818056, 821622, 825065, 829367, 835952]
50981H35952R788J3393J7462K2105K6760L0564L3176L4755L5131L3701L0405K6325
50969A149517K2935K0971K0305K0619K1712K3221K4522K5110K5053K4954K5503
50958A404422K6978K9201L1940L5123L8466M1046M1741M0152L6794L2353K7236
50947A785452K1900J7033J3037R664O517L720K009K387N615J1143J6209J6883
50935A911569J1029K51j1477k0839k6678k9398l0035k9797k9505k9238k8869k8859
50923A658154k9916l2019l4435l6633l8583m0192m1204m1659m1793m1356l9775
50912A240589l7158l4411l2106k9861k7173k4201k1428j9057j7123j5669j4465
50901I67937j3049j1402j0098r437q933q061o926n789m461k814j381p67p50o42
$$ y = [835952, 845740, 859133, 876595, 898700, 925460, 956024, 989200, 1023955, 1059086, 1092787, 1123192, 1149517, 1172452, 1193423, 1213728, 1234347, 1256059, 1279280, 1303802, 1328912, 1353965, 1378919, 1404422, 1431400, 1460601, 1492541, 1527664, 1566130, 1607176, 1648917, 1689069, 1725863, 1758216, 1785452, 1807352, 1824385, 1837422, 1847086, 1853603, 1857323, 1859332, 1861719, 1867334, 1878477, 1894686, 1911569, 1922598, 1922849, 1911372, 1890533, 1863855, 1834457, 1804422, 1774625, 1745120, 1715882, 1687013, 1658154, 1628238, 1596219, 1561784, 1525151, 1486568, 1446376, 1405172, 1363513, 1321720, 1280364, 1240589, 1203431, 1169020, 1136914, 1107053, 1079880, 1055679, 1034251, 1015194, 998071, 982402, 967937, 954888, 943486, 933388, 923951, 915018, 906957, 900031, 894242, 889781, 886967, 885586, 884819, 884069, 883427]
50887H83427k59J12M68J017J562J672J548J915K921L805L917L461K995K652K296
50872I13509K042K201K866L879N083O379P616Q623R400J0088J0882J1983J3522
50859A008073J5507J7839K0440K3189K5853K8337L1067L4755L9610M5027N0336
50848A340033N5652O1593O8273P5020Q1213Q7015R2994R9214J05021J09734J13250
50837B289012J15854J17473J17188J13551J05595R3686P9330O3924M7867L1121
50827C174601J4443n92j2935k2881l1101l7311m0467m0061l6584l0852k3516j5426
50815B897318p895k235P14N50k815q947j6994k6278l6519m7314n7756o6934p4580
50802B550315q0868q5696q8517q8834q6645q2438p6913p0598o3599n5792m7270
$$ y = [883427, 883168, 883280, 883748, 884765, 886327, 887999, 889547, 891462, 894383, 898188, 902105, 905566, 908561, 911213, 913509, 915551, 917752, 920618, 924497, 929580, 935959, 943575, 952198, 961598, 971686, 982568, 994551, 1008073, 1023580, 1041419, 1061859, 1085048, 1110901, 1139238, 1170305, 1205060, 1244670, 1289697, 1340033, 1395685, 1457278, 1525551, 1600571, 1681784, 1768799, 1861793, 1961007, 2066028, 2175762, 2289012, 2404866, 2522339, 2639527, 2753078, 2858673, 2952359, 3031689, 3095613, 3143480, 3174601, 3189044, 3188452, 3175517, 3152636, 3121535, 3084224, 3043757, 3003696, 2967112, 2936260, 2912744, 2897318, 2889423, 2887188, 2887902, 2888452, 2885637, 2876690, 2859696, 2833418, 2796899, 2749585, 2691829, 2624895, 2550315, 2469447, 2383751, 2295234, 2206400, 2119755, 2037317, 1960404, 1889806, 1826207, 1770415, 1723145]
50791A723145l8414k9466k0468j1764m171J830O727J1330J5647J8871K0393K0317
50779A713977J8986J6544J3176R375N725K472m59l129n437p357r267j1831j5305
50766A727470j9096k2385k5200k8327l1997l5320l7490l8938m0381m1265m0262
50755A366809l7275l3817l1048k8469k5098k1133j7641j5109j3092j1032q677
50744A124418n854k518R01L788O124Q483J1256J4269J7350K0797K5012K9894L4929
50731A288849L9643M3825M7447N0659N3757N6862N9600O1391O2108O2292O2549
50720A888982O2930O3004O2397O0939N8280N3705M6627L7149K5985J4002J991
50709B375991r162j8556k5631l0315l2712l2860l0906k7401k3185j8928j4830
$$ y = [1723145, 1684731, 1655265, 1634797, 1623033, 1618862, 1620692, 1627419, 1638749, 1654396, 1673267, 1693660, 1713977, 1732963, 1749507, 1762683, 1772058, 1777783, 1780255, 1779796, 1776667, 1771230, 1763873, 1754606, 1742775, 1727470, 1708374, 1685989, 1660789, 1632462, 1600465, 1565145, 1527655, 1488717, 1448336, 1407071, 1366809, 1329534, 1295717, 1264669, 1236200, 1211102, 1189969, 1172328, 1157219, 1144127, 1133095, 1124418, 1118564, 1116046, 1116947, 1120735, 1126859, 1135342, 1146598, 1160867, 1178217, 1199014, 1224026, 1253920, 1288849, 1328492, 1372317, 1419764, 1470423, 1524180, 1581042, 1640642, 1702033, 1764141, 1826433, 1888982, 1951912, 2014916, 2077313, 2138252, 2196532, 2250237, 2296864, 2334013, 2359998, 2374000, 2375991, 2366829, 2348273, 2322642, 2292327, 2259615, 2226755, 2195849, 2168448, 2145263, 2126335, 2111505]
50698B111505j0725o539k737k78l3k183o279j1791j8298k5195l1611l6848m0615
50685A918373m2669m2555m0162l6249l1883k7372k2219j6155r688l322L274J0791
50673A660164J9222K7839L6191M4598N3398O2096O9612P5176P8532P9413P7283
50662B283524P1939O4105N5166M6341L8342L1641K6718K3735K2163K0897J8902
50651B703473J5780J1815P469K893j981o820j0652j2569j2544j1301r273o168
50639B670122j609M160J0527J7172K4046L0832L6797M1201M3670M4373M4068M3866
50627C009225M4615M6726N0766N7399O5315O9168O1287L7329P32l8900p1915r3349
50615C238398j03044j03190r6571q6024p3880o1247m8217l4975k2481j1981m052
$$ y = [2111505, 2100780, 2094241, 2091504, 2091226, 2091193, 2089010, 2082731, 2070940, 2052642, 2027447, 1995836, 1958988, 1918373, 1875704, 1833149, 1792987, 1756738, 1724855, 1697483, 1675264, 1659109, 1649421, 1646099, 1649373, 1660164, 1679386, 1707225, 1743416, 1788014, 1841412, 1903508, 1973120, 2048296, 2126828, 2206241, 2283524, 2355463, 2419568, 2474734, 2521075, 2559417, 2591058, 2617776, 2641511, 2663674, 2684571, 2703473, 2719253, 2731068, 2738537, 2741430, 2739449, 2732629, 2721977, 2709408, 2696864, 2685563, 2676290, 2670122, 2668513, 2672673, 2683200, 2700372, 2724418, 2755250, 2792047, 2833248, 2876918, 2921291, 2965359, 3009225, 3053840, 3100566, 3151332, 3208731, 3274046, 3343214, 3404501, 3441830, 3442562, 3403662, 3331747, 3238398, 3135354, 3032164, 2935593, 2849569, 2775689, 2714442, 2666225, 2631250, 2608769, 2596788, 2592736]
50604B592736J449M660N209K549l396j2008k2222l2798m2659n1328n9034o5965
50592B317193p1432p4292p4335p2707p0638o8258o5180o1708n8529n5418n1240
50581A593456m5583l9574l4625l0837k7253k3260j9139j5381j1986q585m890r02
50569A331441L190P237J1227J5071J8377K0743K2300K3630K4954K5914K6359K6830
50557A557273K7734K8530K8479K8146K9223L2727L8001M3794M9584N5281O0183
50546A978955O3039O3217O1232N7951N3741M8681M3337L8811L5980L5003L5693
50535B515640L8030M2003M7065N2251N6900O0975O4660O8147P1923P6786Q3142
50524C177522R0635R8734J07278J15899J23360J28327J30676J31260J30305J26746
$$ y = [2592736, 2594185, 2598845, 2604054, 2606603, 2603207, 2591199, 2568977, 2536179, 2493520, 2442192, 2383158, 2317193, 2245761, 2171469, 2097134, 2024427, 1953789, 1885531, 1820351, 1758643, 1700114, 1644696, 1593456, 1547873, 1508299, 1473674, 1442837, 1415584, 1392324, 1373185, 1357804, 1345818, 1337233, 1332343, 1331441, 1334631, 1341868, 1353095, 1368166, 1386543, 1407286, 1429586, 1453216, 1478170, 1504084, 1530443, 1557273, 1585007, 1613537, 1642016, 1670162, 1699385, 1732112, 1770113, 1813907, 1863491, 1918772, 1978955, 2041994, 2105211, 2166443, 2224394, 2278135, 2326816, 2370153, 2408964, 2444944, 2479947, 2515640, 2553670, 2595673, 2642738, 2694989, 2751889, 2812864, 2877524, 2945671, 3017594, 3094380, 3177522, 3268157, 3366891, 3474169, 3590068, 3713428, 3841755, 3972431, 4103691, 4233996, 4360742]
50514D360742J19350J07827R2578P4082N2998L0324O770j7678m2942o7776r0090
50503D626185j08425j22671j33239j39953j41897j38186j28727j14369r6435p6081
50493C426202n4092l1151q129J3914L3745M9896O0762O5012O1829N0841L2309
50482C701138P766j9769m6871p1254r2133j09260j22099j30196j33959j34541
50472B848822j32866j29032j22880j14886j06145r7478q8889q0095p1321o3302
50462A841928n6641n1405m7346m4173m1574l9265l7081l4904l2518k9781k6953
50451A400287k4516k2626k0909j8901j6500j4013j1935j0587r690q404o199l667
50439A232340j922j193n63O71K097K923L209L790N332P835J0820J3614J5751J7430
$$ y = [4360742, 4480092, 4587919, 4680497, 4754579, 4807577, 4837901, 4844671, 4826993, 4784051, 4716275, 4626185, 4517760, 4395089, 4261850, 4121897, 3980000, 3841814, 3713087, 3598718, 3502283, 3426202, 3372110, 3340959, 3332830, 3346744, 3380489, 3430385, 3491147, 3556159, 3617988, 3668829, 3701138, 3708904, 3689135, 3642264, 3571010, 3478877, 3369617, 3247518, 3117322, 2983363, 2848822, 2715956, 2586924, 2464044, 2349158, 2243013, 2145535, 2056646, 1976551, 1905230, 1841928, 1785287, 1733882, 1686536, 1642363, 1600789, 1561524, 1524443, 1489539, 1457021, 1427240, 1400287, 1375771, 1353145, 1332236, 1313335, 1296835, 1282822, 1270887, 1260300, 1250610, 1242206, 1236007, 1232340, 1230418, 1229225, 1228662, 1229333, 1231430, 1234353, 1237562, 1241352, 1246684, 1254519, 1265339, 1278953, 1294704, 1312134]
50425A312134J9355K1802K4193K5927K7153K8250K9041K9307K9746L1507L4766
50414A613181L8553M2130M5858N0406N5727O1208O6372P1034P5004P8005P9855
50403B277333Q0504Q0009P8530P6200P2900O8344O2498N5718M8289L9897K9691
50392B969913J6907J616j4993l1114m5306n7082o6517p3525p7764p9199p8292
50381B464644p5466p0594o3292n3666m2679l1683k1533j2273l707L840R633J3194
50369B116418J4382J2760P608r93j1560k2315l2529m2239n0980n7661o1730o3682
50357A807479o4268o3729o1969n8952n4762m9763m4871m1094l8585l6575l4459
50346A258452l2449l0919k9672k8284k6780k5332k3584k0883j7245j3578j0846
$$ y = [1312134, 1331489, 1353291, 1377484, 1403411, 1430564, 1458814, 1487855, 1517162, 1546908, 1578415, 1613181, 1651734, 1693864, 1739722, 1790128, 1845855, 1907063, 1973435, 2044469, 2119473, 2197478, 2277333, 2357837, 2437846, 2516376, 2592576, 2665476, 2733820, 2796318, 2852036, 2900325, 2940222, 2969913, 2986820, 2988436, 2973443, 2942329, 2897023, 2839941, 2773424, 2699899, 2622135, 2542936, 2464644, 2389178, 2318584, 2255292, 2201626, 2158947, 2127264, 2105731, 2093458, 2089751, 2093591, 2103224, 2116418, 2130800, 2143560, 2151168, 2150175, 2138615, 2116300, 2083771, 2041532, 1990552, 1932891, 1871161, 1807479, 1743211, 1679482, 1617513, 1558561, 1503799, 1454036, 1409165, 1368071, 1329486, 1292911, 1258452, 1226003, 1195084, 1165412, 1137128, 1110348, 1085016, 1061432, 1040549, 1023304, 1009726, 998880]
50335I98880r210q104o933n577m320l452l017k917l085l466l900m259m627n182
50321I30831n809o093n723m769l531k255j083o2Q33J634K346L043L884M970O279
50306I24495P804R495J0898J1266J0460R381Q961Q884Q033O174M482M154N066
50293A029553O115O429N956N141M317L271J424j377m412o784q435r826j0875j0978
50279A009519j0112q969p789o091l907k231j563r53O20K672M039M713N646P126
50265I92720Q473R179R244Q354N987K613k34j513j620j315n28J141L195M305L547
50250A043548J200j596l765m957n487n680n435m643l822l646l867l379j641N88
50236I97418K385L972O257R478J2960J6111J8911K1377K3177K3875K3114K0362
$$ y = [998880, 989670, 981566, 974633, 969056, 964736, 961284, 958267, 955350, 952265, 948799, 944899, 940640, 936013, 930831, 925022, 918929, 913206, 908437, 904906, 902651, 901568, 901506, 902339, 903973, 906319, 909362, 913246, 918216, 924495, 932299, 941794, 952692, 963958, 974418, 983799, 992760, 1001644, 1009677, 1015851, 1020333, 1024487, 1029553, 1035668, 1042097, 1048053, 1053194, 1057511, 1060782, 1062206, 1060829, 1056417, 1049633, 1041198, 1031372, 1020497, 1009519, 999407, 990438, 982649, 976558, 972651, 970420, 968857, 967904, 968524, 971196, 975235, 979948, 985594, 992720, 1001193, 1010372, 1019616, 1027970, 1033957, 1036570, 1036336, 1034823, 1033203, 1031888, 1031360, 1032501, 1035696, 1040001, 1043548, 1044748, 1043152, 1039387, 1034430, 1028943, 1023263, 1017828, 1013185, 1009363, 1005717, 1001850, 998471, 996830, 997418, 999803, 1003775, 1010032, 1019510, 1032470, 1048581, 1067492, 1088869, 1112046, 1135921, 1159035, 1179397]
50224A179397J5031P233j786j0288j6989k1343k3395k3748k3446k3253k3029k2134
50212A012250k0427j8483j6799j5283j3655j1986j0522r311q337p778p758p982
50200H63929p945p436o631n796n113m620m062l038j618n30l11m84j29Q04J462
50185H18482J302O82K20K29R75K640M576N412M598L347L279M561O080P162Q181
50170H71726R442J0448J0657J0380J0423J1099J2027J2739J3191J3704J4604J5999
50158A016439J7777J9778K1963K4496K7643L1665L6743M2982N0334N8370O6121
50147A414311P2363P6285P7751P6820P3295O7109N8908M9708M0171L0915K3476
50136B061112K0053K1629K6895L3406L9361M3712M5162M1963L2825J7604k652
$$ y = [1179397, 1194428, 1201661, 1199875, 1189587, 1172598, 1151255, 1127860, 1104112, 1080666, 1057413, 1034384, 1012250, 991823, 973340, 956541, 941258, 927603, 915617, 905095, 895784, 887447, 879669, 871911, 863929, 855984, 848548, 841917, 836121, 831008, 826388, 822326, 819288, 817670, 817140, 816829, 816345, 816216, 817020, 818482, 819784, 820466, 820686, 820915, 821890, 824530, 829106, 834518, 839116, 842463, 845742, 850303, 856383, 863545, 871726, 881168, 891616, 902273, 912653, 923076, 934175, 946202, 958941, 972132, 985836, 1000440, 1016439, 1034216, 1053994, 1075957, 1100453, 1128096, 1159761, 1196504, 1239486, 1289820, 1348190, 1414311, 1486674, 1562959, 1640710, 1717530, 1790825, 1857934, 1916842, 1966550, 2006721, 2037636, 2061112, 2081165, 2102794, 2129689, 2163095, 2202456, 2246168, 2291330, 2333293, 2366118, 2383722, 2381070]
50125B381070k5765m8617o8131q2498r1509r5818r6220r3490q8359q1394p3088
50114A536181o4091n5102m6539l8476l0918k3905j7393j1356o117k544j776m597
50102A233367j0653j8167k4703k8516k9229k7425k4074k0444j7668j5859j4077
50091A002552j1716r427q052p174n693l549j765p69K19J873L702M863N255N210
50077I75529M715L690K719K701L756N063N903O397O996P629P864P757P965Q781
50063A057465R492R195Q032P016O686O644O576O817P498P938P693P540Q498J0268
50049A167358J1702J2589J3833J5872J8013J9705K1533K4454K8712L3908L9514
50038A407193M5017N0072N4977O0554O7372P5469Q4989R6215J08539J20006J28597
$$ y = [2381070, 2355305, 2306688, 2238557, 2156059, 2064550, 1968732, 1872512, 1779022, 1690663, 1609269, 1536181, 1472090, 1416988, 1370449, 1331973, 1301055, 1277150, 1259757, 1248401, 1242284, 1239740, 1237964, 1233367, 1222714, 1204547, 1179844, 1151328, 1122099, 1094674, 1070600, 1050156, 1032488, 1016629, 1002552, 990836, 981409, 973357, 966183, 960490, 956941, 955176, 954407, 954626, 956499, 960201, 965064, 970319, 975529, 980244, 983934, 986653, 989354, 993110, 998173, 1004076, 1010473, 1017469, 1025098, 1032962, 1040719, 1048684, 1057465, 1066957, 1076152, 1084184, 1091200, 1097886, 1104530, 1111106, 1117923, 1125421, 1133359, 1141052, 1148592, 1157090, 1167358, 1179060, 1191649, 1205482, 1221354, 1239367, 1259072, 1280605, 1305059, 1333771, 1367679, 1407193, 1452210, 1502282, 1557259, 1617813, 1685185, 1760654, 1845643, 1941858, 2050397, 2170403, 2299000]
50027B299000J33559J35080J33169J27695J19278J09602J00766R4615R2325R3988
50017C439077R8384J03427J06772J05944R8319Q1809N6004K2827j3828m9305p9860
50006C969570j04022j22634j37417j49355j58218j63201j63726j59816j52057
49997B659124j41243j28066j13140r7295q1618o7307n5581m7426m2752l9893l6676
49986A808127l2336k7921k4789k3376k3630k5667k9255l3145l5815l6830l6829
49975A478534l6390l5451l3801l1537k8884k5932k2736j9508j6666j4663j3574
49964A199392j2786j1371q948o009l302j229J75J145K318M349P081R551J1240
49951A191606J2831J5252J8527K2057K5428K8215K9527K8622K5778K1842J7207
$$ y = [2299000, 2432559, 2567639, 2700808, 2828503, 2947781, 3057383, 3158149, 3252764, 3345089, 3439077, 3537461, 3640888, 3747660, 3853604, 3951923, 4033732, 4089736, 4112563, 4098735, 4049430, 3969570, 3865548, 3742914, 3605497, 3456142, 3297924, 3134723, 2970997, 2811181, 2659124, 2517881, 2389815, 2276675, 2179380, 2097762, 2030455, 1974874, 1927448, 1884696, 1844803, 1808127, 1775791, 1747870, 1723081, 1699705, 1676075, 1650408, 1621153, 1588008, 1552193, 1515363, 1478534, 1442144, 1406693, 1372892, 1341355, 1312471, 1286539, 1263803, 1244295, 1227629, 1212966, 1199392, 1186606, 1175235, 1166287, 1160278, 1156976, 1155747, 1155922, 1157067, 1159385, 1163734, 1170815, 1180366, 1191606, 1204437, 1219689, 1238216, 1260273, 1285701, 1313916, 1343443, 1372065, 1397843, 1419685, 1436892]
49940A436892J2062P243L681J094j766n469r468j3450j7892k2895k7409l0283
49928A332340l1359l0979k9122k5826k1877j8228j4952j1417p293k769K140P753
49916A148411J4182K1069K7972L4661M1029M7057N3030N9445O6552P4039Q1069
49905A668516Q6394Q8673Q7219Q2731P7086P2175O9100O8522P1231P7493Q5608
$$ y = [1436892, 1448954, 1456197, 1459878, 1460972, 1459206, 1453737, 1444269, 1430819, 1412927, 1390032, 1362623, 1332340, 1300981, 1270002, 1240880, 1215054, 1193177, 1174949, 1159997, 1148580, 1141287, 1138518, 1140658, 1148411, 1162593, 1183662, 1211634, 1246295, 1287324, 1334381, 1387411, 1446856, 1513408, 1587447, 1668516, 1754910, 1843583, 1930802, 2013533, 2090619, 2162794, 2231894, 2300416, 2371647, 2449140, 2534748]
$$ [...]
##END NTUPLES=NMR SPECTRUM
##END=
