##TITLE=AC1477_ZPERVRI303_8100998_XyNB9lbytl
##JCAMPDX= 6.0         $$ Bruker NMR JCAMP-DX V2.0
##DATA TYPE= NMR SPECTRUM
##DATA CLASS= NTUPLES
##ORIGIN= BRUKER
##OWNER= Administrator
$$ 1.72 TOPSPIN		Version 2.1
$$ 2013-07-31 17:06:09.985 -0700  Administrator@X
$$ Compression mode = diff/dup
##.OBSERVE FREQUENCY= 400.02188249412
##.OBSERVE NUCLEUS= ^1H
##.ACQUISITION MODE= SIMULTANEOUS (DQD)
##.ACQUISITION SCHEME= undefined
##.AVERAGES= 64
##.DIGITISER RES= 22
##SPECTROMETER/DATA SYSTEM= spect
##.PULSE SEQUENCE= noesygpps1d.comp
##.SOLVENT NAME= COFFEE_meoh
##.SHIFT REFERENCE= INTERNAL, COFFEE_meoh, 1, 14.96079
##AUDIT TRAIL= $$ (NUMBER, WHEN, WHO, WHERE, PROCESS, VERSION, WHAT)
$$ ##TITLE= Audit trail, TOPSPIN		Version 2.1
$$ ##JCAMPDX= 5.01
$$ ##ORIGIN= Bruker BioSpin GmbH
$$ ##OWNER= Administrator
$$ $$ E:\/data/COFFEE/nmr/AC1477_ZPERVRI303_8100998_XyNB9lbytl/12/pdata/1/auditp.txt
$$ ##AUDIT TRAIL=  $$ (NUMBER, WHEN, WHO, WHERE, PROCESS, VERSION, WHAT)
(   1,<2013-07-31 17:06:05.032 -0700>,<Administrator>,<X>,<go>,<TOPSPIN 2.1>,
      <created by zg
	started at 2013-07-31 16:54:35.391 -0700,
	POWCHK enabled, PULCHK disabled,
       configuration hash MD5:
       C8 4E 4E 5D D3 5C D8 9E 9F 52 82 E0 59 8A DE 15
       data hash MD5: 64K
       CE 95 A8 6D 08 36 E8 80 CE C8 B8 80 83 19 6D AC>)
(   2,<2013-07-31 17:06:08.048 -0700>,<Administrator>,<X>,<proc1d>,<TOPSPIN 2.1>,
      <Start of raw data processing
       efp LB = 0.3 FT_mod = 6 PKNL = 1 PHC0 = 0 PHC1 = 0 SI = 128K 
       data hash MD5: 128K
       6D C0 77 1C 00 11 BB 6B F1 00 07 4C DC B1 05 53>)
(   3,<2013-07-31 17:06:08.985 -0700>,<Administrator>,<X>,<proc1d>,<TOPSPIN 2.1>,
      <pk PHC0 = -80.70557 PHC1 = 0 
       data hash MD5: 128K
       C5 33 F3 63 54 87 4D 59 D7 7E 09 C6 F0 FF DA 6E>)
(   4,<2013-07-31 17:06:09.391 -0700>,<Administrator>,<X>,<proc1d>,<TOPSPIN 2.1>,
      <abs ABSG = 1 
       data hash MD5: 128K
       FA DF C1 A8 D8 CC 6F 6F 1A 1D E6 20 92 BF 49 5A>)
(   5,<2013-07-31 17:06:09.516 -0700>,<Administrator>,<X>,<proc1d>,<TOPSPIN 2.1>,
      <abs ABSG = 2 
       data hash MD5: 128K
       B8 9E CC FC 8F B6 87 F0 D5 8E 98 BE FA A0 02 3E>)
(   6,<2013-07-31 17:06:09.595 -0700>,<Administrator>,<X>,<proc1d>,<TOPSPIN 2.1>,
      <abs ABSG = 3 
       data hash MD5: 128K
       E9 9C C1 12 09 2A 53 67 71 23 A0 2E 9A E1 50 EF>)
(   7,<2013-07-31 17:06:09.673 -0700>,<Administrator>,<X>,<proc1d>,<TOPSPIN 2.1>,
      <abs ABSG = 4 
       data hash MD5: 128K
       18 CC F8 63 1A F5 B2 8A 59 A2 19 63 49 E8 B1 96>)
(   8,<2013-07-31 17:06:09.782 -0700>,<Administrator>,<X>,<proc1d>,<TOPSPIN 2.1>,
      <abs ABSG = 5 
       data hash MD5: 128K
       4D 48 EB 38 D4 40 4B 2F D5 37 6C 54 4D A0 DB ED>)
$$ ##END=
$$ 
$$ $$ hash MD5
$$ $$ 34 FA E4 67 AD E8 34 44 98 7C 1B B3 40 63 55 19
##$RELAX= 
##$RELAX= 
##$RELAX= 
##$RELAX= 
##$RELAX= 
##$RELAX= 
##$RELAX= 
##$RELAX= 
$$ Bruker specific parameters
$$ --------------------------
##$DU= <E:\>
##$EXPNO= 12
$$ [...]
##$TP07= 0
##$TPNAME0= <>
##$TPNAME1= <>
##$TPNAME2= <>
##$TPNAME3= <>
##$TPNAME4= <>
##$TPNAME5= <>
##$TPNAME6= <>
##$TPNAME7= <>
##$TPOAL= (0..7)
0.5 0.5 0.5 0.5 0.5 0.5 0.5 0.5
##$TPOFFS= (0..7)
0 0 0 0 0 0 0 0
##$TUNHIN= 0
##$TUNHOUT= 0
##$TUNXOUT= 0
##$USERA1= <user>
##$USERA2= <user>
##$USERA3= <user>
##$USERA4= <user>
##$USERA5= <user>
##$V9= 5
##$VALIST= <valist>
##$VCLIST= <CCCCCCCCCCCCCCC>
##$VD= 0
##$VDLIST= <DDDDDDDDDDDDDDD>
##$VPLIST= <PPPPPPPPPPPPPPP>
##$VTLIST= <TTTTTTTTTTTTTTT>
##$WBST= 2048
##$WBSW= 25
##$XGAIN= (0..3)
0 0 0 0
##$XL= 0
##$YL= 0
##$YMAX_a= 7039446
##$YMIN_a= -13148714
##$ZGOPTNS= <>
##$ZL1= 120
##$ZL2= 120
##$ZL3= 120
##$ZL4= 120
##$ABSF1= 14.96079
##$ABSF2= -5.597392
##$ABSG= 5
##$ABSL= 3
##$ALPHA= 0
##$AQORDER= 0
##$ASSFAC= 0
##$ASSFACI= 0
##$ASSFACX= 0
##$ASSWID= 0
##$AUNMP= <proc_prof1d_extract.lims>
##$AXLEFT= 0
##$AXNAME= <>
##$AXNUC= <1H>
##$AXRIGHT= 0
##$AXTYPE= 0
##$AXUNIT= <>
##$AZFE= 0.1
##$AZFW= 0.1
##$BCFW= 0
##$BC_mod= 0
##$BYTORDP= 0
##$COROFFS= 0
##$CY= 15
##$DATMOD= 1
##$DC= 0
##$DFILT= <>
##$DTYPP= 0
##$F1P= 0
##$F2P= 0
##$FCOR= 0.5
##$FTSIZE= 131072
##$FT_mod= 6
##$GAMMA= 0
##$GB= 0
##$INTBC= 1
##$INTSCL= 1
##$ISEN= 128
##$LB= 0.3
##$LEV0= 0
##$LPBIN= 0
##$MAXI= 10000
##$MC2= 0
##$MEAN= 0
##$ME_mod= 0
##$MI= 0
##$NCOEF= 0
##$NC_proc= -2
##$NLEV= 6
##$NOISF1= 0
##$NOISF2= 0
##$NSP= 0
##$NTH_PI= 0
##$NZP= 0
##$OFFSET= 14.96079
##$PC= 1
##$PHC0= -80.70557
##$PHC1= 0
##$PH_mod= 1
##$PKNL= yes
##$PPARMOD= 0
##$PPDIAG= 0
##$PPIPTYP= 0
##$PPMPNUM= 2147483647
##$PPRESOL= 1
##$PSCAL= 4
##$PSIGN= 0
##$PYNMP= <proc.py>
##$REVERSE= no
##$SF= 400.020009721533
##$SI= 131072
##$SIGF1= 0
##$SIGF2= 0
##$SINO= 400
##$SIOLD= 131072
##$SPECTYP= <>
##$SREGLST= <1H.CDCl3>
##$SSB= 0
##$STSI= 131072
##$STSR= 0
##$SW_p= 8223.68421052631
##$SYMM= 0
##$S_DEV= 0
##$TDeff= 65536
##$TDoff= 0
##$TI= <>
##$TILT= no
##$TM1= 0
##$TM2= 0
##$TOPLEV= 0
##$USERP1= <user>
##$USERP2= <user>
##$USERP3= <user>
##$USERP4= <user>
##$USERP5= <user>
##$WDW= 1
##$XDIM= 131072
##$YMAX_p= 413018025
##$YMIN_p= -13695
##$CURPLOT= <Network HP LaserJet P1505>
##$CURPRIN= <$Network HP LaserJet P1505>
##$DFORMAT= <normdp>
##$LAYOUT= <+/1D_H.xwp>
##$LFORMAT= <normlp>
##$PFORMAT= <normpl>
##$SURQMSG= 1
$$ End of Bruker specific parameters
$$ ---------------------------------
##NTUPLES= NMR SPECTRUM
##VAR_NAME=  FREQUENCY,     SPECTRUM/REAL,   SPECTRUM/IMAG
##SYMBOL=    X,             R,               I
##VAR_TYPE=  INDEPENDENT,   DEPENDENT,       DEPENDENT
##VAR_FORM=  AFFN,          ASDF,            ASDF
##VAR_DIM=   131072,        131072,          131072
##UNITS=     HZ,            ARBITRARY UNITS, ARBITRARY UNITS
##FACTOR=    0.0627417313425164, 1,          1
##FIRST=     8223.62146879497, 853,          -66527
##LAST=      0,             2199,            -66744
##MIN=       0,             -13695,          0
##MAX=       8223.62146879497, 413018025,    0
$$ Real data points
##PAGE= N=1
##DATA TABLE= (X++(R..R)), XYDATA
$$ [...]
61726D37921L354K882K526K656L038L425L864M327M516M333M132M284M724N172
61712D91154N462N465M957L939K768J644K33j733l748m955n265n407n830o118
61698D82566n692m613l382k311j460r31q42j096j410j519j214m09O66J542K013
61683D61908K301K473K172J319O95J056J844J725M66n77l31N50P18n1q96j351
61667D74021j722k133k214j931j863k236k459k080j594j640j915j643p86qM08
61652D50205P85J238J433J375J581K112K139J169J33M36K151L906M598M551M775
61637D82587N635O562O686N507L204O25j289k337l169m414n900o939p173o798
61623D72787o057n020l842k890k367k023j444o02P3K27O6K37J081K061K146R09
$$ y = [437921, 441275, 444157, 446683, 449339, 452377, 455802, 459666, 463993, 468509, 472842, 476974, 481258, 485982, 491154, 496616, 502081, 507038, 510977, 513745, 515389, 515622, 513889, 510141, 505186, 499921, 494514, 488684, 482566, 476874, 472261, 468879, 466568, 465108, 464177, 463335, 462239, 460829, 459310, 458096, 457687, 458353, 459895, 461908, 464209, 466682, 468854, 470173, 470868, 471924, 473768, 475493, 475959, 475382, 475051, 475601, 476319, 476268, 475372, 474021, 472299, 470166, 467952, 466021, 464158, 461922, 459463, 457383, 455789, 454149, 452234, 450591, 449805, 449797, 450205, 450990, 452228, 453661, 455036, 456617, 458729, 460868, 462037, 462170, 462606, 464757, 468663, 473261, 477812, 482587, 488222, 494784, 501470, 506977, 510181, 510806, 509517, 507180, 504011, 499597, 493697, 486758, 479585, 472787, 466730, 461710, 457868, 454978, 452611, 450588, 449144, 448542, 448615, 448842, 448908, 449145, 450226, 452287, 454433, 455342]
61607D55342r54k358l022l615m770o251p249p298o717o136n777n269m224k935
61593C88767k200k391l008l359l417l574l816l796l615l755m082l732k423j166
61579C44433r82j465j482q66n06q29j217j113p74o18n51m19m82q57j053o38n2
61562C30529q7p93j503j761j712j615j544j489j313o71N00J476J285r8j585k117
61546C17502j545m35N24P95L00l04j62O72J196Q08J34M8M57O63N11M55P25J052
61528C23396J145Q39k7j296k194k023j199q70j505k481l158l566l815l654l019
61513B96573k380k041j650q77q0K56K58K69J09n62j387j606j148p54r45j384j420
61496B81231q70j54Q0m54j251j327l00R51J178J85j056j601j361q22m49m63p00
$$ y = [455342, 454388, 452030, 449008, 445393, 440623, 434372, 427123, 419825, 413108, 406972, 401195, 395926, 391702, 388767, 386567, 384176, 381168, 377809, 374392, 370818, 367002, 363206, 359591, 355836, 351754, 348022, 345599, 344433, 343451, 341986, 340504, 339638, 339132, 338303, 337086, 335973, 335199, 334581, 334030, 333611, 333129, 332272, 331219, 330581, 330529, 330442, 329649, 328146, 326385, 324673, 323058, 321514, 320025, 318712, 318041, 318541, 320017, 321302, 321204, 319619, 317502, 315957, 315522, 316046, 316841, 317141, 316837, 316675, 317347, 318543, 319351, 319485, 319533, 319990, 320653, 321164, 321619, 322344, 323396, 324541, 325380, 325353, 324057, 321863, 319840, 318641, 317771, 316266, 313785, 310627, 307061, 303246, 299592, 296573, 294193, 292152, 290502, 289625, 289545, 289801, 290059, 290328, 290437, 289875, 288488, 286882, 285734, 284980, 284035, 282651, 281231, 280361, 280207, 280287, 279833, 278582, 277255, 276955, 277906, 279084, 279269, 278213, 276612, 275251, 274429, 273980, 273517, 272817]
61479B72817o90j78M61P59R12J415K126K381K048J721J719J667J288Q37M84K6
61463B89793m33l10M97J161J049O11N34O67N52L96O19Q62M73k68m50J00O03N70
61445B97026K99P9k39n77m24L36J054J241J326J959K994L747L996M173M602N001
61429C26593M871M096L042K159J592J160O22m2o21p99l71N41J401J715J632J799
61413C49390K464L072K966K178J204L48k90o11q15j534l081m720n422n149m700
61398C35300m415l878k965k307k398k885l148k986k515j822j136q20r45j115j004
61383C00961n76K21J414K399K158N66j050j251n7J327J972J854J375Q88P03J010
61367C13914J669K252K351J868J150Q90J478K415K771K338J882K065K757L594
$$ y = [272817, 272127, 271949, 272410, 273169, 274081, 275496, 277622, 280003, 282051, 283772, 285491, 287158, 288446, 289283, 289767, 289793, 289360, 289050, 289547, 290708, 291757, 292368, 292902, 293569, 294121, 294517, 295136, 295998, 296471, 296203, 295753, 295853, 296456, 297026, 297325, 297404, 297165, 296588, 296164, 296500, 297554, 298795, 300121, 302080, 305074, 308821, 312817, 316990, 321592, 326593, 331464, 335560, 338602, 340761, 342353, 343513, 344135, 344093, 343472, 342673, 342302, 342843, 344244, 345959, 347591, 349390, 351854, 354926, 357892, 360070, 361274, 361622, 361332, 360721, 359906, 358372, 355291, 350571, 345149, 340000, 335300, 330885, 327007, 324042, 321735, 319337, 316452, 313304, 310318, 307803, 305981, 304845, 304025, 303080, 301965, 300961, 300385, 300606, 302020, 304419, 306577, 307143, 306093, 304842, 304785, 306112, 308084, 309938, 311313, 312201, 312904, 313914, 315583, 317835, 320186, 322054, 323204, 324094, 325572, 327987, 330758, 333096, 334978, 337043, 339800, 343394]
61353C43394M576N594O095N896N760O447P672Q728R668J0866J1775J1286R379
61340D47136P322O071N409M944M978N733O460O170M908L677L174L151K939K165
61326E14237Q42q81k780m460n496n811n824n957o024n482m309l196k562j898o50
61311D59749P24J275R93Q61J456K256K674K959L714M955O150O872P025O648N845
61296E14156M647K794M2l160n666o804p095p403p734p496o644n814n260m486l200
61281D50877j983j558j788j920j525p81L9Q58J631K362L290M645O096O915O861
61266D74019O534O500O541O201N725N808O562P381P958Q716R980J1313J2069J2194
61252E87501J2055J1731J0985R777Q377O989N619M327L265K414J455O5j710l440
$$ y = [343394, 347970, 353564, 359659, 365555, 371315, 377762, 385434, 394162, 403830, 414696, 426471, 437757, 447136, 454458, 460529, 465938, 470882, 475860, 481593, 488053, 494223, 499131, 502808, 505982, 509133, 512072, 514237, 515079, 514198, 511418, 506958, 501462, 495651, 489827, 483870, 477846, 472364, 468055, 464859, 462297, 460399, 459749, 460473, 461748, 462741, 463602, 465058, 467314, 469988, 472947, 476661, 481616, 487766, 494638, 501663, 508311, 514156, 518803, 521597, 521639, 518479, 512813, 506009, 498914, 491511, 483777, 476281, 469637, 463823, 458563, 454077, 450877, 448894, 447336, 445548, 443628, 442103, 441322, 441361, 442219, 443850, 446212, 449502, 454147, 460243, 467158, 474019, 480553, 487053, 493594, 499795, 505520, 511328, 517890, 525271, 533229, 541945, 551925, 563238, 575307, 587501, 599556, 611287, 622272, 632049, 640426, 647415, 653034, 657361, 660626, 663040, 664495, 664560, 662850, 659410]
61238F59410m684n470o272p363q270q218p103n746n082n385o328p321p640o772
61224E67756m942k995j523m01N72J180J252J128J169J240J144J155J521J935K153
61209E72344K617L684M547L923J811l82j497j658j505j186m28R43K835M908O701
61194E97657Q063R435J1306J3541J5669J7547J9065J9509J8139J5365J2481J0168
61182G67945Q243O808O546P448Q330Q192P313O429N640M685L650K734J814P90
61168H46567j75j139k501m161n270n433n482o385p977r529j0957j2522j3883j4412
61154G46741j4277j4182j4143j3457j1834r767p708n646l596j888p81l49q30k526
61140F45757n153p780r631j0620j1010j0875j0066q527o575m917m137l954l298
$$ y = [659410, 654726, 649256, 642984, 635621, 627351, 619133, 612030, 606284, 601202, 595817, 589489, 582168, 574528, 567756, 562814, 559819, 558296, 557895, 558467, 559647, 560899, 562027, 563196, 564436, 565580, 566735, 568256, 570191, 572344, 574961, 578645, 583192, 587115, 588926, 588544, 587047, 585389, 583884, 582698, 582270, 583213, 586048, 590956, 597657, 605720, 615155, 626461, 640002, 655671, 673218, 692283, 711792, 729931, 745296, 757777, 767945, 776188, 782996, 789542, 796990, 805320, 813512, 820825, 827254, 832894, 837579, 841229, 843963, 845777, 846567, 846392, 845253, 842752, 838591, 833321, 827888, 822406, 816021, 808044, 798515, 787558, 775036, 761153, 746741, 732464, 718282, 704139, 690682, 678848, 669081, 661373, 655727, 652131, 650243, 649462, 649113, 648283, 645757, 640604, 632824, 623193, 612573, 601563, 590688, 580622, 572095, 565520, 560603, 556466, 552512, 549214]
61127E49214j549O12K109K911L888N471P258Q954J0791J2773J4308J5095J5766
61114F47601J7121J9057K0818K2050K3159K4598K6245K7527K8043K7934K7623
61103I11776K7265K6565K5227K3424K1499J9379J6580J2828Q382L682r41n144
61091A090522q584j1305j3860j6681j9471k1499k2513k3001k3517k3977k3854
61080H82260k2949k1657k0450j9441j8616j8186j8269j8349j7545j5615j3263
61069F77920j1372j0172r317q417p207n571l663j911p30k60l80o92m86P50K717
61054F21209M603O039P322Q547R329R680J0410J2064J4069J5591J6735J8158J9991
61041G73747K1915K3932K6279K8799L1181L3569L6195L8705M0662M2500M5066
$$ y = [549214, 547665, 548277, 550386, 553297, 557185, 562656, 569914, 578868, 589659, 602432, 616740, 631835, 647601, 664722, 683779, 704597, 726647, 749806, 774404, 800649, 828176, 856219, 884153, 911776, 939041, 965606, 990833, 1014257, 1035756, 1055135, 1071715, 1084543, 1092925, 1096607, 1095666, 1090522, 1081938, 1070633, 1056773, 1040092, 1020621, 999122, 976609, 953608, 930091, 906114, 882260, 859311, 837654, 817204, 797763, 779147, 760961, 742692, 724343, 706798, 691183, 677920, 666548, 656376, 647059, 638642, 631435, 625864, 622201, 620290, 619560, 619300, 618920, 618228, 617742, 618492, 621209, 625812, 631851, 639173, 647720, 657049, 666729, 677139, 689203, 703272, 718863, 735598, 753756, 773747, 795662, 819594, 845873, 874672, 905853, 939422, 975617, 1014322, 1054984, 1097484, 1142550]
61030A142550M8304N1278N3421N4895N5848N6330N7059N9177O3092O8387P5032
61019A785373Q3636R4207J05639J16992J28707J42457J60538J85580K19878K64648
61009C287655L20525L88780M71048N68367O82018Q15079R71187J152566J362537
61000A0019762J606579J876169K117594K222333K075066J639360J007196L59564
60992B2923623j31143l74334l66717j63276J35603L84292M24509J61612l70476
60983B2623693j019634j599504j980944k129660k085046j916578j690181j452843
60975H749303j230494j033307q63213p18915n97549m95555m10040l39319k82106
60966B778805k36810k01699j74946j54308j37428j22787j09885r8388q7635p7181
$$ y = [1142550, 1190854, 1242132, 1295553, 1350448, 1406296, 1462626, 1519685, 1578862, 1641954, 1710341, 1785373, 1869009, 1963216, 2068855, 2185847, 2314554, 2457011, 2617549, 2803129, 3023007, 3287655, 3608180, 3996960, 4468008, 5036375, 5718393, 6533472, 7504659, 8657225, 10019762, 11626341, 13502510, 15620104, 17842437, 19917503, 21556863, 22564059, 22923623, 22792480, 22418146, 22051429, 21888153, 22023756, 22408048, 22832557, 22994169, 22623693, 21604059, 20004555, 18023611, 15893951, 13808905, 11892327, 10202146, 8749303, 7518809, 6485502, 5622289, 4903374, 4305825, 3810270, 3400230, 3060911, 2778805, 2541995, 2340296, 2165350, 2011042, 1873614, 1750827, 1640942, 1542554, 1454919, 1377738]
60956A377738o7223n8143n0022m2878l7091l3218l1475l1420l1971l1814l0233
60945I32250k7639k5032k2893k0939j8917j7106j5784j4813j4031j3668j3960
60934G27468j4585j4950j4941j4963j5306j5780j6109j6300j6434j6286j5426
60923E56388j3821j2110j1068j0787j0590r831q627p610p107o807o280n555n013
60910D41182m809m588l857k601j399p99o78l79M38J328J621J199N39O8j89l51
60894D26725l85k30K3K14L25M21M49K26k43o59p78q63j452k543l309k996j963
60877D12962j319j513j745j155j45L3j041k250k213r50J14j71j356j997j379j59
60861C95716P11J099J388J519J030j18j373k264k678k469j463l3J020J413J623
$$ y = [1377738, 1310515, 1252372, 1202350, 1159472, 1122381, 1089163, 1057688, 1026268, 994297, 962483, 932250, 904611, 879579, 856686, 835747, 816830, 799724, 783940, 769127, 755096, 741428, 727468, 712883, 697933, 682992, 668029, 652723, 636943, 620834, 604534, 588100, 571814, 556388, 542567, 530457, 519389, 508602, 498012, 488181, 479554, 471944, 464837, 458030, 451750, 446195, 441182, 436373, 431785, 427928, 425327, 423928, 423129, 422451, 422072, 422510, 423838, 425459, 426658, 427197, 427265, 427076, 426725, 426340, 426110, 426133, 426347, 426672, 427093, 427542, 427768, 427525, 426866, 426088, 425225, 423773, 421230, 417921, 414925, 412962, 411643, 410130, 408385, 407230, 407085, 407118, 406077, 403827, 401614, 400664, 400778, 400607, 399251, 397254, 395875, 395716, 396427, 397526, 398914, 400433, 401463, 401345, 399972, 397708, 395030, 392561, 391098, 391065, 392085, 393498, 395121]
60846C95121J910J744P21n09r31m12L50Q47J066R81M52k96p06n40j94j81o10j131
60828C97682j232n82O51J887K655K930K868K483J867J339J070Q24M46L03P27J240
60812D17158R91j60j461k165k194j956j922k355l026l337l064k823l299m246m786
60797C81355m539l875l230k830k910l420l557k595j187q47j860k818k667k136
60783C42884k305k719k125n03Q20R98N71L87N46P00P90R79J256J492J771K374
60767C47916L460M822N950O354N912M937L849K915K324K350L100M179M831M574
60753D07473L636K687K168J919J476P83M45J139K770M397N082M676L730K753J743
60738D46877L92j358l037m007m166m101m378m832m873m377l880l832m110m387
$$ y = [395121, 397031, 398775, 399496, 398987, 398056, 397644, 397994, 398841, 399907, 400888, 401340, 401044, 400338, 399798, 399604, 399423, 398813, 397682, 396450, 395868, 396519, 398406, 401061, 403991, 406859, 409342, 411209, 412548, 413618, 414442, 414888, 415191, 415918, 417158, 418149, 417989, 416528, 414363, 412169, 410213, 408291, 405936, 402910, 399573, 396509, 393686, 390387, 386141, 381355, 376816, 372941, 369711, 366881, 363971, 360551, 356994, 354399, 353212, 352365, 350505, 347687, 345020, 342884, 340579, 337860, 335735, 335232, 336052, 337050, 337621, 338008, 338554, 339254, 340044, 341023, 342279, 343771, 345542, 347916, 351376, 356198, 362148, 368502, 374414, 379351, 383200, 386115, 388439, 390789, 393889, 398068, 402899, 407473, 411109, 413796, 415964, 417883, 419359, 420142, 420587, 421726, 424496, 428893, 433975, 438651, 442381, 445134, 446877, 447269, 445911, 442874, 438867, 434701, 430600, 426222, 421390, 416517, 412140, 408260, 404428, 400318, 395931]
60724C95931m620m853m879m458l728l090k722k476k185j885j676j591j616j732
60710C54420j878j927j744j339q94o05m22p0O25J531K381L003L314L312L272L650
60694C66629M463N059M906M385M250M511M511M066L743L835L866L469L066L122
60680D23881L287K891K025J464J640K156K298J709O66o7J71J318K627L507M008
60665D53581M350M447M273M218M564M948M967N032N911P527Q960R650R981J0492
60651E42901J1213J1936J2630J3237J3543J3561J3711J4166J4401J3759J2287
60640F87345J0571Q875O987M922L214K218J486K93j395k949m053n135o555p922
60626F97902q652q864r125r466r376q822q470q677q922q648q115p777p435o633
$$ y = [395931, 391311, 386458, 381579, 377121, 373393, 370303, 367581, 365105, 362920, 361035, 359359, 357768, 356152, 354420, 352542, 350615, 348871, 347532, 346638, 346033, 345611, 345541, 346166, 347697, 350078, 353081, 356395, 359707, 362979, 366629, 371092, 376151, 381057, 385442, 389692, 394203, 398714, 402780, 406523, 410358, 414224, 417693, 420759, 423881, 427168, 430059, 432084, 433548, 435188, 437344, 439642, 441351, 442017, 441950, 442121, 443439, 446066, 449573, 453581, 457931, 462378, 466651, 470869, 475433, 480381, 485348, 490380, 496291, 503818, 512778, 522428, 532409, 542901, 554114, 566050, 578680, 591917, 605460, 619021, 632732, 646898, 661299, 675058, 687345, 697916, 706791, 713778, 718700, 721914, 724132, 725618, 725911, 724516, 721567, 717514, 712379, 705824, 697902, 689250, 680386, 671261, 661795, 652419, 643597, 635127, 626450, 617528, 608880, 600765, 592988, 585553, 578920]
60612E78920n606n040n056n192n313n775o578p129p115p017p361p864p805o981
60598D89088n930n260n072n008m670m003l333l001l057l333l744m236m548m429
60584D29464m071m020m467m977n099m842m361l491k001j86J267J991K212K323
60570C99742K538L082M275O079P789Q671Q868R140R600R302P530M998L014J739
60556D86367J41k197m281n098n013n035n266m926l616j725K79K252M093N764P543
60541D69282R546J1092J1362J0750J0544J1023J0751Q458M783J427q70k646m424
60528E51078o001p015p361o900n346k888n21N91J49r44j357n17Q94J785J903J995
60512E19545K670L588M122M322M668N171N359N135N032N560O791Q690J1339J4591
$$ y = [578920, 573314, 568274, 563218, 558026, 552713, 546938, 540360, 533231, 526116, 519099, 511738, 503874, 496069, 489088, 483158, 477898, 472826, 467818, 463148, 459145, 455812, 452811, 449754, 446421, 442677, 438441, 433893, 429464, 425393, 421373, 416906, 411929, 406830, 401988, 397627, 394136, 392135, 391949, 393216, 395207, 397419, 399742, 402280, 405362, 409637, 415716, 423505, 432176, 441044, 450184, 459784, 469086, 476616, 481614, 484628, 486367, 486508, 484311, 480030, 474932, 469919, 464884, 459618, 454692, 451076, 449351, 449630, 451882, 455975, 461739, 469282, 478828, 489920, 501282, 512032, 522576, 533599, 544350, 552808, 557591, 559018, 558148, 555502, 551078, 545077, 538062, 530701, 523801, 518455, 515567, 515046, 515637, 515786, 514842, 513485, 512968, 513862, 515647, 517550, 519545, 522215, 525803, 529925, 534247, 538915, 544086, 549445, 554580, 559612, 565172, 571963, 580653, 591992, 606583]
60498F06583J7974K1257K4714K8586L2526L5890L8384M0025M0601L9456L5875
60487I61871K9460K0285Q977l343j5394k6180l5099m1780m5978m7653m7021m4511
60475G13634m0783l6638l2691k9079k5607k2170j8920j6039j3575j1603j0334
60464D56195r831r714r366q467p238o128n372m867m413l949l539l237k991k727
60450C74356k387j938j346o73j02K19L03K22o0n28q75p52l08j70o30j129r68k96
60432C62938ro05j578k054j741j054n12l35m26n55n19l14j74l54q16j171r91k29
60414C49501O71J141J059Q27Q65J149J408J507J438J054K83n34q10l70M16J137
60398C60742J653J892J760J364J003P46M13J07K77J032J794J959J608J233J090
$$ y = [606583, 624557, 645814, 670528, 699114, 731640, 767530, 805914, 845939, 886540, 925996, 961871, 991331, 1011616, 1020593, 1017250, 1001856, 975676, 940577, 898797, 852819, 805166, 758145, 713634, 672851, 636213, 603522, 574443, 548836, 526666, 507746, 491707, 478132, 466529, 456195, 446364, 436650, 427284, 418817, 411579, 405451, 400079, 395212, 390799, 386850, 383311, 380074, 377083, 374356, 371969, 370031, 368685, 368012, 367910, 368129, 368432, 368654, 368594, 368066, 367191, 366439, 366131, 365961, 365331, 364202, 363234, 362938, 362929, 362324, 360746, 358692, 356951, 355897, 355385, 355050, 354624, 354069, 353550, 353236, 353062, 352708, 351892, 350721, 349730, 349501, 350172, 351313, 352372, 353199, 354064, 355213, 356621, 358128, 359566, 360620, 360903, 360369, 359559, 359189, 359605, 360742, 362395, 364287, 366047, 367411, 368414, 369160, 369573, 369680, 369957, 370989, 372783, 374742, 376350, 377583, 378673]
60383C78673J179J470J818J927J755J662J780J675J065M91O44J351J851J903J848
60368D01092J760J344P02M65R00J542J859J773J368O96J01K02J109K119K474K174
60352D21680J736J507J507J708K083K536L000L576M447N638O877P699P789P354
60338D79137O915O535N586L617J076j318l482n608p290p893p670p488p469o921
60324D47727n716m619l985l215j996r82o56n04p3J27l92j002q43p5O85J460K468
60307D28409L249L476M032N984Q767J0800J1740J2717J4289J5533J5426J3941
60295E48363J1359P559K579k894q025j2133j4385j4113j1887r323p351n448l009
60282D81292n71J069K078L038L681L176J381r43l055m722n935o727p246p617p790
$$ y = [378673, 379852, 381322, 383140, 385067, 386822, 388484, 390264, 391939, 393004, 393495, 394139, 395490, 397341, 399244, 401092, 402852, 404196, 404898, 405363, 406263, 407805, 409664, 411437, 412805, 413501, 413602, 413804, 414913, 417032, 419506, 421680, 423416, 424923, 426430, 428138, 430221, 432757, 435757, 439333, 443780, 449418, 456295, 463994, 471783, 479137, 486052, 492587, 498173, 501790, 502866, 501548, 498066, 492458, 485168, 477275, 469605, 462117, 454648, 447727, 442011, 437392, 433407, 430192, 428196, 427214, 426558, 426054, 425981, 426108, 425716, 424714, 423871, 423796, 424481, 425941, 428409, 431658, 435134, 439166, 445150, 453917, 464717, 476457, 489174, 503463, 518996, 534422, 548363, 559722, 567281, 569860, 566966, 558941, 546808, 532423, 518310, 506423, 497100, 489749, 484301, 481292, 480721, 481790, 483868, 486906, 490587, 493763, 495144, 494201, 491146, 486424, 480489, 473762, 466516, 458899, 451109]
60267D51109p707p441o890n745m144k956k877l545m075m121l931l558k869k133
60253C89117j874k012j793q21L62R66Q45M76K83K96L32L35N13J044J652J698Q59
60236C92278l96j266j359p80K34J393K314K836L236L714L875L281K357K045K476
60221D16238K735K197J371J082J448K122L041M175M977M792L830L056L092L650
60207D57806M085M138L958L809L841L990M029L876L768L906M064L901L568L495
60193E12234L588L254K400J692J485J134O1j070j140l14j4j004k469l301l458
60178E13078l488l457l131k779k858l094k735j767j055j124j490j528j292j135
60164D82145j023q20p22r35j098p23j2K85j39q24j200j117o57Q5Q39J200J070
$$ y = [451109, 443402, 435961, 429071, 423326, 419182, 416226, 413349, 409804, 405729, 401608, 397677, 394119, 391250, 389117, 387243, 385231, 383438, 382617, 382979, 383945, 384790, 385266, 385549, 385845, 386177, 386512, 387025, 388069, 389721, 391419, 392278, 391882, 390616, 389257, 388477, 388711, 390104, 392418, 395254, 398490, 402204, 406079, 409360, 411717, 413762, 416238, 418973, 421170, 422541, 423623, 425071, 427193, 430234, 434409, 439386, 444178, 448008, 451064, 454156, 457806, 461891, 466029, 469987, 473796, 477637, 481627, 485656, 489532, 493300, 497206, 501270, 505171, 508739, 512234, 515822, 519076, 521476, 523168, 524653, 525787, 525848, 524778, 523638, 523324, 523310, 522306, 519837, 516536, 513078, 509590, 506133, 503002, 500223, 497365, 494271, 491536, 489769, 488714, 487590, 486100, 484572, 483280, 482145, 481122, 480302, 479580, 478645, 477547, 476824, 476812, 477097, 476958, 476134, 474934, 473817, 473160, 473245, 474084, 475284, 476354]
60147D76354Q49R49J345J787K208K622K861K791K651K891L621M596N718P171Q853
60132E27267R975R655P877N521L437J746J80j252k264k846l281l613l442k554
60118E46406j420p44o47o42l51Q7L82M92N24N08M46M46N84P39P38N30J74l16r22
60099E47014j537k062k520k900l063k905k559k184j658p76K99J125J562J919K403
60084E32158K809K982L256L992M926N413N250M820M373L683K552J227N2r95k088
60069E74410l158m061m879n701o208o010n345n033n538o439o944o648n680m453
60055D98313l487l222l637m153m144l511k622j807j137n54J7O06J182J636J943
60040D75423K170K245J967J470J391K126L146L525L128K647K433J962Q41l12o65
$$ y = [476354, 477203, 478152, 479497, 481284, 483492, 486114, 488975, 491766, 494417, 497308, 500929, 505525, 511243, 518414, 527267, 537242, 546897, 554774, 560295, 563732, 565478, 565658, 564406, 562142, 559296, 556015, 552402, 548960, 546406, 544986, 544242, 543595, 542953, 542602, 542689, 543071, 543563, 544087, 544595, 545041, 545487, 546071, 546810, 547548, 548078, 548252, 547936, 547014, 545477, 543415, 540895, 537995, 534932, 532027, 529468, 527284, 525626, 524850, 525149, 526274, 527836, 529755, 532158, 534967, 537949, 541205, 545197, 550123, 555536, 560786, 565606, 569979, 573662, 576214, 577441, 577493, 576498, 574410, 571252, 567191, 562312, 556611, 550403, 544393, 539048, 534015, 528477, 522038, 515094, 508446, 502766, 498313, 494826, 491604, 487967, 483814, 479670, 476159, 473537, 471730, 470593, 470039, 470056, 470662, 471844, 473480, 475423, 477593, 479838, 481805, 483275, 484666, 486792, 489938, 493463, 496591, 499238, 501671, 503633, 504474, 504162, 503497]
60025E03497n52j173k935m774n490n217n085n681o461o643o211n770n685n795
60011D36025n820n711n512n100m313l219k111j302r53j003j053n99L80J240J377
59996D02326R81P25Q11R12J055J751K942L512K623J024K60P53J578K039K543L536
59980D29371M472M453L428K155J308J001J019R94N18m43j408j929k157k443k605
59965D37734k108r69J10N43M06J24R6O34J717K666K561J361Q5m42n48r50j473
59948D41547j350n59l5l84j083j313j016o88n65n85q87j682k629k986k605k284
59932D20896k685l338l158j869l77K81J8m48m50N3N54N42P5j94K01Q30Q25J36
59914D11892j97O52K231L439L848L832L700L399K963K595K181J393L88j11K31
$$ y = [503497, 502945, 501772, 498837, 494063, 488573, 483356, 478271, 472590, 466129, 459486, 453275, 447505, 441820, 436025, 430205, 424494, 418982, 413882, 409569, 406350, 404239, 402937, 401984, 400981, 399928, 399329, 399709, 400949, 402326, 403307, 404032, 404843, 405755, 406810, 408561, 411503, 415015, 417638, 418662, 418922, 419675, 421253, 423292, 425835, 429371, 433843, 438296, 441724, 443879, 445187, 446188, 447207, 448201, 448719, 448276, 446868, 444939, 442782, 440339, 437734, 435626, 434657, 434767, 435310, 435716, 435840, 435936, 436570, 438287, 440953, 443514, 444875, 444960, 444518, 443970, 443020, 441547, 440197, 439638, 439603, 439219, 438136, 436823, 435807, 435119, 434554, 433969, 433082, 431400, 428771, 425785, 423180, 420896, 418211, 414873, 411715, 409846, 409469, 409750, 409768, 409320, 408870, 408923, 409477, 410019, 410094, 409900, 410101, 410931, 411756, 411892, 411695, 412347, 414578, 418017, 421865, 425697, 429397, 432796, 435759, 438354, 440535, 441928, 442316, 442205, 442436]
59899D42436P86O82j63j025j176n48K51N05J70M7Q84K352L334L303K880K908L553
59882D61179M481N352N847N764N401N365N668N651N116M743M866M657L368J628
59868E29086M61l53j722l386m057l386k496k297k426k223j697r97M2J284K054
59853E07887K208K679M205O158P343P478P071O292M805K541o0k402l834l667j860
59838E46844M34J634J054r20l683o719r248j0432j0213r334q342p047n219l332
59824D75477k163j921k100k151k016k096k718l668m265m005l122k364k239k574
59810D38075k825k652k177j800j733j720j339o59k97o60j364j710j576j475j803
59795D14285k350k570k090j001J11N09l1r46j501j540j341r52k36M97N55j87q53
$$ y = [442436, 443222, 443904, 443741, 442716, 441540, 440992, 441243, 441748, 441918, 441965, 442849, 445201, 448535, 451838, 454718, 457626, 461179, 465660, 471012, 476859, 482623, 488024, 493389, 499057, 504708, 509824, 514567, 519433, 524090, 527458, 529086, 529547, 529194, 527472, 524086, 520029, 516643, 514147, 511850, 509424, 507201, 505504, 504507, 504549, 505833, 507887, 510095, 512774, 516979, 523137, 530480, 537958, 545029, 551321, 556126, 558667, 558607, 556205, 552371, 548704, 546844, 547278, 548912, 549966, 549046, 545363, 538644, 529396, 518964, 508751, 499417, 491075, 484028, 478809, 475477, 473314, 471393, 469293, 467142, 465126, 463030, 460312, 456644, 452379, 448374, 445252, 442888, 440649, 438075, 435250, 432598, 430421, 428621, 426888, 425168, 423829, 423170, 422873, 422213, 420849, 419139, 417563, 416088, 414285, 411935, 409365, 407275, 406274, 406385, 406894, 406863, 405917, 404416, 402876, 401535, 400583, 400347, 400844, 401399, 401212, 400359]
59778D00359n28O88J848K269K123K021K237K420K059J189N54Q34J775K364J973
59763D24185J079O43J004J593J709J288Q92J032J614K122K256K211K295K523K749
59748D49195L025L479L966M154L991L763L697L800M056M418M577M097K936J548
59734E00702L77m03n90J01J403K268J787K68j045j328r08n73n39l28M12J261J391
59717E04256N26o26j093o51J11N85O74N45L39L29Q80J945K874L104K817K544K384
59700E21543K101J796J839K172K276K029K036K765L843M590M919N059M718L217
59686E64903O01k070l786m516m675m231k959j353m71p80j605k037j910j642j477
59671E31992j354j286j392j709k213k990l934m492m112l002k032j803k090k306
$$ y = [400359, 399831, 400519, 402367, 404636, 406759, 408780, 411017, 413437, 415496, 416685, 417239, 418073, 419848, 422212, 424185, 425264, 425907, 426911, 428504, 430213, 431501, 432393, 433425, 435039, 437161, 439417, 441628, 443923, 446446, 449195, 452220, 455699, 459665, 463819, 467810, 471573, 475270, 479070, 483126, 487544, 492121, 496218, 499154, 500702, 501079, 500676, 500086, 500187, 501590, 503858, 505645, 505913, 504868, 503540, 502632, 502059, 501520, 501192, 501604, 502865, 504256, 504782, 504156, 503063, 502412, 502523, 503108, 503782, 504327, 504666, 504995, 505875, 507820, 510694, 513798, 516615, 519159, 521543, 523644, 525440, 527279, 529451, 531727, 533756, 535792, 538557, 542400, 546990, 551909, 556968, 561686, 564903, 565504, 563434, 559648, 555132, 550457, 546226, 543267, 541914, 541443, 540663, 539058, 537021, 535111, 533469, 531992, 530638, 529352, 527960, 526251, 524038, 521048, 517114, 512622, 508510, 505508, 503476, 501673, 499583, 497277]
59657D97277k189j816j264m96M67J406J940J855J451J340J694J891J317K68m84
59642E04657q11j249j933k379k504k931l848m363l759k674k177k150j615m25N02
59627D72341O57N69P44Q29M24p8l0N48J198J717K045J759L98j743l764n015n418
59610D67181m952l616j981j088j274j619j118m0M88O5n42o43m75n77q64q95n93
59593D47457j98K77R26J516J773J949K512L213L198K182Q40k35j211k254k782
59578D59163k281j426j484k666l876m208l983l955m091l768k865k056j897k085
59564D18522j902j225o39n43n63j67M62P08N36N86J113J499J244Q27J002J610
59548D23070J816J368J010J496K770M248N510O499P329Q111Q889R810J1355J4141
$$ y = [497277, 495088, 493272, 492008, 491512, 491979, 493385, 495325, 497180, 498631, 499971, 501665, 503556, 504873, 505141, 504657, 503846, 502597, 500664, 498285, 495781, 492850, 489002, 484639, 480880, 478206, 476029, 473879, 472264, 471839, 472341, 472998, 473567, 474311, 475140, 475564, 475486, 475456, 476004, 477202, 478919, 480964, 482723, 483121, 481378, 477614, 472599, 467181, 462229, 458613, 456632, 455544, 454270, 452651, 451533, 451493, 451981, 452046, 451504, 450861, 450386, 449809, 448945, 448050, 447457, 447259, 447536, 448462, 449978, 451751, 453700, 456212, 459425, 462623, 464805, 465645, 465410, 464199, 461945, 459163, 456882, 455456, 453972, 451306, 447430, 443222, 439239, 435284, 431193, 427425, 424560, 422504, 420607, 418522, 416620, 415395, 414756, 414213, 413650, 413483, 413945, 414653, 415189, 415775, 416888, 418387, 419631, 420458, 421460, 423070, 424886, 426254, 427264, 428760, 431530, 435778, 441288, 447787, 455116, 463227, 472116, 481926, 493281, 507422]
59534E07422J8017K1498K2526J9950J4143O518j074o750r323r026p054m284q96
59521E71667K697N373O365O227O084O120N502L682J227q31k054k814l682m838
59507F00725o058p158q219r284r980r789q773p692p191p082o648n449l678j838
59493E01886l70N27R72J220J353J285J177J512K435L331L511L249L616N149P213
59478E38066Q841R969J1397J3652J6281J8300J9143J8938J7986J6199J3156Q652
59466G10580L117k424o746q996r131p889o186m424k405J74L336O863J0512J4027
59452G00408J7099J9510K1304K2806K4419K6401K8694L0966L2738L3360L1899
59441I89604K7356J9304Q326m161j6279k5875l1082l1537k8987k6006k4043k3026
$$ y = [507422, 525439, 546937, 569463, 589413, 603556, 610074, 609000, 602250, 592927, 583901, 576847, 572563, 571667, 574364, 579737, 586102, 592329, 598413, 604533, 610035, 613717, 614944, 614113, 612059, 609245, 605563, 600725, 594667, 587509, 579290, 570006, 560026, 550237, 541464, 533772, 526581, 519499, 512851, 507402, 503724, 501886, 501516, 502043, 503015, 504235, 505588, 506873, 508050, 509562, 511997, 515328, 518839, 522088, 525704, 530853, 538066, 546907, 556876, 568273, 581925, 598206, 616506, 635649, 654587, 672573, 688772, 701928, 710580, 713697, 711273, 704527, 695531, 686400, 678511, 672325, 667901, 665496, 665670, 669006, 675869, 686381, 700408, 717507, 737017, 758321, 781127, 805546, 831947, 860641, 891607, 924345, 957705, 989604, 1016960, 1036264, 1044590, 1040429, 1024150, 998275, 967193, 935656, 906669, 880663, 856620, 833594]
59429H33594k2623k2973k4021k5036k5165k3984k1250j6952j1934p663m672j878
59417F25443J871O293J0413J4125J7874K1306K3714K5628K8370L1554L2191K7184
59405H65966J6201J871j1957k1848k5912k4667k0527j5565r832k584N089R818
59393G66053Q446P12j0576k1532k9284l2857l2810l0352k6629k2500j8566j5171
59381E34934j2403j0219q509p062n651m257l084k253j644j114o79m07k70k64m20
59366D76698n68l49K85Q24P72L31J06L34P93J471K765M754O699P680P644P472
59350E17711P989R164J0406J1419J2526J4146J6147J7865J8717J8700J8265J7827
59338F90882J7432J6800J5577J3616J1052Q187N232K215q56l804o361q507j0591
$$ y = [833594, 810971, 787998, 763977, 738941, 713776, 689792, 668542, 651590, 639656, 631993, 627321, 625443, 627314, 633607, 644020, 658145, 676019, 697325, 721039, 746667, 775037, 806591, 838782, 865966, 882167, 884038, 872081, 850233, 824321, 799654, 779127, 763562, 753730, 751146, 756235, 766053, 774499, 775211, 764635, 743103, 713819, 680962, 648152, 617800, 591171, 568671, 550105, 534934, 522531, 512312, 503803, 496741, 491090, 486833, 483749, 481496, 479852, 478738, 478059, 477652, 477382, 477118, 476698, 476130, 475781, 476066, 476890, 477662, 477993, 478099, 478433, 479226, 480697, 483462, 488216, 494915, 502595, 510239, 517711, 525700, 534864, 545270, 556689, 569215, 583361, 599508, 617373, 636090, 654790, 673055, 690882, 708314, 725114, 740691, 754307, 765359, 773546, 778778, 780993, 780137, 776333, 769972, 761465, 750874]
59325G50874j2939j5253j6645j6506j5282j4054j3370j2876j2143j1321j0579
59314E99906r470p521n181l400k338j229L25J799K778L788N517P824J0214J2750
59300F15762J5633J7963J7814J3822O438k322r965j4649j6050j5438j4478j3658
59288F00872j2274r893p280n513m654l825k352m47J209K177K533K717L213M154
59274E70637N256O208P155Q553J0502J2376J3405J3597J3776J4555J5440J5329
59262G06789J3806J1556R405P362M941K041r61l780o352q477r873j0718j1580
59249G04159j2557j2943j2048j0122q159o945o528o416n982m836l125j491m96
59236F12511j13J53P10J632K705L522L656L053K199J622J244N40p27k296l929
$$ y = [750874, 737935, 722682, 706037, 689531, 674249, 660195, 646825, 633949, 621806, 610485, 599906, 590436, 582915, 577734, 574334, 571996, 570767, 571092, 572891, 575669, 579457, 584974, 592798, 603012, 615762, 631395, 649358, 667172, 680994, 687432, 685110, 675145, 660496, 644446, 629008, 614530, 600872, 588598, 578705, 571425, 565912, 561258, 557433, 555081, 554634, 555843, 558020, 560553, 563270, 566483, 570637, 575893, 582101, 589256, 597809, 608311, 620687, 634092, 647689, 661465, 676020, 691460, 706789, 720595, 732151, 741556, 748918, 753859, 755900, 754939, 751159, 744807, 736330, 726457, 715739, 704159, 691602, 678659, 666611, 656489, 648330, 641385, 634857, 628441, 622459, 617623, 614498, 613007, 612511, 612398, 612551, 613261, 614893, 617598, 621120, 624776, 627829, 630028, 631650, 632894, 633434, 632707, 630411, 626482]
59221F26482n685p447q646q932q880r442j0636j1316j0589r010p916p703p427
59208E12853o206m457l268k892k560j683o44r1k3j8j5k61o22n31K04J027J305
59191D92118J083Q30P46O91O94J038J772K509K844K766K445J993J681K002L079
59176E18291M194M495M185M364N540O932P599P680P940Q549R050R290R546R734
59162F17389R312Q213P122O522O106N463M793M399M031L280K268J283P1j811m076
59147F74365n913p005p697q133q024p404o909o920p076o983o900p151p272o543
59133E74435n178m268m346m542l638j624K10Q23N81N70J119J662K019L019N234
59118E66076P737R070R216R591J0909J2138J2103J1265J1022J1772J2611J2754
$$ y = [626482, 620797, 613350, 604704, 595772, 586892, 577450, 566814, 555498, 544909, 535899, 527983, 520280, 512853, 506647, 502190, 498922, 496030, 493470, 491787, 491143, 491052, 491029, 491011, 490996, 490735, 490113, 489582, 489786, 490813, 492118, 493201, 494031, 494777, 495468, 496162, 497200, 498972, 501481, 504325, 507091, 509536, 511529, 513210, 515212, 518291, 522485, 526980, 531165, 535529, 541069, 548001, 555600, 563280, 571220, 579769, 588819, 598109, 607655, 617389, 626701, 634914, 642036, 648558, 654664, 660127, 664920, 669319, 673350, 676630, 678898, 680181, 680252, 678441, 674365, 668452, 661447, 653750, 645617, 637593, 630189, 623280, 616360, 609284, 602301, 595401, 588250, 580978, 574435, 569257, 564989, 560643, 556101, 552463, 550839, 551049, 551872, 552453, 553023, 554142, 555804, 557823, 560842, 566076, 573813, 582883, 592099, 601690, 612599, 624737, 636840, 648105, 659127, 670899, 683510, 696264]
59106F96264J2350J1865J1383J0747R879Q752P490O540O346O641O514N351L398
59093H03520J260p02k256l069l010k506k145k026j827j418j158j561k820m644
59079G75638o470p885q930r899j0872j1666j2268j2925j3545j3430j2132j0370
59067F45246r432r612r804q924p273o088o010o495o614n985m863l765l234l628
59053E53519m706n525n184l770k334j804k096k483k558k494k419k057j198k49
59039E14642J15j56l68Q0R66J598J729J820K371L338M351N218N927O370O460O532
59023E60993P149Q414R782J0730J1307J1816J2391J3041J3767J4224J3720J2040
59011F99374R936Q189O501M112J299p25j496j837k428k805k329j239PJ603L691
$$ y = [696264, 708614, 720479, 731862, 742609, 752488, 761240, 768730, 775270, 781616, 788257, 794771, 800122, 803520, 804780, 804078, 801822, 798753, 795743, 793237, 791092, 789066, 787239, 785821, 784663, 783102, 780282, 775638, 769168, 761283, 752353, 742454, 731582, 719916, 707648, 694723, 681178, 667748, 655616, 645246, 635814, 626202, 616398, 607474, 600201, 594113, 588103, 581608, 574994, 569009, 564146, 560381, 557147, 553519, 548813, 543288, 538104, 534334, 532000, 530196, 528100, 525617, 523059, 520565, 518146, 516089, 514891, 514642, 514757, 514601, 514233, 514313, 515279, 516877, 518606, 520426, 522797, 526135, 530486, 535704, 541631, 548001, 554461, 560993, 568142, 576556, 586338, 597068, 608375, 620191, 632582, 645623, 659390, 673614, 687334, 699374, 709310, 717499, 724000, 728112, 729411, 728686, 727190, 725353, 722925, 720120, 717791, 716552, 716559, 718162, 721853]
58996G21853N383N637M706L653K612Q82j319k609k493k394l786o091p555p704
58982G10775p791q831j0178j0482r455q053p092o222m545j996L92J708K168K599
58968F42997L300M026M787N911P239Q107Q353Q567R057R206Q403O955N482M006
58954G36396K245L72j274k851m618o190o965p123p384p893q146p905p363o388
58940F64913m629k448q35k2P95J910K273R23j522l722n378p103q922r989r862
58925F16382r074q268p467o578n873n576n345m699l704k857k387j996j338m83
58911E50737K02N80J052K158L813N157N478N164N473P225J0002J2762J4855J6180
58897F40838J6696J6278J5103J3676J2215J0337P686M749K664K170L069M755O906
$$ y = [721853, 727236, 732873, 737579, 741232, 743844, 744726, 743407, 740798, 738305, 735911, 732125, 726034, 718479, 710775, 702984, 694153, 683975, 673493, 664038, 655985, 648893, 642671, 638126, 636130, 636522, 638230, 640398, 642997, 646297, 650323, 655110, 661021, 668260, 676367, 684720, 693287, 702344, 711550, 719953, 726908, 732390, 736396, 738641, 739013, 737739, 734888, 730270, 724080, 717115, 709992, 702608, 694715, 686569, 678664, 671301, 664913, 660284, 657836, 657001, 656979, 657774, 659684, 661957, 662880, 661358, 657636, 652258, 645155, 636233, 626244, 616382, 607308, 599040, 591573, 584995, 579122, 573546, 568201, 563502, 559798, 556941, 554554, 552558, 551220, 550737, 550939, 551519, 552571, 554729, 558542, 563699, 569177, 574341, 579814, 587039, 597041, 609803, 624658, 640838, 657534, 673812, 688915, 702591, 714806, 725143, 732829, 737578, 740242, 742412, 745481, 750236, 757142]
58884G57142R281J1299J2370J2611J2661J2622J1628Q880M898J273p90j579k482
58871H49814m705q261j2016j4648j5681j5600j5038j4088j2532j0522q703p673
58859G10347p497p805q149q261q103p758p354p067p131p633q216q237p387o064
58845F03685m969m465m442m567m499m028l370l132l699m730n585o029o161n855
58831E38154m929l767l099k927k380r95M19P56M0p31r41q84r57j020p19q6N66
58814E16500J071J464J746J818J680J528J545J656J606J276Q61N60K54k88r05
58799E32372j103p43l38m21q13r17o05m35r02j741k189j757o57M97J266J669J975
58782E25158K314K630K975L575M460N220N429N175M849M521L825K525Q74p08k029
$$ y = [757142, 766423, 777722, 790092, 802703, 815364, 827986, 839614, 848494, 853392, 854665, 853875, 852296, 849814, 845109, 836848, 824832, 810184, 794503, 778903, 763865, 749777, 737245, 726723, 718020, 710347, 702850, 695045, 686896, 678635, 670532, 662774, 655420, 648353, 641222, 633589, 625373, 617136, 609749, 603685, 598716, 594251, 589809, 585242, 580743, 576715, 573345, 570213, 566514, 561784, 556199, 550170, 544009, 538154, 533225, 529458, 526359, 523432, 521052, 520057, 520476, 521232, 521272, 520541, 519600, 518716, 517759, 516739, 516020, 515934, 516500, 517571, 519035, 520781, 522599, 524279, 525807, 527352, 529008, 530614, 531890, 532751, 533311, 533565, 533277, 532372, 531269, 530526, 530188, 529767, 528954, 528037, 527432, 526997, 526095, 524354, 522165, 520408, 519751, 520248, 521514, 523183, 525158, 527472, 530102, 533077, 536652, 541112, 546332, 551761, 556936, 561785, 566306, 570131, 572656, 573530, 572822, 570793]
58767E70793l025l532l496l265l376l924m414m321l721l099k665k158j461j035
58753E27301j293j716j196N67K486L286K925K388K391K803L218L436L402L200
58739E53198L285M147N584O633O665O109N874O263O806O950O612O162O039O325
58725F36652O568O211N303M465L984L337J992M02l06M63K180L763M438M142L521
58710F87115L502M477N837O507N975M561K787R08r94k805m453n998p568r369j1538
58695F78944j3763j5190j5193j4207j3326j3021j2796j2091j0943r561p925o193
58683E34735m953m523m387l890l198k973l329l718l778l682l605l403k928k221
58669D84147j267N4J626L071M257N435O753P941Q681Q939Q753P974O488M508K392
$$ y = [570793, 567768, 564236, 560740, 557475, 554099, 550175, 545761, 541440, 537719, 534620, 531955, 529797, 528336, 527301, 526008, 524292, 523096, 523663, 526149, 529435, 532360, 534748, 537139, 539942, 543160, 546596, 549998, 553198, 556483, 560630, 566214, 572847, 579512, 585621, 591495, 597758, 604564, 611514, 618126, 624288, 630327, 636652, 643220, 649431, 654734, 659199, 663183, 666520, 668512, 668914, 668608, 669071, 671251, 675014, 679452, 683594, 687115, 690617, 695094, 700931, 707438, 713413, 717974, 720761, 721669, 720675, 717870, 713417, 707419, 699851, 690482, 678944, 665181, 649991, 634798, 620591, 607265, 594244, 581448, 569357, 558414, 548853, 540928, 534735, 529782, 525259, 520872, 516982, 513784, 510811, 507482, 503764, 499986, 496304, 492699, 489296, 486368, 484147, 482880, 482934, 484560, 487631, 491888, 497323, 504076, 512017, 520698, 529637, 538390, 546364, 552852, 557360, 559752]
58654E59752L81j353k590l259l494l364k744j814j254j547k254k531k218j958
58640E29753k156k407k157j442p36l67l55n17n16p0O29J008Q59O71Q68J102P89
58623E24956O7l98m41m75o05l85L43J120J706K575M048N578O513P057P713Q185
58607E67557P746O547N533N056M476L466K745K980L684L844L149J966N64r28k009
58592F16376k147j574j119j106r33J8J549K899L624L998M663O006P743R119R614
58577F58730R399Q989Q627Q292Q043P894P462O348N025M662N747P373Q403Q984
58563G63978J0254J2663J5269J6911J7577J8151J9111K0030K0327J9999J9264
58552I53534J7894J5392J1811P922M438J436j326l868o058p934r559j0779j1464
$$ y = [559752, 560133, 558780, 556190, 552931, 549437, 546073, 543329, 541515, 540261, 538714, 536460, 533929, 531711, 529753, 527597, 525190, 523033, 521591, 520855, 520488, 520133, 519616, 519100, 519030, 519659, 520667, 521526, 522197, 523065, 524167, 524956, 525023, 524625, 524184, 523709, 523104, 522719, 523062, 524182, 525888, 528463, 532511, 538089, 544602, 551659, 559372, 567557, 575303, 581850, 587383, 592439, 596915, 600381, 603126, 606106, 609790, 613634, 616783, 618749, 619313, 618385, 616376, 614229, 612655, 611536, 610430, 609497, 609515, 611064, 613963, 617587, 621585, 626248, 632254, 639997, 649116, 658730, 668129, 677118, 685745, 694037, 702080, 709974, 717436, 723784, 728809, 733471, 739218, 746591, 754994, 763978, 774232, 786895, 802164, 819075, 836652, 854803, 873914, 893944, 914271, 934270, 953534, 971428, 986820, 998631, 1006553, 1010991, 1012427, 1011101, 1007233, 1001175, 993241, 983682, 972903, 961439]
58539I61439j1842j2269j2796j3322j4037j5277j6922j8329j8911j8498j7213
58528G92023j5393j3572j2101j0769r100p099n258l871k778j786q91j0R77J796
58514G12168J915J293M81j17n25o18N5J475K842L468L503L448L485L637L984M256
58498G44750L928L154K886L353L298J711l72j088l34K66j52o82l39N15J017J094
58482G63005J265J887L072M819O741Q263R401J0752J2341J3212J2696J1456J0497
58469H69407R671P914M816J152k093m650o766q532r674r909r385q610p826o594
58455H18921m452j824L06J740L357N746Q134R233Q636O805M231J293j370l164
58441H57592m183m900n315n032m134l311l026k984k568j388N98L008N004N869
$$ y = [961439, 949597, 937328, 924532, 911210, 897173, 881896, 864974, 846645, 827734, 809236, 792023, 776630, 763058, 750957, 740188, 731088, 723989, 718731, 714860, 712082, 710296, 709405, 709395, 710372, 712168, 714083, 715376, 715857, 715740, 715215, 714597, 714652, 716127, 718969, 722437, 725940, 729388, 732873, 736510, 740494, 744750, 748678, 751832, 754718, 758071, 761369, 763080, 762708, 761620, 761286, 761552, 761400, 760718, 760379, 760894, 761911, 763005, 764270, 766157, 769229, 774048, 780789, 789052, 798453, 809205, 821546, 834758, 847454, 858910, 869407, 879078, 886992, 891808, 892960, 890867, 886217, 879451, 870919, 861245, 851336, 841951, 833341, 825515, 818921, 814469, 812645, 812951, 814691, 818048, 823794, 831928, 841161, 849797, 856602, 860833, 862126, 860756, 857592, 853409, 848509, 843194, 838162, 834028, 830717, 827691, 824707, 822139, 820751, 821349, 824357, 829361, 835230]
58427H35230N842N979P002Q643J0220J1454J2419J3110J3355J2998J1894R961
58415I58107P450M990L056J520j17k046l927n280n993o385o830p265p125n911
58401I24244l838j803n94k24m6O02J860L303M313M587M368M103L876L414K604
58386I50769J767J260J052Q75O38L88k6r23k283l511l887l198j818k31J381L047
58370I45300M652N864O468O678O932P382P764P848P845Q167Q851R566J0187J1041
58356A054545J2354J3663J4168J3636J2570J1476J0298Q750O867N057L783L359
58344A170526L843M824N613N923O262P298R004J0743J2130J3358J4646J5892J6951
58331A297013J7885J8680J9055J8772J7974J7021J6051J4932J3523J1926J0419
$$ y = [835230, 841072, 847051, 854053, 862696, 872916, 884370, 896789, 909899, 923254, 936252, 948146, 958107, 965557, 970547, 973603, 975123, 975006, 972960, 969033, 963753, 957760, 951375, 944545, 937280, 930155, 924244, 920406, 918603, 918009, 917785, 917739, 918341, 920201, 923504, 927817, 932404, 936772, 940875, 944751, 948165, 950769, 952536, 953796, 954848, 955723, 956361, 956749, 956723, 955800, 953517, 950006, 946119, 942921, 941103, 940872, 942253, 945300, 949952, 955816, 962284, 968962, 975894, 983276, 991040, 998888, 1006733, 1014900, 1023751, 1033317, 1043504, 1054545, 1066899, 1080562, 1094730, 1108366, 1120936, 1132412, 1142710, 1151460, 1158327, 1163384, 1167167, 1170526, 1174369, 1179193, 1184806, 1190729, 1196991, 1204289, 1213293, 1224036, 1236166, 1249524, 1264170, 1280062, 1297013, 1314898, 1333578, 1352633, 1371405, 1389379, 1406400, 1422451, 1437383, 1450906, 1462832, 1473251]
58320A473251R171Q095P124O550O767P571Q175Q256Q447R313J0410J1133J2006
58307A586269J3959J6524J8100J8292J8645K0380K2597K3623K3269K2657K2486
58296A806801K2570K2744K3075K3287K2903K2075K1551K1780K2578K3618K4647
58285B057629K5339K5524K5645K6407K8034L0245L2758L5252L7101L7906L8289
58274B400129L9376M1459M3769M5677M7459M9701N2512N5556N8448O0912O2992
58263B957990O5141O7833P0909P3749P6040P8079Q0224Q2473Q4604Q6379Q7687
58252C811108Q8698Q9863R1462R3366R5470R8070J01417J05424J10276J16766
58242D801920J25083J33871J41627J48788J57219J67642J78973J90386K02663
$$ y = [1473251, 1482422, 1490517, 1497641, 1504191, 1510958, 1518529, 1526704, 1534960, 1543407, 1552720, 1563130, 1574263, 1586269, 1600228, 1616752, 1634852, 1653144, 1671789, 1692169, 1714766, 1738389, 1761658, 1784315, 1806801, 1829371, 1852115, 1875190, 1898477, 1921380, 1943455, 1965006, 1986786, 2009364, 2032982, 2057629, 2082968, 2108492, 2134137, 2160544, 2188578, 2218823, 2251581, 2286833, 2323934, 2361840, 2400129, 2439505, 2480964, 2524733, 2570410, 2617869, 2667570, 2720082, 2775638, 2834086, 2894998, 2957990, 3023131, 3090964, 3161873, 3235622, 3311662, 3389741, 3469965, 3552438, 3637042, 3723421, 3811108, 3899806, 3989669, 4081131, 4174497, 4269967, 4368037, 4469454, 4574878, 4685154, 4801920, 4927003, 5060874, 5202501, 5351289, 5508508, 5676150, 5855123, 6045509, 6248172]
58233F248172K16727K32046K47417K62715K78996K97183L17397L39391L63156
58224H803200L89082M17750M49598M84772N23452N66116O13404O66079P25452
58215A3638905P93272Q70711R58117J056571J168985J298784J448429J620453
58207B2854227J819269K050412K319030K631362K997927L433988L957789M590291
58199D6654295N355753O279929P388188Q707628J0269192J2102996J4230577J6662683
58191A27651241J9399790K2426444K5699244K9118193L2437418L5096104L6088546
58184C27916980L4111931K8109900J7973749M905465q893267k1059204k9918088
58177C53147466l4889964l6358378l5236277l2529368k9067680k5418761k1914654
$$ y = [6248172, 6464899, 6696945, 6944362, 7207077, 7486073, 7783256, 8100653, 8440044, 8803200, 9192282, 9610032, 10059630, 10544402, 11067854, 11633970, 12247374, 12913453, 13638905, 14432177, 15302888, 16261005, 17317576, 18486561, 19785345, 21233774, 22854227, 24673496, 26723908, 29042938, 31674300, 34672227, 38106215, 42064004, 46654295, 52010048, 58289977, 65678165, 74385793, 84654985, 96757981, 110988558, 127651241, 147051031, 169477475, 195176719, 224294912, 256732330, 291828434, 327916980, 362028911, 390138811, 408112560, 413018025, 404124758, 383065554, 353147466, 318257502, 281899124, 246662847, 214133479, 185065799, 159647038, 137732384]
58170A37732384j8719861j5896788j3452943j1368911r611760q141312o915396
58163E3625413n894793n045492m338265l748316l255467k843174k496672k202897
58155B3800337j952117j738000j555150j397271j258174j133707j021948r22063
58147A2821907q33442p55264o86115o24080n67688n16625m71402m32554m00178
58138G534559l73707l51770l32486l14237k96060k77545k58802k40621k24012
58129D865319k09254j95716j82910j71234j61265j52649j44353j35869j27649
58120C384420j20243j13565j07291j01562r6757r2664q8456q3691p8901p4878
58110B426412p1606o8390o4851o1254n7879n4698n1785m9442m7633m5760m3490
$$ y = [137732384, 119012523, 103115735, 89662792, 78293881, 68682121, 60540809, 53625413, 47730620, 42685128, 38346863, 34598547, 31343080, 28499906, 26003234, 23800337, 21848220, 20110220, 18555070, 17157799, 15899625, 14765918, 13743970, 12821907, 11988465, 11233201, 10547086, 9923006, 9355318, 8838693, 8367291, 7934737, 7534559, 7160852, 6809082, 6476596, 6162359, 5866299, 5588754, 5329952, 5089331, 4865319, 4656065, 4460349, 4277439, 4106205, 3944940, 3792291, 3647938, 3512069, 3384420, 3264177, 3150612, 3043321, 2941759, 2845002, 2752338, 2663882, 2580191, 2501290, 2426412, 2354806, 2286416, 2221565, 2160311, 2102432, 2047734, 1995949, 1946507, 1898874, 1853114, 1809624]
58099A809624m1377m0217m0023m0102l9911l9438l8776l7869l6669l5247l3667
58088A386328l1956l0123k8132k5985k3989k2641k2090k1966k1934k2019k2103
58077A113390k1652k0522j9554j9665k0481k0677j9611j7940j6631j6038j6066
58066I04553j6495j6851j6549j5503j4200j2969j1675j0310r341r105r306r583
58054G52666j0101j1061j2023j2359j2164j2020j1954j1317r915q547q010q071
58042F25124p858p082o254n795n501n117m898n155n561n477m973m896n752o990
58028E43815p735p875p943q185q331q226q159q350q551q399p860p093o128m959
58014D36021l786k897k386k179k221k448k700k915l250l720l852l109j691m31
$$ y = [1809624, 1768247, 1728030, 1688007, 1647905, 1607994, 1568556, 1529780, 1491911, 1455242, 1419995, 1386328, 1354372, 1324249, 1296117, 1270132, 1246143, 1223502, 1201412, 1179446, 1157512, 1135493, 1113390, 1091738, 1071216, 1051662, 1031997, 1011516, 990839, 971228, 953288, 936657, 920619, 904553, 888058, 871207, 854658, 839155, 824955, 811986, 800311, 790001, 780660, 771555, 762249, 752666, 742565, 731504, 719481, 707122, 694958, 682938, 670984, 659667, 649752, 641205, 633195, 625124, 617266, 610184, 603930, 598135, 592634, 587517, 582619, 577464, 571903, 566426, 561453, 556557, 550805, 543815, 536080, 528205, 520262, 512077, 503746, 495520, 487361, 479011, 470460, 462061, 454201, 447108, 440980, 436021, 432235, 429338, 426952, 424773, 422552, 420104, 417404, 414489, 411239, 407519, 403667, 400558, 398867, 398436]
58000C98436K51Q34J784K633K549J639R89J329K234K901L166L362L552L377K592
57985D31628J393L21m0N27J444J679P96n86j683k546l580m540m769m336m046m285
57969D07377m591m511m112l465k437j343r96j632k416k550k258k108j969j444
57955C71545q47q82j586k360k868l209l334l041k484k024j504m66R43J984K458
57940C52325L084M415N928O740O830P006P852R060R874R925R525R204Q995Q327
57926D59090O640M020J101j474l355m518n318o372p966r647j0710j1057j1182
57913C99252j1328j1142j0311r167q334q037p940p594o806n679m488l582l250
57900C01594l531m123m589m721m673m552m112l121j892j022o28l07R1K59J46K02
$$ y = [398436, 398687, 399521, 401305, 403938, 406487, 408126, 409115, 410444, 412678, 415579, 418745, 422107, 425659, 429036, 431628, 433021, 433342, 433302, 433829, 435273, 436952, 437748, 437162, 435479, 432933, 429353, 424813, 420044, 415708, 411662, 407377, 402786, 398275, 394163, 390698, 388261, 386918, 385922, 384290, 381874, 379324, 377066, 374958, 372989, 371545, 370698, 369816, 368230, 365870, 363002, 359793, 356459, 353418, 350934, 348910, 347406, 346940, 347883, 349867, 352325, 355409, 359824, 365752, 372492, 379322, 386328, 394180, 403240, 413114, 423039, 432564, 441768, 450763, 459090, 465730, 469750, 470851, 469377, 466022, 461504, 456186, 449814, 441848, 432201, 421491, 410434, 399252, 387924, 376782, 366471, 357304, 348970, 340933, 332993, 325399, 318593, 312914, 308426, 304844, 301594, 298063, 293940, 289351, 284630, 279957, 275405, 271293, 268172, 266280, 265258, 264630, 264323, 264414, 264673, 264819, 265021]
57884B65021O91J310J883K751L938M636M200L110K240J667J025M60K11k95j714
57869B91134l310l558k274r64p30j004p20K20J253K013K386K322K202K724L905
57854B95599M776M631M005L901M460N015N059M573L649K387J089J10m46p85j245
57839C36778k155l493m669m996m564m170m281m537m504m234l855l175k161j251
57825B84733o82lJ263K822L974M428M376M095L922M272N165N936N808M555K410
57810C37074k94l025n101o329p244q291r119r192q689q224p986p669p105o412
57796B42394n677m909m183l495k675j755j150j125j446j797k165k439k202j346
57782B06030m86j61p8L24J077K060L514N385O697O590N606M975M881M505L588
$$ y = [265021, 265712, 267022, 268905, 271656, 275594, 280230, 284430, 287540, 289780, 291447, 292472, 292932, 293143, 292848, 291134, 287824, 284266, 281992, 281028, 280298, 279294, 278574, 278794, 280047, 282060, 284446, 286768, 288970, 291694, 295599, 300375, 305006, 309011, 312912, 317372, 322387, 327446, 332019, 335668, 338055, 339144, 339254, 338808, 338023, 336778, 334623, 331130, 326461, 321465, 316901, 312731, 308450, 303913, 299409, 295175, 291320, 288145, 285984, 284733, 284051, 284048, 285311, 288133, 292107, 296535, 300911, 305006, 308928, 313200, 318365, 324301, 330109, 334664, 337074, 336780, 333755, 328654, 322325, 315081, 306790, 297671, 288479, 279790, 271566, 263580, 255911, 248806, 242394, 236717, 231808, 227625, 224130, 221455, 219700, 218550, 217425, 215979, 214182, 212017, 209578, 207376, 206030, 205544, 205383, 205305, 205629, 206706, 208766, 212280, 217665, 224362, 230952, 236558, 241533, 246414, 250919, 254507]
57767B54507K800K439J877O11j031k514l717m667n266n582n772n707n179m546
57753B18253m412m673m622m107l680l454k755j316J00P25O64K84m76j460j830
57738A87241j070m7o5j093j757j089M16J574J803J397R14O05M40M32O87J066J093
57721A92547N30j26j57M04P98N36q5n23n82l42K4K08L0k03m7K65k0j033j962k166
57701A88096j922j735j598j363j254j367j221m18O59J388J758K081K213J742P08
57686A87767m36j343j692j044N44K065K600K596L283M877O427P606R477J2991
57672B35718J7494K1595K5101K9264L5149M2425M9845N6242O0477O0490N3255
57661F87055L6717J2326j4559l7370n2002n8279n8502n5072m9359m2115l4316
$$ y = [254507, 257307, 259746, 261623, 262234, 261203, 258689, 254972, 250305, 245039, 239457, 233685, 227978, 222799, 218253, 213841, 209168, 204546, 200439, 196759, 193305, 190550, 189234, 189334, 190059, 190723, 191007, 190531, 189071, 187241, 186171, 186124, 186059, 184966, 183209, 182120, 182536, 184110, 185913, 187310, 188224, 188829, 189269, 189701, 190388, 191454, 192547, 193077, 192951, 192794, 193198, 193996, 194532, 194447, 193924, 193342, 193000, 193024, 193232, 193262, 193059, 193012, 193277, 193257, 192224, 190262, 188096, 186174, 184439, 182841, 181478, 180224, 178857, 177636, 177218, 177877, 179265, 181023, 183104, 185317, 187059, 187767, 187331, 185988, 184296, 183252, 183796, 185861, 188461, 191057, 194340, 199217, 205644, 213250, 222727, 235718, 253212, 274807, 299908, 329172, 364321, 406746, 456591, 512833, 573310, 633800, 687055, 723772, 736098, 721539, 684169, 632167, 573888, 515386, 460314, 410955, 368840, 334524]
57650C34524k7327k2128j8584j5699j2797j0116q128o691n349m171l617l617l445
57637A92855k708j882j534j490j167n06j6J6q6J02M77N39M6p13j366j882k361
57620A78324k559k083j136o23j129k109k531k158j705j709j852j593j001n63m73
57605A55100n02m68m18l46r1L62P40P82N29J63l02r29j556j838j745j706k078
57588A45697k621k744k201j301m85K6J57j13o04r84j084j046j033j026j035j212
57572A28391j625k067k261k099j558p47j00j71q56j253o81L54P08k8j175j849
57556A12983j702q87J61P64M45m74j079q05P7J018J763K210K180J720J252J092
57540A20718J031O96J46k00m6O54J739K730K849J688j95j735k421k540k418j948
$$ y = [334524, 307197, 285069, 266485, 250786, 237989, 227873, 219745, 213054, 207705, 203534, 199917, 196300, 192855, 190147, 188265, 186731, 185241, 184074, 183568, 183552, 183568, 183482, 183584, 184061, 184600, 184646, 183933, 182567, 180685, 178324, 175765, 173682, 172546, 171923, 170794, 168685, 166154, 163996, 162291, 160582, 158730, 157137, 156136, 155573, 155100, 154598, 154130, 153712, 153366, 153275, 153637, 154377, 155159, 155688, 155851, 155549, 154620, 153064, 151226, 149481, 147775, 145697, 143076, 140332, 138131, 136830, 136345, 136371, 136528, 136415, 135811, 134827, 133743, 132697, 131664, 130638, 129603, 128391, 126766, 124699, 122438, 120339, 118781, 118034, 117934, 117763, 116907, 115654, 114973, 115327, 116035, 116007, 114832, 112983, 111281, 110394, 110555, 111319, 111764, 111290, 110211, 109406, 109483, 110501, 112264, 114474, 116654, 118374, 119626, 120718, 121749, 122445, 122591, 122391, 122345, 122999, 124738, 127468, 130317, 132005, 131810, 130075, 127654, 125114, 122696, 120748]
57524A20748j033p6L83K90J23L50J064J973K577K477J731Q84M49M49O07Q55J319
57507A35170J859J996J506Q04N10P27R98Q77L44k73o65p71p89r28j174j351j477
57490A37363j799k340k658k388j797j480j509j435j042p21q42j219j461j458j286
57475A13928r12l81l8j83o27r07q17m38J61Q69J331J265R11P29O84L69j74l56
57457A15414J6L29O8l80k88L34Q13P48L60Jj73p7K77N94N56L38M07P22P30L33
57437A21122K77J106K164K303J317R7n68o77n30k26J38K75J11JK35N89O85M99
57419A28918K71P7j12k04j29o0j81k96m8N78J244J695J885J776J317O22o2o00
57401A36691r88j229j307j164o14M19J380J307K1j281j357m67J43Q5J87R46J709
$$ y = [120748, 119715, 119639, 120022, 120312, 120435, 120785, 121849, 123822, 126399, 128876, 130607, 131491, 131940, 132389, 132996, 133851, 135170, 137029, 139025, 140531, 141335, 141845, 142572, 143570, 144447, 144791, 144518, 143853, 143082, 142293, 141365, 140191, 138840, 137363, 135564, 133224, 130566, 128178, 126381, 124901, 123392, 121957, 120915, 120194, 119352, 118133, 116672, 115214, 113928, 113016, 112635, 112597, 112414, 111787, 110880, 110063, 109625, 109786, 110655, 111986, 113251, 114162, 114891, 115575, 115944, 115770, 115414, 115430, 115759, 115827, 115447, 115159, 115493, 116306, 117054, 117414, 117415, 117242, 117165, 117442, 118036, 118592, 118930, 119337, 120059, 120789, 121122, 121399, 122505, 124669, 126972, 128289, 128386, 127818, 127141, 126611, 126385, 126523, 126798, 126909, 126910, 127145, 127734, 128419, 128918, 129189, 129266, 129154, 128950, 128821, 128761, 128580, 128284, 128236, 128814, 130058, 131753, 133638, 135414, 136731, 137353, 137291, 136691, 135703, 134474, 133167, 132003, 131389, 131808, 133188, 134495, 134516, 133235, 131878, 131411, 131554, 131639, 131826, 132772, 134481]
57384A34481J741J230P21K92j45l17o6J75k3l16j39L31L96j34p34r50q18n61l37
57365A34827l22o88j360k008k286j962r79M06J659K359K420J934J116M34L40O56
57349A36546P57N90R10K024L022K892J935J311J522K101K523K578K083J072J98
57334A62064J70P88J230J192J017P78J85n73p72j85N65R40J012R36O25K37K27
57317A70436N80P08M08K52N87R36P85L41kk90n48l16O09J566J854J739J917K301
57299A83863K230J694J413J672J832J264K57k97J66J394K538K831K302J723J703
57284B06585J940J741J016L43N5j63o47j139j124m66M54J152J343J039N21K00
57268B12850K66M58L78L3r9K77P63P94N47Q01J755K542K407J822J828K498K928
$$ y = [134481, 136222, 137452, 138173, 138465, 138320, 138003, 137937, 138112, 138089, 137773, 137634, 137965, 138361, 138227, 137493, 136543, 135725, 135164, 134827, 134505, 133817, 132457, 130449, 128163, 126201, 125222, 125628, 127287, 129646, 132066, 134000, 135116, 135550, 135890, 136546, 137303, 137893, 138803, 140827, 143849, 146741, 148676, 149987, 151509, 153610, 156133, 158711, 160794, 161866, 162064, 162234, 163022, 164252, 165444, 166461, 167239, 167424, 166851, 166079, 165894, 166459, 167399, 168411, 169347, 169972, 170209, 170436, 171016, 171724, 172132, 172384, 172971, 173907, 174692, 175033, 175031, 174741, 174193, 173877, 174486, 176052, 177906, 179645, 181562, 183863, 186093, 187787, 189200, 190872, 192704, 193968, 194225, 193928, 194094, 195488, 198026, 200857, 203159, 204882, 206585, 208525, 210266, 211282, 211625, 211680, 211517, 210870, 209731, 208607, 208141, 208595, 209747, 211090, 212129, 212650, 212850, 213116, 213574, 213952, 213985, 213886, 214163, 214926, 215720, 216267, 217068, 218823, 221365, 223772, 225594, 227422, 229920, 232848]
57251B32848K637K211K301K780L177L384L545L684L838M125M444M459M179M086
57237B81698M408M736M712M574M663M876N127N766O908P825P793P185O994P456
57223C64721P965Q158Q264Q301P885P077O753P627R277J0594J1012J0970J1200
57210D79804J1783J2075J1566J0619J0080J0243J0695J1225J2242J3862J5143
57199F09337J5042J3820J2820J2931J3862J4852J5497J5885J6369J7257J8299
57188G75971J8674J7940J6790J6261J6406J6474J6254J6319J6866J7335J7417
57177I62707J7619J8337J9164J9629K0012K0779K1762K2481K2886K3126K2998
57166A191500K2245K1267K0801K0952K1130K0982K0852K1149K1646K1661K0797
$$ y = [232848, 235485, 237696, 239997, 242777, 245954, 249338, 252883, 256567, 260405, 264530, 268974, 273433, 277612, 281698, 286106, 290842, 295554, 300128, 304791, 309667, 314794, 320560, 327468, 335293, 343086, 350271, 357265, 364721, 372686, 380844, 389108, 397409, 405294, 412371, 419124, 426751, 436028, 446622, 457634, 468604, 479804, 491587, 503662, 515228, 525847, 535927, 546170, 556865, 568090, 580332, 594194, 609337, 624379, 638199, 651019, 663950, 677812, 692664, 708161, 724046, 740415, 757672, 775971, 794645, 812585, 829375, 845636, 862042, 878516, 894770, 911089, 927955, 945290, 962707, 980326, 998663, 1017827, 1037456, 1057468, 1078247, 1100009, 1122490, 1145376, 1168502, 1191500, 1213745, 1235012, 1255813, 1276765, 1297895, 1318877, 1339729, 1360878, 1382524, 1404185, 1424982]
57155A424982J9283J7737J6684J6321J6626J7450J8448J9127J9349J9699K0926
57144A626632K2926K4706K5467K5399K5196K5259K5662K6547K8016K9865L1811
57133A917486L3801L5818L7597L8994M0446M2633M5649M8864N1504N3055N3264
57122B399111N2290N0907N0067N0076N0580N1486N3505N7541O3839P1943Q1245
57111C032590R1232J01475J11775J22443J34234J48005J64460J84179K07786K36279
57101D534458K71401L15558L71070M39536N22143O20457P36632Q72625J029359
57092I713239J206399J401812J611840J830623K050189K260568K450242K607269
57084B5132181K720228K777551K765675K669350K476121K182292J795514J332915
$$ y = [1424982, 1444265, 1462002, 1478686, 1495007, 1511633, 1529083, 1547531, 1566658, 1586007, 1605706, 1626632, 1649558, 1674264, 1699731, 1725130, 1750326, 1775585, 1801247, 1827794, 1855810, 1885675, 1917486, 1951287, 1987105, 2024702, 2063696, 2104142, 2146775, 2192424, 2241288, 2292792, 2345847, 2399111, 2451401, 2502308, 2552375, 2602451, 2653031, 2704517, 2758022, 2815563, 2879402, 2951345, 3032590, 3123822, 3225297, 3337072, 3459515, 3593749, 3741754, 3906214, 4090393, 4298179, 4534458, 4805859, 5121417, 5492487, 5932023, 6454166, 7074623, 7811255, 8683880, 9713239, 10919638, 12321450, 13933290, 15763913, 17814102, 20074670, 22524912, 25132181, 27852409, 30629960, 33395635, 36064985, 38541106, 40723398, 42518912, 43851827]
57076D3851827Q17993K78386k56761p61148j215371j607971j933763k191566k382338
57067C4599288k507593k568906k569154k514107k412291k273429k107581j925224
57059A5721003j736687j550652j373303j208926j060533r29531q15397p16300
57051F329674o30039n54539m88203m30233l80191l36988k98763k64151k33093
57042B713474k05915j82172j60959j41845j24672j08812r3529p8948o5593n2942
57032A498087l9485k4511q610Q015K6125M4440N6619N3624L0880p010m8857q3869
57020A505448j06400j15926j14807j06590r4981q2857p1674o1802n3240m5894
57010F51277l9533l3883k8810k4363k0765j8340j7146j6579j5735j4307j2809
$$ y = [43851827, 44669820, 44948206, 44691445, 43930297, 42714926, 41106955, 39173192, 36981626, 34599288, 32091695, 29522789, 26953635, 24439528, 22027237, 19753808, 17646227, 15721003, 13984316, 12433664, 11060361, 9851435, 8790902, 7861371, 7045974, 6329674, 5699635, 5145096, 4656893, 4226660, 3846469, 3509481, 3210718, 2946567, 2713474, 2507559, 2325387, 2164428, 2022583, 1897911, 1789099, 1695570, 1616622, 1551029, 1498087, 1458602, 1434091, 1425481, 1433496, 1459621, 1504061, 1560680, 1614304, 1645184, 1638174, 1589317, 1505448, 1399048, 1283122, 1168315, 1061725, 966744, 883887, 812213, 750411, 697171, 651277, 611744, 577861, 549051, 524688, 503923, 485583, 468437, 451858, 436123, 421816, 409007]
56999D09007j1678j0580r010p175n749m913m199l156j761j49J548L140M470N687
56985C65482O997Q246R031R196Q775P468M726M90m554r513j3669j6337j7004j5942
56971C43392j4264j2957j1971j0558q270n421k718n75J203L189N662Q348J0854
56958C05914J3184J5385J6944J7026J5247J1778O807N93n936j1381j5000j7070
56946C53491j7937j7416j5498j2906j0406p956n130j995R35L416N670Q091J0980
56933B93339J4357J7726K0311K1761K2109K0838J6692R138m40r699j7213k2854
56921C86065k6629k8143k7267k4680k1494j8588j6301j4404j2399j0157q149o826
56909A71028o017n305m738m639m898m972m519l574k239o97N39R58P18N69J077
$$ y = [409007, 397329, 386749, 377739, 370564, 364815, 359902, 355703, 352547, 350786, 350637, 352185, 355325, 359795, 365482, 372479, 380725, 389756, 398952, 407727, 415195, 419921, 420411, 415857, 406344, 392675, 376338, 359334, 343392, 329128, 316171, 304200, 293642, 285372, 279951, 277233, 276658, 277861, 281050, 286712, 295060, 305914, 319098, 334483, 351427, 368453, 383700, 395478, 402285, 402878, 396942, 385561, 370561, 353491, 335554, 318138, 302640, 289734, 279328, 271372, 266242, 264247, 265182, 268598, 274268, 282359, 293339, 307696, 325422, 345733, 367494, 389603, 410441, 427133, 436271, 435831, 426132, 408919, 386065, 359436, 331293, 304026, 279346, 257852, 239264, 222963, 208559, 196160, 186003, 177854, 171028, 165011, 159706, 154968, 150329, 145431, 140459, 135940, 132366, 130127, 129430, 129969, 130927, 131645, 132214, 133291]
56894A33291K197L641N240O961Q816J0744J2503J3867J5110J6770J8476J8515
56882B66131J5448R944M207l69m140p762j0750j1980j1034q571n568k577M53L785
56868B37217P361J0740J3796J7127K1321K6027L0326L3952L7396M0690M2660M1623
56856E60236L6448K6987J4175j6j3109k3124k9058l0848k9319k5955k1918j7212
56844D47287j1329m568K047Q168J4418K1184K8029L4708M1746M9482N7228O3762
56832G52162O7795O7384O0026M4561K2775j513k4581m3629n6581o2536o2429n8309
56820G05125n1869m4124l6041k8463k1393j4177o553J125Q638J6116K3484L0318
56808E82186L6497M2242M7029M8862M5145L4433J7547k573k2097l7949m8716n4372
$$ y = [133291, 135488, 139129, 144369, 151330, 160146, 170890, 183393, 197260, 212370, 229140, 247616, 266131, 281579, 291523, 295730, 295361, 291221, 283459, 272709, 260729, 249695, 241124, 235556, 232979, 233432, 237217, 244578, 255318, 269114, 286241, 307562, 333589, 363915, 397867, 435263, 475953, 518613, 560236, 596684, 623671, 637846, 637830, 624721, 601597, 572539, 541691, 512372, 486417, 464499, 447287, 435958, 431390, 433437, 441605, 456023, 477207, 505236, 539944, 581690, 631172, 688400, 752162, 819957, 887341, 947367, 991928, 1014703, 1013190, 988609, 944980, 888399, 825863, 763434, 705125, 653256, 609132, 573091, 544628, 523235, 509058, 502505, 503630, 512268, 528384, 551868, 582186, 618683, 660925, 707954, 756816, 801961, 836394, 853941, 851368, 829271, 791322, 742606, 688234]
56796F88234n5491n2989m8174m2301l5959k9286k2669j6763j1781p284k727K114
56784C64924P230J2433J7203K0990K3610K4861K3762J8951J0227p52j1668k1021
56772D90750k8197l2751l4415l3676l1642k9178k6412k3173j9591j6146j3297
56761B02272j1177r636q475p584o852o094n193m309l699l383l174l035l120l370
56747A23171l383k886k140j599j337j072o64l79n15j003j401j343q72l26N4K93
56731A04598M33L47m1m49m84j32J74J32r0j08K41P86J217J302J087R14J081J479
56713A12487J694J500J042N04ok51J11R93J736J788J368J074J079J065Q71P46
56697A27801Q54R45O80Q0n46r38j022q95p60p53p52m49J94P74Q62N44K87K78K19
$$ y = [688234, 632743, 579754, 531580, 489279, 453320, 424034, 401365, 384602, 372821, 365537, 362810, 364924, 372154, 384587, 401790, 422780, 446390, 471251, 495013, 513964, 524191, 523439, 511771, 490750, 462553, 429802, 395387, 361711, 330069, 300891, 274479, 251306, 231715, 215569, 202272, 191095, 181459, 172984, 165400, 158548, 152454, 147261, 142952, 139253, 135870, 132696, 129661, 126541, 123171, 119788, 116902, 114762, 113163, 111826, 110754, 110090, 109711, 109196, 108193, 106792, 105449, 104577, 104251, 104305, 104598, 105031, 105378, 105337, 104888, 104404, 104272, 104446, 104578, 104488, 104380, 104621, 105407, 106624, 107926, 109013, 109927, 111008, 112487, 114181, 115681, 116723, 117227, 117221, 116970, 117081, 118074, 119810, 121598, 122966, 124040, 125119, 126184, 127055, 127801, 128655, 129600, 130280, 130360, 129814, 128876, 127854, 126959, 126199, 125446, 124694, 124245, 124439, 125213, 126075, 126619, 126906, 127184, 127403]
56678A27403j93p56j001p81l86r4J04K68K81K8l50o56r27j242j318p25L86J155
56660A21196R42J33l24l2O03J098J391J534J390R62O51P88J139J267J237J479
56644A35454J973K066J332K08n30o25l96j41J00L32M98O27P77Q28O05K17j3M8
56626A43360K71O21J211J877K122J692R59L85o5n68p82j70J080K024K088J670
56610A57775J279O89n29j861k079p54J075K018J731Q57mo94j102j022n46j02O5
56593A56796P4j9l90r51j163p18o5J63o3l28l87j80L89J091J160K10q30o67N44
56574A54666J327J028O56J154J894J782J055R42J866L039L666L737L674L875M616
56559A88977N771O767P318Q026R414J0652J0247Q148O091N480N857O002N607N076
$$ y = [127403, 127210, 126454, 125453, 124672, 124286, 124192, 124296, 124564, 124845, 124873, 124523, 123867, 122940, 121698, 120380, 119655, 120041, 121196, 122138, 122271, 121947, 121915, 122518, 123616, 125007, 126541, 127931, 128893, 129544, 130332, 131471, 132738, 133975, 135454, 137427, 139493, 140825, 141033, 140503, 139878, 139482, 139341, 139441, 139773, 140271, 140898, 141675, 142503, 143108, 143325, 143312, 143360, 143631, 144252, 145463, 147340, 149462, 151154, 152113, 152498, 152433, 151865, 151083, 150913, 151993, 154017, 156105, 157775, 159054, 159743, 159214, 157353, 155274, 154520, 155595, 157613, 159344, 160201, 160197, 159503, 158401, 157379, 156833, 156731, 156796, 156870, 156851, 156461, 155510, 154347, 153629, 153564, 153727, 153664, 153336, 152949, 152769, 153158, 154249, 155409, 155619, 154789, 154122, 154666, 155993, 157021, 157677, 158831, 160725, 162507, 163562, 164504, 166370, 169409, 173075, 176812, 180486, 184361, 188977, 194748, 201515, 208833, 216859, 226273, 236925, 247172, 255320, 261411, 266891, 272748, 278750, 284357, 289433]
56545B89433M380L172J823J255J583J648L33k068m141m809m294l685l756m376
56531B76498m971n334n684o068o172n874n542n487n479n164m717m602m732m399
56517B02273l153j458k97k62j047j736j664j085q97j523k290k238j345m83j98
56502A82597j52O8K19j15p31j040r06o57m52j98j02n67j388j668r96j70j23o43
56484A72976p99m39k42l25J12J343K245J740L99k83J18P08Q76J006J371J414O94
56467A82914j97m09oL20L25L42M85N04L75M23P02Q33O36M50N91Q33P68M09J40
56448A90438J59K69J81r4k11J36P93J178R20L78K31N74P86M49j8k0L18L37j49
56429A96655n83m93j43m3j51Q0Q33J515J409N94p9J8N52P46M47K91O88J135R21
$$ y = [289433, 293813, 296985, 298808, 300063, 301646, 303294, 303627, 301559, 297418, 292609, 288315, 284630, 280874, 276498, 271527, 266193, 260509, 254441, 248269, 242395, 236853, 231366, 225887, 220723, 216006, 211404, 206672, 202273, 199120, 197662, 197365, 197103, 196056, 194320, 192656, 191571, 190674, 189151, 186861, 184623, 183278, 182795, 182597, 182445, 182513, 182732, 182617, 181886, 180846, 179940, 179283, 178831, 178633, 178531, 177964, 176576, 174908, 173912, 173742, 173619, 172976, 172177, 171738, 171496, 171171, 171283, 172626, 174871, 176611, 177010, 176727, 176845, 177553, 178429, 179435, 180806, 182220, 182914, 182717, 182308, 182302, 182622, 182947, 183289, 183774, 184278, 184653, 185076, 185778, 186611, 187247, 187697, 188288, 189121, 189889, 190298, 190438, 190597, 190866, 191047, 190953, 190742, 190878, 191671, 192849, 193769, 194147, 194378, 194952, 195738, 196187, 196169, 196149, 196467, 196804, 196655, 196072, 195579, 195436, 195393, 195242, 195322, 196155, 197670, 199079, 199673, 199594, 199612, 200164, 200910, 201357, 201648, 202336, 203471, 204392]
56410B04392K46M3O90J452J483Q87M14L98N04M63M65P39J089J149Q31L39j22m21
56392B15041l34L40J445K371K502J800Q20K06J77N28R37J185J179J113J464K493
56376B33267L659L968L092J833J097Q10L16m08p17m23j70m24o84k17Q34J592J522
56359B48947R33M42K87K14j11o87j110j030n70j69LJ27K42J51j02j01K82N78M48
56340B48774L15P82J726K459K539K021J152L90L86J309K338K494J881J428J494
56325B71488J532J175Q34R02J172J391J749K322K562J963Q59J00J00O12J172J418
56309B91351J237R73J129J611J622P90k9L22J824L381M256M628M834M764M307
56294C27000L730L272K748J934J034M58M03Q56J733K734L317L208K763K528K554
$$ y = [204392, 204638, 204681, 205371, 206823, 208306, 209193, 209607, 210005, 210509, 210972, 211437, 212176, 213265, 214414, 215245, 215584, 215462, 215041, 214707, 215047, 216492, 218863, 221365, 223165, 223985, 224191, 224368, 224896, 225833, 227018, 228197, 229310, 230774, 233267, 236926, 240894, 243986, 245819, 246916, 247726, 248042, 247634, 246917, 246494, 246324, 245900, 245216, 244999, 245833, 247425, 248947, 249880, 250322, 250609, 250823, 250712, 250025, 248915, 247885, 247315, 247146, 247149, 247276, 247518, 247669, 247567, 247466, 247748, 248326, 248774, 249089, 249871, 251597, 254056, 256595, 258616, 259768, 260158, 260544, 261853, 264191, 266685, 268566, 269994, 271488, 273020, 274195, 275029, 275931, 277103, 278494, 280243, 282565, 285127, 287090, 287949, 288049, 288149, 288761, 289933, 291351, 292588, 293561, 294690, 296301, 297923, 298713, 298684, 299006, 300830, 304211, 308467, 313095, 317929, 322693, 327000, 330730, 334002, 336750, 338684, 339718, 340176, 340579, 341435, 343168, 345902, 349219, 352427, 355190, 357718, 360272]
56279C60272K496K303K354K882L693M530N358O122O546O501O309O346O574O791
56265D29077P184Q137R524J0680J1195J1386J1816J2730J4144J6044J8181K0035
56253E80133K1384K2745K4860K7899L1511L5406L9479M3480M7105N0361N3445
56242I77808N6236N8250N9191N9153N8219N6207N2948M8372M2352L4752K5793
56231A529281J6075O099l863j3405k1884k8959l4890m0076m4517m7926n0149n1209
56219A214577n1148n0110m8435m6479m4350m1977l9282l6250l2926k9481k6174
56208G67965k3285k1094j9795j9165j8473j7082j5214j3692j2862j2151j0795
56197E84357q685o315m261k910k352k284k172j727j041k63N67J300J664J640J505
$$ y = [360272, 362768, 365071, 367425, 370307, 374000, 378530, 383888, 390010, 396556, 403057, 409366, 415712, 422286, 429077, 436261, 444398, 453922, 464602, 475797, 487183, 498999, 511729, 525873, 541917, 560098, 580133, 601517, 624262, 649122, 677021, 708532, 743938, 783417, 826897, 874002, 924363, 977808, 1034044, 1092294, 1151485, 1210638, 1268857, 1325064, 1378012, 1426384, 1468736, 1503488, 1529281, 1545356, 1551455, 1547592, 1534187, 1512303, 1483344, 1448454, 1408378, 1363861, 1315935, 1265786, 1214577, 1163429, 1113319, 1064884, 1018405, 974055, 932078, 892796, 856546, 823620, 794139, 767965, 744680, 723586, 703791, 684626, 666153, 649071, 633857, 620165, 607303, 595152, 584357, 575672, 569357, 565096, 562186, 559834, 557550, 555378, 553651, 552610, 552347, 552914, 554214, 555878, 557518, 559023]
56182E59023J367J086P31O68R66J217J196J256J671K176K537L033L826M353M116
56167E89222L713M222N646O832P026O737O801P285P779Q267R113J0288J1272J1802
56153F96005J2371J3651J5612J7634J9464K1614K4568K8000L1287L4558L8647
56142I53411M4069N0731N8594O7885P8378Q9165R9558J09461J18190J23447J22485
56131A915374J14404J01007Q5546P1020N9350N1302M6618M4117M1768L7096K8329
56120B595931J5734J707j0834k0155k6175l0083l3940l9967m9407o1979p6471
56109B264361r1302j04196j12317j13906j09684j01875r2054q0658o8348n6626
56099A333395m6784l8928l2401k6642k1358j6390j1905q405o140m633l115j333
$$ y = [559023, 560390, 561476, 562207, 562875, 563841, 565058, 566254, 567510, 569181, 571357, 573894, 576927, 580753, 585106, 589222, 592935, 597157, 602803, 609635, 616661, 623398, 630199, 637484, 645263, 653530, 662643, 672931, 684203, 696005, 708376, 722027, 737639, 755273, 774737, 796351, 820919, 848919, 880206, 914764, 953411, 997480, 1048211, 1106805, 1174690, 1253068, 1342233, 1441791, 1551252, 1669442, 1792889, 1915374, 2029778, 2130785, 2216331, 2287351, 2346701, 2398003, 2444621, 2488738, 2530506, 2567602, 2595931, 2611665, 2613372, 2602538, 2582383, 2556208, 2526125, 2492185, 2452218, 2402811, 2340832, 2264361, 2173059, 2068863, 1956546, 1842640, 1732956, 1631081, 1539027, 1458369, 1390021, 1333395, 1286611, 1247683, 1215282, 1188640, 1167282, 1150892, 1138987, 1130582, 1124442, 1119809, 1116694, 1115361]
56087A115361K28J053J290J625K466L556M464N220O109P092P891Q528R248J0018
56073A184149J0750J1870J3823J5938J6840J6391J6116J7150J8708J9403J9188
56062A360326J9024J9248J9423J9442J9737K0504K1511K2579K3616K4319K4476
56051A594205K4315K4058K3514K2585K1766K1482K1436K1320K1556K2609K4017
56040A842863K4971K5514K6266K7383K8617L0036L1897L4168L6838M0223M4173
56029B192949M7627M9875N1666N4071N6885N9167O0729O1962O2819O3204O3803
56018B824757O5307O7327O9243P1525P4860P8639Q1813Q4634Q8068R2093R6120
56007C694386J00501J05870J11552J16459J21050J26662J33381J40424J47995
$$ y = [1115361, 1115589, 1116642, 1117932, 1119557, 1122023, 1125579, 1130043, 1135263, 1141372, 1148464, 1156355, 1164883, 1174131, 1184149, 1194899, 1206769, 1220592, 1236530, 1253370, 1269761, 1285877, 1303027, 1321735, 1341138, 1360326, 1379350, 1398598, 1418021, 1437463, 1457200, 1477704, 1499215, 1521794, 1545410, 1569729, 1594205, 1618520, 1642578, 1666092, 1688677, 1710443, 1731925, 1753361, 1774681, 1796237, 1818846, 1842863, 1867834, 1893348, 1919614, 1946997, 1975614, 2005650, 2037547, 2071715, 2108553, 2148776, 2192949, 2240576, 2290451, 2342117, 2396188, 2453073, 2512240, 2572969, 2634931, 2697750, 2760954, 2824757, 2890064, 2957391, 3026634, 3098159, 3173019, 3251658, 3333471, 3418105, 3506173, 3598266, 3694386, 3794887, 3900757, 4012309, 4128768, 4249818, 4376480, 4509861, 4650285, 4798280]
55998D798280J56757J66076J75023J84501J96020K08850K20970K32568K45869
55989F584914K61647K78665K96565L16541L38998L63232L89571M19226M52100
55980I701459M87453N26554N71640O22571O77894P38926Q09103Q89584R79638
55971A6004822J081321J199272J335925J491919J671693J883620K134287K428613
55963B9231472K776538L193738L695022M293978N010387N870774O900352Q122328
55955F9094589R565634J1262344J3233859J5488108J8028739K0850039K3915052
55948A81438364K7133212L0297614L2916534L4032595L2328150K6706126J7068228
55941C81920823M677467q255591j9493899k7575892l2086574l3442832l2482538
$$ y = [4798280, 4955037, 5121113, 5296136, 5480637, 5676657, 5885507, 6106477, 6339045, 6584914, 6846561, 7125226, 7421791, 7738332, 8077330, 8440562, 8830133, 9249359, 9701459, 10188912, 10715466, 11287106, 11909677, 12587571, 13326497, 14135600, 15025184, 16004822, 17086143, 18285415, 19621340, 21113259, 22784952, 24668572, 26802859, 29231472, 32008010, 35201748, 38896770, 43190748, 48201135, 54071909, 60972261, 69094589, 78660223, 89922567, 103156426, 118644534, 136673273, 157523312, 181438364, 208571576, 238869190, 271785724, 305818319, 338146469, 364852595, 381920823, 386598290, 378342699, 358848800, 331272908, 299186334, 265743502, 233260964]
55934B33260964l0098906k7021108k3745715k0568709j7647473j5049427j2786509
55927H6343117j0843717r196192p812297o654868n688060m882016m210199l647388
55919C3408380l173035k772860k434672k145799j896265j680730j495026j333661
55911A6476332j192331j069581r63739q70919p87916p14450o50597n94333n43510
55902I088956m98154m58886m24715l93999l66059l40522l16612k94156k73825
55893E722028k55476k37839k20655k05264j92172j79900j67232j54831j43641
55884C965018j33531j24715j18674j16191j15877j15820j15283j13830j10380
55875B900717j04579r7836r1663q6131q0956p6760p3980p1690o8834o5665o2766
$$ y = [233260964, 203162058, 176140950, 152395235, 131826526, 114179053, 99129626, 86343117, 75499400, 66303208, 58490911, 51836043, 46147983, 41265967, 37055768, 33408380, 30235345, 27462485, 25027813, 22882014, 20985749, 19305019, 17809993, 16476332, 15284001, 14214420, 13250681, 12379762, 11591846, 10877396, 10226799, 9632466, 9088956, 8590802, 8131916, 7707201, 7313202, 6947143, 6606621, 6290009, 5995853, 5722028, 5466552, 5228713, 5008058, 4802794, 4610622, 4430722, 4263490, 4108659, 3965018, 3831487, 3706772, 3588098, 3471907, 3356030, 3240210, 3124927, 3011097, 2900717, 2796138, 2698302, 2606639, 2520508, 2439552, 2362792, 2288812, 2217122, 2148288, 2082623, 2019857]
55864B019857n9683n5745n1348m7330m3872m1012l9325l9016l9182l8957l8564
55853A525823l8309l7535l5750l3849l3038l3133l3120l2716l2273l1711l0639
55842A153750k9175k7720k6281k4780k3526k2648k1622k0136j8796j8194j7872
55831I03000j7002j5502j3747j1877j0176r404r736j0203j0096j0174j1362j2951
55819G60770j3523j3109j3011j3692j4270j4076j3428j2725j1874j0882j0090
55808F20090r597r086q406p659o753n503m183l257k515j201Q75K847L683L210
55794E72545K165J530J704K168K075J372R36J293J793J602R64P02P95K31j777
55779E90098n156r309j3339j6100j6729j5320j2599r074n017r28K660N716Q269
$$ y = [2019857, 1960174, 1904429, 1853081, 1805751, 1761879, 1720867, 1681542, 1642526, 1603344, 1564387, 1525823, 1487514, 1449979, 1414229, 1380380, 1347342, 1314209, 1281089, 1248373, 1216100, 1184389, 1153750, 1124575, 1096855, 1070574, 1045794, 1022268, 999620, 977998, 957862, 939066, 920872, 903000, 885998, 870496, 856749, 844872, 834696, 825292, 815556, 805353, 795257, 785083, 773721, 760770, 747247, 734138, 721127, 707435, 693165, 679089, 665661, 652936, 641062, 630180, 620090, 610493, 601407, 593001, 585342, 578589, 573086, 568903, 565646, 563131, 561930, 562805, 565652, 569335, 572545, 574710, 576240, 577944, 580112, 582187, 583559, 584495, 585788, 587581, 589183, 590147, 590849, 591644, 591875, 590098, 584942, 575633, 562294, 546194, 529465, 514145, 501546, 492472, 487455, 486527, 489187, 494903, 503172]
55766E03172R415P726K836l853j0181j4535j6283j5739j3990j2233j0886r564
55754D15885p964o418n506n467o062o836p436p865q333q766q694p829o444m923
55740C17342l342j913j246j525j885j478q64j366l088m621m823m035l275l069
55726B80812l439m318n379n959n735n100m614m337l984l483k983k524j931r97
55712B26029L88K154M068N908P477Q379Q011O282M033K152M69j794m495o370o649
55697B56042o102n980o520o983o834o203n496m932m466l798k612j022L85J158
55683A96637J415J469J368J112J095J780L008M001M104L311K021N99p14j671k072
55668B17463j970j692j540j463j164o23l12o72j454j872j387j69J216K271K728
$$ y = [503172, 512587, 520313, 523149, 519296, 509115, 494580, 478297, 462558, 448568, 436335, 425449, 415885, 407921, 401503, 395997, 390530, 384468, 377632, 370196, 362331, 353998, 345232, 336538, 328709, 322265, 317342, 314000, 312087, 310841, 309316, 307431, 305953, 305089, 303723, 300635, 296014, 291191, 287156, 283881, 280812, 277373, 273055, 267676, 261717, 255982, 250882, 246268, 241931, 237947, 234464, 231481, 228957, 227026, 226029, 226417, 228571, 232639, 238547, 246024, 254403, 262414, 268696, 272729, 274881, 275350, 273556, 269061, 262691, 256042, 249940, 243960, 237440, 230457, 223623, 217420, 211924, 206992, 202526, 198728, 196116, 195094, 195479, 196637, 198052, 199521, 200889, 202001, 203096, 204876, 207884, 211885, 215989, 219300, 221321, 221920, 221206, 219535, 217463, 215493, 213801, 212261, 210798, 209634, 209011, 208699, 208027, 206573, 204701, 203314, 203145, 204361, 206632, 209360]
55653B09360K534J868J074M89L16N72R30Q36J34n38l82M48Q69J80j105k000k250
55636B13335k404k968l935n048o050o658o645o141n608n293m897l977k682j767
55622A49262j740k209k357j945j489j396j426j244j031j073j086o11Q3J59o17
55607A31280j557j983j969j869j746j574j556j765j833j487j052r77j099r55o27
55592A09231o29r78j027m29K88M05p3n86q22r24r70p69k89M2j66o30n88K55J335
55573A02676J978K291K888L846M471M252L593L244L286L138K474J605R25L86k55
55558A40798r43j425j715k192l106m177m759m432l368k185j419j181j217j228
55544A07451j113r29p88p60p88p01l86K1K03J1l31m52k46Q0L23M86O27P17P28
$$ y = [209360, 211894, 213762, 214836, 215325, 215641, 216213, 217143, 217979, 218113, 217575, 217193, 217641, 218510, 218690, 217585, 215585, 213335, 210931, 207963, 204028, 198980, 192930, 186272, 179627, 173486, 167878, 162585, 157688, 153711, 151029, 149262, 147522, 145313, 142956, 141011, 139522, 138126, 136700, 135456, 134425, 133352, 132266, 131655, 131738, 131897, 131280, 129723, 127740, 125771, 123902, 122156, 120582, 119026, 117261, 115428, 113941, 112889, 111912, 110813, 109858, 109231, 108602, 107624, 106597, 106168, 106456, 106861, 106788, 106202, 105380, 104456, 103486, 102717, 102428, 102470, 102304, 101674, 101086, 101341, 102676, 104654, 106945, 109833, 113679, 118150, 122402, 125995, 129239, 132525, 135663, 138137, 139742, 140667, 141053, 140798, 139855, 138430, 136715, 134523, 131417, 127240, 122481, 118049, 114681, 112496, 111077, 109896, 108679, 107451, 106338, 105409, 104621, 103861, 103073, 102372, 101986, 102007, 102210, 102221, 101890, 101438, 101192, 101272, 101595, 102081, 102708, 103425, 104153]
55525A04153P46Q56J010J092J058Q59L89k86q08r01q61j323k398l330l214k054
55509I4988q37n34j115j636j375o80m55r01j240r22n17q29j515j472m84L79K65
55492H1120l82p40q39j211j796j979j475o08K60R97J483J594J419J186R76Q11
55476H0816P93R15Q67M52m4k53l01m89o94n77l14l80p52q47l89K42N76M82M6n13
55456G9636p86n26q0J3k00k46r3j95n82o98k79K62N36N73L00n15j482j598o28
55437G3412L10K34l24k22N29R08N20J03L43R51J208Q34J51l53m86n06p48j064
55419G5800r34k58M15P58J206K116K911K842K199J856J836J330J67p52q13n64
55403I0115p88j389j791j844j777j618j243q28o84p87q14o31l76j84j40l95r99
$$ y = [104153, 104899, 105755, 106765, 107857, 108915, 109774, 110163, 109877, 109069, 108168, 107307, 105984, 103586, 100256, 97042, 94988, 94151, 93617, 92502, 90866, 89491, 88811, 88356, 87455, 86215, 85293, 84776, 83947, 82432, 80960, 80476, 80855, 81120, 80738, 79998, 79159, 77948, 76152, 74173, 72698, 72090, 72350, 73347, 74830, 76424, 77843, 79029, 80005, 80816, 81609, 82524, 83391, 83843, 83799, 83546, 83245, 82756, 82062, 81485, 81171, 80791, 80039, 79192, 78803, 79045, 79621, 80103, 80149, 79636, 78850, 78324, 78244, 78257, 78057, 77811, 77718, 77523, 76941, 76243, 75964, 76226, 76762, 77335, 77635, 77120, 75638, 74040, 73412, 73722, 73956, 73632, 73410, 73939, 74847, 75367, 75470, 75813, 76764, 77972, 78806, 78957, 78604, 78118, 77612, 76864, 75800, 74866, 74608, 75023, 75781, 76987, 79103, 82014, 84856, 87055, 88911, 90747, 92077, 92244, 91492, 90679, 90115, 89327, 87938, 86147, 84303, 82526, 80908, 79665, 78837, 78153, 77366, 76552, 75921, 75545, 75361, 75221, 74826, 73827]
55386G3827j594j624q99J99J090J445J224N86j76p15q36o12k96q2M6K53O28J005
55368G3469J069O58m4o51q99p82m90k61k55m76p15o48j44N07P69M35q4j88K12
55349G1482O35P07N57M52L13r3o34q64n87r4K18K37J17O7K07L94K65l96j262j665
55329G0056j315n75K9L61N86P65Q04O54L47n1l90l70J72Q74J058M25n37j023p24
55310G1146p3L03K04r0l35n94r90j247q21M13J761K248J630O27J31K66M39J63
55292G5181l95p43o56k90J61O36J065J228R70M57P4P1L19M58K34l12q99j161q46
55273G5552j9Q38J110N68l95j140j316r65l14L41O35M08j9j44P6K26J14kL9J1
55253G5604j82k29J2J31r6j17N52J310J221M81J60N31P61M14J53M70P72L88k95
$$ y = [73827, 72233, 70609, 69710, 69909, 70999, 72444, 73668, 74254, 74078, 73363, 72527, 71915, 71619, 71537, 71583, 71836, 72464, 73469, 74538, 75196, 75152, 74501, 73602, 72820, 72330, 72069, 71814, 71338, 70623, 69975, 69831, 70338, 71107, 71542, 71458, 71270, 71482, 72117, 72824, 73381, 73833, 74146, 74053, 73419, 72555, 71968, 71874, 72092, 72329, 72446, 72513, 72720, 73114, 73379, 72983, 71721, 70056, 68741, 68166, 68195, 68556, 69142, 69907, 70711, 71365, 71712, 71661, 71271, 70901, 71073, 71947, 73005, 73430, 72893, 71870, 71146, 71073, 71376, 71580, 71490, 71155, 70561, 69571, 68324, 67503, 67916, 69677, 71925, 73555, 74182, 74313, 74579, 75018, 75181, 74786, 74043, 73387, 73097, 73258, 73894, 74959, 76187, 77157, 77614, 77688, 77759, 78078, 78536, 78770, 78458, 77559, 76398, 75552, 75533, 76371, 77481, 78049, 77654, 76514, 75198, 74233, 73919, 74260, 74895, 75303, 75284, 75140, 75216, 75442, 75556, 75554, 75593, 75604, 75422, 75193, 75205, 75336, 75240, 75123, 75675, 76985, 78206, 78687, 78847, 79378, 80139, 80553, 80706, 81176, 81948, 82336, 82041]
55234H2041n16l23k24j94Q6K98k00j284k086k100j608j020m90j27lJ50N91R79
55216G3970P58J47m7L21N19K13Q2O45J222Q21m52j488j466m59R52K049K185J286
55198H1258J42l56k56l29q66j284j050l80K52P52J182J299Q12n0p11q83p60o10
55180G8162n01l91j59L63J122J638J478R22O83R06R19K46o81j142j017o18l6O88
55162H2582J125Q35J31k20oL22N41R13J465J759J587J246Q51R7r91j770j889j835
55144H6743k006j986j395q23r75j356q28P01K075K367J766R52L21k3j42l41q07
55127H4243j157q16O2O55N45J30p9o2m7j63m80r37j180r79o44n44l03O16J644
55108H0504J443j52j595j558m77M39Q94J295J611J474J066Q89Q56M50k89p35o72
$$ y = [82041, 81525, 81202, 80978, 80784, 80870, 81168, 80968, 79684, 77598, 75498, 73890, 72870, 72380, 72253, 72250, 72400, 72991, 73970, 74728, 74875, 74828, 75149, 75668, 75881, 75963, 76608, 77830, 78651, 78199, 76711, 75245, 74786, 75738, 77787, 79972, 81258, 81400, 81044, 80788, 80459, 79593, 78309, 77259, 76879, 77131, 77883, 79065, 80364, 81176, 81126, 80415, 79532, 78772, 78162, 77661, 77270, 77111, 77474, 78596, 80234, 81712, 82634, 83317, 84223, 85142, 85388, 84707, 83565, 82548, 81930, 81894, 82582, 83707, 84542, 84673, 84453, 84447, 84769, 85310, 86223, 87688, 89447, 91034, 92280, 93131, 93228, 92237, 90467, 88578, 86743, 84737, 82751, 81356, 80533, 79558, 78202, 77374, 78075, 80150, 82517, 84283, 85235, 85556, 85533, 85391, 85050, 84243, 83086, 82270, 82332, 82987, 83532, 83662, 83583, 83521, 83474, 83311, 82831, 81894, 80714, 79735, 79091, 78547, 78244, 78860, 80504, 81947, 81795, 80200, 78642, 78165, 78604, 79498, 80793, 82404, 83878, 84944, 85833, 86689, 87139, 86850, 86115, 85443]
55091H5443n54o44n42J60J213J937J831R28k15q45o64j33J45J97M89J029J196
55074I0971N91l70q83n72K79J016J054L26n89r66o37r9J31Nk12l32l13r1L47P88
55054I0444Q20K59m92o71RQ65Q82o7j037j187p35m73o41q04o01j38L25O67Q82
55035H8307J069J346J530J086j59j459j850j370r10q70p15m4O53P87O08O95R13
55018H9617N97l43j204j384j000n51l07k49k29m6M14R61J218J045P34O23O70N91
55000I1157K81k3lM04R06J075O95jn06m98j01L33N93O88O88O69P36Q68Q17M25
54980I9203j1rM14O66L94k9q5J73L80N30Q33J102R40N19M74Q51R00K14n05l54
54960A06600N48J293J342R15L80j60o11p49m73J3L52K78j71n37l14L39N62j89
$$ y = [85443, 84889, 84245, 83703, 83863, 85076, 87013, 88844, 89772, 89557, 88712, 88048, 87915, 88060, 88257, 88746, 89775, 90971, 91562, 91192, 90309, 89737, 90016, 91032, 92086, 92412, 91823, 90857, 90220, 90121, 90252, 90257, 90045, 89713, 89400, 89309, 89656, 90444, 91264, 91523, 91031, 90360, 90369, 91234, 92116, 92049, 91012, 89825, 89090, 88617, 87976, 87172, 86571, 86433, 86758, 87425, 88307, 89376, 90722, 92252, 93338, 93179, 91720, 89870, 88500, 87590, 86720, 86005, 85961, 86614, 87401, 88009, 88704, 89617, 90214, 89871, 88667, 87283, 86283, 85732, 85425, 85176, 84947, 84901, 85315, 86276, 87494, 88539, 89273, 89896, 90566, 91157, 91438, 91415, 91412, 91816, 92722, 93797, 94492, 94491, 93985, 93487, 93386, 93719, 94312, 95000, 95688, 96357, 97093, 97961, 98778, 99203, 99192, 99183, 99597, 100263, 100657, 100628, 100543, 100716, 101096, 101626, 102459, 103561, 104501, 105020, 105494, 106345, 107245, 107459, 106954, 106600, 107148, 108441, 109783, 110698, 111078, 110918, 110307, 109558, 109085, 109098, 109450, 109728, 109557, 109020, 108706, 109045, 109607, 109418]
54942A09418j315j788j388p49l13J7K57J59j79k23J72M21J07l42l07J25M43N37
54924A05052O97R80J213J486K048K713K969K813K938L819N001N688N782N847O080
54909A55126N875M614K597P74l30j106k187l617m919n673n820n487m870m191l533
54894A27253k750j795j025q39j085j220j068r62j023q52j81O59J183J344J278
54879A18917R51N10N63J402K225J999J059J047K874N520P290P695P418O892N775
54864A72137L862J697q0j513l021m610n791o251o151n760n147m370l692l367l301
54849A24642l213l052k980k962k657j890r89m52m29o86r61j115j023o22j33L7
54833A01515k41n90n41n5N26R38J193J345J299R68M50j1k49k50j92l83j037j867
$$ y = [109418, 108103, 106315, 104927, 104178, 103865, 103882, 104139, 104298, 104119, 103896, 104068, 104489, 104596, 104254, 103947, 104072, 104515, 105052, 105749, 106729, 107942, 109428, 111476, 114189, 117158, 119971, 122909, 126728, 131729, 137417, 143199, 149046, 155126, 161001, 165615, 168212, 168986, 168656, 167550, 165363, 161746, 156827, 151154, 145334, 139847, 134977, 130786, 127253, 124503, 122708, 121683, 120844, 119759, 118539, 117471, 116509, 115486, 114634, 114453, 115112, 116295, 117639, 118917, 119868, 120378, 120941, 122343, 124568, 126567, 127626, 128673, 131547, 137067, 144357, 152052, 159470, 166362, 172137, 175999, 177696, 177616, 176103, 173082, 168472, 162681, 156430, 150279, 144519, 139372, 135002, 131310, 127943, 124642, 121429, 118377, 115397, 112435, 109778, 107888, 106899, 106447, 106018, 105332, 104371, 103256, 102233, 101611, 101478, 101515, 101274, 100684, 100143, 100088, 100614, 101552, 102745, 104090, 105389, 106357, 106807, 106796, 106547, 106297, 106105, 105722, 104685, 102818]
54815A02818k136j366K9J090J364J244J221J190Q52L96K79M10J84n34j003n17
54799A05521O03J328J105L22k99m66l45k07j43j18r9j64m14p54q82o01j22J93
54781A04458L38O99J435K005J665M53n42j41J635L415L766K597J121M88P19J117
54765A25228J380J890K988M375N429N786N484M812M309M571N588O323N516L055
54751A86734K31j686k761l908n365o313o110n314m989n308n398m592l283k347
54737A29591k030j824j289n45LJ62J6j98k22L4K88J29l44m52K67J358K001K084
54719A29029K277L012L919M477M734N035N409N603N533N203M311K440k55k924
54705A77803m740n565n817n906n910n656n016m101l148k262j439q99j063j842
$$ y = [102818, 100682, 99316, 99345, 100435, 101799, 103043, 104264, 105454, 106306, 106702, 106981, 107391, 107575, 107041, 106038, 105521, 106124, 107452, 108557, 108879, 108580, 108114, 107769, 107562, 107419, 107301, 107202, 107038, 106624, 105870, 104988, 104387, 104265, 104458, 104796, 105495, 106930, 108935, 110600, 111053, 110511, 110370, 112005, 115420, 119186, 121783, 122904, 123392, 124111, 125228, 126608, 128498, 131486, 135861, 141290, 147076, 152560, 157372, 161681, 166252, 171840, 178163, 183679, 186734, 186965, 185279, 182518, 178610, 173245, 166932, 160822, 155508, 150519, 145211, 139813, 135221, 131938, 129591, 127561, 125737, 124448, 123903, 123906, 124068, 124084, 123886, 123664, 123698, 123986, 124115, 123771, 123319, 123586, 124944, 126945, 129029, 131306, 134318, 138237, 142714, 147448, 152483, 157892, 163495, 169028, 174231, 178542, 180982, 180727, 177803, 173063, 167498, 161681, 155775, 149865, 144209, 139193, 135092, 131944, 129682, 128243, 127344, 126281, 124439]
54691A24439k350j837p74l36q47j399j198o02m28q10j258j411j186n03N27J332
54675A11359J376Q27L13R7po2J32N44Q34Q48P29M23l43j394j918j374l25P3n99
54656A11533j528j529k82J322K065J582N79q2k47k27o6M03R20R15L79L1K71N35
54638A16574J28o67q86k03O46P90J94m79o31j99M81R95J078O67q3p98j056p27
54620A15824k16j55o84j199r55K1Q99R57M10J20N23J122J185O71J42j40m58q67
54602A17200q00J24J233J384L45r64j585j471j170j071j132j098p88k97M1P2M5
54585A10068K50N41O04N56P53J094J130Q52P63J031J203J002P15N26J73l93o72
54568A20196m42k40m67o35k27L31L90K56O29J241J178M03j55j27j68o74j059q18
$$ y = [124439, 122089, 120252, 119478, 119142, 118295, 116896, 115698, 115096, 114668, 113858, 112600, 111189, 110003, 109500, 110027, 111359, 112735, 113562, 113875, 113972, 113965, 113903, 114035, 114579, 115413, 116261, 116990, 117413, 117070, 115676, 113758, 112384, 112059, 112132, 111533, 110005, 108476, 108194, 109516, 111581, 113163, 113742, 113660, 113413, 113186, 113120, 113523, 114443, 115358, 115737, 115768, 116039, 116574, 116702, 116035, 115149, 114946, 115592, 116382, 116576, 116097, 115466, 115267, 115748, 116743, 117821, 118488, 118405, 117607, 116551, 115824, 115608, 115453, 114769, 113570, 112615, 112636, 113535, 114492, 114902, 115022, 115545, 116667, 117852, 118523, 118665, 118525, 118067, 117200, 116400, 116524, 117757, 119141, 119486, 118522, 116937, 115466, 114296, 113225, 112093, 110995, 110207, 109910, 109951, 110023, 110068, 110318, 110859, 111463, 112019, 112772, 113866, 114996, 115848, 116611, 117642, 118845, 119847, 120562, 121088, 121261, 120868, 120196, 119754, 119514, 119047, 118412, 118185, 118516, 118906, 119162, 119791, 121032, 122210, 122613, 122458, 122331, 122163, 121489, 120430, 119612]
54550A19612l82l23m12j23M58Q39R21R43R08O40K33l0j17j84j56K18R18J554J786
54531A27303J629J365J275J386J433J163P48N76O04L36l49p73l06O67J163Q22
54515A39042J59l21o68j006j079o68j44j47p35j221r48j00M18p4j284k175j948
54498A27101p15O91J416J145K18o59r91q89q02q34n87K09J186J715J596J107N20
54481A31427q2n88q26p51m19J29P43J016O82R1q0L22P99R72J039J249J411J266
54463A38400R56P82P25O38O54Q99J050O96J40J31O97Q63r9j582k304j839r67n97
54445A39243q04j067j066r19p84n18J44J134J914J955J333O40K87L5m74j071j225
54428A38757q75n27m67l33K21Q49R36N12J78K14L12K80M18R02J253Q71o4p87q78
$$ y = [119612, 119230, 118907, 118495, 118372, 118830, 119669, 120590, 121533, 122441, 123081, 123314, 123284, 123167, 122983, 122827, 123045, 123963, 125517, 127303, 128932, 130297, 131572, 132958, 134391, 135554, 136302, 136878, 137482, 137818, 137469, 136696, 136390, 137057, 138220, 139042, 139201, 138880, 138212, 137206, 136127, 135459, 135315, 135168, 134433, 133212, 132264, 132164, 132582, 132508, 131224, 129049, 127101, 126386, 127077, 128493, 129638, 129856, 129197, 128206, 127317, 126515, 125681, 125094, 125303, 126489, 128204, 129800, 130907, 131427, 131345, 130757, 129931, 129180, 128761, 128890, 129633, 130649, 131331, 131422, 131342, 131664, 132463, 133435, 134474, 135723, 137134, 138400, 139356, 140138, 140863, 141501, 142155, 143054, 144104, 144800, 144940, 145071, 145768, 146631, 146532, 144950, 142646, 140807, 139840, 139243, 138439, 137372, 136306, 135387, 134603, 134085, 134229, 135363, 137277, 139232, 140565, 141205, 141492, 141527, 141053, 139982, 138757, 137882, 137355, 136888, 136555, 136776, 137625, 138561, 139073, 139251, 139465, 139777, 140057, 140475, 141377, 142630, 143501, 143437, 142650, 141772]
54409A41772o56n53n71m77k62j39k31m30m67p7P27J470J557R47K75J27M22P10
54391A44144Q39R45J045J082J229J638J924J459L08p12j084j153j348j428j026
54376A47862m27j80k26q1L11N85O83R14J246J303J106J133J404J278M96k43k96
54359A56868o6l43j034j295p46J02N80M82m6p81j421j738j766j634j260n38K59
54342A45623O18L84p3l44l18p7K21K73j42p71j070q69n98o57q68p28r7O15Q31
54323A41953L18n78j159r80l30P3r7m57m19J46Q30J142R48N43K41n2o57j405j504
54304A38556n46P32J286J145J147J417J133N8p52m12M27N77O6q2M37Q57O81M27
54286A47154O99J288J598J496J292J138R10N14P0k14k79l52p83j571k140j864
$$ y = [141772, 141116, 140563, 139992, 139515, 139253, 139114, 138883, 138453, 137986, 137909, 138636, 140106, 141663, 142610, 142885, 143012, 143434, 144144, 144983, 145928, 146973, 148055, 149284, 150922, 152846, 154305, 154613, 153901, 152817, 151664, 150316, 148888, 147862, 147435, 147255, 147029, 146948, 147259, 147844, 148527, 149441, 150687, 151990, 153096, 154229, 155633, 156911, 157407, 157164, 156868, 156802, 156459, 155425, 154130, 153384, 153486, 154066, 154548, 154502, 153721, 152300, 150562, 148796, 147162, 145902, 145364, 145623, 146241, 146625, 146552, 146208, 145890, 145813, 146034, 146307, 146165, 145394, 144324, 143455, 142857, 142200, 141332, 140604, 140507, 141122, 141953, 142271, 141693, 140534, 139554, 139224, 139297, 139200, 138743, 138324, 138470, 139300, 140442, 141390, 141933, 142174, 142122, 141465, 140060, 138556, 138010, 138742, 140028, 141173, 142320, 143737, 144870, 144928, 144176, 143764, 144191, 144768, 144834, 144752, 145189, 146046, 146727, 147154, 147853, 149141, 150739, 152235, 153527, 154665, 155575, 156089, 156159, 155945, 155666, 155314, 154531, 152960, 150820, 148956]
54270A48956q35J26L24j89q10j006p54m79o12j031j124n94L5R9k64l72k3L78O49
54251A42474J030J451J367O84J28K04M42K27k06k39N8P8l17o83p32n89m03k82
54233A44692m64j018j425j080j89M66N40L47K3o61j565k015j721j244j128j155
54217A32403q42k24L72R03J456J866J899J634J237O04l48j247j554j178n09M9
54201A36521L02K33k9k47l53m60n31l38K6R8k21l41J25O32M23k60m82P5P56Q58
54181A36787L15n07j146j229q12m73o20q12m05L57O00J34k59PO53J156J365J241
54163A36352O79j18o37p12o56n78k27L16M98J80n3J86N38O48P42R75R39M27JJ68
54143A39668N58O34O01Q75J165R81N91N71P85O49J25l47o73j021j223j059q75
$$ y = [148956, 148121, 148247, 148571, 148382, 147572, 146566, 145812, 145333, 144721, 143690, 142566, 141972, 142007, 142106, 141842, 141470, 141447, 141825, 142474, 143504, 144955, 146322, 147006, 147134, 147338, 147780, 148007, 147801, 147562, 147620, 147698, 147381, 146698, 145966, 145377, 144974, 144692, 144228, 143210, 141785, 140705, 140516, 140982, 141522, 141869, 141892, 141231, 139666, 137651, 135930, 134686, 133558, 132403, 131561, 131337, 131709, 132612, 134068, 135934, 137833, 139467, 140704, 141308, 140960, 139713, 138159, 136981, 136472, 136521, 136823, 137056, 137027, 136780, 136427, 135967, 135436, 135098, 135124, 135222, 135001, 134660, 134785, 135417, 135840, 135580, 135098, 135173, 135929, 136787, 137102, 136595, 135449, 134220, 133408, 132935, 132315, 131503, 131098, 131455, 132055, 132189, 131930, 131937, 132590, 133746, 135111, 136352, 137031, 136913, 136276, 135564, 134908, 134330, 134103, 134419, 134917, 135097, 135044, 135230, 135768, 136416, 137158, 138133, 139072, 139499, 139500, 139668, 140226, 140860, 141461, 142336, 143501, 144482, 145073, 145644, 146429, 147078, 147203, 146856, 146183, 145162, 143939, 142880, 142005]
54126A42005r86q85m1Q70Q67M16Q59J996K028L40j253r87M28J042L25o38j003
54109A45383r00n98p1M92O50L31OO1M17O76M63k93j141j388q52j48O5j85n12p74
54089A41682r39p11M8Q44J055P72N57N47M47L05N28J072J334J069P57P85Q49N49
54071A51550K2m67j043j743j905r02O65J388Q12j2q9K53K56J43O08J327J197J49
54053A52209n18rQ66J081R68J374K023J919J025L49M85J136K028L164M054L892
54037A76046K894K390L044L910L898L290L085L468L852L937L909L786L332K505
54023B23346J530O88L05O53J385J546O60n34r76o04k34m95j411k722l948m417
54007B14772l962l354l402l828l727k948k203j916j801j598j471j470j363j148
$$ y = [142005, 141019, 140134, 140093, 140963, 141830, 142246, 143105, 145101, 147129, 147469, 146216, 145229, 145657, 146699, 147024, 146386, 145383, 144483, 143885, 143814, 144306, 144956, 145287, 145293, 145354, 145771, 146447, 146910, 146617, 145476, 144088, 143236, 143088, 143153, 142968, 142456, 141682, 140743, 140032, 140080, 140924, 141979, 142751, 143308, 143855, 144302, 144607, 145135, 146207, 147541, 148610, 149367, 150152, 151001, 151550, 151572, 151105, 150062, 148319, 146414, 145512, 146177, 147565, 148377, 148365, 148276, 148529, 148785, 148928, 149536, 150863, 152060, 152209, 151691, 151682, 152548, 153629, 154597, 155971, 157994, 159913, 160938, 161287, 161772, 162908, 164936, 168100, 172154, 176046, 178940, 181330, 184374, 188284, 192182, 195472, 198557, 202025, 205877, 209814, 213723, 217509, 220841, 223346, 224876, 225564, 225869, 226522, 227907, 229453, 230113, 229579, 228603, 227999, 227765, 227270, 225859, 223137, 219189, 214772, 210810, 207456, 204054, 200226, 196499, 193551, 191348, 189432, 187631, 186033, 184562, 183092, 181729, 180581]
53993A80581j136j344j431j424j830k704l191k518r94L18P52M69O1l5K24N81Q09
53976A67188R00Q27L68n05j181r41N7Q09O43j02o78p45m17O4L77K45j74l07J42
53957A66570Q08J168J194J195J270J269J155J069J109J270J529J811J992K078
53943A85487K288K748L169L126K671K452L004M103M978N270N457O144P141P632
53929B45670P285O657O389O413O311O018N763N595N490N778O930Q933J1308J3659
53915C48199J5924J8029J9566J9764J7677J2842O073p70o291j0494j3751j5515
53903D11253j4999j2850j0864r938r367q373p245o584o365o395o876p766q198
53890B95433p393n824m801m978n759o081n488m448l842m039m447m285l626l170
$$ y = [180581, 179445, 178101, 176670, 175246, 173416, 170712, 167521, 165003, 164009, 164327, 165079, 165548, 165609, 165574, 165798, 166379, 167188, 168088, 168915, 169283, 168778, 167597, 166656, 166713, 167522, 168165, 168063, 167385, 166640, 166223, 166287, 166664, 166909, 166735, 166428, 166570, 167378, 168546, 169740, 170935, 172205, 173474, 174629, 175698, 176807, 178077, 179606, 181417, 183409, 185487, 187775, 190523, 193692, 196818, 199489, 201941, 204945, 209048, 214026, 219296, 224753, 230897, 238038, 245670, 252955, 259612, 266001, 272414, 278725, 284743, 290506, 296101, 301591, 307369, 314299, 323232, 334540, 348199, 364123, 382152, 401718, 421482, 439159, 452001, 458074, 457304, 451013, 440519, 426768, 411253, 396254, 383404, 372540, 362602, 353235, 344862, 337617, 331033, 324668, 318273, 311397, 303631, 295433, 288040, 282216, 277415, 272437, 266678, 260597, 255109, 250661, 246819, 242780, 238333, 234048, 230422, 227252]
53876B27252l104k922k486k371k812l207l137l032l206l050k023p95m35r08j337
53861A92427j384j459j693j690j313q91n94k65J05L17L79M09J76n67j363j349
53845A81245m41M46N18r9q27j273j248p12M4N25O21O28O26L37k15m45M9Q35J187
53826A81801R57N75M02M37N18N19L67Q3j94l49l98l24L9Q52J954K850L077K596
53808A95762J823J265J101J192J346J488J617J844K427L440M453M938M964M951
53794B32611M756L783K187J088J015J022K55m91N0J406J860R15j59m71o48j360
53778B47819k025j877j306j194j589j957k199k585l066l414l695l891l479k158
53764B13384o93j58n64r76r08o72n21l20j71n02j262j786j707j375j101p00j37
$$ y = [227252, 224148, 221226, 218740, 216369, 213557, 210350, 207213, 204181, 200975, 197925, 195902, 195107, 194672, 193764, 192427, 191043, 189584, 187891, 186201, 184888, 183997, 183403, 183138, 183243, 183560, 183939, 184348, 184524, 183957, 182594, 181245, 180804, 181250, 181768, 181669, 180842, 179569, 178321, 177609, 177653, 178178, 178799, 179427, 180053, 180390, 180175, 179730, 179779, 180614, 181801, 182758, 183333, 183735, 184172, 184690, 185209, 185576, 185659, 185465, 185116, 184718, 184394, 184433, 185285, 187239, 190089, 193166, 195762, 197585, 198850, 199951, 201143, 202489, 203977, 205594, 207438, 209865, 213305, 217758, 222696, 227660, 232611, 237367, 241150, 243337, 244425, 245440, 246462, 246717, 246226, 246276, 247682, 249542, 250457, 250298, 249827, 249179, 247819, 245794, 243917, 242611, 241417, 239828, 237871, 235672, 233087, 230021, 226607, 222912, 219021, 215542, 213384, 212691, 212533, 211969, 210993, 210085, 209413, 208892, 208572, 208401, 207899, 206637, 204851, 203144, 201769, 200668, 199968, 199831]
53747A99831J52Q9M85J982L929N108N346N595O519P764Q777R691J1001J2909J5214
53732B94392J7530J9162J9081J6405J0990L573m392j1060j4989j6069j5463j4283
53720C04877j2710j0663q723p526o567m729k076p0M01K02N02R70N11o69j011L02
53704B53021K196L080K658J863J483J493J608J859K432L154L530L258K622K113
53690B86370J803J357P09L34N90J195J673K002K334K400J773O93j35n18r92j905
53674B99683k849l283l159k685j963j233r72j319j688j443p29k10k30n70q98j052
53658B75400r31m93O4L86K50k78r65j498j613j283p10n6O28J195J409J313J264
53641B74082J366J229O26M2P4N74R15R49J085J530K069K608L247L691L314K164
$$ y = [199831, 199983, 200072, 200557, 202539, 206468, 211576, 216922, 222517, 229036, 236800, 245577, 255268, 266269, 279178, 294392, 311922, 331084, 350165, 366570, 377560, 381133, 376741, 365681, 350692, 334623, 319160, 304877, 292167, 281504, 272781, 265255, 258688, 253959, 251883, 251813, 252214, 252416, 252918, 253888, 254399, 253730, 252719, 253021, 255217, 258297, 260955, 262818, 264301, 265794, 267402, 269261, 271693, 274847, 278377, 281635, 284257, 286370, 288173, 289530, 290239, 290573, 291163, 292358, 294031, 296033, 298367, 300767, 302540, 303233, 303098, 302580, 301588, 299683, 296834, 293551, 290392, 287707, 285744, 284511, 283539, 282220, 280532, 279089, 278360, 278150, 277920, 277350, 276452, 275400, 274469, 273976, 274040, 274426, 274676, 274398, 273433, 271935, 270322, 269039, 268329, 268273, 268901, 270096, 271505, 272818, 274082, 275448, 276677, 277303, 277345, 277419, 277993, 278908, 279857, 280942, 282472, 284541, 287149, 290396, 294087, 297401, 299565]
53625B99565J261J407K142K514K460K693L403L899L768L597M161N316O173O257
53611C48616N978O061O724P551P960P816P632Q046Q958R356Q278N902L347J432
53597D43657M8j234k369l037l275l506m009m635n049n025m539l768k995k397k019
53582C95848j961k343k947l214k940k688k984l388k954j705q68j379k679l451
53568C60347l123k225j484j164j179j331j298q21p8L80K96J16M56J250J792J642
53552C53576J155Q75P40L09l65o59k67M33J117K031L288M275M405M156M500N503
53536C85072O356O744P254Q170Q858Q824Q646R171J0295J1235J1665J1980J2571
53523E06841J3430J4357J5138J5644J6047J6767J7911J8988J9598K0088K1073
$$ y = [299565, 300826, 302233, 304375, 306889, 309349, 312042, 315445, 319344, 323112, 326709, 330870, 336186, 342359, 348616, 354594, 360655, 367379, 374930, 382890, 390706, 398338, 406384, 415342, 424698, 432976, 438878, 442225, 443657, 443705, 442471, 440102, 437065, 433790, 430284, 426275, 421640, 416591, 411566, 407027, 403259, 400264, 397867, 395848, 393887, 391544, 388597, 385383, 382443, 379755, 376771, 373383, 370429, 368724, 367856, 366477, 363798, 360347, 357224, 354999, 353515, 352351, 351172, 349841, 348543, 347722, 347644, 348024, 348320, 348436, 348892, 350142, 351934, 353576, 354731, 355606, 356346, 356655, 356290, 355631, 355364, 355797, 356914, 358945, 362233, 366508, 370913, 375069, 379569, 385072, 391428, 398172, 405426, 413596, 422454, 431278, 439924, 449095, 459390, 470625, 482290, 494270, 506841, 520271, 534628, 549766, 565410, 581457, 598224, 616135, 635123, 654721, 674809, 695882]
53512F95882K2547K4027K5405K6973K8627K9699K9799K9327K8904K8708K8551
53501I98449K8316K8033K7743K7481K7331K7369K7583K7885K8074K7922K7472
53490A303658K7165K7391K7940K8168K7658K6411K4451K1723J8557J5843J4306
53479A563271J3762J3364J2549J1483J0496R432P836N689L552J777q0k655n723
53466A644753q354j0234j2125j4632j7020j7976j7312j6290j6286j7662j9917
53455A476945k2337k4295k5449k5951k6217k6348k6012k5032k3761k2734k2150
53444A206659k1842k1482k0732j9398j7575j5475j3136j0547q121o551n998n674
53432A040128m601k645n25J101K307L658N462P413Q973J0082J1333J3274J5761
$$ y = [695882, 718429, 742456, 767861, 794834, 823461, 853160, 882959, 912286, 941190, 969898, 998449, 1026765, 1054798, 1082541, 1110022, 1137353, 1164722, 1192305, 1220190, 1248264, 1276186, 1303658, 1330823, 1358214, 1386154, 1414322, 1441980, 1468391, 1492842, 1514565, 1533122, 1548965, 1563271, 1577033, 1590397, 1602946, 1614429, 1624925, 1634357, 1642193, 1647882, 1651434, 1653211, 1653131, 1650476, 1644753, 1636399, 1626165, 1614040, 1599408, 1582388, 1564412, 1547100, 1530810, 1514524, 1496862, 1476945, 1454608, 1430313, 1404864, 1378913, 1352696, 1326348, 1300336, 1275304, 1251543, 1228809, 1206659, 1184817, 1163335, 1142603, 1123205, 1105630, 1090155, 1077019, 1066472, 1058351, 1051800, 1045802, 1040128, 1035527, 1032882, 1032357, 1033458, 1035765, 1039423, 1044885, 1052298, 1061271, 1071353, 1082686, 1095960, 1111721]
53419A111721J8184K0195K1860K3175K4012K4592K5522K7084K8903L0625L2452
53408A388325L4642L6780L8274L9382M1109M3913M7102M9774N1951N4337N7149
53397A882738N9755O1524O2645O3751O4998O5966O6434O6721O7052O6926O5654
53386B594164O3332O0832N8765N6810N4257N0894M7166M3661M0551L7387L3433
53375C141252K8433K3099J8504J4850J1177O495P52n560j2345j9892k8105l6362
53363C142298m4107n1140n7200o1809o4747o6384o7261o7587o7319o6508o5287
53352B462949o3662o1605n9292n7019n4978n3377n2632n3046n4190n4992n4606
53341A843550n2985n0491m7332m3738m0389l8003l6480l4845l2248k8755k5088
$$ y = [1111721, 1129905, 1150100, 1171960, 1195135, 1219147, 1243739, 1269261, 1296345, 1325248, 1355873, 1388325, 1422967, 1459747, 1498021, 1537403, 1578512, 1622425, 1669527, 1719301, 1771252, 1825589, 1882738, 1942493, 2004017, 2066662, 2130413, 2195411, 2261377, 2327811, 2394532, 2461584, 2528510, 2594164, 2657496, 2718328, 2777093, 2833903, 2888160, 2939054, 2986220, 3029881, 3070432, 3107819, 3141252, 3169685, 3192784, 3211288, 3226138, 3237315, 3243810, 3244562, 3239002, 3226657, 3206765, 3178660, 3142298, 3098191, 3047051, 2989851, 2928042, 2863295, 2796911, 2729650, 2662063, 2594744, 2528236, 2462949, 2399287, 2337682, 2278390, 2221371, 2166393, 2113016, 2060384, 2007338, 1953148, 1898156, 1843550, 1790565, 1740074, 1692742, 1649004, 1608615, 1570612, 1534132, 1499287, 1467039, 1438284, 1413196]
53330A413196k1921j9541j7920j6910j6431j6514j6971j7108j6227j4503j2930
53319A226220j2134j1754j1158j0287r295p976o101m072k462j185K19J696K820
53306A154531L753N220P399R607J1375J3126J5419J8123K0721K2936K4696K5909
53294A332815K6691K7524K8775L0244L1449L2105L2161L1683L0885K9984K8826
53283A663142K6996K4488K1836J9358J6784J3880J0963Q314N568K215j568n106
53271A806870q060j0595j2991j5409j7976k0670k3303k5784k8136l0109l1328
53260A582509l2063l3202l4888l5982l5681l4988l5438l6763l7144l5701l3468
53249A197191l1698l0468k9458k8912k9023k9118k8415k7132k6184k6006k6315
$$ y = [1413196, 1391275, 1371734, 1353814, 1336904, 1320473, 1303959, 1286988, 1269880, 1253653, 1239150, 1226220, 1214086, 1202332, 1191174, 1180887, 1171592, 1163616, 1157515, 1153443, 1150981, 1149796, 1150015, 1151711, 1154531, 1158284, 1163504, 1170903, 1180510, 1191885, 1205011, 1220430, 1238553, 1259274, 1282210, 1306906, 1332815, 1359506, 1387030, 1415805, 1446049, 1477498, 1509603, 1541764, 1573447, 1604332, 1634316, 1663142, 1690138, 1714626, 1736462, 1755820, 1772604, 1786484, 1797447, 1805761, 1811329, 1813544, 1811976, 1806870, 1798810, 1788215, 1775224, 1759815, 1741839, 1721169, 1697866, 1672082, 1643946, 1613837, 1582509, 1550446, 1517244, 1482356, 1446374, 1410693, 1375705, 1340267, 1303504, 1266360, 1230659, 1197191, 1165493, 1135025, 1105567, 1076655, 1047632, 1018514, 990099, 962967, 936783, 910777, 884462]
53238H84462k6713k6948k6687k5592k3639k1122j8462j6172j4650j3720j2728
53227F58029j1470j0615j0727j1264j1241j0663j0507j1249j2279j2956j3461
53216E31597j4122j4535j4061j2857j1708j0957j0289r604r359r692r850r019
53204C95544p425o124n768o108o581o874o883o643o435o536o693o328n463m845
53190C06838m903n063m575l581k745k262j910j794k234k931l093k510j782j393
53176B66062j090n23J28N05N62M01Kn42q72p99n86n31m84p5P35J619K235K421
53158B69168K233J932J756J599J173M92o0l13n25q63j069q73l84J79P55J130Q14
53141B77144l31j614k105j606o72N2K44p3m75l75L08Q69O32j62o85n71j81L3o0
$$ y = [884462, 857749, 830801, 804114, 778522, 754883, 733761, 715299, 699127, 684477, 670757, 658029, 646559, 635944, 625217, 613953, 602712, 592049, 581542, 570293, 558014, 545058, 531597, 517475, 502940, 488879, 476022, 464314, 453357, 443068, 433464, 424105, 414413, 404563, 395544, 388119, 381995, 376227, 370119, 363538, 356664, 349781, 343138, 336703, 330167, 323474, 317146, 311683, 306838, 301935, 296872, 292297, 288716, 285971, 283709, 281799, 280005, 277771, 274840, 271747, 269237, 267455, 266062, 264972, 264449, 264577, 265082, 265644, 266045, 266047, 265505, 264633, 263834, 263248, 262717, 262233, 262158, 262893, 264512, 266747, 269168, 271401, 273333, 275089, 276688, 277861, 278353, 278293, 277980, 277455, 276592, 275523, 274650, 274266, 274445, 275200, 276330, 277144, 276813, 275199, 273094, 271488, 270816, 270868, 271112, 271039, 270564, 270189, 270497, 271366, 271998, 271836, 271151, 270580, 270399, 270432, 270372]
53122B70372m50j051j577j736j596j434j300j095r01q37o93k66L9m13j435k040
53106B53587j723j117j045j421j570j217o47j25L22N56K97m70j303j718j598j173
53090B39635p35n39q07j487k025j701m97O45Q26L38K28P66J020K67q71j326j031
53073B32706p06n99l16J76L36j2l84m65n34p55p67l71l1j96n79o06j88L61Q00
53054B27870R74P24K13j0K74N00J60k86M6J143K023J954J161K93l22p19j012j294
53036B33692j556j569j093k90L00K94j51n20l64L67J226J529R82L6n67n48k44
53019B31524l8M2J52L74O45P58M70j32m49Q2J165J811J477O89K72L10K58j80o85
53000B38545q80p65n14j58K59M39P2o65j136q93j47N18P74P25N87M04J41j08r5
$$ y = [270372, 269922, 268871, 267294, 265558, 263962, 262528, 261228, 260133, 259232, 258395, 257702, 257436, 257475, 257062, 255627, 253587, 251864, 250747, 249702, 248281, 246711, 245494, 244847, 244722, 245044, 245600, 245897, 245427, 244124, 242406, 240808, 239635, 238900, 238361, 237554, 236067, 234042, 232341, 231844, 232489, 233315, 233653, 233881, 234647, 235667, 235934, 235063, 233737, 232706, 232000, 231401, 231085, 231261, 231597, 231585, 231201, 230736, 230202, 229447, 228680, 228309, 228278, 228082, 227503, 226897, 226709, 227070, 227870, 228844, 229568, 229781, 229771, 230045, 230545, 230705, 230419, 230465, 231608, 233631, 235585, 236746, 237039, 236717, 235998, 234986, 233692, 232136, 230567, 229474, 229184, 229484, 229778, 229627, 229107, 228743, 229110, 230336, 231865, 232847, 232883, 232316, 231768, 231524, 231486, 231528, 231680, 232054, 232699, 233457, 233927, 233795, 233346, 233428, 234593, 236404, 237881, 238570, 238842, 239152, 239410, 239230, 238545, 237665, 236900, 236386, 236228, 236487, 236926, 236998, 236333, 235197, 234304, 234157, 234675, 235449, 236174, 236761, 237165, 237306, 237198, 237103]
52981B37103M06J348K279K574K024J134O20O78R21R02M57l41j126j245m10O67
52965B47991Q95K41j16O38J901K634K694K496K018J037ml88k59m10r30j032m10
52948B58996J98J42k65n25q39j594k436k613j994j148n26o3L82O24L41m32j181
52931B47067j346r57o58q28r40l10O98R46Q9r47j336j341j473j422o87L30P64
52914B37649N38K93K68J76N1L05Q04P99Q7n46m50L1K42J94K47K58k34j153j775
52895B37784j540o55J51K44m70j396j702j062J5Q25J251J648K056K016J242J29
52879B40536o77j009j277j895k798l467l371k435j143j63K24K64K83K91J83J32
52863B23678N02J293K008K180J807J161M17k71n94l44K09M92K25l53q53j117j204
$$ y = [237103, 237509, 238857, 241136, 243710, 245734, 246868, 247488, 248166, 249087, 249989, 250446, 250105, 248979, 247734, 247324, 247991, 248886, 249127, 249011, 249649, 251550, 254184, 256878, 259374, 261392, 262429, 262425, 262037, 261778, 261368, 260438, 259406, 258996, 259194, 259336, 259071, 258546, 257707, 256113, 253677, 251064, 249070, 247922, 247396, 247333, 247715, 248339, 248680, 248248, 247067, 245721, 244764, 244106, 243278, 242338, 242028, 242726, 243672, 243761, 242814, 241478, 240137, 238664, 237242, 236555, 236885, 237649, 238187, 238480, 238748, 238924, 238975, 239280, 240084, 240883, 240970, 240424, 239974, 240005, 240247, 240441, 240688, 240946, 240712, 239559, 237784, 236244, 235589, 235740, 235984, 235514, 234118, 232416, 231354, 231369, 232194, 233445, 235093, 237149, 239165, 240407, 240536, 239859, 238850, 237573, 235678, 232880, 229413, 226042, 223607, 222464, 222301, 222525, 222789, 223072, 223363, 223546, 223678, 224180, 225473, 227481, 229661, 231468, 232629, 233046, 232775, 232181, 231837, 232046, 232538, 232763, 232410, 231557, 230440, 229236]
52846B29236j250j330j395j333j258j493k057k356j855r28m95q50j399j639j729
52831B07869j887j862j440r09n93l27J16N13N96N21M35L5q04j375r53L0M99K51
52813B00715P4M07Q32J066J450K100K472K231J943K255K914L167K710J797P31
52798B26864l26j299k347l653m822m917l641k019j311j511j636j177o20m75n53
52783A96557l57K57R84J374J167N16j05m09n39n42j5J218K275J966M03r20q68
52766B02962Q8Q10R78J029J054N92m58j441j631r62R4J117J920K368K286J660
52750B12466P85J02j67j64j21l8K17N20N05Q8l04k47J14K87Q2k82o53j068j338
52731B10784j051k37M19M25K03M66J137J531J455J344J254N67q51j983j826p49
$$ y = [229236, 227986, 226656, 225261, 223928, 222670, 221177, 219120, 216764, 214909, 213981, 213486, 212636, 211237, 209598, 207869, 205982, 204120, 202680, 201771, 201178, 200851, 200967, 201480, 202076, 202597, 203032, 203067, 202263, 200888, 199935, 199965, 200464, 200715, 200789, 201196, 202028, 203094, 204544, 206644, 209116, 211347, 213290, 215545, 218459, 221626, 224336, 226133, 226864, 226538, 225239, 222892, 219239, 214417, 209500, 205859, 203840, 202529, 201018, 199382, 198205, 197585, 197110, 196557, 196200, 196457, 197441, 198815, 199982, 200498, 200393, 199984, 199445, 198903, 198888, 200106, 202381, 204347, 204750, 203830, 202962, 203050, 203860, 204838, 205867, 206921, 207513, 207055, 205614, 203983, 203021, 203115, 204232, 206152, 208520, 210806, 212466, 213251, 213353, 213186, 213022, 212901, 212863, 213080, 213600, 214105, 214193, 213889, 213642, 213756, 214043, 214125, 213843, 213190, 212122, 210784, 209733, 209496, 209915, 210340, 210543, 211009, 212146, 213677, 215132, 216476, 217730, 218297, 217446, 215463, 213637, 212888]
52715B12888N8J61L4p0m58j063j176m65M08P19O48Q34J360J734J597J021L52K4
52697B18606L39J009J270P68J6m02o25r63j114o36R8L31J84M65J214J454P17j27
52679B22604j54L40N50N22Q99J675K113J908J575J575J680J523J204J029R77P98
52663B40818N38N47R59J325R77k32j587k069j345j25O15O86P27J208J728J493
52647B46263L52r77j701j742j596j602j610j395j078r41j046j219j358j418j132
52632B27800j57J385K786L441L460L376L506L815M239M726M955M370K680J59k493
52617B68048m484n217m644l405k354j819j555j379j457j816k017j648r47m70l48
52602B34488k37M0K43J36j81m77o27n33j12M83Q54Q28P09R08J372J656J483J084
$$ y = [212888, 212946, 213107, 213141, 213071, 212613, 211550, 210374, 209909, 210317, 211036, 211684, 212518, 213878, 215612, 217209, 218230, 218582, 218606, 218945, 219954, 221224, 221992, 222008, 221606, 220981, 220018, 218904, 218268, 218366, 218697, 218881, 219346, 220560, 222014, 222731, 222604, 222450, 222790, 223340, 223862, 224761, 226436, 228549, 230457, 232032, 233607, 235287, 236810, 238014, 239043, 240020, 240818, 241356, 241903, 242862, 244187, 245164, 244932, 243345, 241276, 239931, 239806, 240421, 241107, 241834, 243042, 244770, 246263, 246615, 245638, 243937, 242195, 240599, 238997, 237387, 235992, 234914, 233973, 232927, 231708, 230350, 228932, 227800, 227643, 229028, 231814, 235255, 238715, 242091, 245597, 249412, 253651, 258377, 263332, 267702, 270382, 270541, 268048, 263564, 258347, 253703, 250298, 247944, 246125, 244570, 243191, 241734, 239918, 237901, 236253, 235306, 234836, 234488, 234251, 234291, 234534, 234670, 234489, 234012, 233385, 232852, 232740, 233223, 234077, 234905, 235614, 236522, 237894, 239550, 241033, 242117]
52584B42117R15J188J646J822J487Q99M92M41O11Q32R83Q92M80P9J66O19O48j96
52566B56121j355j979j992j915j908j589q52k00j03m09o28m56Q2P66J278J410
52550B46271J215Q41K72m16p54l81K23J47o94j386j314q75n70j34P42J516J482
52533B46185R32O95P80M51m07r89q36m84m93n75k55K25K92l6k43j53o6j25m6M10
52513B45262J076J590J802J778J628J385J033O14K92L01O98J204J371J004L52
52498B61390j44k96l30n86j106j599j772j614j296r61p20o76q24r83j038j129
52482B46316j388j544j119j1J288K173K389J976J095R6m27j13O48R82M78k65l14
52465B52260M51J153J005L44K50J192K431K875K252J245O58O95R34P99R7p85j265
$$ y = [242117, 243032, 244220, 245866, 247688, 249175, 250074, 250566, 251007, 251618, 252450, 253433, 254325, 254805, 254884, 255050, 255669, 256317, 256121, 254766, 252787, 250795, 248880, 246972, 245383, 244531, 244331, 244228, 243819, 243191, 242735, 242817, 243583, 244861, 246271, 247486, 248327, 248599, 248183, 247429, 247048, 247271, 247418, 246724, 245338, 244024, 243149, 242579, 242445, 243187, 244703, 246185, 247117, 247812, 248592, 249043, 248636, 247647, 246811, 246327, 245834, 245259, 245004, 245229, 245521, 245485, 245242, 245089, 245023, 244898, 244852, 245262, 246338, 247928, 249730, 251508, 253136, 254521, 255554, 256168, 256460, 256761, 257459, 258663, 260034, 261038, 261390, 261246, 260950, 260620, 260034, 258928, 257329, 255557, 253943, 252647, 251686, 250966, 250290, 249466, 248483, 247445, 246316, 244928, 243384, 242265, 242254, 243542, 245715, 248104, 250080, 251175, 251271, 250844, 250731, 251379, 252361, 252839, 252574, 252260, 252711, 253864, 254869, 255213, 255463, 256655, 259086, 261961, 264213, 265458, 266116, 266811, 267745, 268544, 268641, 267856, 266591]
52448B66591j209j028j113j444j867k321k569k125r59Q3J63m33o95l14k9m21j088
52431B49222j300q99k22M74J069J374J235P14k5q18j367j345q14j95L32J111K320
52414B50866L419L693L124K378K063K359L186M296N341O173P067Q262R360R503
52400C21090Q177N604K435o62l219n100o462p360p443o442m831l556k992k615
52386B86624j861r12l09j41j2K92N86P32R27J365J876K120K048J924J913J910
52370B99082J888K140K948M087M941N108M779M387M087L622K663J172m26j491
52356C38987j694j308q30l86K48J015J451J341J107J215J513J611J649K145L160
52341C51224M164M859N576O676P932Q861R354R621R756R809J0120J1098J2618
$$ y = [266591, 265382, 264354, 263241, 261797, 259930, 257609, 255040, 252915, 251956, 252039, 252202, 251769, 251074, 250760, 250731, 250310, 249222, 247922, 247023, 246801, 247275, 248344, 249718, 250953, 251667, 251642, 250824, 249457, 248112, 247298, 247103, 247435, 248546, 250866, 254285, 257978, 261102, 263480, 265543, 267902, 271088, 275384, 280725, 286898, 293965, 302227, 311587, 321090, 329267, 334871, 337306, 336644, 333425, 328325, 321863, 314503, 307060, 300618, 295787, 292231, 289239, 286624, 284763, 283851, 283542, 283401, 283389, 283681, 284267, 284999, 285926, 287291, 289167, 291287, 293335, 295259, 297172, 299082, 300970, 303110, 306058, 310145, 315086, 320194, 324973, 329360, 333447, 337069, 339732, 340904, 340478, 338987, 337293, 335985, 335155, 334769, 335017, 336032, 337483, 338824, 339931, 341146, 342659, 344270, 345919, 348064, 351224, 355388, 360247, 365823, 372499, 380431, 389292, 398646, 408267, 418023, 427832, 437952, 449050, 461668]
52328D61668J4042J4947J5593J6456J7608J8800J9875K0828K1619K2216K2719
52317F66371K3153K3236K2706K1792K0946K0180J9158J7992J7279J7091J6567
52306H86471J5032J3002J1477J0603R750Q631P522O427M918L002J412O72M13m6
52292I79286r11k050l476n200o926q226q924r045q595p658o476n242l957k644
52278H99956j412j47J496L589N712P556R342J1239J2783J3390J3318J3478J4262
52265A004562J5107J5386J5351J5741J6623J7016J5898J3460J0946R258Q061O660
52253A164069N195M353M105L571K263O54p55k133l710n197o302p228q169q885
52239A141831r400j0366j2004j3260j3022j1716j0723j0447j0012q776p109n577
$$ y = [461668, 475710, 490657, 506250, 522706, 540314, 559114, 578989, 599817, 621436, 643652, 666371, 689524, 712760, 735466, 757258, 778204, 798384, 817542, 835534, 852813, 869904, 886471, 901503, 914505, 925982, 936585, 946335, 954966, 962488, 968915, 973833, 976835, 978247, 978919, 979332, 979286, 978375, 976325, 972849, 967649, 960723, 952497, 943573, 934528, 925933, 918275, 911799, 906557, 902600, 899956, 898544, 898397, 899893, 903482, 909194, 916750, 926092, 937331, 950114, 963504, 976822, 990300, 1004562, 1019669, 1035055, 1050406, 1066147, 1082770, 1099786, 1115684, 1129144, 1140090, 1149348, 1157409, 1164069, 1169264, 1173617, 1177722, 1181293, 1183556, 1184210, 1183455, 1181322, 1177612, 1172415, 1166113, 1158885, 1150716, 1141831, 1132431, 1122065, 1110061, 1096801, 1083779, 1072063, 1061340, 1050893, 1040881, 1032105, 1024996, 1019419]
52227A019419m310l384k935k601j632K1J423J803J455J193J387J948K756L664
52213A020207M428N010N666O534P362P917Q289Q551Q482P944P212O616O065N279
52199A115562M291L394K715K170J810J874K417L060L268K906K336J903J458O88
52185A149852j91n88m76n85j346k208k620l065m353o187p433p643p405p170o731
52170A091851o036n571n497n210m216k814j545m78M78J131J341J389J651K220
52156A068694L062M070M732M345K939J479P90O95N52J56l78r85j469j391o51K16
52140A086856P60J181J714K038J915J869K495L451M029M442N651P980J0645J2811
52126A147837J4461J6089J8028K0317K2835K5386K7769K9799L1193L1655L1235
$$ y = [1019419, 1015109, 1011725, 1008790, 1006189, 1004557, 1004578, 1006001, 1007804, 1009259, 1010452, 1011839, 1013787, 1016543, 1020207, 1024635, 1029645, 1035311, 1041845, 1049207, 1057124, 1065413, 1073964, 1082446, 1090390, 1097602, 1104218, 1110283, 1115562, 1119853, 1123247, 1125962, 1128132, 1129942, 1131816, 1134233, 1137293, 1140561, 1143467, 1145803, 1147706, 1149164, 1149852, 1149661, 1149073, 1148597, 1148012, 1146666, 1144458, 1141838, 1138773, 1134420, 1128233, 1120800, 1113157, 1105752, 1098582, 1091851, 1085815, 1080244, 1074747, 1069537, 1065321, 1062507, 1060962, 1060484, 1060962, 1062093, 1063434, 1064823, 1066474, 1068694, 1071756, 1075826, 1080558, 1084903, 1087842, 1089321, 1090111, 1090806, 1091358, 1091514, 1091136, 1090151, 1088682, 1087291, 1086640, 1086856, 1087616, 1088797, 1090511, 1092549, 1094464, 1096333, 1098828, 1102279, 1106308, 1110750, 1116401, 1124381, 1135026, 1147837, 1162298, 1178387, 1196415, 1216732, 1239567, 1264953, 1292722, 1322521, 1353714, 1385369, 1416604]
52115A416604L0341K9218K7717K5818K3908K2179K0185J7523J4569J1921R450
52104A649433O615L437M67k046m251o013o956p233p561q255q810q699q189p980
52090A583959q404r098r481r421r442j0122j1246j1845j1284r793p744n031j703
52077A469345J389L519N233P664J0812J3437J4732J5199J5786J6822J8003J8771
52065A610712J8666J7801J6971J6656J6091J4116J0897P833N737M129K418O71
52053A742698j109l293n694p351p970q644j0370j2689j4590j6059j7722j9665
52041A617542k1539k3388k5283k6528k6289k4916k3561k2590k1252j9024j6330
52030A366842j3813j1653r866q547p587o707o037o081o807p435p427p240p601
$$ y = [1416604, 1446945, 1476163, 1503880, 1529698, 1553606, 1575785, 1595970, 1613493, 1628062, 1639983, 1649433, 1656048, 1659485, 1659952, 1657906, 1653655, 1647642, 1640686, 1633453, 1625892, 1617637, 1608827, 1600128, 1591939, 1583959, 1575555, 1566457, 1556976, 1547555, 1538113, 1527991, 1516745, 1504900, 1493616, 1483823, 1476079, 1471048, 1469345, 1470734, 1474253, 1479486, 1487150, 1497962, 1511399, 1526131, 1541330, 1557116, 1573938, 1591941, 1610712, 1629378, 1647179, 1664150, 1680806, 1696897, 1711013, 1721910, 1729743, 1735480, 1739609, 1742027, 1742698, 1741589, 1738296, 1732602, 1725251, 1717281, 1708637, 1698267, 1685578, 1670988, 1654929, 1637207, 1617542, 1596003, 1572615, 1547332, 1520804, 1494515, 1469599, 1446038, 1423448, 1402196, 1383172, 1366842, 1353029, 1341376, 1331510, 1322963, 1315376, 1308669, 1302632, 1296551, 1289744, 1282309, 1274882, 1267642, 1260041]
52017A260041q522r518j0399j1284j1958j1891j1049j0191j0128j1016j2556j4531
52005A126998j6717j8530j9375j9475j9783k0732k1556k1308k0253j9589j9905
51994I09775k0579k0722j9969j8249j5619j2759j0868j0448j0612j0218r263q504
51982G41965q137p640o860o355o656p715r213j0808j2035j2489j2290j1899j1367
51969F18501j0312q737p271o324n535m429l116j928p38P94K571M120N175N739
51955E88510N762N189M291L407K354N57k065m724o547p356p454p004o032m762
51941E64126l484k116m08J455K925L916N039O687Q304R008Q722Q088P425O312
51927F25999M271J334k178n944r516j2312j4086j5118j5769j6077j5995j5636
$$ y = [1260041, 1251519, 1242001, 1231602, 1220318, 1208360, 1196469, 1185420, 1175229, 1165101, 1154085, 1141529, 1126998, 1110281, 1091751, 1072376, 1052901, 1033118, 1012386, 990830, 969522, 949269, 929680, 909775, 889196, 868474, 848505, 830256, 814637, 801878, 791010, 780562, 769950, 759732, 750469, 741965, 733828, 726188, 719328, 712973, 706317, 698602, 689389, 678581, 666546, 654057, 641767, 629868, 618501, 608189, 599452, 592181, 585857, 580322, 575893, 572777, 570849, 570111, 570905, 573476, 577596, 582771, 588510, 594272, 599461, 603752, 607159, 609513, 610070, 608005, 603281, 596734, 589378, 581924, 574920, 568888, 564126, 560642, 558526, 558118, 559573, 562498, 566414, 571453, 578140, 586444, 595452, 604174, 612262, 619687, 625999, 630270, 631604, 629426, 623482, 613966, 601654, 587568, 572450, 556681, 540604, 524609, 508973]
51915E08973j5044j4081j2830j1685j0698r276p083m891l859m033m261l518j757
51902D05957N42K953M999O096O059N424M999N257O148P132P304N952L239L9l029
51887D69071n931q475r871r652q489p512o950o118m604k834j332jJ548L284M720
51872D06854N476N665N740O047O503O735O496N893N060L839J991l39k638m452
51858D58870n601o051n836n127l986k199L07K815M223M322M191M865N956O153
51844D62902M941L190K074J923K321K861L461M171M942N527N476M389K304k28
51830E10254k537m264n461o443p542q714r392r056p961o949o403n939n264m760
51816D19569m712m609l884k952k612k637j938k45J436K319K822L548M062L550
$$ y = [508973, 493929, 479848, 467018, 455333, 444635, 435359, 428276, 423385, 419526, 415493, 411232, 407714, 405957, 406499, 409452, 414451, 420547, 426606, 432030, 437029, 442286, 448434, 455566, 462870, 468822, 472061, 472100, 469071, 463140, 454665, 444794, 435142, 426653, 419141, 412191, 406073, 401469, 398635, 397303, 397302, 398850, 402134, 406854, 412330, 417995, 423735, 429782, 436285, 443020, 449516, 455409, 460469, 464308, 466299, 465960, 463322, 458870, 453269, 447218, 441382, 436255, 432269, 430070, 430377, 433192, 437415, 441737, 445928, 450793, 456749, 462902, 467843, 471033, 473107, 475030, 477351, 480212, 483673, 487844, 492786, 498313, 503789, 508178, 510482, 510254, 507717, 503453, 497992, 491549, 484007, 475293, 465901, 456845, 448884, 441935, 435532, 429593, 424329, 419569, 414857, 410248, 406364, 403412, 400800, 398163, 396225, 395980, 397416, 399735, 402557, 406105, 410167, 413717]
51802D13717K158P90j44r98j981k798l202l295l171k803k444k533k991l145k601
51787C84559j836j549j767j937j690j170o63k14L46J101J808K008J520P16J10
51772C81342l35j064k043k446j565K67K009L032L577M234N331O754Q041Q573Q064
51757D23771O882N683M604L088P09k066m257n441o103o829p441p310o332n161
51743C93797m301l474k233q76q1K72J214L357O018Q086R253R879J0047R413P903
51728D48274N964M074K588K001K685M134N003M324K346qk128l835n055n778o107
51713D58482n901m745k760j129j081k378l450l168j880n80L83J411K905M804O594
51698D47507P472O744M398J289j442l004l093j785M45K843M824O073O139M393
$$ y = [413717, 415875, 416665, 416521, 415523, 413542, 410744, 407542, 404247, 401076, 398273, 395829, 393296, 390305, 387160, 384559, 382723, 381174, 379407, 377470, 375780, 374610, 373947, 373733, 374079, 375180, 376988, 378996, 380516, 381232, 381342, 381007, 379943, 377900, 375454, 373889, 374156, 376165, 379197, 382774, 387008, 392339, 399093, 407134, 415707, 423771, 430653, 436336, 440940, 444028, 444737, 442671, 438414, 432973, 426870, 420041, 412600, 405290, 398958, 393797, 389496, 386022, 383789, 382913, 382832, 383104, 384318, 387675, 393693, 401779, 411032, 420911, 430958, 440371, 448274, 454238, 458312, 460900, 462901, 465586, 469720, 474723, 479047, 481393, 481385, 479257, 475422, 470367, 464589, 458482, 452581, 447836, 445076, 443947, 442866, 440488, 437038, 433870, 431990, 431410, 431793, 433204, 436109, 440913, 447507, 454979, 461723, 466121, 467410, 465968, 462964, 459871, 458086, 458531, 461374, 466198, 472271, 478410, 482803]
51684D82803Q49l371o887r174j0380j0429r116o994n258m427l763k359k84J719
51670D12929L200M201M870N409O244P649R214J0121J0017R322Q435O954M016m93
51656E02088n231q257q717p467n795l959j452J517L722M423M300M287M017K303
51642D85779j093m952p965r850j1039j1800j2067j1757j0911r637q110o559n235
51629C74804m431m336m635m481l330j795j052j357j704j213k50K57J62R8L91O46
51613C47774M98J92J85M86O86N31J84j9M7J94K17J91M35J045J619J601J016O37
51595C57519J298L045N134O814P970Q877R501R327P855N140J780j360l329l392
51581D16179j566J153L497N007O277Q085J0569J3317J6051J8880K1926K4757K6453
$$ y = [482803, 483652, 480281, 473394, 464220, 453840, 443411, 434295, 427301, 422043, 417616, 413853, 411494, 411210, 412929, 416129, 420330, 425200, 430609, 436853, 444502, 453716, 463837, 473854, 483176, 491611, 498565, 502581, 502088, 496857, 488600, 479883, 472416, 466621, 462662, 461210, 462727, 466449, 470872, 475172, 479459, 483476, 485779, 484686, 479734, 471769, 461919, 450880, 439080, 427013, 415256, 404345, 394708, 386598, 380039, 374804, 370373, 366037, 361402, 356921, 353591, 351796, 350744, 349387, 347683, 346470, 346220, 346477, 346639, 346737, 347128, 347774, 348272, 348464, 348649, 349135, 349821, 350352, 350536, 350517, 350564, 350758, 350975, 351166, 351601, 352646, 354265, 355866, 356882, 357519, 358817, 361862, 366996, 373810, 381780, 390657, 400158, 409485, 417340, 422480, 424260, 422900, 419571, 416179, 414613, 415766, 419263, 424270, 430547, 438632, 449201, 462518, 478569, 497449, 519375, 544132, 570585]
51568E70585K6373K4988K3770K3966K5340K6292K5347K2538J9375J7667J8390
51557H24631K1500K6587L3381M1367M8969N3672N3452M8043L8621K6574J3082
51546A229879m68j2639k2801l1333l8697m4811m9489n2755n4363n3704n0799m6848
51534G71172m3092l9449l5088k9990k5145k1248j8173j5737j4131j3285j2513
51523E03321j1241r576p852o115m454l409l456m301n114n378n174m774m296l755
51509D24426l262l132l671m768n636n424m169k876k417k697l103l341l455l356
51495C73119k866k088j307o34n9K75K86L52R39J929K701K923K731K164J017n30
51479C80952j739k115k036k160k515k679k600k701l100l297k864k152j908k287
$$ y = [570585, 596958, 621946, 645716, 669682, 695022, 721314, 746661, 769199, 788574, 806241, 824631, 846131, 872718, 906099, 947466, 996435, 1050107, 1103559, 1151602, 1190223, 1216797, 1229879, 1229411, 1216772, 1193971, 1162638, 1123941, 1079130, 1029641, 976886, 922523, 868819, 818020, 771172, 728080, 688631, 653543, 623553, 598408, 577160, 558987, 543250, 529119, 515834, 503321, 492080, 482504, 474652, 468537, 464083, 460674, 457218, 452917, 447803, 442425, 437251, 432477, 428181, 424426, 421164, 418032, 414361, 409593, 403957, 398533, 394364, 391488, 389071, 386374, 383271, 379930, 376475, 373119, 370253, 368165, 366858, 366224, 366165, 366440, 366726, 367078, 368017, 369946, 372647, 375570, 378301, 380465, 381482, 380952, 379213, 377098, 375062, 372902, 370387, 367708, 365108, 362407, 359307, 356010, 353146, 350994, 349086, 346799]
51465C46799k627k338j659j325j534j765j576j175q94n44K89J540K692L447L885
51450C43215M089M150M539N816P779R550J0720J1859J3561J5596J7497J9350K1196
51437D88917K1997K0139J5087Q130J446l118m706l772k006j257k241m485p410
51424E26721j0753j3853j5465j4869j2674j0067p686n686m388m016m080l758k892
51411D16534j920r52L41J790K537K196J539J488J860J749R24J53J12O01J014J138
51395D31104J147J138J048R73J253K236M004O284Q577J0429J1733J2804J4172
51382E06902J6379J9823K4565L0086L5586M0702M5751N1077N6407O1124O4803
51371I53205O6920O6220O1327N2246M0710K8564J6262L340j0085k2974l4359m4044
$$ y = [346799, 344172, 341834, 340175, 338850, 337316, 335551, 333975, 332800, 331906, 331362, 331651, 333191, 335883, 339330, 343215, 347304, 351454, 355993, 361809, 369588, 379138, 389858, 401717, 415278, 430874, 448371, 467721, 488917, 510914, 531053, 546140, 554270, 555716, 552598, 547892, 544120, 542114, 540857, 538616, 534131, 526721, 515968, 502115, 486650, 471781, 459107, 449040, 441354, 435668, 431280, 427264, 423184, 419426, 416534, 414614, 413662, 414003, 415793, 418330, 420526, 422065, 423553, 425413, 427162, 428086, 428239, 428351, 428952, 429966, 431104, 432251, 433389, 434437, 435410, 436663, 438899, 442903, 449187, 457764, 468193, 479926, 492730, 506902, 523281, 543104, 567669, 597755, 633341, 674043, 719794, 770871, 827278, 888402, 953205, 1020125, 1086345, 1147672, 1199918, 1240628, 1269192, 1285454, 1288794, 1278709, 1255735, 1221376, 1177332]
51359A177332n2183n8613o2807o4343o3403o0809n7430n3433m8378m2239l5915
51348E77779l0364k5652k1374j7693j5087j3284j1391r254p850p895q765r238
51336C99932q793p697o337n013m084l689l453k958k310j894j719j477j121q90
51322C48497q18o78m47m39p93j128q82J5R93J336R19L44K68O90J037Q78K78m72
51304C49598j000q08K97J610K046J496J019J281J564R37k67r56q30n13m77o37
51288C54360q83j141j015k36O37P98M17L60O91N40l14p97j0J420K128J473j46
51271C58282j833k598j867k05R75R18K91Q8M14R13J568K342K599J878Q91P30J279
51254C66665J427P48J3r6J88M23O59R40Q32rj117j636j312p45p39j530k550k906
$$ y = [1177332, 1125149, 1066536, 1003729, 939386, 875983, 815174, 757744, 704311, 655933, 613694, 577779, 547415, 521763, 500389, 482696, 467609, 454325, 442934, 433680, 425830, 417935, 409170, 399932, 391139, 383442, 377105, 372092, 368008, 364319, 360866, 357908, 355598, 353704, 351985, 350508, 349387, 348497, 347679, 347001, 346554, 346115, 345322, 344194, 343312, 343327, 344320, 345656, 346575, 346919, 347187, 347877, 348914, 349792, 350070, 349598, 348598, 347790, 348087, 349697, 351743, 353239, 354258, 355539, 357103, 358040, 357773, 356817, 355987, 355474, 354997, 354360, 353477, 352336, 351321, 351085, 351722, 352520, 352937, 353297, 353988, 354528, 354214, 353417, 353407, 354827, 356955, 358428, 358282, 356449, 353851, 351984, 351779, 352754, 353672, 353963, 354051, 354465, 355378, 356946, 359288, 361887, 363765, 364656, 365386, 366665, 368092, 368840, 368853, 368757, 368945, 369368, 370027, 370967, 371799, 371790, 370673, 369037, 367725, 366980, 366241, 364711, 362161, 359255]
51236C59255k297j484j548k580l553l538k768k136k069k199j981j293m15K70N70
51221C32234O07O44Q10J047J372J883K396K378J622P19N09J024J439J223Q57J155
51205C51919K087K790K679K141J997K516L222L470L015K072J092M22K8m10j021
51190C78019j425j190m58K50P70J370J997K067J369O84Q43J475J388K00j084j347
51174C84928p04j67l57r85j513j844k222k673k822k315j296l36J15J43J43M06
51158C68501R60J682K320K439J817Q20J75J86L93K17l23p56q28p46p71r04j107
51141C74075j531k299l140l509l139k366j749j439j150o90l69o14j323j804j486
51126C47467n20M94J253J968K773L252K875J890J347J969L233L973L805L511L853
$$ y = [359255, 356958, 355474, 353926, 351346, 347793, 344255, 341487, 339351, 337282, 335083, 333102, 331809, 331394, 331664, 332234, 332841, 333485, 334295, 335342, 336714, 338597, 340993, 343371, 344993, 345712, 346221, 347245, 348684, 349907, 350764, 351919, 354006, 356796, 359475, 361616, 363613, 366129, 369351, 372821, 375836, 377908, 379000, 379422, 379450, 379040, 378019, 376594, 375404, 374946, 375196, 375966, 377336, 379333, 381400, 382769, 383453, 384296, 385771, 387159, 387359, 386275, 384928, 384224, 384057, 383700, 382715, 381202, 379358, 377136, 374463, 371641, 369326, 368030, 367694, 367809, 367952, 368095, 368501, 369461, 371143, 373463, 375902, 377719, 378539, 378714, 378900, 379293, 379510, 379187, 378431, 377603, 376857, 376086, 375182, 374075, 372544, 370245, 367105, 363596, 360457, 358091, 356342, 354903, 353753, 353063, 352694, 352080, 350757, 348953, 347467, 346947, 347441, 348694, 350662, 353435, 356687, 359562, 361452, 362799, 364768, 368001, 371974, 375779, 379290, 383143]
51111C83143M489M446L423K104J202P51N28O04J073J515J375Q60Q75J857L048
51096D11293L367K737K078K095K526K647K171J402Q01N94O60O72L89j19o75j325
51080D31313k121k685k488j689j110j095j022l70L74N79O44J323K251K291J369
51065D27564Q06J541L037M347N337O306P214P984Q900R936J0222Q927O397L765
51051E12283J894J208K011L993N809O219N562N255N876O668O885O743O720O837
51037E83963P018P489Q327R096R229Q330N985J900l336q185j1336j2720j3067
51024E92693j2988j2795j2746j2800j2431j1169r191p024m941l035j605q21k19
51011D90928Q82K470L893M803N481O112O401O177N901O078O493O571O334O482
$$ y = [383143, 387632, 392078, 395501, 397605, 398807, 399558, 400086, 400690, 401763, 403278, 404653, 405513, 406388, 408245, 411293, 414660, 417397, 419475, 421570, 424096, 426743, 428914, 430316, 431117, 431711, 432371, 433043, 433432, 433313, 432638, 431313, 429192, 426507, 424019, 422330, 421220, 420125, 419103, 418733, 419107, 419686, 420330, 421653, 423904, 426195, 427564, 428370, 429911, 432948, 437295, 442632, 448938, 456152, 464136, 473036, 482972, 493194, 502121, 508518, 512283, 514177, 515385, 517396, 521389, 527198, 533417, 538979, 544234, 550110, 556778, 563663, 570406, 577126, 583963, 590981, 598470, 606797, 615893, 625122, 633452, 639437, 641337, 638001, 629816, 618480, 605760, 592693, 579705, 566910, 554164, 541364, 528933, 517764, 508573, 501549, 496608, 493573, 491968, 491147, 490928, 491810, 494280, 498173, 502976, 508457, 514569, 520970, 527147, 533048, 539126, 545619, 552190, 558524, 565006]
50997E65006P420Q684R509R631R272Q608P716O956O930P864R272J0413J1017J1434
50983F89732J2242J3858J6315J9204K1933K4192K6042K7380K7607K6301K4119
50972I28925K2550K2530K3601K4659K5351K6453K8902L2685L6871M0661M4148
50961A257336M7876N1863N5423N8086O0165O2105O3611O3910O2686O0259N6901
50950A900221N2534M7207M1393L5544K9720K3857J8190J3228R469P179O262O100
50938B190904N713M113O50m699j1011j6571k0057k1713k2980k4850k7065k8980
50926B023454l0635l2597l5229l8588m2677m7288n1794n5570n8424o0347o1026
50915A509279o0158n8059n5498n2851m9868m6245m2112l7830l3720l0054k6987
$$ y = [565006, 572426, 581110, 590619, 600250, 609522, 618130, 625846, 632802, 639732, 647596, 656868, 667281, 678298, 689732, 701974, 715832, 732147, 751351, 773284, 797476, 823518, 850898, 878505, 904806, 928925, 951475, 974005, 997606, 1022265, 1047616, 1074069, 1102971, 1135656, 1172527, 1213188, 1257336, 1305212, 1357075, 1412498, 1470584, 1530749, 1592854, 1656465, 1720375, 1783061, 1843320, 1900221, 1952755, 1999962, 2041355, 2076899, 2106619, 2130476, 2148666, 2161894, 2171363, 2178542, 2184804, 2190904, 2196617, 2200730, 2201380, 2196681, 2185670, 2169099, 2149042, 2127329, 2104349, 2079499, 2052434, 2023454, 1992819, 1960222, 1924993, 1886405, 1843728, 1796440, 1744646, 1689076, 1630652, 1570305, 1509279, 1449121, 1391062, 1335564, 1282713, 1232845, 1186600, 1144488, 1106658, 1072938, 1042884, 1015897]
50904A015897k4317k1594j8649j5887j3858j2642j1820j0948r920q831p687o347
50892H53397m793l366k535k382k369j870q86j10j26o49p69PJ201J998K295K703
50876H41746L599M646N490O430P880R492J0505J0915J1583J2995J4546J5444J5859
50863I71130J6675J8424K0902K3677K6496K9272L2093L5340L9469M4546N0214
50852A308238N6239O2869P0481P8956Q7679R6213J04781J13839J23278J32349
50842B234922J40344J47077J52521J56466J58739J59333J57686J52315J41898
50833C601301J26791J08724Q9113O8360M6917K6027O919r957k4304l5196m1641
50822C963054m3671m2185l7935l1240k2602j3080m112K678N672L850k706j3023
$$ y = [1015897, 991580, 969986, 951337, 935450, 921592, 908950, 897130, 886182, 876262, 867431, 859744, 853397, 848604, 845238, 842703, 840321, 837952, 836082, 835196, 835086, 834960, 834311, 833542, 833549, 834750, 836748, 839043, 841746, 845345, 849991, 855481, 861911, 869791, 879283, 889788, 900703, 912286, 925281, 939827, 955271, 971130, 987805, 1006229, 1027131, 1050808, 1077304, 1106576, 1138669, 1174009, 1213478, 1258024, 1308238, 1364477, 1427346, 1497827, 1576783, 1664462, 1760675, 1865456, 1979295, 2102573, 2234922, 2375266, 2522343, 2674864, 2831330, 2990069, 3149402, 3307088, 3459403, 3601301, 3728092, 3836816, 3925929, 3994289, 4041206, 4067233, 4074152, 4064195, 4039891, 4004695, 3963054, 3919383, 3877198, 3839263, 3808023, 3785421, 3772341, 3768229, 3770907, 3776579, 3780429, 3777723, 3764700]
50810C764700k5859m0028n4538o8918q3278r7628j11218j22850j31704j37483
50800B891196j40024j39196j35105j28090j18596j07332r5307q3257p1236n9161
50790A813892m7476l6777k7022j7782r212k121K984O285Q066Q345P309N546L559
50777A715596J382j070l657o149q425j0366j1899j3275j5054j7616k0854k4334
50765A584279k7594l0336l2627l4828l7010l8499l8503l7184l5513l3984l2083
50754A206118k9235k5740k2307j9105j5781j2219q787n817l128k53K992O257R062
50741A082057J1488J4219J7714K1603K5299K9028L3564L9016M4497M9275N3679
50730A421439N8435O3620O8701P3295P7396Q0964Q3749Q5587Q6544Q6793Q6399
$$ y = [3764700, 3738841, 3698813, 3644275, 3575357, 3492079, 3394451, 3283233, 3160383, 3028679, 2891196, 2751172, 2611976, 2476871, 2348781, 2230185, 2122853, 2027546, 1944289, 1873053, 1813892, 1766416, 1729639, 1702617, 1684835, 1675623, 1673502, 1676486, 1682771, 1690837, 1699182, 1706491, 1712037, 1715596, 1716978, 1715908, 1712251, 1706102, 1697677, 1687311, 1675412, 1662137, 1647083, 1629467, 1608613, 1584279, 1556685, 1526349, 1493722, 1458894, 1421884, 1383385, 1344882, 1307698, 1272185, 1238201, 1206118, 1176883, 1151143, 1128836, 1109731, 1093950, 1081731, 1072944, 1067127, 1063999, 1063746, 1066738, 1072995, 1082057, 1093545, 1107764, 1125478, 1147081, 1172380, 1201408, 1234972, 1273988, 1318485, 1367760, 1421439, 1479874, 1543494, 1612195, 1685490, 1762886, 1843850, 1927599, 2013186, 2099730, 2186523, 2272922]
50719B272922Q5186Q2631P7926P0344N9671M6310L1040J4701j888j7623l0877
50708B690343m0039m4596m5411m3643l9676l3546k5978j8199j0778l554L203Q265
50696B396391J0330Q879L955m121j4524k6035l7790m9385n9980o8097p2815p4497
50684B012311p3779p0553o4714n7289m9698m2148l3657k3673j2849k193P834J7339
50672A606931K6664L6140M5544N3801N9754O3279O5079O5437O3834N9877N4037
50661B200377M7164L9872L2685K6208K0765J6200J2371R525P803O631N023K449
50649B427073q36m127o679p993q011p006n138k177K101P360J2868J8180K3394
50636B449009K8592L3390L7289M0289M2786M4868M6138M6405M6171M6162M6582
$$ y = [2272922, 2358108, 2440739, 2518665, 2589009, 2648680, 2694990, 2726030, 2740731, 2738843, 2721220, 2690343, 2650304, 2605708, 2560297, 2516654, 2476978, 2443432, 2417454, 2399255, 2388477, 2384923, 2388126, 2396391, 2406721, 2415600, 2419555, 2415434, 2400910, 2374875, 2337085, 2287700, 2227720, 2159623, 2086808, 2012311, 1938532, 1867979, 1803265, 1745976, 1696278, 1654130, 1620473, 1596800, 1583951, 1581758, 1589592, 1606931, 1633595, 1669735, 1715279, 1769080, 1828834, 1892113, 1957192, 2022629, 2086463, 2146340, 2200377, 2247541, 2287413, 2320098, 2346306, 2367071, 2383271, 2395642, 2405167, 2412970, 2419601, 2424624, 2427073, 2426237, 2422110, 2415431, 2407438, 2399427, 2392421, 2387283, 2385106, 2387207, 2394567, 2407435, 2425615, 2449009, 2477601, 2510991, 2548280, 2588569, 2631355, 2676223, 2722361, 2768766, 2814937, 2861099, 2907681]
50625B907681M6959M5958M0752K7470M081k6414n6688p9815r3119r7504r4652
50614B624709q6129p4147o1164m8384l5788k3776j3541n591Q92O447J0025J0054
50602B303607O221n41r267j9383l0202m0861n0759n9525o6629p1498p3984p4446
50590A812733p3392p1380o8935o6070o2125n6640n0365m4749m0406l6637l2619
50579A209415k8428k4524k0807j6848j2758r156o180l155N40M565P974J0258J1711
50566A122607J2779J3517J3853J4062J4645J5815J7336J8898K0476K2319K4813
50555A311120K8334L2946L8201M3440M8355N3063N7504O1083O3077O3188O1489
50544A861800N8085N3180M7419M1831L7383L4748L4313L6071L9465M3671M8183
$$ y = [2907681, 2954640, 3000598, 3041350, 3068820, 3072901, 3046487, 2989799, 2909984, 2816865, 2719361, 2624709, 2538580, 2464433, 2403269, 2354885, 2319097, 2295321, 2281780, 2276189, 2277081, 2283528, 2293553, 2303607, 2309828, 2309287, 2300020, 2280637, 2250435, 2209574, 2158815, 2099290, 2032661, 1961163, 1887179, 1812733, 1739341, 1667961, 1599026, 1532956, 1470831, 1414191, 1363826, 1319077, 1278671, 1242034, 1209415, 1180987, 1156463, 1135656, 1118808, 1106050, 1096894, 1090714, 1087559, 1088099, 1092664, 1100638, 1110896, 1122607, 1135386, 1148903, 1162756, 1176818, 1191463, 1207278, 1224614, 1243512, 1263988, 1286307, 1311120, 1339454, 1372400, 1410601, 1454041, 1502396, 1555459, 1612963, 1674046, 1737123, 1800311, 1861800, 1919885, 1973065, 2020484, 2062315, 2099698, 2134446, 2168759, 2204830, 2244295, 2287966, 2336149]
50533B336149N2885N7602O1969O5972P0252P5509Q1784Q8648R5888J03510J11060
50522C201228J17523J22105J24707J25438J24035J20137J13748J04943R3291P8159
50512D325314N9659L8840J6856n611k8112n0089p1008r0390j07388j20744j29509
50501C837818j33499j32775j27117j16577j02220q5605o7544m7966k7073o097
50491B991345J3319L0038M3473N3002N7603N6019M7346L1752J0659j3929m0192
50480C280435o6372r0250j09617j23482j32275j36669j36788j32999j26665j19419
50470B105899j11871j03693r4792q5820p7560p0392o4336n9184n4465m9735m5011
50459A289040m0632l6603l2484k8069k3830k0376j7700j5223j2537r839p606o019
$$ y = [2336149, 2389034, 2446636, 2508605, 2574577, 2644829, 2720338, 2802122, 2890770, 2986658, 3090168, 3201228, 3318751, 3440856, 3565563, 3691001, 3815036, 3935173, 4048921, 4153864, 4247155, 4325314, 4384973, 4423813, 4440669, 4435058, 4406946, 4356857, 4285849, 4195459, 4088071, 3967327, 3837818, 3704319, 3571544, 3444427, 3327850, 3225630, 3140025, 3072481, 3024515, 2997442, 2991345, 3004664, 3034702, 3078175, 3131177, 3188780, 3244799, 3292145, 3323897, 3334556, 3320627, 3280435, 3214063, 3123813, 3014196, 2890714, 2758439, 2621770, 2484982, 2351983, 2225318, 2105899, 1994028, 1890335, 1795543, 1709723, 1632163, 1561771, 1497435, 1438251, 1383786, 1334051, 1289040, 1248408, 1211805, 1179321, 1151252, 1127422, 1107046, 1089346, 1074123, 1061586, 1051747, 1044141, 1038122]
50447A038122m792l578k363j330l96P69K151L147L235K731K495L061M307N890
50433A053449P535Q950R960J0875J2330J4546J7106J9505K1580K3272K4451K5292
50421A248851K6398K8137L0130L1834L3413L5531L8451M1807M5278M9002N3236
50410A662068N7968O2936O7789P2087P5413P7596P8651P8451P6688P3094O7591
50399B450332O0320N1856M3272L5340K7510J8167O301p481k1751l5552m8464n9867
50387B519983o8976p5497p9577q1074p9459p4664o7449n8723m8921l8320k7605
50376A819718j7612q707p55O306J2097J5935J7156J5452J1017M308m429j5071
50364A855415k6925l8481m8284n5849o1349o4699o5585o4394o2285o0057n7442
$$ y = [1038122, 1033330, 1029752, 1027389, 1026059, 1025663, 1026432, 1028583, 1031730, 1034965, 1037696, 1040191, 1043252, 1047559, 1053449, 1060984, 1069934, 1079894, 1090769, 1103099, 1117645, 1134751, 1154256, 1175836, 1199108, 1223559, 1248851, 1275249, 1303386, 1333516, 1365350, 1398763, 1434294, 1472745, 1514552, 1559830, 1608832, 1662068, 1720036, 1782972, 1850761, 1922848, 1998261, 2075857, 2154508, 2232959, 2309647, 2382741, 2450332, 2510652, 2562508, 2605780, 2641120, 2668630, 2686797, 2693098, 2685617, 2663866, 2628314, 2579850, 2519983, 2451007, 2375510, 2295933, 2214859, 2135400, 2060736, 1993287, 1934564, 1885643, 1847323, 1819718, 1802106, 1793399, 1792644, 1798950, 1811047, 1826982, 1844138, 1859590, 1870607, 1874915, 1870486, 1855415, 1828490, 1790009, 1741725, 1685876, 1624527, 1559828, 1494243, 1429849, 1367564, 1307507, 1250065]
50353A250065n3893m9636m5489m1894l8674l5532l2367k9121k5799k2621j9750
50342H55289j6821j3310r480o444m941m375l512j914k80N79O48N50P73J281J705
50327G99748J786J604J367J021L10o48j130n37P94J916K393K609K931L147L069
50312H20380L076L591M368M898N260N901O664O813O179N630N954O787P156O781
50298H99438O275O212O446O537O391O266O362O607O825O892O694O075M988L665
50284I85673K520J747J095K56o06r29m60L81R84J249J685K805M523O040O326M962
50268A018251K663P37j12l56q20j536j722q44P07K150L178M022M660M276J824
50253A037078k747p983j1918j3638j3674j2855j1241q471m862j561M43J107J116
$$ y = [1250065, 1196172, 1146536, 1101047, 1059153, 1020479, 984947, 952580, 923459, 897660, 875039, 855289, 838468, 825158, 815678, 809234, 804293, 799918, 796406, 794492, 794212, 794791, 795439, 795989, 796762, 798043, 799748, 801534, 803138, 804505, 805526, 805836, 805188, 804058, 803521, 804315, 806231, 808624, 811233, 814164, 817311, 820380, 823456, 827047, 831415, 836313, 841573, 847474, 854138, 860951, 867130, 872760, 878714, 885501, 892657, 899438, 905713, 911925, 918371, 924908, 931299, 937565, 943927, 950534, 957359, 964251, 970945, 977020, 982008, 985673, 988193, 989940, 991035, 991291, 990685, 989756, 989296, 989677, 990661, 991910, 993595, 996400, 1000923, 1006963, 1013289, 1018251, 1020914, 1021651, 1021539, 1021183, 1020363, 1018827, 1017105, 1016261, 1016968, 1019118, 1022296, 1026318, 1030978, 1035254, 1037078, 1034331, 1026348, 1014430, 1000792, 987118, 974263, 963022, 954551, 949689, 948128, 948571, 949678, 950794]
50240I50794J208J766K724L528L453K239M65r51j582j786k266l455n338p608r807
50225I33384j1423j2115j2088j2127j2922j4267j5139j4763j3410j1942j0824
50214G92364r909r032q216p295n883m016k405j632j359q20J61J072J623K072K576
50199G49301K780K459K179K737M088N363N861N691N310N048N198O104P706R372
50185H19197J0664J2093J4602J8278K2150K5320K7951L0932L4856L9503M4070
50174A099616M7840N0670N2879N4486N4709N2656M8499M3538L9061L5693L3859
50163A613506L4061L6050L8256L8728L6505L1582K3894J3102n61j5830l0881m4054
50151A774358n4145o0611o3703o4156o2701n9892n6211n1911m6908m1269l5746
$$ y = [950794, 952002, 953768, 956492, 960020, 963473, 965712, 966177, 965226, 963644, 961858, 959592, 956137, 950799, 943191, 933384, 921961, 909846, 897758, 885631, 872709, 858442, 843303, 828540, 815130, 803188, 792364, 782455, 773423, 765207, 757912, 752029, 748013, 745608, 743976, 742617, 741797, 741958, 743030, 744653, 746725, 749301, 752081, 754540, 756719, 759456, 763544, 768907, 774768, 780459, 785769, 790817, 796015, 802119, 809825, 819197, 829861, 841954, 856556, 874834, 896984, 922304, 950255, 981187, 1016043, 1055546, 1099616, 1147456, 1198126, 1251005, 1305491, 1360200, 1412856, 1461355, 1504893, 1543954, 1579647, 1613506, 1647567, 1683617, 1721873, 1760601, 1797106, 1828688, 1852582, 1865684, 1865123, 1849293, 1818412, 1774358, 1720213, 1659602, 1595899, 1531743, 1469042, 1409150, 1352939, 1301028, 1254120, 1212851, 1177105]
50140A177105l1337k8257k5743k2951j9824j7099j5770j6374j8326k0005k0033
50129I41386j8514j6606j4955j3258j1334r748q909q269p098n597m664m650m898
50116H12886m463l056j301k45m59j443k083j802j010m16k65m14o64o96p6J237
50100G95730K684L809M843O172P508Q169Q127Q182R043J0572J2123J3331J4389
50087I04682J5618J6913J7751J7848J7693J8056J8975J9662J9674J9559J9962
50076A106393K0565K0567J9919J9347J9263J9325J9269J9524K0727K2989K6011
50065A333899K9691L4254L9845M6247N3130O0405O8176P6211Q3695Q9731R3949
50054B009233R6300R6437R3998Q9655Q5260Q2465Q1672Q2519Q4689Q7521Q9333
$$ y = [1177105, 1145768, 1117511, 1091768, 1068817, 1048993, 1031894, 1016124, 999750, 981424, 961419, 941386, 922872, 906266, 891311, 878053, 866719, 856971, 848062, 839793, 832695, 827098, 822434, 817784, 812886, 808423, 805367, 804066, 803821, 803362, 801919, 799836, 798034, 797024, 796608, 796343, 795929, 795265, 794569, 794493, 795730, 798414, 802223, 807066, 813238, 820746, 828915, 837042, 845224, 854267, 864839, 876962, 890293, 904682, 920300, 937213, 954964, 972812, 990505, 1008561, 1027536, 1047198, 1066872, 1086431, 1106393, 1126958, 1147525, 1167444, 1186791, 1206054, 1225379, 1244648, 1264172, 1284899, 1307888, 1333899, 1363590, 1397844, 1437689, 1483936, 1537066, 1597471, 1665647, 1741858, 1825553, 1915284, 2009233, 2105533, 2201970, 2295968, 2385623, 2470883, 2553348, 2635020, 2717539, 2802228, 2889749, 2979082]
50043B979082Q8103Q2679P2692N7612L7048J2089j4529m0053o2957q2472r7844
50032C031450j08772j15933j20372j22360j21435j17567j11853j05825j00133
50023B007200r4050q6450p7323o8106o0353n4341m9356m5009m1590l9178l7229
50012A354215l5306l3604l2370l1204k9475k7170k5003k3677k3278k3303k3072
50001A046753k2158k0497j8158j5169j1730q304n158k021J312M218N828O262O507
49988I67685O915O695N281L330J780O39n89j900k992m134n871q173j0535j2819
49974I45312j5081j6722j6706j4870j2269j0031q405p139o178n538m936l974k584
49961H20879j098O7P33J194K107L828N905P628R053J0998J3911J7297K0542K3753
$$ y = [2979082, 3067185, 3149864, 3222556, 3280168, 3317216, 3329305, 3314776, 3274723, 3211766, 3129294, 3031450, 2922678, 2806745, 2686373, 2564013, 2442578, 2325011, 2213158, 2107333, 2007200, 1913150, 1826700, 1749377, 1681271, 1620918, 1566577, 1517221, 1472212, 1430622, 1391444, 1354215, 1318909, 1285305, 1252935, 1221731, 1192256, 1165086, 1140083, 1116406, 1093128, 1069825, 1046753, 1024595, 1004098, 985940, 970771, 959041, 950737, 945579, 943558, 944870, 949088, 954916, 961178, 967685, 974600, 981295, 986576, 989906, 991686, 992325, 991736, 989836, 986844, 982710, 976839, 968666, 958131, 945312, 930231, 913509, 896803, 881933, 869664, 859633, 851228, 844089, 837911, 832373, 827437, 823463, 820879, 819781, 819848, 820581, 821775, 823882, 827710, 833615, 841243, 850296, 861294, 875205, 892502, 913044, 936797]
49947I36797K7352L1288L5169L8901M2658M6290M9361N1704N3646N5543N7491
49936A426200N9463O1294O2344O1464N7631N0653M1340L1286K2458J6598J4481
49925A905212J5632J8734K2217K4474K3946J9410J0364k947j9660l8194n6309
49914A922879p1803q3447r1075r4725r4177q9617q2318p3987o5476n6600m7353
49903A072301l8721l1873k6873k2646j8169j3314q506m053o8L202N282N771M574
49890I26907J964j417m640o866p882q218q647r570j0930j2577j4517j6767j9150
49877H07690k1300k2882k3698k3735k3114k1989k0378j8127j5206j2001r265p595
$$ y = [936797, 964149, 995437, 1030606, 1069507, 1112165, 1158455, 1207816, 1259520, 1313166, 1368709, 1426200, 1485663, 1546957, 1609301, 1670765, 1728396, 1779049, 1820389, 1851675, 1874133, 1890731, 1905212, 1920844, 1939578, 1961795, 1986269, 2010215, 2029625, 2039989, 2037042, 2017382, 1979188, 1922879, 1851076, 1767629, 1676554, 1581829, 1487652, 1398035, 1315717, 1241730, 1176254, 1119654, 1072301, 1033580, 1001707, 974834, 952188, 934019, 920705, 912199, 908146, 908078, 911280, 916562, 922333, 926907, 928871, 927454, 922814, 915948, 908066, 899848, 891201, 881631, 870701, 858124, 843607, 826840, 807690, 786390, 763508, 739810, 716075, 692961, 670972, 650594, 632467, 617261, 605260, 595995, 588400]
$$ [...]
##END NTUPLES=NMR SPECTRUM
##END=
