##TITLE=AC1479_ZINDOMA305_8101045_lMus8BbtgM
##JCAMPDX= 6.0         $$ Bruker NMR JCAMP-DX V2.0
##DATA TYPE= NMR SPECTRUM
##DATA CLASS= NTUPLES
##ORIGIN= BRUKER
##OWNER= Administrator
$$ 1.72 TOPSPIN		Version 2.1
$$ 2013-07-31 17:26:42.190 -0700  Administrator@X
$$ Compression mode = diff/dup
##.OBSERVE FREQUENCY= 400.02188249412
##.OBSERVE NUCLEUS= ^1H
##.ACQUISITION MODE= SIMULTANEOUS (DQD)
##.ACQUISITION SCHEME= undefined
##.AVERAGES= 8
##.DIGITISER RES= 22
##SPECTROMETER/DATA SYSTEM= spect
##.PULSE SEQUENCE= zg30
##.SOLVENT NAME= COFFEE_meoh
##.SHIFT REFERENCE= INTERNAL, COFFEE_meoh, 1, 14.98509
##AUDIT TRAIL= $$ (NUMBER, WHEN, WHO, WHERE, PROCESS, VERSION, WHAT)
$$ ##TITLE= Audit trail, TOPSPIN		Version 2.1
$$ ##JCAMPDX= 5.01
$$ ##ORIGIN= Bruker BioSpin GmbH
$$ ##OWNER= Administrator
$$ $$ E:\/data/COFFEE/nmr/AC1479_ZINDOMA305_8101045_lMus8BbtgM/10/pdata/1/auditp.txt
$$ ##AUDIT TRAIL=  $$ (NUMBER, WHEN, WHO, WHERE, PROCESS, VERSION, WHAT)
(   1,<2013-07-31 17:26:35.706 -0700>,<Administrator>,<X>,<go>,<TOPSPIN 2.1>,
      <created by zg
	started at 2013-07-31 17:25:30.699 -0700,
	POWCHK enabled, PULCHK disabled,
       configuration hash MD5:
       C8 4E 4E 5D D3 5C D8 9E 9F 52 82 E0 59 8A DE 15
       data hash MD5: 64K
       9E 24 8C DE 80 EC C6 F5 66 27 CE F5 39 17 A3 1C>)
(   2,<2013-07-31 17:26:38.628 -0700>,<Administrator>,<X>,<proc1d>,<TOPSPIN 2.1>,
      <Start of raw data processing
       efp LB = 0 FT_mod = 6 PKNL = 1 PHC0 = 0 PHC1 = 0 SI = 32K 
       data hash MD5: 32K
       49 5E 7D 3D EF F1 88 0F FB 8F 97 4F 89 38 2A B2>)
(   3,<2013-07-31 17:26:38.924 -0700>,<Administrator>,<X>,<proc1d>,<TOPSPIN 2.1>,
      <pk PHC0 = 98.33313 PHC1 = 0 
       data hash MD5: 32K
       32 66 F9 86 79 38 5F 74 EE 69 2E F5 E7 83 EA 2C>)
(   4,<2013-07-31 17:26:39.018 -0700>,<Administrator>,<X>,<proc1d>,<TOPSPIN 2.1>,
      <abs ABSG = 1 
       data hash MD5: 32K
       42 38 7F 4A 8A 50 66 45 F4 F1 FE 58 E0 0B 67 BB>)
(   5,<2013-07-31 17:26:39.081 -0700>,<Administrator>,<X>,<proc1d>,<TOPSPIN 2.1>,
      <abs ABSG = 2 
       data hash MD5: 32K
       8D 86 F0 93 FC FC 47 28 87 FA 67 B4 49 6D 57 18>)
(   6,<2013-07-31 17:26:39.128 -0700>,<Administrator>,<X>,<proc1d>,<TOPSPIN 2.1>,
      <abs ABSG = 3 
       data hash MD5: 32K
       7C 0E B3 14 D9 65 54 AF E4 3D C8 7A D1 83 BD D1>)
(   7,<2013-07-31 17:26:39.174 -0700>,<Administrator>,<X>,<proc1d>,<TOPSPIN 2.1>,
      <abs ABSG = 4 
       data hash MD5: 32K
       AC 44 D8 00 57 E6 2B A8 E3 FB B8 4F 6E 7A 94 FE>)
(   8,<2013-07-31 17:26:39.253 -0700>,<Administrator>,<X>,<proc1d>,<TOPSPIN 2.1>,
      <abs ABSG = 5 
       data hash MD5: 32K
       9C 97 F6 E5 CC AB 08 9E 0F 31 5F 1C D9 DD 93 AA>)
$$ ##END=
$$ 
$$ $$ hash MD5
$$ $$ CD D8 11 55 7F CC 93 23 DA EF D9 7B A0 CF 00 9A
##$RELAX= 
##$RELAX= 
##$RELAX= 
##$RELAX= 
##$RELAX= 
##$RELAX= 
##$RELAX= 
$$ Bruker specific parameters
$$ --------------------------
##$DU= <E:\>
##$EXPNO= 10
##$NAME= <AC1479_ZINDOMA305_8101045_lMus8BbtgM>
$$ [...]
150 150 150 150 150 150 150 150
##$TP07= 0
##$TPNAME0= <>
##$TPNAME1= <>
##$TPNAME2= <>
##$TPNAME3= <>
##$TPNAME4= <>
##$TPNAME5= <>
##$TPNAME6= <>
##$TPNAME7= <>
##$TPOAL= (0..7)
0.5 0.5 0.5 0.5 0.5 0.5 0.5 0.5
##$TPOFFS= (0..7)
0 0 0 0 0 0 0 0
##$TUNHIN= 0
##$TUNHOUT= 0
##$TUNXOUT= 0
##$USERA1= <user>
##$USERA2= <user>
##$USERA3= <user>
##$USERA4= <user>
##$USERA5= <user>
##$V9= 5
##$VALIST= <valist>
##$VCLIST= <CCCCCCCCCCCCCCC>
##$VD= 0
##$VDLIST= <DDDDDDDDDDDDDDD>
##$VPLIST= <PPPPPPPPPPPPPPP>
##$VTLIST= <TTTTTTTTTTTTTTT>
##$WBST= 2048
##$WBSW= 25
##$XGAIN= (0..3)
0 0 0 0
##$XL= 0
##$YL= 0
##$YMAX_a= 663939
##$YMIN_a= -565618
##$ZGOPTNS= <>
##$ZL1= 120
##$ZL2= 120
##$ZL3= 120
##$ZL4= 120
##$ABSF1= 14.98509
##$ABSF2= -5.573092
##$ABSG= 5
##$ABSL= 3
##$ALPHA= 0
##$AQORDER= 0
##$ASSFAC= 0
##$ASSFACI= 0
##$ASSFACX= 0
##$ASSWID= 0
##$AUNMP= <proc_prof1d_extract_pilot.lims>
##$AXLEFT= 0
##$AXNAME= <>
##$AXNUC= <1H>
##$AXRIGHT= 0
##$AXTYPE= 0
##$AXUNIT= <>
##$AZFE= 0.1
##$AZFW= 0.1
##$BCFW= 0
##$BC_mod= 0
##$BYTORDP= 0
##$COROFFS= 0
##$CY= 15
##$DATMOD= 1
##$DC= 0
##$DFILT= <>
##$DTYPP= 0
##$F1P= 0
##$F2P= 0
##$FCOR= 0.5
##$FTSIZE= 32768
##$FT_mod= 6
##$GAMMA= 0
##$GB= 0
##$INTBC= 1
##$INTSCL= 1
##$ISEN= 128
##$LB= 0
##$LEV0= 0
##$LPBIN= 0
##$MAXI= 10000
##$MC2= 0
##$MEAN= 0
##$ME_mod= 0
##$MI= 0
##$NCOEF= 0
##$NC_proc= -8
##$NLEV= 6
##$NOISF1= 0
##$NOISF2= 0
##$NSP= 0
##$NTH_PI= 0
##$NZP= 0
##$OFFSET= 14.98509
##$PC= 1
##$PHC0= 98.33313
##$PHC1= 0
##$PH_mod= 1
##$PKNL= yes
##$PPARMOD= 0
##$PPDIAG= 0
##$PPIPTYP= 0
##$PPMPNUM= 2147483647
##$PPRESOL= 1
##$PSCAL= 4
##$PSIGN= 0
##$PYNMP= <proc.py>
##$REVERSE= no
##$SF= 400.02
##$SI= 32768
##$SIGF1= 0
##$SIGF2= 0
##$SINO= 400
##$SIOLD= 32768
##$SPECTYP= <>
##$SREGLST= <1H.CDCl3>
##$SSB= 0
##$STSI= 32768
##$STSR= 0
##$SW_p= 8223.68421052631
##$SYMM= 0
##$S_DEV= 0
##$TDeff= 65536
##$TDoff= 0
##$TI= <>
##$TILT= no
##$TM1= 0
##$TM2= 0
##$TOPLEV= 0
##$USERP1= <user>
##$USERP2= <user>
##$USERP3= <user>
##$USERP4= <user>
##$USERP5= <user>
##$WDW= 1
##$XDIM= 32768
##$YMAX_p= 458343370
##$YMIN_p= -703211
##$CURPLOT= <Network HP LaserJet P1505>
##$CURPRIN= <$Network HP LaserJet P1505>
##$DFORMAT= <normdp>
##$LAYOUT= <+/1D_H.xwp>
##$LFORMAT= <normlp>
##$PFORMAT= <normpl>
##$SURQMSG= 1
$$ End of Bruker specific parameters
$$ ---------------------------------
##NTUPLES= NMR SPECTRUM
##VAR_NAME=  FREQUENCY,     SPECTRUM/REAL,   SPECTRUM/IMAG
##SYMBOL=    X,             R,               I
##VAR_TYPE=  INDEPENDENT,   DEPENDENT,       DEPENDENT
##VAR_FORM=  AFFN,          ASDF,            ASDF
##VAR_DIM=   32768,         32768,           32768
##UNITS=     HZ,            ARBITRARY UNITS, ARBITRARY UNITS
##FACTOR=    0.250966925370066, 1,           1
##FIRST=     8223.43324360094, -174633,      -336214
##LAST=      0,             42432,           -119305
##MIN=       0,             -703211,         0
##MAX=       8223.43324360094, 458343370,    0
$$ Real data points
##PAGE= N=1
##DATA TABLE= (X++(R..R)), XYDATA
$$ [...]
19517A21522a75363j98036i5031j95347a25669A40872K7154c52760d2330I1661
19506A74464b69876d4950l44775A31826a94156L7777A25028a44559j31741G8728
19495a49667e0334l4676H5524b90199i8239j3119p734j04685R2394j23624I8471
19483e1437m69866e0174b4215B12448d91914d0167l5638F1415c84519R3009h8131
19471E1381J3424J61659a01266q5766A30142b4778n5758B63556a25031C02521
19460b0726l6926b0507I532h7551j2988l0667A76862b19678B35L0121b78220A55558
19447d14637J78422A54003e1126q1879j95728J38383A35011c07975I3339a5134
19436b57343J04651B9529d8560k08165E2147J28121d24680C6909J50645b9884
$$ plain form
19517 121522 -175363 -373399 -95031 -290378 -125669 140872 168026 -352760 -42330 91661
19506 174464 -269876 -44950 -389725 131826 -194156 -156379 125028 -144559 -276300 78728
19495 -149667 -50334 -85010 85524 -290199 -98239 -111358 -119092 -223777 -131383 -255007 98471
19483 -51437 -521303 -50174 -24215 212448 -491914 -40167 -75805 61415 -384519 -291510 -88131
19471 51381 64805 226464 -101266 -187032 130142 -24778 -80536 263556 -125031 302521
19460 -20726 -57652 -20507 9532 -87551 -100539 -131206 176862 -219678 235 30356 -278220 155558
19447 -414637 -236215 154003 -51126 -133005 -328733 -190350 135011 -307975 93339 -15134
19436 -257343 -152692 29529 -48560 -256725 52147 180268 -424680 36909 187554 -29884
19425b58051Q8777A47888a16642k3563c9912g376A51168b1356k69884g5586A72199
19413d88241E2781L2224B3135G319b33335l072j44106a674j24218Q472E4052c9082
19400A12137b54480P7399F2077a91557R4563H7546b59011b1524j16784K3320M6057
19389f8931m30599b35759C8835i677A1564i5350j07838l39535B09502a20391A75300
19377a33575I1928i7450K3884a4644I7871K10777a26560D9220a41025I6367c22899
19365a48432a7727m8127N057q2768j985B84042d6813k65055B7438K150h9483k949
19353i2432p077d1827j12696C775P011c2178j76023h6110D6065a74586b3531o3693
19341h7224m8583A13042D2124b24868e3354F1453a45684j58541L7276P1824O5865
$$ plain form
19425 -258051 -169274 147888 -116642 -140205 -39912 -7376 151168 -21356 -291240 -75586 172199
19413 -488241 52781 85005 23135 7319 -233335 -236407 -380513 -1674 -125892 -117420 54052 -39082
19400 112137 -254480 -177081 62077 -191557 -96994 87546 -259011 -21524 -138308 -114988 -68931
19389 -68931 -499530 -235759 38835 -9677 11564 -95350 -203188 -542723 209502 -120391 175300
19377 -133575 91928 -97450 -73566 -14644 97871 308648 -126560 49220 -141025 96367 -322899
19365 -148432 -17727 -65854 -60797 -143565 -145550 284042 -46813 -311868 27438 29588 -89483 -92432
19353 -92432 -99509 -41827 -154523 3775 10786 -32178 -208201 -86110 46065 -174586 -23531 -87224
19341 -87224 -135807 113042 42124 -224868 -53354 61453 -145684 -304225 -266949 -195125 -129260
19330a29260A21919a36340B00705G3479j1692a74143e6448a8548k5787N336C8812
19318d20646e3217h844j43348C2909a4993k44362G4712b60981O7536j6600A47108
19306g8317A99403b04812G3496O7591M5535e52369f2989A28758b46482n3870F2101
19294E4478b95988J21283L7496E192J1270g2764a9623j03122A13907E5352O2342
19283A17694f1563J6292n0720Q714a9972l55796e6872A98903i8672j26014A46701
19271b03736Q8594b346B87125b35529B19732g3574k80375A44211a00955l66245
19261d67200K32048R5992A64282E1438J19438J34610a49005I3816m0449J25345
19251A78712o0240B5338g4809k7903A26303h1254k27235a05808j28950J14590
$$ plain form
19330 -129260 121919 -136340 200705 73479 61787 -174143 -56448 -18548 -44335 -38999 38812
19318 -420646 -53217 -8844 -152192 32909 -14993 -259355 74712 -260981 -193445 -210045 147108
19306 -78317 199403 -204812 73496 141087 186622 -552369 -62989 128758 -246482 -300352 62101
19294 54478 -295988 -174705 -137209 5192 16462 -72764 -19623 -122745 113907 55352 117694
19283 117694 -61563 -45271 -95991 -87277 -19972 -375768 -56872 198903 -98672 -224686 146701
19271 -203736 -115142 -2346 287125 -235529 219732 -73574 -353949 144211 -100955 -467200
19261 -467200 -235152 -139160 164282 51438 170876 305486 -149005 93816 53367 178712
19251 178712 118472 25338 -74809 -102712 126303 -81254 -308489 -105808 -234758 -120168
19241a20168B04156c76688B84701b96003C25042H0580a30611m7975C8544L03348
19231C41892a15733b3505A76835b47044B31791b07653j54037C32666C1189b81827
19220b37657j26352A19184K635n3734d8440n0985K576k67522A47337g671j97117
19209b04788j89926B47195D749J13435a07152q8838B36310i2681D5825K6066N496
19198G7387a46219k8555C9396a33163f6157A2134a00725k9770l01575J39997J03704
19187a88369B25970c4214k46711d230k9991j60051h7310m5788C35035e5305b5956
19175A0039l967K3762g742A4993a4849j22734e2834G3962a29406e5133k19776
19164b74909e931k11721h0587J7399D7816a69314D320M2294f2344a9051k89400
$$ plain form
19241 -120168 204156 -376688 284701 -296003 325042 80580 -130611 -178586 38544 341892
19231 341892 -115733 -23505 176835 -247044 231791 -207653 -361690 332666 31189 -281827
19220 -237657 -364009 119184 121819 68085 -48440 -99425 -96849 -364371 147337 -7671 -204788
19209 -204788 -394714 247195 4749 118184 -107152 -195990 236310 -92681 45825 71891 77387
19198 77387 -146219 -174774 39396 -133163 -66157 12134 -100725 -130495 -432070 -292073 -188369
19187 -188369 225970 -34214 -280925 -4230 -34221 -194272 -87310 -133098 335035 -55305 -25956
19175 10039 6072 29834 -7742 14993 -14849 -137583 -52834 73962 -129406 -55133 -274909
19164 -274909 -5931 -217652 -80587 -63188 47816 -169314 4320 46614 -62344 -19051 -308451
19153c08451m0378h3417j43289B2773J87775G2173c26216g3309r0379A22395h7151
19141b25952A04170b73391h0950k01161A37365f7607j73330A67744B0155d80917
19130B5199J06602a04244C0749L823d32457D76765g5039j37826q4895j8686f4815
19118B7105a54297A88839b97269b8772r0963r774C9109b68530o0073a0744l06054
19107c16798A65535f584k2734B38488b38371D5738b35085O6354F8041h7720j57091
19096b44811C0782J75270c00496h0528B75981e473k85458g2759B7860b07991j57041
19085c65032A11114b97809B16467g0310j64109A44420L4326e5566q6310K5959
19075a15917A24181b23953d7313B4892a47751L7942B7761b80447j79548a93821
$$ plain form
19153 -308451 -348829 -83417 -226706 22773 210548 72173 -326216 -73309 -163688 122395 -87151
19141 -225952 104170 -273391 -80950 -282111 137365 -67607 -240937 167744 20155 -480917
19130 25199 131801 -104244 30749 34572 -432457 476765 -75039 -212865 -297760 -316446 -64815
19118 27105 -154297 188839 -297269 -28772 -119735 -129509 39109 -268530 -328603 -10744 -316798
19107 -316798 165535 -6584 -29318 238488 -238371 45738 -235085 -168731 68041 -87720 -244811
19096 -244811 30782 206052 -300496 -80528 275981 -5473 -290931 -72759 27860 -207991 -365032
19085 -365032 111114 -297809 216467 -70310 -234419 144420 178746 -55566 -141876 -115917
19075 -115917 124181 -223953 -47313 24892 -147751 -109809 27761 -280447 -459995 -193821
19064b71981d5564B0142c36505a27079j50613A79000j2104K577b18569M7472j93367
19053c64464H1327a05957C12507D9884c31361p8486B61155d0023C98733b67687
19042d9549r0998B7855M5229b72169E7861L18450a7186k19802k04974H6074r208
19031G6866J10717a55769B73609a55817e1502k5969A24238b56956B65458b3167
19020B31732i3109l1081a7730j00463A08373i6465c456p1473l08682j65747F3627
19008I2461J2670a48044F2630c652k8446l51580a55610D179a33705g699C2150
18996A52337L34696e5882G4465b49502J10423A26239E5494J67044a40127k53326
18986c93453a95541k6046A11812J48397g5683j13222l28893B23362h3368B15249
$$ plain form
19064 -271981 -45564 20142 -336505 -127079 -277692 179000 166896 169473 -218569 -171097 -364464
19053 -364464 81327 -105957 312507 49884 -331361 -409847 261155 -40023 398733 -267687
19042 -49549 -140547 27855 73084 -272169 57861 376311 -17186 -236988 -441962 86074 76866
19031 76866 187583 -155769 273609 -155817 -51502 -77471 124238 -256956 265458 -23167
19020 231732 -93109 -124190 -17730 -118193 108373 -96465 -3456 -74929 -383611 -549358 63627
19008 92461 105131 -148044 62630 -3652 -32098 -383678 -155610 4179 -133705 -7699 32150
18996 152337 487033 -55882 74465 -249502 -139079 126239 55494 222538 -140127 -393453
18986 -393453 -195541 -221587 111812 260209 -75683 -188905 -517798 223362 -83368 215249
18975g3465A05512a76212p4190c0791m2937k9697B75713f5806A09416i3316A05861
18963a64655j75467D8808d5856l79272f2829D9402R7172e1747B0863c64943d7238
18951a35841k27749I1142b61327a0927j03518A6061b79261A58036K5948E9589
18940A00629f0423A15208c46173a64044A02865j0313C6403K97306A1145J43015
18930A54160a85764Q4259C31139D6020O8541A9712a23590C28306a60903A87636
18919a06630j3265j28871B6894a85348j46785i7513b9887j33394B2624M8403f2095
18907a66808A69285a93754l3150B34216i7331A35821Q1281c11003L0639f0481
18896b03186N685j31212F1165J56470b9323A05678I804b04581R2287j84119a480
$$ plain form
18975 -73465 105512 -176212 -250402 -30791 -73728 -103425 275713 -65806 109416 -93316 105861
18963 -164655 -340122 48808 -45856 -425128 -62829 49402 146574 -51747 20863 -364943 -47238
18951 -135841 -363590 91142 -261327 -10927 -114445 16061 -279261 158036 183984 59589
18940 100629 -60423 115208 -346173 -164044 102865 92552 36403 333709 11145 154160
18930 154160 -185764 -101505 331139 46020 114561 19712 -123590 328306 -160903 187636
18919 -106630 -119895 -248766 26894 -185348 -332133 -97513 -29887 -163281 22624 71027 -62095
18907 -166808 169285 -193754 -226904 234216 -97331 135821 217102 -311003 -280364 -60481
18896 -203186 -197501 -328713 61165 217635 -29323 105678 9804 -204581 -112294 -296413 -1480
18884g5602j16750e3626k93479A45423b1292G2929a79842h4363B1926K37345b01854
18872A88695c5803D80235b15948B29646e80519E4213b03134B27858E5817J31617
18862A87434m5251b80256A27129l2469g1423l95110a50575m2709B29400c0434
18851a727q5484C970g9312e253j2698j08879O1690j78757M3070B6426f4842D882
18838a24241e9588A10597a53362P3920b0875B5234P5654D1281b5437j43119j28999
18827b97555B5055a65432e5937r9311e7613j17396H7899b71290B38488C233M98979
18816E02212B6505e7076i653k17166C0325J68551i2937B02169q1266a07992D571
18804A49694d2446A43953M0066a11789O850H7152e59305C3133a41029C57476E8319
$$ plain form
18884 -75602 -192352 -53626 -347105 145423 -21292 72929 -179842 -84363 21926 259271 -201854
18872 188695 -35803 480235 -215948 229646 -580519 54213 -203134 227858 55817 187434
18862 187434 142183 -280256 127129 94660 -71423 -466533 -150575 -193284 229400 -30434
18851 -1727 -87211 3970 -79312 -5253 -17951 -126830 -65140 -243897 -200827 26426 -64842 4882
18838 -124241 -59588 110597 -153362 -79442 -20875 25234 100888 41281 -25437 -168556 -297555
18827 -297555 25055 -165432 -55937 -155248 -57613 -175009 87899 -271290 238488 3233 502212
18816 502212 26505 -57076 -9653 -226819 30325 198876 -92937 202169 120903 -107992 4571
18804 149694 -42446 143953 184019 -111789 -104939 87152 -559305 33133 -141029 357476 58319
18792C2631a76080E4829h0390K5740C8083a34405A19974E9445e9884k88768R3200
18781b55452A76728G744J08031a66610k24268J72562b2496j8283A23355o1121
18771F2234J0330J74990b4193A06255b06020B5204b56093R7835k9836M0557L9629
18760a07908m7106A3458J38492n7781J09552b99484O0725C2506d92409d4507r2325
18749a36832j9000j690d3580m60610a29518C32214j427F2279a53824k30724a56876
18737F1757c3782m2115D9504a26965j29139h0703B78092b57354J21993f4643G7734
18725A71265p176c54728a05550n4998A14541n6194D915a9876G2192b51570j71109
18714d22679i0242l1256B3851K35J557a98638e0117j38757A66602d4981l38650
$$ plain form
18792 32631 -176080 54829 -80390 -54650 38083 -134405 119974 59445 -59884 -348652 -255452
18781 -255452 176728 7744 115775 -166610 -390878 -218316 -22496 -40779 123355 62234
18771 62234 72564 247554 -24193 106255 -206020 25204 -256093 -158258 -188094 -147537 -107908
18760 -107908 -155014 13458 151950 94169 203721 -299484 -238759 32506 -492409 -44507 -136832
18749 -136832 -155832 -157522 -43580 -504190 -129518 332214 330787 62279 -153824 -384548 -156876
18737 61757 -33782 -75897 49504 -126965 -256104 -80703 278092 -257354 -135361 -64643 77734
18725 171265 164089 -354728 -105550 -160548 114541 58347 4915 -19876 72192 -251570 -422679
18714 -422679 -90242 -121498 23851 24086 25643 -198638 -50117 -188874 166602 -44981 -383631
18703c83631c5859k79674J32322I8282b6935j78058k07386a74456j41803a36827
18692b24226b708m25935e6750A33730b58550n8083a24950l40604i8371k68875
18682c67246j05005C619J76398B2732b26520L962I6953J92627b81112e492j9784
18671b5276l890n3030G2566c15155h5296L8152o6015B02574a62666k9673j6201
18660b08540a3954k02289A09520d10996I7861D4452j6806b10405l5552h0124j92179
18649b72303A91969F9168B6722h8060c8339m6410B8348b56766c3051B48827a75776
18637B0196c11813G2309a22381C6923a77367M3395e5527j14593k86928J37206
18627c19842C767b59719R9829j72571r2547d7412R566H8107F912Q1883b16786
$$ plain form
18703 -383631 -35859 -315533 -183211 98282 -26935 -204993 -412379 -174456 -316259 -136827
18692 -224226 -2708 -428643 -56750 133730 -258550 -316633 -124950 -465554 -98371 -367246
18682 -367246 -472251 3619 180017 22732 -226520 -222558 96953 289580 -281112 -5492 -25276
18671 -25276 -29166 -82196 72566 -315155 -85296 -47144 -113159 202574 -162666 -192339 -208540
18660 -208540 -13954 -216243 109520 -410996 97861 44452 27646 -210405 -245957 -80124 -272303
18649 -272303 191969 69168 26722 -88060 -38339 -84749 28348 -256766 -33051 248827 -175776
18637 20196 -311813 72309 -122381 36923 -177367 -133972 -55527 -170120 -457048 -319842
18627 -319842 3767 -259719 -159890 -332461 -425008 -47412 -37846 88107 6912 88795 -216786
18615a41117l15838A50360J09921c11068J03639B7803b56441A75726L0972B7440
18604b91089J33305j65235B43053j06660b40618o717i9186k90152C87093A9735
18593b01678B10556a86237M1779k49671D1531b40329B11405D299e1567A11471
18582B2742a93274C041i2189F2107c87855d2974A31522a95903a1042j3660k30221
18571b54923F5760f5118E1027K62490j00639c4556j06453o7868h5021B60444b6986
18559f4017j0220A61631K62584a82351m4759O3908a6035A46259e2171H4469l5778
18548D8691h1072B50101B94J37393a64678B75724b31658O0143N267B30165a4267
18536B31215c93598A02564J19973b26910A36200g4640B21624b58353c6397A881
$$ plain form
18615 -141117 -456955 150360 260281 -311068 -207429 27803 -256441 175726 206698 27440
18604 -291089 -157784 -323019 243053 136393 -240618 -247335 -99186 -389338 387093 19735
18593 -201678 210556 -186237 -144458 -394129 41531 -240329 211405 4299 -51567 111471
18582 22742 -193274 3041 -92189 62107 -387855 -42974 131522 -195903 -11042 -24702 -254923
18571 -254923 65760 -65118 51027 313517 212878 -34556 -141009 -208877 -85021 260444 -26986
18559 -64017 -74237 161631 424215 -182351 -227110 -163202 -16035 146259 -52171 84469 48691
18548 48691 -81072 250101 294 137687 -164678 275724 -231658 -171515 -166248 230165 -14267
18536 231215 -393598 102564 222537 -226910 136200 -74640 221624 -258353 -36397 1881
18525c2591A55339h3827b5319A40364k9893c3737j91679j1351B00424i3978m144
18514i8122k16451B14723N6896c96597h7068D4076e5839D5946J09369b10864E7326
18502B9222g3211o10k8284D91495c69543m2113g1318k16048J43033l1012A56165
18490d11004c2344m55288A26453b98576g0836D1636b2475B29339P7276f3968K5642
18479c8326H4058J37799g5255r2148l07315h599A03105b81466A09145l9323E14
18467A09157a87316A85822o1592k6605B8774g0876O522A22428l2359g8346j49229
18456b27575f5936j3856A51139c89042B5732J87488n6553a59189o0560j3084c1407
18444g7021C30463c80540a03k44420C09472a45913A68494b43761A50319c4036
$$ plain form
18525 -32591 155339 -83827 -25319 140364 110471 -33737 -225416 -236767 200424 -93978 -98122
18514 -98122 -314573 214723 271619 -396597 -87068 44076 -55839 45946 155315 -210864 57326
18502 29222 -73211 -73821 -102105 491495 -369543 -411656 -71318 -287366 -144333 -175345 156165
18490 -411004 -32344 -487632 126453 -298576 -70836 41636 -22475 229339 306615 -63968 -38326
18479 -38326 84058 221857 -75255 -167403 -474718 -8599 103105 -281466 109145 69822 514
18467 109157 -187316 185822 124230 97625 28774 -70876 -64354 122428 90069 -78346 -227575
18456 -227575 -65936 -79792 151139 -389042 25732 213220 156667 -159189 -219749 -232833 -31407
18444 -77021 330463 -380540 -103 -244523 309472 -145913 168494 -243761 150319 -34036
18433D5569a34274L0023l62050a11533N4396A2036K3319a98488j19034A31409
18422c42120a13425L8589l83605J85389a32868n423B6369i0678L4640C31392I8993
18410G3843a55458j02580c2434j52280A84115i7703A18699a05148A0504b48349
18399G9507N3543c1965B24887e2195p2321j95659J01801B15149b9251C20861F0606
18387A75725a38650H1716a61422j0781j69848i4694j37224p3902a22355k68683
18377c91038J29897A81154M0706J28425A47969h0676J2712j4523k6817H0636C4640
18365a50579H9809J58866I0458g6146l9014n2324B96018c4193j38043Q1902K3847
18354f6487J8034m45944A82632a00544j77609P4864g9141k90911F8865J53887
$$ plain form
18433 45569 -134274 -104251 -466301 -111533 -57137 12036 35355 -198488 -317522 131409
18422 -342120 -113425 -74836 -458441 -273052 -132868 -138291 26369 -90678 -56038 331392 98993
18410 73843 -155458 -258038 -32434 -184714 184115 -97703 118699 -105148 10504 -248349
18399 79507 133050 -31965 224887 -52195 -124516 -320175 -218374 215149 -29251 320861 60606
18387 175725 -138650 81716 -161422 -172203 -342051 -94694 -231918 -305820 -122355 -391038
18377 -391038 -261141 181154 221860 350285 147969 -80676 -67964 -82487 -109304 80636 34640
18365 -150579 89809 248675 90458 -76146 -115160 -167484 296018 -34193 -172236 -90334 -66487
18354 -66487 -48453 -494397 182632 -100544 -278153 -203289 -79141 -370052 68865 222752
18344B22752A7166c7718j31319M7155H62b23714P2028d7545B08288a18199B56237
18332b12699R542B7853d785B28684c4607j41526A25248B3428K04154a95711c8983
18320a82004A74417D4734i4322M1455A15480g4100p5224i489j5475j98529j01712
18309c25205J57810O7293n5683d9738j40291K836H7885a5049l5873k04161F2278
18297a97597B193h262q9535j26920a07613G7742b03698e478A15259n774l2635
18286G6850K07101b51649M4653B22557C9645a46961A67563d2579a5075o3537j14130
18275a92742h7575C0923J64112a20606F4649a37602B88501e6206A56839E2036
18264b35259f8082c1936A41122C8636a50370j22655G6147c01280M01J4172A52718
$$ plain form
18344 222752 17166 -37718 -169037 -121882 862 -223714 -151686 -47545 208288 -118199 256237
18332 -212699 -203157 27853 -4785 228684 -34607 -176133 125248 23428 227582 -195711 -38983
18320 -182004 174417 44734 -94322 -52867 115480 -74100 -149324 -9489 -24964 -223493 -325205
18309 -325205 -167395 -100102 -155785 -49738 -190029 -187193 87885 -15049 -50922 -255083 62278
18297 -197597 2193 -8262 -97797 -224717 -107613 77742 -203698 -5478 115259 109485 76850
18286 76850 283951 -251649 -206996 222557 39645 -146961 167563 -42579 -15075 -78612 -192742
18275 -192742 -87575 30923 195035 -120606 64649 -137602 288501 -56206 156839 52036
18264 -235259 -68082 -31936 141122 38636 -150370 -273025 76147 -301280 -300879 -286707 152718
18252c2787r0295k3827o79L3956l0200B44203b73230c4635k93248i1083B7322
18240a71102A39249o4216J62624B4201i1742B80826A05416J45367a39343j03629
18230b42972J14064G1869b47325B02201a27340B24900a09284K5496j1476A17937
18219i8873A21941R0818b74648J24449g1794F0180M5311i9871j91527H7124a31161
18207b20898J07807j54494B03142b78599f5389E4343a21747l1993A37174K6621
18197A63795L6535g728k17748F4861a32671c0886A529h0550F3536J57765h9650
18185a8640c139k67475Q5701g5524q1868A30053a98146d5312B2317b67753b3384
18173G7968k2087R1958C6202g6790A28192F1849d9566j62836j22960D6428K5813
$$ plain form
18252 -32787 -123082 -146909 -147588 -113632 -143832 244203 -273230 -34635 -327883 -91083 27322
18240 -171102 139249 75033 237657 24201 -91742 280826 105416 250783 -139343 -242972
18230 -242972 -128908 71869 -247325 202201 -127340 224900 -109284 -83788 -95264 117937
18219 -98873 121941 212759 -274648 -150199 -71794 60180 105491 -99871 -291398 87124 -131161
18207 -220898 -113091 -267585 203142 -278599 -65389 54343 -121747 -153740 137174 163795
18197 163795 200330 -7728 -225476 64861 -132671 -30886 1529 -80550 63536 221301 -89650
18185 -18640 -3139 -270614 -184913 -75524 -157392 130053 -198146 -45312 22317 -267753 -23384
18173 77968 55881 147839 36202 -76790 128192 61849 -49566 -212402 -335362 46428 72241
18162G2241c867C905g729j71064C08202a8316A2921L18597a53711L3608A11008
18150b45014A26488C1867b5720g448k43906g412j02902m16544a33044b819C48205
18138A06875l517i9221d371j14847k50534h8637j29317f255l3008j03875A3016
18126b8170q5298j72902a26285M2653E4527b69320J10970A06246a31646A16517
18115e62077b7971I8277a60401D9129i0829B50938j15656r593b76949j26418c3936
18103A73497i5724A8636c3742j19938E8458a44515b7726B14598J3432a27419j60057
18092b87476o6140f1741B89353H0674b0360l8965A28902h9384k56799I781b48206
18080B07607B6083c26173B2364c71926a42305B0646a42124f7160A50426N6575
$$ plain form
18162 72241 -3867 3905 -7729 -178793 308202 -18316 12921 331518 -153711 -120103 111008
18150 -245014 126488 31867 -25720 -7448 -251354 -7412 -110314 -526858 -133044 -2819 348205
18138 106875 103358 -99221 -4371 -119218 -369752 -88637 -217954 -6255 -39263 -143138 13016
18126 -28170 -113468 -286370 -126285 -83632 54527 -269320 -158350 106246 -131646 116517
18115 -562077 -27971 98277 -160401 49129 -90829 250938 135282 125689 -276949 -403367 -33936
18103 173497 -95724 18636 -33742 -153680 58458 -144515 -27726 214598 228030 -127419 -287476
18092 -287476 -353616 -61741 289353 80674 -20360 -59325 128902 -89384 -346183 9781 -248206
18080 207607 26083 -326173 22364 -371926 -142305 20646 -142124 -67160 150426 207001
18070B07001R7469A36464a97822G7884B8461K02272b28712a05983g747o3065H9346
18058c3095j56054H6689J06471a77008b6699A43089d8348A34254h8219A64839
18047a29971M0087q6357K2494C085b18456O1657j22991a01724o23n0587A012b22413
18034a07087j5002J5771j89987G9005J26275E2811K9047e23981D8069L1824k8123
18023E1770J0059K30824D0975b03610G6932i3596o9308A18080a57632E5427c1967
18011A12836k247m4664a77952A9749a70106m6045M8075C9130f3778G9736J9342
18000I9078b04453D2163P0193a6298j31781k21365f3929j19916A20409Q752a954
17988d9283o4964b9462A82285a07953A46685i5820j79069A5851J04498a8945n0535
$$ plain form
18070 207001 304470 136464 -197822 77884 28461 230733 -228712 -105983 -7747 -70812 89346
18058 -33095 -189149 86689 193160 -177008 -26699 143089 -48348 134254 -88219 164839
18047 -129971 -89884 -176241 -153747 3085 -218456 -156799 -279790 -101724 -102347 -152934 1012 -222413
18034 -107087 -122089 -106318 -296305 79005 205280 52811 81858 -523981 48069 79893 51770
18023 51770 61829 292653 40975 -203610 76932 -93596 -162904 118080 -157632 55427 -31967
18011 112836 110589 65925 -177952 19749 -170106 -216151 -168076 39130 -63778 79736 99078
18000 99078 -204453 42163 112356 -16298 -148079 -369444 -63929 -183845 120409 129161 -1954
17988 -49283 -114247 -29462 182285 -107953 146685 -95820 -274889 15851 120349 -18945 -69480
17977f9480j06629J4003A36194c3440k34966j6994E9742K9023B295L6014A6501
17965B33050b33217l6865D7038H636Q4040R9106c90259a5597A47061d60667g15
17953c8953A0877b08041B41747a88771h64B03355e106j49463K5498A55904C3118
17941I2253J48883c0870C3228M2894l2465h6049A30055b32251K9787H5462N7971
17930A43433a63070A21745g2814A62635a15593l9744d134A18065E4470J06658
17920A61128a67027G0181n807J5682p197P4162o5822i5562A29353b50196d939
17908C6428i4866A27629J89687a1084C1392e09428A05756h8360I4474J07491O9684
17897B71649A34776h7860j05074O4747B82150b65343H8885b89993B87770a93369
$$ plain form
17977 -69480 -176109 -162106 136194 -33440 -268406 -285400 59742 88765 2295 38309 16501
17965 233050 -233217 -270082 47038 8636 92676 191782 -390259 -15597 147061 -460667 -715
17953 -38953 10877 -208041 241747 -188771 -864 203355 -5106 -154569 -129071 155904 33118
17941 92253 241136 -30870 33228 76122 43657 -86049 130055 -232251 -202464 85462 143433
17930 143433 -163070 121745 -72814 162635 -115593 -155337 -4134 118065 54470 161128
17920 161128 -167027 70181 64374 80056 72859 147021 81199 -95562 129353 -250196 -4939
17908 36428 -94866 127629 317316 -11084 31392 -509428 105756 -88360 94474 201965 271649
17897 271649 134776 -87860 -192934 -128187 282150 -265343 88885 -289993 287770 -193369
17886E2139J66425b6256j46934B28277g7118j03170k90745b1266A48098B5722
17875i0052H2650L9169J46184B3578J48903a76182A50374b42498D1361a60801
17864H7863J85927r8788a67754o96O7794B80856C6639b3048k61577e1820n1566
17853a03386A06126B3024O2313c7680a2323G8388d4067B62763c9962K595k29162
17842b66529a28044n9774l015j02809A06015a92091B81389a02035j16619A48293
17831a28696A46444M8470I633d32953g9221j92754M5829e6864A99922d1992j802
17820d3794A1168D959d4388m68168b14063I0659d6437J880A25332a26127A39346
17808d5884k00526j11234a29322A10147J04366b21363B8549d6358j28828j54351
$$ plain form
17886 52139 218564 -26256 -173190 228277 -77118 -180288 -471033 -21266 148098 25722
17875 -90052 82650 121819 268003 23578 172481 -176182 150374 -242498 41361 -160801
17864 87863 273790 175002 -167754 -168450 -100656 280856 36639 -23048 -284625 -51820 -103386
17853 -103386 106126 23024 85337 -37680 -12323 78388 -44067 262763 -39962 -37367 -266529
17842 -266529 -128044 -187818 -190833 -293642 106015 -192091 281389 -102035 -218654 148293
17831 -128696 146444 194914 9633 -432953 -79221 -271975 -226146 -56864 199922 -41992 -43794
17820 -43794 11168 4959 -44388 -512556 -214063 90659 -46437 -44557 125332 -126127 139346
17808 -45884 -246410 -357644 -129322 110147 214513 -221363 28549 -46358 -175186 -329537
17798c29537B40335J8618a23095B14703M8278m2537o7662o7795b67A95018c99809
17786d5773I6366j9333R7420M7655b33413B0615J54233m3151l119a52714A03147
17774F8325N779C6580N6986j2909A2474d5529q5879P401K0094j25407R7712C45068
17761e9585B39766H3976c06424A58705a83935l13478a35093E3456d8043A86544
17750a0284o7556B23654k8843C9168a1284o4432l2407c3295B13291q9276K98134
17739D22149b26136h7300A4989c38832B71208o9548A4759R9818b04997A11777
17728a98408Q7544E8422b43731g8296H071J12453P6700c2981D186d8861j10294
17717a59155j04804C9462a19180j40163A35975A4290O144f9160B17518d4989A46775
$$ plain form
17798 -329537 240335 258953 -123095 214703 262981 220444 152782 84987 -267 195018 -399809
17786 -45773 96366 77033 174453 222108 -233413 20615 174848 131697 128578 -152714 103147
17774 68325 74104 36580 93566 80657 12474 -45529 -131408 -124007 -103913 -229320 -131608 345068
17761 -59585 239766 83976 -306424 158705 -183935 -497413 -135093 53456 -48043 186544
17750 -10284 -77840 223654 194811 39168 -11284 -75716 -108123 -33295 213291 124015 422149
17739 422149 -226136 -87300 14989 -338832 271208 201660 14759 114577 -204997 111777
17728 -198408 -110864 58422 -243731 -78296 8071 120524 197224 -32981 4186 -48861 -159155
17717 -159155 -263959 39462 -119180 -259343 135975 14290 20434 -69160 217518 -44989 146775
17705c3059k80510f8634A51857h483A09538J4503a43501d7812l9906A56017G5402
17693a0657A47137e8745A02449K8074a09356F4739L37261I435b91679A22836J20189
17682B43025b58938i7538D9378a73132A47630a23719r0576H7608a00353M2446
17672e7907F2986d9397n3873B4568J9469J06081Q4557N6501H4841N02l0186a20992
17659A2813L74279A7747J20158k5636a53795j92610N8467D95975A23213c1410
17648g8801l0584k73578g9419q6458b7647C04284i894C96575A47293i3247m9512
17637a42759f6700A63734C2774f5488k25222d9849B86271A25788c9588a4540j5769
17626c0309H4102K37458j15310m8941d8681B04940M7716E9199k7887a37869c7613
$$ plain form
17705 -33059 -313569 -68634 151857 -8483 109538 124041 -143501 -47812 -87718 156017 75402
17693 -10657 147137 -58745 102449 130523 -109356 64739 402000 9435 -291679 122836 243025
17682 243025 -258938 -97538 49378 -173132 147630 -123719 -214295 87608 -100353 -57907
17672 -57907 62986 -49397 -103270 24568 44037 150118 234675 291176 84841 85343 55157 -120992
17659 12813 387092 17747 137905 112269 -153795 -346405 -287938 495975 123213 -31410
17648 -78801 -109385 -382963 -79419 -165877 -27647 304284 -9894 396575 147293 -93247 -142759
17637 -142759 -66700 163734 32774 -65488 -290710 -49849 286271 125788 -39588 -14540 -30309
17626 -30309 84102 321560 206250 157309 -48681 204940 252656 59199 31312 -137869 -37613
17614a06350k6768n608J7611k37697H3219a11293H9338i7413K6879A74895K9771
17603B04666b1492A7495P1038a56387D12323e5633k41506A37509R4158F4267L3858
17592I8125P7593D6033J98176a596j74425j8180A84840N043J70c36620A48423
17580b43242A27736N5603h9139B53621G7460n352K68582n3893a13159j03218l4830
17569b51207B37211a08323E629J59256h9197C75687A7027O5987J07358o4413j3827
17558A12132B9909a18958E2002c10710D6178g8729C8858J27531K0950J341D9335
17546a20419C82835A75928a10071A74631J61593b24663h5317c0720a3587j12624
17536a26211d7585B37532j8621G9730L32679p8038A30193F0932K41201i5566A47611
$$ plain form
17614 -106350 -133118 -138726 -121115 -358812 83219 -111293 89338 -97413 -70534 174895 204666
17603 204666 -21492 17495 88533 -156387 412323 -55633 -297139 137509 231667 64267 98125
17592 98125 175718 46033 244209 -1596 -176021 -194201 184840 189883 190053 -336620 148423
17580 -243242 127736 183339 -89139 253621 77460 72108 340690 286797 -113159 -216377 -251207
17569 -251207 237211 -108323 5629 164885 -89197 375687 17027 83014 190372 125959 112132
17558 112132 29909 -118958 52002 -310710 46178 -78729 38858 166389 187339 188680 49335
17546 -120419 382835 175928 -110071 174631 336224 -224663 -85317 -30720 -13587 -126211
17536 -126211 -47585 237532 218911 79730 412409 334371 130193 60932 302133 -95566 147611
17524h2508I2521a05428A00465L02757a04736B30558n846a58400E8701a29111
17513g7061D56270A41168N5685J27448j01225A9109a2961j9407A58699J55365
17503C14064G4381b45656J14720J9561A57275L0252D0926j4013L24563a58395
17492C27252m2357f1594a3289o4461I6710a47447C37849A50546a18021F5436a11726
17480C12176d2595o939k7140B39269D8150b2417A43652e4172H1234K38128H4882
17468D68421B824Q6234J66379J28060b63302Q0385Q3901A48845c88285A85009
17457B69849J4216j24506c9690q2491I863K89055r6125J41516j39212K84781j29480
17446C60398A16346L09358B5839K99011o3110D6474b29848E06967j60451j67863
$$ plain form
17524 -82508 92521 -105428 100465 403222 -104736 230558 224712 -158400 58701 -129111
17513 -77061 456270 141168 196853 324301 223076 19109 -12961 -32368 158699 314064
17503 314064 74381 -245656 -130936 -111375 157275 187527 40926 26913 351476 -158395
17492 327252 284895 -61594 -13289 -77750 96710 -147447 337849 150546 -118021 65436 -111726
17480 312176 -42595 -49534 -76674 239269 48150 -22417 143652 -54172 81234 319362 84882
17468 468421 2824 89058 255437 383497 -263302 -182917 -99016 148845 -388285 185009
17457 269849 284065 159559 -39690 -122181 9863 298918 202793 344309 205097 489878 360398
17446 360398 116346 425704 25839 324850 261740 46474 -229848 506967 346516 178653
17436A78653j3704L9473l1916J90172C0578J99628D9943J64388J07703m6848a25990
17424B45148K14993k1085j54075q8083I7201P9561l6152L09508A91556J01427
17414B92983j1669a49965B10347I50c3734B17770E2018c90187G1252L19886f0854
17402A88166a8158l0787C77143A25169J4100Q4829a88107A66164F0796J27049
17392A87845O1401H4439N1579K80354a21424B13955f2173K5396q2702A99041k9752
17381A69289Q772P8770h9168I5604L2791K78289i1614G4270J87881K627j24543
17370A40235J43102l1600L7636q0556J12063j02068n3257J07928d05382B34L34667
17359C34901d5534B60849B564J40587l1381G599M94559b88728H3194J10152M8732
$$ plain form
17436 178653 164949 204422 172506 362678 30578 230206 49943 214331 322034 275186 -125990
17424 245148 460141 439056 284981 196898 97201 176762 140610 450118 191556 292983
17414 292983 281314 -149965 210347 950 -33734 217770 52018 -390187 71252 391138 -60854
17402 188166 -18158 -48945 377143 125169 139269 224098 -188107 166164 60796 187845
17392 187845 249246 84439 136018 416372 -121424 213955 -62173 -36777 -119479 199041 169289
17381 169289 178061 256831 -89168 95604 128395 406684 -91614 74270 262151 264778 140235
17370 140235 283337 251737 289373 208817 320880 218812 165555 273483 -405382 234 334901
17359 334901 -45534 260849 2564 143151 111770 7599 502158 -288728 83194 193346 242078
17348B42078a01479D00869b9063A62488Q5181m4210C5670a31470E7789a61852
17337H3325A3182K31631p0327p6472K50572K8259j62260k1210e5413B84285r2810
17326A91475k556C3835Q1977L004A0146b9124j14283H1288j934j8999a09412B44079
17313A35220n3789L55809E0172A0584L33334A62863a48273C73144f5653B98967
17302b03016B78189p2420H0815a05591C58225i2979j04697C46522G1850E232J0930
17291A6162N2211I246f992C15926K17175B0333K67310R2330A0747N13349c9952
17279A25674K407J65441O344n8178G3584M5717i534j99185F06897e8967K8397
17268c0570C35092o1732o4518K75114p6620a22253a7676G9681A8420a05968B41534
$$ plain form
17348 242078 -101479 400869 -29063 162488 247669 203459 35670 -131470 57789 -161852
17337 83325 13182 244813 174486 98014 348586 376845 214585 193375 -55413 284285 191475
17326 191475 188919 33835 115812 118816 10146 -29124 -143407 81288 79354 60355 -109412 244079
17313 135220 81431 437240 50172 10584 343918 162863 -148273 373144 -65653 298967
17302 -203016 278189 205769 80815 -105591 358225 -92979 -197676 346522 71850 5232 16162
17291 16162 68373 9246 -6992 315926 533101 20333 287643 379973 10747 524096 -39952
17279 125674 128081 293522 299866 241688 73584 119301 -9534 -208719 606897 -58967 -30570
17268 -30570 335092 273360 208842 483956 407336 -122253 -17676 79681 18420 -105968 241534
17256i3580C6150J68731I8827B4621K31187N5659C137K53130H1624P1673n8225
17245I5072L48876A60103L0376O3879G1013M22555k19267q6692K48730F5902J93193
17234B59095A5479b91498c2405C71693A30033l0724b24474B75397e3280C06244
17223c13553C21751H6671K80299H4448K14186A30932K9674G5671C160M27181A70180
17211C51898a03570C8979f9884C96595A62283K52045j70648k3281i1078B52369
17200D4594J29186J56758L6041J8934A10387K44315P2796j0325j99476M4411D9834
17188E11852D2797K85458j06055J2512n5462f105C69L68580G5509J37506K0545
17177B33560J13565j42253k4908G3765K57011K10178I7028C2248J65697J70399
$$ plain form
17256 -93580 36150 204881 98827 24621 255808 311467 3137 256267 81624 153297 95072
17245 95072 443948 160103 190479 254358 71013 493568 274301 187609 436339 65902 259095
17234 259095 15479 -291498 -32405 371693 130033 99309 -224474 275397 -53280 306244
17223 -313553 321751 86671 366970 84448 298634 130932 160606 75671 3160 430341 170180
17211 351898 -103570 38979 -69884 396595 162283 414328 243680 220399 -91078 252369
17200 44594 173780 330538 366579 385513 110387 354702 427498 417173 217697 262108 49834
17188 511852 42797 328255 222200 234712 179250 -6105 369 368949 75509 213015 233560
17177 233560 347125 204872 179964 73765 330776 540954 97028 32248 197945 368344
17167C68344A64155N5920j9499F9545J81534b08625A73093K42453A25787Q3550
17157B09337J25585j09124J6650J18045J7474a31240C37566A56938J93064J70194
17147E20196A43872L42548G5705f9727B94237M6525P1563L2829A68098N6722J88623
17136D13443a38165B17656Q6228p7458L89266j62492K1147j51785J83147J21897
17126F27606j79007p2794M35398l95513o3485l1958c6489D49832n8504J23518
17116E14846j39712Q1921j35082A45152L25805j79743n2157J6751J31299Q2279
17106D69386I0916J5407J82242L55190A8481N71207b7233A97362p24J68194K39214
17095F04046B69410I3808O05708l38987C5666J82132P6420k1017K63601G3421
$$ plain form
17167 368344 164155 220075 200576 69545 251079 -208625 173093 415546 125787 209337
17157 209337 334922 225798 242448 360493 377967 -131240 337566 156938 350002 520196
17147 520196 143872 486420 75705 -69727 294237 340762 412325 445154 168098 224820 413443
17136 413443 -138165 217656 303884 226426 615692 453200 474347 322562 505709 627606
17126 627606 448599 375805 811203 415690 352205 320247 -36489 449832 391328 514846
17116 514846 375134 457055 321973 145152 470957 291214 239057 255808 387107 469386
17106 469386 90916 106323 288565 643755 18481 589688 -27233 197362 196638 364832 604046
17095 604046 269410 93808 699516 360529 35666 217798 294218 273201 536802 73421
17084B10020J31713q801l1429J39010J3943j63808O1937J22699j49996K94073
17074F19361k66115J98308B18894J36968K11107j82788r5245o3768O4467J24333
17064D13968j94256K42041o9286l0826q7814J12201P0815O2709j82499L2990L36906
17053G06949j77391p4663P7646k08577K00702j52954K8238M7356p8696K81026
17043F49636n7734m0975Q0072m5889N7124k2903q4093J7910n578O9117J54221
17032G70908k86955Q8335j66067J14209L04919n6098o4836p2593j33277l3751
17022D64794j65834J88793P5792j47986J04398K92187j64955J86348k36604J61594
17012G58527k4995j72061M78718n8680k13528k90733p8173J50261j29668M8780
$$ plain form
17084 210020 341733 332932 301503 440513 454456 290648 352585 475284 325288 619361
17074 619361 353246 551554 218894 355862 566969 384181 288936 225168 289635 413968
17064 413968 219712 461753 392467 361641 273827 386028 456843 519552 337053 370043 706949
17053 706949 529558 454895 532541 323964 524666 371712 399950 447306 368610 649636
17043 649636 591902 550927 630999 585110 642234 619331 535238 553148 547570 616687 770908
17032 770908 483953 572288 406221 520430 825349 769251 704415 631822 498545 464794
17022 464794 298960 487753 563545 415559 519957 812144 647189 833537 596933 758527
17012 758527 733532 561471 1040189 981509 767981 477248 399075 549336 419668 468448
17002D68448j64658M88951L1662p9403p5258J63372J5164j24380j17373L21116
16992I27641k73363J3535M3625J35286j27478K43605o4106R6602j68121j09561
16982G17665L77792m10634K56377J59053k52291l47557L90802l89296L24593L12945
16972A139449Q5687F03788J50445L4878R4147j23251M36208L0011l15672q5946
16962H24608R1031J93917k19549L85057j0351n17017J64559j62037L22029k96712
16952G75535M46698k73252m622R6633j4613r707P8720J37969k29093q8406M08924
16941A324786K39958o54329K59697k78549M44687K94701l11927K40962n55456
16932A004530M46395j25741l2683M1261p2971J07255K1499J60776m8585k81803
$$ plain form
17002 468448 303790 792741 824403 745000 669742 833114 848278 723898 606525 927641
16992 927641 654278 667813 711438 846724 719246 962851 898745 995347 827226 717665
16982 717665 1095457 684823 941200 1100253 847962 500405 891207 501911 826504 1139449
16972 1139449 1225136 603788 754233 789111 883258 760007 1196215 1226226 910554 824608
16962 824608 915639 1109556 890007 1275064 1264713 747696 912255 750218 1072247 775535
16952 775535 1222233 948981 944359 1040992 1026379 1016672 1095392 1233361 1004268 915862 1324786
16941 1324786 1564744 910415 1170112 891563 1336250 1630951 1319024 1559986 1004530
16932 1004530 1450925 1325184 1292501 1333762 1260791 1368046 1389545 1550321 1501736 1219933
16922A219933L19723l17792J27213K1619k5941J22141R165r691J4078J07049J9839
16911A607336k08814M04523k39464J46541n2926j18692L04333k94942J12619j44864
16901A515650M95613k94628K69771k08434k37013J16080K62626P0095j44388P092
16891A852464J06219J02828k06699J24829j91204J13795K15100J25504j97283
16882B045553K28887k78628K85927K751o6157M00626m12277J82974k2865n2677
16872B314114J15795J52900l63837N48111J54195m09741L00916N1843k89426K34845
16862B809715k57301J20210l73779N02837J07761K38945k15964n2652J97631O7144
16852C144547q5751J13616j04325r7893L88657k79476L98114k04319J21014K97155
$$ plain form
16922 1219933 1539656 1221864 1349077 1370696 1344755 1466896 1476061 1466370 1480448 1587497 1607336
16911 1607336 1398522 1803045 1563581 1710122 1657196 1538504 1842837 1547895 1660514 1515650
16901 1515650 2011263 1716635 1986406 1777972 1540959 1657039 1919665 1989760 1845372 1852464
16891 1852464 1958683 2061511 1854812 1979641 1788437 1902232 2117332 2242836 2045553
16882 2045553 2274440 1995812 2281739 2284490 2218333 2618959 2206682 2389656 2366791 2314114
16872 2314114 2429909 2582809 2218972 2767083 2921278 2511537 2812453 2864296 2574870 2809715
16862 2809715 2552414 2672624 2298845 2801682 2909443 3148388 2932424 2879772 3077403 3144547
16852 3144547 3058796 3172412 3068087 2970194 3358851 3079375 3477489 3273170 3394184 3691339
16842C691339M0856k70735L14203J32003m4976K5251K08187r4624M09962k30951
16832D180515N40633k09940j1504m34K45322J28634N338p9384J50328K80420j08537
16821E121391J17438j21258O53690K8639l14355K04843J99218L78566k52381J92115
16811F207906K30712L9834L94125R4561R6758K13450K24073j3110J15060M27001
16801H030370K22789J72186K20669K23457K54552L14119M3113J29390M44017l9568
16791A0015094J8416N77932N21102M0565K18387K23034K05647P99869K22786J7328
16781A2860160Q05538O24346j0583P77983n1117O98669O24012M21743N23101L81057
16771A7654909Q81859P12195J027301P23785L17551Q06934P72672R73785Q09388
$$ plain form
16842 3691339 3732195 3461460 3775663 3907666 3862690 3887941 4096128 4001504 4411466 4180515
16832 4180515 4721148 4511208 4499704 4499270 4744592 4873226 4878564 4799180 4949508 5229928 5121391
16821 5121391 5238829 5117571 5771261 5799900 5485545 5690388 5889606 6268172 6015791 6207906
16811 6207906 6438618 6478452 6872577 6967138 7063896 7277346 7501419 7488309 7603369 8030370
16801 8030370 8253159 8425345 8646014 8869471 9124023 9438142 9481255 9610645 10054662 10015094
16791 10015094 10033510 10611442 11132544 11173109 11391496 11614530 11820177 12620046 12842832 12860160
16781 12860160 13665698 14290044 14279461 15057444 15006327 15704996 16329008 16750751 17273852 17654909
16771 17654909 18536768 19248963 20276264 21000049 21317600 22124534 22897206 23870991 24680379
16762B4680379J200421Q50824R82126J373377J259429J676102J188827J138005
16754C4349490J780745J749345J841817J755114K306437J967248K095815L214826
16746E1060837K316932K784556K888361L297026L477571L919079M216751M011740
16738G7972853M665047M716812N646020N707152N794874O127204O617282P024374
16730A24271618P478332P358153P469647P402429P965672P125651O823060O366561
16722A82261123N378954M483228L111168K400161N22790n66420j436289l458985
16714A92695730m002024m980544n967402o790697p425201p476934p296166p691201
16706A41065561p733557p248391p204746o884239o429173o391794n822243n794769
$$ plain form
16762 24680379 25880800 26731624 27713750 29087127 30346556 32022658 33211485 34349490
16754 34349490 36130235 37879580 39721397 41476511 43782948 45750196 47846011 51060837
16746 51060837 53377769 56162325 59050686 62347712 65825283 69744362 73961113 77972853
16738 77972853 82637900 87354712 93000732 98707884 104502758 110629962 117247244 124271618
16730 124271618 131749950 139108103 146577750 153980179 161945851 169071502 175894562 182261123
16722 182261123 187640077 192123305 195234473 197634634 198157424 197591004 196154715 192695730
16714 192695730 188693706 183713162 177745760 170955063 163529862 156052928 148756762 141065561
16706 141065561 133332004 126083613 118878867 111994628 105565455 99173661 93351418 87556649
16698H7556649n012698n022858l992770m687945l810915l506836l423293l070669
16690E5028665l189592k823318k437349k360444k049702k200000j484418k238035
16682C6245807j603203j370013k052432j144545j136471j377835r61315j306862
16674B5293131p29030r00056j201998j040792n62274p86483j011897m59511q22270
16665A7778820k86508q32689o07356j25353j151376j94957n65586o39544l37245
16656A3038206k93113m58979j85658o73837p1234k13670m12810n36677j67298
16647A0024930P9574q07094j87290j02621m40095L3176k89796k10363J19735n14287
16637G705869k2384m68197k2365J83050m59534K02329k53231n96932j89923n24118
$$ plain form
16698 87556649 82543951 77521093 73528323 68840378 65029463 61522627 58099334 55028665
16690 55028665 51839073 49015755 46578406 44217962 42168260 39968260 38483842 36245807
16682 36245807 34642604 33272591 31220159 30075614 28939143 27561308 26599993 25293131
16674 25293131 24564101 23664045 22462047 21421255 20858981 20072498 19060601 18601090 17778820
16665 17778820 17492312 16659623 16052267 15926914 14775538 14580581 14014995 13375451 13038206
16656 13038206 12745093 12286114 12100456 11426619 11355385 11141715 10728905 10192228 10024930
16647 10024930 10104504 9297410 9110120 9007499 8567404 8600580 8310784 8100421 8220156 7705869
16637 7705869 7683485 7215288 7192923 7375973 6916439 7118768 6865537 6268605 6078682 5554564
16627E554564N66540m41002Q6263p6041k34723l02299K3028l15482M28830l87648
16617D902030q1355j11830j13748K84627k48067k76756j43782R5387m0413j51217
16607D114876j45037n9959p2836K25879m23810k83909K3096M24531m45344J28599
16597C486086j02743n16404M61630J30845k12866N2988m61J42248l43638M3053
16587C140738J8465l18541L9l94850J99615J29225m93215J36797n3905j41619
16577B222749M49356k32209K1521k40394j348r8389L3633O6907J38630k85345
16567B075111J85645k18124L69546k04249k45605j96866L71676R1975j93918q7606
16557A947585j20765J71924n20805K51776j27868N4685J48401M641l29346Q1783
$$ plain form
16627 5554564 6121104 5680102 5766365 5690324 5455601 5153302 5176330 4860848 5289678 4902030
16617 4902030 4820675 4708845 4595097 4879724 4631657 4354901 4211119 4306506 4266093 4114876
16607 4114876 3969839 3909880 3837044 4062923 3639113 3355204 3378300 3802831 3357487 3486086
16597 3486086 3383343 2866939 3328569 3459414 3246548 3299536 3299075 3441323 3097685 3140738
16587 3140738 3159203 2840662 2840701 2445851 2645466 2774691 2281476 2418273 2364368 2222749
16577 2222749 2672105 2439896 2461417 2221023 2219675 2121286 2154919 2221826 2360456 2075111
16567 2075111 2260756 2042632 2412178 2207929 1962324 1765458 2137134 2229109 2035191 1947585
16557 1947585 1826820 1998744 1477939 1729715 1601847 1656532 1804933 1809574 1480228 1562011
16547A562011p4085L54523m73674M50650m01191K32599k07751O5855J8010k5162
16537A501785j81458J16060j31790p3745K87633k27042J92777n23282O19811k88541
16527A292208l01165L35869k55505M12339J45986k41667p2953j94278q4548K43652
16517A279938r0973j62705o590j95103L56377k98024L3360K09500R6140m32577
16507G89343K83326o1296J39428M8643K06240m35963J30066k9923j70508k09942
16497F89414K24532N5520n8138j30299K66136k5170M1513r9052j11084l39716
16487E13656K73762l08373K25912J96190j15633j26501J62584j16368R6784J77725
16477I79738k27350o0696J93813L5774r1978j8023r2851l3228j1897j52938k2124
$$ plain form
16547 1562011 1487926 1842449 1368775 1819425 1418234 1650833 1443082 1508937 1526947 1501785
16537 1501785 1320327 1436387 1304597 1230852 1518485 1291443 1484220 960938 1580749 1292208
16527 1292208 991043 1326912 1071407 1483746 1629732 1388065 1315112 1120834 1036286 1279938
16517 1279938 1188965 1026260 1019670 824567 1180944 882920 916280 1125780 1221920 789343
16507 789343 1072669 1011373 1150801 1199444 1405684 969721 1099787 1069864 899356 689414
16497 689414 913946 969466 911328 781029 1047165 1021995 1063508 964456 853372 513656
16487 513656 787418 479045 704957 901147 785514 659013 821597 705229 802013 979738
16477 979738 752388 691692 885505 921279 829301 811278 718427 685199 673302 520364 498240
16466D98240R3795K39455l51640K16585J35223k04407n6760N57769m25982j3088
16456F89190p9727J48892M9540o5431j16330K1997J77534j27592B14084M14114
16446F28198l6215j09378J37776k5142q3298K06630J47780B21318K24240O0994
16436E06552J30287J34346C84679J18594j77877M02393n9473J63451j31757J80062
16426H80072l92332m0617J6224K31937l26063M3305L20398C63616M4413J52972
16416E61001k63239R6468J09057k16109L49729j04110j89220K54112j32631Q2082
16406E47140j9051p3870k20420M51083A84599J57339o6223L1707Q0605j87085
16396B00942L15232A93894R2769J95771j48012R8368j40396L03688k47975J91713
$$ plain form
16466 498240 592035 831490 479850 696435 831658 627251 570491 1128260 702278 689190
16456 689190 609463 758355 807895 742464 626134 648131 825665 698073 214084 628198
16446 628198 591983 482605 620381 595239 511941 718571 866351 221318 445558 506552
16436 506552 636839 771185 384679 503273 325396 727789 668316 831767 700010 880072
16426 880072 487740 447123 463347 695284 369221 412526 732924 363616 408029 561001
16416 561001 297762 394230 503287 287178 636907 532797 343577 597689 465058 547140
16406 547140 528089 454219 233799 684882 184599 341938 275715 307422 388027 200942
16396 200942 516174 193894 286663 482434 334422 432790 292394 596082 348107 539820
16386E39820A12592J53506j9137J65424k05929J40851J3967r125K8158H8633L23224
16375D11857l7104L30618B78172N2502K59434j54892J19627k67065N0540L3573
16365C71891A63406N8114J52422e9315E03942j01787m4023J9818j22404R9846
16355C55392R5166A93457L319K65973j17246k2743a23870A13860L70641l9320
16345D45181A48235K91331k1891N2850c1972B15309J47702j56928r9861K19327
16335C25549f5870B25033M844L64673a91314C15978j55780B530J92391j5254K74965
16324D54632F9299c3712D51829A05688a42767B83816P5387J94118B55633j24393
16314A31240l45J21180C1859J62013a07803D28371f7083A14934P7755p0675J31865
$$ plain form
16386 539820 112592 266098 246961 412385 206456 347307 361274 352149 380307 88633 411857
16375 411857 374753 705371 278172 330674 590108 435216 554843 287778 338318 371891
16365 371891 163406 221520 373942 -59315 503942 402155 358132 377950 255546 355392
16355 355392 450558 193457 196776 462749 345503 322760 -123870 113860 484501 445181
16345 445181 148235 439566 417675 470525 -31972 215309 363011 206083 106222 325549
16335 325549 -65870 225033 229877 594550 -191314 315978 160198 2530 194921 179667 454632
16324 454632 69299 -33712 451829 105688 -142767 283816 359203 553321 255633 131240
16314 131240 130895 252075 31859 193872 -107803 428371 -67083 114934 192689 122014 253879
16303B53879j08343J36582J59181A08493O8596f8923j61214B58202J3167a3407
16292A76249k2463E7113f9120b120A86145O7975b40678g7981I5527J39923b27868
16280D17215a47314B49535K8546K1906A27915n2463L94733C627L98793K8810k01148
16269B30082I3351J18184J10626j18905J82759e7010k9018B03085l7455o7664
16259I7966J31685e8018A35895l6632k6037R4712k5705K0435o9701M24603D7654
16247B24896a08221A55944f967c22j26915C45773A01570J82382j30330B544J42869
16236A45413L0794K7072m9327b73815A42626k9715C5731H078K17172a46946K4244
16225a22702B06073H6725e3442C64806b31116B1238c8132q0035N0495b6614E9914
$$ plain form
16303 253879 145536 282118 441299 108493 177089 -68923 -230137 258202 271369 -13407
16292 176249 153786 57113 -69120 -2120 186145 254120 -240678 -77981 95527 235450 -227868
16280 417215 -147314 249535 278081 299987 127915 75452 470185 3627 402420 431230 230082
16269 230082 93351 211535 322161 203256 386015 -57010 -86028 203085 165630 97966
16259 97966 229651 -58018 135895 99263 73226 167938 142233 162668 92967 517570 47654
16247 224896 -108221 155944 -6967 -322 -127237 345773 101570 283952 153622 2544 145413
16236 145413 176207 203279 153952 -273815 142626 112911 35731 8078 225250 -146946 -122702
16225 -122702 206073 86725 -53442 364806 -231116 21238 -38132 -118167 -67672 -26614 59914
16213A85018q0280f1249H5050M31186h0370A88109M2126g3254K3806F4048J41260
16202B05308h3317C24862h8168C5055a8712B4850M36579a1373A58701G5363J36294
16191B11657r9011l6099e6454B26295a19582M6217C7272J00364R0089b21727F7796
16179A49309D0644L66985E4418L9846O5434a11791b6164A10347L5143E7101d0408
16167A62633P3030a95695A69919b38976B79243A7620e4300B88664a67885C76491
16156B40170e9583A19049K4592d6520k6277b1066A83081n2262g755A50633i0317
16144A40282a95787O8430B00234A1477J86064c55851B58875a81493A7973L5189
16134E3162N6809J58327F4618J06250a66080A20957a18093A49086a52175A5212
$$ plain form
16213 185018 104738 -61249 85050 516236 -80370 188109 230235 -73254 -49448 64048 205308
16202 205308 -83317 324862 -88168 35055 -18712 24850 461429 -11373 158701 75363 211657
16191 211657 112646 76547 -56454 226295 -119582 -73365 37272 137636 227725 -221727 67796
16179 149309 40644 407629 54418 94264 159698 -111791 -26164 110347 145490 57101 -40408
16167 162633 235663 -195695 169919 -238976 279243 17620 -54300 288664 -167885 376491
16156 240170 -59583 119049 143641 -46520 -72797 -21066 183081 130819 -7755 150633 -90317
16144 140282 -195787 -127357 200234 11477 197541 -355851 258875 -181493 17973 53162
16134 53162 109971 268298 64618 170868 -166080 120957 -118093 149086 -152175 15212
16123d81925a60925H0148J9884b74459A94233J7065b21124B6333c16170I5059
16112B63703p9486a2545J134E1912a15984b9548m7657A44562a88002B13046e3397
16100C28445E1394L12952A13809k7193O3504j8727F1063j9573Q3654K09539e741
16088F2368a38660B22015m2976K0375N7368C7738a09158L1603B87249A9610J31226
16077A50836O7462a19804B1031b06597C28777A8680b93610d2984J4900C14328
16066e0025C9301a94171P2107a4747j23902A04677a5629C0308i7352j79466C9218
16054a44875n4292j0609j4208C9776a1740k06768A26289f363o7008E5699J6370
16043G2069a90890A37501B0516L47842B6498c01923g6587b7071C03818j02455
$$ plain form
16123 -481925 -160925 80148 100032 -274459 194233 211298 -221124 26333 -316170 95059
16112 263703 184217 -12545 -11411 51912 -115984 -29548 -77205 144562 -188002 213046 -53397
16100 328445 51394 364346 113809 86616 150120 131393 61063 41490 125144 334683 -5741
16088 62368 -138660 222015 179039 199414 256782 37738 -109158 -77555 287249 19610 150836
16077 150836 218298 -119804 21031 -206597 328777 18680 -293610 -42984 -28084 314328
16066 -50025 39301 -194171 -122064 -14747 -138649 104677 -15629 30308 -97352 -276818 39218
16054 -144875 -199167 -209776 -223984 39776 -11740 -218508 126289 -6363 -73371 55699 72069
16043 72069 -190890 137501 20516 368358 26498 -301923 -76587 -27071 303818 201363
16033B01363b42538m5867e5906B63835b55788a3509j6530n7306E6709K4692J95416
16022B76817G8681A2209h6080g698j34678C10658b8237j09836A27191c4829B13460
16010a13328M9039A85987h9312j63587d3465a7791j36044e1096m92769d2197A18534
15998c77337b1444A02622a1614j31939p4248f2679j25219c311k80480B2189J4374
15987C6563J45178P5595a41580I6977f102I3400a21644A56346N350b3980C21426
15975A55398a25185n6469K2714e8115B64629g9137A2294J14665b96596C9615m527
15964C5088a22476C6423c9449A46851K6064J4005a82195G4447K537d8110c580
15952A30272A9607K12413A4712K0009a41977L1338B13800g5671a3686A66268b94143
$$ plain form
16033 201363 -242538 -288405 -55906 263835 -255788 -13509 -30039 -87345 56709 81401 276817
16022 276817 78681 12209 -86080 -7698 -142376 310658 -28237 -138073 127191 -34829 213460
16010 -113328 -64289 185987 -89312 -252899 -43465 -17791 -153835 -51096 -543865 -42197 118534
15998 -377337 -21444 102622 -11614 -143553 -217801 -62679 -187898 -3311 -283791 22189 36563
15987 36563 181741 257336 -141580 96977 -6102 93400 -121644 156346 161696 -23980 321426
15975 155398 -125185 -181654 -158940 -58115 264629 -79137 12294 126959 -296596 39615 35088
15964 35088 -122476 36423 -39449 146851 172915 186920 -182195 74447 76984 -48110 -3580
15952 130272 19607 232020 14712 34721 -141977 -110639 213800 -75671 -13686 166268 -294143
15940D745b49225B04254a36529O2786L0712j41l9473k25930f7449j06131b1602
15928a63775C22046E388a13278A2479b32935J01294r6315P8702g1723H7599G515
15916E8228c09248a24081F4949M318J80565B0325b59315B54614K8686a401A1983
15904F3488a63416g7389D0342b68120B5816J42489d8173q7415A36430m8096Q8474
15893A76808D7089J88922c04114d0155B2604J83987q67a33714a1930j54815N3495
15882a13250d0960m7427j35921a08482m8069B43684G9066h2189l3210o4125K2928
15871a56596j92069p9840J51177E5863K9156b6192A62527D5292L14312a59228
15860A338c5864E3674h3158A4571N15946b31394A95457g8084o929L2724k62158
$$ plain form
15940 4745 -249225 204254 -136529 -73743 -43031 -43172 -82645 -308575 -67449 -173580 -21602
15928 -163775 322046 5388 -113278 12479 -232935 -131641 -227956 -149254 -71723 87599 7515
15916 58228 -309248 -124081 64949 69267 249832 20325 -259315 254614 283300 -1401 11983
15904 63488 -163416 -77389 40342 -268120 25816 168305 -48173 -135588 136430 88334 176808
15893 176808 47089 236011 -304114 -40155 22604 206591 205724 -133714 -11930 -166745 -113250
15882 -113250 -40960 -88387 -224308 -108482 -156551 243684 79066 -82189 -115399 -179524 -156596
15871 -156596 -348665 -428505 -277328 55863 85019 -26192 162527 45292 359604 -159228
15860 1338 -35864 53674 -83158 14571 530517 -231394 195457 -78084 -85013 -52289 -314447
15849c14447a8004A49062e931l18882R1265D037a62924A79424E8913d31160a11770
15837c2195a0117l8741j8238A56642a43816B38493A19021c7464B36270a8010k89850
15826c07860J29897K2112B21745r6067P0908a2194p0507a652j17526d3319o2578
15815a05897A04162c90714A45004c23542a53737A30389H817K6353l822a97190
15804H7321m0295b18071b2279j0224B52615b3963H2730i8673h649k3729l80725
15793d13103G9016R1248a40376O120k79415O0133B39075F079e4947q7555o1869
15782b04371F0412d4160k26244E2738k0801a49854b4889j964j82032A76735d62289
15770b18845Q509R4157b810o8509A747b9932j5777A17213d7882C82260c15441
$$ plain form
15849 -314447 -18004 149062 -5931 -324813 -233548 4037 -162924 179424 58913 -431160 -111770
15837 -32195 -10117 -48858 -67096 156642 -143816 238493 119021 -37464 236270 -18010 -307860
15826 -307860 -177963 -155851 221745 125678 196586 -12194 -82701 -1652 -119178 -43319 -105897
15815 -105897 104162 -390714 145004 -323542 -153737 130389 8817 35170 31348 -197190
15804 87321 47026 -218071 -22279 -32503 252615 -23963 82730 -98673 -8649 -32378 -413103
15793 -413103 79016 170264 -140376 -134256 -413671 -353538 239075 6079 -54947 -142502 -204371
15782 -204371 60412 -44160 -270404 52738 31937 -149854 -24889 -26853 -208885 176735 -462289
15770 -218845 -210336 -116179 -2810 -71319 1747 -29932 -45709 117213 -47882 382260 -315441
15758a27527e7160k46148A89426O6532D8019K41497h4209k43960i0145A91057
15747B35346n2198k8297C0001L0236L34O6720B515J79002d10796E2780E876a55942
15734a1336j12438l0959b4598A71887D4878Q9554a98318O4247B28299b40156g0046
15722E4522b94097i149D8564a66025B62163H2254a82296E916M2613M7659a35419
15710c0916q1722j11769n5661P6949A42770Q560I477c33023J40133C5951B431
15698d4203A2087a36857D5238a55007j16374A70521b35662a6791J665D0669a95174
15686A40164d2101D6298J8896b21094L1734E496b79868E229Q2735a76224m7969
15675b24193b41j92870j21912A40782B2055K67575B7162a36183e3540a5394D0173
$$ plain form
15758 -127527 -57160 -303308 189426 255958 48019 289516 -84209 -328169 -90145 191057
15747 235346 183148 154851 30001 60237 60571 127291 2515 181517 -410796 52780 5876 -155942
15734 -11336 -123774 -154733 -24598 171887 44878 134432 -198318 -134071 228299 -240156 -70046
15722 54522 -294097 -9149 48564 -166025 262163 82254 -182296 5916 48529 96188 -135419
15710 -30916 -112638 -224407 -280068 -203119 142770 151330 9477 -333023 -192890 35951 2431
15698 -44203 12087 -136857 45238 -155007 -271381 170521 -235662 -16791 -15126 40669 -195174
15686 140164 -42101 46298 65194 -221094 -189360 5496 -279868 5229 87964 -176224 -224193
15675 -224193 -241 -193111 -315023 140782 22055 289630 27162 -136183 -53540 -15394 40173
15663b36262A3180J08048n1497i4561A08653c75673a17722A87810F5533N9445
15653A24978i4924m0029j8679q7699M6085a1115F7090b68901M9957f6902A92727
15641C7141L4666a53722f5688k53464A6186K31312F8386h4822B38299b87662a42808
15629b66575J28101j18028B66179b94777A55750b14137A9765c5808r4857Q679
15619a21986j3315A52910f5810o9065j31839B61940r7630a98036A7534c7277l7041
15608g4318j1295A36761a93306B39763a04955k01992b0062j58631C82863b23417
15597G2418e8771j35217B10762g0963k52688B88757A8692a6487b793k31984r024
15586b43801e9735E7608i6116A08504b48527B13703i0587J8111B67191E8094J42722
$$ plain form
15663 -236262 13180 121228 69731 -94561 108653 -375673 -117722 187810 65533 124978
15653 124978 -94924 -134953 -153632 -241331 -195246 -11115 67090 -268901 -218944 -66902 192727
15641 37141 71807 -153722 -65688 -319152 16186 247498 68386 -84822 238299 -287662 -142808
15629 -266575 -138474 -256502 266179 -294777 155750 -214137 19765 -35808 -130665 -121986
15619 -121986 -135301 152910 -65810 -134875 -266714 261940 164310 -198036 17534 -37277 -74318
15608 -74318 -85613 136761 -193306 239763 -104955 -306947 -20062 -178693 382863 -223417
15597 72418 -58771 -193988 210762 -70963 -323651 288757 18692 -16487 -2793 -234777 -243801
15586 -243801 -59735 57608 -96116 108504 -248527 213703 -90587 -72476 267191 58094 200816
15575B00816J36936g9908c8426B16513j3711a08709l951C1773K80705a42957c5531
15563h987n3310j12037A52939m2690J09500b24137A37691m5763K7305a18274A2830
15551B03170a27640A39409b68024A9593J26171a25471j31106h5387J0054C4171
15540b98643A92054A868a12089A04733A1752E8L01089B2651a08326o8112g9993
15528I759J5170J4403O4742a96659B0749J01864c21220g7224k6134e792C23655
15516a32196e9549j86506i9241c2751A81842D9454c3841D26987b43792l32640
15506e76432a61990E551c09838e590C8609a75901p3634J12733N8681c0540k64611
15495b95151I3490c4549D2445c28093a43998K1403j12151C06021F1577O7961a22489
$$ plain form
15575 200816 337752 -79908 -38426 216513 202802 -108709 -112660 31773 312478 -142957 -35531
15563 -8987 -62297 -174334 152939 110249 219749 -224137 137691 91928 119233 -118274 12830
15551 203170 -127640 139409 -268024 19593 145764 -125471 -256577 -85387 -75333 34171
15540 -298643 192054 1868 -112089 104733 11752 58 301147 22651 -108326 -176438 -79993
15528 9759 24929 39332 104074 -196659 20749 122613 -321220 -77224 -103358 -5792 323655
15516 -132196 -59549 -246055 -99241 -32751 181842 49454 -33841 426987 -243792 -576432
15506 -576432 -161990 5551 -309838 -5590 38609 -175901 -249535 -136802 -78121 -30540 -295151
15495 -295151 93490 -34549 42445 -328093 -143998 -122595 -234746 306021 61577 129538 -122489
15483B29650a86752E0642e8483A24045d901O60j49712A363b13871A64258a34488
15471B10059k3934D2962K7159b8890p6704A32726J02733C6667a71276C7130b9801
15459h8653L8464o754I695A355J51852K787k9549c25010E71437A36128f5286A8869
15446E1325a41518H859J05614c60707A09225J62178c41156A88050P135H6874c0600
15434F17P9067b26729d0931A97804n3543A7349O6034L17R773E365a49518G5056
15421f1688B0354c3790D56932A90251a89123I1442a8799A50811f9927C4834N6607
15410I1441i8224k20803J39559j46670A68457b89817h3661k97304h4982c3250
15399b48605j37256a54213I8207e72213G895N5837C1145J98739a45047A88387
$$ plain form
15483 229650 -186752 50642 -58483 124045 -4901 -4241 -153953 1363 -213871 164258 -134488
15471 210059 186125 42962 70121 -28890 -105594 132726 235459 36667 -171276 37130 -29801
15459 -88653 -50189 -56943 9695 1355 153207 155994 126445 -325010 571437 136128 -65286 18869
15446 51325 -141518 8859 114473 -360707 109225 271403 -341156 188050 195185 86874 -30600
15434 617 79684 -226729 -40931 197804 144261 17349 83383 83700 93473 5365 -149518 75056
15421 -61688 20354 -33790 456932 190251 -189123 91442 -18799 150811 -69927 34834 91441
15410 91441 -98224 -319027 -179468 -326138 168457 -289817 -83661 -380965 -84982 -33250
15399 -248605 -385861 -154213 98207 -572213 7895 63732 31145 229884 -145047 188387
15388f7292b2143C46052a12478A04085a96901j02733D1150J67416c72403e9289
15377A24481R7731c9105C6168J02503G930J32753a09692r931P253e0917A28227
15365d18073E8776K5902c3381B7050P4308P2199e6308j2052k70874c8144A16745
15353A5417K33022m0509a77668B41115e9303F8786c3898A79565a79213B7523c54111
15341a38549E1505c559C59819g1805B77808I7205i2885k9255j170H9399O5306
15330A54705b95436a19087M1949A12660N0518b03184A20058Q9978e2588C2121
15319A1955K09748c6841A68281K45231A29833c45156i2128B96888k4641f4969
15308a27954D0638M8373b05348B61344b87484H0797h0330k5808k13021g2121B14381
$$ plain form
15388 -67292 -22143 346052 -112478 104085 -196901 -299634 41150 208566 -372403 -59289
15377 124481 222212 -39105 36168 138671 7930 140683 -109692 -119623 -112370 -50917 128227
15365 -418073 58776 84678 -33381 27050 101358 173557 -56308 -68360 -339234 -38144 116745
15353 15417 248439 207930 -177668 241115 -59303 68786 -33898 179565 -179213 27523 -354111
15341 -138549 51505 -3559 359819 -71805 277808 97205 -92885 -122140 -123310 89399 154705
15330 154705 -295436 -119087 -77138 112660 163178 -203184 120058 210036 -52588 32121
15319 11955 221703 -36841 168281 413512 129833 -345156 -92128 296888 272247 -64969
15308 -127954 40638 89011 -205348 261344 -287484 80797 -80330 -106138 -319159 -72121 214381
15296b11372f5407o5246A26194d1350B00566n5197b32390h3692o9552b1241r9370
15285a20611C21916A03711J02309G9784a94335I6099a95470A11775a25069d69
15274A93187a34385B07750f7158A68339a11966R188A17491d1133l0061j29354
15264b00548D59865e2272A05656L36500E5623a76970C54554b1809E6987J75921
15254B32908J39108N4687a54109c2239B10245K45936O42766p4421k04908M98749
15244A318367J1845o49202A76510B5126J22680b51047g386I7335R0560o8813a56522
15232B3930P178J16441p0457c68G5605j0776c42430a48385A48820p3907P5121
15221A50034a2486A42856B6570a3850A53401k9401a63911c0252l8941A66641p0920
$$ plain form
15296 -211372 -65407 -130653 126194 -41350 200566 145369 -232390 -83692 -153244 -21241 -120611
15285 -120611 321916 103711 206020 79784 -194335 96099 -195470 111775 -125069 -469
15274 193187 -134385 207750 -67158 168339 -111966 -102778 117491 -41133 -71194 -200548
15264 -200548 459865 -52272 105656 442156 55623 -176970 354554 -21809 56987 232908
15254 232908 372016 426703 -154109 -32239 210245 456181 1098947 1024526 819618 1318367
15244 1318367 1330212 681010 176510 25126 147806 -251047 -7386 97335 187895 119082 -156522
15232 23930 31108 147549 77092 -368 75605 64829 -342430 -148385 148820 74913 150034
15221 150034 -12486 142856 26570 -13850 153401 124000 -163911 -30252 -69193 166641 95721
15210I5721b34909C1805c13796A30026c15701J54609P4689d2555b366j87413B28566
15198e189B38763F1073g7998G0107j4306A3836J12741d1843A67151F9728L17621
15187C87349E7322a47612E8972J57775I8677J6395a27610m7368D16707F5276K20633
15176B85909J6183I7701o03K42936A23279Q3465N8758H7620C5526J55223o2214
15165A28535Q3422a14763c6471I9804J5471J1547J57953H3486c5998C61114g5236
15153A47055K23446j68818o1076J64969j06900a99757C11298A8592J76751K41809
15143D37152n8876A75368p4291h6173C13331b61393C85012C8843d6422a4188j42652
15132a56840A40915J00926F3893J51566g5143A84599K14176j67956m4157L8531
$$ plain form
15210 95721 -234909 31805 -313796 130026 -315701 -161092 -86403 -42555 -2366 -189779 228566
15198 -5189 238763 61073 -77998 70107 55801 13836 126577 -41843 167151 69728 387349
15187 387349 57322 -147612 58972 216747 98677 115072 -127610 -174978 416707 65276 285909
15176 285909 302092 97701 97098 340034 123279 206744 265502 87620 35526 190749 128535
15165 128535 211957 -114763 -36471 99804 115275 126822 284775 83486 -35998 361114 -75236
15153 147055 370501 201683 140607 305576 198676 -199757 311298 18592 195343 437152
15143 437152 378276 175368 101077 -86173 313331 -261393 385012 38843 -46422 -14188 -156840
15132 -156840 140915 241841 63893 215459 -75143 184599 398775 230819 186662 225193
15122B25193L199G8962c8616B38104i7757B8020L87791A3093d328B32825d1633
15110a28316A43055O0163p9892B036R1330J45973N1135n9367J5324j07936m0669
15099I7826J8462c45137A3670J55231a05601A4732e5295E4993J31391a05490A82220
15087a40083d7740K544H0528O212i311I1511g3105B89512F5233K66780a95333
15075b12986A78568J0267H9364l2897j6034O9405A249J08658i1822A52725n0803
15064A01922K4613h075n110C74681j0625p3927a38579C42016r071L8389k5122
15053C46212p2507h5624C64252j82103J05178b4280B55376I8914J45728K09640
15043D54282G1942K78115C7754k119K15454c5841B22626a04805C05081p9095r8025
$$ plain form
15122 225193 228392 78962 -38616 238104 -97757 28020 415811 13093 -4328 232825 -41633
15110 -128316 143055 203218 123326 2036 93366 239339 290474 231107 246431 138495 97826
15099 97826 116288 -345137 13670 168901 -105601 14732 -55295 54993 186384 -105490 182220
15087 -140083 -47740 -45196 80528 86740 -9311 91511 -73105 289512 65233 332013 -195333
15075 -212986 178568 188835 89364 56467 40433 109838 1249 109907 -91822 152725 101922
15064 101922 126535 -8075 -13185 374681 364056 290129 -138579 342016 332945 371334 346212
15053 346212 273705 -85624 364252 182149 287327 -24280 255376 98914 244642 454282
15043 454282 71942 350057 37754 35635 251089 -35841 222626 -104805 305081 225986 127961
15032A27961K35852j23563b26131A07588a48003A49485J32841K92661H6440K40747
15022C27187A44771o6716a98063B20920J91604j79811N7402j03004a1534A11251
15011A04149a37936A20680J94193A03254O3761E6267Q219L48011m541K96273I7653
14999F9669J43139J8661H9885n980R781K94284A58492k4140e3048D65603A75750
14987D06287G9982K93924q8452R2021j30297R6734A02434l2958a8810B09526o1784
14976A47742o7067J67577A19134J98693A17933D9986J51460J70546A18281J91058
14966C09339l1722j02107k9786M2738C4171K22966K12607E7440L28456A79312
14955d1467D71222P4516q7114h798A76872M2112D3291L03799A15852j9974J38509
$$ plain form
15032 127961 363813 240250 -226131 107588 -148003 149485 282326 574987 86440 327187
15022 327187 144771 78055 -198063 220920 412524 232713 290115 187111 -11534 111251
15011 104149 -137936 120680 314873 103254 167015 56267 64486 412497 407956 704229 97653
14999 69669 212808 231469 89885 83905 93686 387970 158492 134352 -53048 465603 175750
14987 406287 79982 373906 285454 377475 247178 343912 102434 69476 -18810 209526 147742
14976 147742 80675 248252 119134 317827 117933 49986 201446 371992 118281 309339
14966 309339 277617 175510 145724 188462 34171 257137 469744 57440 385896 179312
14955 -41467 471222 545738 458624 -8798 176872 218984 43291 347090 115852 95878 234387
14944B34387n8886N4505r5540K34309a63569j8873B65569J05503j11394p5525
14934A84153J10923C1887L21029J35399A5387K83374L062j05531Q094K14530m161
14923D14755j86911P2429b57928A76232H1707K36945H9223K11917l6550e0924
14912B74204K45757B23994J75174A51965R4713A3616L59624j9990R2715N8505
14902E04470I7512K11382G6936K04894R5217M6069k07695J85479j60163J2363
14892B53100E8654K42673L9406A65559D591J51449K96061j38464O6458j12953
14882B67142F142L05541J2100r1394J75755R8561j9241A42809J97129C8103K25292
14871B63395J18620A58928b8519B09040K18532K40511j46494j5528A65972J14025
$$ plain form
14944 234387 175501 230006 134466 368775 -163569 -182442 265569 371072 259678 184153
14934 184153 295076 31887 352916 488315 15387 298761 301823 196292 204386 418916 414755
14923 414755 227844 300273 -257928 176232 81707 318652 89223 301140 264590 -50924
14912 274204 519961 223994 399168 151965 246678 13616 373240 353250 445965 504470
14902 504470 97512 308894 76936 281830 377047 423116 215421 400900 240737 253100
14892 253100 58654 301327 340733 165559 4591 156040 452101 313637 380095 267142
14882 267142 6142 311683 323783 232389 408144 506705 487464 142809 339938 38103 263395
14871 263395 382015 158928 -28519 209040 427572 668083 521589 506061 165972 279997
14861B79997R203K64165M1340A32531N48713k34021b911j85369E29523K1586j28895
14850D22214J8284p6371o6712J14793r4706k7368K42136B63699J35050j10420
14840B88329R986K46743A50831M60711j0027q8542R238B59301C6581M30738E3248
14828B85517L79627B89054M44034B58818J40218J4329L2195J82331B11641N8I8877
14816E40125K45461j86481k9609K1338k05781K57007p0513k62001L66516q2046
14806E94016k07591J85414Q4973B64360J37379M6014J66272k9008j48420A81199
14795C73886l9054K10600j20006L68873k27220M3234r0063q1041M54579j24160
14785G69628r5316r2600j85733L71858l60985P6464M9182k739J46448j2112j05944
$$ plain form
14861 279997 289200 553365 594705 132531 681244 447223 -2911 -188280 529523 551109 422214
14850 422214 440498 364127 297415 412208 317502 290134 532270 263699 398749 288329
14840 288329 298315 545058 150831 611542 601515 512973 522211 259301 36581 467319 53248
14828 285517 665144 289054 733088 258818 399036 413365 445560 627891 211641 211699 98877
14816 540125 785586 599105 569496 590834 385053 642060 571547 309546 676062 594016
14806 594016 386425 571839 656812 264360 401739 447753 614025 585017 436597 181199
14795 373886 334832 545432 425426 794299 567079 610313 520250 439209 893788 769628
14785 769628 674312 581712 395979 767837 406852 483316 532498 529759 676207 664095 558151
14774E58151j13950J69094J51646j30183J17980j97710k65694L14022o5768j48843
14764C88745L29425n6542k24941R3836P9405K09999j79665n9463K81963k15620
14754F47142j02368J65964j12254J29855l9504k06805L83156j69032j02799L06397
14744H99752m98l59810N701j7363m7476A95323P35521k55559k0032M62812l11766
14733H06299n862J83232D67941K69750K71742l65064J29016N1105k258J59942
14723I82174k83187K94473r4481M13823F32653j07888M19816j82027J28647J22090
14713A013291j6867l08339M87958m45153R8272K86897m68295L85907l95940L00684
14703I38415N4447j6402j56227J18673M3424m936K43735m99703K64198J63222
$$ plain form
14774 558151 444201 613295 764941 634758 752738 555028 289334 603356 537588 388745
14764 388745 718170 661628 436687 530523 609928 819927 640262 580799 862762 647142
14754 647142 544774 710738 598484 728339 688835 482030 865186 696154 593355 899752
14744 899752 899254 539444 545145 527782 480306 195323 930844 675285 655253 1118065 806299
14733 806299 800437 983669 467941 737691 1009433 644369 773385 824490 822232 982174
14723 982174 698987 993460 898979 1312802 632653 524765 944581 762554 891201 1013291
14713 1013291 996424 688085 1176043 730890 829162 1116059 647764 1033671 637731 938415
14703 938415 992862 976460 820233 938906 982330 977394 1221129 721426 985624 1148846
14693A148846n18947O35480m40026L24639m56745J21N58065n70965K09509J17265
14683A007242p8759J85488k17137L74976q7251L5223l39047j51693J02126K84747
14673A115915k92611j46600L51868p3957J24778N4865K9226j45536L3682j85627
14663H66003L02647p8783j11440J77578p2576J99349Q475J6841q1236J3551j16702
14652A123707R9767j98832M7430p5231J081M82248l46611K04067r5634R5379l99497
14641I37874M43010k72649J91617r9773k58040L01452L17338n82340M89277l51736
14631A116030K17410J60821j70142K88776m90278J79027M1522M8985k5561L8533
14621A405123p1387K92127j38353J77381j48889N8792l02701L06484Q4028k08193
$$ plain form
14693 1148846 629899 1265379 825353 1149992 693247 693368 1251433 680468 889977 1007242
14683 1007242 928483 1113971 896834 1271810 1184559 1219782 880735 729042 831168 1115915
14673 1115915 823304 676704 1028572 954615 1079393 1134258 1163484 1017948 1051630 866003
14663 866003 1168650 1089867 978427 1156005 1083429 1282778 1291253 1308094 1226858 1240409 1123707
14652 1123707 1223474 1024642 1072072 996841 997922 1480170 1133559 1337626 1241992 1337371 937874
14641 937874 1380884 1108235 1299852 1200079 942039 1243491 1560829 978489 1467766 1116030
14631 1116030 1333440 1494261 1324119 1612895 1122617 1301644 1343166 1392151 1366590 1405123
14621 1405123 1333736 1625863 1487510 1664891 1516002 1574794 1272093 1578577 1662605 1454412
14611A454412K43437j76553k11J38914n3074j98805K31358r2386K74841j29372
14601A692561P8841n29749O34611j55002j81312J57174J00964N3996j00958L48961
14591B100087k58803r5783P8834k67731N46905k99985j7796q6580L38718j09885
14581A927981j02267M32572O0904l52604L64246m64359J35000L04382k7988k02178
14571B075689K11912k91153N43985k35481K25844P4668l0654o020m1785j2020
14561B514985K56711l9668K30141P7347j6099K35719K43772K71536J65446L83768
14551D323658L51582P66785K000137L878249R040329J7791768k80559j4501876
14543B3370073q960357n819656l214981j651237q52209o88584K78738k02510k48751
$$ plain form
14611 1454412 1697849 1521296 1521085 1659999 1606925 1408120 1639478 1547092 1821933 1692561
14601 1692561 1771402 1241653 1876264 1721262 1539950 1697124 1798088 1852084 1751126 2100087
14591 2100087 1841284 1745501 1824335 1556604 2103509 1803524 1785728 1699148 2037866 1927981
14581 1927981 1825714 2258286 2319190 1966586 2330832 1866473 2001473 2305855 2277867 2075689
14571 2075689 2287601 1996448 2540433 2304952 2530796 2605464 2574810 2568790 2527005 2514985
14561 2514985 2771696 2732028 2962169 3039516 3023417 3259136 3502908 3774444 3939890 4323658
14551 4323658 4675240 5442025 7442162 11320411 20360740 38152508 37871949 23370073
14543 23370073 14409716 8590060 5375079 3723842 2871633 2183049 2461787 2259277 2010526
14534B010526j48644L02220J08368j3579K47641k36370J28418q8983k71382K62948
14524B301163k8772M04234m51789m1862M89294r8148R4254k52204J46213J77318
14514B739701k43113M46882p5453o6919r4422M15054K5824N0439q6063L31862
14504C443792l23459j19436L72537j39693k04873K14158k7268J79796k47361N7686
14494C205879L05837k4276k54013K67359o2618J88309J08345j34214J46035L04626
14484D051269j98946J76337j00717J50772K36213L640n00409M83757n1167Q7880
14474D338629L1639k82023K05820L10476k655j74208k21473J99819Q2179J54151
14464D642354K12148L7282l7013l8579J54825J31539r3776M88122l77976J03496
$$ plain form
14534 2010526 1861882 2164102 2272470 2258891 2506532 2270162 2398580 2309597 2038215 2301163
14524 2301163 2272391 2676625 2224836 2182974 2672268 2574120 2668374 2416170 2562383 2739701
14514 2739701 2496588 2943470 2868017 2801098 2706676 3121730 3147554 3197993 3111930 3443792
14504 3443792 3120333 3000897 3373434 3233741 3028868 3243026 3215758 3395554 3148193 3205879
14494 3205879 3511716 3487440 3233427 3500786 3438168 3626477 3734822 3600608 3746643 4051269
14484 4051269 3852323 4028660 3927943 4078715 4314928 4318568 3818159 4301916 4250749 4338629
14474 4338629 4370268 4088245 4294065 4604541 4601886 4427678 4206205 4406024 4488203 4642354
14464 4642354 4854502 4891784 4854771 4816192 4971017 5102556 5008780 5496902 5118926 5222422
14454E222422J44191J22883l29708M47141k76690N36760j43003J88876K34561
14445F147433m0006R4175k29543j37615L22273J00575M4075j87814L22362K80445
14435F716360o7831K65775M6380M41854k55144J3081Q9323K08597M00888k37901
14425G621382n5177K85002K7353K94857l9134J03642J45847l24888M89897L53185
14415H901966j54193L58472K06568k18464M16453J13620O7581L0348L46554k03572
14405I865333K85202K71047J30085L47293K55217m09048P61229j26778L94339
14396A1773919N462J11363K02455m5278j14868Q27992L35434p9697R7535O56496
14386A3770813N2536K57546N15399j74047N07903j27945P02417L97224r398N07583
$$ plain form
14454 5222422 5366613 5489496 5159788 5606929 5330239 5866999 5723996 5912872 6147433
14445 6147433 6107427 6201602 5972059 5834444 6156717 6257292 6301367 6113553 6435915 6716360
14435 6716360 6648529 6914304 6960684 7402538 7147394 7160475 7249798 7458395 7859283 7621382
14425 7621382 7566205 7851207 7878560 8173417 8134283 8237925 8383772 8058884 8548781 8901966
14415 8901966 8747773 9106245 9312813 9094349 9510802 9624422 9692003 9722351 10068905 9865333
14405 9865333 10150535 10421582 10551667 10898960 11154177 10745129 11506358 11379580 11773919
14396 11773919 11779381 11890744 12093199 12047921 11933053 12761045 13096479 13016782 13114317 13770813
14386 13770813 13823349 14080895 14596294 14422247 14930150 14802205 15504622 15901846 15892448 16400031
14376A6400031J15360K34581N18548N02871J52842N46801j11729L96802Q32673
14367A9588780L14779K94065M90011L67237N97727M38910L41602P75378N79389
14358B3787878l528O36684O90129N39146R17142O04726N33361J46087R70363R63016
14348B9785004M31054R82056O31885J025439N12591R08358J103927P12504J325487
14339C7418305P35075R81737J362359Q53920J336634J200113J108649J298485
14331D6295277J518428J794509J315927J393603K004732J569665J732263J899224
14323E9523628J761957K254754K158442K421676K235510K678552K396552K857633
14315G8288704L040147L013503L574992L094233L632915L867734L992646M075166
$$ plain form
14376 16400031 16515391 16749972 17268520 17771391 17924233 18471034 18359305 18756107 19588780
14367 19588780 19903559 20197624 20687635 21054872 21652599 22091509 22433111 23208489 23787878
14358 23787878 23784350 24421034 25111163 25650309 26567451 27172177 27705538 27851625 28821988 29785004
14348 29785004 30216058 31198114 31829999 32855438 33368029 34276387 35380314 36092818 37418305
14339 37418305 38153380 39135117 40497476 41351396 42688030 43888143 44996792 46295277
14331 46295277 47813705 49608214 50924141 52317744 54322476 55892141 57624404 59523628
14323 59523628 61285585 63540339 65698781 68120457 70355967 73034519 75431071 78288704
14315 78288704 81328851 84342354 87917346 91011579 94644494 98512228 102504874 106580040
14307A06580040M554157M577832N262463N167029N342070N961902O294145O594754
14299A50334392O867597P125748Q082091Q213271Q308615R405341R691847J0003021
14291B18031923J0759225J1349521J1715794J2428675J2529804J3269782J3643282
14284C03728006J4005863J4535320J4850508J4212235J4706083J4313472J3882968
14277D04234455J3361711J2234944J1226152R151807N631076K503225r2080k741220
14269D55510070j889924o495899m565692n457568m310051n468469p948842r488750
14261D09884875j2396247j3581973j4671562j5365965j5272801j5127175j5174571
14254C08294581j4205308j3770252j3427694j2848858j2409385j1897703j1092124
$$ plain form
14307 106580040 111134197 115712029 120974492 126141521 131483591 137445493 143739638 150334392
14299 150334392 157201989 164327737 172409828 180623099 188931714 198337055 208028902 218031923
14291 218031923 228791148 240140669 251856463 264285138 276814942 290084724 303728006
14284 303728006 317733869 332269189 347119697 361331932 376038015 390351487 404234455
14277 404234455 417596166 429831110 441057262 450209069 455840145 458343370 458251290 455510070
14269 455510070 453620146 447124247 442558555 437100987 432790936 427322467 419373625 409884875
14261 409884875 397488628 383906655 369235093 353869128 338596327 323469152 308294581
14254 308294581 294089273 280319021 266891327 254042469 241633084 229735381 218643257
14247B18643257j0912335r774011r229709q675877q422257q132295p620649p022106
14239A48854018o679068o124528n624527n487907n735587n128469m861208m046886
14231A05165838m138051l949349l973164l148107l918297l108434l186333k700545
14223G7043558l045257k539781k638467k087136k193102j944121k154671k384790
14215E8056233j357033j812677j642634j696470j718591j429724j571986j427552
14207D5399566p60319j034559j397420j284525j081902j352433n92650j153079
14199C6742679r96239r61874p14573r79437q50012j195862o11636m20979r44490
14190B9067577p62007n09819p84537n26862o81566j94455r68286o25719l07930
$$ plain form
14247 218643257 207730922 197956911 188727202 180051325 171629068 163496773 155876124 148854018
14239 148854018 142174950 136050422 130425895 124937988 119202401 114073932 109212724 105165838
14231 105165838 101027787 97078438 93105274 89957167 86038870 82930436 79744103 77043558
14223 77043558 73998301 71458520 68820053 66732917 64539815 62595694 60441023 58056233
14215 58056233 56699200 54886523 53243889 51547419 49828828 48399104 46827118 45399566
14207 45399566 44639247 43604688 42207268 40922743 39840841 38488408 37895758 36742679
14199 36742679 35746440 34784566 34069993 33090556 32240544 31044682 30433046 30012067 29067577
14190 29067577 28305570 27795751 27011214 26484352 25802786 25608331 24640045 24014326 23706396
14181B3706396o99799J83003q64673n22918n04772m36692l14867l89659n85233
14172A9570786p7756m69940l68268n29847j58521m11730j93655p47791M5194n93514
14162A6064958J43697m84517m42324p4253j87354n60728O0153l43775l36910j20282
14152A3718665j32064m28164M8572k90473k80337j74223k52452j36902q375m72148
14142A1592099J31056l46479q7554o27142K76341L8711l71255k13467k83336j0063
14132A0098911K62195o73047J78659m56389N0019j66847o9846o289m47472j22316
14122H647578N2812k85512J12220k51912n3199K04574m10571J2708j38134j36067
14112G754497o7202k0251l68829K96176j72694n23228K34495k81346M4007l2575
$$ plain form
14181 23706396 23006597 23189600 22324927 21802009 21297237 20860545 20545678 20156019 19570786
14172 19570786 19493030 19023090 18654822 18124975 17966454 17554724 17361069 16613278 16658472 16064958
14162 16064958 16208655 15724138 15281814 15207561 15020207 14459479 14519632 14175857 13838947 13718665
14152 13718665 13586601 13158437 13207009 12916536 12636199 12461976 12209524 12072622 12064247 11592099
14142 11592099 11723155 11376676 11289122 10661980 10938321 10977032 10605777 10392310 10108974 10098911
14132 10098911 10361106 9688059 9866718 9410329 9460348 9293501 9223655 9217366 8769894 8647578
14122 8647578 8700390 8414878 8527098 8275186 8221987 8426561 8015990 8028698 7890564 7754497
14112 7754497 7687295 7667044 7298215 7594391 7421697 6898469 7132964 6851618 6895625 6863050
14102F863050R5188l64964j00041O3040j18068O4724k85742J04189l54005J91747
14092F159118r0086j39061j06392J35532j36258j57649K20367l42356j45846L4594
14082E431963p2248K16194n81689K2152J18422j28030Q3939r5303r2383q1145
14072D821872o8673K29088l96721J43624m34388L60464k82291M9284L2608j51042
14062D303825L98798m41329p7270L23949k27730p6407j40262J99807k63573Q2743
14052D082551l35062n3301O9083L23847M2637j40531k58509J80913o05200J39268
14042C445696M43433k59201k3514n3384J19791k10789M3583m25272J65430J24398
14032C370171M2394J17264r7932q8063K65304m01375j51679J21165r9129J70820
$$ plain form
14102 6863050 6958238 6593274 6493233 6556273 6438205 6502929 6217187 6321376 5967371 6159118
14092 6159118 6069032 5929971 5823579 5959111 5822853 5665204 5885571 5543215 5397369 5431963
14082 5431963 5359715 5575909 4994220 5016372 5134794 5006764 5090703 4995400 4903017 4821872
14072 4821872 4753199 4982287 4585566 4729190 4294802 4655266 4372975 4422259 4454867 4303825
14062 4303825 4702623 4261294 4184024 4507973 4280243 4203836 4063574 4263381 3999808 4082551
14052 4082551 3747489 3694188 3763271 4087118 4129755 3989224 3730715 3911628 3306428 3445696
14042 3445696 3889129 3629928 3606414 3553030 3672821 3462032 3505615 3080343 3245773 3370171
14032 3370171 3412565 3529829 3431897 3343834 3609138 3207763 3056084 3177249 3078120 3248940
14022C248940j55696j68432K9100j67998J75455J48833j81200j11350j68528L76258
14012C025382k47168j67444K00003k67906M09152P3973n01255j36235o3525O1201
14002B386178Q9868J7989l19105L65999m68758L4436J37220j49845K32501J3369
13992B339852Q6772j62862N13831Q21865K692872P340103J8600631P257049j3614306
13983B5875807q543766n724186l235675k030605j083963r06485l98312n40215
13975C412600m5855o07117L26276m9629l54712P7498m74300M18461k69652M6527
13965B480097j27906J04136l40939K96773R6318k77475K04495m00440L21080j48289
13955B207850P1271J79526q6964l25549J25258r2168O298J09750j69303N4185
$$ plain form
14022 3248940 3093244 2924812 2953912 2785914 2961369 3110202 2929002 2817652 2649124 3025382
14012 3025382 2778214 2610770 2810773 2542867 2952019 3025992 2524737 2388502 2324977 2386178
14002 2386178 2476046 2494035 2174930 2540929 2072171 2106607 2243827 2093982 2326483 2339852
13992 2339852 2426624 2263762 2777593 3599458 6292330 13632433 32233064 39490113 25875807
13983 25875807 17332041 11607855 8372180 6341575 5257612 4351127 3952815 3412600
13975 3412600 3366745 2759628 3085904 3036275 2681563 2759061 2284761 2703222 2433570 2480097
13965 2480097 2352191 2456327 2115388 2412161 2508479 2231004 2435499 2035059 2356139 2207850
13955 2207850 2279121 2458647 2371683 2046134 2171392 2079224 2085522 2195272 2025969 2080154
13945B080154J39721o38193M35751J31067k27651q1920L08305j56852n5378k27617
13935A707387O2429p7603k7655L25570k94496k3597K99190q9805j94107Q7021
13925A774334M447J91566j00777l71052K29952k68578k49247O97383n35598L94457
13915A766887l6036K30428o49184K56834J65905l98594J65078M35292l22097q324
13905A606189j52852L42513k84609J83385m0146r7545K9168j21919q2368Q9424
13895A471240l5774k60543J62841j73714K65078L16766n20334N1164p5600l44014
13885H57110M56022j33056L4578j87676P0423L75702j04648j10044j97432K84996
13875A345975j39719j67479K33786n6223K0795n683n1193m7974M15123j45914
$$ plain form
13945 2080154 2219875 1581682 2017433 2148500 1920849 1838929 2147234 1990382 1935004 1707387
13935 1707387 1769816 1692213 1664558 1990128 1695632 1672035 1971225 1881420 1687313 1774334
13925 1774334 1778781 1970347 1869570 1498518 1728470 1459892 1210645 1908028 1372430 1766887
13915 1766887 1730851 1961279 1312095 1568929 1734834 1336240 1501318 1936610 1614513 1606189
13905 1606189 1453337 1795850 1511241 1694626 1654480 1556935 1586103 1464184 1381816 1471240
13895 1471240 1435466 1174923 1337764 1164050 1429128 1745894 1225560 1276724 1201124 857110
13885 857110 1313132 1180076 1214654 1026978 1097401 1473103 1368455 1258411 1060979 1345975
13875 1345975 1206256 1038777 1272563 1216340 1237135 1231452 1180259 1132285 1547408 1401494
13865A401494k19334L12608m30749O9552N3271P4586k00548J16442K11806k06053
13855A183075k33645M42434m70826J35520K4404p9562K6560n3831J62844m4279
13845A092694j74851P0467q2592L83334l43245n2521K86317k18284J96050j22704
13835A034665J04772j11493p4102q1755J16622n1303O948m426K216K79411l16154
13824I05401N826j99185K27850q3731P4043L52080k78484Q716N45123m74520k69125
13813H13994m5369j08716L48963j20843P8913p5823P9912o3985m08281L06140
13803H04905M46766k28466J54424l2764l39752J97013j61197L74772k12778L8436
13793A041359k06420K61359j04612l07461k20729P42873k59188l58671J91066
$$ plain form
13865 1401494 1182160 1494768 1064019 1133571 1186842 1261428 1060880 1177322 1389128 1183075
13855 1183075 949430 1391864 921038 1056558 1080962 1001400 1027960 974129 1136973 1092694
13845 1092694 917843 988310 905718 1289052 945807 893286 1179603 961319 1157369 1034665
13835 1034665 1139437 1027944 953842 872087 988709 937406 944354 939928 942144 1221555 905401
13824 905401 911227 712042 939892 856161 930204 1282284 1003800 1012516 1557639 1083119 813994
13813 813994 768625 659909 1008872 888029 966942 891119 971031 907046 498765 804905
13803 804905 1251671 1023205 1177629 1144865 805113 1002126 840929 1215701 1002923 1041359
13793 1041359 834939 1096298 991686 684225 463496 1206369 947181 588510 779576
13784G79576J41942j59486P3225j46592M00264j83599J04042m33685J88791J58779
13774I23257k36254o6209J15983J29933L8081n1604Q5084j82575j66074L63649
13764I53271J2403o5624j35893M8712l11072P1483P4417K1253K68570j22651j80233
13753F34636L57447m76201J60408K74604k3386j60690j91539N0731j25385J5027
13743E15652J57401K444j30464J31129k9553J44250j15604j63203M2939L07704
13733H62695m05361K19694N4158j88703L06338j62529j37875K98226B45422L39850
13723E85272j11422L21881j78931j83404J69336M01449l03568k82003L12486k54135
13713D76961K25230j89066j85764M33075k75235Q7648l9620p7611J39358n9309
$$ plain form
13784 779576 921518 762032 835257 688665 1088929 905330 1009372 575687 764478 923257
13774 923257 687003 620794 736777 866710 904791 853187 938271 755696 589622 953271
13764 953271 965674 900050 764157 812869 501797 573280 647697 668950 937520 814869 634636
13753 634636 992083 515882 676290 950894 927508 766818 575279 626010 500625 515652
13743 515652 673053 675497 545033 676162 646609 790859 675255 512052 554991 862695
13733 862695 457334 677028 731186 542483 848821 686292 548417 846643 245422 585272
13723 585272 473850 795731 616800 433396 602732 1004181 700613 418610 731096 476961
13713 476961 702191 513125 327361 760436 485201 572849 533229 455618 594976 535667
13703E35667J46823r3388j27375L0962k7621L38965m6390o969l48651O8183J65412
13692F35618o5217p9433j36168J88359L19413j72004l40537J55985J37050n3303
13682E89763O4670m4834o6006Q2002j6014K06584k01896j45405m5863l5415P6156
13671D63742o8969r798L2047L06934j99471K08296j84268J13542m0488j18095
13661E03472B51041J42745J86244B52960R9699J02955J33470r1537L22786C72786
13650A29292K32156k0728P5245p8808J23167j35658J84048r7609J25936K2739
13640E59780j75184O09928m73740J64083l15631J75912k63104K35312o3234m2866
13630D11256J44698j14594A83107l460N4721J50537J47683j19122j8531j95417
$$ plain form
13703 535667 682490 589102 461727 492689 465068 804033 757643 750674 402023 470206 635618
13692 635618 570401 490968 354800 543159 862572 690568 350031 506016 643066 589763
13682 589763 654433 609599 543593 625595 609581 816165 614269 468864 423001 387586 463742
13671 463742 394773 384975 417022 723956 524485 732781 548513 662055 621567 503472
13661 503472 251041 393786 580030 252960 352659 455614 589084 497547 820333 372786
13650 129292 361448 340720 415965 337157 460324 324666 508714 411105 537041 559780
13640 559780 384596 994524 520784 684867 369236 545148 282044 517356 454122 411256
13630 411256 555954 441360 183107 179647 234368 384905 532588 413466 394935 199518
13620A99518L1053M12011j34478L53171C6796L99829J91572B55560J88574A59906
13609B23286K67443A10916K54452R2402Q0897P722K42408B74093D0520K91185
13599C31705O1378n5277R7987K64651A00464K01086O6563A53190M68918B91094
13588D11308l9058A40162J83264p6240k6220J18357K6840j9775p8213q7184J79995
13577C60986A75853M22999j11935J9633L0143p8989J0785j04143j21966J57655
13567D00035L0409j64232l0950L61751B38727p7488N0099L94899j16257j4320
13557D75660p8613j20805N3729J13094l1980r7300l9647M3933O267l5646K12440
13546E01132j11989l5048j42410K52149H7690C8276J98264L18472B43405C2219
$$ plain form
13620 199518 230571 642582 508104 861275 36796 436625 628197 255560 444134 159906
13609 223286 490729 110916 365368 457770 538667 546389 788797 274093 40520 331705
13599 331705 393083 337806 435793 700444 100464 301550 368113 153190 622108 291094
13588 411308 372250 140162 323426 247186 220966 339323 366163 346388 268175 180991 360986
13577 360986 175853 598852 486917 506550 536693 457704 468489 364346 242380 400035
13567 400035 430444 266212 235262 597013 238727 161239 211338 606237 489980 475660
13557 475660 397047 276242 329971 443065 411085 313785 274138 318071 324338 288692 501132
13546 501132 389143 354095 211685 463834 87690 38276 236540 555012 243405 32219
13535B81551r6189J73149A36038M10758j29692D9747N0785M39240B03169O4872
13525B68041K50019k12767p5992L9084P6380N5296j0781j02734A30762M03364
13515E34126k31056K13628a9069B99663o9333k7308J62341J73588p359K41231
13505G72823a7240C62790r6893A28417L14040j3321k2011l3352n2929M919K03633
13494E29396B43227j10938K65070j48853q9188P6660J19558p3957J00685L0098
13484D12362E4036L1255i1615A56574D2231K47481L00948B74948K71141j22812
13474D23277m3095g1478C19829J26019j32690C0650M39189F1006d6280B90137
13463D38982J31004k37709k5733N1857A73600M08746A83197a58052f6130A60385
$$ plain form
13535 281551 185362 358511 136038 546796 417104 49747 100532 539772 203169 268041
13525 268041 518060 305293 229301 268385 344765 400061 389280 286546 130762 534126
13515 534126 303070 516698 -19069 299663 230330 203022 365363 538951 531592 772823
13505 772823 -17240 362790 265897 128417 442457 429136 407125 373773 320844 325763 529396
13494 529396 243227 132289 397359 248506 159318 235978 355536 281579 382264 412362
13484 412362 54036 85291 -91615 156574 42231 289712 590660 274948 546089 423277
13474 423277 380182 -71478 319829 445848 313158 30650 469839 61006 -46280 290137
13463 438982 569986 332277 306544 358401 173600 582346 183197 -158052 -66130 160385
13452E02859f9758C16094L0562q2678J54270j80472d4176B74901L6556O3929j43668
13441B31718k4898m2028p3404K42992J35662j15834C598M77129j44574A25346
13430B43857a12495A19002K86077j52057g3179B64843k1704P8352J15328D8548
13419B38799l7381P5794q2910P8112D3369Q5240M19566B04812P1000J70733j93681
13408B52864J34776j33526g5619L5172B95483I0041K8379K14504F7692N71028
13398F38720B01903m8562J38459n8087f4209C65701j51234L5037A03297K48444
13388C51741j45489J57667a6191A29877a64569C40714M1264H4545K18702j49402
13378A53845J75706r4576j09589J02917R9444C2791L78767P0039O917F315K55241
$$ plain form
13452 502859 -69758 316094 346656 263978 418248 237776 -44176 274901 311457 375386 231718
13441 231718 206820 164792 91388 334380 470042 354208 3598 480727 336153 125346
13430 243857 -112495 119002 405079 253022 -73179 264843 243139 321491 436819 48548
13419 238799 201418 277212 194302 272414 43369 128609 548175 204812 275812 446545 252864
13408 252864 387640 254114 -75619 -40447 295483 90041 118420 332924 67692 638720
13398 638720 201903 153341 291800 233713 -64209 365701 214467 249504 103297 351741
13388 351741 206252 363919 -16191 129877 -164569 340714 381978 84545 303247 153845
13378 153845 329551 234975 125386 228303 327747 32791 411558 481597 488514 6315 261556
13367B61556L6754Q990d8795A23724d461D40659B18389L70429I2465R8718o5142
13356A26041P329J78634J06926A46324L724K44878K8612J29062k14452b31732
13345B28909L2839N2527N06005k59361B05328O0700K03390p4966P6465H8457R153
13334I7610J20178j5470H1240L50935j98653m8179J6705G2397k1397b57720A60044
13322A04471R2953J24736N7166A81795L14003B8605L85343p6753P4492l8488j65102
13311B08097K683m665r31G2615P2985L2906J46207J62136A12799E5275K43917
13300B99192j1237G7444N5632K1601P5127A03479K63123K0663J81437B35416b7311
13288B37318A16250O2682m8784J61595j22278a99634A74099o5866J91617R0141
$$ plain form
13367 261556 298310 307300 -48795 123724 -4461 440659 218389 588818 92465 191183 126041
13356 126041 133370 312004 418930 146324 150048 394926 423538 552600 338148 -231732
13345 228909 261748 314275 820280 560919 205328 266028 469418 394452 470917 88457 97610
13334 97610 217788 202318 81240 432175 233522 185343 202048 72397 51000 -257720 160044
13322 104471 197424 322160 379326 181795 495798 28605 413948 337195 411687 373199 208097
13311 208097 210780 206115 205184 72615 145600 178506 324713 486849 112799 55275 299192
13300 299192 287955 77444 133076 154677 229804 103479 366602 387265 568702 235416 -27311
13288 237318 116250 178932 130148 291743 169465 -199634 174099 108233 299850 389991
13278C89991C6054J03305M05627A60654M3386a44526B64193m9735A06501l2374
13268G4127P3203D0475J37986g7584A10150J7440M381J66239E1243J6760J05005
13257A73008J64637B6348L06541A5326R7642Q7304J29914J3141a53651A35450
13246B05798K00352j27575H5181l072J58490E1696J92780f4183B01294R6286e5426
13234C08335j41457K04159A10438i0392A01570J54521H1780J17949n1437M75929
13224F24221G8560K08415F7794L6397j6334f3807G0850K91486h4287B66247f7734
13212B18900F2662a1040A43134L6847F3807K28493A31790a25735L4946A15070
13201C6104a06387k1619E7159i491C12932A25073C2889g9635C66318e0067B91145
$$ plain form
13278 389991 36054 139359 544986 160654 204040 -144526 264193 214458 106501 74127
13268 74127 147330 40475 178461 -77584 110150 127590 131971 298210 51243 68003 173008
13257 173008 337645 26348 332889 15326 112968 200272 330186 343327 -153651 135450
13246 205798 406150 278575 85181 82109 240599 51696 244476 -64183 201294 297580 -55426
13234 308335 166878 371037 110438 -90392 101570 256091 81780 199729 148292 624221
13224 624221 78560 286975 67794 104191 87857 -63807 70850 362336 -84287 266247 -67734
13212 218900 62662 -11040 143134 179981 63807 292300 131790 -125735 -90789 115070
13201 36104 -106387 -128006 57159 -9491 312932 125073 32889 -79635 366318 -50067 291145
13189B76875r4967c8145C17922a30186F0591O037P0071R4203p7066J79314e0488
13177A09616a1899B15457L1641A12440J33038j19311R4288b66820B2749K27339
13167B50088a61549B33020A384K82736J53661A06501j3583k2278f3470G2450B9015
13155H7699O210h1946A8270J59758L91862b3532A07056l6020a22881k1013H7935
13143A79379a21328A71085B9438K00036A14062J04992I8637J23643C1423R9636
13133A31059a50992A94787F646J27357A4541P7560J65198p8126a82829O1183C03982
13121g5970A14015K2137J33132m3509A09772l0324K07058e3815A60867j2578a1116
13109C83581A83075j673e7766b6795B74496F1060K3857m461d3947C3732Q0820
$$ plain form
13189 276875 181908 -38145 317922 -130186 60591 66628 136699 230902 153836 333150 -50488
13177 109616 -11899 215457 247098 112440 245478 126167 220455 -266820 22749 250088
13167 250088 -161549 233020 1384 284120 437781 106501 92918 70640 -63470 72450 29015
13155 87699 93909 -81946 18270 178028 569890 -23532 107056 71036 -122881 -143894 87935
13143 179379 -121328 171085 29438 229474 114062 219054 98637 222280 31423 131059
13133 131059 -150992 194787 6646 134003 14541 92101 257299 179173 -182829 -121646 303982
13121 -75970 114015 136152 269284 225775 109772 79448 286506 -53815 160867 148289 -11116
13109 383581 183075 181402 -57766 -26795 274496 61060 84917 80456 -43947 33732 114552
13098A14552f9484k30371C18933B9698L0966J79251b879C80650a87823D3494b03641
13086A05385c05174A3347K07599H825b9736I5447J54916B8798M6781a29619A42696
13074b48911A31268K38707j33408a75535n852B20178D2146J96459j13777E6809
13063I0010R899L7506E4514P220Q7170O6276A162M47969a68355a1096A85745e1119
13050D69698B1391K21769I0368b7166G4714B0098K81720A8707c5227R306B87819
13038C53030A33127C1610J53592A2494K99338j01663N6094b2395m1044A96258
13027B58722c0150C25161B1208L04687j03467N9371m8312F7373J28194J7195I4090
13015a05187j30661g7658j80520D57596C5960M0589a14444A34918J18696b5411
$$ plain form
13098 114552 -69484 -299855 318933 29698 60664 239915 -2879 380650 -187823 43494 -203641
13086 105385 -305174 13347 220946 8825 -29736 95447 250363 28798 75579 -129619 142696
13074 -248911 131268 369975 236567 -175535 -181387 220178 42146 238605 124828 56809
13063 90010 99909 137415 54514 61734 148904 215180 1162 449131 -168355 -11096 185745 -51119
13050 469698 21391 243160 90368 -27166 74714 20098 301818 18707 -35227 -25921 287819
13038 353030 133127 31610 185202 12494 311832 210169 266263 -22395 -63439 196258
13027 258722 -30150 325161 21208 325895 222428 281799 233487 67373 195567 212762 94090
13015 -105187 -235848 -77658 -258178 457596 35960 76549 -114444 134918 253614 -25411
13004a12884A6543L05983A04300J97776a07277G7891O947M28060I9725K48325
12994C48050g6873J2229C60108m4279O5699r0967c1034I2161J50543A043J33676
12983A34719j082F0731M64490i375n15213A59640J81301j68501b92185a31159
12972b8431A50231i2949B51008M7896H1073O4807J53604a01480B01454a79505
12961C25441A37050a3890o491E3582Q3925n9168j2376c07670B3114N4346L69135
12950D46595E1196K14625A13719e5206A01765g6338J4913B96437D5315J04600
12940A49915J3822H548A168J74231L6100G7583J17170g3607D6440K7890J36354
12929B10684c63097E5505m875A3761K7280P2767L0793L6301K21960d80507J81367
$$ plain form
13004 -112884 16543 322526 104300 302076 -107277 77891 84838 512898 99725 348050
12994 348050 -76873 -64644 360108 315829 381528 290561 -31034 92161 242704 1043 134719
12983 134719 133637 60731 525221 -9375 -524588 159640 340941 172440 -292185 -131159
12972 -28431 150231 -92949 251008 298904 81073 145880 299484 -101480 201454 -179505
12961 325441 137050 -13890 -20381 53582 137507 78339 65963 -307670 23114 77460 446595
12950 446595 51196 265821 113719 -55206 101765 -76338 -61425 296437 45315 149915
12940 149915 163737 8548 1168 175399 211499 77583 194753 -73607 46440 74330 210684
12929 210684 -363097 55505 50630 13761 41041 113808 144601 180902 402862 -480507 -299140
12918b99140C21109i99A12808j992K785d4026B86395F2963a1055j55364C08940
12906b17337B90946m6897m7336E3552B5273K2931K8268J84064E3226g3206I5346
12894C29413a37332O6059J5839H1892a79696h5540A30922a7958B5256J86044M6168
12883B57468b71293F3409J18514e0142F9218B948Q1606C9944L02494o4194j12511
12872A65733c7169A19602b4750j15843D96465a07701B68635b9943B21219a43584
12861a08709A83855k5106b8995q4651d9126k14562h9138C30665j16064a43506
12850b03022H7637O9446d86388C7970a05106Q397A5076c2240a563C01532j3679
12839B87853d0710A98369e8745C2107a07020A59204b34553G6691h3668b1955G9994
$$ plain form
12918 -299140 321109 -999 112808 110816 113601 -44026 286395 62963 -11055 -166419 308940
12906 -217337 290946 244049 196713 53552 25273 48204 76472 260536 53226 -73206 95346
12894 329413 -137332 -71273 -55434 81892 -179696 -85540 130922 -17958 25256 211300 257468
12883 257468 -271293 63409 181923 -50142 69218 2948 84554 39944 342438 278244 165733
12872 165733 -37169 119602 -24750 -140593 496465 -107701 268635 -29943 221219 -143584
12861 -108709 183855 158749 -28995 -113646 -49126 -263688 -89138 330665 214601 -143506
12850 -203022 87637 157083 -486388 37970 -105106 -96709 15076 -32240 -1563 301532 287853
12839 287853 -40710 198369 -58745 32107 -107020 159204 -234553 76691 -83668 -21955 79994
12827a69306E3987k5459J66331d5902a434H2468Q1218L6272B3323J941b1865C41135
12814a83041j5591N1283k09109I9425b15284C81585a9225D6765i4367A3386K82606
12803B95992i1885o2477B11455d3785d291B41788j18331Q2696F6351b22638B5333
12791E7146h9987H4005C8929J54368a81435a0741j77179b7082A65968c1649A5712
12779a45039H2522c51084A21179a34005B42623j11060b5024m556k50532g8257
12768g9604G7275J0468k4084p048c0356J5161B23037N9723l4063G1502K04705
12757B76207a19233b8408A27431e5288C05437B4814g9050n2200k96539A95108
12746E1788A5088K6272g6448k02537H9689R2651J5620d8506B97170j37148b47185
$$ plain form
12827 -169306 53987 28528 194859 -45902 -1434 82468 163686 199958 23323 25264 -21865 341135
12814 -183041 -198632 -147349 -356458 99425 -215284 381585 -19225 46765 -94367 13386 295992
12803 295992 -91885 -154362 211455 -43785 -4291 241788 123457 206153 66351 -222638 25333
12791 57146 -89987 84005 38929 193297 -181435 -10741 -187920 -27082 165968 -31649 15712
12779 -145039 82522 -351084 121179 -134005 242623 131563 -25024 -29580 -280112 -78257
12768 -79604 77275 87743 63659 56611 -30356 -15195 223037 282760 248697 71502 276207
12757 276207 -119233 -28408 127431 -55288 305437 24814 -79050 -131250 -427789 195108
12746 51788 15088 41360 -76448 -278985 89689 182340 197960 -48506 297170 160022 -247185
12734A84241R5691M2254B4034K52084M6188j2439D9528a9271B84444j41361a62020
12722A09750k4009G634d3146A34282A1837N3919N8493a05881M3257A06419B7924
12710A71102J1398D8322L1690B9109J13112g4293A7916b01225B09796b2259H3806
12698A80645K14270j18682a3629k9114p3556j68038L9622A65459a25000E8117
12687G9748K74371b69332a16708B25487q009q681C892K45309f898m08475C3919
12675C3193L9274J99261k3322k6292a11460K6245B89000A29909J15598c900k63312
12664b67212g697A39378m241L07235A41375C4606L89288a80096B65449D0573f9305
12652F2399J67580b11101a04374M3607B89167e218j76525I7451J35750H5168J41516
$$ plain form
12734 184241 279932 322186 24034 276118 322306 309867 49528 -19271 284444 143083 -162020
12722 109750 85741 7634 -43146 134282 11837 65756 124249 -105881 -62624 106419 27924
12710 171102 182500 48322 80012 29109 142221 -74293 17916 -201225 209796 -22259 83806
12698 180645 394915 276233 -13629 -42743 -116299 -284337 -244715 165459 -125000 58117
12687 79748 354119 -269332 -116708 225487 217478 208797 3892 249201 -6898 -415373 33919
12675 33193 72467 271728 248406 222114 -111460 -85215 289000 129909 245507 -3900 -267212
12664 -267212 -7697 139378 135137 442372 141375 34606 423894 -180096 265449 40573 -69305
12652 62399 229979 -211101 -104374 -60767 289167 -5218 -181743 97451 233201 85168 226684
12641B26684B4668L7900J16201a0238l08704C31085g4195b8125j2363A61981J85709
12630C47690a47912A780K80305a61151I9447C1561K427J39070b1660k42004A63896
12618H6001L9016k7741J781c3856l41768B54602F779e0017B80187A2075K38560
12607B50635e9835C5236e076B54284d539F1642b4670j91153A47303K10904E2670
12595A19885K237e5095F6489A5666K96922a07352H0226L7058J21045O8113i1843
12583C44864a72974a2963B77797B5402a93411I7813k0393K16079e0062B27745
12572B58649m2376E0837d8853j24474A09923J88163E4395C43K37719l7212i0598
12560h244o0716N031K2439n2608j33247b3541C70493b9990j93213Q0710A83841
$$ plain form
12641 226684 24668 62568 178769 -10238 -318942 331085 -74195 -28125 -40488 161981 347690
12630 347690 -147912 1780 282085 -161151 99447 31561 33988 173058 -21660 -263664 163896
12618 86001 125017 97276 99057 -33856 -375624 254602 6779 -50017 280187 12075 250635
12607 250635 -59835 35236 -5076 254284 -4539 61642 -24670 -215823 147303 358207 52670
12595 119885 122122 -55095 66489 15666 312588 -107352 80226 117284 238329 306442 -91843
12583 344864 -172974 -12963 277797 25402 -193411 97813 77420 293499 -50062 227745
12572 258649 216273 50837 -48853 -173327 109923 298086 54395 343 238062 200850 -90598
12560 -8244 -68960 -63929 -41490 -94098 -227345 -23541 370493 -29990 -223203 -142493 183841
12548A42056b8352k27810C21940G8937a1951A98893J7912c6050O367B80c05590
12536C85064g8853o0676d3671C7168O196e7517B320M196J26469d5882l7448D8606
12523a35862A931J12875l1940b14242F2342K10920A19957J34609B6752b8019B89785
12511A94872p0345a96399C61371B4737J28484g5961A37508a7467D2953K05072
12501B48025O1561b47489J00779L9891F7791a32964J9804a9282A11114m1629K0454
12490H9939E737b58962A26834a8002E4450k1045J56529e8552C19243b09411A89786
12478c6616A90258m8015R4731B9038i1063A73056m1333b81079G1074H751a72124
12466B83714a0264I3792Q0170j0644a27505c9228D72251j56592j50852K664D1864
$$ plain form
12548 142056 -28352 -256162 321940 78937 -11951 198893 216805 -36050 -29683 280 -305590
12536 385064 -78853 -139529 -43671 37168 43364 -57517 2320 6516 132985 -45882 -83330 48606
12523 -135862 1931 114806 82866 -214242 62342 273262 119957 254566 26752 -28019 289785
12511 194872 124527 -196399 361371 24737 153221 -75961 137508 -17467 42953 248025
12501 248025 309586 -247489 -146710 -106819 67791 -132964 -113160 -19282 111114 69485 89939
12490 89939 5737 -258962 126834 -18002 54450 33405 189934 -58552 319243 -209411 189786
12478 -36616 190258 142243 236974 29038 -91063 173056 131723 -281079 71074 8751 -172124
12466 283714 -10264 93792 173962 163318 -127505 -39228 472251 315659 164807 167471 41864
12454A90045P2727p9754F7792B1682L1579K47036r7162b91303J42394E2437J76931
12443B29368j07024f1412j78523C71078j59340J2762d2091n7804k0209A71540
12432b5491B29319d5103l5546B08093E7826Q2214a3602D66b2291n1190a6477D8655
12419A00351a71109M4734B23103a17406B3649a28886d8559D1032a16841A89567
12408a09641c7280k39206a13523E4538D436a81664L5056f5300D9195f4809q4138
12397a48947H3716a07099j11324A64648f3955j73950R418J04094k47040J38666
12387b32767j58691h1503A56020E0611P8496i2176p6029r900i848j01085j39707
12376b50640G8980a21777A16300J8640L9635a3515E87414a9182j8035A26486B5403
$$ plain form
12454 190045 262772 183018 67792 21682 53261 300297 203135 -291303 -148909 52437 229368
12443 229368 122344 -61412 -239935 371078 211738 224500 -42091 -99895 -120104 171540
12432 -25491 229319 -45103 -80649 208093 57826 140040 -13602 466 -22291 -73481 -16477 48655
12419 100351 -171109 -126375 223103 -117406 23649 -128886 -48559 41032 -116841 189567
12408 -109641 -37280 -276486 -113523 54538 4436 -181664 -146608 -65300 49195 -64809 -148947
12397 -148947 83716 -107099 -218423 164648 -63955 -237905 -228487 -124393 -371433 -232767
12387 -232767 -391458 -81503 156020 50611 129107 -92176 -168205 -178105 -9848 -110933 -250640
12376 -250640 78980 -121777 116300 134940 174575 -13515 587414 -19182 -37217 126486 25403
12364A45024N5690m7774F5889J46311K5125j04983d0174k3826R549C1121M7727
12353G8848a88024L9376A66897h3139j35290J08500c6405B36285a44409H1040
12342a15979b9684B33406J31899I9518b12720n7269D378b44485i382n1651D7413
12330D08652A16461J26305a31509A18557L16301k14294b33620G2669J9565K09923
12320C02157a78813k28019J91468G5435C2944a02369I1347a47640m3157B82143
12309c8569n3437E6167K6056a19772H2264j2793b1148C948e3108l6621B44738
12297A6948N4378P8689n9086b76990F3173k0591a63746A5046c5479m3168a1464
12285c7616A32001J40623i4873A64231a76824I1046a77948A52490f2254A46190
$$ plain form
12364 145024 200714 152940 65889 212200 237325 132342 -40174 -64000 -54451 31121 78848
12353 78848 -188024 -148648 166897 -83139 -218429 -109929 -36405 236285 -144409 81040
12342 -115979 -29684 233406 365305 99518 -212720 -269989 4378 -244485 -9382 -61033 47413
12330 408652 116461 242766 -131509 118557 434858 220564 -233620 72669 92234 302157
12320 302157 -178813 -406832 -215364 75435 32944 -102369 91347 -147640 -190797 282143
12309 -38569 -92006 56167 82223 -119772 82264 69471 -21148 3948 -53108 -89729 244738
12297 16948 71326 150015 90929 -276990 63173 42582 -163746 15046 -35479 -78647 -11464
12285 -37616 132001 272624 -94873 164231 -176824 91046 -177948 152490 -62254 146190
12274B08463M2050J25151a53440n2804B4897J25189O0599Q322K60418a00131a0232
12262E5293c3251L307g289E5062L37214A06298N8275a72984A31777k3141d9448
12250c1999n9272l9028C25366n4563c6675C08143a24477K8470d0836k4654B97494
12238I3434R4769F4683c5061o2891F1526a80035F6506J00860n9198J61364g055
12226f9828l1537D17811O7214o1672d245B25884a51842E10095l5149j08868k9947
12215C36131A00787J1559e4795A88291a9045F1493K39467A29888N3916L38955
12205E22759k33362A07839M02839M2456A19405a05975D52996f3760C01329o9236
12195B32093k0705K11915e294p5237A55677j6544J35607K7367b0681q3202B62602
$$ plain form
12274 208463 250513 375664 -153440 -206244 24897 150086 210685 219007 479425 -100131 -10232
12262 55293 -33251 -29944 -7289 55062 392276 106298 164573 -172984 131777 108636 -49448
12250 -31999 -91271 -130299 325366 270803 -36675 308143 -124477 -96007 -40836 -65490 297494
12238 93434 188203 64683 -35061 -97952 61526 -180035 66506 167366 108168 269532 -7055
12226 -69828 -101365 417811 485025 423353 -4245 225884 -151842 510095 474946 366078 336131
12215 336131 100787 112346 -54795 188291 -19045 61493 300960 129888 183804 522759
12205 522759 289397 107839 510678 553134 119405 -105975 452996 -63760 301329 232093
12195 232093 211388 423303 -5294 -80531 155677 139133 274740 302107 -20681 -103883 262602
12183a13899N3057A47817o3807M3891J1815a24174N7615B07793P434J4624p2481
12172A57370j7790O4898I7671d9893B43531D8502L30657A73500D3992K20638j25808
12161A38822A3398N1641k3361K17659c4195D70701C8665a3006A08044J55352E101
12149b70405J26281A81494o8599B4025a11467H4482N2370a28851I3600J27035
12139B20635b26557A74248b1213B5894P8162J10520m1538m3400N986C0789K23196
12128B53985K08459a9240j0470D2665K25463b66070g7027E822J39737b6368I5317
12116A57989F7016d9713h627A06009D6412L654a32455j9238A06003c13241J08639
12105b04602M5078L5422g78B67440b23837A7515b37179G573J83880Q5807o7025
$$ plain form
12183 -113899 -60842 147817 84010 127901 139716 -124174 -66559 207793 215227 229851 157370
12172 157370 139580 204478 97671 -49893 243531 48502 379159 173500 43992 264630 138822
12161 138822 13398 65039 41678 259337 -34195 470701 38665 -13006 108044 263396 5101
12149 -270405 -144124 181494 112895 24025 -111467 84482 136852 -128851 93600 220635
12139 220635 -226557 174248 -21213 25894 104056 214576 173038 129638 135624 30789 253985
12128 253985 462444 -19240 -29710 42665 268128 -266070 -77027 5822 145559 -26368 95317
12116 157989 67016 -49713 -8627 106009 46412 50066 -132455 -151693 106003 -313241 -204602
12105 -204602 -159524 -124102 -778 267440 -223837 17515 -237179 7573 191453 277260 210235
12094B10235a18923b1121l56091F1911R2549b3954j85016e388C2321c1081G0029
12082I8735g9980D12015A4419a083B9083a08291D7181j154c74249f7926o5051
12071a32977A3654a78927K1586k7759O4372D3271N7016J8393J62423D2450h6822
12059A50423K81038Q90549n6554m88015a3870B59053K34746A04324d8921A29631
12048f873A16161L0858J69299A52951k9555J33394j2025i6907B25962a74070A6019
12036a10530l6413m6849j04412f8381b4864D3556L1071f5561F30b15947C59590
12024B13881a32801e6862A12017m2483j9333L2290N8770b48477l99301A70281
12013B35959c4047H6876h0241L4984C39761D1652G75a2977B48820a65811A20754
$$ plain form
12094 210235 -118923 -21121 -377212 61911 154460 -23954 -208970 -5388 32321 -31081 70029
12082 98735 -79980 412015 14419 -1083 29083 -108291 47181 46027 -374249 -67926 -132977
12071 -132977 13654 -178927 -157341 -185100 -120728 43271 100287 118680 281103 42450 -86822
12059 150423 431461 1322010 1265456 777441 -13870 259053 493799 104324 -48921 129631
12048 -6873 116161 147019 316318 152951 123396 256790 244765 -96907 225962 -174070 16019
12036 -110530 -146943 -193792 -298204 -68381 -24864 43556 74627 -65561 630 -215947 359590
12024 213881 -132801 -56862 112017 69534 50201 82491 141261 -248477 -647778 170281
12013 235959 -34047 86876 -80241 -45257 339761 41652 775 -12977 248820 -165811 120754
12001b55696F2813a06421j4179A50644h11B65038d01596e2406q5405A5991L545
11990A9536M8308L4042c61427A9357N3896C2371f3436D0879i707C50040i1748
11978B78622A34117L5815B9408f0149j54419j17000e3316A96366e8703H8791a7478
11966b4762j17329J9660B60896c8166m6992r1116R311B5012i4363C7566J20181
11955A57747M4176b51808d0983H5090l9307i2251k79467c7923G9723l2390b2174
11943A13279k8790K8966K54138a33736G1578B4048b42076E0545a5244l61128f8892
11931I8074i0607A24951N1752B9093L95193H0753j777L8934h9445C40627i429
11919b87200A44090b26515H5496b30468F2795K2147a54067e188n5666A32931L0843
$$ plain form
12001 -255696 62813 -106421 -120600 150644 -811 265038 -401596 -52406 -137811 15991 19536
11990 19536 67844 101886 -361427 19357 73253 32371 -63436 40879 -9707 350040 -91748
11978 278622 134117 169932 29408 -60149 -214568 -331568 -53316 196366 -58703 88791 -17478
11966 -24762 -142091 -122431 260896 -38166 -85158 -176274 -166963 25012 -94363 37566 157747
11955 157747 201923 -251808 -40983 85090 45783 -92251 -371718 -37923 79723 47333 -22174
11943 113279 84489 113455 367593 -133736 71578 24048 -242076 50545 -15244 -376372 -68892
11931 98074 -90607 124951 176703 29093 424286 80753 78976 117910 -89445 340627 -9429
11919 -287200 144090 -226515 85496 -230468 62795 84942 -154067 -5188 -60854 132931 163774
11908A63774a266D57461a24640k3414C03519A42965n7962K30865A55170E60K20688
11897B21248a3821j62171h4058n2197e9794H3842a69421a3942D2415R2008P8299
11886B12722a34343A1762N0364b16176j13554O1496d2740C347b9710B54851A20581
11874a87688N8048O2651k02393k5364f6309G7735c54080B9861a28803C3571N8947
11863I2518J12554c16886A49619d7430N249I2233K57111A67675a84806R573q3651
11852b58884i7701C2028f7651j6590I7040a98570M9483E7394b50597Q1315A88080
11840B9531b84392F5549N4728i2840A72184l2196f0147j26313N0332B00014a30307
11828A50700n0243D6555b51191I1292a03507d1834J8215j01941A75798F7916k1959
$$ plain form
11908 163774 -1266 457461 -124640 -148054 303519 142965 85003 315868 155170 560 221248
11897 221248 -13821 -175992 -84058 -136255 -59794 83842 -169421 -13942 42415 134423 212722
11886 212722 -134343 11762 62126 -216176 -329730 -268234 -42740 3347 -29710 254851 120581
11874 -187688 -129640 -66989 -269382 -294746 -66309 77735 -354080 29861 -128803 33571 92518
11863 92518 205072 -316886 149619 -47430 -42181 92233 349344 167675 -184806 -175233 -258884
11852 -258884 -97701 32028 -67651 -84241 97040 -198570 -149087 57394 -250597 -169282 188080
11840 29531 -284392 65549 120277 -92840 172184 139988 -60147 -186460 -136128 200014 -130307
11828 150700 100457 46555 -251191 91292 -103507 -41834 -23619 -125560 175798 67916 45957
11817D5957J17743b41184g955E9972Q6011E7506K51145a45551A14069a58390B63377
11805B2296L3524k2085a53429K4169E043a7373b764l15666C51677j35651b6116
11793D4328c0471B08298q6691b8845A40494f0076m46522A76992m4902J28656b71855
11781D7149J12217m2444d10789A72090i2051A11369Q6108D6223J71324D6061A3061
11769C1891b83093J2638A40754a0446H0631b37666c5839A04125e3499a0162A0208
11757c2249D0960a09342J516j47684A76523e0946k21099I3117a49309A4523a1965
11745a52100C52727j67873b13107D9563A5173J29515H447J32573l0869j0509K1714
11734A21356a7995F0242L30527a04415C58503a268G5671a24971A61454l4308g9318
$$ plain form
11817 45957 163700 -241184 -7955 59972 145983 57506 308651 -145551 114069 -158390 263377
11805 22296 55820 33735 -153429 -129260 5043 -17373 -2764 -318430 351677 216026 -26116
11793 44328 -30471 208298 121607 -28845 140494 -60076 -506598 176992 132090 260746 -271855
11781 47149 159366 116922 -410789 172090 -92051 111369 197477 46223 217547 46061 13061
11769 31891 -283093 -270455 140754 -10446 80631 -237666 -35839 104125 -53499 -10162 10208
11757 -32249 40960 -109342 -107826 -255510 176523 -50946 -272045 93117 -149309 14523 -11965
11745 -152100 352727 184854 -213107 49563 15173 144688 8447 141020 110151 99642 121356
11734 121356 -17995 60242 390769 -104415 358503 -1268 75671 -124971 161454 127146 -79318
11722B68213A0526a54286d4987l9653c5969A62719J08060r4330c05437C99290
11711B15547f9658A88785Q4193b33694L2994A20969q231R4398C4345P6460c2314
11699F2694i6085j50625C69269e9098A99429f815G1553g7135E1174a85542C67258
11687H027K24913F2346Q1119M0304d8432A43015Q6753F5537a35432N8279B60415
11675a22392I2321a70832a4115j31564C52827C6568C931c1822B72982h7536c1356
11663a0290k1392C0896K09034f1048A01511D7544a53308A32249a12084L6753A7411
11651A51028n3550b7466j57514j54841J19819A8789L45649j70106a48096O3978
11641h4118I5893c60507d0551A51152b01355k7079B24458E6907J77967A16500
$$ plain form
11722 268213 10526 -154286 -44987 -84640 -35969 162719 270779 176449 -305437 399290
11711 215547 -69658 188785 272978 -233694 -200700 120969 112738 207136 34345 110805 -32314
11699 62694 -96085 -246710 369269 -59098 199429 -6815 71553 -77135 51174 -185542 367258
11687 8027 232940 62346 143465 183769 -48432 143015 229768 65537 -135432 -77153 260415
11675 -122392 92321 -170832 -14115 -145679 352827 36568 3931 -31822 272982 -87536 -31356
11663 -10290 -31682 30896 239930 -61048 101511 47544 -153308 132249 -112084 -75331 17411
11651 151028 97478 -27466 -184980 -339821 -220002 18789 364438 194332 -148096 -84118
11641 -84118 95893 -360507 -40551 151152 -201355 -228434 224458 56907 234874 116500
11630b08642A82232H6244a21330b45B04709f6811A61665j0170a67324B38456f0679
11618B43923F9647O4072d271A50416n5669a40470p648D3979A8134Q8451a79786
11606A0579J72347b65382b9912j77931R5751A5774h8544I7642C777J14109a8921
11594a25492C39729G8359J64087c9659D3932N9918b8279F8110K66415A66047P1584
11583B37631n9370f9883c268k0036b287B61860a98318A03149j1129j583K38683
11572C29120O3652e5938A62751j8094k6755i8887H0485Q1798c1576j77871F9946
11560B55286a29130D0745a08515a7642A48980n3210L5670D0533c2017C968a57454
11548E1060p767q78b37527A47331r709f0706p724a8325B10666K0247c0036B86188
$$ plain form
11630 -208642 182232 86244 -121330 -245 204709 -66811 161665 151495 -167324 238456 -60679
11618 243923 69647 133719 -4271 150416 94747 -140470 -148118 43979 18134 106585 -179786
11606 10579 182926 -265382 -29912 -207843 -112092 15774 -88544 97642 3777 117886 -18921
11594 -125492 339729 78359 242446 -39659 43932 103850 -28279 68110 334525 166047 237631
11583 237631 178261 -69883 -3268 -23304 -2287 261860 -198318 103149 92020 90437 329120
11572 329120 392772 -55938 162751 144657 117902 -98887 80485 162283 -31576 -209447 69946
11560 255286 -129130 40745 -108515 -17642 148980 95770 131440 40533 -32017 3968 -157454
11548 51060 43293 42415 -237527 147331 137622 -60706 -68430 -18325 210666 230913 -30036 286188
11535H9980J3633k1666B1187M33411j89782A21407b67319A34989K66370A15599
11524C9762c0268B84942a2885j289A64103o2173B9576d2848I8937d8589n3563
11513a02152c4225a1920l3099B6497J87721a84191A29820K98284A07086b8829
11502B79421k0069A15713b09198M1177B6589D614J46331J91985q1605K69160b22466
11490C18137b28990A66422e0590B33714A06670a5639C33364J23444F3136J40215
11480B03351K07065j67001l3222o5891a13733C8434K87946m6493J3578K35023
11470E28488k05033N6501C9803K70391I2551M7733J12869m2218b09012l2472E5846
11458D15613j19300Q6958I4740L04400C8711R3290r375d0391B51701F0867g8420
$$ plain form
11535 89980 103613 81947 21187 454598 264816 121407 -267319 134989 401359 115599
11524 39762 -30268 284942 -12885 -14174 164103 101930 29576 -42848 98937 -48589 -102152
11513 -102152 -34225 -11920 -45019 26497 214218 -184191 129820 428104 107086 -28829
11502 279421 259352 115713 -209198 -168021 26589 4614 150945 342930 261325 530485 -222466
11490 318137 -228990 166422 -50590 233714 106670 -15639 333364 456808 63136 203351
11480 203351 410416 243415 210193 144302 -113733 38434 326380 279887 293465 528488
11470 528488 323455 379956 39803 310194 92551 140284 253153 210935 -209012 -241484 55846
11458 415613 296313 383271 94740 399140 38711 132001 122626 -40391 251701 60867 -78420
11446A42131a64521f573B42020F7061M9506e9505k3410E82529A41458A9156K70898
11435B90054A8568f7759L1195B3905M11329a94516I1744d0223k34996A01763m0036
11424F1727J61794C2783J54513h1638k01539B30698c926A98154A2281P516L13217
11413C33014b6755A08901N0775a4140I7656c30125a48820C6638H82J22193M4321
11402A67396a4535j9343A38416a56429g6888j20878j74017D29327D7740O2136
11392A09876k3236K061f1762h51k36821o0331A49065J09081e2490l2512C79196
11380A62336f5405D3733b97679D09964j97753m2670a70849O9982M1082R064j61008
11369b11729F9957a21077a712A82427k0065N6461a35942O908H247a04390A2415
$$ plain form
11446 142131 -164521 -6573 242020 67061 116567 -59505 -82915 582529 141458 19156 290054
11435 290054 18568 -67759 -36564 23905 435234 -194516 91744 -40223 -275219 101763 61727
11424 61727 223521 32783 187296 -81638 -283177 230698 -3926 198154 12281 19797 333014
11413 333014 -26755 108901 159676 -14140 97656 -330125 -148820 36638 882 123075 167396
11402 167396 -14535 -33878 138416 -156429 -76888 -197766 -371783 429327 47740 109876
11392 109876 86640 88701 -61762 -851 -237672 -298003 149065 258146 -52490 -85002 379196
11380 162336 -65405 43733 -297679 409964 212211 169541 -170849 -100867 -59785 -50721 -211729
11369 -211729 69957 -121077 -1712 182427 162362 218823 -135942 -129034 8247 -104390 12415
11357F6117R6773c87412f619l8529H8707M7801k2195i1324a4403A12840b98398
11345G1514k885K64589H4209A3988J53437N4530f6683j10006A10253a76114D1900
11333A23750n0638a34464f1177k77754A24738a7314l42154J52356A80726a44489
11322A32282c00407i471k40134A88083k9274K1246b27760A43605B3974L4870a4854
11310c1791D87168a06044n5541m5867P9146L2010I6880c15288R188R2380M4262
11299a69458I1299a07788G8526b3349A11847b2790C99391b58584C07547I7995
11288C6259K07895K8644j16731a16214m5639c6611r907r439k7164B85181c421
11276A68260e7291o6080q9499A07839h6101G8989L8793c36665I2893C3701b60895
$$ plain form
11357 66117 162890 -387412 -6619 -45148 88707 136508 114313 -91324 -14403 112840 -298398
11345 71514 68629 333218 84209 13988 167425 221955 -66683 -176689 110253 -176114 41900
11333 123750 73112 -134464 -61177 -338931 124738 -17314 -359468 -207112 180726 -144489
11322 132282 -300407 -9471 -249605 188083 158809 180055 -227760 143605 23974 58844 -14854
11310 -31791 487168 -106044 -161585 -207452 -128306 -96296 96880 -315288 -306100 -213720 -169458
11299 -169458 91299 -107788 78526 -23349 111847 -22790 399391 -258584 307547 97995
11288 36259 244154 272798 156067 -116214 -161853 -36611 -46518 -55957 -83121 285181 -3421
11276 168260 -57291 -123371 -212870 107839 -86101 78989 117782 -336665 92893 33701 -260895
11264d7782B35718C9460a31714k19080f3752K1997E0074b06499C1713b9365A09276
11252g1818I3547b28769A50736c8715k28227r0919J10660N8631R2039r8883A8451
11240c67400b2145m10j63534K2786l7080O4124B25963l9159a97449C3275P0183
11229A03458D5759a09742K8378I5922b31434D21263e8672j72909J14389b5220
11218C9571K6324f9657l09894D2625a67808a727A61120D0502a12838j20798F8680
11206A64039m0722f7323G8505a9666G3194J77231A2461d40459A36181A4927b09543
11194B4568J10329n6876M9382f015n2961j73253R7836P250O0799D7974R5226m1482
11182A01718P9972d4681D2333G090a20109B12864a16736M6711B0178K14119E2469
$$ plain form
11264 -47782 235718 39460 -131714 -350794 -63752 -41755 50074 -206499 31713 -29365 109276
11252 -71818 93547 -228769 150736 -38715 -266942 -357861 -247201 -188570 -96531 -195414 18451
11240 -367400 -22145 -22555 -186089 -163303 -200383 -136259 225963 186804 -197449 33275 103458
11229 103458 45759 -109742 -81364 95922 -231434 421263 -58672 -231581 -117192 -25220
11218 39571 65895 -69657 -379551 42625 -167808 -1727 161120 40502 -112838 -233636 68680
11206 164039 123317 -67323 78505 -19666 73194 250425 12461 -440459 136181 14927 -209543
11194 24568 134897 78021 127403 -6015 -58976 -232229 -134393 -127143 -66344 47974 143200 101718
11182 101718 181690 -44681 42333 7090 -120109 212864 -116736 -70025 20178 234297 52469
11170A32548D6125d533j11947E8594K5482f8543A27626A7791b2636C20832b26290
11158f2809D8888c011I4834a139l7411o5126A04587J7342d5984B9611K8618f1617
11145b6372E9232a35388A82109m8673J90763j58157K6134l53i4212A29359C4248
11133D17447j36155i9582l2229e580o1112B38221J11360a79293I4111M9304e9530
11121a36028I5945c0270A89037E638c97507F051J07345A688b6579r4488N9279
11110f1788C50035a5991D1709I823K75062j33024O9761A04807a72494a0909L867
11099g042B76076b4454B31700D2266K78711D5094N4186L03160A51576P2378E2369
11087A32251R9422M42010I8557O6549K24320Q6761j92701Q9162h7632A6569K08415
$$ plain form
11170 132548 46125 -4533 -116480 58594 84076 -68543 127626 17791 -22636 320832 -226290
11158 -62809 48888 -3011 94834 -1139 -38550 -103676 104587 121929 -45984 29611 58229 -61617
11145 -26372 59232 -135388 182109 133436 324199 166042 192176 191823 -94212 129359 34248
11133 417447 281292 -99582 -131811 -5580 -66692 238221 349581 -179293 94111 143415 -59530
11121 -136028 95945 -30270 189037 5638 -397507 6051 113396 1688 -26579 -121067 -61788
11110 -61788 350035 -15991 41709 9823 284885 151861 221622 104807 -172494 -10909 -7042
11099 -7042 276076 -24454 231700 42266 320977 45094 99280 402440 151576 223954 52369
11087 132251 231673 673683 98557 165106 389426 476187 283486 372648 -87632 16569 224984
11076B24984J95504j65909O8025A51878m8991J60494M8310G6566b0679C41249
11065C51523J13219P1775A39078O77477B63936M26792l28269M23401C84491K56243
11055F40734r4454J35579J0341M0737j02112L68929l29264o9058K14233L9042
11045H54707m00167J4207M79792k19592J58969j31660j94533J92366J94931j15407
11035H33613j29448O5243l50214K13713J12094J72244l49939M21212m71781K24055
11025G40792l31443N51889M2626D17033K01424J48042k08081Q7441O3137o988
11015G02008j23853J19981q6062J81159k28811J02770J05108k28833L7761J70290
11005G51518q3657K2939L0506l38935K95617Q5494k50571J59555L76368l65263
$$ plain form
11076 224984 420488 254579 322604 151878 102887 263381 311691 76566 -20679 341249
11065 351523 464742 536517 139078 816555 263936 690728 362459 785860 384491 640734
11055 640734 546280 681859 692200 732937 630825 999754 670490 601432 815665 854707
11045 854707 454540 468747 948539 728947 887916 756256 561723 754089 949020 833613
11035 833613 704165 769408 419194 632907 745001 917245 567306 988518 516737 740792
11025 740792 409349 961238 1003864 417033 618457 766499 558418 645859 708996 702008
11015 702008 578155 698136 612074 793233 564422 667192 772300 543467 581228 751518
11005 751518 667861 690800 721306 382371 677988 763482 512911 672466 1048834 683571
10995F83571K4944K79629m75317J27901K45331K49473m13015K3402M6881R8028
10985H90828j89612L10212K88045k36742J34474L48795k17534M48199q6917K43550
10975A933298o3967P30667l13348K08037N52518K5795J20709p6310m62105m3903
10965B611391j64943j03024l55481k99853m7973L65275j64695r2008P5477k5643
10955A798523k77148O6183k49968Q9277m65751O0915l45551j67008j56117K86425
10945F39780k68142L32301k82582J13739e2496B7973J93657r6200J23580I0726
10934C59839a34042B49849C9240a20563j02803a6225j30132f9533B19600I0673
10923a73264E3511b3618h745j50742D99563C6342i3863k1781A37125b00251A45457
$$ plain form
10995 683571 708515 988144 512827 640728 886059 1135532 722517 745919 792800 890828
10985 890828 701216 1011428 1299473 1062731 1197205 1546000 1328466 1776665 1689748 1933298
10975 1933298 1869331 2599998 2286650 2494687 3047205 3073000 3193709 3117399 2655294 2611391
10965 2611391 2446448 2343424 1987943 1688090 1640117 2005392 1840697 1748689 1824166 1798523
10955 1798523 1521375 1587558 1337590 1426867 961116 1022031 676480 509472 353355 639780
10945 639780 371638 703939 421357 535096 -52496 27973 221630 125430 249010 90726
10934 359839 -134042 249849 39240 -120563 -223366 -16225 -146357 -69533 219600 90673
10923 -173264 53511 -23618 -8745 -159487 499563 36342 -93863 -115644 137125 -200251 145457
10911A04061a51108J6389a616A20344e6112j86545B25487H7623B8836J37557m7857
10900A18536A1892a72934N7933H1292A9306J80614a42294k05595R9355A31399
10889a32164f0186j5484G0299a67822j29400C3844b2888B47612a68599o9470H2456
10877b00262O5739j32369a29463B8464J00522j646b135B79729c47559f535j55001
10866a61536i945B13355b53824A06434B5765l06K29852a1659E1986e8882A69565
10854e1769C9623b1696j282C3503g0374A42384M2376b97324Q1687n3861c8450
10842A04136a62948D1196a88837N0931j27836A33245d5694j61478C26419a95321
10831A78576L1753a19704A18394D8445J97002I1399m2438d8097B90950r9185a57685
$$ plain form
10911 104061 -151108 -134719 -1616 120344 -56112 -242657 225487 87623 28836 166393 118536
10900 118536 11892 -172934 -115001 81292 19306 199920 -142294 -347889 -248534 131399
10889 -132164 -60186 -75670 70299 -167822 -297222 33844 -22888 247612 -168599 -238069 82456
10877 -200262 -134523 -266892 -129463 28464 128986 127340 -2135 279729 -347559 -6535 -161536
10866 -161536 -9945 213355 -253824 106434 25765 25459 255311 -11659 51986 -58882 169565
10854 -51769 39623 -21696 -22978 33503 -70374 142384 184760 -297324 -215637 -269498 -38450
10842 104136 -162948 41196 -188837 -137906 -265742 133245 -45694 -207172 326419 -195321
10831 178576 210329 -119704 118394 48445 245447 91399 48961 -48097 290950 191765 -157685
10819f9714j40385j23368b8099B5139c04934A75954a95731G6009g5749K7815D80659
10807b2536N991H6510B5039j2514a51794m078d8234A77048J79820A3209J06895
10796A20104n0759O9464a67455O7890p6859A46264N5514c9184A49614b61696A32356
10784B44055e7144D0875J9710O0552b29234A39487R1041E9472J2841a05848r451
10773a15299m39222a11155a6445o330C9131a46259n7522B2350J31837a37188O2696
10762g4492A44638K0345m9478a04526m9872j33170c5398A29324e2184O43I8649
10750e3568J2132D02173n2365c22183b6022n8255k03221A63259f7142D3373R1418
10739A34791a86889A19875J7452B8864a55318H9979f3284j08303p413O8916A45193
$$ plain form
10819 -69714 -210099 -333467 -28099 25139 -304934 175954 -195731 76009 -75749 -47934 480659
10807 -22536 -16545 86510 25039 12525 -151794 -155872 -48234 177048 356868 13209 120104
10796 120104 69345 138809 -167455 -99565 -176424 146264 201778 -39184 149614 -261696 132356
10784 244055 -57144 40875 60585 121137 -229234 139487 230528 59472 72313 -105848 -115299
10773 -115299 -554521 -111155 -16445 -22775 39131 -146259 -203781 22350 154187 -137188 -74492
10762 -74492 144638 164983 115505 -104526 -154398 -287568 -35398 129324 -52184 -51541 98649
10750 -53568 -41436 402173 349808 -322183 -26022 -84277 -287498 163259 -67142 43373 134791
10739 134791 -186889 119875 137327 28864 -155318 89979 -63284 -171587 -179000 -110084 145193
10727A29958n1536g8551k014n0271A04722k8240a63435M5005k98017C7462c31085
10715a11759A5324a54139L9491e5706B49249p2448d020A61776e4401k33642J37301
10704a50742A16820b22616J05938A4782K07338c66479A89045a31808j21760F311
10693A34564p393j6820h5073j9971k08763C6716e9365J9570i613j49811A7796
10681d2395j69933j0351a11144k2719j76253b9038A19120J05849d71091B33388
10670b35711c9556r565j48835r495M6563L6357m0252F1867a92733B67383b11315
10658B28976C0473J18766J09606h054j17861A01899b21343j4307g2937r5109E5193
10646b61345f0919F0591l786b93439f9545j2078H9680J71621j04714b01674N0503
$$ plain form
10727 129958 78422 -78551 -80565 -130836 104722 76482 -163435 -118430 -416447 37462 -331085
10715 -111759 15324 -154139 -114648 -55706 249249 176801 -4020 161776 -54401 -288043 -150742
10704 -150742 116820 -222616 -116678 14782 222120 -366479 189045 -131808 -253568 6311
10693 134564 127171 110351 -85073 -105044 -313807 36716 -59365 -39795 -9613 -159424 17796
10681 -42395 -212328 -222679 -111144 -133863 -310116 -29038 119120 224969 -471091 233388
10670 -235711 -39556 -49121 -197956 -207451 -160888 -124531 -164783 61867 -192733 267383 -211315
10658 228976 30473 149239 258845 -8054 -125915 101899 -221343 -235650 -72937 -168046 55193
10646 -261345 -60919 60591 56805 -293439 -69545 -81623 89680 261301 156587 -201674 -151171
10635a51171j06428P0772B24662f7568o7102n8931h1668h368j73484J2707L5187
10624a33958r6645g9048j78494A87252q7492c21372E590L15988j50855E6049J63504
10613B19553B1915e5824j0628n1048l2719B50441m7346i2121r8737D1706a61570
10601C6097K40168e9598j49851e4143j13168G025Q2810b10038k9392a10575A2317
10589B77969G2021J03829a49634j99270A09494J43466N2945b14366L2441j701
10579a83626E0465b5886p5053n7183f2033i755B90127A4452c13985g3985j6436
10568i0421a2803H8372l0485J1482J19413J07290a05236l3593D2866b4255k0916
10557d5171q4991I6027a27948i702j61030O4310j28814E6496b95281J31651G5456
$$ plain form
10635 -151171 -257599 -186827 224662 -67568 -134670 -193601 -81668 -8368 -181852 -169145 -133958
10624 -133958 -230603 -79048 -257542 187252 99760 -321372 5590 321578 170723 56049 219553
10613 219553 21915 -55824 -66452 -117500 -150219 250441 203095 -92121 -190858 41706 -161570
10601 36097 276265 -59598 -209449 -54143 -167311 7025 89835 -210038 -239430 -110575 12317
10589 277969 72021 175850 -149634 -348904 109494 252960 305905 -214366 -181925 -183626
10579 -183626 50465 -25886 -100939 -158122 -62033 -9755 290127 14452 -313985 -73985 -90421
10568 -90421 -12803 88372 57887 69369 188782 296072 -105236 -138829 42866 -24255 -45171
10557 -45171 -130162 96027 -127948 -9702 -170732 -106422 -235236 56496 -295281 -163630 75456
10545a83316j3295A349K09986b36686b5823A64085J731f4481k7914q3660j12723
10534b88778A80075o0486c94686A9343J3536j1416J78078E7597i1862A83075a25979
10522a8948r2506C06613A49241a48242M5325A13029C5543L7369a5439m2166k1478
10511g9083r6830c0094F555c27113f4655B95292H888O8980a93403A09506C9136
10499a03578r611K2573B52028o9052g7299F9372b07426l6590A13896b11478h6113
10487B29590B7738a4020B9447b51711B50496d2215A31841L93925j72162R861j70305
10476A93160p0695k2182b878G6587L99398b00042E071a81925j75680G997J11260
10465A19257a29787E0558b491A99976a41009j9291p1055R1284j24987I1147m3910
$$ plain form
10545 -183316 -196611 1349 211335 -236686 -25823 164085 165816 -64481 -92395 -176055 -288778
10534 -288778 180075 119589 -394686 19343 32879 21463 199541 57597 -91862 183075 -125979
10522 -18948 -111454 306613 149241 -148242 -102917 113029 35543 72912 -15439 -57605 -79083
10511 -79083 -175913 -30094 6555 -327113 -64655 295292 8888 77868 -193403 109506 39136
10499 -103578 -113189 -90616 252028 182976 -77299 69372 -207426 -244016 113896 -211478 -86113
10487 229590 27738 -14020 29447 -251711 250496 -42215 131841 525766 353604 363465 193160
10476 193160 122465 100283 -2878 76587 475985 -200042 5071 -181925 -357605 7997 119257
10465 119257 -129787 50558 -2491 199976 -141009 -160300 -231355 -140071 -265058 91147 47237
10454D7237e05j83151j22q1299M0984A4258a17994B53261j16473n9395d4219F3914
10441i1150r1009C4172L00886C4344J58121l1742A0866J75249p3456B1341a42847
10429a12540H3241J65296g2051m3108H0498b82225A16a89531G646a15751j12323
10418b28074C18661G3671O0877j6257k4758K8249f9442B28152C6791h9779E9942
10406h7224A5159J256K24065L1581a89060L4550c6300l42418e7225n6343c9778
10394a57477B33613r8827N8262F7323L20859A48470R1453H5821J67592E8852d7714
10382A69174L2676d612C75748A62670j1623k4854Q8962Q7087A35280Q3440A6234
10370h89D22153j04280l4300L00925j5183B65260K7085J58764m4752n1530J3478
$$ plain form
10454 47237 -505 -183656 -183778 -265077 -224093 14258 -117994 253261 136788 77393 -44219 63914
10441 -91150 -182159 34172 335058 34344 192465 160723 10866 186115 112659 21341 -142847
10429 -112540 83241 248537 -72051 -115159 80498 -282225 116 -189531 7646 -115751 -228074
10418 -228074 318661 73671 134548 118291 93533 121782 -69442 228152 36791 -89779 59942
10406 -87224 15159 16415 240480 272061 -189060 -154510 -36300 -378718 -57225 -113568 -39778
10394 -157477 233613 134786 193048 67323 388182 148470 239923 85821 253413 58852 -47714
10382 169174 201850 -4612 375748 162670 151047 126193 215155 302242 135280 218720 16234
10370 -889 422153 317873 283573 584498 569315 265260 292345 451109 406357 354827 368305
10359C68305A59122J75631M9381F1130N294J33308O5534L15380j69268R4653m6089
10348D59942K4777k03744K57286j19440j8822P9081K9953j90172C3304J63392
10338A96696j7683E5658J06962B1124N61337F9426k7965b7579A11705J99119a1537
10326C40048a33806a7319A37947m336J82085J534n8359A10437l2560c852m7185
10315e1037J4332l2949l9790d430A61613G6383a08071R917r810j12536q4921G9172
10302G466a8609A42783M3168d0301j464k775F254N8749Q5093F1372h4810n2731
10290a37541f0485B31703J3700n7501B88P9846i8327A73660G2023P348b79885
10278b108p4357j13527Q9331k3132j169l7991p1830B73683F5948J6774b68992
$$ plain form
10359 368305 159122 334753 384134 61130 66424 199732 265266 580646 411378 506031 459942
10348 459942 484719 280975 538261 418821 399999 479080 509033 318861 33304 196696
10338 196696 179013 55658 162620 21124 582461 69426 41461 -27579 111705 310824 -11537
10326 340048 -133806 -17319 137947 133611 315696 317230 258871 110437 77877 -3852 -51037
10315 -51037 -36705 -69654 -109444 -4430 161613 76383 -108071 -98154 -107964 -220500 -305421 79172
10302 7466 -18609 142783 185951 -40301 -41765 -44540 6254 65003 150096 61372 -84810 -137541
10290 -137541 -60485 231703 245403 187902 288 80134 -98327 173660 72023 79371 -279885
10278 -2108 -76465 -189992 -100661 -123793 -124962 -162953 -234783 273683 65948 82722 -268992
10266b8080I4223J86534H9901c86166h1126A90039j2596Q6822R9724J03970B11371
10254F5917L22261A46417J55475C9396g2298m6941A74508b7510j37733A78243
10243a82052l01520A59280E5304c05j83869r7541k9025D5157b8101B17127b26500
10231C54274c40476a47739P1468C5762b08858h7827A40812b74867H788f1604B31795
10219g0506B8686O6822b78581J06392O0282K0862n0493A59226b57675a02885a6434
10207a17541L8177J6819p7392k23542B3282a69491d6547E9828f0196K3188d989
10195H2001a78434c439k95905a20609A33556a96059M8730A53420J35479a25590
10184b80629a08487I0742a7563A25863a78746a47m8826a6064m75389G8220a51154
$$ plain form
10266 -28080 94223 280757 89901 -386166 -81126 190039 177443 264265 363989 467959 211371
10254 65917 388178 146417 301892 39396 -72298 -119239 174508 -27510 -165243 178243
10243 -182052 -483572 159280 55304 -305 -184174 -281715 -310740 45157 -28101 217127 -226500
10231 354274 -340476 -147739 -76271 35762 -208858 -87827 140812 -274867 8788 -61604 231795
10219 -70506 28686 95508 -278581 -172189 -111907 -91045 -141538 159226 -257675 -102885 -16434
10207 -117541 -79364 -62545 -139937 -363479 23282 -169491 -46547 59828 -60196 -37008 -4989
10195 82001 -178434 -3439 -299344 -120609 133556 -196059 -147329 153420 288899 -125590
10184 -280629 -108487 90742 -17563 125863 -178746 -147 -48973 -16064 -491453 78220 -151154
10172C45084h4840J7238n346J6185A42429c5769j10315A55512A7467b16106k43527
10161d59633J84195a2585k07424H40a35189n7854b0902j07766C129h2453C52404
10149H8585a39996N221K2928j32289j45686C4505a73533k1096C0114N1373b64125
10137a60397K8330d1090k38749F7390b40764C4740h4409m5428j5874M7070A25045
10125i3341A88170a26532c5613l80627a24840G1692d0039A26594J36009a38426
10114d03334G0987K32698b28403b6968j75664F7833a54857N1999Q202A35874a10220
10102b97156N6033e8362H9434B0721Q2479a62204L4577A83284b52795j65875b312
10090B13583a58217b0380k8196k09879q8375c1555O512A0010g7048J1900m5378
$$ plain form
10172 345084 -84840 -67602 -72948 -56763 142429 -35769 -146084 155512 17467 -216106 -459633
10161 -459633 -275438 -12585 -220009 840 -135189 -193043 -20902 -128668 3129 -82453 352404
10149 88585 -139996 -134775 -111847 -244136 -389822 34505 -173533 -194629 30114 81487 -264125
10137 -160397 -132067 -41090 -279839 67390 -240764 34740 -84409 -129837 -145711 -98641 125045
10125 -93341 188170 -126532 -35613 -416240 -124840 71692 -40039 126594 262603 -138426
10114 -403334 70987 303685 -228403 -26968 -202632 67833 -154857 -102858 -94656 135874 -110220
10102 -297156 -241123 -58362 89434 20721 103200 -162204 -127627 183284 -252795 -418670 -2312
10090 213583 -158217 -20380 -48576 -258455 -346830 -31555 -25043 10010 -77048 -65148 -110526
10079a10526K1224r0908A009J44190D3157b26354A58786B455J79074a83681Q4635
10068i9046k42147B1303J92728c35976h9820o0693o2087j01B70008A18075L8865
10057A56940h1174j25593A93246b14575A11875a51106j19395J5197P7197C12187
10046h7561l6148D0519L1494a238j52748p4961f5677A11492b19063j57432b2916
10034B11674b55798M303a14359K9818l2078L175L596c9818l5240n823K9960A6196
10021e0104k32487b7229j07344A21908f4808I8012a22577G1318d31282F3651J11135
10010A74786p9107a50743e0246Q671j61152j59049G483b71341g1601j11679A62316
9998F59a22822N5837E6482i5890k32622b505A53807N42o7822J11862k3703c06073
$$ plain form
10079 -110526 -89302 -180210 1009 145199 43157 -226354 158786 2455 181529 -183681 -99046
10068 -99046 -341193 21303 214031 -335976 -89820 -150513 -212600 -212701 270008 118075 156940
10057 156940 -81174 -206767 193246 -214575 111875 -151106 -270501 -255304 -178107 312187
10046 -87561 -123709 40519 72013 -1238 -153986 -228947 -65677 111492 -219063 -376495 -22916
10034 211674 -255798 -251495 -114359 -84541 -116619 -113444 -109848 -39818 -75058 -80881 -50921 16196
10021 -50104 -282591 -27229 -134573 121908 -64808 98012 -122577 71318 -431282 63651 174786
10010 174786 95679 -150743 -50246 -41575 -202727 -361776 7483 -271341 -71601 -183280 162316
9998 659 -122822 -66985 56482 -95890 -328512 -2505 153807 154349 86527 198389 174686 -306073
9985B56720i5635r1173n3411G125b0805A10398h3101E0088a10022l5521I2225
9973a78084A15013a05764p1986l9848e3212E1590a13792C556b18526o653B30982
9961A37237g5298I7142c2904m03247g6353A59019a38605M7802o8180O1537C25799
9949G1180b03859h6548b9912j80335R6423j27760j3965M6384Q1458A72112k7442
9938A44670b12477b5957j05777H8177a82337E5065b23046A21471j3793d29855
9927a35024n71A60683a2616B5449a42273I0883b71750l2913a34976e7269A58248
9915i9089j69620a33321A07167a23298j20823a1638A96275a98709G6771c7387
9904a10739H054c63604J77990j62904A14810d15727E821b63478A41767b05214
$$ plain form
9985 256720 -95635 -186808 -240219 7125 -20805 110398 -83101 50088 -110022 -145543 92225
9973 -178084 115013 -105764 -177750 -217598 -53212 51590 -113792 3556 -218526 -225179 230982
9961 137237 -75298 97142 -32904 -436151 -76353 159019 -138605 -90803 -158983 -97446 325799
9949 71180 -203859 -86548 -29912 -210247 -113824 -241584 -255549 -209165 -127707 172112 144670
9938 144670 -212477 -25957 -131734 88177 -182337 55065 -223046 121471 107678 -429855
9927 -135024 -135595 160683 -12616 25449 -142273 90883 -271750 -304663 -134976 -57269 158248
9915 -99089 -268709 -133321 107167 -123298 -244121 -11638 196275 -198709 76771 -37387
9904 -110739 8054 -363604 -185614 -348518 114810 -415727 5821 -263478 141767 -205214
9893I0510K02124A01091m4260a76902g8794l3055k27864a09165M0926N512j34932
9882a97659N9715A30567a93280m0196E4879a98603A47073C153a59422M7832q2892
9871a94482j40962B83974a46723B02003b9691r288j01758I0470a13185A73276
9860A18269f6386A09815b35684i0075I223Q3213e452A92560b11597a00533C33565
9848d39701E7239J45487d9300D2798J98862a77533K4623l7448A41539L97g8321
9836D4980R3371d4920k9746c5952j5702a4101D4738c49396d3358k3219q0913B451
9823b82298i4935B40411c9522j37813j5499A58231J12202C3487R674Q5638i995
9811b4424B64868a10939F6436c77097a3607m572l23180J27950n523i425j65362
$$ plain form
9893 90510 292634 101091 56831 -176902 -78794 -111849 -339713 -109165 -68239 -62727 -197659
9882 -197659 -137944 130567 -193280 -233476 54879 -198603 147073 3153 -159422 -111590 -194482
9871 -194482 -335444 283974 -146723 202003 -29691 -38979 -140737 90470 -113185 173276
9860 118269 -66386 109815 -235684 -90075 9223 92436 -5452 192560 -211597 -100533 333565
9848 -439701 57239 202726 -49300 42798 241660 -177533 -152910 -190358 141539 141936 -78321
9836 44980 138351 -44920 -74666 -35952 -51654 -14101 44738 -349396 -43358 -66577 -147490 2451
9823 -282298 -94935 240411 -39522 -177335 -192834 158231 270433 33487 43161 128799 -9995
9811 -24424 264868 -110939 66436 -377097 -13607 -18179 -341359 -213409 -218932 -9425 -174787
9800a74787a1248j5233F7574d18477I5631a72458D1543j2364d4297k41157J15729
9789a69725a9125F7448a35375A86997c02065E9615b47681L0329J06246E0689a27014
9777A28586i9797j2583A21275Q8568a21788B7563b39930O8820f6050J7505Q659
9766c9886m6232j03818P6824j22202N1376Q3555l63723b17821j97747a39756j93222
9755c32978a01238j3548A97983a61080g197A06564a07982c9404D00080a83728
9744a00021B70987b85938H0328d76136b18802A67850c1178n5849I7544a38638
9733d42551A07036k6249a42507j23694h3527m65944d0900B36697a74550j60355
9723c34905I4728a19583k05714J25176A27306a13455k68128J61594j7931A31699
$$ plain form
9800 -174787 -11248 -26481 67574 -418477 95631 -172458 41543 29179 -44297 -285454 -169725
9789 -169725 -19125 67448 -135375 186997 -302065 59615 -247681 -217352 -111106 50689 -127014
9777 128586 -99797 -112380 121275 209843 -121788 27563 -239930 -171110 -66050 -48545 -39886
9766 -39886 -86118 -189936 -113112 -235314 -183938 -100383 -464106 -217821 -415568 -139756 -332978
9755 -332978 -101238 -114786 197983 -161080 -7197 106564 -107982 -39404 400080 -183728
9744 -100021 270987 -285938 80328 -476136 -218802 167850 -31178 -87027 97544 -138638
9733 -442551 107036 80787 -142507 -266201 -83527 -549471 -40900 236697 -174550 -334905
9723 -334905 94728 -119583 -325297 -200121 127306 -113455 -381583 -219989 -237920 131699
9712a49266a6804k9604A7846M5883a65674h254A12904K88076b64151E1122a52734
9700b70153J17554k42393J67691f8465b9869q2059E8953a18590L1480G0855b81254
9688d6873m5742b3709B3863J68549c04713J48193m6503A67519F2170a7336B02401
9676I2307b8525j16160D9184A2626a06685A92207q2965a33338E6302g6403j55432
9665b31835q4316G8553b63571J30081c3024k56393E0808a52350c7307j14695B8732
9653F1592b97571e802A3627J67525e7368a6605m3864o2863m166m35131a8639A29049
9640a14417k09525a49574F8337j5745a40623M0551j23088A10667b19753d7111
9629F5122c8010j18739A6700i1471b1663q2797K5760j98624A96164j7411b02642
$$ plain form
9712 -149266 -16804 -46408 17846 63729 -165674 -8254 112904 400980 -264151 51122 -152734
9700 -270153 -152599 -394992 -227301 -68465 -29869 -111928 58953 -118590 -87110 70855 -281254
9688 -46873 -92615 -23709 23863 192412 -304713 -156520 -203023 167519 62170 -17336 202401
9676 92307 -28525 -144685 49184 12626 -106685 192207 109242 -133338 56302 -76403 -231835
9665 -231835 -316151 78553 -263571 -133490 -33024 -289417 50808 -152350 -37307 -152002 28732
9653 61592 -297571 -5802 13627 181152 -57368 -16605 -60469 -123332 -127498 -562629 -18639 129049
9640 -114417 -323942 -149574 68337 52592 -140623 -100072 -223160 110667 -219753 -47111
9629 65122 -38010 -156749 16700 -91471 -21663 -104460 -78700 -277324 196164 178753 -202642
9617A83598a68091K8318B87483a73605A91518E5852J59527E1757J84341a13816
9606d9683p8893A14414J05194m656I095b02183d2713A35260b83048A23304a8837
9594F015a62148A8061c64679a77956c685l32220e4670k1928j71079J18067K1378
9583a08232A54604b41942R1254A03968g2198B3242b1776D0503a23509l71821J31758
9572c63572a66496A25186Q3376b69113r6423J69379i600j70183D313a11583c8017
9560a91066n1587I6050i4811k1373j4349b4123A8367e0247B02013d85660L5662
9549d49998A83748d00599a16462B01597c26386A93610a23064c1910B42817c62417
9538C4808L1316b11078f0933I1026a33643O1237j13588B46730a46526A9590J7060
$$ plain form
9617 183598 -168091 -139773 287483 -173605 191518 55852 215379 51757 236098 -113816
9606 -49683 -128576 114414 219608 214952 9095 -202183 -42713 135260 -283048 123304 -18837
9594 6015 -162148 18061 -364679 -177956 -3685 -335905 -54670 -76598 -247677 -129610 -108232
9583 -108232 154604 -241942 -150688 103968 -72198 23242 -21776 40503 -123509 -495330 -363572
9572 -363572 -166496 125186 208562 -269113 -365536 -196157 -9600 -179783 4313 -111583 -38017
9560 -191066 -242653 96050 -94811 -116184 -130533 -24123 18367 -50247 202013 -485660 -449998
9549 -449998 183748 -400599 -116462 201597 -326386 193610 -123064 -31910 242817 -362417
9538 34808 66124 -211078 -60933 91026 -133643 -72406 -185994 246730 -146526 19590 36650
9527C6650g6775j47038h6960a5217B69936a3157n3418B7075a92618k5490e9084
9515a74414Q3625I035O301J76317H996L7502b18506N7281j71843A42364P585d97667
9502D7504R1109k3788C9496b91004A10972b52396B5051L01008e1432j19575L6858
9491a34149d1671q4817n9664a9773l6009j61066F8304N8175e916C0844a92157
9479h5643A4536b92617J38816C89647H5410P278J58914j01951a12404B39312a33696
9467a57972k29470E6306b46677H2330g9403A33306c43884c7075H7561m2751P3448
9456A18258H078A682c76799G0183g7844L1303K1121E5091K07976A04106b31766
9444A15989h0503j24919j23424L8837R0302E5616a40688E3222a56113d6702A5798
$$ plain form
9527 36650 -76775 -223813 -86960 -15217 269936 -13157 -66575 27075 -192618 -218108 -59084
9515 -174414 -90789 9035 15336 191653 8996 46498 -218506 -161225 -333068 142364 149949 -497667
9502 47504 138613 114825 39496 -291004 110972 -252396 25051 326059 -51432 -171007 -134149
9491 -134149 -41671 -126488 -186152 -19773 -55782 -216848 68304 126479 -5916 30844 -192157
9479 -85643 14536 -292617 -153801 389647 85410 92688 251602 149651 -112404 239312 -133696
9467 -157972 -387442 56306 -246677 82330 -79403 133306 -343884 -37075 87561 44810 118258
9456 118258 8078 1682 -376799 70183 -77844 -46541 -25420 55091 263067 104106 -231766
9444 115989 -80503 -205422 -328846 -290009 -199707 55616 -140688 53222 -156113 -46702 15798
9432A44972i6020p4444A19600b00944A53644c3142C6376J67323a25195B15806
9421E0251a02189L3842k59575i4454j0350o2967C48344b01314D6510c15267A83093
9409A55582e4389l90520N2856h1765D3950b96506a39201N188l3853R929B03356
9397c7577j34748l11566F3063c73386g4763a0072q4668q5669q9219R1281d1387
9385A6300b12124A17652K00184A40563j182J05178I81M9257b43024A44951a07178
9373a21814j24982J05257i454j60379j33843c4895o5012A54368a90167g7750J0300
9362f7450F3723k6024e9245j29771d0142A18459B04c29548J30989j22379e7552
9350g4776H7128K1840I830b54825J4703h8368j03733F0384c862j15057B36894
$$ plain form
9432 144972 -96020 -170464 119600 -200944 153644 -33142 36376 203699 -125195 215806
9421 50251 -102189 -68347 -327922 -94454 -104804 -167771 348344 -201314 46510 -315267 183093
9409 155582 -54389 -444909 -392053 -81765 43950 -296506 -139201 -134013 -167866 -157937 203356
9397 -37577 -172325 -483891 63063 -373386 -74763 -10072 -94740 -180409 -269628 -178347 -41387
9385 16300 -212124 117652 317836 140563 139381 244559 981 50238 -243024 144951 -107178
9373 -121814 -246796 -141539 -9454 -169833 -303676 -34895 -99907 154368 -190167 -77750 -67450
9362 -67450 63723 37699 -59245 -189016 -40142 118459 204 -329548 -198559 -320938 -57552
9350 -74776 87128 108968 9830 -254825 -240122 -88368 -192101 60384 -3862 -118919 236894
9338B00929c68099h5336D0634j9761O9873m2554J34873g3685j79706g6263n1753
9327a28016B0746K60780A23742i3350H0070L5185e0232l08594g0300G8984a41748
9315e0906j03816O0321B7472a76495j04431I0747a98531B6927K50371a25784O0828
9304f4956j08777f4516B4439J02278J24445j6547P0293b52585b0371B04838a7481
9292b51489k1129d6588j38818d7065j21270B15439F9245i2472B98175A24556a98258
9280a30492C8277a23720A46642i4257D9158d39021b6374l43968i1509a8128j33972
9269a52100b8856k39108O8453j09649J04846P6066r8162c2084m7756o0483K5086
9258a15237j53515a11464E739c42427b1315A45477c26247a43514f220k07227A64343
$$ plain form
9338 200929 -368099 -85336 40634 20873 90746 48192 183065 -73685 -253391 -76263 -128016
9327 -128016 20746 281526 123742 -93350 80070 115255 -50232 -358826 -70300 78984 -141748
9315 -50906 -154722 -94401 27472 -176495 -280926 90747 -198531 26927 277298 -125784 -64956
9304 -64956 -173733 -64516 24439 126717 251162 234615 304908 -252585 -20371 204838 -17481
9292 -251489 -272618 -46588 -185406 -47065 -168335 215439 69245 -92472 298175 124556 -198258
9280 -130492 38277 -123720 146642 -94257 49158 -439021 -26374 -370342 -91509 -18128 -152100
9269 -152100 -28856 -267964 -199511 -309160 -204314 -128248 -226410 -32084 -79840 -140323 -115237
9258 -115237 -268752 -111464 5739 -342427 -21315 145477 -326247 -143514 -6220 -213447 164343
9246f2738G9055i8544k48997a54609e9342A48409a86976A78055m6602J87385H3729
9234B01220b97272b0232n0512k7743J283B7289a2014p3739j08084b4572k3942
9223d8514A62638h3044K0090A27903a73790G050b8022A02536M7283N8572b60699
9211b32866O9466m8229d5125j26157D4004m709f2057J2201N820J1633j80203A25325
9198G6097I387a52161K8394r9603B71881b27192h5851a1713k44462e5488B97218
9186c44618C28793b95853h6840b0495j79972A3836a59924g0076A06850l1612n245
9175F9993d12523e038r0366k21294J39061k6352B47365a8445k88337D8034a79112
9163F2994G055a73960A69103a19461A17956a0992H0619f5790A83328c94686A9573
$$ plain form
9246 -62738 79055 -98544 -347541 -154609 -59342 148409 -186976 178055 131453 318838 83729
9234 201220 -297272 -20232 -70744 -98487 -97204 27289 -12014 -85753 -193837 -24572 -48514
9223 -48514 162638 -83044 -62954 127903 -173790 7050 -28022 102536 149819 208391 -260699
9211 -232866 -163400 -211629 -45125 -171282 44004 39295 -62057 -49856 -44036 -32403 -212606 125325
9198 76097 9387 -152161 -123767 -223370 271881 -227192 -85851 -11713 -256175 -55488 297218
9186 -344618 328793 -295853 -86840 -20495 -200467 13836 -159924 -70076 106850 75238 69993
9175 69993 -412523 -5038 -95404 -316698 -177637 -203989 247365 -18445 -306782 48034 -179112
9163 62994 7055 -173960 169103 -119461 117956 -10992 80619 -65790 183328 -394686 19573
9151G0763a91587A98423e9424j11988K5546l58553a56814E3279a13163J2770c9749
9139i5510j6890A84324a24005n5393J190c3173Q1k01176j09937e2273l2367A9221
9126A08642A207a93957C37709f5630k70816C37380j57926a33906k0321A21026
9115A00526i6503j18486f0235n7616j34379r5116C90826C3577a55394e5543D3823
9103G8795a83692q178e5838o9871j81184c2125B97477h7415E2407a44911C22303
9091a53345P662j09049J609n5804a16296d3278F3255L5266a77224m9943b0188
9079a41333d3779B5126K9301h5739N133O29L1671j46626D95025A20047a02879
9067G1943d8973C24538b93868J03752J9702a7640q8996M2612k0433A8799K07760
$$ plain form
9151 70763 -191587 198423 -59424 -171412 -145866 -504419 -156814 53279 -113163 -100393 -39749
9139 -95510 -112400 184324 -124005 -179398 -178208 -33173 -33092 -234268 -344205 -52273 -84640 19221
9126 108642 1207 -193957 337709 -65630 -336446 337380 179454 -133906 -154227 121026
9115 100526 -96503 -214989 -60235 -117851 -252230 -347346 390826 33577 -155394 -55543 43823
9103 78795 -183692 -191870 -55838 -125709 -306893 -32125 297477 -87415 52407 -144911 322303
9091 -153345 -145683 -254732 -253123 -308927 -116296 -43278 63255 98521 -177224 -227167 -20188
9079 -141333 -43779 25126 54427 -85739 -80606 -79977 -48306 -194932 495025 120047 -102879
9067 71943 -48973 324538 -293868 -190116 -170414 -17640 -106636 -64024 -84457 18799 226559
9056B26559E1946J76302H1527J58493f8483B42425b0217B03792b28898A7151O8183
9045H5334J60319j14675a20145p0859c5614j15275c0747C65479I3149b8958j209
9034c0167A40669N1706H5624c4881j32494a5933A5109a14722J6821j51096J23711
9023a25286k6154l6951j21515J01130d5471n40868a38946j28903J21116j8239
9013a64972g1058o7653k20731J07802e8243A85138I0525d86222d6418A34781l2758
9002A02023P697J5746a57822F6395a10340k19204f25E4507a65926j17854a35437
8990a84383F8734D201Q1250g4652I6078B2574f0362a4049A010i224A9979J42114
8978A62093h5668j43777Q7581C70929a49645p4987E8606B5292R1505a02468k30068
$$ plain form
9056 226559 51946 228248 81527 240020 -68483 242425 -20217 203792 -228898 17151 85334
9045 85334 245653 130978 -120145 -191004 -35614 -150889 -30747 365479 93149 -28958 -30167
9034 -30167 140669 192375 85624 -34881 -167375 -15933 15109 -114722 -97901 -248997 -125286
9023 -125286 -151440 -188391 -309906 -208776 -45471 -586339 -138946 -267849 -146733 -164972
9013 -164972 -71058 -138711 -359442 -251640 -58243 185138 90525 -486222 -46418 134781 102023
9002 102023 109720 125466 -157822 66395 -110340 -329544 -625 54507 -165926 -283780 -135437
8990 -184383 68734 4201 85451 -74652 96078 22574 -60362 -14049 1010 -9224 19979 162093
8978 162093 -85668 -229445 -141864 370929 -149645 -224632 58606 25292 116797 -102468 -332536
8967c32536d8811A46312a9156B55504C8492g5885j30210O6308q6666A05298b56368
8955h2536j73829a09845A16151m0739a42829E9423f528k01613D47507h6600A91165
8943b15963j69237P1610a14990B2362J35736b01432h8089H5758o655K82208k0456
8932C40855h5927B29774b2435l50955i7756A3586M61697j60928N95485J846611
8922B756451Q172384L409370F371556k638956j819229G34155J2955j08468E4864
8912A88098f3765A9909J91109C8884O80785B15412B6505d5170r4673N1970H8246
8900B55796h7672B20003d3327m22461C94707b14724O2275e7207k41061c7593A4059
8888a73104a7646C5172J97979h59j44301A03576a37981A5533a77426G7919b71591
$$ plain form
8967 -332536 -48811 146312 -19156 255504 38492 -75885 -206095 -139787 -226453 105298 -256368
8955 -82536 -256365 -109845 116151 75412 -142829 59423 -6528 -208141 447507 -86600 191165
8943 -215963 -385200 -313590 -114990 22362 158098 -201432 -88089 85758 79103 361311 340855
8932 340855 -85927 229774 -22435 -373390 -97756 13586 475283 314355 909840 2756451
8922 2756451 10928835 14338205 6371556 3732600 1913371 734155 747110 638642 54864
8912 188098 -63765 19909 211018 38884 719669 215412 26505 -45170 -139843 -87873 88246
8900 255796 -87672 220003 -43327 -465788 394707 -214724 -152449 -57207 -298268 -37593 14059
8888 -173104 -17646 35172 233151 -859 -145160 103576 -137981 15533 -177426 77919 -271591
8876e7963b3176r0467B40036F1876e4804j1006A55693C7209f6451K2657k59355
8865c03149a41004m7966k26393J15180b2046E8076R4936D9929P7147a64646B73231
8853a10001F4444b31391B56271c9805j31986C802a08619e3092B5823Q53J02931
8842A29607B1861a06823A29251d3754j4175H8872C4380b01108n6908A46775C4630
$$ plain form
8876 -57963 -23176 -113643 240036 61876 -54804 -65810 155693 37209 -66451 -43794 -303149
8865 -303149 -141004 -188970 -415363 -300183 -22046 58076 153012 49929 127076 -164646 273231
8853 -110001 64444 -231391 256271 -39805 -171791 3802 -108619 -53092 25823 26676 129607
8842 129607 21861 -106823 129251 -43754 -57929 88872 34380 -201108 -258016 146775 34630
$$ [...]
##END NTUPLES=NMR SPECTRUM
##END=
