##TITLE=AC1479_ZINDOMA305_8101045_lMus8BbtgM
##JCAMPDX= 6.0         $$ Bruker NMR JCAMP-DX V2.0
##DATA TYPE= NMR SPECTRUM
##DATA CLASS= NTUPLES
##ORIGIN= BRUKER
##OWNER= Administrator
$$ 1.72 TOPSPIN		Version 2.1
$$ 2013-08-15 18:16:12.337 -0700  Administrator@X
$$ Compression mode = diff/dup
##.OBSERVE FREQUENCY= 400.02188249412
##.OBSERVE NUCLEUS= ^1H
##.ACQUISITION MODE= SIMULTANEOUS (DQD)
##.ACQUISITION SCHEME= undefined
##.AVERAGES= 64
##.DIGITISER RES= 22
##SPECTROMETER/DATA SYSTEM= spect
##.PULSE SEQUENCE= noesygpps1d.comp
##.SOLVENT NAME= COFFEE_meoh
##.SHIFT REFERENCE= INTERNAL, COFFEE_meoh, 1, 14.96098
##AUDIT TRAIL= $$ (NUMBER, WHEN, WHO, WHERE, PROCESS, VERSION, WHAT)
$$ ##TITLE= Audit trail, TOPSPIN		Version 2.1
$$ ##JCAMPDX= 5.01
$$ ##ORIGIN= Bruker BioSpin GmbH
$$ ##OWNER= Administrator
$$ $$ E:\/data/COFFEE/nmr/AC1479_ZINDOMA305_8101045_lMus8BbtgM/22/pdata/1/auditp.txt
$$ ##AUDIT TRAIL=  $$ (NUMBER, WHEN, WHO, WHERE, PROCESS, VERSION, WHAT)
(   1,<2013-08-15 18:16:07.275 -0700>,<Administrator>,<X>,<go>,<TOPSPIN 2.1>,
      <created by zg
	started at 2013-08-15 18:04:37.150 -0700,
	POWCHK enabled, PULCHK disabled,
       configuration hash MD5:
       C8 4E 4E 5D D3 5C D8 9E 9F 52 82 E0 59 8A DE 15
       data hash MD5: 64K
       FE 9B ED F3 8E 13 85 55 3A D3 40 20 B0 0F 6D 09>)
(   2,<2013-08-15 18:16:10.244 -0700>,<Administrator>,<X>,<proc1d>,<TOPSPIN 2.1>,
      <Start of raw data processing
       efp LB = 0.3 FT_mod = 6 PKNL = 1 PHC0 = 0 PHC1 = 0 SI = 128K 
       data hash MD5: 128K
       FF 2F 59 FD EF B8 15 37 52 75 46 8E F3 72 07 30>)
(   3,<2013-08-15 18:16:11.244 -0700>,<Administrator>,<X>,<proc1d>,<TOPSPIN 2.1>,
      <pk PHC0 = -81.12854 PHC1 = 0 
       data hash MD5: 128K
       BB 01 7D B5 7B F4 41 BA 4F F9 05 AB A2 F8 37 C9>)
(   4,<2013-08-15 18:16:11.650 -0700>,<Administrator>,<X>,<proc1d>,<TOPSPIN 2.1>,
      <abs ABSG = 1 
       data hash MD5: 128K
       10 F9 E0 2A B0 05 58 85 F3 C5 E5 E4 86 66 11 1A>)
(   5,<2013-08-15 18:16:11.790 -0700>,<Administrator>,<X>,<proc1d>,<TOPSPIN 2.1>,
      <abs ABSG = 2 
       data hash MD5: 128K
       A5 F3 9A D6 BD 67 56 2F C3 C4 EA 5F AD F6 32 6A>)
(   6,<2013-08-15 18:16:11.884 -0700>,<Administrator>,<X>,<proc1d>,<TOPSPIN 2.1>,
      <abs ABSG = 3 
       data hash MD5: 128K
       EB B0 80 44 35 78 6A 3A 59 BC A4 70 6D 97 9F 84>)
(   7,<2013-08-15 18:16:12.025 -0700>,<Administrator>,<X>,<proc1d>,<TOPSPIN 2.1>,
      <abs ABSG = 4 
       data hash MD5: 128K
       A6 51 54 63 54 A5 19 6D FA 2F 7E DA B9 55 0F CD>)
(   8,<2013-08-15 18:16:12.103 -0700>,<Administrator>,<X>,<proc1d>,<TOPSPIN 2.1>,
      <abs ABSG = 5 
       data hash MD5: 128K
       FE A2 37 AE FD E4 F3 EB 76 3A 62 B2 9D CC 96 77>)
$$ ##END=
$$ 
$$ $$ hash MD5
$$ $$ 6B B5 CE F6 03 D5 BD 66 AB 50 2B E8 C9 7C 13 46
##$RELAX= 
##$RELAX= 
##$RELAX= 
##$RELAX= 
##$RELAX= 
##$RELAX= 
##$RELAX= 
##$RELAX= 
$$ Bruker specific parameters
$$ --------------------------
##$DU= <E:\>
##$EXPNO= 22
$$ [...]
##$TP07= 0
##$TPNAME0= <>
##$TPNAME1= <>
##$TPNAME2= <>
##$TPNAME3= <>
##$TPNAME4= <>
##$TPNAME5= <>
##$TPNAME6= <>
##$TPNAME7= <>
##$TPOAL= (0..7)
0.5 0.5 0.5 0.5 0.5 0.5 0.5 0.5
##$TPOFFS= (0..7)
0 0 0 0 0 0 0 0
##$TUNHIN= 0
##$TUNHOUT= 0
##$TUNXOUT= 0
##$USERA1= <user>
##$USERA2= <user>
##$USERA3= <user>
##$USERA4= <user>
##$USERA5= <user>
##$V9= 5
##$VALIST= <valist>
##$VCLIST= <CCCCCCCCCCCCCCC>
##$VD= 0
##$VDLIST= <DDDDDDDDDDDDDDD>
##$VPLIST= <PPPPPPPPPPPPPPP>
##$VTLIST= <TTTTTTTTTTTTTTT>
##$WBST= 1024
##$WBSW= 4
##$XGAIN= (0..3)
0 0 0 0
##$XL= 0
##$YL= 0
##$YMAX_a= 6225443
##$YMIN_a= -13363439
##$ZGOPTNS= <>
##$ZL1= 120
##$ZL2= 120
##$ZL3= 120
##$ZL4= 120
##$ABSF1= 14.96098
##$ABSF2= -5.597201
##$ABSG= 5
##$ABSL= 3
##$ALPHA= 0
##$AQORDER= 0
##$ASSFAC= 0
##$ASSFACI= 0
##$ASSFACX= 0
##$ASSWID= 0
##$AUNMP= <proc_prof1d_extract.lims>
##$AXLEFT= 0
##$AXNAME= <>
##$AXNUC= <1H>
##$AXRIGHT= 0
##$AXTYPE= 0
##$AXUNIT= <>
##$AZFE= 0.1
##$AZFW= 0.1
##$BCFW= 0
##$BC_mod= 0
##$BYTORDP= 0
##$COROFFS= 0
##$CY= 15
##$DATMOD= 1
##$DC= 0
##$DFILT= <>
##$DTYPP= 0
##$F1P= 0
##$F2P= 0
##$FCOR= 0.5
##$FTSIZE= 131072
##$FT_mod= 6
##$GAMMA= 0
##$GB= 0
##$INTBC= 1
##$INTSCL= 1
##$ISEN= 128
##$LB= 0.3
##$LEV0= 0
##$LPBIN= 0
##$MAXI= 10000
##$MC2= 0
##$MEAN= 0
##$ME_mod= 0
##$MI= 0
##$NCOEF= 0
##$NC_proc= -2
##$NLEV= 6
##$NOISF1= 0
##$NOISF2= 0
##$NSP= 0
##$NTH_PI= 0
##$NZP= 0
##$OFFSET= 14.96098
##$PC= 1
##$PHC0= -81.12854
##$PHC1= 0
##$PH_mod= 1
##$PKNL= yes
##$PPARMOD= 0
##$PPDIAG= 0
##$PPIPTYP= 0
##$PPMPNUM= 2147483647
##$PPRESOL= 1
##$PSCAL= 4
##$PSIGN= 0
##$PYNMP= <proc.py>
##$REVERSE= no
##$SF= 400.020009643106
##$SI= 131072
##$SIGF1= 0
##$SIGF2= 0
##$SINO= 400
##$SIOLD= 131072
##$SPECTYP= <>
##$SREGLST= <1H.CDCl3>
##$SSB= 0
##$STSI= 131072
##$STSR= 0
##$SW_p= 8223.68421052631
##$SYMM= 0
##$S_DEV= 0
##$TDeff= 65536
##$TDoff= 0
##$TI= <>
##$TILT= no
##$TM1= 0
##$TM2= 0
##$TOPLEV= 0
##$USERP1= <user>
##$USERP2= <user>
##$USERP3= <user>
##$USERP4= <user>
##$USERP5= <user>
##$WDW= 1
##$XDIM= 131072
##$YMAX_p= 421678100
##$YMIN_p= -16318
##$CURPLOT= <Network HP LaserJet P1505>
##$CURPRIN= <$Network HP LaserJet P1505>
##$DFORMAT= <normdp>
##$LAYOUT= <+/1D_H.xwp>
##$LFORMAT= <normlp>
##$PFORMAT= <normpl>
##$SURQMSG= 1
$$ End of Bruker specific parameters
$$ ---------------------------------
##NTUPLES= NMR SPECTRUM
##VAR_NAME=  FREQUENCY,     SPECTRUM/REAL,   SPECTRUM/IMAG
##SYMBOL=    X,             R,               I
##VAR_TYPE=  INDEPENDENT,   DEPENDENT,       DEPENDENT
##VAR_FORM=  AFFN,          ASDF,            ASDF
##VAR_DIM=   131072,        131072,          131072
##UNITS=     HZ,            ARBITRARY UNITS, ARBITRARY UNITS
##FACTOR=    0.0627417313425164, 1,          1
##FIRST=     8223.62146879497, 992,          -62447
##LAST=      0,             2120,            -63143
##MIN=       0,             -16318,          0
##MAX=       8223.62146879497, 421678100,    0
$$ Real data points
##PAGE= N=1
##DATA TABLE= (X++(R..R)), XYDATA
$$ [...]
63861I96268L3279L5083L6318L7105L7631L7847L7459L6083L3656L0716K7801
63850A379246K4559K0048J4058P582J640l763r169j4767k0411k5954l1062l5142
63838A306865l8110m0787m3902m7002m8972m9489m9162m8449m7110m4909m2224
63827H06749l9652l7387l5218l2924l0538k8293k6381k4738k3045k1086j8943
63816D88544j6884j5089j3613j2363j1132r880q999q815q831q020o186m416l730
63803C60586l820l742l386l347l710l889l733l811m355m766m568m218m349m712
63789C04180m526l663k851k652k746k445j603p58m34n15n01k54k36q15j564j623
63773B76994p71K37N67K19k17m52o60q33n54K96R48M74r37j968j724q66p23j574
$$ y = [996268, 1029547, 1064630, 1100948, 1138053, 1175684, 1213531, 1250990, 1287073, 1320729, 1351445, 1379246, 1403805, 1423853, 1437911, 1445493, 1447133, 1443370, 1434201, 1419434, 1399023, 1373069, 1342007, 1306865, 1268755, 1227968, 1184066, 1137064, 1088092, 1038603, 989441, 940992, 893882, 848973, 806749, 767097, 729710, 694492, 661568, 631030, 602737, 576356, 551618, 528573, 507487, 488544, 471660, 456571, 442958, 430595, 419463, 409583, 400584, 391769, 382938, 374918, 368732, 364316, 360586, 356766, 353024, 349638, 346291, 342581, 338692, 334959, 331148, 326793, 322027, 317459, 313241, 308892, 304180, 299654, 295991, 293140, 290488, 287742, 285297, 283694, 282936, 282502, 281987, 281486, 281232, 280996, 280181, 278617, 276994, 276223, 276460, 277027, 277246, 277029, 276577, 275917, 275084, 274530, 274826, 275774, 276248, 275311, 273343, 271619, 270753, 270030, 268456]
63755B68456k360k139j194m49k66k53J9N77J183J504J264O06K39P42J737K271
63739B71937K068J893K403L155L246K519J604J008Q06J075J900K814K994K396
63725C01818K103L021M647N744N902N676N411M810L795K941K632K449J866J074
63711C53889N71L07j74r33j586j893j954j898j778j725j787j732j377r62p65n02
63695C35701K86J340J851J633J428J870K674L204L310L174K761J941R44K38j1
63680C62344kQ0K51N61J006J600K275K755K676J968J046N42P89J459J842J567
63664C82759R89O93O70L36o52j870k625k762k749l050l618m034m121m187m495
63649C51284m610l780k082o44l29o46n81m5K80K82O02J389J939J928K084L048
$$ y = [268456, 266096, 263957, 262763, 262314, 262048, 261795, 261814, 262391, 263574, 265078, 266342, 266948, 267187, 267929, 269666, 271937, 274005, 275898, 278301, 281456, 284702, 287221, 288825, 289833, 290639, 291714, 293614, 296428, 299422, 301818, 303921, 306942, 311589, 317333, 323235, 328911, 334322, 339132, 342927, 345868, 348500, 350949, 352815, 353889, 354460, 354767, 354593, 353660, 352074, 350181, 348227, 346329, 344551, 342826, 341039, 339307, 337930, 336968, 336203, 335701, 335987, 337327, 339178, 340811, 342239, 344109, 346783, 349987, 353297, 356471, 359232, 361173, 362117, 362355, 362344, 362342, 362422, 362673, 363234, 364240, 365840, 368115, 370870, 373546, 375514, 376560, 377102, 377891, 379350, 381192, 382759, 383748, 384441, 385111, 385447, 384795, 382925, 380300, 377538, 374789, 371739, 368121, 364087, 359966, 355779, 351284, 346674, 342894, 340812, 340168, 339839, 339193, 338612, 338567, 338847, 339129, 339731, 341120, 343059, 344987, 347071, 350119]
63633C50119M304M926M924N080N732O465O845O921P020P495Q582J0144J1581J2381
63619D52519J2765J3461J4872J6692J8341J9556K0587K1948K3911K6174K8213
63608F69039K9923L1596L3200L4153L4010L2948L1117K7965K2811J5968Q732K320
63596I73782k807o649r226j0571j0858j0408r698r385j0041j1890j4836j8574
63584H48839k2542k5858k7723k7902k6763k4893k2812k0822j8942j7021j5011
63573E98550j2982j0863q489o014l891k191l48K003M304N646N863N624N652O282
63559E89146P547R183J0628J1558J2364J3732J5857J8449K1357K4616K7976L1037
63547G93450L3918L7274M1531M6378N0872N3394N1636M3739L0132J3864j313j3081
$$ y = [350119, 354423, 359349, 364273, 369353, 375085, 381550, 388395, 395316, 402336, 409831, 418413, 428557, 440138, 452519, 465284, 478745, 493617, 510309, 528650, 548206, 568793, 590741, 614652, 640826, 669039, 698962, 730558, 763758, 797911, 831921, 864869, 895986, 923951, 946762, 962730, 971462, 973782, 970975, 964326, 955100, 944529, 933671, 923263, 913565, 904180, 894139, 882249, 867413, 848839, 826297, 800439, 772716, 744814, 718051, 693158, 670346, 649524, 630582, 613561, 598550, 585568, 574705, 566216, 560202, 556311, 554120, 553772, 555775, 560079, 565725, 571588, 577212, 582864, 589146, 596693, 605876, 616504, 628062, 640426, 654158, 670015, 688464, 709821, 734437, 762413, 793450, 827368, 864642, 906173, 952551, 1003423, 1056817, 1108453, 1152192, 1182324, 1196188, 1194875, 1181794]
63535A181794k0807k4597k4959k3017k0195j7421j5022j3394j3239j4941j7971
63524I76231k1319k4424k7433l0551l3388l5188l5603l4937l3592l1603k8974
63513F39219k6196k3953k2290k0513j8068j5268j2950j1647j1244j1224j0977
63502D54889j0068q534o935n905n559n448n051m215l193k419k302k872l524l357
63488C85507k040k56J006J504J766K121K270J990J772K269L364M318M703M701
63474D14995M550M135L334K314J339N54%m47j157k325l471l785l189k499k370
63459D11978k461k061j061J8O77Q11O40O27J185K200L138L808M707O346Q561J0773
63443D49886J2552J3692J4235J4785J6268J8804K1378K3240K5154K8515L3628
$$ y = [1181794, 1160987, 1136390, 1111431, 1088414, 1068219, 1050798, 1035776, 1022382, 1009143, 994202, 976231, 954912, 930488, 903055, 872504, 839116, 803928, 768325, 733388, 699796, 668193, 639219, 613023, 589070, 566780, 546267, 528199, 512931, 499981, 488334, 477090, 465866, 454889, 444821, 436287, 429352, 423447, 417888, 412440, 407389, 403174, 399981, 397562, 395260, 392388, 388864, 385507, 383467, 383211, 384217, 385721, 387487, 389608, 391878, 393868, 395640, 397909, 401273, 405591, 410294, 414995, 419545, 423680, 427014, 429328, 430667, 431221, 431221, 430774, 429617, 427292, 423821, 420036, 416847, 414348, 411978, 409517, 407456, 406395, 406413, 407090, 407901, 408541, 409168, 410353, 412553, 415691, 419499, 424206, 430552, 439113, 449886, 462438, 476130, 490365, 505150, 521418, 540222, 561600, 584840, 609994, 638509, 672137]
63432F72137L9602M5352M9501M9751M4096L3288K0931J0447K770k609n512n194
63420I54560j910K959Q292J3845J9426K4400K8302L1175L2864L2484K9226K3435
63408A199058J6416R260K321m202r773j3825j6200j7004j6447j5206j4593j5640
63396A104165j8136k1104k4212k7900l2061l5420l6803l6415l5327l4096l2483
63385G70208l0237k7503k4576k1798j9494j7596j5513j2814r891p411n368l227
63373E74780q60J396L491N702P859R290R931J0814J2990J6278J9481K1743K3351
63360G16246K5246K7948L1034L3655L5489L6998L8687M0410M1445M0924L8058
63349A106140L2490K4892J6790R305K410m089r403j2469j3477j3726j4023j4202
$$ y = [672137, 711739, 757091, 806592, 856343, 900439, 933727, 954658, 965105, 967875, 965266, 959754, 954560, 952650, 955609, 963901, 977746, 997172, 1021572, 1049874, 1081049, 1113913, 1146397, 1175623, 1199058, 1215474, 1224734, 1227055, 1222853, 1213080, 1199255, 1183055, 1166051, 1149604, 1134398, 1119805, 1104165, 1086029, 1064925, 1040713, 1012813, 980752, 945332, 908529, 872114, 836787, 802691, 770208, 739971, 712468, 687892, 666094, 646600, 629004, 613491, 600677, 590786, 583375, 578007, 574780, 573920, 575316, 578807, 584509, 592368, 601658, 611589, 622403, 635393, 651671, 671152, 692895, 716246, 741492, 769440, 800474, 834129, 869618, 906616, 945303, 985713, 1027158, 1068082, 1106140, 1138630, 1163522, 1180312, 1189617, 1192027, 1187938, 1178535, 1166066, 1152589, 1138863, 1124840, 1110638]
63337A110638j4247j4915j6898k0087k3848k7478l0284l1861l2483l2550l1759
63326H34228k9545k6364k3354k0603j6918j1785o284j432L110P409R391O288k108
63313G22033j2741k1909k7735l0252l0269k8677k6187k3191j9904j6653j3793
63302D70722j1417r470q064p398p408p711p823p292n964m331l286l159l306l045
63288C81048k556k397k530k559k552k839l124k704j634q27p80r82q37n07l66k54
63272C53600J77P78J061Q71M74J28o5KL69Q76J355J790K139K161J793J547K099
63255C71155L423M722N273N024M353L658L363L868N095O294O741O541O401O736
63241D42647P391Q165R104J0200J1270J2357J3814J5761J7756J9291K0281K0838
$$ y = [1110638, 1096391, 1081476, 1064578, 1044491, 1020643, 993165, 962881, 931020, 898537, 865987, 834228, 804683, 778319, 754965, 734362, 717444, 705659, 699375, 697943, 701053, 708462, 717853, 724141, 722033, 709292, 687383, 659648, 629396, 599127, 570450, 544263, 521072, 501168, 484515, 470722, 459305, 449835, 441771, 434373, 426965, 419254, 411431, 404139, 398175, 393844, 390558, 387399, 384093, 381048, 378492, 376095, 373565, 371006, 368454, 365615, 362491, 359787, 358153, 357326, 356546, 355564, 354727, 354220, 353854, 353600, 353777, 354555, 355616, 356487, 356961, 357089, 357024, 357026, 357395, 358271, 359626, 361416, 363555, 365716, 367509, 369056, 371155, 374578, 379300, 384573, 389597, 393950, 397608, 400971, 404839, 409934, 416228, 422969, 429510, 435911, 442647, 450038, 458203, 467307, 477507, 488777, 501134, 514948, 530709, 548465, 567756, 588037, 608875]
63229F08875K1014K1049K1436K2250K2812K2578K2005K1886K2096K1837K1034
63218H48872K0559K0922K1595K1907K1880K1677K0831J8673J5239J1233P290L529
63206A054207l27m756j0091j6039k1634k5910k8646l0282l1259l1600l1061k9488
63194G93114k7074k4251k1348j8448j5661j3280j1382r518p230m733k583q45Q87
63181F37648K728M388N761O973P863Q122Q020Q160Q477Q337P828P919Q844R350
63167G40418Q280O126M270L304K844K326J205j099m591q345j1425j3736j5426
63154G14151j6203j6048j5909j6580j7354j6996j5645j4455j3664j2437j0647
63143E48213r306q805q151o566m785l897l723l225k072r49n15o16o06o4P80J284
$$ y = [608875, 629889, 650938, 672374, 694624, 717436, 740014, 762019, 783905, 806001, 827838, 848872, 869431, 890353, 911948, 933855, 955735, 977412, 998243, 1016916, 1032155, 1043388, 1050678, 1054207, 1053880, 1049124, 1039033, 1022994, 1001360, 975450, 946804, 916522, 885263, 853663, 822602, 793114, 766040, 741789, 720441, 701993, 686332, 673052, 661670, 652152, 644922, 640189, 637606, 636761, 637648, 640376, 644764, 650525, 657498, 665361, 673483, 681503, 689663, 698140, 706477, 714305, 722224, 731068, 740418, 748698, 754824, 759094, 762398, 765242, 767568, 768773, 767674, 763083, 754738, 743313, 729577, 714151, 697948, 681900, 665991, 649411, 632057, 615061, 599416, 584961, 571297, 558860, 548213, 538907, 530102, 521951, 515385, 510600, 506703, 502980, 499755, 497683, 496734, 496219, 495603, 494997, 494933, 495713, 496997]
63127D96997J171R46J235J933K453K721L250M155M800M707M190L869L942M201
63113E40570M326M008L227K509K413K710K665K262K206K589K448J284Q3QP03Q71
63097E74882J31o57p86n07l88o17j043j358j138k25Q15J130O97M78J225K490L217
63080E78346L063K716K877L361L541L454L956N518P325Q170Q001P946Q699R710
63066F56683J0317J0859J2040J3657J4901J5679J6784J8707K1011K3074K4932
63055H38644K7104K9925L3289L6771L9872M2466M4978M7848N0775N2909N3929
63044A298510N4505N5442N6737N7720N7869N7194N6050N4894N4104N3763N3647
63033A910435N3462N2945N1665M9069M5002L9878L4000K6937J7943O856n675j8751
$$ y = [496997, 498168, 499114, 500349, 502282, 504735, 507456, 510706, 514861, 519661, 524368, 528558, 532427, 536369, 540570, 544896, 548904, 552131, 554640, 557053, 559763, 562428, 564690, 566896, 569485, 571933, 573217, 573300, 573308, 574011, 574882, 575013, 574356, 573570, 573063, 572675, 572058, 571015, 569657, 568519, 568294, 569109, 570239, 570936, 571414, 572639, 575129, 578346, 581409, 584125, 587002, 590363, 593904, 597358, 601314, 606832, 614157, 622327, 630328, 638274, 646973, 656683, 667000, 677859, 689899, 703556, 718457, 734136, 750920, 769627, 790638, 813712, 838644, 865748, 895673, 928962, 965733, 1005605, 1048071, 1093049, 1140897, 1191672, 1244581, 1298510, 1353015, 1408457, 1465194, 1522914, 1580783, 1637977, 1694027, 1748921, 1803025, 1856788, 1910435, 1963897, 2016842, 2068507, 2117576, 2162578, 2202456, 2236456, 2263393, 2281336, 2288192, 2282517, 2263766]
63021B263766l1526m3181n3173o1581o8659p3990p6641p6443p4526p2106o9187
63010A562753o5028n9610n3877m8451m2845l6329k9152k2458j7051j2628q255
62999A167069l489J101M477O228P031P959R442J1048J2210J2834J3175J3410J3501
62986A275996J3325J2761J1772J0469Q939O987M296R51k518n860r505j3924j8805
62973A294884k3329k7084l0188l2554l3671l3374l2295l1195l0100k8591k6629
62962I65874k4693k3105k1690k0173j8584j7158j6015j5158j4547j4123j3811
62951G66817j3615j3549j3510j3376j3269j3411j3618j3319j2312j1163j0490
62940F25185j0083r255p859o435n359m483l773l685m468n510n859n229m117l054
$$ y = [2263766, 2232240, 2189059, 2135886, 2074305, 2005646, 1931656, 1855015, 1778572, 1704046, 1631940, 1562753, 1497725, 1438115, 1384238, 1335787, 1292942, 1256613, 1227461, 1205003, 1187952, 1175324, 1167069, 1163580, 1164681, 1169158, 1175386, 1182417, 1190376, 1199818, 1210866, 1223076, 1235910, 1249085, 1262495, 1275996, 1289321, 1302082, 1313854, 1324323, 1333262, 1340249, 1344545, 1345496, 1342978, 1337118, 1327613, 1313689, 1294884, 1271555, 1244471, 1214283, 1181729, 1148058, 1114684, 1082389, 1051194, 1021094, 992503, 965874, 941181, 918076, 896386, 876213, 857629, 840471, 824456, 809298, 794751, 780628, 766817, 753202, 739653, 726143, 712767, 699498, 686087, 672469, 659150, 646838, 635675, 625185, 615102, 605847, 597988, 591553, 586194, 581711, 577938, 574253, 569785, 564275, 558416, 553187, 549070, 546016]
62926E46016k102j095r4N30M60m5j86M83J309J155j09j409j952k195k808l426
62910E34532l250k437j867j788j629j159q52r65j060p38j11O12J387J921J743
62895E24339J019O21J003J521J344N12l37q61j113j101p59k23J69J45k98p63o20
62878E24598K98J254J402R60Q93J402J637J081K60l00q58j595j999j875j993k818
62862E22347l393k630j087k15k41j28N44J066J037J070J676K419K634K306J827
62847E29232J462J365J581J785J539R50N97O54O79M02J78L37N97M96O2l25m59
62830E41132m00k33pJ93K42R2q5J32J064K417L368L530L388L492L581L169K581
62813E67656K627L336L917L990M006M258M377M109L859L942L991L715L708M796
$$ y = [546016, 543914, 542819, 542725, 543255, 543715, 543670, 543484, 543967, 545276, 546431, 546322, 544913, 542961, 540766, 537958, 534532, 531282, 528845, 526978, 525190, 523561, 522402, 521550, 520585, 519525, 518787, 518676, 519288, 520675, 522596, 524339, 525358, 525979, 526982, 528503, 529847, 530359, 530022, 529161, 528048, 526947, 526188, 525965, 526134, 526279, 525981, 525218, 524598, 524896, 526150, 527552, 528512, 529405, 530807, 532444, 533525, 533785, 533485, 532627, 531032, 529033, 527158, 525165, 522347, 518954, 516324, 515237, 515022, 514781, 514653, 515197, 516263, 517300, 518370, 520046, 522465, 525099, 527405, 529232, 530694, 532059, 533640, 535425, 536964, 537914, 538511, 539165, 539844, 540246, 540424, 540761, 541358, 541854, 541916, 541591, 541132, 540732, 540499, 540492, 540685, 540927, 541019, 540934, 541066, 542130, 544547, 547915, 551445, 554833, 558325, 561906, 565075, 567656, 570283, 573619, 577536, 581526, 585532, 589790, 594167, 598276, 602135, 606077, 610068, 613783, 617491, 622287]
62799F22287O784Q537R308R435R656J0162J0658J1138J2222J4497J7667K0721
62787G63072K3115K5410K8551L2726L7300M1677M5860N0261N5303O1085O7166
62776A231526P2746P7334Q0998Q3771Q5272Q5273Q4132Q1979P7922P0962O1494
62765B093409N0889L9664K7081J2690k719j8005l2599m6066n7603o6689p3740
62754A926312p9490q3937q6413q6506q4591q1523p8033p4269o9906o4837n9648
62743A077159n5090n1183m7260m2886l8294l3940l0185k7333k5423k3836k1688
62732F80041j8799j5840j3445j1649j0178q865p673o716o213o005n342l781j988
62719E63547r61o94m72j85j62M0J331L469N207O221P478R241J0407J0568J1154
$$ y = [622287, 629071, 637608, 646916, 656351, 666007, 676169, 686827, 697965, 710187, 724684, 742351, 763072, 786187, 811597, 840148, 872874, 910174, 951851, 997711, 1047972, 1103275, 1164360, 1231526, 1304272, 1381606, 1462604, 1546375, 1631647, 1716920, 1801052, 1883031, 1960953, 2031915, 2093409, 2144298, 2183962, 2211043, 2223733, 2221014, 2203009, 2170410, 2124344, 2066741, 2000052, 1926312, 1846822, 1762885, 1676472, 1589966, 1505375, 1423852, 1345819, 1271550, 1201644, 1136807, 1077159, 1022069, 970886, 923626, 880740, 842446, 808506, 778321, 750988, 725565, 701729, 680041, 661242, 645402, 631957, 620308, 610130, 601265, 593592, 586876, 580663, 574658, 569316, 565535, 563547, 562586, 561892, 561420, 561235, 561073, 561113, 562444, 565913, 571120, 577341, 584819, 594060, 604467, 615035, 626189]
62704F26189J3424J6541J8965K0635K2411K4266K5564K6499K7851K9602L1153
62693H83100L2613L4579L6744L7931L7576L6239L4536L2368K9201K4453J7818
62682A237158R838J929m924j1179j7761k4423l0043l4143l7126l9192m0116m0014
62670I70004l9270l7806l5421l2820l1097l0057k8272k5168k1947j9901j8781
62659F49464j7482j5609j3614j1919j0562r465q497p464o340n404m920m882n093
62646E28213n290n196m689l975l327k712k012j417j203j214j007m11M48J480K422
62631E00110K610J659K74l95j53K55M69Q21J250J023n9j050j031j77Q69J978L278
62614E11731M486N179N355N206M703M004L869N038P258R432J0675J0945J0774
$$ y = [626189, 639613, 656154, 675119, 695754, 718165, 742431, 767995, 794494, 822345, 851947, 883100, 915713, 950292, 987036, 1024967, 1062543, 1098782, 1133318, 1165686, 1194887, 1219340, 1237158, 1246996, 1248925, 1244001, 1232822, 1215061, 1190638, 1160595, 1126452, 1089326, 1050134, 1010018, 970004, 930734, 892928, 857507, 824687, 793590, 763533, 735261, 710093, 688146, 668245, 649464, 631982, 616373, 602759, 590840, 580278, 570813, 562316, 554852, 548512, 543108, 538188, 533306, 528213, 522923, 517727, 513038, 509063, 505736, 503024, 501012, 499595, 498392, 497178, 496171, 495760, 496208, 497688, 500110, 502720, 504379, 504653, 504258, 504105, 504360, 504829, 505650, 506900, 507923, 507864, 506814, 505783, 505606, 506475, 508453, 511731, 516217, 521396, 526751, 531957, 536660, 540664, 544533, 549571, 556829, 566261, 576936, 587881, 598655]
62601E98655J0806J1496J2973J5150J7962K1320K4815K7918L0551L3098L5676
62590H40420L7897L9586M1051M2285M2448M0776L7590L3704K9164K3348J6141
62579A224410Q262L82p405j5036k1999k7747l2238l5732l8308l9779m0087l9525
62567I35198l8612l7629l6373l4439l1879k9284k7024k4777k2189j9675j7936
62556F15381j6771j5250j3095j1170j0198r726q897p640o462n472m467l719l701
62543D98813m078l853k734j530q76m23K35O57L07m35q38r43j247j630j572j203
62527D78650j105j018O3K293M444N505N925O726Q108R626J1103J2604J3917J4798
62513E71639J5583J6897J8852K0945K2664K3827K4543K5109K5737K6125K5604
$$ y = [598655, 609461, 620957, 633930, 649080, 667042, 688362, 713177, 741095, 771646, 804744, 840420, 878317, 917903, 958954, 1001239, 1043687, 1084463, 1122053, 1155757, 1184921, 1208269, 1224410, 1232672, 1233054, 1225649, 1210613, 1188614, 1160867, 1128629, 1092897, 1054589, 1014810, 974723, 935198, 896586, 858957, 822584, 788145, 756266, 726982, 699958, 675181, 652992, 633317, 615381, 598610, 583360, 570265, 559095, 548897, 539171, 530274, 522634, 516172, 510700, 506233, 502514, 498813, 494735, 490882, 488148, 486618, 485742, 485319, 485554, 486211, 486518, 486083, 485245, 484302, 483055, 481425, 479853, 478650, 477545, 476527, 476590, 478883, 483327, 488832, 494757, 501483, 509591, 519217, 530320, 542924, 556841, 571639, 587222, 604119, 622971, 643916, 666580, 690407, 714950, 740059, 765796, 791921, 817525]
62502H17525K3946K1655J9141J6154J2486Q695N548L176J378L66M46J378K760
62489I34654M769P726J1182J4373J7348K0661K4079K6647K8225K9813L1960L3671
62477A185108L3380L0316K4612J6936Q651J509l806q556j4648k2523l0880l8209
62465A181890m3824m7444m8805m8222m7002m6432m6319m5172m2043l7665l3370
62454F95592k9427k5139k0364j6005j2855j0794r384q476p702o185l556p18J120
62441E46107J818K041K140K166K514L512M605M871M303L581K738J103j305l442
62427E76752m574n100n762o757p887q815q966p978o488n659n717n790n367m941
62413D86951m856m604l922l582m177m965m815l813k966k755k796k647k137j164
$$ y = [817525, 841471, 863126, 882267, 898421, 910907, 919602, 925150, 928326, 929704, 930070, 930516, 931894, 934654, 939423, 947149, 958331, 972704, 990052, 1010713, 1034792, 1061439, 1089664, 1119477, 1151437, 1185108, 1218488, 1248804, 1273416, 1290352, 1299003, 1300512, 1296706, 1288150, 1273502, 1250979, 1220099, 1181890, 1138066, 1090622, 1041817, 993595, 946593, 900161, 853842, 808670, 766627, 728962, 695592, 666165, 641026, 620662, 604657, 591802, 581008, 571624, 563148, 555446, 549261, 545705, 544987, 546107, 547925, 549966, 552106, 554272, 556786, 560298, 564903, 569774, 574077, 577658, 580396, 581499, 580194, 576752, 572178, 567078, 561316, 554559, 546672, 537857, 528891, 520913, 514425, 508766, 503049, 497259, 491892, 486951, 482095, 477491, 473569, 469987, 465810, 460845, 456030, 452217, 449251, 446496, 443700, 441053, 438916, 437752]
62399D37752J12R82Q95L52M50J534K876L723M072M333M635M727M329L513K824
62384D77109K855L595M398M787N023N562O316O800O945P174P762Q461Q895R074
62370E64756R439J0429J2026J3727J5048J6035J7189J8948K1466K4724K8489L2256
62358G84532L5724L9285M3529M8207N2451N5955N9086O1509O1766N8795N3144
62347A353983M5889L7263K7277J7038Q059N07o605j3538j9457k4121k8618l3793
62335A363884l8917m2689m4864m5954m5892m4118m0883l7471l4796l2533l0011
62324I25756k7430k5538k4463k3525k2274k1124k0688k0890k1148k1098k0773
62313F76805k0102j8795j6797j4612j2943j2076j1670j1026r644p646n658m200
$$ y = [437752, 437864, 438846, 439741, 440093, 440543, 442077, 444953, 448676, 452748, 457081, 461716, 466443, 470772, 474285, 477109, 479964, 483559, 487957, 492744, 497767, 503329, 509645, 516445, 523390, 530564, 538326, 546787, 555682, 564756, 574195, 584624, 596650, 610377, 625425, 641460, 658649, 677597, 699063, 723787, 752276, 784532, 820256, 859541, 903070, 951277, 1003728, 1059683, 1118769, 1180278, 1242044, 1300839, 1353983, 1399872, 1437135, 1464412, 1481450, 1489509, 1490016, 1483411, 1469873, 1450416, 1426295, 1397677, 1363884, 1324967, 1282278, 1237414, 1191460, 1145568, 1101450, 1060567, 1023096, 988300, 955767, 925756, 898326, 872788, 848325, 824800, 802526, 781402, 760714, 739824, 718676, 697578, 676805, 656703, 637908, 621111, 606499, 593556, 581480, 569810, 558784, 549140, 541494, 535836, 531636]
62301E31636l335k951l033l350l252k351j193o49o81l75P63K175L069L284L065
62286E22822K592K149K265L192M450N246N240M636L776K916K290K200K983M707
62272E71464O724P856P570O868P324R241J1466J3131J4749J7208K0533K4210K8094
62259G46438L2266L6467M0379M4204M8302N2506N6305N9482O2004O3379O2729
62248A304461N9494N3681M5541L5460K4234J3013K767o170j4138k1735k9227l6297
62236A431084m2505m7884n2703n6660n8893n8986n7442n4971n1850m8141m4024
62225H57025l9561l4729k9996k6234k3618k1316j8690j6160j4234j2467j0289
62214F09731q275p453p683p701o756n250l746k243o18R50K286L554M984O614Q355
$$ y = [531636, 528301, 525350, 522317, 518967, 515715, 513364, 512171, 511522, 510841, 510466, 511229, 513404, 516473, 519757, 522822, 525414, 527563, 529828, 533020, 537470, 542716, 547956, 552592, 556368, 559284, 561574, 563774, 566757, 571464, 578188, 586044, 593614, 600482, 607806, 617047, 628513, 641644, 656393, 673601, 694134, 718344, 746438, 778704, 815171, 855550, 899754, 948056, 1000562, 1056867, 1116349, 1178353, 1241732, 1304461, 1363955, 1417636, 1463177, 1498637, 1522871, 1535884, 1538651, 1532481, 1518343, 1496608, 1467381, 1431084, 1388579, 1340695, 1287992, 1231332, 1172439, 1113453, 1056011, 1001040, 949190, 901049, 857025, 817464, 782735, 752739, 726505, 702887, 681571, 662881, 646721, 632487, 620020, 609731, 601456, 594003, 586320, 578619, 571863, 566613, 562867, 560624, 560006, 560956, 563242, 566796, 571780, 578394, 586749]
62199E86749J0083J1649J3035J4387J5699J6659J7123J7458J8032J8596J8605
62188G58075J7872J6565J4826J2871J1132R802Q439O586M539L025K244J745J026
62175H68747j63j740l022k959j246J184L433N985R911J5130K0498K5453L0451
62162I71662L5700M0433M3665M4869M3768M0284L4877K8272K0724J2296L883l088
62150A317345q267j2762j7542k2287k6346k9923l3537l6864l8963l9323l8189
62139A013342l6056l3394l0625k7871k4819k1216j7431j4166j1696r667p638n659
62127G73104m166l343k644j264P82K473L077L280M346O345Q123R051R826J1219
62113H20209J2790J3394J2411R991O556K659r37l581n068n410m636l132j859j694
$$ y = [586749, 596832, 608481, 621516, 635903, 651602, 668261, 685384, 702842, 720874, 739470, 758075, 775947, 792512, 807338, 820209, 831341, 841143, 849582, 856168, 860707, 863732, 865976, 867721, 868747, 868584, 866844, 863822, 860863, 859617, 860801, 864234, 870219, 880130, 895260, 915758, 941211, 971662, 1007362, 1047795, 1091460, 1136329, 1180097, 1220381, 1255258, 1283530, 1304254, 1316550, 1320433, 1317345, 1309078, 1296316, 1278774, 1256487, 1230141, 1200218, 1166681, 1129817, 1090854, 1051531, 1013342, 977286, 943892, 913267, 885396, 860577, 839361, 821930, 807764, 796068, 786401, 778763, 773104, 768938, 765595, 762951, 761687, 762469, 764942, 768019, 771299, 775645, 781990, 790113, 799164, 808990, 820209, 832999, 846393, 858804, 868795, 875351, 878010, 877073, 873492, 868424, 863014, 858378, 855246, 853387, 851693]
62099H51693k635l987n175o010o348n976m919l477j853OK094M002N161N419N246
62084H33241N252N598O015O340O757P463Q382R411J0648J2161J3792J5410J7059
62071I57529J8593J9615K0160K1057K2912K5074K6311K6438K6504K7484K9362
62060A221039L1478L2966L2821L0393K6056K0820J5126Q698J713m737r771j3617
62048A392985j6992k0244k3603k7534l2122l6501l9568m1103m1662m1659m1052
62037A030945l9729l7702l5023l1944k9043k6716k4656k2246j9442j6891j5107
62026G32446j3907j2687j1133r526q447q183q408q565q503q500q680q735q425
62013F08747p961p628p261o492n302m030k843j630l76O16J074J191J523K419L604
$$ y = [851693, 849058, 845071, 839896, 833886, 827538, 821562, 816643, 813166, 811313, 811319, 813413, 817415, 822576, 827995, 833241, 838493, 844091, 850106, 856446, 863203, 870666, 879048, 888459, 899107, 911268, 925060, 940470, 957529, 976122, 995737, 1015897, 1036954, 1059866, 1084940, 1111251, 1137689, 1164193, 1191677, 1221039, 1252517, 1285483, 1318304, 1348697, 1374753, 1395573, 1410699, 1419397, 1421110, 1416373, 1406602, 1392985, 1375993, 1355749, 1332146, 1304612, 1272490, 1235989, 1196421, 1155318, 1113656, 1071997, 1030945, 991216, 953514, 918491, 886547, 857504, 830788, 806132, 783886, 764444, 747553, 732446, 718539, 705852, 694719, 685193, 676746, 668563, 660155, 651590, 643087, 634587, 625907, 617172, 608747, 600786, 593158, 585897, 579405, 574103, 570073, 567230, 565600, 565224, 565840, 566914, 568105, 569628, 572047, 575651]
61998E75651M355M172L233K169J401P72j29j375k565l325l875m889o601q290r013
61983E51691q720q205p973p752p311p009p117p213o819o142n577m883l669k311
61969D60990j568j504j523j334j118q87n79n76j206j796j229M39J950K627L083
61954D55769L868M540M678M859N808P268Q491R372J0371J1650J2926J3966J4761
61941E68327J5478J6431J7798J9151J9702J9350J8892J9026J9576K0014K0045
61930G73790J9387J7684J5226J3008J1544J0112P848M939K160k59k459m225n270
61917H63485n920o650p079o286m071j267J188L014M560O508R341J2627J5130J6165
61903I00745J6430J6842J6931J5416J2105Q173M493P57l456p672j1101j3557j5336
$$ y = [575651, 580006, 584178, 587411, 589580, 590981, 591753, 591624, 590249, 587684, 584359, 580484, 575595, 568994, 560704, 551691, 542971, 534766, 526793, 519041, 511730, 504721, 497604, 490391, 483572, 477430, 471853, 466970, 463301, 460990, 459422, 457918, 456395, 455061, 453943, 453056, 452477, 451901, 450695, 448899, 447670, 448109, 450059, 452686, 455769, 459637, 464177, 468855, 473714, 479522, 486790, 495281, 504653, 515024, 526674, 539600, 553566, 568327, 583805, 600236, 618034, 637185, 656887, 676237, 695129, 714155, 733731, 753745, 773790, 793177, 810861, 826087, 839095, 850639, 860751, 868599, 873538, 875698, 875439, 872980, 868755, 863485, 857565, 850915, 843836, 837550, 833479, 832212, 833400, 836414, 840974, 847482, 856823, 869450, 884580, 900745, 917175, 934017, 950948, 966364, 978469, 986642, 991135, 991892, 988436, 980764, 969663, 956106, 940770]
61890I40770j6608j7435j7981j8310j8226j7683j7104j6912j6947j6693j6040
61879G50831j5472j5434j5742j5796j5214j4139j2889j1500r859q188p005o411
61867F03182n757m328k243l08R33J728K680M062N670P205Q694J0502J2873J5522
61853F60415J7847J9684K1506K3812K6470K8972L1057L2707L3659L3410L1867
61842I61406K9628K7274K4586K0758J5486R594M322J15l548p073r920j1237j0962
61829A050429r763q006n405j798K283O130R505J2422J4564J5347J4529J2395R347
61816A121979N446N26n289j1271j6497k0592k3849k6496k8254k8858k8554k7681
61804I10610k6115k3767k1263j9394j8065j6660j5165j4061j3181j1817j0073
$$ y = [940770, 924162, 906727, 888746, 870436, 852210, 834527, 817423, 800511, 783564, 766871, 750831, 735359, 719925, 704183, 688387, 673173, 659034, 646145, 634645, 624786, 616598, 609593, 603182, 597425, 593097, 590854, 590546, 591479, 593207, 595887, 599949, 605619, 612824, 621518, 632020, 644893, 660415, 678262, 697946, 719452, 743264, 769734, 798706, 829763, 862470, 896129, 929539, 961406, 991034, 1018308, 1042894, 1063652, 1079138, 1088732, 1093054, 1093169, 1089621, 1082548, 1072628, 1061391, 1050429, 1040666, 1032660, 1027255, 1025457, 1027740, 1033870, 1043375, 1055797, 1070361, 1085708, 1100237, 1112632, 1121979, 1127425, 1127951, 1122662, 1111391, 1094894, 1074302, 1050453, 1023957, 995703, 966845, 938291, 910610, 884495, 860728, 839465, 820071, 802006, 785346, 770181, 756120, 742939, 731122, 721049]
61793G21049q915q535p877o396n132n167n923o050n367m798m820m974m813m448
61779F37834m121l926l888l877l537k733j918j650j984k614l287l679l327k233
61765E95060j187q90j081j113j002j231j723j827j294o39m49q36j551k224k475
61750E75538k169j592j225j392k149l220l882l429k103j091j190j932k374k250
61736E45540j840j214l56L72O61Q79J568K528L062L027K927L006K886K244J374
61721E66664R32J289K162K871L057L175L770M435M146K796J438P25R3q86j484
61706E95183j076n08j020k455l650m098m078l641k744k086k433l275l333k402
61692E58384j471j112r35o90p01r77r62m76j0L7l45j259k685l778l452j874m23
$$ y = [721049, 712134, 703599, 695722, 689326, 684194, 679027, 673104, 667054, 661687, 656889, 652069, 647095, 642282, 637834, 633713, 629787, 625899, 622022, 618485, 615752, 613834, 612184, 610200, 607586, 604299, 600620, 597293, 595060, 593873, 592983, 591902, 590789, 589787, 588556, 586833, 585006, 583712, 583073, 582624, 581788, 580237, 578013, 575538, 573369, 571777, 570552, 569160, 567011, 563791, 559909, 556480, 554377, 553286, 552096, 550164, 547790, 545540, 543700, 542486, 542130, 542502, 543163, 544042, 545610, 548138, 551200, 554227, 557154, 560160, 563046, 565290, 566664, 567596, 568885, 571047, 573918, 576975, 580150, 583920, 588355, 592501, 595297, 596735, 597460, 597553, 596667, 595183, 594107, 593599, 592579, 590124, 586474, 582376, 578298, 574657, 571913, 569827, 567394, 564119, 560786, 558384, 556913, 555801, 554866, 554176, 553475, 552498, 551536, 551060, 551050, 551087, 550742, 549483, 546798, 543020, 539568, 537694, 537271]
61675E37271M9j08m83j218k126k398j758j024r38j212j338j510k067k715k939
61660E15486k761k510k223j733j043l20K12K07n17j421j572p23L40P66M84m7l68
61643E02257j24P56J754K107J700J137Q66P98P29N09l00k012l913m635l811k578
61627D95240k026j973j777j529j717k264k665k781k857k978k954k685k275j910
61613D62849j781j913k011j792j518j818k885m261n436o216o546o441o148n868
61599D08215n350m321l268k988l357l442k871k313k356k815l392m105m689m540
61585C58408l717l149l276l302k441j239q60j526k349k442j694p42m40j085j918
61570C28228j874r28j55l05j026j675k026j915j108K5N50K45K3N27J183J288J158
$$ y = [537271, 537320, 537212, 536729, 535511, 533385, 530987, 529229, 528205, 527267, 526055, 524717, 523207, 521140, 518425, 515486, 512725, 510215, 507992, 506259, 505216, 504896, 505108, 505315, 504798, 503377, 501805, 501082, 501422, 502188, 502672, 502625, 502257, 502133, 502889, 504643, 506750, 508450, 509587, 510453, 511251, 511980, 512489, 512189, 510177, 506264, 501629, 497818, 495240, 493214, 491241, 489464, 487935, 486218, 483954, 481289, 478508, 475651, 472673, 469719, 467034, 464759, 462849, 461068, 459155, 457144, 455352, 453834, 452016, 449131, 444870, 439434, 433218, 426672, 420231, 414083, 408215, 402865, 398544, 395276, 392288, 388931, 385489, 382618, 380305, 377949, 375134, 371742, 367637, 362948, 358408, 354691, 351542, 348266, 344964, 342523, 341284, 340424, 338898, 336549, 334107, 332413, 331671, 331231, 330146, 328228, 326354, 325426, 325271, 324966, 323940, 322265, 320239, 318324, 317216, 317241, 317791, 318036, 318059, 318586, 319769, 321057, 322215]
61553C22215J337J486J000K02p2L32Q92J215J146M88n46j008j78J371K381K355
61537C34616J835J493J569J957K263K031J345Q36P69O17j8o71q45q86j295j781
61521C43835j865j852k222k546k102j262j086j637j833j112j70K09J50J25Q0l84
61505C26328j294k143k322j668p01k15l89o10l69l0j84o11n17L02J146J288P35
61488C18746L3l23k60j16k42n28n45j86K17M95Q30J215J340J340J873L000L755
61471C30644L396K429J694J191O43M12Q23J176O19l85p06l38k71p24q58k89L42
61454C39798N83P77J106J087N01l3O3N70J040J450J801J780J323J021J415K197
61438C56479K636K568K492K824L393L696L417K727K152K062K308K414K050J295
$$ y = [322215, 323552, 325038, 326038, 326240, 326168, 326500, 327392, 328607, 329753, 330241, 329695, 328687, 328509, 329880, 332261, 334616, 336451, 337944, 339513, 341470, 343733, 345764, 347109, 347945, 348714, 349331, 349313, 348642, 347797, 346911, 345616, 343835, 341970, 340118, 337896, 335350, 333248, 331986, 330900, 329263, 327430, 326318, 326148, 326357, 326507, 326632, 326712, 326328, 325034, 322891, 320569, 318901, 318200, 317985, 317596, 316986, 316617, 316587, 316403, 315792, 315275, 315577, 316723, 318011, 318746, 318779, 318456, 318196, 318080, 317838, 317310, 316765, 316579, 316796, 317291, 318121, 319336, 320676, 322016, 323889, 326889, 330644, 334040, 336469, 338163, 339354, 339997, 340409, 341232, 342408, 343027, 342642, 341936, 341598, 341327, 340603, 339745, 339456, 339798, 340381, 341158, 342264, 343351, 343852, 343819, 343882, 344452, 345492, 346942, 348743, 350523, 351846, 352867, 354282, 356479, 359115, 361683, 364175, 366999, 370392, 374088, 377505, 380232, 382384, 384446, 386754, 389168, 391218, 392513]
61424C92513N82M63J198K385L265L621L912M323M195K979J298L28L71P70J020
61409D23223J145J033L03r76k150k770l002l085k896k417k083k313k874l007k221
61394C95910q92m2l28j226j502o61M81R81R70J123J406J238O11K01L53P55J147
61377D00525J626K066K000J353P80R00J537K042K088J899J814J789J456P14J60
61362D22749M46J281J717J640K105L607M934M779L786L699M890O137O745P369
61348D75884Q467R382R602R769J0597J1572J1602J0491Q969P614O370N020L633
61335E88972K527J932J635R83m22k061k959k880k660l154m268n219n363m625l436
61320E59002k398j696q93M05J755K307J994J739K252L259M042M333M417M797N953
$$ y = [392513, 393095, 393558, 394756, 397141, 400406, 404027, 407939, 412262, 416457, 419436, 420734, 421062, 421433, 422203, 423223, 424368, 425401, 425704, 424728, 422578, 419808, 416806, 413721, 410825, 408408, 406325, 404012, 401138, 398131, 395910, 395018, 394976, 394648, 393422, 391920, 391259, 391740, 392721, 393691, 394814, 396220, 397458, 398069, 398270, 398623, 399378, 400525, 402151, 404217, 406217, 407570, 408350, 409250, 410787, 412829, 414917, 416816, 418630, 420419, 421875, 422589, 422749, 423195, 424476, 426193, 427833, 429938, 433545, 438479, 443258, 447044, 450743, 455633, 461770, 468515, 475884, 484351, 493733, 503335, 513104, 523701, 535273, 546875, 557366, 566335, 573949, 580319, 585339, 588972, 591499, 593431, 595066, 596049, 595627, 593566, 590607, 587727, 585067, 581913, 577645, 572426, 567063, 562438, 559002, 556604, 554908, 554015, 554420, 556175, 558482, 560476, 562215, 564467, 567726, 571768, 576101, 580518, 585315, 591268]
61305E91268P972J0277J2035J2981J3500J3903J4025J3574J2385J0297P305L916
61293G23438P81k067n022p815r474r621r125q988r180r089q552p842o990n851
61279F24603m632l731l104k262r89L10J103J359J576K250L390M503N059M913M311
61264F38659L612L169L262L978N146O479P785Q934R906J0884J2006J2885J2771
61251G39476J1425R406P230M722J670j442l983n991p754r002r298q921q547q266
61237G10725p727p069o698o320n147l228j577q64p80q13p91l96Q91L037N226O765
61221F85234P627Q014P997P813P818P940P749P242O835O570O072N436N343N970
61207G83660O566O419N598M487L365K691K960L965M920N653O869Q939J1358J3794
$$ y = [591268, 599240, 609517, 621552, 634533, 648033, 661936, 675961, 689535, 701920, 712217, 719522, 723438, 724219, 722152, 717130, 709315, 699841, 690220, 681095, 672107, 662927, 653838, 645286, 637444, 630454, 624603, 619971, 616240, 613136, 610874, 609885, 610195, 611298, 612657, 614233, 616483, 619873, 624376, 629435, 634348, 638659, 642271, 645440, 648702, 652680, 657826, 664305, 672090, 681024, 690930, 701814, 713820, 726705, 739476, 750901, 760307, 767537, 772259, 773929, 772487, 768504, 762513, 754759, 745757, 736459, 727538, 718991, 710725, 702998, 695929, 689231, 682911, 677764, 674536, 672959, 672095, 671315, 670502, 669711, 669315, 670206, 673243, 678469, 685234, 692861, 700875, 708872, 716685, 724503, 732443, 740192, 747434, 754269, 760839, 766911, 772347, 777690, 783660, 790226, 796645, 802243, 806730, 810095, 812786, 815746, 819711, 824631, 830284, 837153, 846092, 857450, 871244]
61193H71244J6640J9906K2543K3724K4001K4317K4486K3579K1341J8284J4744
61182A104809J0852P223M724L411K392R21q76k501l855n307p165r268j1177j2696
61168A081487j4107j5694j7310j8696j9969k1262k2146k2075k1394k1050k1225
61157H66559k1074k0072j8791j7889j7002j5304j2661r725p205n352l954k534
61145G14996q13Q69J914K144J709N02j596l968n541o067o235o382n941m457k339
61130F78795j33K119M478O737Q905J1317J3951J6311J8310K0481K3003K5383K7462
61117H57119K9745L2313L4357L5458L6280L7333L8023L7737L6975L6412L5588
61106A247340L3577L0412K6934K3626K0467J7472J4558J1239P169K647k037p268
$$ y = [871244, 887884, 907790, 930333, 954057, 978058, 1002375, 1026861, 1050440, 1071781, 1090065, 1104809, 1115661, 1122884, 1127608, 1131019, 1133411, 1134332, 1133456, 1130955, 1127100, 1121793, 1114628, 1105360, 1094183, 1081487, 1067380, 1051686, 1034376, 1015680, 995711, 974449, 952303, 930228, 908834, 887784, 866559, 845485, 825413, 806622, 788733, 771731, 756427, 743766, 734041, 726836, 721484, 717530, 714996, 714183, 715052, 716966, 719110, 720819, 721321, 719725, 715757, 710216, 704149, 697914, 691532, 685591, 681134, 678795, 678662, 680781, 685259, 691996, 700901, 712218, 726169, 742480, 760790, 781271, 804274, 829657, 857119, 886864, 919177, 953534, 988992, 1025272, 1062605, 1100628, 1138365, 1175340, 1211752, 1247340, 1280917, 1311329, 1338263, 1361889, 1382356, 1399828, 1414386, 1425625, 1432794, 1435441, 1433404, 1426136]
61094A426136j3422j9956k5840l0529l3970l6170l7360l8142l8851l9208l8959
61083A073729l8223l6825l4180l0566k7574k6338k6016k4976k2835k0333j7830
61072G68033j5100j2257r810p896o288m918l735k403p92N49J126J230J429J820
61058G10988K417L568N253O733P694Q976J1241J3679J5148J5903J6963J8412J9594
61045H56569K0558K2030K4158K6429K8591L0633L2194L2966L3400L4101L4885
61034A176514L5335L5719L6374L6824L6672L6718L7929L9834M1308M2373M3828
61023A599428M5569M6740M7260M7727M8276M8965N0932N5562O2787P1726Q2607
61012B207579R6334J12536J29915J48536J70125J96431K28881K69389L19592L79951
$$ y = [1426136, 1412714, 1392758, 1366918, 1336389, 1302419, 1266249, 1228889, 1190747, 1151896, 1112688, 1073729, 1035506, 998681, 964501, 933935, 906361, 880023, 854007, 829031, 806196, 785863, 768033, 752933, 740676, 730866, 722970, 716682, 711764, 708029, 705626, 704834, 705383, 706509, 707739, 709168, 710988, 713405, 716973, 722226, 728959, 736653, 745629, 756870, 770549, 785697, 801600, 818563, 836975, 856569, 877127, 899157, 923315, 949744, 978335, 1008968, 1041162, 1074128, 1107528, 1141629, 1176514, 1211849, 1247568, 1283942, 1320766, 1357438, 1394156, 1432085, 1471919, 1513227, 1555600, 1599428, 1644997, 1691737, 1738997, 1786724, 1835000, 1883965, 1934897, 1990459, 2053246, 2124972, 2207579, 2303913, 2416449, 2546364, 2694900, 2865025, 3061456, 3290337, 3559726, 3879318, 4259269]
61002D259269M51623N38089O41916P60959Q91894J037263J204825J400365J625757
60993A2811960J878541K133773K313999K295059J980221J394120O99689J05637
60985B5612999k53389l57599k55903j9344K49138L96836K72561j68851q14333
60976B4662115j458744j931576k171587k207918k101388j909252j679765j450186
60968I751699j240607j055389q93474p54691o37700n38329m53067l81634l24389
60959C472419k79276k42786k12468j87171j65882j47450j30987j16001j02384
60950A888014r0365p9934p0469o1642n4374m9896m7916m6744m5342m4118m3460
60939A253754m2627m0682l7822l5080l3133l1885l0857k9529k7489k4659k1444
$$ y = [4259269, 4710892, 5248981, 5890897, 6651856, 7543750, 8581013, 9785838, 11186203, 12811960, 14690501, 16824274, 19138273, 21433332, 23413553, 24807673, 25507362, 25612999, 25359610, 25002011, 24746108, 24726764, 24975902, 25372738, 25645299, 25476448, 24662115, 23203371, 21271795, 19100208, 16892290, 14790902, 12881650, 11201885, 9751699, 8511092, 7455703, 6562229, 5807538, 5169838, 4631509, 4178442, 3796808, 3472419, 3193143, 2950357, 2737889, 2550718, 2384836, 2237386, 2106399, 1990398, 1888014, 1797649, 1717715, 1647246, 1585604, 1531230, 1481334, 1433418, 1386674, 1341332, 1297214, 1253754, 1211127, 1170445, 1132623, 1097543, 1064410, 1032525, 1001668, 972139, 944650, 919991, 898547]
60928H98547j8483j6188j4584j3465j2709j2310j2086j1599j0602r477q771q409
60916G49864p858p053o515o424o243n532m498l481k474j467o89j14N94J287J245
60901G00642L75k70J38R23Q71j05j035j285r96m16L58J123J692K204K803L244
60885G10266L410L835N059O650P651P850P960Q564R539J0594J1729J3062J4560
60872H20729J6015J7102J7623J7924J8783K0506K2467K3983K5274K6953K8948
60861A056307L0644L1871L3048L4418L5837L7194L8393L8879L7953L5645L2710
60850A442899K9631K6219K2268J7994J3592Q811L326k828r341j5920k2284k8127
60838A486240l3225l7469m0736m3019m4530m5428m5418m4074m1691l9405l8165
$$ y = [898547, 880064, 863876, 849292, 835827, 823118, 810808, 798722, 787123, 776521, 767044, 758273, 749864, 742006, 734953, 728438, 722014, 715771, 710239, 705741, 702260, 699786, 698319, 697630, 697516, 698110, 699397, 700642, 701017, 700747, 700885, 701808, 702679, 702574, 701539, 700254, 699258, 698842, 699200, 700323, 702015, 704219, 707022, 710266, 713676, 717511, 722570, 729220, 736871, 744721, 752681, 761245, 770784, 781378, 793107, 806169, 820729, 836744, 853846, 871469, 889393, 908176, 928682, 951149, 975132, 1000406, 1027359, 1056307, 1086951, 1118822, 1151870, 1186288, 1222125, 1259319, 1297712, 1336591, 1374544, 1410189, 1442899, 1472530, 1498749, 1521017, 1539011, 1552603, 1561414, 1564740, 1561912, 1552571, 1536651, 1514367, 1486240, 1453015, 1415546, 1374810, 1331791, 1287261, 1241833, 1196415, 1152341, 1110650, 1071245, 1033080]
60827A033080l7692l6729l4328l0761k7204k4604k2930k1527k0010j8576j7507
60816G41212j6648j5588j4142j2466j0832r413q272p402o738o156n445m477l422
60803F20211k600j939r63M14J393J259M82R4J64k26j383k441k702k656l022l601
60787F02484l707l278k793k490k252k107k228k650l257l917m425m585m584m862
60773E55349n447n889o002o060o102n781n202n043n385n323m418l564l623m001
60759D83509l615k612j972j926j929j866k061k292j969j248q67q66m36P63K140
60744D62753L112L652L806L468K862K386J889Q73m06r67n23l4l13q75p62rM31
60727D81343q9j289k435l042l126l032l020l053l083l374m192n268n998o166o082
$$ y = [1033080, 995388, 958659, 924331, 893570, 866366, 841762, 818832, 797305, 777295, 758719, 741212, 724564, 708976, 694834, 682368, 671536, 662123, 653851, 646449, 639711, 633555, 628110, 623633, 620211, 617611, 615672, 614709, 615123, 616516, 617775, 618257, 618351, 618515, 618289, 616906, 614465, 611763, 609107, 606085, 602484, 598777, 595499, 592706, 590216, 587964, 585857, 583629, 580979, 577722, 573805, 569380, 564795, 560211, 555349, 549902, 544013, 538011, 531951, 525849, 520068, 514866, 509823, 504438, 499115, 494697, 491133, 487510, 483509, 479894, 477282, 475310, 473384, 471455, 469589, 467528, 465236, 463267, 462019, 461152, 460286, 459850, 460613, 462753, 465865, 469517, 473323, 476791, 479653, 482039, 483928, 484801, 484395, 483428, 482905, 482871, 482558, 481683, 480921, 480912, 481343, 481254, 479965, 477530, 474488, 471362, 468330, 465310, 462257, 459174, 455800, 451608, 446340, 440342, 434176, 428094]
60712D28094n960n614m896m045l440l217l243l237k963k483k224k454k831k771
60698C78716k196j516r50l38L06N54P3q35j402j036J68J403J783J211M82L86R88
60681C77797J926L000L997M454M205L881M209M975N383N203M891M695M436M191
60667D37243M295M564M268L194K132J947K665L636M248M233L728L243L193L441
60653D86030L503L251K943K686K325J859J397P97q4q87j255j739l247n487p000
60638D85092p084o666o714o824o245n388n163n344m882l655k691k440k029p27
60624D19240O70Q51j47r50p23j47k43q42r15j50N71L97m55j180j369j104m45N31
60606D13590J356J431O90l30j056j233q94l31ql6R4Q00J617J687J022N72R22J568
$$ y = [428094, 422134, 416520, 411624, 407579, 404139, 400922, 397679, 394442, 391479, 388996, 386772, 384318, 381487, 378716, 376520, 375004, 374054, 373716, 374022, 374576, 374649, 373814, 372412, 371376, 371544, 372947, 374730, 375941, 376423, 376809, 377797, 379723, 382723, 386720, 391174, 395379, 399260, 403469, 408444, 413827, 419030, 423921, 428616, 433052, 437243, 441538, 446102, 450370, 453564, 455696, 457643, 460308, 463944, 468192, 472425, 476153, 479396, 482589, 486030, 489533, 492784, 495727, 498413, 500738, 502597, 503994, 504791, 504707, 503820, 502565, 500826, 497579, 492092, 485092, 478008, 471342, 464628, 457804, 451559, 446171, 441008, 435664, 430782, 427127, 424436, 421996, 419967, 419240, 419910, 420761, 420614, 419664, 418941, 418794, 418551, 417709, 416794, 416644, 417215, 417612, 417157, 415977, 414608, 413504, 413059, 413590, 414946, 416377, 417067, 416737, 415681, 414448, 413554, 413223, 413215, 413179, 413273, 414073, 415690, 417377, 418399, 418971, 419893, 421461]
60588D21461J716J304Q86Q31J013J069P83K79j10k52l73n92n16K71J521K599L323
60571D35213L968M539M712M644N041O265P878R327J0540J1559J2145J2107J1532
60558E39470J0410Q499N880L257J177o71k883n239o688o452m876l083j929j310
60544E35562m52J091K939M489N720P048Q541R845J0804J1621J2307J2573J2262
60531F34350J1461J0078P901N195K653N67j352l132m233m410m226m258m332m021
60517F42241l418k849k278j544q24l55N5P09J404J714J711J988L013M758O820
60502F53145Q669J0043J1367J3537J6918K0882K4658K8227L1957L5749L9190M2180
60490I36522M4686M6066M5340M2161L6839K9509J9947Q394m144j6546k8038l7833
$$ y = [421461, 423177, 424481, 425367, 426198, 427211, 428280, 429063, 429342, 429232, 428980, 428607, 428015, 427499, 427770, 429291, 431890, 435213, 439181, 443720, 448432, 453076, 458117, 464382, 472260, 481587, 492127, 503686, 515831, 527938, 539470, 549880, 558379, 564259, 567516, 568693, 568022, 565139, 559900, 553212, 546760, 541884, 538801, 536872, 535562, 535110, 536201, 539140, 543629, 549349, 556397, 564938, 574783, 585587, 597208, 609515, 622088, 634350, 645811, 655889, 663790, 668985, 671638, 672205, 670853, 667721, 663488, 659078, 654852, 650594, 646262, 642241, 638823, 635974, 633696, 632152, 631328, 630973, 631028, 631737, 633141, 634855, 636566, 638554, 641567, 646325, 653145, 661814, 671857, 683224, 696761, 713679, 734561, 759219, 787446, 819403, 855152, 894342, 936522, 981208, 1027274, 1072614, 1114775, 1151614, 1181123, 1201070, 1209464, 1205320, 1188774, 1160736, 1122903]
60478A122903m5025m9274n1072n0943m8839m4823l9903l5516l2216k9484k6756
60467F69052k4101k1767j9596j7229j4617j2111j0155r081q914r151q950p867
60455E05513o369n329n076n195n132m678l925l133k685k746k935k671j971j447
60441D52221j461j679j674j432r95k28P56J329J132O05K98O8l91p46m85Q5K35
60424D47638k9j15n5m53j148j019L67J876K208J509Q36O18M76K62M09J060J550
60407D55990J128r1j145j207l31P34J320J241N97m01j246j230j39J351K366K724
60391D61661K769K702K522K389K417K310J802J348J621K476L143L409L761M264
60377D98594M223L297K132J543J679K304L169L802L666K987K779L480M236M052
$$ y = [1122903, 1077878, 1028604, 977532, 926589, 877750, 832927, 793024, 757508, 725292, 695808, 669052, 644951, 623184, 603588, 586359, 571742, 559631, 549476, 540395, 531481, 522330, 513380, 505513, 499144, 493815, 488739, 483544, 478412, 473734, 469809, 466676, 463991, 461245, 458310, 455639, 453668, 452221, 450760, 449081, 447407, 445975, 444980, 444752, 445508, 446837, 447969, 448574, 448872, 448940, 448549, 447803, 447318, 447403, 447638, 447609, 447494, 447439, 446986, 445838, 444819, 445186, 447062, 449270, 450779, 451615, 452233, 452709, 452971, 453380, 454440, 455990, 457118, 457027, 455882, 454675, 454344, 455078, 456398, 457639, 458236, 457835, 456589, 455359, 455220, 456571, 458937, 461661, 464430, 467132, 469654, 472043, 474460, 476770, 478572, 479920, 481541, 484017, 487160, 490569, 494330, 498594, 502817, 506114, 508246, 509789, 511468, 513772, 516941, 520743, 524409, 527396, 530175, 533655, 537891, 541943]
60363E41943L107K302K007J955J972K099K191K001J572J132P74O07R46J864K874
60348E69346L492L963M877O224P320P602P137O353N543M665L455J801N7j266k153
60333F28416l053m061m627m365l752l562l909m286m301l936l282k522k092k416
60319E78252l422m521n070m764l756k559j659j112n47L89J763L472N248O711P788
60304E76213R035J1038J3526J5698J7372J8964K0216J9991J7768J4432J0891O802
60292G51946J515m388r541j3371j6242j8225j8735j7501j5127j2529j0273q522
60280F09007p201o190n561n556o083o508o340n805n390n148m834m472m183l817
60266E31919l205k595k256j930j263m99j43q2K35Q25J100P90L03J2k59p46j205
$$ y = [541943, 545050, 547352, 549359, 551314, 553286, 555385, 557576, 559577, 561149, 562281, 563055, 563662, 564608, 566472, 569346, 572838, 576801, 581678, 587902, 595222, 602824, 609961, 616314, 621857, 626522, 629977, 631778, 631835, 630569, 628416, 625363, 621302, 616675, 612310, 608558, 604996, 601087, 596801, 592500, 588564, 585282, 582760, 580668, 578252, 574830, 570309, 565239, 560475, 556719, 554160, 552501, 551389, 550842, 551231, 552994, 556466, 561714, 568425, 576213, 585248, 596286, 609812, 625510, 642882, 661846, 682062, 702053, 719821, 734253, 745144, 751946, 753461, 749073, 739532, 726161, 709919, 691694, 672959, 655458, 640331, 627802, 617529, 609007, 601806, 595616, 590055, 584499, 578416, 571908, 565568, 559763, 554373, 549225, 544391, 539919, 535736, 531919, 528714, 526119, 523863, 521933, 520670, 520171, 520028, 519946, 520181, 521006, 522106, 522896, 523199, 523211, 522952, 522206, 521001]
60249E21001j166n93m1p5n40o23O7P49L32r37j549p39M77Q63O50P51J076Q14O7
60230E20584j22O31J532J904K046K482L136L582L600L164K441J995K494L959N637
60215E59065O747P040O637N872N350N606O533P497Q143Q623Q919Q605P516O231
60201F58384N475N265N034M409L567K830K162J324M10p9L7N3q53k378l333l334
60185F78973l415m494o043o965p096o975o719o110n411n040m679l743k551j965
60171F07767k001j914j638j892k672k905k094j114q58j045r86o99n17k92K50Q41
60155E88231J082J118J338J767K229K725L161L176K741K560L271M545N497N770
60141F29211N733N827O212O874P662Q258Q489Q552Q694Q848Q801Q487P881O855
$$ y = [521001, 519835, 519242, 519201, 519126, 518586, 517963, 518030, 518779, 519111, 518174, 516625, 515886, 516363, 517226, 517876, 518627, 519703, 520517, 520584, 520462, 521093, 522625, 524529, 526575, 529057, 532193, 535775, 539375, 542539, 544980, 546975, 549469, 553428, 559065, 565812, 572852, 579489, 585361, 590711, 596317, 602850, 610347, 618490, 627113, 636032, 644637, 652153, 658384, 663859, 669124, 674158, 678567, 682134, 684964, 687126, 688450, 688860, 688781, 688818, 688871, 688018, 685640, 682307, 678973, 675558, 671064, 665021, 658056, 650960, 643985, 637266, 631156, 625745, 620705, 616026, 612283, 609732, 607767, 605766, 603852, 602214, 600322, 597650, 594745, 592651, 591537, 590679, 589634, 588648, 587949, 587432, 587140, 587390, 588231, 589313, 590431, 591769, 593536, 595765, 598490, 601651, 604827, 607568, 610128, 613399, 617944, 623441, 629211, 634944, 640771, 646983, 653857, 661519, 669777, 678266, 686818, 695512, 704360, 713161, 721648, 729529, 736384]
60127G36384N431L972K737J512j3j613k633k592j530L5J265J511R91P05J217J773
60111G49152J157p10k590l359l106k692k744l323m238n234n993o282o159n915
60097F97964n687n295m526l429k198q04R27K809M145M396L884L467L639M163M547
60082G08002M544M140L455K752K282J980J472N11q60k542m435o187p312p795q244
60067F91763r035r705r585q883q486q738q910q193o781n596n112m917m445l751
60053E89626l370l553l906l699k518o18J196K282K803L535M847O164O720O612
60039F06121O619P092P513P204O012M253K466J268Q76N97n79k646m429n127n349
60024F31891o125p559r055j0329j1344j1636j0677q878p333o506n841m857l952
$$ y = [736384, 741815, 745787, 748524, 750036, 750023, 748410, 745777, 743185, 741655, 741690, 742955, 744466, 745457, 746162, 747379, 749152, 750309, 749599, 747009, 743650, 740544, 737852, 735108, 731785, 727547, 722313, 716320, 710038, 703879, 697964, 692277, 686982, 682456, 679027, 676829, 676025, 676952, 679761, 683906, 688302, 692186, 695653, 699292, 703455, 708002, 712546, 716686, 720141, 722893, 725175, 727155, 728627, 729138, 728278, 725736, 721301, 715114, 707802, 700007, 691763, 682728, 673023, 663438, 654555, 646069, 637331, 628421, 620228, 613447, 607851, 602739, 597822, 593377, 589626, 586256, 582703, 578797, 575098, 572580, 571962, 573158, 575440, 578243, 581778, 586625, 592789, 599509, 606121, 612740, 619832, 627345, 634549, 640561, 644814, 647280, 648548, 649424, 650021, 649442, 646796, 642367, 637240, 631891, 625766, 618207, 609152, 598823, 587479, 575843, 565166, 556288, 548955, 542449, 536608, 531751, 527799]
60011E27799l701l834l365j747L42J559J283K68l10k39k31o01q39o00k35R2Q42
59994E16483K023K627K081J430J942L192L832L725L864M390M378L613L067L170
59980E59817L046K034P40j70j109k656m299n059m801m197l736l385k956k226j024
59965E30019M18J481J854J939K272K872L404L620L451L004K680K843L197K972
59951E66026J929O92j29n19o33l87R4K76r8o12q70j110j716k557l305l985m685
59934E48411n168n238n168n233n086m219k779j451n47K56J314K526L493L950L903
59919E28964L517K964K452K370L112M452N405N219M433M348N474P076Q295Q996
59905E97077R276Q923P772O152M467K750R75n49j465j821j915j926j891j779j392
$$ y = [527799, 524098, 520264, 516899, 515152, 515494, 517053, 518336, 518604, 518294, 518055, 517824, 517223, 516384, 515784, 515549, 515641, 516483, 518506, 521133, 523214, 524644, 526586, 529778, 533610, 537335, 541199, 545589, 549967, 553580, 556647, 559817, 562863, 564897, 565637, 565467, 564358, 561702, 557403, 552344, 547543, 543346, 539610, 536225, 533269, 531043, 530019, 530437, 531918, 533772, 535711, 537983, 540855, 544259, 547879, 551330, 554334, 557014, 559857, 563054, 566026, 567955, 568647, 568518, 567999, 567366, 566979, 567073, 567349, 567251, 566639, 565769, 564659, 562943, 560386, 557081, 553096, 548411, 543243, 538005, 532837, 527604, 522518, 518299, 515520, 514069, 513522, 513778, 515092, 517618, 521111, 525061, 528964, 532481, 535445, 537897, 540267, 543379, 547831, 553236, 558455, 562888, 567236, 572710, 579786, 588081, 597077, 606353, 615276, 623048, 629200, 633667, 636417, 637392, 636843, 635378, 633557, 631642, 629716, 627825, 626046, 624654]
59890F24654n31O68J810K754L589M144M106L703L621M013M256M009L831M356N306
59875F74289N800N261L781J931M40m14j289l078n577p454p835p161o256n316m348
59860F42774l761l818m058l866l209k277j088P3N40L10N30K032L979M989N156
59845F38306N856P677R651J0659J0584R784Q244N732K527m63k217k258r13R87
59831G04156K758M017M326L217Q20j975m447o676q864j0524j0963j0336r523r041
59817F46945q718q313p883p405o581n245l721k519j805j293o34J26N71N02K38
59802E94265R3k07j083k258k980l122l344m033m801n243n505n743n689n168m495
59787E40687l950l436k941k754k827k574j773j046j001j413j748j780j345k10
$$ y = [624654, 624123, 624791, 626601, 629355, 632944, 637088, 641194, 644897, 648518, 652531, 656787, 660796, 664627, 668983, 674289, 680089, 685350, 689131, 691062, 691502, 691088, 689799, 686721, 681144, 673690, 665855, 658694, 652438, 647122, 642774, 639013, 635195, 631137, 627271, 624062, 621785, 620697, 620770, 621310, 621620, 622150, 624182, 628161, 633150, 638306, 644162, 651839, 661490, 672149, 682733, 692517, 700761, 706493, 709020, 708557, 706340, 704082, 703169, 704156, 706914, 710931, 715257, 718474, 719294, 717319, 712872, 706196, 697332, 686808, 675845, 665509, 655986, 646945, 638227, 629914, 622031, 614626, 608045, 602800, 599079, 596560, 594755, 593462, 592828, 592954, 593525, 594027, 594265, 594358, 594151, 593068, 590810, 587830, 584708, 581364, 577331, 572530, 567287, 561782, 556039, 550350, 545182, 540687, 536737, 533301, 530360, 527606, 524779, 522205, 520432, 519386, 518385, 516972, 515224, 513444, 512099, 511889]
59773E11889J184J704R07j44k68L40P63Q60J107J487J573J452J612K071K449K734
59757E31720L266M015M561M629M236L490K788K793L719M928N713O008N959N460
59743E93285M732M563N179N521M591K931J737J123L86m77p75l91R9M40P83R74
59727F24701Q22P70J235J545Q03l44k66J252K497K122P58j29k6N15P90M66k71
59710F37240p73n66L3L32J81j18n21r72p69P05K601L199K081P13M88J250K095
59693F47199K669L059L189K915K315J425J96j061j636j144N0J252J937J849J184
59678F65398N64K57m11k175m529o161o623o633o704o539n994n527n328m957m270
59663F00368l824l894l944l513k907k463j996j395j027r32l54J202L039M041L957
$$ y = [511889, 513073, 514777, 515684, 515540, 515272, 515612, 516375, 517235, 518342, 519829, 521402, 522854, 524466, 526537, 528986, 531720, 534986, 539001, 543562, 548191, 552427, 555917, 558705, 561498, 565217, 570145, 575858, 581866, 587825, 593285, 598017, 602580, 607759, 613280, 617871, 620802, 622539, 623662, 624048, 623571, 622796, 622405, 622504, 622944, 623727, 624701, 625523, 626293, 627528, 629073, 629876, 629532, 629266, 630518, 633015, 635137, 635895, 635766, 635740, 636255, 637045, 637511, 637240, 636467, 635901, 635934, 636266, 636447, 636329, 635808, 634836, 634067, 634772, 637373, 640572, 642653, 643366, 643854, 645104, 647199, 649868, 652927, 656116, 659031, 661346, 662771, 662967, 661906, 660270, 659126, 659176, 660428, 662365, 664214, 665398, 665962, 666219, 665808, 663633, 659104, 652943, 646320, 639687, 632983, 626444, 620450, 614923, 609595, 604638, 600368, 596544, 592650, 588706, 585193, 582286, 579823, 577827, 576432, 575405, 574473, 574119, 575321, 578360, 582401, 586358]
59648E86358L329K608J922J374R74N06j11p02j319k357l674m175l059j125m1l34
59632E80174q04j68J330K268J730K23j063j552j587j676j901k104k198k068j596
59617E69008j033r19j292j475j126q35j047j029J31J933K989K932K677K839L040
59602E76793K851K376J655N37o08j006o89o69j498k484k774k371j666p91k1J2
59586E69647q16j606j538j056j231k263l251l353k653j881j572j692j965k361
59572E42409k974l460l141k054j266j520k111j890r51k16J55Q01J698K071J826
59557E29377J773K151K210J658J325J806K479K545K139J796J594J462J674K439
59543E56428L554M812O209P489Q232Q690R816J2179J5444J8878K1369K1024J6383
$$ y = [586358, 589687, 592295, 594217, 595591, 596565, 597071, 596960, 596258, 594939, 592582, 588908, 584733, 581674, 580549, 580508, 580174, 579370, 579202, 580532, 582800, 584530, 584753, 583690, 582138, 580551, 578875, 576974, 574870, 572672, 570604, 569008, 567975, 567056, 565764, 564289, 563163, 562328, 561281, 560252, 560383, 562316, 565305, 568237, 570914, 573753, 576793, 579644, 582020, 583675, 584212, 583604, 582598, 581909, 581240, 579742, 577258, 574484, 572113, 570447, 569656, 569635, 569647, 568831, 567225, 565687, 564631, 563400, 561137, 557886, 554533, 551880, 549999, 548427, 546735, 544770, 542409, 539435, 535975, 532834, 530780, 529514, 527994, 525883, 523993, 523042, 522826, 522981, 523782, 525480, 527551, 529377, 531150, 533301, 535511, 537169, 538494, 540300, 542779, 545324, 547463, 549259, 550853, 552315, 553989, 556428, 559982, 564794, 571003, 578492, 586724, 595414, 605230, 617409, 632853, 651731, 673100, 694124, 710507]
59530G10507Q618J242l106m594m504l130m11K703M977O271P012O973N716L706
59516G41980J836K62j459l434n528p885j0482j2595j3555j3668j3604j3295j2280
59503F36293j0695r137p837o708n843n243m470l263k135j666j597j292o26K05
59489E75986J175K039K111J280O82J371K804L665L749L926M585N274N788O540
59475F20975P746R068J0171J0885J0882R855P982N735L349J057n03q27l26J66
59461F96215N08J225K565M255O033P787R335J0692J2321J4381J6007J6151J5026
59448H12501J3893J3444J3105J2004R855O828L132j030n444r891j3929j6907j8441
59435H19120j8711j7978j6282j3948j1818j0390r213p763o359n411m255j810J850
$$ y = [710507, 719125, 720367, 717261, 712667, 708163, 705033, 704622, 707325, 712302, 718573, 725585, 732558, 738274, 741980, 743816, 744078, 742619, 739185, 733657, 725772, 715290, 702695, 689140, 675472, 661868, 648573, 636293, 625598, 616461, 608624, 601916, 596073, 590830, 586360, 583097, 580962, 579296, 577699, 576407, 575781, 575986, 577161, 579200, 581311, 582591, 583273, 584644, 587448, 591113, 594862, 598788, 603373, 608647, 614435, 620975, 628721, 637789, 647960, 658845, 669727, 679582, 687564, 693299, 696648, 697705, 697202, 696375, 696049, 696215, 696723, 697948, 700513, 704768, 710801, 718588, 727923, 738615, 750936, 765317, 781324, 797475, 812501, 826394, 839838, 852943, 864947, 874802, 881630, 884762, 883732, 878288, 868397, 854468, 837561, 819120, 800409, 782431, 766149, 752201, 740383, 729993, 720780, 713017, 706658, 701247, 696992, 695182, 697032]
59422F97032N510Q373J0762J3280J6067J8934K1569K3555K4685K5264K5806K6630
59410I17467K7887K9132K8354K2466J0340m928j7992k5608k8187k7584k4830k0108
59398H86409j3531n466K817Q440Q127J032j0060k0782k8059l1009l0295k7424
59386G40199k4088k1177j8467j5483j2418r829p832o068m317k715j414l06Q11
59373F16896J954K887L369L463L502L712M043M434M970N643O191O441O559O800
59359F80864P222P847Q734R739J0541J1267J2537J4579J6770J8509K0118K2222
59347H40949K4674K6636K7581K7548K6786K5610K4362K2860K0243J5908J0438
59336A093595M974p5n062j0051j4503j8001k0681k2852k4602k5784k6181k5810
$$ y = [697032, 702542, 710915, 721677, 734957, 751024, 769958, 791527, 815082, 839767, 865031, 890837, 917467, 945354, 974486, 1002840, 1025306, 1035646, 1030718, 1012726, 987118, 958931, 931347, 906517, 886409, 872878, 867412, 870229, 878669, 886796, 887828, 877768, 856986, 828927, 797918, 767623, 740199, 716111, 694934, 676467, 660984, 648566, 638737, 630905, 624837, 620520, 617805, 616391, 616085, 616896, 618850, 621737, 625106, 628569, 632071, 635783, 639826, 644260, 649230, 654873, 661064, 667505, 674064, 680864, 688086, 695933, 704667, 714406, 724947, 736214, 748751, 763330, 780100, 798609, 818727, 840949, 865623, 892259, 919840, 947388, 974174, 999784, 1024146, 1047006, 1067249, 1083157, 1093595, 1098569, 1098494, 1093432, 1083381, 1068878, 1050877, 1030196, 1007344, 982742, 956958, 930777, 904967]
59324I04967k5073k4312k3126k0868j7966j5867j5105j4423j2593j0159q322o933
59312G10220n030k800j465j379j515r96M6J190K296L200L795M478N667O954P681
59297G32342Q276R891J2638J5241J6585J6458J4560J0075K972n085j1842j6063
59285H06048j7716j7292j5448j2905j0202p613n385l633k005Q0K664N187P251
59272G29031R031J0813J2546J3987J4963J5382J5214J4414J2758R986O353K655
59260H67133o23l744o943r771j1812j3399j4902j5818j5560j4600j3881j3388
59248G32692j2307j0395q178o034l994k246q33Q60L293N696O931P171P559Q381
59234G28596Q925R007R189R333Q422O109L269O16k010m693o917q501r922j1311
$$ y = [904967, 879894, 855582, 832456, 811588, 793622, 777755, 762650, 748227, 735634, 725475, 717153, 710220, 705190, 702390, 700925, 699546, 698031, 697035, 697081, 698271, 700567, 703767, 707562, 712040, 717707, 724661, 732342, 740618, 750509, 763147, 778388, 794973, 811431, 825991, 836066, 839038, 833953, 822111, 806048, 788332, 771040, 755592, 742687, 732485, 724872, 719487, 715854, 713849, 713929, 716593, 721780, 729031, 738062, 748875, 761421, 775408, 790371, 805753, 820967, 835381, 848139, 858125, 864478, 867133, 866510, 862766, 855823, 846052, 834240, 820841, 805939, 790121, 774561, 759961, 746080, 732692, 720385, 709990, 701812, 695778, 691784, 689538, 688705, 689565, 692858, 698554, 705485, 712656, 720215, 728596, 737521, 746528, 755717, 765050, 773472, 779581, 782850, 783466, 781456, 776763, 769846, 761345, 751423, 740112]
59220G40112j2124j2164j1881j1339r983p895o153n390n005m340l612l037k047
59207F45142j89J871L050L026K218J210N75O64J086J020L48j86k08k57o26o69
59191F58075J21J062J164N14M9K80Q29J041O73J30J60J056K088K236J480P94Q66
59174F72618J479K277L276M514N824P254R007J0829J2135J2860J3460J3955J3835
59161G83323J3023J2055J1057R418O826L751O27k595n773q276r801j0739j1443
59148G91453j1805j1797j1643j1284j0478r522r002q769q181p446p528q406q807
59135F66785q124p351p381p602o950n448l845k550j614j024m55N30J654K091J843
59120F20559J978L042M333N246O242P728R107R768J0083J0554J0951J0983J0936
$$ y = [740112, 727988, 715824, 703943, 692604, 682621, 674726, 668573, 663183, 658178, 653838, 650226, 647189, 645142, 644953, 646824, 649874, 652900, 655118, 656328, 656903, 657567, 658653, 659673, 660021, 659835, 659627, 659370, 658744, 658075, 658196, 659258, 660422, 660936, 660985, 661265, 662094, 663135, 663808, 663938, 664098, 665154, 667242, 669478, 670958, 671752, 672618, 674097, 676374, 679650, 684164, 689988, 697242, 706249, 717078, 729213, 742073, 755533, 769488, 783323, 796346, 808401, 819458, 828876, 835702, 839453, 840080, 837485, 831712, 823436, 813635, 802896, 791453, 779648, 767851, 756208, 744924, 734446, 724924, 715922, 707153, 698972, 691526, 683998, 675592, 666785, 658661, 651310, 643929, 636327, 629377, 623929, 620084, 617534, 615920, 614896, 614441, 614971, 616625, 618716, 620559, 622537, 625579, 629912, 635158, 641400, 649128, 658235, 668003, 678086, 688640, 699591, 710574, 721510]
59107G21510J0863J0124Q579P274O940O754N569L660K114J199M10m20j096j727
59093G81753k468k992k988k837l047l449l548l258k758k158j839k445l978n591
59079G38397o702p633q610r150r060r036r442r419q213o511n449n028m546l921
59065F35677l559l454l287l020k607j779p96o16j519k425k443k169k434k703k026
59050F00840p91j77l99p49r40j108r63j80O36N75j98p50q19r20j251j442j216
59033E90148m60J010K896M138M108L708M318O001P704Q887R904J1021J2072J2928
59019F78383J3456J3291J2347J1195J0124Q357N163J257j896l773m761m924l992
59006G34227k331q40J15P91J382K035L212N073O856P771Q110Q584Q996Q700P931
$$ y = [721510, 732373, 742497, 751076, 758350, 765290, 772044, 777613, 781273, 783387, 784586, 784996, 784576, 783480, 781753, 779285, 776293, 773305, 770468, 767421, 763972, 760424, 757166, 754408, 752250, 750411, 747966, 743988, 738397, 731695, 724062, 715452, 706302, 697242, 688206, 678764, 669345, 661132, 654621, 649172, 644144, 639598, 635677, 632118, 628664, 625377, 622357, 619750, 617971, 617175, 616559, 615040, 612615, 610172, 608003, 605569, 602866, 600840, 600049, 599872, 599473, 598724, 597784, 596676, 595713, 595533, 596169, 596744, 596546, 595796, 594977, 594057, 592806, 591364, 590148, 589688, 590698, 593594, 597732, 601840, 605548, 609866, 615867, 623571, 632458, 642362, 653383, 665455, 678383, 691839, 705130, 717477, 728672, 738796, 747153, 752316, 753573, 751677, 747904, 743143, 738219, 734227, 731896, 731056, 731171, 731962, 733344, 735379, 738591, 743664, 750520, 758291, 766401, 774985, 783981, 792681, 800612]
58991H00612P496P391O862N718M446L205J670j66j973l700n319o253n970m905
58977H09114l803k581p66J297K898M272O198Q456J0014J0685J1363J2514J3644
58964H83305J4367J4880J5189J4859J3827J2542J1122R168O551L588L29l571q061
58951I88095j2447j6080j8714k0262k0767k0568k0000j8982j7417j5668j4066
58940G93124j2278r878p248n223m111l656l586l566l092k184j670k026k497k230
58926G29879j706j902k684l125l082l183l564l703l397k877k104r51J72P58J030
58911F99561J486K051K517L321M820O347P070P424Q490J0391J2456J4481J6571
58898G96986J8197J8747J8667J8809J9019J8696J8282J8745J9898K0844K1764
$$ y = [800612, 808108, 815499, 822361, 828079, 832525, 835730, 837400, 837234, 835261, 831561, 826242, 819989, 814019, 809114, 805311, 802730, 801964, 803261, 806159, 810431, 816629, 825085, 835099, 845784, 857147, 869661, 883305, 897672, 912552, 927741, 942600, 956427, 968969, 980091, 989259, 995810, 999398, 999727, 996156, 988095, 975648, 959568, 940854, 920592, 899825, 879257, 859257, 840275, 822858, 807190, 793124, 780846, 770968, 763720, 758497, 754386, 750730, 747144, 743578, 740486, 738302, 736632, 734606, 732109, 729879, 728173, 726271, 723587, 720462, 717380, 714197, 710633, 706930, 703533, 700656, 698552, 697601, 697773, 698531, 699561, 701047, 703098, 705615, 708936, 713756, 720103, 727173, 734597, 743087, 753478, 765934, 780415, 796986, 815183, 833930, 852597, 871406, 890425, 909121, 927403, 946148, 966046, 986890, 1008654]
58887A008654K3693K6552K9035L0363L0672K9670K6543K1469J5789J0414N203
58876A258057M6m737r217j3894j8760k3243k6960k9550l0142k8291k5169k2506
58864A025634k0594j8631j6664j5490j4926j3933j2457j1547j1520j1662j1735
58853H66475j2224j2952j3038j2344j1462j0360q676p226p345q591r029q093p241
58840G37894p451p953p973p914q079p906p179o595o488o337n983n889n884n103
58826F41160l574k276j372o0J576K376K267K617L842M644M393M280N071N647M971
58811F75562L836L360L173K509J750J559J527R07j34j020j687k209k378k339k683
58796F81733l375l586l171l094l831m548m474l927l314k410j255m99j83O85K592
$$ y = [1008654, 1032347, 1058899, 1087934, 1118297, 1148969, 1178639, 1205182, 1226651, 1242440, 1252854, 1258057, 1258103, 1253366, 1244149, 1230255, 1211495, 1188252, 1161292, 1131742, 1101600, 1073309, 1048140, 1025634, 1005040, 986409, 969745, 954255, 939329, 925396, 912939, 901392, 889872, 878210, 866475, 854251, 841299, 828261, 815917, 804455, 794095, 785419, 778193, 770848, 762257, 753228, 745135, 737894, 730443, 722490, 714517, 706603, 698524, 690618, 683439, 676844, 670356, 664019, 658036, 652147, 646263, 641160, 637586, 635310, 633938, 633878, 635454, 637830, 640097, 642714, 646556, 651200, 655593, 659873, 664944, 670591, 675562, 679398, 682758, 685931, 688440, 690190, 691749, 693276, 694183, 694049, 693029, 691342, 689133, 686755, 684416, 681733, 678358, 674772, 671601, 668507, 664676, 660128, 655654, 651727, 648413, 646003, 644748, 644249, 644066, 644751, 647343]
58781F47343M751O312P173P204O134M666M108M407M060K567J131L03j043l460
58767F95656n589o326o499p060p377o731n949n903n834m711l026j682l27J621
58753F30263L403L975L709L617L682L334K789K620K675K626K800L466M145M551
58739F77655N261O500P393P376P201P463P494O870O612P468Q364Q141P601Q095
58725G79494R112R097P969P002O812O970P164P273O862N962N776P209R251J0160
58711H86113R710Q920Q090O574M189J488j236m100o895r208j1134j3170j5537
58698H63804j8113k0581k2248k2468k1665k1038k0716j9404j6531j3497j1763
58687F55780j0977j0071r072q519q109p327o638o687o950o445n174l804k577j403
$$ y = [647343, 652094, 658406, 665579, 672783, 678917, 683583, 687691, 692098, 696158, 698725, 699856, 700159, 699116, 695656, 690067, 683741, 677242, 670182, 662805, 656074, 650125, 644222, 638388, 633677, 630651, 628969, 628642, 630263, 633666, 637641, 641350, 644967, 648649, 651983, 654772, 657392, 660067, 662693, 665493, 668959, 673104, 677655, 682916, 689416, 696809, 704185, 711386, 718849, 726343, 733213, 739825, 747293, 755657, 763798, 771399, 779494, 788606, 797703, 805672, 812674, 819486, 826456, 833620, 840893, 847755, 853717, 859493, 866702, 875953, 886113, 895823, 904743, 912833, 919407, 923596, 925084, 923848, 919748, 912853, 903645, 892511, 879341, 863804, 845691, 825110, 802862, 780394, 758729, 737691, 716975, 697571, 681040, 667543, 655780, 644803, 634732, 625660, 617141, 609032, 601705, 595067, 588380, 581430, 574985, 569811, 566007, 563430, 562027]
58673E62027m18M92J857L587M693M902N436P237R589J1516J3336J5565J7396J7569
58659F74784J5801J2348P318J601k791m821n820p405r156r712r056q133p244o366
58645F41348o051o452o372m876k954k071j940j330j14J101K446M221N561N453
58631F27970M446L807L615L106K241J429M67q49j740j441m50N46J921L996N796
58616F54860O513P083Q644J0539J1588J2166J2978J2924J0476O396K803K01k374
58603G54797m762n667n064m508m871n588o146o669p010o696n820m832l652k029
58589F81483l58R50K290M050N783P233R137J1744J3701J3882J3234J3178J3341
58576G89648J2530J0931R513Q339P161O688P481Q631R348J0620J3510J7063J9948
$$ y = [562027, 561609, 562101, 563958, 567545, 572238, 577140, 582576, 589813, 599402, 610918, 624254, 639819, 657215, 674784, 690585, 702933, 710251, 711852, 709061, 704240, 698420, 691015, 681859, 672147, 663091, 654958, 647714, 641348, 635297, 628845, 622473, 617597, 614643, 612572, 610632, 609302, 609188, 610289, 612735, 616956, 622517, 627970, 632416, 636223, 639838, 642944, 645185, 646614, 647081, 646232, 644492, 643051, 642601, 643147, 645068, 649064, 654860, 661373, 668456, 677100, 687639, 699227, 711393, 724371, 737295, 747771, 754167, 756970, 757171, 754797, 750035, 744368, 739304, 734796, 729925, 724337, 718191, 711522, 704512, 697816, 691996, 687164, 683512, 681483, 681125, 682075, 684365, 688415, 694198, 701431, 710568, 722312, 736013, 749895, 763129, 776307, 789648, 802178, 813109, 822622, 830961, 838122, 844810, 852291, 860922, 870270, 880890, 894400, 911463, 931411]
58563I31411K2716K6284K9511L0837L1007L1541L1587K9109K4318J9140J3993
58552A221454P966J667l001n647p477q915r529r815j0552j0959j0009r034j0358
58539A135791j3794j7106j9477k1793k4032k5173k5416k5642k5047k2111j7652
58528H98548j4063j1689q916n607l320k083j23K829M960N492N650O097O041N270
58514H89086M550L722J902k70j180j115j955l893n222n490n995o836o521n036
58500H55747m376n288o182o041n832o206o251n358m209l250k161j205j060j100
58486G97228L5K169M034N716Q210J0866J2100J2503J4185J6990J8502J8031J7402
58473I37971J7243J5757J1890O844J762l351p887j0560j1706j2893j3915j2956
$$ y = [931411, 954127, 980411, 1009922, 1040759, 1071766, 1103307, 1134894, 1164003, 1188321, 1207461, 1221454, 1229420, 1231087, 1228086, 1222439, 1214962, 1206047, 1196518, 1186703, 1176151, 1165192, 1155183, 1146149, 1135791, 1121997, 1104891, 1085414, 1063621, 1039589, 1014416, 989000, 963358, 938311, 916200, 898548, 884485, 872796, 863880, 858273, 854953, 852870, 852747, 855576, 860536, 866028, 871678, 877775, 883816, 889086, 893636, 897358, 899260, 898990, 897810, 896695, 894740, 890847, 885625, 880135, 874140, 867304, 860783, 855747, 851371, 846083, 839901, 833860, 828028, 821822, 815571, 810213, 806004, 802754, 800593, 799388, 798328, 797228, 797263, 799432, 803466, 809182, 817392, 828258, 840358, 852861, 867046, 884036, 902538, 920569, 937971, 955214, 970971, 982861, 989705, 991467, 988116, 980229, 969669, 957963, 945070, 931155, 918199]
58461I18199j0076p442n730l458l65J860K967M926Q369J1303J2355J2341J1785
58448I57034R885O790L904J130l133q474j2110j2918j2644j2293j0667p548m945
58435H94011l812k620m51J407K166K887M065M751N101O753R702J1844J2516J3356
58421I61676J4737J4736J2647J0095P680M047o07l806m903o295r103j1304j1668
58408I77932j1875j3015j3550j2602j1840j2208j2052j0286q312p088n464k968
58396H56672j090l17Q11K441K655J344J048K507L201J908Q13J384J999J540J451
58381H78367K364K561J562J400K546K713J451J603M164O187N980N852P364Q483
58367I32597Q023Q302J0585J2346J2024J2067J4239J6353J6609J6808J8096J8029
$$ y = [918199, 908123, 900681, 894951, 891493, 891128, 892988, 895955, 900881, 909250, 920553, 932908, 945249, 957034, 966919, 973709, 977613, 978743, 975610, 967136, 955026, 942108, 929464, 917171, 906504, 898956, 894011, 890199, 887579, 887128, 888535, 890701, 893588, 897653, 902404, 907505, 914258, 923960, 935804, 948320, 961676, 976413, 991149, 1003796, 1013891, 1021571, 1025618, 1025011, 1021205, 1016302, 1010007, 1000904, 989600, 977932, 966057, 953042, 939492, 926890, 915050, 902842, 890790, 880504, 872192, 865104, 859640, 856672, 855582, 855265, 856076, 858517, 861172, 862516, 863564, 866071, 869272, 871180, 871993, 873377, 875376, 876916, 878367, 880731, 883292, 884854, 886254, 888800, 891513, 892964, 894567, 898731, 904918, 910898, 916750, 924114, 932597, 940620, 948922, 959507, 971853, 983877, 995944, 1010183, 1026536, 1043145, 1059953, 1078049, 1096078]
58355A096078J5190J2275J1205R560N404J235m63j282k883l321j151J058J221
58342A144126J566M176O914P665Q348J0752J2646J2170J1831J3930J6245J6375
58330A266744J6155J7465J8038J5862J3382J2819J1651P461K979J479J349K7q67
58317A384544P79K858K960K936M855O676O602P285J0760J3819J3486J2467J3895
58304A483922J5555J4715J3864J5809J7958J7335J6424J8055J9397J7458J5505
58293A665997J7381K0200J9640J7789J8737K0840K0570J9708K1515K3913K3553
58282A889843K2515K4041K5991K5484K5371K9012L3426L4895L6225M0961M5725
58271B233489M6333M6159M9991N4958N6251N6506O0362O5031O5636O4933O8036
$$ y = [1096078, 1111268, 1123543, 1134748, 1144308, 1149712, 1150947, 1150484, 1149202, 1146319, 1142998, 1141847, 1142905, 1144126, 1145692, 1149868, 1156782, 1164447, 1172795, 1183547, 1196193, 1208363, 1220194, 1234124, 1250369, 1266744, 1282899, 1300364, 1318402, 1334264, 1347646, 1360465, 1372116, 1379577, 1382556, 1384035, 1385384, 1385411, 1384544, 1385323, 1388181, 1391141, 1394077, 1398932, 1405608, 1412210, 1419495, 1430255, 1444074, 1457560, 1470027, 1483922, 1499477, 1514192, 1528056, 1543865, 1561823, 1579158, 1595582, 1613637, 1633034, 1650492, 1665997, 1683378, 1703578, 1723218, 1741007, 1759744, 1780584, 1801154, 1820862, 1842377, 1866290, 1889843, 1912358, 1936399, 1962390, 1987874, 2013245, 2042257, 2075683, 2110578, 2146803, 2187764, 2233489, 2279822, 2325981, 2375972, 2430930, 2487181, 2543687, 2604049, 2669080, 2734716, 2799649, 2867685]
58260B867685P2486P3165P2134P3847P5704P3349P0093P0924P2570P0022O7297
58249C659276P0751P7320Q0604Q2851Q9316R6898J00467J04314J14523J26276
58239D602596J31913J35287J44364J56058J62961J68569J80612J95548K05490
58230F083398K14280K30428K50355K65505K79721L02088L29036L51623L73968
58221H680402M05689M42983M76771N12393N60734O17412O72262P31459Q07715
58212A3907820Q97233R90573J097111J233291J396711J579572J797130K073391
58204B4972832K410711K805917L283237L874792M581283N391296O327349P434713
58196F1082130Q743833J0286624J2119947J4272569J6697013J9346940K2280656
$$ y = [2867685, 2940171, 3013336, 3085470, 3159317, 3235021, 3308370, 3378463, 3449387, 3521957, 3591979, 3659276, 3730027, 3807347, 3887951, 3970802, 4060118, 4157016, 4257483, 4361797, 4476320, 4602596, 4734509, 4869796, 5014160, 5170218, 5333179, 5501748, 5682360, 5877908, 6083398, 6297678, 6528106, 6778461, 7043966, 7323687, 7625775, 7954811, 8306434, 8680402, 9086091, 9529074, 10005845, 10518238, 11078972, 11696384, 12368646, 13100105, 13907820, 14805053, 15795626, 16892737, 18126028, 19522739, 21102311, 22899441, 24972832, 27383543, 30189460, 33472697, 37347489, 41928772, 47320068, 53647417, 61082130, 69825963, 80112587, 92232534, 106505103, 123202116, 142549056, 164829712]
58189A64829712K5614473K9389108L3480655L7394532L9827128L8571219L1557326
58182D00664153J8634999K378948j3179814k4844412l1522874l3815941l3004312
58175B85310747l0483142k7534729k4996190k3011085k1254898j9427710j7481517
58168A21121476j5495422j3538802j1682661j0011586q565163p321622o255596
58161D8250624n362204m620616l987979l440714k981379k600512k270432j979905
58153B1006883j738640j543919j375376j224958j101273j002130r11504q25648
58145A1283435p55115o99162o43539n85234n35227m95077m53828m09658l72532
58136F334063l43653l13333k81111k57731k45046k32768k17208k05102j97160
$$ y = [164829712, 190444185, 219833293, 253313948, 290708480, 330535608, 369106827, 400664153, 419299152, 421678100, 408498286, 383653874, 352131000, 318315059, 285310747, 254827605, 227292876, 202296686, 179285601, 158030703, 138602993, 121121476, 105626054, 92087252, 80404591, 70393005, 61827842, 54506220, 48250624, 42888420, 38267804, 34279825, 30839111, 27857732, 25257220, 22986788, 21006883, 19268243, 17724324, 16348948, 15123990, 14022717, 13020587, 12109083, 11283435, 10528320, 9829158, 9185619, 8600385, 8065158, 7570081, 7116253, 6706595, 6334063, 5990410, 5677077, 5395966, 5138235, 4893189, 4660421, 4443213, 4238111, 4040951]
58127D040951j85509j69579j57734j51064j41509j27939j18373j14339j08243
58118B766662r8333r1637q9773q5934p8277p2840p0852o6291n8281n3366n3174
58107A947904n1736m7126m4124m3544m0482l4908l2691l4306l3626k9607k8104
58096A527650l0324l0508k7075k5250k6539k6157k3117k2506k5330k6283k4015
58085A240546k3661k6558k7269k3786k1191k2161k2813k1084k0569k2768k3766
58074I84920k1754k0144k0460j9644j6992j6091j7464j6856j3273j1177j2266
58063G98799j2554j0156q473r058q660o110n009o724p626o099n601p897r825r499
58049F85508r324j0258r516o640n419p007p503n145l679n499p589p352o656p094
$$ y = [4040951, 3855442, 3685863, 3528129, 3377065, 3235556, 3107617, 2989244, 2874905, 2766662, 2668329, 2576692, 2486919, 2400985, 2322708, 2249868, 2179016, 2112725, 2054444, 2001078, 1947904, 1896168, 1849042, 1804918, 1761374, 1720892, 1685984, 1653293, 1618987, 1585361, 1555754, 1527650, 1497326, 1466818, 1439743, 1414493, 1387954, 1361797, 1338680, 1316174, 1290844, 1264561, 1240546, 1216885, 1190327, 1163058, 1139272, 1118081, 1095920, 1073107, 1052023, 1031454, 1008686, 984920, 963166, 943022, 922562, 902918, 885926, 869835, 852371, 835515, 822242, 811065, 798799, 786245, 776089, 767616, 758558, 749898, 743788, 738779, 732055, 724429, 718330, 712729, 704832, 695007, 685508, 676184, 665926, 656410, 649770, 644351, 637344, 629841, 624696, 621017, 615518, 607929, 600577, 593921, 586827]
58035E86827o810n087m565o097o745n570n919r193j1827j1329j0079j0183r910
58022D83513q127p122p923p788n397l636m283m746l123j706k368l038j910p93
58008D21553j229j504m31O4j012j304M24J596M11q47l8J295J344J237K089K508
57992D26156J644J160J817J706J07p33K25P77l01j102p97j562m007n139l570k312
57976D14069l564n022m389l320l671l871k360q27q14p08O90J354j18j455p34J55
57960C85415o08j126N22K323J769J05l23p1n78j000l59j05j328k134q30J030J693
57943C84395K379M397O173O255O338Q092R890J0017J0096J1917J3797J3672J2975
57930E00393J3741J4455J2678R432P117N277K189j269l185m282o450r150j0624
$$ y = [586827, 580017, 574930, 570365, 564268, 557523, 551953, 546034, 536841, 525014, 513685, 503606, 493423, 483513, 475386, 468264, 460341, 452553, 447156, 443520, 439237, 434491, 431368, 429662, 427294, 424256, 422346, 421553, 420324, 418820, 418389, 418453, 417441, 416137, 416561, 418157, 418568, 417721, 417683, 418978, 420322, 421559, 423648, 426156, 427800, 428960, 430777, 432483, 432590, 431857, 432082, 432859, 432558, 431456, 430659, 429097, 425090, 419951, 416381, 414069, 410505, 405483, 401094, 397774, 394103, 390232, 387872, 387045, 386231, 385523, 386213, 387567, 387449, 385994, 385260, 385415, 384807, 383681, 384203, 386526, 388295, 388400, 388077, 388006, 387428, 386428, 386069, 385964, 384636, 382502, 381672, 382702, 384395, 386774, 391171, 397344, 403599, 409937, 418029, 427919, 437936, 448032, 459949, 473746, 487418, 500393, 514134, 528589, 541267, 550699, 557816, 563093, 565282, 564013, 560828, 556546, 550096, 540946, 530322]
57917E30322j1145j1970j2652j2332j1994j2536j2489j0564q439p981p824n964
57905D04432l656l272m113l981l183l484m465m455l749l696l755k632j056l98
57891C58537J29J854L705M014L766M842O391O296M987M439M500L605K130J661
57877D10856J705M73j752l153l680m735o235o848o689o903p148o248m876m722
57863C50045n514n406l993k569j780j273j076j131l25J898L908M046L230L193
57849C43253L497K842J954K291L039K419R26L27L01p87k556l200k786k933l613
57834C44974l337k164j619j818j511p95r47j735j592l26Q22J675L082M580M707
57819C43996L692L313M088M807M820M616M252L398K740L164L829L137J277l48
$$ y = [530322, 519177, 507207, 494555, 482223, 470229, 457693, 445204, 434640, 426201, 418220, 410396, 404432, 400776, 397504, 393391, 389410, 386227, 382743, 378278, 373823, 370074, 366378, 362623, 359991, 358935, 358537, 358666, 360520, 364225, 368239, 372005, 376847, 383238, 389534, 394521, 398960, 403460, 407065, 409195, 410856, 412561, 413034, 411282, 408129, 404449, 399714, 393479, 386631, 379942, 373039, 365891, 359643, 354767, 350045, 344531, 339125, 335132, 332563, 330783, 329510, 328434, 327303, 326978, 328876, 332784, 336830, 340060, 343253, 346750, 349592, 351546, 353837, 356876, 359295, 360221, 360548, 360849, 360062, 357506, 354306, 351520, 348587, 344974, 341637, 339473, 337854, 336036, 334525, 333730, 332783, 331048, 329456, 329130, 329952, 331627, 334709, 339289, 343996, 347688, 351001, 355089, 359896, 364716, 369332, 373584, 376982, 379722, 382886, 386715, 389852, 391129, 390781]
57805C90781j682l670n845o771o651o971p744p488n942m477l797l401l226l733
57791C19383m424m260l409k816k451j804j432j912k040m62J676K235J588J921
57777C01793L555M782N060N531O430O772O596O885P168N954L654K394K619K508
57763C71701J101m55j309k091l194l980m257m607m918m481l649l537l989l815
57749C28520k984k626k898k914k632k763l024k619k143k702l569l194k152k312
57735B89988l399l312j868j059j427j314k37J33q65j651j298r75j491j865j436
57720B67924j049j198j122n50k59k70L07J126O27j113k051j414p70j093j313q19
57704B56963p70j653j949o80Q32J146P45O79R95J619K890M164L780J511q00k033
$$ y = [390781, 389099, 385429, 379584, 372813, 366162, 359191, 351447, 343959, 338017, 333540, 329743, 326342, 323116, 319383, 314959, 310699, 307290, 304474, 302023, 300219, 298787, 296875, 294835, 294373, 296049, 298284, 299872, 301793, 305348, 310130, 315190, 320721, 327151, 333923, 340519, 347404, 354572, 360526, 364180, 366574, 369193, 371701, 372802, 372347, 371038, 368947, 365753, 361773, 357516, 352909, 347991, 343510, 339861, 336324, 332335, 328520, 325536, 322910, 320012, 317098, 314466, 311703, 308679, 306060, 303917, 301215, 297646, 294452, 292300, 289988, 286589, 283277, 281409, 280350, 278923, 277609, 277372, 277505, 276640, 274989, 273691, 272716, 271225, 269360, 267924, 266875, 265677, 264555, 264005, 263746, 263476, 263783, 264909, 265536, 264423, 262372, 260958, 260188, 259095, 257782, 256963, 256193, 254540, 252591, 251911, 252743, 253889, 254634, 255313, 256308, 257927, 260817, 264981, 268761, 270272, 269472, 267439]
57688B67439l113m595n173m062k675k290j958m22J595K801L623N318P971J0874
57674B75333J3970J7506K1164K4741K8821L3893L9616M5656N2081N7955O0460
57663F71196N6350M3873K3524j616k6066m4404n4632n8302n7400n2807m5873l9016
57651D14827l3594k8876k4092j9857j6707j3946j1030q600p158o137n114m505
57639B35211m360l926l117k842l183k937j713p15o92q21n29n09j059j255q09q76
57623B05868j988k940k851k536k682k589j839j410j778j790p37K32J87N0O13Q05
57607A84615l68j716j568k57P89J199J275Q06k02p19j70M01M7m68j83K54j48q68
57589A82719r54q05j272j945j942j530j438j496j179p74o55l78L26P00J97m63
$$ y = [267439, 264326, 259731, 254558, 250496, 247821, 245531, 243573, 243151, 244746, 247547, 251170, 256488, 264459, 275333, 289303, 306809, 327973, 352714, 381535, 415428, 455044, 500700, 552781, 610736, 671196, 727546, 771419, 794943, 793327, 767261, 722857, 668225, 609923, 552523, 499716, 453843, 414827, 381233, 352357, 328265, 308408, 291701, 277755, 266725, 258125, 250967, 244830, 239716, 235211, 230851, 226925, 223808, 220966, 217783, 214846, 213133, 212418, 211726, 210905, 210376, 209867, 208808, 207553, 206744, 205868, 203880, 200940, 198089, 195553, 192871, 190282, 188443, 187033, 185255, 183465, 182728, 182960, 183147, 183197, 183810, 184615, 184247, 182531, 180963, 180706, 181495, 182694, 183969, 184775, 184573, 183854, 183684, 184085, 184132, 183664, 183481, 183735, 183587, 182719, 181765, 180960, 179688, 177743, 175801, 174271, 172833, 171337, 170158, 169384, 168729, 168351, 168677, 169377, 169574, 169111]
57573A69111o52r72j850k332j728j105j578k313j927p97k51m17n59o68j046j044
57557A49872J00J684K334J893J262R78J032J480K101K143J400P52P92R43Q55J318
57541A70939K652L588L167K416K610L161K880K147J956J776M09j669k731k150
57527A91151q42K60P71M46n09j157r23m35l44j85O03J488J818J933K241K274J809
57510B00399J684K289K546J731Q86R69J136M85k6P26J850J940J438J373J098l99
57494B20125k098k329j675j884k692k295n60P54Q24N11L98K57K82Q63J304O52
57478B12437l44j53J010J532J075P79R74P83R1j34L11N31K77L60J109J890K302
57461B24830K486K341J771J481K108K863K519J400Q17R45R33P51J063J611J506
$$ y = [169111, 168459, 167487, 165637, 163305, 161577, 160472, 158894, 156581, 154654, 153857, 153606, 153189, 152630, 151962, 150916, 149872, 149972, 151656, 153990, 155883, 157145, 158123, 159155, 160635, 162736, 164879, 166279, 167031, 167823, 168766, 169621, 170939, 173591, 177179, 180346, 182762, 185372, 188533, 191413, 193560, 195516, 197292, 197701, 196032, 193301, 191151, 190309, 190569, 191340, 191786, 191277, 190120, 189197, 188762, 188418, 188233, 188836, 190324, 192142, 194075, 196316, 198590, 200399, 202083, 204372, 206918, 208649, 209535, 210504, 211640, 212125, 212099, 212825, 214675, 216615, 218053, 219426, 220524, 220125, 218027, 215698, 214023, 212139, 209447, 207152, 206592, 207346, 208170, 208681, 209079, 209336, 209618, 210481, 211785, 212437, 212093, 211940, 212950, 214482, 215557, 216336, 217310, 218093, 218184, 218050, 218361, 218892, 219169, 219529, 220638, 222528, 224830, 227316, 229657, 231428, 232909, 235017, 237880, 240399, 241799, 242616, 243561, 244494, 245245, 246308, 247919, 249425]
57446B49425R26P58Q65N08J43Q06J990K269J790K023K991L067J803P91J172K190
57430B73517K743K743K463K016J850K420L168L172K678K681L108L067K639K684
57416C10949L049K829K268K468L286L483K933K671K782K390J760K072K989K826
57402C48755J553J136K319L483L500L350L867M150L506K959L453M178M065L549
57388C93823L581M087M547M981N462N609N377N331N587N584N288N359N764N589
57374D65969M645L863L619L256K699K841L736M129L559L210L828M462M289M106
57360E18211M812N822O140N831N395M841M308M427N206N716N717O238P733Q987
57346E99384Q989Q497Q619R009Q759Q022P508P181O652O163O138O417O767P421
$$ y = [249425, 250351, 251109, 251974, 252482, 252625, 253431, 255421, 257690, 259480, 261503, 264494, 267561, 269364, 270155, 271327, 273517, 276260, 279003, 281466, 283482, 285332, 287752, 290920, 294092, 296770, 299451, 302559, 305626, 308265, 310949, 313998, 316827, 319095, 321563, 324849, 328332, 331265, 333936, 336718, 339108, 340868, 342940, 345929, 348755, 350308, 351444, 353763, 357246, 360746, 364096, 367963, 372113, 375619, 378578, 382031, 386209, 390274, 393823, 397404, 401491, 406038, 411019, 416481, 422090, 427467, 432798, 438385, 443969, 449257, 454616, 460380, 465969, 470614, 474477, 478096, 481352, 484051, 486892, 490628, 494757, 498316, 501526, 505354, 509816, 514105, 518211, 523023, 528845, 534985, 540816, 546211, 551052, 555360, 559787, 564993, 570709, 576426, 582664, 590397, 599384, 608373, 616870, 625489, 634498, 643257, 651279, 658787, 665968, 672620, 678783, 684921, 691338, 698105, 705526]
57332G05526Q351Q810Q423P984Q280Q921R092Q750Q357Q099Q067Q498R271R792
57318H26221R868R955J0200J0187R975J0296J1203J1688J1232J0653J0665J0820
57306I52963J0621J0651J1534J2756J3401J3416J3334J3377J3504J3741J3961
57295A093259J3932J3925J4485J5350J5592J5111J4846J5154J5221J4604J4057
57284A255536J4180J4469J4433J4506J5077J5698J5964J6175J6465J6392J6004
57273A424899J6127J6906J7315J6870J6531J7011J7552J7437J7450J8569K0133
57262A616800K0720K0165J9551J9735K0745K2160K3262K3320K2392K1418K1075
57251A851343K1152K1349K1860K2715K3479K3938K4270K4331K3815K3238K3502
$$ y = [705526, 713877, 722687, 731110, 739094, 747374, 756295, 765387, 774137, 782494, 790593, 798660, 807158, 816429, 826221, 836089, 846044, 856244, 866431, 876406, 886702, 897905, 909593, 920825, 931478, 942143, 952963, 963584, 974235, 985769, 998525, 1011926, 1025342, 1038676, 1052053, 1065557, 1079298, 1093259, 1107191, 1121116, 1135601, 1150951, 1166543, 1181654, 1196500, 1211654, 1226875, 1241479, 1255536, 1269716, 1284185, 1298618, 1313124, 1328201, 1343899, 1359863, 1376038, 1392503, 1408895, 1424899, 1441026, 1457932, 1475247, 1492117, 1508648, 1525659, 1543211, 1560648, 1578098, 1596667, 1616800, 1637520, 1657685, 1677236, 1696971, 1717716, 1739876, 1763138, 1786458, 1808850, 1830268, 1851343, 1872495, 1893844, 1915704, 1938419, 1961898, 1985836, 2010106, 2034437, 2058252, 2081490, 2104992]
57240B104992K4310K4459K3959K4090K4986K5142K4084K3483K4494K5874K6096
57229B375969K5619K5579K5765K5509K5306K5815K6335K5817K4526K3361K2426
57218B652027K1519K1099K1410K1634K1137K0620K0860K1354K1522K2075K3747
57207B889004K5663K6516K6508K6672K7033K6948K6557K6447K6456K6079K5509
57196C179392K5147K4725K4017K3608K3852K3914K3004K1686K0785J9937J8586
57185C428653J7443J7465J8204J8624J8921K0071K2133K4271K5807K6193K4670
57174C662455K1398J8082J6332J5964J6062J6724J8411K0496K1948K2770K3453
57163C874095K3781K3493K3362K4084K4918K4754K3808K2868K1796K0200J8730
$$ y = [2104992, 2129302, 2153761, 2177720, 2201810, 2226796, 2251938, 2276022, 2299505, 2323999, 2349873, 2375969, 2401588, 2427167, 2452932, 2478441, 2503747, 2529562, 2555897, 2581714, 2606240, 2629601, 2652027, 2673546, 2694645, 2716055, 2737689, 2758826, 2779446, 2800306, 2821660, 2843182, 2865257, 2889004, 2914667, 2941183, 2967691, 2994363, 3021396, 3048344, 3074901, 3101348, 3127804, 3153883, 3179392, 3204539, 3229264, 3253281, 3276889, 3300741, 3324655, 3347659, 3369345, 3390130, 3410067, 3428653, 3446096, 3463561, 3481765, 3500389, 3519310, 3539381, 3561514, 3585785, 3611592, 3637785, 3662455, 3683853, 3701935, 3718267, 3734231, 3750293, 3767017, 3785428, 3805924, 3827872, 3850642, 3874095, 3897876, 3921369, 3944731, 3968815, 3993733, 4018487, 4042295, 4065163, 4086959, 4107159, 4125889]
57152D125889J8126J7768J6690J5194J3938J2227Q979M642M59l463p716j1925
57140D210808j5405j8778k3074k7609l0563l1374l0953k9743k7252k3342j8640
57129C934075j3766r157n311k166J087M630P366Q597R211J0038J0462J0191J0907
57116C976164J4420K0480K8245L8425N1721O6640Q1300R6456J14385J35835J60561
57105D784632J89861K26097K70574L24358L90206M71141N68104O81558Q14228
57096H720759R69566J149175J355024J592512J867016K177890K519749K888618
57088B3240309L282604L697492M126706M563201M990454N364159N606097N624131
57080F0495153N347256M754080L881706K811312J635412M26770p67063j903489
$$ y = [4125889, 4144015, 4161783, 4178473, 4193667, 4207605, 4219832, 4228811, 4233453, 4233912, 4230449, 4222733, 4210808, 4195403, 4176625, 4153551, 4125942, 4095379, 4064005, 4033052, 4003309, 3976057, 3952715, 3934075, 3920309, 3911152, 3905841, 3903675, 3904762, 3909392, 3916758, 3925355, 3934566, 3944604, 3955066, 3965257, 3976164, 3990584, 4011064, 4039309, 4077734, 4129455, 4196095, 4277395, 4373851, 4488236, 4624071, 4784632, 4974493, 5200590, 5471164, 5795522, 6185728, 6656869, 7224973, 7906531, 8720759, 9690325, 10839500, 12194524, 13787036, 15654052, 17831942, 20351691, 23240309, 26522913, 30220405, 34347111, 38910312, 43900766, 49264925, 54871022, 60495153, 65842409, 70596489, 74478195, 77289507, 78924919, 79351689, 78584626, 76681137]
57072G6681137k927089l776288m404841m795594m960601m935454m770213m514945
57064D1596112m206789l868536l516100l163377k821246k497098k197019j926050
57056A7399897j685738j473796j287073j123343r80348q55467p47135o55020n78119
57047H013858n13834m59419m13246l74236l41005l12143k86891k65345k48065
57038D799674k35095k24901k14924k03804j92674j83512j76588j70156j62071
57029C035949j51095j37174j21339j05087q9262p3578n7419m0659k3797q505J556
57018B229590J917r245k9029n1601p1636q5990r3608r5226r2705q7657q0822p2832
57006A461156o4772n7501n1172m5767m1291l7153l2505k7697k4189k2467k1366
$$ y = [76681137, 73754048, 69977760, 65572919, 60777325, 55816724, 50881270, 46111057, 41596112, 37389323, 33520787, 30004687, 26841310, 24020064, 21522966, 19325947, 17399897, 15714159, 14240363, 12953290, 11829947, 10849599, 9994132, 9246997, 8591977, 8013858, 7500024, 7040605, 6627359, 6253123, 5912118, 5599975, 5313084, 5047739, 4799674, 4564579, 4339678, 4124754, 3920950, 3728276, 3544764, 3368176, 3198020, 3035949, 2884854, 2747680, 2626341, 2521254, 2431992, 2358414, 2300995, 2260336, 2236539, 2228034, 2229590, 2231507, 2222262, 2193233, 2141632, 2069996, 1984006, 1890398, 1795172, 1702467, 1614810, 1533988, 1461156, 1396384, 1338883, 1287711, 1241944, 1200653, 1163500, 1130995, 1103298, 1079109, 1056642, 1035276]
56995A035276k0048j9203j9348j9441j8435j6925j5876j4823j2844j0322q233
56984H59778o422m235k271j934l542o356j0120j5087k0564k4815k6674k6340k4570
56971F86848k1951j9022j6263j3769j1331q829o229l494q22J450L518O137R549
56958F05792J3054J6085J8814K0926K0699J6432Q434j127r938j6443j9859k0474
56946F52395j9664j8714j7708j6059j3653j0756p397l662k12K436M808P872J1720
56933E71406J5642J9261K2824K6311K8746K8418K3643J3910Q07j2474k3075k9863
56921F85556l3007l3023l0761k7568k4640k2334k0441j8651j6578j3985j1437
56910D33131j0014r941j0101r429q058o642n311l943k735j859j033n8Q17J480
$$ y = [1035276, 1015228, 996025, 976677, 957236, 938801, 921876, 906000, 891177, 878333, 868011, 859778, 853356, 849121, 846850, 844916, 841374, 835018, 824898, 809811, 789247, 764432, 737758, 711418, 686848, 664897, 645875, 629612, 615843, 604512, 595683, 589454, 585960, 585138, 586588, 590106, 596243, 605792, 618846, 634931, 653745, 674671, 695370, 711802, 720236, 719109, 709171, 692728, 672869, 652395, 632731, 614017, 596309, 580250, 566597, 555841, 548444, 544782, 544570, 547006, 551814, 559686, 571406, 587048, 606309, 629133, 655444, 684190, 712608, 736251, 750161, 750968, 738494, 715419, 685556, 652549, 619526, 588765, 561197, 536557, 514223, 493782, 475131, 458553, 444568, 433131, 423117, 413176, 403075, 393646, 385588, 378946, 373635, 369692, 366957, 365098, 364065, 364007, 364824, 366304]
56896C66304K288L395M452N410O792Q673J0351J1654J3566J6820K0657K3712K5251
56883E19325K4770K1486J5278P441m27p563j3320j6446j6405j4586j2822j1177
56871D95554q435m278L30M621Q605J2357J5912J9865K5006L1293L7919M4403N0678
56858G33830N5773N7089N1545L7786J7732l873k2042l4218m0580m2197l9869l4741
56846G36235k8554k2428j6114r122j791N419J2854K1117L0183L9658M9337N9126
56834H75920O9065P9478Q9520R4911Q9006O8042L5104j883l5256o0333p5176q0227
56822A148171p8105p2065o4148n5227m6076l7309k8717j9750j0469j336P500J6073
56810G58542K4232L2207M0813N0240N8886O3829O1915N0497K8929O88k7187m8400
$$ y = [366304, 368592, 371987, 376439, 381849, 388641, 397314, 407665, 419319, 432885, 449705, 470362, 494074, 519325, 544095, 565581, 580859, 588300, 587873, 580310, 566990, 550544, 534139, 519553, 506731, 495554, 487119, 482841, 483171, 487792, 496397, 508754, 524666, 544531, 569537, 600830, 638749, 683152, 733830, 789603, 846692, 898237, 936023, 953755, 949882, 927840, 893622, 853042, 810845, 770976, 736235, 707681, 685253, 669139, 660017, 658226, 663645, 676499, 697616, 727799, 767457, 816794, 875920, 944985, 1024463, 1113983, 1208894, 1297900, 1365942, 1401046, 1399163, 1363907, 1303574, 1228398, 1148171, 1070066, 998001, 933853, 878626, 832550, 795241, 766524, 746774, 736305, 734969, 742469, 758542, 782774, 814981, 855794, 906034, 964920, 1028749, 1090664, 1141161, 1170090, 1170778, 1143591, 1095191]
56798A095191o1009o6494o6737o3081n7044m9969m2370l4678k7907k2447j7165
56787E86290j0987m555J107O531J2781J9344K4763K8709L1382L1339K6010J4650
56775G67364n11j5991k8760l6803l9821l9583l8290l6548l3791l0213k6841k4070
56763D16142k1468j8915j6683j4578j2318j0458r730r625q936p418n784m416l323
56750B72490k968l679m557m384l456l056l383l385k557j444m67M08R26P54L45
56735B41587L78N17m8j084j636j633j759j975j569n82J78N25R88J600J816J488
56719B38791Q41j57j284j498l01R74Q01j88k76N05P17K75N94J878K570J875Q12
56702B46929K91o6o28j011j156j555j975j522m36j63j112j918j534o43l01n30
$$ y = [1095191, 1034182, 967688, 900951, 837870, 780826, 730857, 688487, 653809, 625902, 603455, 586290, 575303, 570748, 571855, 578386, 591167, 610511, 635274, 663983, 695365, 726704, 752714, 767364, 766853, 750862, 722102, 685299, 645478, 605895, 567605, 531057, 497266, 467053, 440212, 416142, 394674, 375759, 359076, 344498, 332180, 321722, 311992, 302367, 293431, 286013, 280229, 275813, 272490, 269522, 265843, 261286, 256902, 253446, 250390, 247007, 243622, 241065, 239621, 239154, 239562, 240488, 241242, 241587, 241965, 242482, 242434, 241350, 239714, 238081, 236322, 234347, 232778, 232196, 232374, 232899, 233887, 235487, 237303, 238791, 239632, 239475, 238191, 236693, 236392, 237366, 238167, 237979, 237703, 238208, 238925, 239200, 239794, 241672, 244242, 246117, 246929, 247220, 247154, 246526, 245515, 244359, 242804, 240829, 239307, 238871, 238708, 237596, 235678, 234144, 233501, 233200, 232670]
56686B32670q48j062r62l14M30M86rk05l7j45l90M3R19J014J77l70j52j25p14
56667B30406r90m22K02L79P34J443J474M39k85M54J763K134J693J700K521L308
56651B46953L347K826K413K568L119L324K742J933J732K002J932J401R89Q33N60
56636B78674K87M51P39M40j67j76L02L09j81k83ql50j305j625r64n62j159j930
56618B72492k105k106k375k532k373k433k846k955k554k247k159j674q89p77j439
56603B41028j715j146o37o11k01Q91J486Q56nj05J6m12r41q60m84l59k47J76N81
56584B37311P34J010J437J359P18M46R65J449J308J107J303J386J057R88J545
56569B54123K039J990J992K500L047L320L744M378M632M755N987Q358J0006R689
$$ y = [232670, 231822, 230760, 229798, 229484, 229914, 230400, 230391, 230186, 230149, 230004, 229614, 229657, 230576, 231590, 231767, 231397, 231245, 231120, 230406, 229416, 228994, 229196, 229575, 230309, 231752, 233226, 233665, 233380, 233834, 235597, 237731, 239424, 241124, 243645, 246953, 250300, 253126, 255539, 258107, 261226, 264550, 267292, 269225, 270957, 272959, 274891, 276292, 277281, 278114, 278674, 278961, 279412, 280151, 280591, 280424, 280248, 280550, 280859, 280678, 280395, 280387, 280037, 278732, 277107, 276143, 275581, 274422, 272492, 270387, 268281, 265906, 263374, 261001, 258568, 255722, 252767, 250213, 247966, 245807, 244133, 243244, 242467, 241028, 239313, 238167, 237530, 236919, 236718, 237609, 239095, 239951, 239946, 239841, 239857, 239445, 238504, 237644, 237160, 236801, 236554, 236730, 237311, 238045, 239055, 240492, 241851, 242569, 243015, 243980, 245429, 246737, 247844, 249147, 250533, 251590, 252578, 254123, 256162, 258152, 260144, 262644, 265691, 269011, 272755, 277133, 281765, 286520, 292507, 300865, 310871, 320560]
56555C20560Q438P520O428M250J655N6k79K9O24J255J335O98k5n04j158j948k060
56538C46874j494j444k340l094l112l401m486n127m373l260k984k936k223j645
56524C04955k338l669m221l873l348k664j633r29j143j580j392j056j312j639
56510B74158j170l01J6k51o80j347k128k111j042k41o92j405j144n21o70j025
56494B59446l63Q01R04j46j006r94n51oN33N14l51j122p78J60N05L65O99J419
56476B60029J452N75l14o05m68n0P35J620K021J638N98o38j128o3J899K879K013
56459B72193N00k60l83n43n75j80Q0k35m92p0M94N52L75K59k52j126j185J25J545
56440B70822J861J589J504R76o04k089k105j202p17n22L01J458J884J507R97M75
$$ y = [320560, 328998, 336518, 342946, 347196, 348851, 348907, 348628, 348657, 349281, 350536, 351871, 352569, 352544, 352040, 350882, 348934, 346874, 345380, 343936, 341596, 338502, 335390, 331989, 327503, 322376, 318003, 314743, 311759, 308823, 306600, 304955, 302617, 298948, 294727, 290854, 287506, 284842, 283209, 282280, 281137, 279557, 278165, 277109, 275797, 274158, 272988, 272687, 272703, 272452, 271772, 270425, 268297, 266186, 265144, 264903, 264211, 262806, 261662, 261141, 260471, 259446, 259083, 259884, 260788, 260642, 259636, 258642, 258091, 258085, 258618, 259132, 258781, 257659, 256881, 257041, 257546, 257911, 258610, 260029, 261481, 262056, 261742, 261137, 260669, 260619, 261354, 262974, 264995, 266633, 267231, 266593, 265465, 265402, 267301, 270180, 272193, 272693, 272433, 272050, 271507, 270932, 270752, 270832, 270597, 270105, 270035, 270529, 271081, 271456, 271715, 271463, 270337, 269152, 269277, 270822, 272683, 274272, 275776, 276752, 276148, 274059, 271954, 270752, 270035, 269513, 269814, 271272, 273156, 274663, 275660, 276135]
56424B76135j14k21L11M56l64r48j09J282J651J058N78M23K81M51J002R03l17
56407B82458j211m83Q44J127P37R58J445J025O4j89K17M76Q40J859K652K122J076
56390B96017J036J716J772J236J035R57K94l04J21P30J76p70l24J174J771J071
56374C07708N19P62J080J215J573J858J423P25N34K66q73j866j191M48J084N83
56358C15848M30Q84Q36J41k49k58n22o20K83J404J298M17M07J252J562J319J718
56341C26150K541K335J228R71K039L043L255L422L881L964L507L097K749K026
56327C64208J307J251J399J049Q09J421J953J289M77J138K472K502J427R74J186
56312C84862Q04K03P92J947J708K75k91M17R64J197K314L940M369L769M008N157
$$ y = [276135, 276021, 275800, 276111, 276567, 276203, 275255, 275146, 276428, 278079, 279137, 279715, 280138, 280419, 280870, 281872, 282775, 282458, 281247, 280764, 281608, 282735, 283472, 284430, 285875, 286900, 286964, 286775, 286992, 287468, 288308, 290167, 292819, 294941, 296017, 297053, 298769, 300541, 301777, 302812, 303769, 304063, 303759, 303880, 304610, 304786, 304016, 303692, 304866, 306637, 307708, 308227, 308989, 310069, 311284, 312857, 314715, 316138, 316863, 317397, 317663, 316790, 314924, 313733, 314181, 315265, 315848, 316278, 317162, 317998, 318139, 317890, 317632, 317110, 316490, 316773, 318177, 319475, 319892, 320299, 321551, 323113, 324432, 326150, 328691, 331026, 332254, 333225, 335264, 338307, 341562, 344984, 348865, 352829, 356336, 359433, 362182, 364208, 365515, 366766, 368165, 369214, 370023, 371444, 373397, 374686, 375163, 376301, 378773, 381275, 382702, 383676, 384862, 385666, 385869, 386661, 388608, 390316, 390591, 390300, 390717, 391681, 392878, 395192, 399132, 403501, 407270, 411278, 416435]
56296D16435N314M066L017K739K213J455J603K285K070J555K693N006N904N059
56282D61414M821N881O268N337N086O473P824P990Q002Q485Q582Q309R080J0897
56268E64449J2011J2118J2952J4967J6570J7369J8933K1506K3315K4116K6091
56257G64397L0147L4551L8331M2785M8468N3924N8738O4603P2078P9327Q5396
56246A372745R1686R8868J05411J10397J14673J18037J18432J15284J10489J04716
56236B460738R5941Q3097O7977N2026L4393J4806m730k2736l9808n5950o9391
56225B616363p9548q8143r5876j01040j02866j03088j02689j00369r5780r1053
56215A655911q7386q3255p7628p1845o6733o1133n4938n0175m7346m4044l9023
$$ y = [416435, 421749, 425815, 428832, 431571, 433784, 435239, 436842, 439127, 441197, 442752, 445445, 450451, 456355, 461414, 466235, 472116, 478384, 483721, 488807, 495280, 503104, 511094, 519096, 527581, 536163, 544472, 553552, 564449, 576460, 588578, 601530, 616497, 633067, 650436, 669369, 690875, 714190, 738306, 764397, 794544, 829095, 867426, 910211, 958679, 1012603, 1071341, 1135944, 1208022, 1287349, 1372745, 1464431, 1563299, 1668710, 1779107, 1893780, 2011817, 2130249, 2245533, 2356022, 2460738, 2556679, 2639776, 2707753, 2759779, 2794172, 2808978, 2804248, 2781512, 2741704, 2685754, 2616363, 2536815, 2448672, 2352796, 2251756, 2148890, 2045802, 1943113, 1842744, 1746964, 1655911, 1568525, 1485270, 1407642, 1335797, 1269064, 1207931, 1152993, 1102818, 1055472, 1011428, 972405]
56204I72405l4295l1361k8799k5507k2864k1661k0232j7707j5739j5103j4017
56193G25120j1785j0437j0700j0144p602n586n770n924m154k375k628l444k986
56180F41585k406l019l353k107r01j123j100N78K066J646R92J991L349L423L424
56165F45045M686N736N174M557N446O503O476O929Q969J0457R735Q991J0611J3208
56151G52523J4588J5605J7676J9570K0126K1260K4690K8669L1345L4482M0297
56140A020831M7475N3860O0386O8818P8361Q7784R8044J09385J18722J23174J23247
56129A990087J19652J10682R6376Q1697P1564O5682O1648N9249N7741N2805M1025
56118B808208K4498P046j0714k8453m2318m9306n2532n7428o5387p5236q7395
$$ y = [972405, 938110, 906749, 877950, 852443, 829579, 807918, 787686, 769979, 754240, 739137, 725120, 713335, 702898, 692198, 682054, 674452, 668866, 663096, 657172, 653018, 650643, 648015, 644571, 641585, 639179, 636160, 632807, 630700, 629799, 628676, 627576, 628154, 630220, 631866, 632858, 634849, 638198, 641621, 645045, 649731, 655467, 660641, 665198, 670644, 677147, 683623, 690552, 699521, 709978, 719713, 728704, 739315, 752523, 767111, 782716, 800392, 819962, 840088, 861348, 886038, 914707, 946052, 980534, 1020831, 1068306, 1122166, 1182552, 1251370, 1329731, 1417515, 1515559, 1624944, 1743666, 1866840, 1990087, 2109739, 2220421, 2316797, 2398494, 2470058, 2535740, 2597388, 2656637, 2714378, 2767183, 2808208, 2832706, 2839752, 2829038, 2800585, 2758267, 2708961, 2656429, 2599001, 2533614, 2458378, 2370983]
56107B370983j01527j13216j18135j17191j13313j06296r5345q3302p3320o4183
56097A385155n3686m3593l6461l0893k4753j9672j7326j4888r639m558l576m635
56085A121475l368m59O62M61J519K900K332J430K867M979M858M064N588Q076Q786
56070A166170R182J1672J4128J3670J2667J4631J7556J7701J6579J7527J8884
56059A330367J7485J5482J6486J8352J7024J4319J4356J5631J4271J1977J2877
56048A498627J5561J6031J5454J7091J8875J7175J4671J6096J9482K0051J9446
56037A688560K2273K6899K8771K9482L3281L7965L8754L7830M0277M4061M4215
56026B072368M3287M6967N2780N4213N2782N4602N8212N7709N5065N6979O2060
$$ y = [2370983, 2269456, 2156240, 2038105, 1920914, 1807601, 1701305, 1605960, 1522658, 1449338, 1385155, 1331469, 1287876, 1251415, 1220522, 1195769, 1176097, 1158771, 1143883, 1134244, 1129686, 1126110, 1121475, 1118107, 1117648, 1118310, 1118771, 1120290, 1123190, 1125522, 1126952, 1129819, 1134798, 1139656, 1143720, 1149308, 1157384, 1166170, 1175352, 1187024, 1201152, 1214822, 1227489, 1242120, 1259676, 1277377, 1293956, 1311483, 1330367, 1347852, 1363334, 1379820, 1398172, 1415196, 1429515, 1443871, 1459502, 1473773, 1485750, 1498627, 1514188, 1530219, 1545673, 1562764, 1581639, 1598814, 1613485, 1629581, 1649063, 1669114, 1688560, 1710833, 1737732, 1766503, 1795985, 1829266, 1867231, 1905985, 1943815, 1984092, 2028153, 2072368, 2115655, 2162622, 2215402, 2269615, 2322397, 2376999, 2435211, 2492920, 2547985, 2604964, 2667024]
56015B667024O3508O2273O4924P0636P3012P2861P6386Q2625Q5538Q6525R1746
56004C497058R9419J03133J05251J12998J23899J29658J31930J39103J50139J57283
55994D749871J62083J72267J85345J92535J96528K07566K24384K37499K48840
55985F576918K68516K94491L15916L34613L62014L96799M27873M57625M98878
55976I933643N50530O00645O51973P18823Q00514Q85255R78522J098568J245928
55967A7464401J408767J596871J837152K137459K491114K915049L442980M081380
55959C7375173M815146N657409O650740P824551R201659J0834777J2767747J4967158
55951A10094360J7375622K0037993K3087719K6592542L0449565L4268347L7020436
$$ y = [2667024, 2730532, 2792805, 2857729, 2928365, 3001377, 3074238, 3150624, 3233249, 3318787, 3405312, 3497058, 3596477, 3699610, 3804861, 3917859, 4041758, 4171416, 4303346, 4442449, 4592588, 4749871, 4911954, 5084221, 5269566, 5462101, 5658629, 5866195, 6090579, 6328078, 6576918, 6845434, 7139925, 7455841, 7790454, 8152468, 8549267, 8977140, 9434765, 9933643, 10484173, 11084818, 11736791, 12455614, 13256128, 14141383, 15119905, 16218473, 17464401, 18873168, 20470039, 22307191, 24444650, 26935764, 29850813, 33293793, 37375173, 42190319, 47847728, 54498468, 62323019, 71524678, 82359455, 95127202, 110094360, 127469982, 147507975, 170595694, 197188236, 227637801, 261906148, 298926584]
55944B98926584L6783369L1406651K0142298M824081j0838287k3402302l1320715
55937C26521679l4876721l5132933l3180204k9988463k6369752k2839413j9601057
55930A24533136j6714491j4214497j2090474j0279479q732808p439052o371760
55923D8690575n473630m706016m064299l534203l078541k676888k336813k056410
55915B0763775j812327j592836j407943j258637j127286j005809r04035q23327
55907A0831575p49109o76031o14787n67971n23287m76488m37872m10152l81895
55898E993983l48769l20399l00400k79310k53221k30660k15241j99099j79072
55889C667812j62659j52626j41713j27576j17458j13212j06718r5052q5668q1706
$$ y = [298926584, 335709953, 367116604, 387258902, 392082983, 381244696, 357842394, 326521679, 291644958, 256512025, 223331821, 193343358, 166973606, 144134193, 124533136, 107818645, 93604148, 81513674, 71234195, 62501387, 55062335, 48690575, 43216945, 38510929, 34446630, 30912427, 27833886, 25156998, 22820185, 20763775, 18951448, 17358612, 15950669, 14692032, 13564746, 12558937, 11654902, 10831575, 10082466, 9406435, 8791648, 8223677, 7700390, 7223902, 6786030, 6375878, 5993983, 5645214, 5324815, 5024415, 4745105, 4491884, 4261224, 4045983, 3846884, 3667812, 3505153, 3352527, 3210814, 3083238, 2965780, 2852568, 2745850, 2650798, 2565130, 2483424]
55879B483424p6263o6304n8719n7526n7706n6461n8176o3540o5761o2388n9646
55868A800934o0539n9762n4615n0044m8503m5336l8610l3285l1506k8628k2987
55857A327119j9822k1372k2508k0330j8906k0500k1184j9276j9263k3172k6466
55846A094320k6544k7064k9931l1137k8574k6163k6280k5672k2586k0468k0856
55835H09045k0048j6508j4224j5076j5119j2131r738j0220j0272p815o135p343
55823F64416q337p154o807q954j0184q555p533r370j0684q739o344o353o804n568
55809E53030m470m816m023o30K322K596K647M662O604O706O994Q787R445P228
55795E97082M731M026K899o55m601o915r035j2007j3623j2662j1642j2045j1241
$$ y = [2483424, 2407161, 2340857, 2282138, 2224612, 2166906, 2110445, 2052269, 1988729, 1922968, 1860580, 1800934, 1740395, 1680633, 1626018, 1575974, 1527471, 1482135, 1443525, 1410240, 1378734, 1350106, 1327119, 1307297, 1285925, 1263417, 1243087, 1224181, 1203681, 1182497, 1163221, 1143958, 1120786, 1094320, 1067776, 1040712, 1010781, 979644, 951070, 924907, 898627, 872955, 850369, 829901, 809045, 788997, 772489, 758265, 743189, 728070, 715939, 706201, 695981, 685709, 677894, 671759, 664416, 656079, 648925, 642118, 633164, 622980, 614425, 606892, 597522, 586838, 578099, 571755, 565402, 558598, 553030, 548560, 543744, 539721, 539091, 541413, 544009, 546656, 551318, 557922, 564628, 571622, 580409, 589854, 597082, 601813, 605839, 608738, 608083, 603482, 596567, 587532, 575525, 561902, 549240, 537598, 525553, 514312]
55782E14312p636m526n130p771r415j0139j0757r861o797m006l193k423J26L098
55768D35882N200P535J0001R470M641j143m876p704j0942j2646j1469r940j0287
55755D03722j0741r373p910q208q636p550o780q033r245q169o402o140o143m609
55741B95783k906k843l073j878o36j054j761j167q50k461m113l462j853j711k307
55726B63708j773r59j623k924l157k925l388l490k150r45j435k139j270o9q6K64
55710B35639K762N456N467L772L307M120M130L121K301J291r10l216m002m140
55696B59098n393p083p369o537n974n321l576j736j315j558r34l7j41l89O49K058
55680B14442K227J974L003M632N025M432M182L730J771q15k106k190k344k368
$$ y = [514312, 506676, 502150, 497020, 489249, 479834, 469695, 458938, 449077, 442280, 438274, 435081, 432658, 432784, 435882, 441082, 448617, 458618, 468088, 472729, 471586, 466710, 459006, 448064, 435418, 423949, 414009, 403722, 392981, 383608, 375698, 367490, 358854, 351304, 344524, 336491, 327246, 319077, 312675, 306535, 300392, 295783, 292877, 290034, 286961, 285083, 284447, 283393, 281632, 280465, 279615, 277154, 273041, 269579, 267726, 266015, 263708, 261935, 260976, 259353, 256429, 253272, 250347, 246959, 243469, 241319, 240374, 238939, 236800, 235530, 235461, 235375, 235639, 238401, 243857, 249324, 253096, 256403, 260523, 264653, 267774, 270075, 271366, 270456, 267240, 263238, 259098, 253705, 246622, 239253, 232716, 226742, 221421, 217845, 216109, 214794, 213236, 212302, 212265, 212124, 211735, 212384, 214442, 216669, 218643, 221646, 226278, 231303, 235735, 239917, 243647, 245418, 244603, 242497, 240307, 237963, 235595]
55666B35595j530q21j393j957q09Q63P55o33r41K21J472K605M185N213M458L248
55650B50531L728N075M725K650J028K31j352l709m938m700m775n854o596o276
55636B29768n802n730n644n640o199o557n431l370k168k045j691r13q45j495j499
55621A74739n49J58J39K59Q48J141Q56N94M12k95j325j692j243q19p85p87q24
55604A70827j220j631j439r08p46q74q34r26j597k300k252j724j389j058l63J88
55588A51754J10l9J70L2p33p99P10K334K418J737J937K655K564K129K758M121
55572A73858M846N121O164P680Q344Q243Q405Q469P243N151L675K742J061j328
55558B49674l248m762o783q686q806p281n989n694n546n221n212n082l845k129
$$ y = [235595, 234065, 233244, 231851, 229894, 229085, 229948, 230703, 230070, 229129, 229350, 230822, 233427, 237612, 242825, 247283, 250531, 254259, 259334, 264059, 266709, 267737, 267968, 266616, 262907, 257969, 253269, 248494, 242640, 236044, 229768, 223966, 218236, 212592, 206952, 200753, 194196, 188765, 185395, 183227, 181182, 179491, 178578, 177733, 176238, 174739, 174190, 174348, 174487, 174746, 175594, 176735, 177591, 178185, 178597, 178302, 176977, 175285, 174042, 173223, 172438, 171651, 170827, 169607, 167976, 166537, 165629, 164883, 164009, 163175, 162249, 160652, 158352, 156100, 154376, 152987, 151929, 151566, 151754, 151864, 151825, 151995, 152027, 151294, 150495, 151205, 153539, 155957, 157694, 159631, 162286, 164850, 166979, 169737, 173858, 178704, 183825, 189989, 197669, 206013, 214256, 222661, 231130, 238373, 243524, 247199, 249941, 251002, 249674, 246426, 241664, 234881, 226195, 217389, 210108, 204119, 198425, 192879, 187658, 182446, 177364, 173519, 171390]
55544A71390j568k021j770n89j45j058j865j430k90P85J702K145J632O59K27J58
55528A67962m26j206j245j108k149l818m059k550j184j036j171q98q61j324j493
55513A43434j196j321j965k009j176o99j301k145k350k051j489n07N66J028R88
55498A27807J105J148L69p60r10m7O00O64Q43J001J96j192j555o72j19o11r91
55481A26876m59J82K45K55N78O17J47r8J68K65l7m2M46O56K35k45m56n70l33O22
55461A29052J484J063j46n32m6j65j085j293l17M43K61J22M57K35p66j054JQ50
55443A28564L28m47j77M54K56l85m75j87k13l67j92M9J4N4L99N30J60p6L37J020
55423A29646J500J810J782J068K28N03J859K759K411J794J825K015J780J487J374
$$ y = [171390, 169822, 167801, 166031, 165442, 165297, 164239, 162374, 160944, 160654, 161439, 163141, 165286, 166918, 167577, 167804, 167962, 167536, 166330, 165085, 163977, 161828, 158010, 153951, 151401, 150217, 149181, 148010, 147112, 146251, 144927, 143434, 142238, 140917, 138952, 136943, 135767, 135068, 133767, 131622, 129272, 127221, 125732, 125225, 125791, 126819, 127807, 128912, 130060, 130429, 129669, 128759, 128712, 129312, 129976, 130819, 131820, 132016, 130824, 129269, 128597, 128478, 127867, 126876, 126417, 126599, 126844, 127099, 127677, 128294, 128441, 128343, 128511, 128776, 128739, 128697, 129143, 129799, 130034, 129789, 129333, 128763, 128430, 129052, 130536, 131599, 131453, 130921, 130875, 130710, 129625, 128332, 128015, 128458, 128719, 128841, 129298, 129533, 128767, 127713, 127714, 128564, 128892, 128445, 128268, 128722, 128978, 128593, 128118, 127931, 127718, 127351, 127159, 127208, 127222, 127276, 127675, 128205, 128365, 128289, 128626, 129646, 131146, 132956, 134738, 135806, 136034, 136537, 138396, 141155, 143566, 145360, 147185, 149200, 150980, 152467, 153841]
55408A53841Q72j08o07k95k24r96j653j440j212j894k866l049k508j849j146m66
55392A34400l60p56n42P08J715J332K67j39J74M76P10J184J580J448J041O84K4
55375A43946j170k112j958j057m26m21o27o26k88K22L66k85j283j742j608j554
55359A29377j622j183l60k9j67K14J093J082k34j344j082k51l2k00r3O2p9n8M11
55340A25505O36J80k52j33j50q79j618j572j180j111j068o12j53n3K42J118J836
55323A20736J739J361J402J531J286J033J057P53k31j056r51l78L2N64J421J811
55307A32110J225M35J85m2p40j177p22j78l68n90J1P08M46j86J6P16O67j15m75
55288A31926j6N75P90O56K65j01J36Q74J093M48L2N04P73j06j013n07O62P55j02
$$ y = [153841, 154713, 154605, 153998, 153703, 153479, 152483, 150830, 149390, 148178, 146284, 143418, 140369, 137861, 136012, 134866, 134400, 134040, 133284, 132742, 133450, 135165, 136497, 136764, 136625, 136799, 137275, 137985, 139169, 140749, 142197, 143238, 143922, 143946, 142776, 140664, 138706, 137649, 137223, 136802, 136175, 135549, 135261, 135483, 135849, 135564, 134281, 132539, 130931, 129377, 127755, 126572, 126212, 126183, 126016, 126230, 127323, 128405, 128171, 126827, 125745, 125494, 125462, 125262, 125169, 125231, 125152, 125094, 125505, 126141, 126321, 126069, 125936, 125786, 124907, 123289, 121717, 120537, 119426, 118358, 117746, 117593, 117540, 117782, 118900, 120736, 122475, 123836, 125238, 126769, 128055, 129088, 130145, 130898, 130667, 129611, 128660, 128282, 128314, 128878, 130299, 132110, 133335, 133770, 133955, 133913, 133173, 131996, 131274, 131096, 130728, 130138, 130149, 130857, 131303, 131117, 131133, 131849, 132516, 132401, 131926, 131910, 132485, 133275, 133931, 134196, 134095, 134231, 135105, 136198, 136646, 136678, 137182, 137955, 137849, 136836, 136329, 136991, 137746, 137644]
55269A37644l37K97N24j65q61r20o50l54nJ58j07l71j75M3j95k94L71R77L95p93
55249A35182j128o47o41j233j143P0J259J458R82M37r0n56p35o60m62R6J082J684
55231A34955J114o4o47n05m54p50r71j094j396j489q04J90N40M16P59J502J622
55214A32924R08K62Q8j75o92p71m5R42J686K190K330J703L91r32j732j812j032
55197A36233K94J064N15n93r90p67r57j569j578p99k54m06m80Q8P77R71P98N93
55179A32940L78K36L75O00M61J6k67k95l08k40R4L44J53j6M72J225J402J108J015
55160A39693R71M38o4M00J251R19n29j226l33P22N49k88n58k39p6l00p17j265
55142A39348j691j426m25M57N42J54k5J77N53Q91R10M31j16n8M83O21Lo89p87
$$ y = [137644, 137307, 137604, 138128, 137963, 137102, 136182, 135532, 135178, 135173, 135331, 135224, 134853, 134678, 134721, 134526, 134232, 134603, 135580, 135975, 135182, 134054, 133407, 132766, 131533, 130390, 130460, 131719, 133177, 134159, 134596, 134506, 133950, 133215, 132555, 132093, 132189, 133271, 134955, 136069, 136005, 135358, 134853, 134399, 133649, 132678, 131584, 130188, 128699, 127895, 128085, 128625, 129041, 129800, 131302, 132924, 133832, 134094, 134182, 134007, 133315, 132544, 132499, 133441, 135127, 137317, 139647, 141350, 141741, 140809, 139077, 137265, 136233, 136527, 137591, 138106, 137513, 136523, 135756, 134799, 133230, 131652, 130853, 130599, 130193, 129713, 129801, 130578, 131549, 132347, 132940, 133318, 133554, 133929, 134529, 134990, 135006, 134739, 134444, 134136, 133896, 133990, 134334, 134487, 134471, 134943, 136168, 137570, 138678, 139693, 140664, 141102, 141038, 141438, 142689, 143608, 143079, 141853, 141520, 142242, 142791, 142503, 141945, 141706, 141630, 141330, 140613, 139348, 137657, 136231, 135806, 136263, 136805, 136959, 136934, 137111, 137664, 138555, 139465, 139896, 139780, 139722, 140205, 140826, 140829, 140140, 139353]
55123A39353l90J07M94N74K44n8K42Q52Q78K41j69Q2L20l7n85p32n97n42m92j81
55103A39604L32P76R73Q83O52N89P00N35l8k63M45J377J433Q14N97Q77P09j11
55085A50884o55m52j22j19o4K91N39M67L71K77j37o26n03R5K60j50k89J16L53
55066A50536K32N33J428J848J180K46j22k27m77n27l03n59j419j651m94Q47Q32
55049A51903j82o55j01O36Q32N43R7j32J55N99K75r82j962j590l83M24N45N18
55031A50540N31M29M39Q47J230R66K28k86m22n00n07j64L22L92J8k02J13O49Q02
55012A55425K54p41j474j396p71l18j86J92J030J699J641J033K46o26j232q85
54996A53891L57J296J089M12L55Q43J065Q82Q18R15O69r1r67j535j489n88Q80
$$ y = [139353, 138963, 139070, 139564, 140138, 140382, 140324, 140566, 141418, 142296, 142537, 142368, 142450, 142770, 142733, 142148, 141416, 140819, 140277, 139785, 139604, 139936, 140712, 141685, 142568, 143220, 143809, 144509, 145044, 145006, 144743, 145188, 146565, 147998, 148812, 149409, 150286, 150995, 150884, 150229, 149777, 149655, 149536, 149472, 149763, 150302, 150769, 151140, 151417, 151280, 150654, 150151, 150246, 150506, 150356, 150067, 150183, 150536, 150768, 151301, 152729, 154577, 155757, 156003, 155881, 155654, 155177, 154650, 154347, 153788, 152369, 150718, 150224, 151071, 151903, 151721, 151066, 150965, 151601, 152433, 152976, 153073, 152941, 153096, 153695, 153970, 152988, 151026, 149436, 149053, 149477, 150022, 150540, 151071, 151500, 151939, 152786, 154016, 154982, 155210, 154924, 154502, 154002, 153495, 153331, 153653, 154045, 154063, 153861, 153974, 154623, 155425, 155679, 154938, 153464, 152068, 151297, 150979, 150793, 150985, 152015, 153714, 155355, 156388, 156634, 156008, 154776, 153891, 154248, 155544, 156633, 157045, 157400, 158243, 159308, 160190, 161008, 161923, 162592, 162501, 161534, 159999, 158510, 157922, 158802]
54979A58802J865J562M76j70L7M13K60l37q04o75k6M90K38m93o40K60J396J852
54961A64506J716J491J104L63j26L52J321J577Q55R8%J50j51r58j779k102j686
54944A66731p82r2j01m03k00N53J000N12n38j290j314p71M0J018K136L161L632
54927A73292L267K405J829K053K930L961M733N062N024M971N223N571N458M643
54913B30422L364J778k13k439m279n351n866o118o012n521n019m817m678m197
54899A81054l368k471j688j108q29p77p17n72m27j90K97Q49J148J388J992K780
54883A77361L162L228L625M213M080L266L172M472N884N959N066M421M003K879
54869B34791R70q26k111l332m732n924o531o455n612m192k964k620k848k785k231
$$ y = [158802, 160667, 162229, 162705, 162535, 162572, 162985, 163245, 162908, 162104, 161429, 161403, 161893, 162131, 161638, 160998, 161258, 162654, 164506, 166222, 167713, 168817, 169180, 169054, 169406, 170727, 172304, 173159, 173257, 173257, 173407, 173256, 172298, 170519, 168417, 166731, 165949, 165857, 165756, 165353, 165153, 165706, 166706, 167218, 166680, 165390, 164076, 163305, 163345, 164363, 166499, 169660, 173292, 176559, 178964, 180793, 182846, 185776, 189737, 194470, 199532, 204556, 209527, 214750, 220321, 225779, 230422, 233786, 235564, 235351, 232912, 228633, 223282, 217416, 211298, 205286, 199765, 194746, 189929, 185251, 181054, 177686, 175215, 173527, 172419, 171590, 170813, 170096, 169524, 169097, 168907, 169204, 170053, 171201, 172589, 174581, 177361, 180523, 183751, 187376, 191589, 195669, 198935, 202107, 206579, 212463, 218422, 223488, 227909, 231912, 234791, 235761, 234935, 232824, 229492, 224760, 218836, 212305, 205850, 200238, 196046, 193082, 190462, 187614, 184829, 182598]
54854A82598j712j541j548j595j634j365n91J85J86n68j301j460j155p38n24p73
54838A66464j381j718j350o97m15m06j42K86K80j95n17m27l19m50n36l56j16j1
54820A57994P4K08K11o4n02q68r51n87J43Q73J324J591J794J732J252O19J57k22
54802A64778o20o84q6P85J229J113Q38O21L83J88J79K25O3l03p25j184j474j115
54784A64211k2J108J678J954K329K364J536M36K08R79J869K415K923L497L795
54769A91280L806L988M464M967N582O623P649P625O292M548L191K129J091J85
54755B53420o18j778l516n393o881p776p871o954n410m136l444k777j829j184
54741A93853j296j584j235l67K50K73n6m87q30p08J19J241J958K156K249K362
$$ y = [182598, 180886, 179345, 177797, 176202, 174568, 173203, 172612, 172797, 172983, 172415, 171114, 169654, 168499, 167761, 167237, 166464, 165083, 163365, 162015, 161318, 160903, 160497, 160355, 160641, 160921, 160726, 160209, 159782, 159463, 159013, 158477, 158121, 158005, 157994, 158068, 158276, 158487, 158423, 157921, 157053, 156102, 155515, 155658, 156531, 157855, 159446, 161240, 162972, 164224, 164843, 165000, 164778, 164158, 163474, 163388, 164173, 165402, 166515, 167353, 167974, 168357, 168545, 168724, 168949, 169012, 168709, 167984, 166800, 165326, 164211, 164189, 165297, 166975, 168929, 171258, 173622, 175158, 175594, 175802, 176781, 178650, 181065, 183988, 187485, 191280, 195086, 199074, 203538, 208505, 214087, 220710, 228359, 235984, 242276, 246824, 250015, 252144, 253235, 253420, 252802, 251024, 247508, 242115, 235234, 227458, 219587, 212633, 207223, 203087, 199643, 196866, 195037, 193853, 192557, 190973, 189738, 189371, 189621, 189894, 189838, 189351, 188521, 187813, 187932, 189173, 191131, 193287, 195536, 197898]
54725A97898K121J499J313K353M202N454N251M182L331K867K116Q41l73j212k252
54710B29591l931n533o013n441m853m763m687m108l190k321j536p37p0K15J44
54695A82767K5J57M42L23o40k020k733k291j454j187j476j670j559j372j016k24
54679A66072O54Q08O3q35j111o85O4O88Q46N30J34j4n4j38J0N36Q41L29n29p64
54659A67445l29n5k31l01L9L84M17L33K49Q1Q1O23J301J186K40m32j44M36L86
54640A71709k15o43m97J08P40P77o2j014q96L21J307J158M58J13Q7l6j03J09J64
54621A73585l41q95q28m64n71j001r26k82O3l16p21l54O65J578J899J692J240
54604A74023P29J46m85r06p93k78K0k33o01m90m3R3k51n56m24p5J58M07R76J711
$$ y = [197898, 200019, 201518, 202831, 205184, 209386, 214840, 220091, 224273, 227604, 230471, 232587, 233428, 233055, 231843, 229591, 225660, 220127, 214114, 208673, 203820, 199057, 194370, 190262, 187072, 184751, 183215, 182478, 182408, 182623, 182767, 182792, 182949, 183391, 183714, 183074, 181054, 178321, 176030, 174576, 173389, 171913, 170243, 168684, 167312, 166296, 166072, 166726, 167534, 167597, 166762, 165651, 164966, 165030, 165718, 166564, 167094, 167228, 167214, 167160, 167022, 167032, 167568, 168409, 168738, 168209, 167445, 167116, 167061, 166830, 166529, 166568, 166952, 167369, 167702, 167951, 168032, 168113, 168736, 170037, 171223, 171463, 171031, 170887, 171323, 171709, 171494, 170851, 170354, 170462, 171202, 171979, 171917, 170903, 170007, 170328, 171635, 172793, 173251, 173364, 173451, 173415, 173312, 173421, 173585, 173244, 172349, 171521, 171057, 170486, 169485, 168559, 168277, 168340, 168024, 167303, 166949, 167614, 169192, 171091, 172783, 174023, 174752, 174898, 174413, 173507, 172714, 172436, 172456, 172223, 171622, 171132, 171089, 171182, 170931, 170375, 169951, 169876, 170034, 170441, 171417, 173128]
54584A73128K094J911J463J003L65o33j627j944j354k24R36J701J598M48j056
54569A77809j733j308p51q09r07k09Q31J028K99k04K44J040J291Q65K18k86n26
54552A76892n72o91r78j065n21L99J072J353J553J596J070K06n6P22J798K169
54536A84947J597N78k57m58n7L64L12J03L64R22R50K43n70j174j910k715k720
54519A80519j503Q3R59J007O85J76m29p69o85o36r97j368j150m71P6K73L76N80
54501A76726Q41J040J049P86M12J97J38P4J42N69R80O59l41j157j339j342j449
54484A77985j189k90O25R20P78O16M03J39K86J001J577J393Q25N66O53Q08J110
54467A88206J545J543P88o8k80r0j52m01l69j19RJ29M35N41J12l37j71K57J76
$$ y = [173128, 175222, 177133, 178596, 179599, 179964, 179331, 177704, 175760, 174406, 174182, 175118, 176819, 178417, 178865, 177809, 176076, 174768, 174017, 173208, 172301, 172092, 172923, 173951, 174250, 174046, 174290, 175330, 176621, 177486, 177704, 177418, 176892, 176320, 175629, 174651, 173586, 173065, 173464, 174536, 175889, 177442, 179038, 180108, 180314, 180258, 180980, 182778, 184947, 186544, 187122, 186865, 186407, 186350, 186714, 187026, 187129, 187493, 188415, 189365, 189608, 189038, 187864, 185954, 183239, 180519, 179016, 179099, 180058, 181065, 181750, 181926, 181497, 180728, 180043, 179407, 178410, 177042, 175892, 175421, 175497, 175770, 176146, 176726, 177567, 178607, 179656, 180442, 180854, 181051, 181189, 181263, 181405, 181974, 182954, 183613, 183272, 182115, 180776, 179434, 177985, 176796, 176506, 177131, 178051, 178829, 179445, 179848, 179987, 180273, 181274, 182851, 184244, 185069, 185635, 186288, 187096, 188206, 189751, 191294, 192082, 192014, 191734, 191644, 191492, 191091, 190722, 190603, 190612, 190741, 191176, 191717, 191829, 191492, 191321, 191578, 191754]
54448A91754l28o44p71j019r73n2J134J309M39j75J25N27J73o54j181j155p76
54431A87733m03n44j363k029j383M24J855J835R60L70K64J04k29k43L94J350J822
54414A90917J197k48j359j216k36L96L00K68Q70J546J502Q06J92J24O03J428K195
54397A99285K327J584M38l88n75k59L35R38J203R54L76k14o89j022j102q47m02
54380B01942K2L44N40N34L15K1k36n08p80q10m24J22L49J66m2L1K39L39M73R24
54360B03561J455J445Q26L98P70J381J198J97n89n37r8J82N51J419K448K904K581
54343B20092J866J183Q54J187K163L123L244K322Q28n93j432j534j281j355j929
54328B28738k426k360j962j632j306r38r71j635k219j944j174q81j121j070m57
$$ y = [191754, 191426, 190782, 190011, 188992, 188019, 187967, 189101, 190410, 190849, 190674, 190799, 191326, 191499, 190845, 189664, 188509, 187733, 187330, 186786, 185423, 183394, 182011, 182435, 184290, 186125, 187085, 187455, 187719, 187823, 187594, 187351, 187745, 189095, 190917, 192114, 191866, 190507, 189291, 189055, 189451, 189751, 190019, 190889, 192435, 193937, 194743, 194935, 195059, 195662, 197090, 199285, 201612, 203196, 203634, 203246, 202671, 202412, 202747, 203685, 204888, 205842, 206218, 206004, 205315, 204293, 203191, 202344, 201942, 201964, 202308, 202848, 203382, 203697, 203718, 203482, 202974, 202194, 201384, 200960, 201082, 201431, 201597, 201555, 201586, 201825, 202164, 202637, 203561, 205016, 206461, 207287, 207685, 208455, 209836, 211034, 211231, 210642, 210105, 210007, 210189, 210740, 212159, 214607, 217511, 220092, 221958, 223141, 223995, 225182, 227345, 230468, 233712, 236034, 236862, 236269, 234837, 233303, 232022, 230667, 228738, 226312, 223952, 221990, 220358, 219052, 218114, 217143, 215508, 213289, 211345, 210171, 209290, 208169, 207099, 206642]
54313B06642N4K7j80j91j26o6J44K81k46j347j930j259l3M77j3p15r38p61o25
54294A99195p19q14n23K94J210J514R75K36J98J040J976K011R53l48q33k93N12
54277B06584Q35P43O78O49K80m28r54r97q34q38r27p26r5O87J165J134Q14O03
54259B08373N89N22L16K96P05J198J194O05o4k80O2O30Q46K98p93j637j668j043
54241B10149l26J02P1m14r80j030m91l1j14l56k34P0J48J42L29L96J0l22R3Q49
54221B08061Q45j44j180j534j377j061o67l74m90q62r46o22k06K98J129J878J645
54204B04393L88p49r04m43p3J44M18N46L49J85M41Q43Q57N05K98N57J099J495
54186B10349J423R26M25K09N2l04n06n5O50N96l76j252j311j088j340j791j607
$$ y = [206642, 206696, 206723, 206543, 206352, 206226, 206160, 206304, 206585, 206339, 204992, 203062, 201803, 201770, 202247, 202234, 201519, 200581, 199820, 199195, 198476, 197662, 197139, 197433, 198643, 200157, 201132, 201368, 201566, 202606, 204582, 206593, 207546, 207198, 206365, 206072, 206584, 207419, 208162, 208840, 209489, 209769, 209341, 208387, 207390, 206556, 205718, 204791, 204065, 203970, 204657, 205822, 206956, 207770, 208373, 208962, 209484, 209800, 210096, 210801, 211999, 213193, 213798, 213734, 213454, 213516, 214146, 214992, 215290, 214497, 212860, 211192, 210149, 209823, 209925, 209996, 209582, 208602, 207572, 207081, 207050, 206936, 206580, 206346, 206416, 206564, 206706, 207035, 207431, 207441, 207119, 207212, 208061, 208906, 208762, 207582, 206048, 204671, 203610, 202943, 202569, 202079, 201217, 200271, 199649, 199443, 199741, 200870, 202748, 204393, 204781, 204032, 203128, 202685, 202612, 202756, 203174, 203720, 204069, 204254, 204695, 205538, 206395, 206900, 207198, 207755, 208854, 210349, 211772, 212698, 213123, 213332, 213384, 213080, 212574, 212519, 213169, 213765, 213389, 212137, 210826, 209738, 208398, 206607, 205000]
54169B05000o27M26Q00L11o20j295j342j097j084j140o67J75M04k99r25m97N97
54152A98120J284J235R36P31O16O07O65M68j53p90r28o12k13K07P10R91O70k3
54134B04521m55l29J13N72Q54P76L35m5J07P89J608K229K393J804M91q55j350
54117B13558q45M8P25J115J378J526J377P77j41q79r46m73j12j77k11K15P34P15
54099B18384K97J75M61N03J8l05J80R66R32j07r94o39O13J391R39j61r39j166
54081B20548j209j185q60k77J40K11K51O01J198J789K226K394K212J833J592J557
54065B33021J401Q70J90p7M57J639K735K932K209J559J978L341M681N445N901
54050B68282O446P234Q553J0716J3226J4654J3782J0618O078J190l178o317p889
$$ y = [205000, 204373, 204799, 205599, 205910, 205290, 203995, 202653, 201556, 200472, 199332, 198665, 198840, 199244, 198945, 198020, 197523, 198120, 199404, 200639, 201575, 202306, 202922, 203529, 204194, 204662, 204509, 203719, 202791, 202179, 201966, 202173, 202883, 203874, 204544, 204521, 204066, 203737, 203850, 204422, 205276, 206052, 206387, 206342, 206449, 207238, 208846, 211075, 213468, 215272, 215763, 214908, 213558, 212713, 212761, 213486, 214601, 215979, 217505, 218882, 219659, 219518, 218639, 217693, 217220, 217108, 216931, 216720, 216935, 217669, 218384, 218681, 218856, 219317, 219820, 219838, 219533, 219713, 220679, 221611, 221504, 220510, 219871, 220484, 221875, 222814, 222653, 221714, 220548, 219339, 218154, 217294, 217017, 217157, 217368, 217619, 218220, 219418, 221207, 223433, 225827, 228039, 229872, 231464, 233021, 234422, 235292, 235482, 235405, 235862, 237501, 240236, 243168, 245377, 246936, 248914, 252255, 256936, 262381, 268282, 274728, 281962, 290515, 301231, 314457, 329111, 342893, 353511, 359589, 360779, 357601, 351284, 343395]
54037C43395q036p147n751m440l462k381p72Q53J516J256J204J851K215J320j95
54022C21426p99RJ172J380M35o51p44J40P48Q8j297k134k292k744l750m330l988
54005C02669l655m150m843m747m096l741l647l126k169j445j170r11n14m09r46
53990B63100j850k440k163j180m51p91j704j866r61j02m5j20L35O85J75n72n22
53973B49528j7j90j089j721j644j242o62K05R01Q29M29O88J508J829J388J080
53957B51820J373J685J652J828K579L382L740L935M315M621M597M664N380O677
53943C02248Q081R249R934R833Q848P302N690M338L275K192O71j147k414k650
53929C65450k559l055l756l492k177j017p32o83j93L84N12N43J154K290L346M019
$$ y = [343395, 335359, 328212, 322461, 318021, 314559, 312178, 311406, 312259, 313775, 315031, 316235, 318086, 320301, 321621, 321426, 320627, 320636, 321808, 323188, 323623, 322972, 322228, 322368, 323116, 323204, 321907, 319773, 317481, 314737, 310987, 306657, 302669, 299014, 294864, 290021, 285274, 281178, 277437, 273790, 270664, 268495, 267050, 265880, 264969, 264455, 264046, 263100, 261250, 258810, 256647, 255467, 255016, 254225, 252521, 250655, 249694, 249592, 249547, 249427, 249762, 250447, 250622, 250050, 249528, 249511, 249321, 248232, 246511, 244867, 243625, 242963, 243168, 244069, 244898, 245327, 246015, 247523, 249352, 250740, 251820, 253193, 254878, 256530, 258358, 260937, 264319, 268059, 271994, 276309, 280930, 285527, 290191, 295571, 302248, 310329, 319578, 329512, 339345, 348193, 355495, 361185, 365523, 368798, 370990, 371661, 370514, 368100, 365450, 362891, 359836, 356080, 352588, 350411, 349394, 348662, 347979, 347786, 348170, 348682, 349225, 350379, 352669, 356015, 360034]
53913C60034M433M692M845N055N388N578N261M389L308K507K263K287J938J071
53899D13049M53P96J658J995J701J758K864M691O643Q562J0401J1964J3173J3844
53885D93552J2983R175K231o122j3550j8705k1359k1804k0657j8726j6492j4020
53873C66506j1575r761q792q127p233o176n258m606m307m334m106k883r87J46
53859B88507l37j701k744l168l214k749j647n26j96o49j279j759k033j874j239
53844B63392o74o41p64n27l10p83j598j774j265j032j364j378n30L57K89m76r06
53827B50016o38j29K88O91J043J074Q34P45R10Q96N00K40N80J021O82l24q37j82
53809B57410R91J777K271L006L738L662K781K079K234K909L528M000M326M160
$$ y = [360034, 364467, 369159, 374004, 379059, 384447, 390025, 395286, 399675, 402983, 405490, 407753, 410040, 411978, 413049, 413502, 414298, 415956, 417951, 419652, 421410, 424274, 428965, 435608, 444170, 454571, 466535, 479708, 493552, 506535, 515710, 517941, 511819, 498269, 479564, 458205, 436401, 415744, 397018, 380526, 366506, 354931, 345170, 336378, 328251, 321018, 314842, 309584, 304978, 300671, 296337, 292231, 289348, 288361, 288507, 288170, 286469, 283725, 280557, 277343, 274594, 272947, 272421, 272225, 271576, 270297, 268538, 266505, 264631, 263392, 262718, 262077, 261313, 260786, 260476, 259693, 258095, 256321, 255056, 254024, 252660, 251282, 250752, 251109, 251398, 250922, 250016, 249378, 249249, 249537, 250228, 251271, 252345, 253179, 253924, 254834, 255730, 256230, 256470, 257050, 258071, 258753, 258429, 257592, 257410, 258401, 260178, 262449, 265455, 269193, 272855, 275636, 277715, 279949, 282858, 286386, 290386, 294712, 298872]
53795B98872L348K465K254K722L152K930K118J356J279J895K462K254J438P71
53781C29316N02J21o27j267j421j476j860k210j889j081o71j230k503l862m773
53766C05069m973m565l950l427k983k578k349k318k252k066k074k412k596k111
53752B64415j159l16K61P57J004N57n24j531j906j676j070j87Q01J500J680J535
53736B64141J380J250J013O71L46Q6r4m6L79J006J364J188P86O44Q30J013J074
53719B77031J273J686J891J573J093J048J441J788J836J706J460J083Q50J140
53705B96899J863K595L256M003M541M243L186K303K222K590K821K872K919K906
53691C39219K850L004L276L044K061R50L52M2n11j190j499j368j112q49n51m23
$$ y = [298872, 302220, 304685, 306939, 309661, 312813, 315743, 317861, 319217, 320496, 322391, 324853, 327107, 328545, 329316, 329818, 329939, 329312, 328045, 326624, 325148, 323288, 321078, 319189, 318108, 317437, 316207, 313704, 309842, 305069, 300096, 295531, 291581, 288154, 285171, 282593, 280244, 277926, 275674, 273608, 271534, 269122, 266526, 264415, 263256, 262940, 263201, 263958, 264962, 265519, 264995, 263464, 261558, 259882, 258812, 258625, 259426, 260926, 262606, 264141, 265521, 266771, 267784, 268455, 268801, 268887, 268793, 268747, 269126, 270132, 271496, 272684, 273470, 274114, 274944, 275957, 277031, 278304, 279990, 281881, 283454, 284547, 285595, 287036, 288824, 290660, 292366, 293826, 294909, 295759, 296899, 298762, 301357, 304613, 308616, 313157, 317400, 320586, 322889, 325111, 327701, 330522, 333394, 336313, 339219, 342069, 345073, 348349, 351393, 353454, 354404, 354756, 354798, 354287, 353097, 351598, 350230, 349118, 348269, 347718, 347295]
53675C47295o92j204j569j558j062j34O86O09l42j150j140q26q70j040r73j128
53659C34902j837k171j171L08N81k68m94N08J295Q01l4MM18j1j179j873j487m43
53641C27849P25J724K173J918J543J736K218K106J304P07Q58J256J303J235J604
53626C50259K310K704K450J866J495J665K388L324L941L932L564L376L546L816
53612C90636L974M081M175M115L926L986M535N171N227M528L500K606K051J904
53598D44415K083K200J899J451J509K113K469K020J219P85O50K78k80m09n9Po12
53581D61738j152o40P18J745J847J692K126K967L393L157K724K259J228o77k846
53566D80279m414n180n463n412n083m791m683m275l193k071j787j968j366J69
$$ y = [347295, 346603, 345399, 343830, 342272, 341210, 341076, 341762, 342371, 342029, 340879, 339739, 338913, 338043, 337003, 336030, 334902, 333065, 330894, 329723, 330031, 330612, 330344, 329850, 330358, 331653, 332454, 332420, 332424, 332842, 332831, 331652, 329779, 328292, 327849, 328574, 330298, 332471, 334389, 335932, 337668, 339886, 341992, 343296, 344003, 344861, 346117, 347420, 348655, 350259, 352569, 355273, 357723, 359589, 361084, 362749, 365137, 368461, 372402, 376334, 379898, 383274, 386820, 390636, 394610, 398691, 402866, 406981, 410907, 414893, 419428, 424599, 429826, 434354, 437854, 440460, 442511, 444415, 446498, 448698, 450597, 452048, 453557, 455670, 458139, 460159, 461378, 462163, 462813, 463091, 462811, 462402, 462343, 462350, 461738, 460586, 459946, 460664, 462409, 464256, 465948, 468074, 471041, 474434, 477591, 480315, 482574, 483802, 483125, 480279, 475865, 470685, 465222, 459810, 454727, 449936, 445253, 440978, 437785, 435714, 433927, 431959, 430593, 430762]
53552D30762J289J055K26j7L78Q19J237J847K351K365K256K639L323L604L378
53537D57512L238L563M267N322O756Q093Q620Q366Q229Q893J0086J1128J1783
53524E55856J2376J3200J4130J4722J4753J4540J4632J5199J5979J6810J7767
53513G19964J8711J9279J9584K0255K1464K2538K3028K3490K4513K5614K5921
53502I64361K5507K5183K5188K5012K4322K3296K2156K1049K0290J9989J9659
53491A216012J8830J7908J7598J7743J7665J7405J7635J8329J8627J8169J7564
53480A413485J7222J6741J5806J4874J4316J3624J2086R791P406N340L506J687
53468A545884k91k556n079p658j0057j2061j3481j4415j5353j6628j7884j8587
$$ y = [430762, 432051, 433106, 433332, 433315, 433693, 434512, 435749, 437596, 439947, 442312, 444568, 447207, 450530, 454134, 457512, 460750, 464313, 468580, 473902, 480658, 488751, 497371, 505737, 513966, 522859, 532945, 544073, 555856, 568232, 581432, 595562, 610284, 625037, 639577, 654209, 669408, 685387, 702197, 719964, 738675, 757954, 777538, 797793, 819257, 841795, 864823, 888313, 912826, 938440, 964361, 989868, 1015051, 1040239, 1065251, 1089573, 1112869, 1135025, 1156074, 1176364, 1196353, 1216012, 1234842, 1252750, 1270348, 1288091, 1305756, 1323161, 1340796, 1359125, 1377752, 1395921, 1413485, 1430707, 1447448, 1463254, 1478128, 1492444, 1506068, 1518154, 1527945, 1535351, 1540691, 1544197, 1545884, 1545593, 1543037, 1537958, 1530300, 1520243, 1508182, 1494701, 1480286, 1464933, 1448305, 1430421, 1411834]
53456A411834j8856j9196j9629j9847k0152k1270k3036k4180k3828k2523k1326
53445A177991k0521j9644j8362j6792j5239j3889j2650j1203r445p774o514n272
53433A020686l552j809j000j014n21J290L734N744P110Q148R006R897J1336J3380
53419A082435J5269J6456J7494J9195K1305K2866K3656K4532K6312K8809L1086
53408A329415L2345L2674L3012L4243L6267L8220L9630M0864M2387M4177M6072
53397A749306M8081N0064N1714N3124N4702N6205N6698N6020N5428N5988N7023
53386B344353N7028N5668N3834N2127N0272M7909M5025M1609L7667L3596K9842
53375B848930K6164K1882J6917J1899P225K610k249p250j2301j7732k3952l0945
$$ y = [1411834, 1392978, 1373782, 1354153, 1334306, 1314154, 1292884, 1269848, 1245668, 1221840, 1199317, 1177991, 1157470, 1137826, 1119464, 1102672, 1087433, 1073544, 1060894, 1049691, 1040246, 1032472, 1025958, 1020686, 1017134, 1015325, 1014325, 1013311, 1012790, 1014080, 1017814, 1023558, 1030668, 1038816, 1047822, 1057719, 1069055, 1082435, 1097704, 1114160, 1131654, 1150849, 1172154, 1195020, 1218676, 1243208, 1269520, 1298329, 1329415, 1361760, 1394434, 1427446, 1461689, 1497956, 1536176, 1575806, 1616670, 1659057, 1703234, 1749306, 1797387, 1847451, 1899165, 1952289, 2006991, 2063196, 2119894, 2175914, 2231342, 2287330, 2344353, 2401381, 2457049, 2510883, 2563010, 2613282, 2661191, 2706216, 2747825, 2785492, 2819088, 2848930, 2875094, 2896976, 2913893, 2925792, 2933017, 2935627, 2933378, 2926128, 2913827, 2896095, 2872143, 2841198]
53363B841198l8154m4684m9695n2977n5160n6975n8417n8984n8665n8141n7953
53352B251393n7966n7757n7091n5769n3569n0645m7694m5447m4062m3230m2585
53341A695578m1789m0420l8231l5560l3146l1337k9690k7516k4776k2193k0382
53330A350538j9093j7464j4997j2074r658q527q735r566j0140j0178j0075j0087
53318A209944r804q772p308o113n213l994k290p33K12Q59J705K757L825N025O536
53303A186636Q219R799J1119J2084J2731J3549J5228J7759K0302K2232K3823K5543
53291A379024K7233K8459K9139K9299K8686K7202K5354K3703K2235K0736J9346
53280A660416J8107J6458J3885J0794P912N190K103j142l799n922q534j2076j5552
$$ y = [2841198, 2803044, 2758360, 2708665, 2655688, 2600528, 2543553, 2485136, 2426152, 2367487, 2309346, 2251393, 2193427, 2135670, 2078579, 2022810, 1969241, 1918596, 1870902, 1825455, 1781393, 1738163, 1695578, 1653789, 1613369, 1575138, 1539578, 1506432, 1475095, 1445405, 1417889, 1393113, 1370920, 1350538, 1331445, 1313981, 1298984, 1286910, 1277252, 1268725, 1259990, 1250424, 1240284, 1230106, 1220031, 1209944, 1200140, 1191368, 1184060, 1177947, 1172734, 1168740, 1166450, 1165717, 1165929, 1166788, 1168493, 1171250, 1175075, 1180100, 1186636, 1194855, 1204654, 1215773, 1227857, 1240588, 1254137, 1269365, 1287124, 1307426, 1329658, 1353481, 1379024, 1406257, 1434716, 1463855, 1493154, 1521840, 1549042, 1574396, 1598099, 1620334, 1641070, 1660416, 1678523, 1694981, 1708866, 1719660, 1727572, 1732762, 1734865, 1733723, 1729924, 1724002, 1715468, 1703392, 1687840]
53267A687840j7771j8910k0240k2493k5056k6837k7571k8039k9016l0333l1286
53256A410288l1743l2234l2939l3308l3038l2640l2514l2105l0749k8829k7256
53245A062933k6166k5097k4173k4039k4573k4765k4137k3294k2727k1892k0078
53234H01992j7598j5386j3809j2492j1137r942r163q688q230p772p598p870q338
53221F63969q621q704q883r215r431r523r933j0857j1742j1907j1400j0828j0496
53208E32429j0227r790r069p991o746n935n993o564o928o877o775o832o915o953
53194D28834p046p115o960o581o117n481m559l663l279l413l587l521l349l237
53180C60926l173l062k719j937r34m11p29j290j331r63p97q68q18p92j184j686
$$ y = [1687840, 1670069, 1651159, 1630919, 1608426, 1583370, 1556533, 1528962, 1500923, 1471907, 1441574, 1410288, 1378545, 1346311, 1313372, 1280064, 1247026, 1214386, 1181872, 1149767, 1119018, 1090189, 1062933, 1036767, 1011670, 987497, 963458, 938885, 914120, 889983, 866689, 843962, 822070, 801992, 784394, 769008, 755199, 742707, 731570, 721628, 712465, 703777, 695547, 687775, 680177, 672307, 663969, 655348, 646644, 637761, 628546, 619115, 609592, 599659, 588802, 577060, 565153, 553753, 542925, 532429, 522202, 512412, 503343, 495352, 488606, 482671, 476678, 470114, 463186, 456309, 449534, 442702, 435787, 428834, 421788, 414673, 407713, 401132, 395015, 389534, 384975, 381312, 378033, 374620, 371033, 367512, 364163, 360926, 357753, 354691, 351972, 350035, 349101, 348690, 347961, 346671, 345340, 344377, 343580, 342712, 341894, 341102, 339918, 338232]
53164C38232j565q79l57j22K77N48k67k032l177k801j958j982k546k471j645r88
53148C16267q77q21n42l98n75o78l70M9L0m35p57m70Q0P9o62j324j150n64m98
53129C06384q93p74J52J002J022N21O5k73m05J39J302K049J618O44K26M62P24
53112C13965Q74J196J446J056J28o07q74j087j492j827j953k080k208j960j168
53097C03409j74O11J027R52K65p60j456j427j014p96q75q49m12K09N16L62J71
53080B99759L76P81P92K63k29j58L14O84P36O31O68J114J939K547K239J215N28
53063C14199O94R51M22o33j363j613j746j665j014j75nn41q80n82k98p10j578
53046C03463k167k064j320k93L44L1r43j560j288p06o11r23r55m43R9J6p92j698
$$ y = [338232, 336667, 335788, 335431, 335309, 335586, 336134, 335867, 333835, 330658, 327857, 325899, 323917, 321371, 318900, 317255, 316267, 315390, 314569, 314027, 313629, 313054, 312376, 312006, 312055, 312085, 311650, 310893, 310423, 310503, 310582, 309920, 308596, 307446, 306882, 306384, 305491, 304717, 304869, 305871, 306893, 307414, 307479, 307206, 306801, 306940, 308242, 310291, 311909, 312553, 312779, 313241, 313965, 314839, 316035, 317481, 318537, 318665, 318058, 317184, 316097, 314605, 312778, 310825, 308745, 306537, 304577, 303409, 303235, 303846, 304873, 305825, 306090, 305330, 303874, 302447, 301433, 300637, 299762, 298913, 298501, 298710, 299226, 299588, 299759, 300135, 300916, 301708, 301971, 301742, 301584, 301898, 302582, 303318, 303949, 304617, 305731, 307670, 310217, 312456, 313671, 314199, 314893, 315844, 316266, 315633, 314270, 312657, 310911, 309246, 308232, 308057, 308052, 307511, 306631, 306049, 305751, 305041, 303463, 301296, 299232, 297912, 297619, 297963, 297994, 297051, 295491, 294203, 293497, 292886, 291963, 291008, 290565, 290664, 290680, 289888, 288190]
53028B88190j854j038k6K78kJ06R54J659J318K46n38o01k35L51J190J964K005
53011B93967J144J10k35J88P29P44J36o42r81n34M84J477J938J761J138L97q8
52994C01733l4M59Q75P69K60j00L7N29J073J572J983K074J640Q91K97M2q7j95
52976C13818lP18J668K238K114J518R45P53R42J137R49M40J30L74Q94J149R88
52959C30772O60L49pm38q08j032j200j448j765j984j831j197l87K1j60m65m31
52942C18649k61m38q20p75j76L03P5o65j353j708j689j288p48o37j240k051k296
52925C02882j834j162o48k47J16L07K74K19L24N17O41O56N38K16k24m23r3N85
52907C02644J032P75j41j247k041k276j918j005K82J386J575O68n97j235j044
$$ y = [288190, 286336, 285298, 285272, 285550, 285548, 285654, 286608, 288267, 289585, 289831, 289293, 288692, 288457, 288808, 289998, 291962, 293967, 295111, 295221, 294986, 295174, 295903, 296647, 296783, 296141, 295160, 294626, 295110, 296587, 298525, 300286, 301424, 301821, 301733, 301699, 302158, 303033, 303802, 304062, 303962, 303999, 304528, 305601, 307173, 309156, 311230, 312870, 313761, 314058, 314100, 314013, 313818, 313815, 314533, 316201, 318439, 320553, 322071, 323016, 323769, 324711, 325848, 326797, 327237, 327367, 327741, 328635, 329784, 330772, 331432, 331781, 331774, 331336, 330528, 329496, 328296, 326848, 325083, 323099, 321268, 320071, 319684, 319705, 319545, 319080, 318649, 318388, 317950, 317130, 316355, 316179, 316482, 316557, 315892, 314539, 312831, 311142, 309854, 309106, 308469, 307229, 305178, 302882, 301048, 299886, 299238, 298991, 299107, 299414, 299688, 299907, 300231, 300748, 301389, 302045, 302583, 302799, 302575, 302152, 302059, 302644, 303676, 304451, 304310, 303063, 301022, 298746, 296828, 295823, 296105, 297491, 299066, 299734, 299137, 297902, 296858]
52892B96858o06k92K07J140K003K077J382N79Q6j78k48R5Q04J339J269P52J62
52875C07429m05r54j237j011m27J49O15J016J174Q66L71L88J206K258K696K292
52859C16426J614J365J575J594Q91k34j077j538k170l088l503k873j918j771k446
52844C02847l005l027k934k868k303j128k10l16j104j672j614j062k31N36P26
52829B82635K28l74n54n44p37q72m74J78L25j56n87m29J70Q63J506K011K252K246
52811B87687K073J675J095P90J242K163K649K185J124Or88j832k372k549k535
52796B92413k386j925j214q23j190j959k291j785p94J02O33Q42Q17N89K50J8J21
52779B81418N29R06Q85M34j45m89m53j01L78P93J033J099R97P16L56J40J88L28
$$ y = [296858, 296252, 295960, 296167, 297307, 299310, 301387, 302769, 303348, 303434, 303256, 303008, 303103, 303907, 305246, 306515, 307267, 307429, 307024, 306070, 304833, 303822, 303395, 303544, 304159, 305175, 306349, 307215, 307586, 307974, 309180, 311438, 314134, 316426, 318040, 319405, 320980, 322574, 323465, 323231, 322154, 320616, 318446, 315358, 311855, 308982, 307064, 305293, 302847, 299842, 296815, 293881, 291013, 288710, 287582, 287372, 287056, 285952, 284280, 282666, 281604, 281373, 281909, 282635, 282863, 282489, 281935, 281391, 280654, 279782, 279308, 279486, 279811, 279655, 279068, 278639, 278809, 279672, 281178, 283189, 285441, 287687, 289760, 291435, 292530, 293320, 294562, 296725, 299374, 301559, 302683, 302689, 301701, 299869, 297497, 294948, 292413, 290027, 288102, 286888, 286065, 284875, 282916, 280625, 278840, 278046, 278148, 278781, 279623, 280440, 281029, 281279, 281297, 281418, 281947, 282853, 283738, 284172, 284027, 283538, 283085, 282984, 283362, 284155, 285188, 286287, 287284, 288000, 288356, 288496, 288684, 289012]
52761B89012K67j44p91j354j463r87k65K03L05L46M41L72J59K50P50J002M86k62
52743B88327l14L95J148J553J777J832J545J221J464K113K208J341K81j76k42
52728C04473m77p27m25M25J197J416J049K94n07r28q56o97q35j147j289j247j144
52711B98575q61l20R6q0p52j411j794j873j428l12R05J280O22k60o09m68j64L16
52693B91462R98J475J277N17k38n83m56Q2Q02J189Q53J74O2Q89J928K115J216
52676C03762%o40n24j15J34K37M91J008J457J389Q26M21Q32J904K651K221P95
52659C16849n93j092p37j97l1k48l88PR24J845K221K000J551J092N12k33q27r88
52641C21667q94r15j033q79l00L92Q60J104J236J204R87R98J886L853O241P954
$$ y = [289012, 289279, 289135, 288344, 286990, 285527, 284540, 284275, 284478, 284783, 285129, 285570, 285942, 286101, 286351, 287101, 288103, 288589, 288327, 288013, 288408, 289556, 291109, 292886, 294718, 296263, 297484, 298948, 301061, 303269, 304610, 304891, 304715, 304473, 303996, 303269, 302844, 303269, 304466, 305882, 306931, 307225, 306718, 305790, 304934, 304237, 303402, 302255, 300966, 299719, 298575, 297714, 297394, 297490, 297410, 296658, 295247, 293453, 291580, 290152, 289840, 290745, 292025, 292647, 292387, 291778, 291310, 291146, 291462, 292460, 293935, 295212, 295729, 295491, 294908, 294452, 294534, 295336, 296525, 297378, 297552, 297614, 298503, 300431, 302546, 303762, 303762, 303122, 302598, 302483, 302617, 302854, 303345, 304353, 305810, 307199, 308025, 308446, 309278, 311182, 313833, 316054, 316849, 316256, 315164, 314427, 314230, 314199, 313951, 313563, 313570, 314494, 316339, 318560, 320560, 322111, 323203, 323715, 323482, 322655, 321667, 320773, 319858, 318825, 317946, 317646, 318038, 318898, 320002, 321238, 322442, 323429, 324427, 326313, 330166, 336407, 344361]
52625C44361Q246P106M968K306m76k876m405m953m911m751m592m322l954l620
52611C28127l231k535j592q97p56p98m26L35Q12N02k62o10J9J305K249K069J016
52594C25327J15r1k15r98j954j827m88O09L02p28r86j58P99J206J263J241J042
52577C24459Q00R58J389J197k5j367j671r97l90m25o80n64j01K62K36p8l91n26
52559C22086n26m74k81J15M28K30m00q49p48l73r1J52M60N21O4m90m69R0L50l22
52539C19473j642k681k647j498k3P96O66J69OK98P61J140J245R66N84O55J229
52522C19497J619J364R11Q08P97M32J06N29J508K258K640L124L609L475K874K770
52506C48321L373L623K673R98n27j790l018l906l955l235k246j387r62j229j984
$$ y = [344361, 352607, 359713, 364681, 366987, 366511, 363635, 359230, 354277, 349366, 344615, 340023, 335701, 331747, 328127, 324896, 322361, 320769, 319872, 319116, 318318, 317892, 318227, 319039, 319541, 319279, 318669, 318688, 319993, 322242, 324311, 325327, 325442, 325351, 325136, 324138, 322184, 320357, 319869, 320478, 320780, 320052, 319066, 318908, 319707, 320913, 322176, 323417, 324459, 325259, 326217, 327606, 328803, 328778, 327411, 325740, 324743, 324353, 323928, 323248, 322684, 322583, 322845, 323081, 323003, 322612, 322086, 321560, 321086, 320805, 320920, 321348, 321578, 321178, 320329, 319581, 319208, 319117, 319269, 319729, 320250, 320314, 319824, 319355, 319445, 319795, 319473, 317831, 315150, 312503, 311005, 310982, 311778, 312444, 312613, 312619, 312917, 313678, 314818, 316063, 317029, 317613, 318268, 319497, 321116, 322480, 323391, 324199, 324996, 325428, 325534, 326063, 327571, 329829, 332469, 335593, 339202, 342677, 345551, 348321, 351694, 355317, 357990, 358988, 358461, 356671, 353653, 349747, 345792, 342557, 340311, 338924, 337962, 336733, 334749]
52491C34749k445k095j297p08n09n34p28r53q16j91M54P54R96J509J949J881J601
52474C33617J657J909J794J353J172J437J711J753J793J967K075K084K303K862
52460C59487L411L542L123K188Q35o33j779k443k800l042l231l459l767l866l357
52445C44209k372j637j618j902j697q32Q9M47K49j15n39j232k093k489j972r93
52429C25503m06l78l64j71k60p31p72K47J701K455K285J813J335O00k29l54O29
52412C32903K107L213L760M087M423M774N204N887O936Q347R928J1203J1530J0458
52398D24760P950M275n6m254p482r313r871r499q526p332o294n416m278k645r67
52383C61052%Q2p8J96Q64J331J270J027J109J558K048K428K832L297L634L769
$$ y = [334749, 332304, 330209, 328912, 328204, 327695, 327161, 326433, 325480, 324664, 324473, 324927, 325681, 326677, 328186, 330135, 332016, 333617, 335274, 337183, 338977, 340330, 341502, 342939, 344650, 346403, 348196, 350163, 352238, 354322, 356625, 359487, 362898, 366440, 369563, 371751, 372586, 371953, 370174, 367731, 364931, 361889, 358658, 355199, 351432, 347566, 344209, 341837, 340200, 338582, 336680, 334983, 334151, 334240, 334687, 334936, 334821, 334282, 333050, 330957, 328468, 326496, 325503, 325097, 324719, 324355, 324184, 323924, 323193, 322421, 322668, 324369, 326824, 329109, 330922, 332257, 332857, 332628, 332274, 332903, 335010, 338223, 341983, 346070, 350493, 355267, 360471, 366358, 373294, 381641, 391569, 402772, 414302, 424760, 432710, 436985, 436929, 432675, 425193, 415880, 406009, 396510, 387984, 380652, 374358, 368942, 364664, 362019, 361052, 361052, 361134, 361056, 361252, 362116, 363447, 364717, 365744, 366853, 368411, 370459, 372887, 375719, 379016, 382650, 386419]
52367C86419L910M143M164L546K209M84j099k040k153j742j283q85l54J69J87
52352C95675l44p39m69J73O58J030J550J969J828J286J000J255J784K326K824
52337D11806L099L024K904L212L871M438M927N854P329Q758R625J0098J0607J1260
52323E00812J1923J2487J2843J2872J2629J2256J1700J0878J0151J0183J1133
52312F29867J2441J3548J4435J5334J6292J7160J7690J7596J6904J6275J6378
52301H03920J6956J7123J6726J6593J7072J7193J5890J3389J0720Q338O057L867
52289I63844J923j7k210m025m491l819l482m342n485n523m469l607l788m594n141
52274I10774n064m485l576k507j527o72M50K179M143N467N796N726O027O768P538
$$ y = [386419, 390329, 394472, 398636, 402182, 404391, 404875, 403776, 401736, 399583, 397841, 396558, 395673, 395319, 395488, 395675, 395331, 394592, 394123, 394296, 394954, 395984, 397534, 399503, 401331, 402617, 403617, 404872, 406656, 408982, 411806, 414905, 417929, 420833, 424045, 427916, 432354, 437281, 443135, 450464, 459222, 468847, 478945, 489552, 500812, 512735, 525222, 538065, 550937, 563566, 575822, 587522, 598400, 608551, 618734, 629867, 642308, 655856, 670291, 685625, 701917, 719077, 736767, 754363, 771267, 787542, 803920, 820876, 837999, 854725, 871318, 888390, 905583, 921473, 934862, 945582, 953920, 959977, 963844, 965767, 965750, 963540, 959515, 955024, 951205, 947723, 943381, 937896, 932373, 927904, 924297, 920509, 915915, 910774, 905710, 901225, 897649, 895142, 893615, 892943, 893393, 895572, 899715, 905182, 910978, 916704, 922731, 929499, 937037]
52259I37037Q151Q785R542J0427J1635J3311J4958J5660J5088J3861J2684J1586
52247A082725J0264Q729P116N241K844J66k273m329o205p771q528q370q028q376
52233A063205r556j1008j2126j2711j2875j2868j2954j3214j3444j3391j3121
52222I25937j2921j2770j2204j0918r291q016p313o752n869m566l022j571p03
52209H30021p21j163j055j7J218J755J631J526J726J943K024K161K426K638K814
52194H48927L283M182N181N886O217O279O043N321L981K166L82q65j665k672m204
52179H88442n668o352o372o330o284n896n322n062m927m190k866j905j735j606
52165H23927q68N5N83J097K285L959N332N992N927N015L364J796J124J106R37
$$ y = [937037, 945188, 953973, 963515, 973942, 985577, 998888, 1013846, 1029506, 1044594, 1058455, 1071139, 1082725, 1092989, 1101718, 1108834, 1114075, 1116919, 1117085, 1114812, 1110483, 1104278, 1096507, 1087979, 1079609, 1071581, 1063205, 1053649, 1042641, 1030515, 1017804, 1004929, 992061, 979107, 965893, 952449, 939058, 925937, 913016, 900246, 888042, 877124, 867833, 859817, 852504, 845752, 839883, 835317, 832295, 830724, 830021, 829300, 828137, 827082, 827065, 828283, 830038, 831669, 833195, 834921, 836864, 838888, 841049, 843475, 846113, 848927, 852210, 856392, 861573, 867459, 873676, 879955, 885998, 891319, 895300, 897466, 897848, 896983, 895318, 892646, 888442, 882774, 876422, 870050, 863720, 857436, 851540, 846218, 841156, 836229, 832039, 829173, 827268, 825533, 823927, 823059, 823114, 823697, 824794, 827079, 831038, 836370, 842362, 848289, 853304, 856668, 858464, 859588, 860694, 861631]
52150H61631N66O17J121J382J287J752L363N237N900M953L354K246J912J858J561
52135H98740R81M41J95L28J033K603M998P624R892J1737J3327J4648J5759J7165
52121I99471J9240K1419K2629K2684K2542K2988K3595K3406K2188K0554J9104
52110A239820J7896J6732J5521J4341J3285J2427J1792J1422J1430J1916J2733
$$ y = [861631, 862197, 862814, 863935, 865317, 866604, 868356, 871719, 876956, 882856, 887809, 891163, 893409, 895321, 897179, 898740, 899721, 900162, 900357, 900685, 901718, 904321, 909319, 916943, 926835, 938572, 951899, 966547, 982306, 999471, 1018711, 1040130, 1062759, 1085443, 1107985, 1130973, 1154568, 1177974, 1200162, 1220716, 1239820, 1257716, 1274448, 1289969, 1304310, 1317595, 1330022, 1341814, 1353236, 1364666, 1376582, 1389315]
$$ [...]
##END NTUPLES=NMR SPECTRUM
##END=
