##TITLE=AC1480_CUNDIAS13306_8101136_fXrxJl3XZk
##JCAMPDX= 6.0         $$ Bruker NMR JCAMP-DX V2.0
##DATA TYPE= NMR SPECTRUM
##DATA CLASS= NTUPLES
##ORIGIN= BRUKER
##OWNER= Administrator
$$ 1.72 TOPSPIN		Version 2.1
$$ 2013-07-31 18:33:41.911 -0700  Administrator@X
$$ Compression mode = diff/dup
##.OBSERVE FREQUENCY= 400.02188249412
##.OBSERVE NUCLEUS= ^1H
##.ACQUISITION MODE= SIMULTANEOUS (DQD)
##.ACQUISITION SCHEME= undefined
##.AVERAGES= 8
##.DIGITISER RES= 22
##SPECTROMETER/DATA SYSTEM= spect
##.PULSE SEQUENCE= zg30
##.SOLVENT NAME= COFFEE_meoh
##.SHIFT REFERENCE= INTERNAL, COFFEE_meoh, 1, 14.98509
##AUDIT TRAIL= $$ (NUMBER, WHEN, WHO, WHERE, PROCESS, VERSION, WHAT)
$$ ##TITLE= Audit trail, TOPSPIN		Version 2.1
$$ ##JCAMPDX= 5.01
$$ ##ORIGIN= Bruker BioSpin GmbH
$$ ##OWNER= Administrator
$$ $$ E:\/data/COFFEE/nmr/AC1480_CUNDIAS13306_8101136_fXrxJl3XZk/10/pdata/1/auditp.txt
$$ ##AUDIT TRAIL=  $$ (NUMBER, WHEN, WHO, WHERE, PROCESS, VERSION, WHAT)
(   1,<2013-07-31 18:33:35.332 -0700>,<Administrator>,<X>,<go>,<TOPSPIN 2.1>,
      <created by zg
	started at 2013-07-31 18:32:29.661 -0700,
	POWCHK enabled, PULCHK disabled,
       configuration hash MD5:
       C8 4E 4E 5D D3 5C D8 9E 9F 52 82 E0 59 8A DE 15
       data hash MD5: 64K
       6A A8 24 CD 17 44 C2 2E 27 B7 3A 90 D2 4D FB 6E>)
(   2,<2013-07-31 18:33:38.301 -0700>,<Administrator>,<X>,<proc1d>,<TOPSPIN 2.1>,
      <Start of raw data processing
       efp LB = 0 FT_mod = 6 PKNL = 1 PHC0 = 0 PHC1 = 0 SI = 32K 
       data hash MD5: 32K
       4D 23 26 0B 31 14 C3 6E C0 05 D2 15 C2 4E A2 26>)
(   3,<2013-07-31 18:33:38.598 -0700>,<Administrator>,<X>,<proc1d>,<TOPSPIN 2.1>,
      <pk PHC0 = 100.0195 PHC1 = 0 
       data hash MD5: 32K
       D6 7C 91 9C 8E 3C 9F EB C6 9E 3F 83 50 79 9E 74>)
(   4,<2013-07-31 18:33:38.707 -0700>,<Administrator>,<X>,<proc1d>,<TOPSPIN 2.1>,
      <abs ABSG = 1 
       data hash MD5: 32K
       C3 1D 83 0F 71 B4 5A 56 52 B1 28 C3 F0 D2 41 A9>)
(   5,<2013-07-31 18:33:38.786 -0700>,<Administrator>,<X>,<proc1d>,<TOPSPIN 2.1>,
      <abs ABSG = 2 
       data hash MD5: 32K
       CB CD 1F B0 8C BE 35 71 5F B6 D2 B7 D8 C8 D8 A8>)
(   6,<2013-07-31 18:33:38.848 -0700>,<Administrator>,<X>,<proc1d>,<TOPSPIN 2.1>,
      <abs ABSG = 3 
       data hash MD5: 32K
       74 E9 A5 1E 0B 3E 99 56 9D 85 31 AB C2 6B 7C 2E>)
(   7,<2013-07-31 18:33:38.926 -0700>,<Administrator>,<X>,<proc1d>,<TOPSPIN 2.1>,
      <abs ABSG = 4 
       data hash MD5: 32K
       89 AD AA 5B 8F 73 45 FB FA 56 5E 57 02 1E D7 66>)
(   8,<2013-07-31 18:33:38.973 -0700>,<Administrator>,<X>,<proc1d>,<TOPSPIN 2.1>,
      <abs ABSG = 5 
       data hash MD5: 32K
       E9 6D A0 C9 E4 49 8B 9F E1 3C 0A 2F D7 FE 9F A9>)
$$ ##END=
$$ 
$$ $$ hash MD5
$$ $$ 49 64 17 2F 41 AA D0 34 32 F6 80 AD 79 0D E2 10
##$RELAX= 
##$RELAX= 
##$RELAX= 
##$RELAX= 
##$RELAX= 
##$RELAX= 
##$RELAX= 
$$ Bruker specific parameters
$$ --------------------------
##$DU= <E:\>
##$EXPNO= 10
$$ [...]
150 150 150 150 150 150 150 150
##$TP07= 0
##$TPNAME0= <>
##$TPNAME1= <>
##$TPNAME2= <>
##$TPNAME3= <>
##$TPNAME4= <>
##$TPNAME5= <>
##$TPNAME6= <>
##$TPNAME7= <>
##$TPOAL= (0..7)
0.5 0.5 0.5 0.5 0.5 0.5 0.5 0.5
##$TPOFFS= (0..7)
0 0 0 0 0 0 0 0
##$TUNHIN= 0
##$TUNHOUT= 0
##$TUNXOUT= 0
##$USERA1= <user>
##$USERA2= <user>
##$USERA3= <user>
##$USERA4= <user>
##$USERA5= <user>
##$V9= 5
##$VALIST= <valist>
##$VCLIST= <CCCCCCCCCCCCCCC>
##$VD= 0
##$VDLIST= <DDDDDDDDDDDDDDD>
##$VPLIST= <PPPPPPPPPPPPPPP>
##$VTLIST= <TTTTTTTTTTTTTTT>
##$WBST= 2048
##$WBSW= 25
##$XGAIN= (0..3)
0 0 0 0
##$XL= 0
##$YL= 0
##$YMAX_a= 649949
##$YMIN_a= -554967
##$ZGOPTNS= <>
##$ZL1= 120
##$ZL2= 120
##$ZL3= 120
##$ZL4= 120
##$ABSF1= 14.98509
##$ABSF2= -5.573092
##$ABSG= 5
##$ABSL= 3
##$ALPHA= 0
##$AQORDER= 0
##$ASSFAC= 0
##$ASSFACI= 0
##$ASSFACX= 0
##$ASSWID= 0
##$AUNMP= <proc_prof1d_extract_pilot.lims>
##$AXLEFT= 0
##$AXNAME= <>
##$AXNUC= <1H>
##$AXRIGHT= 0
##$AXTYPE= 0
##$AXUNIT= <>
##$AZFE= 0.1
##$AZFW= 0.1
##$BCFW= 0
##$BC_mod= 0
##$BYTORDP= 0
##$COROFFS= 0
##$CY= 15
##$DATMOD= 1
##$DC= 0
##$DFILT= <>
##$DTYPP= 0
##$F1P= 0
##$F2P= 0
##$FCOR= 0.5
##$FTSIZE= 32768
##$FT_mod= 6
##$GAMMA= 0
##$GB= 0
##$INTBC= 1
##$INTSCL= 1
##$ISEN= 128
##$LB= 0
##$LEV0= 0
##$LPBIN= 0
##$MAXI= 10000
##$MC2= 0
##$MEAN= 0
##$ME_mod= 0
##$MI= 0
##$NCOEF= 0
##$NC_proc= -8
##$NLEV= 6
##$NOISF1= 0
##$NOISF2= 0
##$NSP= 0
##$NTH_PI= 0
##$NZP= 0
##$OFFSET= 14.98509
##$PC= 1
##$PHC0= 100.0195
##$PHC1= 0
##$PH_mod= 1
##$PKNL= yes
##$PPARMOD= 0
##$PPDIAG= 0
##$PPIPTYP= 0
##$PPMPNUM= 2147483647
##$PPRESOL= 1
##$PSCAL= 4
##$PSIGN= 0
##$PYNMP= <proc.py>
##$REVERSE= no
##$SF= 400.02
##$SI= 32768
##$SIGF1= 0
##$SIGF2= 0
##$SINO= 400
##$SIOLD= 32768
##$SPECTYP= <>
##$SREGLST= <1H.CDCl3>
##$SSB= 0
##$STSI= 32768
##$STSR= 0
##$SW_p= 8223.68421052631
##$SYMM= 0
##$S_DEV= 0
##$TDeff= 65536
##$TDoff= 0
##$TI= <>
##$TILT= no
##$TM1= 0
##$TM2= 0
##$TOPLEV= 0
##$USERP1= <user>
##$USERP2= <user>
##$USERP3= <user>
##$USERP4= <user>
##$USERP5= <user>
##$WDW= 1
##$XDIM= 32768
##$YMAX_p= 451990061
##$YMIN_p= -806481
##$CURPLOT= <Network HP LaserJet P1505>
##$CURPRIN= <$Network HP LaserJet P1505>
##$DFORMAT= <normdp>
##$LAYOUT= <+/1D_H.xwp>
##$LFORMAT= <normlp>
##$PFORMAT= <normpl>
##$SURQMSG= 1
$$ End of Bruker specific parameters
$$ ---------------------------------
##NTUPLES= NMR SPECTRUM
##VAR_NAME=  FREQUENCY,     SPECTRUM/REAL,   SPECTRUM/IMAG
##SYMBOL=    X,             R,               I
##VAR_TYPE=  INDEPENDENT,   DEPENDENT,       DEPENDENT
##VAR_FORM=  AFFN,          ASDF,            ASDF
##VAR_DIM=   32768,         32768,           32768
##UNITS=     HZ,            ARBITRARY UNITS, ARBITRARY UNITS
##FACTOR=    0.250966925370066, 1,           1
##FIRST=     8223.43324360094, 44412,        -134020
##LAST=      0,             74825,           -157896
##MIN=       0,             -806481,         0
##MAX=       8223.43324360094, 451990061,    0
$$ Real data points
##PAGE= N=1
##DATA TABLE= (X++(R..R)), XYDATA
$$ [...]
$$ plain form
19574 -341802 31650 -80805 -84249 47378 21431 -54994 -128908 287102 -188856 -203536 257504
19562 108080 -312790 -145675 288794 -202642 -29752 -224915 -195110 -20409 23694 -179547
19551 -14419 -371851 51442 120135 -192516 -241313 29654 56593 -155240 -537349 -201877 131174
19539 137059 -142142 -99402 -225216 -29340 -47820 -1897 -26093 93770 -147452 -275154 194113
19527 -99241 449778 -141194 78965 -156129 376441 238188 -305093 -428591 50037 106627
19517 106627 -224251 8125 55799 -144597 21188 -87210 104917 208312 -61964 -288287 -130620
19505 -51760 137473 -61721 -105299 -24072 107810 -73769 -112067 210374 31199 -351958 -275755
19494 -275755 -20182 -175017 -175701 87814 -119004 -153523 -146258 -125186 -271238 -224047 -77697
$$ packed form
19574c41802C1650h0805l444D7378B1431e4994p3914B87102a88856j4680B57504
19562A08080c12790a45675B88794b02642b9752j95163K9805b0409B3694a79547
19551a4419l57432E1442O8693a92516m8797B9654K6939a55240l82109b01877A31174
19539A37059a42142M2740j25814b9340j8480a897k4196I3770a47452j27702A94113
19527i9241D49778a41194G8965a56129C76441j38253c05093j23498E0037N6590
19517A06627b24251H125M7674a44597B1188h7210A04917J03395f1964k26323a30620
19505e1760A37473f1721m3578b4072A07810g3769l8298B10374C1199c51958P6203
19494b75755b0182j54835o84H7814a19004l4519P265K1072j46052M7191g7697
$$ plain form
19482 -414370 53019 -336261 103606 39852 -40670 84610 85536 -22510 -47107 36421 -294213
19470 -52315 -271741 -443090 -31164 -100639 -166242 -280702 -14812 -203748 -231855 -135984 -30664
19458 -51206 243575 -54230 163123 -144880 59359 -200607 3300 -183296 -132978 163370 31435
19446 -383396 -34783 -228053 -54920 104282 -229917 -235481 78898 135312 203610 -150860 -96535
19435 -96535 -187581 -153575 -151925 72958 72994 2446 58470 130491 56910 22076 71487 178059
19423 178059 -39515 -257367 -235365 94711 -150214 -71667 -390704 25974 -77627 272182 94086
19411 26908 4930 -154611 50424 92530 -231489 -9032 23640 175054 -68195 -79546 125176
19399 26290 181209 -71426 133849 111736 -216666 205275 299056 -68627 -56130 -165160 59168
$$ packed form
19482d14370E3019c36261A03606C9852d0670H4610R26b2510k4597C6421b94213
19470e2315k19426j71349c1164o9475o5603j14460a4812j88936k8107R5871c0664
19458e1206B43575e4230A63123a44880E9359b00607C300a83296N0318A63370C1435
19446c83396c4783j93270e4920A04282b29917n564G8898N6414O8298a50860N4325
19435i6535r1046L4006J650G2958L6B446N6024P2021E6910B2076M9411J06572
19423A78059c9515k17852K2002I4711a50214g1667l19037B5974g7627B72182I4086
19411B6908D930a54611E0424M2106b31489i032B3640J51414f8195j1351A25176
19399B6290J54919g1426A33849k2113b16666B05275R3781f8627J2497j09030E9168
$$ plain form
19387 5028 13992 110924 67362 53888 -243590 -223761 -120531 43944 -490630 -236577 149995
19375 -180454 10541 -229564 -257954 -195476 190922 -70196 -75587 -58235 154038 22374 -56646
19363 218591 -292500 -246650 117289 -121144 -7773 -202028 -105483 -94623 -153996 115335 -116796
19351 -5862 18423 -127563 28436 -276807 -92534 -298835 -172058 -72381 345920 -122226 -137083
19340 -137083 109647 -96087 135090 -54266 63239 115523 69165 12892 76721 -143627 -180832
19329 -180832 7888 -20619 -217528 -86371 -51484 -320033 -505065 175799 -27260 13298 -404942
19317 106469 95779 39859 -95307 236196 331836 -123298 -153738 -433168 -114498 -226864
19307 -226864 -423805 60595 -188709 -162765 -173337 -198446 -85270 -362401 -5028 -286623 33380
$$ packed form
19387E028Q964R6932m3562j3474b43590J9829J03230D3944d90630b36577A49995
19375a80454A0541b29564k8390O2478A90922g0196n391J7352A54038B2374e6646
19363B18591b92500M5850A17289a21144g773j94255R6545J0860n9373A15335a16796
19351e862A8423a27563B8436b76807i2534k06301J26777g2381C45920a22226j4857
19340a37083A09647i6087A35090e4266F3239N2284m6358A2892O3829a43627l7205
19329a80832G888b0619j96909h6371L4887k68549j85032A75799b7260A3298d04942
19317A06469j0690C9859i5307B36196R5640a23298l0440k79430a14498j12366
19307b26864j96941F0595a88709K5944j0572k5109h5270k77131e028k81595C3380
$$ plain form
19295 303639 203433 -192777 231426 -407408 -241852 197736 201924 -363837 -293108 -245971
19285 -245971 -253876 149499 -70302 124563 -140843 -338209 112169 182024 -44082 -204260
19275 -204260 -67052 -232073 -172280 -47022 145409 -174540 101301 -193013 -112625 126852
19264 -66193 -129587 265108 111301 -103349 -142105 126929 -104242 -341173 -165827 -85341
19254 -85341 105183 35263 -35513 -140604 177175 167604 194831 44233 -24279 -102735 34547
19242 40335 208583 137612 -207335 91515 139196 -201910 227937 29982 -205829 -174725 -270276
19231 -270276 -73083 -22158 97989 -144516 219898 265995 215627 135464 -125446 -175487 -149464
19220 -149464 76355 -154363 40631 151262 -237794 -58433 -120261 182712 5182 -352086 -83851
$$ packed form
19295C03639j00206a92777B31426d07408J65556A97736M188c63837P0729M7137
19285b45971p905A49499g0302A24563a40843j97366A12169O9855d4082j60178
19275b04260f7052j65021N9793d7022A45409a74540A01301a93013Q0388A26852
19264f6193o3394B65108A11301a03349l8756A26929a04242k36931a65827Q0486
19254h5341A05183C5263c5513j05091A77175r571K7227D4233b4279p8456C4547
19242D0335J68248p0971b07335I1515M7681b01910B27937B9982b05829L1104r5551
19231b70276g3083b2158I7989a44516B19898M6097n0368q0163a25446n0041K6023
19220a49464G6355a54363D0631J10631b37794e8433o1828A82712E182c52086h3851
$$ plain form
19208 -221468 -214058 -220058 -7834 -105520 -138135 -205508 -159394 317934 -226781 266209 -394003
19196 97648 348946 -398158 -181079 -23162 119217 -67597 269438 -28338 26183 -108388
19185 230685 7754 92979 30882 143838 147853 -2145 91020 -40777 -80688 -51152 -225348 -93930
19172 72171 -103752 66487 -14280 168083 -186460 59666 -217817 -252938 46374 377455 -178306
19160 -30850 38799 242380 -140916 111416 182825 152069 29684 30846 -141465 -174792 -34058
19148 -230299 8661 -356035 -215929 -9160 189616 255472 -128457 315616 -252073 24752 18530
19137 18530 -85780 -50219 155163 -127540 -108065 -98393 -31854 98326 -275232 368125 -29773
19125 -27197 64182 -163358 -133453 -186802 21963 -186277 383412 71865 -90816 -347683 121106
$$ packed form
19208b21468P410o000g834r7686l2615o7373M6114C17934b26781B66209c94003
19196I7648K51298c98158a81079b3162A19217f7597B69438b8338B6183a08388
19185B30685G754Q5225C0882J12956M015b145I1020d0777l9911K9536j74196i3930
19172G2171a03752F6487a4280A68083a86460E9666b17817l5121D6374L31081a78306
19160c0850C8799K03581a40916A11416P1409l0756B9684J162a41465l3327c4058
19148b30299H661c56035J40106i160A89616O5856a28457C15616b52073B4752o222
19137A8530h5780L5561A55163a27540J9475R672c1854I8326b75232C68125b9773
19125b7197F4182a63358K9905n3349B1963a86277C83412G1865i0816k56867A21106
$$ plain form
19113 -85715 301543 41885 33616 -314057 56229 -134973 -213779 -24915 3072 -30184 -22210 -113672
19101 -113672 -92303 137691 -92820 188249 43541 153457 -236527 89921 27609 -162959
19090 51077 -325671 340801 361422 166947 -355890 32787 -203671 -80400 59551 61411 -94939
19078 21999 89506 272200 -51638 -92559 82426 -275991 -159995 -1018 149189 -101415 197102
19066 -82888 -703899 -407002 81707 -55447 -277272 -122038 12445 -61024 -111256 -271751 -121652
19054 -124032 -118497 -84667 71225 -14099 -231828 73059 -94099 -88351 34169 11757 -45546 -56221
19042 -56221 85151 -167768 -135305 -138446 -206865 -90438 -138507 -222064 47991 165852 196005
19031 196005 -134903 187643 152656 89228 -9735 121190 15878 -150287 300028 -155711
$$ packed form
19113h5715C01543D1885q269c14057E6229a34973p8806b4915C072c0184P974r1462
19101a13672K1369A37691i2820A88249D3541J09916b36527H9921B7609a62959
19090E1077c25671C40801K0621A66947c55890C2787b03671h0400E9551J860i4939
19078B1999O7507J82694e1638m0921H2426b75991J15996a018A49189a01415A97102
19066h2888o21011K96897H1707e5447k21825a22038A2445f1024n0232j60495a21652
19054a24032N535L3830G1225a4099k17729G3059i4099N748C4169A1757d5546j0675
19042e6221H5151a67768L2463l141o8419i0438m8069q3557D7991J17861L0153
19031A96005a34903A87643l4987o3428i735A21190A5878a50287C00028a55711
$$ plain form
19020 -157081 261082 -175567 12345 -261038 121481 9890 131554 -45710 -110485 -275588
19010 -275588 163737 -103683 -163170 171204 235809 -163697 114943 149067 117718 -25416
18999 42541 -4485 -386605 -274240 -52245 135015 -125400 306547 -187802 -153949 -201468 -126020
18988 -126020 -65652 299188 -41565 6397 20733 157728 -28375 -17260 -278584 -475286 150176
18976 -115676 -82000 222 -102375 -195896 -26683 66149 -389319 -11000 -110870 -123769 -119395 -147951
18964 -147951 21804 -172409 -56177 -46599 -13575 -18821 -120759 266245 40724 -79884 11530
18952 12321 69068 -228292 74647 161781 -225915 -107124 -251152 211453 -153280 -546016
18942 -546016 -71509 104360 58903 -30749 41835 52595 -314902 -36939 18359 -47169 -339098
$$ packed form
19020a57081B61082a75567A2345b61038A21481I890J21664d5710o4775j65103
19010b75588A63737a03683n9487A71204O4605a63697A14943L4124l1349b5416
18999D2541d485l82120J12365e2245A35015a25400C06547a87802L3853m7519P5448
18988a26020O0368B99188d1565F397J4336J36995b8375J1115k61324j96702A50176
18976a15676L3676B22a02375r3521b6683F6149c89319a1000r9870j2899M374k8556
18964a47951B1804a72409e6177R578a3575n246j01938B66245D0724g9884A1530
18952A2321N6747b28292G4647Q7134b25915a07124j44028B11453a53280l92736
18942e46016g1509A04360m5457c0749D1835J0760c14902c6939A8359d7169k91929
$$ plain form
18931 -339098 5098 276376 250525 -167211 -102097 -65189 -11181 -62794 -49089 -296322 57027
18919 -182455 -57866 -48439 -46955 -214925 -106776 -109594 400808 -164766 51987 -13255 142827
18907 180898 -34226 35964 -223221 166383 -347341 2023 -67728 108822 57341 13487 58071
18896 58071 190160 75111 -90019 114268 154493 141905 -244462 69467 -108382 110974 -98332
18884 173121 -46292 -32642 191442 310176 -322516 -159359 -315494 13054 61031 18705
18873 -43461 111822 32236 187586 112249 33617 45678 -324436 -88146 -63646 74118 -236473
18861 -252248 49079 74006 -107531 -133995 -40922 81103 -16627 -149519 -34339 363075 236310
18850 236310 118214 -126373 269813 334502 231674 226935 139603 -121660 -406449 99050
$$ packed form
18931c39098E098K71278k5851a67211O5114L6908a1181n1613J3705k47233E7027
18919a82455e7866R427J484j67970a06776k818D00808a64766E1987a3255A42827
18907A80898c4226C5964b23221A66383c47341B023f7728A08822n1481A3487M4584
18896E8071J32089G5111i0019A14268M0225j2588b44462F9467a08382A10974i8332
18884A73121d6292J3650A91442J18734c22516a59359j56135A3054M7977A8705
18873d3461A11822C2236J55350p5337C3617J2061c24436h8146K4500G4118b36473
18861b52248D9079K4927a07531k6464d0922H1103a6627j32892c4339C63075j26765
18850B36310j18096a26373B69813O4689j02828m739q7332a21660k84789I9050
$$ plain form
18839 -299635 205321 -91093 -155156 -63307 265322 180129 -281065 46595 -268012 -63448 -271425
18828 -271425 -215939 -11759 29403 -47949 179210 -131827 -245441 -333089 57994 10583 393851
18817 393851 231610 -37331 -5685 42663 -436906 94603 111055 30555 48422 24291 -46099
18805 152614 27921 -10328 174174 -209005 88529 -91331 -111293 -130115 -154512 -259863 -53764
18793 59244 84267 -48800 -81727 -47528 -49741 -87080 -160812 -167488 -158554 62803 -48665 -8353
18780 -296339 2670 125215 -331780 169322 -289571 -158097 -72832 -137712 132224 -223202
18769 -248771 149297 -136135 -27390 -221078 -305772 106058 -126307 75360 37399 -60193
18758 47179 143613 -101998 -193421 -15486 236840 -145943 196737 35370 24175 412412 47655
$$ packed form
18839b99635B05321i1093o4063f3307B65322q5193b81065D6595b68012f3448k07977
18828b71425N5486a1759B9403d7949A79210a31827j13614q7648E7994A0583L83268
18817C93851j62241c7331e685D2663d36906I4603J6452C0555J7867k4131d6099
18805A52614B7921a0328A74174b09005H8529i1331j9962j8822k4397j05351e3764
18793E9244K5023d8800l2927L4199k213l7339p3732o676Q934F2803d8665h353
18780b96339B670J22545c31780A69322b89571J31474g2832o4880A32224b23202
18769b48771A49297a36135b7390j93688q4694A06058a26307G5360C7399f0193
18758D7179R6434a01998r1423a5486B36840a45943A96737C5370j1195L88237D7655
$$ plain form
18746 -155341 40318 101409 58198 195338 -8320 -183889 243339 201509 -180906 -87781 -22604
18734 -84899 195632 -382624 -31409 9663 -80535 53188 51358 -59626 307855 228113 119410
18723 119410 -460638 33950 -212429 121730 -108194 11666 -289456 -21165 -65709 -128789
18713 -128789 -71443 -237640 -313069 94551 -103828 145559 -71296 -194759 -71034 -146363 -130627
18702 -130627 -272104 95204 -68778 -133352 43568 -178211 -145622 -63990 -287994 -32813 83438
18690 -165948 -10882 -185028 -12813 -91353 -5764 30598 -314154 -14101 -253581 -71910 214039
18678 52555 -254119 75997 -88734 5131 -73969 -175039 -180213 83656 -228731 -153772 192277
18666 -89031 -23897 123495 -49003 32018 -216192 -120919 61624 32226 -233201 93997 -270125
$$ packed form
18746a55341D0318O1091m3211J37140h320j75569B43339m1830a80906h7781b2604
18734h4899A95632c82624c1409I663h0535E3188j830e9626C07855p9742j08703
18723A19410d60638C3950b12429A21730a08194A1666b89456b1165m4544o3080
18713a28789N7346j66197p5429I4551a03828A45559g1296j23463g1034p5329J5736
18702a30627j41477I5204f8778o4574D3568a78211L2589f3990k24004c2813H3438
18690a65948a0882j74146a2813p8540e764C0598c14154a4101k39480g1910B14039
18678E2555b54119G5997h8734E131g3969j01070n174H3656b28731P4959A92277
18666h9031b3897A23495d9003C2018b16192R5273F1624k9398b33201I3997b70125
$$ plain form
18654 57175 -194961 -73350 -242924 -119620 -218804 538 -106717 39738 -242016 -215049 -124428
18643 -124428 -110310 159259 39714 123282 38717 -102443 302221 -299027 10368 -173339
18632 99160 -150915 -222054 -106476 -41409 146445 -82874 -108574 135327 -255687 -707 105956
18620 -71229 -153115 240577 -106943 -335375 31931 199190 -56116 -105845 112617 -66758 26355
18608 -79435 -174608 -41472 89563 -72794 -202181 -78791 -162126 -239058 -333598 -61783 -89610
18597 -89610 9057 -435983 103477 -141880 -316058 140963 -252430 -180308 -318413 -138156
18586 -142589 310356 -84720 289980 -128662 129597 -20396 -224269 89775 -46144 194012
18575 -78711 -37240 -54822 337902 -406842 82070 -7044 25642 -190384 6095 188704 -160032
$$ packed form
18654E7175a94961g3350j69574a19620r9184E38a06717C9738b42016K6967R0621
18643a24428J4118A59259C9714Q3568C8717a02443C02221b99027A0368a73339
18632I9160a50915p1139a06476d1409A46445h2874k5700A35327b55687g07A05956
18620g1229q1886B40577a06943k28432C1931J67259e6116m9729A12617f6758B6355
18608g9435r5173d1472H9563g2794j29387g8791q3335p6932r4540f1783k7827
18597h9610I057d35983A03477a41880j74178A40963b52430P2122j38105a38156
18586a42589C10356h4720B89980a28662A29597b0396k03873H9775d6144A94012
18575g8711c7240j7582C37902d06842H2070g044B5642a90384F095J82609a60032
$$ plain form
18563 -165077 -90528 -59922 -241715 167591 238830 -85096 -78681 -103987 -182392 -120636 -27098
18551 6142 112993 -11858 -218141 -194079 -249753 -29471 -200932 -74232 -287714 -29851 -14212
18539 -229649 -31517 972 -85840 14081 37870 26763 -405289 -111339 -62608 -437974 188002
18527 -342657 -75298 -396499 54719 -118458 -222862 -452329 -113812 -9526 4909 -225065 42593
18515 -205769 177958 -119388 -155788 -61802 -29409 -45455 171655 -29818 -206773 14833 205140
18504 205140 -108774 -262443 -421485 24594 28786 216669 153400 -69097 180959 -484446
18493 35054 44752 138029 -141050 -396932 -223297 244648 -116467 -110921 134869 -55954 -189758
18482 -189758 -148391 -44797 119756 -197971 16854 -97987 -122721 -87540 184745 -30217 -56696
$$ packed form
18563a65077P4549L0606j81793A67591P1239h5096O415k5306p8405O1756b7098
18551F142J06851a1858k06283K4062n5674b9471j71461g4232k13482b9851a4212
18539b29649c1517I72h5840A4081K3789j1107d05289a11339M8731l75366A88002
18527c42657g5298l21201E4719a18458j04404k29467a13812i526D909b25065D2593
18515b05769A77958a19388l6400f1802b9409j6046A71655b9818j76955A4833J90307
18504B05140a08774j53669j59042B4594M192J87883o3269f9097A80959d84446
18493C5054R698R3277a41050k55882J73635B44648a16467N546A34869e5954j33804
18482a89758M1367d4797A19756a97971A6854i7987k4734L5181A84745c0217k6479
$$ plain form
18471 -56696 98240 -123854 -198722 -149550 -156550 232231 -177926 64518 -8358 123162 34730
18459 76845 353894 -416105 -28292 -277387 31820 11410 -205460 -6963 -72886 -101054 83158
18447 -17258 269044 -152795 -272137 -17642 -45547 51873 -148328 -275214 -90157 183548
18436 -357646 -95296 -358979 -31048 -84509 137988 68280 -16665 -38328 -122999 -292302 -191943
18425 -191943 -147432 -219898 -8859 -78680 114518 49725 52899 91401 -205941 -3766 145909
18413 -206281 -142820 -130869 -128985 -185493 36217 15106 -252661 114477 -131965 172961 -45072
18401 589617 -80529 40124 184496 133167 21309 -51374 47710 -218167 -142722 -17220 149722
18389 162452 -155795 155062 -172236 -149647 25761 150314 50248 120428 54891 174245
$$ packed form
18471e6696I8240a23854p4868M9172p000B32231a77926F4518h358A23162C4730
18459G6845K77049d16105b8292k49095C1820A1410b05460f963o5923k8168H3158
18447a7258B69044a52795j19342a7642k7905E1873a48328j26886i0157A83548
18436c57646i5296k63683c1048n3461A37988F8280a6665k1663q4671j69303J00359
18425a91943M4511p2466h859o9821A14518D9725L174L8502b05941c766A45909
18413b06281O3461J1951J884n6508C6217A5106b52661A14477a31965A72961d5072
18401E89617h0529D0124J44372n1329B1309e1374D7710b18167P5445a7220A49722
18389A62452a55795A55062a72236K2589B5761J24553E0248P0180E4891J19354
$$ plain form
18379 174245 382 174351 -48220 186999 -121303 -53654 170209 -61171 -233757 52437 -193675
18367 -157111 358384 180900 279504 51504 -33925 216580 105463 -194319 59642 -185225
18356 190238 -277630 -27119 166831 -236277 -94447 265917 171829 81285 10115 -18573 -166112
18345 -166112 -134195 -9062 233207 -125218 132406 281980 390614 138715 -27856 -172134
18335 -172134 -162411 -61198 -300944 177941 -148962 72199 -64598 -319314 -38717 47889 169138
18324 169138 -112055 178557 -108691 275035 68513 -24212 135038 193028 100636 197128
18314 197128 126412 89882 -107237 11788 50532 -238610 -267346 163886 205065 -260364 -140337
18303 -140337 192252 -262777 -138594 -121082 -269316 85184 -381962 -244202 144804 -120015
$$ packed form
18379A74245C82J73969d8220A86999a21303e3654A70209f1171j72586E2437a93675
18367a57111C58384j77484R8604E1504c3925B16580A05463a94319E9642a85225
18356A90238b77630b7119A66831b36277i4447B65917r4088H1285A0115a8573j47539
18345a66112L1917i062B33207a25218A32406J49574J08634A38715b7856j44278
18335a72134R723f1198k39746A77941a48962G2199f4598k54716c8717D7889J21249
18324A69138a12055A78557a08691B75035F8513b4212A35038N7990r2392R6492
18314A97128p0716l6530a07237A1788L8744b38610k8736A63886M1179b60364J20027
18303a40337A92252b62777J24183J7512j48234H5184c81962J37760A44804a20015
$$ plain form
18292 403750 4649 -308874 -95777 -67660 -200592 198050 154936 243661 31544 -106834 344397
18280 -20678 66066 73673 -395462 -167100 -254823 -81215 184273 -161999 -105257 -191432 167886
18268 65440 -19633 -222970 43913 93613 87502 -10017 -73000 263718 144359 -41194 -196351
18257 -196351 92763 87154 14453 -74955 -69480 -212739 266976 -168452 124698 -472960 -30888
18245 -134242 87583 -187946 -1626 -241778 38823 -69709 -94922 35710 62406 245566 -153287
18233 -226382 -332169 295708 43384 -310530 32503 17687 67649 -179844 -195307 -189082 55020
18221 17878 -360815 -336762 140764 67219 54193 -165127 -174917 326298 -252060 113410 -289604
18209 186740 -177235 -65364 356646 -117332 -235431 -191667 177797 -103036 -276737 254417
$$ packed form
18292D03750D649c08874i5777K8117j32932A98050m3114Q8725C1544a06834C44397
18280b0678F6066P607c95462a67100q7723h1215A84273a61999N6742q6175A67886
18268F5440a9633k03337D3913M9700o111a0017o2983B63718j19359d1194j55157
18257a96351I2763n609A4453g4955N475j43259B66976a68452A24698d72960c0888
18245a34242H7583a87946a626k40152C8823f9709k5213C5710K6696J83160a53287
18233b26382j05787B95708D3384c10530C2503j4816M9962a79844j5463O225E5020
18221A7878c60815K4053A40764F7219j3026a65127r790C26298b52060A13410b89604
18209A86740a77235f5364C56646a17332j18099M3764A77797a03036j73701B54417
$$ plain form
18198 134904 -311314 -223131 -225637 -152791 52626 201105 -32708 -222755 -256765 -50844 -150189
18187 -150189 -225618 -65870 -338557 287625 -240953 -57378 38050 -89294 -100263 53667 -92043
18175 154968 -145114 -97252 105381 -313648 251747 -252131 27711 -132486 146977 -157875
18164 -137705 -345576 7673 -96386 -161439 -157604 -107710 -123547 -20893 224961 -249095 -123551
18152 -103098 -34999 49275 -230412 179663 78636 -22613 -330018 166994 -154191 152485
18141 34961 29983 223756 -97058 161085 -211635 -3481 -480723 -345410 -140198 301733 -44348
18129 144984 -183216 -286763 68059 107492 -54793 -97413 -362826 108019 -285881 -159994
18119 -159994 -280029 -212786 4181 141637 44525 -61578 -259537 46983 40756 90777 33258
$$ packed form
18198A34904c11314Q8183k506P2846E2626J48479c2708j90047l4010e0844r9345
18187a50189p5429f5870k72687B87625b40953e7378C8050h9294j0969E3667i2043
18175A54968a45114M7862A05381c13648B51747b52131B7711a32486A46977a57875
18164a37705k07871G673i6386o5053L835M9894j5837b0893B24961b49095a23551
18152a03098c4999D9275b30412A79663G8636b2613l07405A66994a54191A52485
18141C4961m978J93773i7058A61085b11635c481m77242J35313a40198C01733d4348
18129A44984a83216j03547F8059L9433e4793m2620k65413A08019b85881J25887
18119a59994j20035O7243D181J37456D4525f1578j97959D6983o227N0021C3258
$$ plain form
18107 11157 -303230 121250 -202050 -214082 27395 186493 19691 -25824 99563 -133116 -42218
18095 -29710 389122 -117413 -234931 99201 127099 300655 104380 439202 283220 178360
18085 178360 315713 434983 181911 -227773 -80008 111674 1025 164894 281889 121337
18074 265254 -77750 -245322 -312886 -173092 -30146 304353 23208 -91072 -152423 -106788 -722
18062 -428797 282125 -126494 -291273 4455 -100388 51786 -442718 -156008 -29147 46083
18051 3449 -72159 -98724 -91909 -379784 -8790 85096 -142224 218172 -106786 -90166 22679
18039 291398 -37860 -261774 127949 -313465 292148 -247275 75513 81479 61864 -48866 86145
18027 -203609 -108958 230393 -123192 272948 45452 106575 -33630 156585 -375462 75837
$$ packed form
18107A1157c03230A21250b02050j2032B7395J59098A9691b5824I9563a33116d2218
18095b9710C89122a17413j17518I9201K7898J73556A04380L34822j55982j04860
18085A78360J37353J19270A81911b27773h0008A11674A025J63869J16995A21337
18074B65254g7750j67572o7564J39794c0146C04353B3208i1072o1351M5635g22
18062d28797B82125a26494j64779D455a00388E1786d42718a56008b9147D6083
18051C449g2159k6565O815k87875h790H5096a42224B18172a06786J6620B2679
18039B91398c7860k23914A27949c13465B92148b47275G5513N966j9615d8866H6145
18027b03609R4651B30393a23192B72948D5452O1123c3630A56585c75462G5837
$$ plain form
18016 -344082 95400 -39931 -384456 182978 139539 79375 -12174 -46281 223017 -151702 -75883
18005 -75883 176357 102594 294502 42247 -199383 -64322 -45811 -117874 -339333 -87204 242370
17993 36101 -284375 -51327 227913 -148695 23255 -129183 -28379 168040 -218271 -139661
17983 -139661 13950 16410 -500439 233993 -224851 -298041 7753 6526 292768 234171 290524
17972 290524 -87110 -167683 -110933 190435 -63660 -55275 127439 -367718 -355227 -102454 116450
17960 81122 -129669 355583 -64978 -50489 -138211 265085 52680 -128979 29243 234162 -83885
17948 37405 35989 19782 233317 -289833 83901 -245676 161314 -88963 -287076 -320354 -130675
17936 -139640 349426 6415 38464 194798 151288 -373012 -48523 -223371 70031 -214103 83905
$$ packed form
18016c44082I5400c9931l44525A82978m3439o0164a2174l4107B23017a51702P5819
18005g5883A76357p3763J91908D2247a99383f4322J8511p2063k21459h7204B42370
17993C6101b84375e1327B27913a48695B3255a29183b8379A68040b18271P8610
17983a39661A3950K460e00439B33993b24851p3190G753j227K86242n8597N6353
17972B90524h7110q0573N6750A90435f3660Q385A27439c67718J2491a02454A16450
17960H1122a29669C55583f4978J4489q7722B65085E2680a28979B9243K04919h3885
17948C7405j416j6207K13535b89833H3901b45676A61314h8963j98113l3278a30675
17936a39640C49426F415L2049J56334m3510c73012d8523j74848G0031b14103H3905
$$ plain form
17924 127870 -65147 500962 332089 172040 42723 26278 21388 181278 -125556 108383
17913 476560 78178 -5159 -231240 65786 -19868 -304656 -149231 -95378 181185 302558 -170820
17901 -268628 -166911 -136404 101835 120010 -120874 -427125 38926 -513189 -76509 9666 -80111
17889 -45880 29578 61176 -128545 29552 -49778 -175080 -121124 135822 -151571 49234 -173802
17877 120807 -254812 1794 104905 98648 11104 90240 47547 -65833 6944 -75463 -171599 112180
17864 217274 35990 81218 -124861 9868 360575 60974 21326 -296932 -116694 -110268 235035
17852 266042 351854 -324235 120141 -493910 -15662 342846 142688 32997 2199 -282065
17841 64683 28113 137291 888 -274913 100353 134018 64481 134225 -99897 -164515 78252
$$ packed form
17924A27870f5147E00962j68873j60049D2723j6445m890J59890a25556A08383
17913D76560G8178e159k26081F5786a9868k84788a49231N3853A81185J21373a70820
17901b68628J01717L0507A01835J8175a20874l06251C8926e13189g6509I666h0111
17889d5880B9578L1598a28545B9552d9778j25302N3956A35822a51571D9234a73802
17877A20807b54812A794J03111o257A1104P9136m2693f5833F944g5463r6136A12180
17864B17274C5990M5228a24861I868L50707F0974B1326b96932a16694O426B35035
17852B66042Q5812c24235A20141d93910a5662C42846A42688C2997B199b82065
17841F4683B8113J09178H88b74913A00353L3665F4481O9744i9897o4618G8252
$$ plain form
17829 -35647 -66774 10116 -74517 467124 171157 -214860 -131622 -135755 151129 -27072 -313070
17818 -313070 104882 -36162 38993 -70293 52963 13818 204912 41354 198087 316607 -521484
17806 -3478 13880 -241992 67261 128526 -341181 146825 243943 265939 84594 -236607 101804
17794 490364 221686 -260909 -91298 117939 -67054 115835 48004 3600 149675 -28465 212258
17782 -116689 -8811 -188588 -63783 -16059 135354 217500 -131405 -97445 -244891 -140641 -188744
17771 -188744 -346038 -19242 199216 114950 9509 -46824 -133241 -195773 256866 156784 285155
17760 285155 -45029 -511402 41306 59459 -175494 -110636 -66538 224443 93183 -157345 -61844
17748 172705 -266538 33409 -90889 66208 95682 -56444 26587 78693 74666 -82880 284308
$$ packed form
17829c5647l1127A0116g4517D67124A71157b14860Q3238m133A51129b7072k85998
17818c13070A04882c6162C8993g0293E2963A3818J91094D1354J56733J18520e21484
17806c478A3880b41992F7261O1265c41181A46825R7118K1996H4594b36607A01804
17794D90364B21686b60909i1298A17939f7054A15835D8004C600J46075b8465B12258
17782a16689h811j79777f3783a6059A35354Q2146a31405L3960j47446J04250m8103
17771a88744j57294a9242A99216q4266I509d6824q6417o2532B56866j00082J28371
17760B85155d5029m66373D1306J8153a75494O4858M4098B24443I3183a57345f1844
17748A72705b66538C3409i0889F6208K9474e6444B6587N2106m027h2880B84308
$$ plain form
17736 136299 -44232 -100342 -136601 -102344 140918 -154577 -50493 50693 -14229 -71272 285562
17724 -10646 -62680 -39495 -185816 -1818 87193 -122603 -463822 -49369 -94224 4231 91613
17713 91613 62109 13926 -247784 -10773 185239 -112954 -183953 365393 -29040 393000 -29262
17701 -254808 53271 -101765 83628 -115337 -126419 91053 146018 5042 9673 224162 4315
17689 145470 26495 307267 -234182 197490 -301676 82130 8560 -258599 -31110 153658
17678 102087 -66870 -61092 28461 53692 -59791 -10686 58529 -77023 145054 -52676 433119
17666 82600 209039 142766 286350 402280 82380 140941 200356 220529 -186538 265928 -37692
17654 -59914 118008 -365021 -25623 41543 -293177 97234 219403 -159568 -387156 -160627
$$ packed form
17736A36299d4232n6110l6259L4257A40918a54577e0493E0693a4229n7043B85562
17724a0646n2034K3185j46321a818H7193a22603l41219d9369m4855D231Q7382
17713I1613k9504A3926b47784a0773A85239a12954p0999C65393b9040C93000b9262
17701b54808E3271a01765H3628a15337j1082I1053N4965E042M631K14489D315
17689A45470B6495K80772b34182A97490c01676H2130H560b58599c1110A53658
17678A02087f6870N778B8461K5231e9791a0686E8529g7023A45054e2676D33119
17666H2600J26439o6273J43584J15930H2380N8561N9415K0173a86538B65928c7692
17654e9914A18008c65021b5623D1543b93177I7234J22169a59568k27588a60627
$$ plain form
17643 238008 -134316 -92831 -201387 -61745 -83215 1926 184663 198756 23065 105546 162438
17632 162438 2154 -196744 190389 -7411 187955 -77713 11235 -210610 93077 -111535 -316629
17621 -316629 -131548 270736 -95456 12602 3873 -79895 -43651 -125077 22820 405923 -40820
17609 -91783 -21833 -43878 -97877 -156652 -12983 59401 146568 81293 69375 -353181 -5931 175825
17596 46193 131019 137341 -45694 91165 40155 124079 76625 -71048 651 71902 85098 -46497
17583 -206892 36239 -301727 21537 -38247 143897 304345 82672 230204 -24620 126048
17572 531537 135024 -85695 -135154 49288 -159489 -173405 45886 -266843 -27575 -74463 223804
17560 197516 16717 178202 371638 -108838 140559 223826 96450 395667 -161131 225632
$$ packed form
17643B38008a34316M1485j08556f1745k1470A926J82737J4093B3065Q2481N6892
17632A62438B154a96744A90389g411A87955g7713A1235b10610I3077a11535k05094
17621c16629a31548B70736i5456A2602C873g9895L6244q1426B2820L83103d0820
17609i1783b1833k2045n3999n8775a2983E9401Q7167o5275j1918c53181e931A75825
17596D6193Q4826O322d5694I1165D0155Q3924m7454g1048F51P1251J3196d6497
17583b06892C6239c01727B1537c8247A43897J60448H2672J47532b4620A26048
17572E31537A35024h5695m9459D9288a59489j3916D5886b66843b7575m6888B23804
17560A97516A6717J61485J93436a08838A40559Q3267I6450K99217a61131B25632
$$ plain form
17549 -85161 157196 216863 -172715 -242848 -80771 202772 -138414 264369 143326 75695
17539 75695 17129 -49778 -24957 -38152 220512 -8120 -95101 277516 -30655 -198775 84166
17527 -13133 257273 50854 24204 174855 144103 -57408 15864 95975 -47136 322218 -173662
17515 121824 286122 -93953 33892 209564 225048 132894 -204103 98263 10592 -111800 158386
17503 -17206 -172117 92725 -122297 41792 -87079 80163 -139997 16931 209141 268126 -126100
17491 -52227 204360 -105991 -67374 507971 203849 160782 -57191 307643 71784 256635
17481 256635 247183 -30927 314192 114174 8864 185290 143113 257003 145861 96991 -35627
17469 -129653 -81529 297079 -24360 173762 269470 -117845 223651 257549 13568 27883 18059
$$ packed form
17549h5161A57196N9667a72715p0133h0771B02772a38414B64369j21043o7631
17539G5695A7129d9778K4821j3195B20512h120q6981B77516c0655j68120H4166
17527a3133B57273E0854B4204J50651l0752e7408A5864Q0111d7136C22218a73662
17515A21824J64298i3953C3892J75672J5484r2154b04103I8263A0592a11800A58386
17503a7206j54911I2725a22297D1792h7079H0163a39997A6931J92210N8985a26100
17491e2227B04360a05991L8617E07971B03849m3067e7191C07643G1784J84851
17481B56635r452c0927C14192A14174H864J76426m2177J13890j11142m8870c5627
17469a29653M8124B97079b4360A73762R5708a17845B23651L3898A3568J4315r824
$$ plain form
17458 18059 -38063 38661 61337 40261 265022 136040 553526 198010 354425 289678 121050
17446 -19553 330734 337240 242269 -164308 473076 34002 333738 436293 118544 173648 260737
17435 260737 327659 187645 322508 409375 159668 290986 68383 501040 169862 291859
17425 291859 276826 136639 379450 552814 404148 207640 273165 414975 195048 430830
17415 430830 599442 428140 114437 -121765 158981 539239 163412 562290 -188052 74722
17404 288224 415046 130095 66126 21712 243960 218521 225862 243518 91379 178741 316810
17393 316810 210952 77246 -91105 131884 -104227 53952 -86367 -89664 -19618 66248 -31285
17381 104897 555411 -177447 20284 -34614 28716 120018 382068 247536 155651 219660 191189
$$ packed form
17458A8059c8063C8661K2676k1076K24761j28982M17486A98010J56415o4747A21050
17446a9553C30734O506r4971a64308D73076C4002K99736J02555A18544N5104Q7089
17435B60737O6922j40014J34863Q6867A59668J31318F8383M32657A69862J21997
17425B91859j5033A36639K42811J73364j48666j96508O5525J41810A95048K35782
17415D30830J68612j71302A14437a21765A58981L80258A63412L98878a88052G4722
17404B88224J26822A30095o3969B1712K22248k5439P341J7656I1379Q7362J38069
17393C16810j05858G7246i1105A31884a04227E3952h6367l297a9618F6248c1285
17381A04897M50514a77447B0284c4614B8716R1302K62050j34532r1885O4009k8471
$$ plain form
17370 191189 -303904 58672 -198574 19378 200338 149251 84685 226476 99998 -21146 172658
17358 378812 132742 537832 -131900 110600 18941 -208837 382307 -66714 2703 159674
17348 159674 -105320 213291 274446 319116 -182380 10305 153879 111989 32744 119496 183379
17337 183379 21553 344553 -1914 149026 58685 206135 134384 87775 14089 156456 316308
17326 316308 98415 219561 -1321 11448 -58038 -30717 98688 -32356 -204137 -57533 354340
17314 -81028 301164 -311151 205518 478249 142621 482695 -204902 48786 -57237 53948
17303 111473 334049 265287 193421 59066 334904 217146 10328 21633 -138412 -53004 366129
17291 65784 -34555 211442 140935 -67951 321804 217737 232405 91510 267191 637589 78624
$$ packed form
17370A91189c03904E8672a98574A9378J80960n1087o4566J41791I9998b1146A72658
17358C78812A32742M05090a31900A10600A8941b08837C82307f6714B703J56971
17348A59674a05320B13291O1155M4670a82380A0305J43574m1890C2744Q6752O3883
17337A83379B1553L23000a914A49026E8685J47450p1751m6609A4089J42367J59852
17326C16308I8415J21146a321A1448e8038K7321I8688c2356j71781e7533C54340
17314h1028C01164c11151B05518K72731A42621L40074b04902D8786e7237E3948
17303A11473K22576o8762p1866E9066K75838j17758A0328J1305a38412e3004C66129
17291F5784c4555B11442p0507f7951C21804j04067J4668I1510J75681L70398G8624
$$ plain form
17279 360693 131405 288644 156964 278573 269535 95686 -21497 132983 307347 292472
17269 292472 61517 378453 142248 264388 268779 -53269 43305 250212 273784 58823 56436
17258 56436 100138 306809 288862 193179 465821 -130605 217348 173144 -882 -66797 112518
17246 427620 -14237 65507 286148 546871 99380 65913 353145 83089 289148 -20768 398060
17234 256566 234485 -16135 15957 237995 153909 217530 347691 112980 108220 200535 306933
17223 306933 523720 339516 151542 110195 -1888 456083 -217331 216254 -69627 411635
17212 271639 175343 259624 117073 18313 151649 437523 -86490 474577 218988 411291
17202 411291 613919 234539 323136 347328 319648 210582 43086 151612 338067 53709
$$ packed form
17279C60693A31405J57239j31680J21609r038I5686b1497A32983J74364j4875
17269B92472F1517L16936A42248J22140M391e3269D3305K06907K3572E8823k387
17258E6436M3702K06671j7947r5683K72642a30605B17348m4204h82o5915A12518
17246D27620a4237F5507K20641K60723I9380l3467K87232H3089K06059b0768C98060
17234B56566k2081a6135A5957K22038q4086O3621J30161A12980m760R2315J06398
17223C06933K16787j84204A51542m1347a888D56083b17331B16254f9627D11635
17212B71639r6296Q4281A17073A8313J33336K85874h6490D74577B18988J92303
17202D11291K02628B34539Q8597K4192k7680j09066D3086J08526J86455E3709
$$ plain form
17191 400300 457933 455933 545263 234104 200605 -39103 60319 174722 375934 263881 265716
17180 265716 265480 385507 170501 619041 152338 364288 304631 244749 -5420 613854 245451
17168 199231 353985 220985 234813 585841 76336 424784 401276 361013 211601 99451
17157 180128 315081 308540 23108 295790 390071 631874 382660 190373 443644 298931
17147 298931 387916 343115 374103 375860 259843 481692 438130 440921 861892 345815 -99487
17135 368394 219542 330403 433122 238204 27853 129068 95486 403924 546431 26964
17124 180927 125326 901569 331705 308771 203595 335790 355996 229785 405996 122795
17113 330342 176055 453213 418063 468643 333821 361461 160906 593167 358175 368205
$$ packed form
17191D00300N7633k000Q9330B34104l3499c9103F0319J14403K01212j12053J835
17180B65716k36J20027A70501M48540A52338K11950n9657n9882e420F13854B45451
17168A99231J54754j33000J3828L51028G6336L48448k3508m0263j49412I9451
17157A80128J34953o541B3108K72682R4281K41803k49214A90373K53271j44713
17147B98931Q8985m4801L0988J757j16017K21849m3562K791M20971C45815i9487
17135C68394j48852J10861J02719j94918B7853J01215l3582L08438J42507B6964
17124A80927n5601P76243C31705k2934j05176J32195K0206j26211J76211A22795
17113C30342j54287K77158l5150N0580j34822K7640A60906M32261k34992J0030
$$ plain form
17103 368205 227053 206652 395885 261025 402398 347402 385573 441388 243095 289628
17093 289628 483993 285587 270304 194157 525065 354288 569910 345972 337029 666366
17083 666366 398014 385481 238509 785393 482867 253579 315513 576800 394099 321452
17073 321452 687839 568683 481087 630417 656599 573078 199420 420867 710744 465594
17063 465594 517937 162064 486620 521297 707883 478143 476908 474861 739027 712020 635034
17052 635034 353988 407370 481771 583658 475071 649283 188217 574026 407064 384905
17042 384905 388990 891142 600064 668777 638570 421341 420172 677974 514162 805066 749906
17031 749906 636358 430832 622089 551242 709128 398631 726623 775741 649112 566175
$$ packed form
17103C68205j41152k0401J89233j34860J41373n4996L8171N5815j98293M6533
17093B89628J94365j98406j5283p6147L30908j70777K15622k23938q943L29337
17083F66366k68352j2533j46972N46884l02526k29288O1934K61287j82701p2647
17073C21452L66387j19156q7596J49330K6182q3521A99420K21447K89877k45150
17063D65594N2343A62064L24556L4677J86586k29740j235k047K64166k7007p6986
17052F35034k81046N3382P4401J01887j08587J74212A88217L85809j66962k2159
17042C84905M085N02152k91078O8713l0207k17229j169K57802j63812K90904n5160
17031G49906j13548k05526J91257p0847J57886l10497L27992M9118j26629q2937
$$ plain form
17021 566175 232422 655854 615422 624329 316045 492535 428971 898728 682343 859684
17011 859684 778721 585397 510590 490717 961184 719579 773537 624624 607290 654309 615641
17000 615641 809824 638767 648381 924102 1031553 641220 849198 826616 743365 818066
16990 818066 719665 893408 876141 858860 694008 534403 703425 1103237 719956 936862
16980 936862 819441 873959 1156867 711414 980702 876329 717664 719705 702416 989346
16970 989346 1071521 1277070 570979 596295 789217 547841 972944 936789 985626 1013692
16960 1013692 714436 1180476 1040711 1029581 1008356 895222 983468 1088077 1144398 924946
16950 924946 961377 718681 1238089 1229658 929437 1209498 899475 959471 1082637 1400491
$$ packed form
17021E66175B32422M23432m0432Q907l08284J76490o3564M69757k16385J77341
17011H59684q0963j93324p4807j9873M70467k41605N3958j48913j7334M7019l8668
17000F15641J94183j71057R614K75721J07451l90333K07978k2582q3251P4701
16990H18066r8401J73743j7267j7281j64852j59605J69022L99812l83281K16906
16980I36862j17421N4518K82908m45453K69288j04373j58665K041j7289K86930
16970I89346Q2175K05549E70979K5316J92922k41376M25103l6155M8837K8066
16960A013692k99256M66040j39765j1130k1225j13134Q8246J04609N6321k19452
16950I24946L6431k42696N19408q431l00221K80061l10023N9996J23166L17854
$$ plain form
16940 1400491 1257478 1157116 1196920 1087017 1309083 1168099 1409778 1035713 1418656 1185514
16930 1185514 1269716 747455 1428604 1488312 1064197 1320126 1278631 1440572 1205923 1329391
16920 1329391 1363981 1754191 1435726 1290654 1536441 1405132 1595551 1400883 1640985 1701344
16910 1701344 1791254 1541084 1642326 1360106 1860353 1439129 1657802 1725970 1625418 2003591
16900 2003591 1450637 1935446 1870843 2027145 1743112 1798875 1505186 2097302 1945806 2174343
16890 2174343 2014809 2000528 1791110 1891964 1675796 2319535 2118409 2029262 2173375 2173126
16880 2173126 2059641 2270096 2172428 2342225 2251932 2297378 2304642 2392920 2347517 2303392 2290807
16869 2290807 2616020 2806550 2532628 2529659 2561750 2696678 2809548 2767141 2817099 3177512
$$ packed form
16940A400491j43013j00362L9804j09903K22066j40984K41679l74065L82943k33142
16930A185514Q4202n22261O81149N9708m24115K55929m1495J61941k34649J23468
16920A329391L4590L90210l18465j45072K45787j31309J90419j94668K40102O0359
16910A701344Q9910k50170J01242k82220N00247m21224K18673O8168j00552L78173
16900B003591n52954M84809o4603J56302k84033N5763k93689N92116j51496K28537
16890B174343j59534j4281k09418J00854k16168O43739k01126q9147J44113k49
16880B173126j13485K10455r7668J69797r0293M5446P264Q8278m5403m4125j2585
16869B290807L25213J90530k73922k969L2091J34928J12870m2407M9958L60413
$$ plain form
16859 3177512 2962834 2769519 2884072 2915391 3160772 2902115 3327559 3463967 3105306 3023345
16849 3023345 3115748 3223806 3251741 3370205 3474532 3631945 3335189 3664538 3666229 3519440
16839 3519440 3790748 4041321 3723573 3804933 4288522 4008355 3795972 4322039 4107884 4455388
16829 4455388 4376458 4456143 4663505 4748210 5224857 4842965 5201151 5305565 5001505 5423994
16819 5423994 5340897 5389502 5593234 5996049 5752146 6035976 5883846 6368924 6264432 6368736
16809 6368736 6338461 6906730 6848845 6928571 6805708 7509005 7241147 7607621 7783947 7752569
16799 7752569 7887272 8352676 8491666 8656419 9058358 9038432 9342687 9148110 10039735 10278777
16789 10278777 10262369 10510757 10929132 10856830 11612506 12009241 12220744 12542503 12892983 13357663
$$ packed form
16859C177512k14678j93315J14553L1319K45381k58657M25444J36408l58661q1961
16849C023345R2403J08058K7935J18464J04327J57413k96756L29349J691j46789
16839C519440K71308K50573l17748Q1360M83589k80167k12383N26067k14155L47504
16829D455388p8930P9685K07362Q4705M76647l81892L58186J04414l04060M22489
16819E423994q3097M8605K03732M02815k43903K83830j52130M85078j04492J04304
16809F368736l0275N68269n7885P9726j22863P03297k67858L66474J76326l1378
16799G752569J34703M65404J38990J64753M01939j9926L04255j94577Q91625K39042
16789A0278777j6408K48388M18375p2302P55676L96735K11503L21759L50480M64680
$$ plain form
16779 13357663 13481295 14089695 14404374 15151886 15500754 16042819 16259865 16886614 17409681
16770 17409681 18135810 19135349 19677037 20705409 21356398 22223422 22299332 23571817 24425514
16761 24425514 25563716 26918950 27889555 29030448 30368210 31422149 33055384 34602136
16753 34602136 36396393 38062626 39567789 42148962 44180512 46311020 48847149 51317514
16745 51317514 54599198 57389897 60434537 64113861 67654984 71918631 76194980 81117773
16737 81117773 85571648 91029872 96824037 102894327 109412562 115905541 123238977 130468431
16729 130468431 138237647 146151465 154186783 161883039 169524566 176865037 183541004 189188718
16721 189188718 194458560 198073364 200195971 201163179 200455128 198480546 195175766 190569390
$$ packed form
16779A3357663J23632O08400L14679P47512L48868N42065K17046O26749N23067
16770A7409681P26129R99539N41688J028372O50989Q67024P5910J272485Q53697
16761B4425514J138202J355234R70605J140893J337762J053939J633235J546752
16753C4602136J794257J666233J505163K581173K031550K130508K536129K470365
16745E1317514L281684K790699L044640L679324L541123M263647M276349M922793
16737H1117773M453875N458224N794165O070290O518235O492979P333436P229454
16729A30468431P769216P913818Q035318P696256P641527P340471O675967N647714
16721A89188718N269842L614804K122607R67208p08051j974582l304780m606376
$$ plain form
16713 190569390 184902720 178255942 171083489 163429657 155320123 147009121 139112661 131061172
16705 131061172 123210106 115908547 108651585 102145710 95780597 90132477 84297342 79050713
16697 79050713 74738868 70017758 65904047 61994497 58722479 55508981 52192525 49202313
16689 49202313 46616109 44700217 42075904 39843866 38076080 36189950 34492732 32874876
16681 32874876 31176415 29978648 28398320 27339092 26155033 24891708 24118320 22961599
16673 22961599 22340409 21294302 20143335 19773453 19158300 18092244 17248486 16876809 16159369
16664 16159369 15702832 14847264 14898732 14024354 13438506 13390831 12671339 12345569 12048452 11456304
16654 11456304 11650252 10687040 10330579 10335851 10042002 9573910 9347067 9195511 8634286 8762443
$$ packed form
16713A90569390n666670o646778p172453p653832q109534q311002p896460q051489
16705A31061172p851066p301559p256962o505875o365113n648120n835135n246629
16697G9050713m311845m721110m113711l909550l272018l213498l316456k990212
16689D9202313k586204j915892k624313k232038j767786j886130j697218j617856
16681C2874876j698461j197767j580328j059228j184059j263325p73388j156721
16673B2961599o21190j046107j150967l69882o15153j066056q43758l71677p17440
16664A6159369m56537q55568N1468q74378n85848m7675p19492l25770k97117n92148
16654A1456304J93948r63212l56461N272k93849m68092k26843j51556n61225J28157
$$ plain form
16644 8762443 8454313 8254218 8232210 8192342 7461707 7402004 6936210 6847670 6894476 6811495
16634 6811495 6416332 6345785 5902211 5767491 5914777 5678948 5258688 5690088 5147954 5126919
16624 5126919 5298125 4959001 5090133 4635469 4527435 4365805 4417138 4381300 4399365 4044295
16614 4044295 4119067 3817231 3941114 3818691 4017466 3682265 3710057 3905007 3362494 3417284
16604 3417284 3502866 3284207 3054451 3262746 3135410 2960484 3491282 2757109 2983876 2843896
16594 2843896 2914540 2742065 2742346 2827666 2610881 2577417 2676916 2674880 2470267 2572020 2147354
16583 2147354 2249762 2352384 2365711 2062138 2001639 2161882 2102767 1930240 2029170 2147185
16573 2147185 2080785 2132693 2116894 2149987 1779353 1955488 1954391 2052772 1859635 1544720 1692074
$$ packed form
16644H762443l08130k00095k2008l9868p30635n9703m65794q8540M6806q2981
16634F811495l95163p0547m43574j34720J47286k35829m20260M31400n42134k1035
16624E126919J71206l39124J31132m54664j08034j61630N1333l5838J8065l55070
16614D044295P4772l01836J23883j22423J98775l35201K7792J94950n42513N4790
16604C417284Q5582k18659k29756K08295j27336j74926N30798p34173K26767j39980
16594B843896P0644j72475K81Q5320k16785l3464R9499k036k04613J01753m24666
16583B147354J02408J02622J3327l03573o0499J60243n9115j72527R8930J18015
16573B147185o6400N1908j5799L3093l70634J76135j097R8381j93137l14915J47354
$$ plain form
16562 1692074 1761500 1725246 1671833 1480533 1605222 1963451 1784204 1704614 1552932 1416231
16552 1416231 1834566 1327242 1580223 1447469 1357046 1370657 1162171 1232241 1635699 1289557
16542 1289557 1122366 1581129 1240893 1173668 1243490 1510317 1100325 1352867 1032306 1439878
16532 1439878 1195830 1383793 967800 1146534 1254615 1171790 1394084 890451 1263589 1229954
16522 1229954 1084868 1084082 1087307 890106 970139 1008740 750418 761235 894321 797742 1112193
16511 1112193 1319052 1087411 880203 344607 920874 790238 737130 784562 711716 1032655
16501 1032655 557063 621230 780500 824687 1057005 819657 752582 797876 432555 913683
16491 913683 601099 818008 706023 574355 760322 1099363 333346 510704 663404 639011
$$ packed form
16562A692074O9426l6254n3413j91300J24689L58229j79247p9590j51682j36701
16552A416231M18335n07324K52981j32754r0423J3611k08486P0070M03458l46142
16542A289557j67191M58763l40236o7225O9822K66827m09992K52542l20561M07572
16532A439878k44048J87963m15993J78734J08081q2825K22294n03633L73138l3635
16522A229954j45086p86L225j97201Q0033L8601k58322J0817J33086r6579L14451
16511A112193K06859k31641k07208C44607N76267j30636n3108M7432p2846L20939
16501A032655m75592O4167J59270M4187K32318k37348o7075M5294l65321M81128
16491I13683l12584K16909j11985j31668J85967L39041C33346J77358J52700k4393
$$ plain form
16481 639011 513022 378393 1059387 952868 574091 578299 477594 424467 380967 634612
16471 634612 488126 407155 733255 748447 610017 518592 699450 511318 390158 632533
16461 632533 741740 331791 79865 72169 587843 222502 453024 365806 547080 473852
16451 473852 458337 605885 608421 334373 584610 208285 442080 469475 479216 270792 435133
16440 435133 259145 225540 431513 166132 369109 632421 331811 341167 153986 342517
16430 342517 280574 247567 390748 543477 403593 786035 273154 7270 752105 107408
16419 495584 614780 122762 207327 210913 254217 194772 155171 379901 42144 279517 366144
16408 366144 293157 213727 511467 150307 307729 748064 231861 220291 429178 148925
$$ packed form
16481F39011j25989j34629O80994j06519l78777M208j00705n3127m3500K53645
16471F34612j46486q0971L26100J5192j38430r1425J80858j88132j21160K42375
16461F32533J09207C31791G9865p696N15674B22502K30522q7218J81274p3228
16451D73852j5515J47548K536k74048K50237B08285K33795K7395R741k08424J64341
16440D35133j75988l3605K05973A66132K02977K63312l00610R356A53986J88531
16430C42517o1943l3007J43181J52729j39884L82442B73154G270P44835A07408
16419D95584J19196A22762Q4565L586M3304n9445l9601K24730D2144K37373Q6627
16408C66144p2987p9430K97740A50307J57422M40335B31861j1570K08887A48925
$$ plain form
16397 213833 341252 395726 356261 465045 425557 397319 446182 25176 -55722 146337 252866
16386 252866 260404 456606 225861 319460 131572 455123 327472 68778 228933 126141
16376 126141 203282 291224 453581 219526 477825 432761 14997 306648 -24119 458256
16365 132703 -24284 287817 472521 513959 -150249 171401 221856 157982 -45042 222009
16354 -133619 159206 326073 34066 296344 325040 335486 -9167 261995 460659 317997
16344 317997 179314 -80942 200028 285693 273636 131751 485410 580004 39166 -103218
16333 -73179 206028 258539 221552 136038 101739 286539 299089 -107976 15217 137847 41649
16321 -108218 94557 5419 52557 312131 211902 122474 301805 240556 66563 -37501 -302811
$$ packed form
16397B13833J27419N4474l9465J08784l9488k8238M8863B5176e5722A46337J06529
16386B52866P538J96202B25861R3599A31572L23551j27651F8778J60155j02792
16376A26141P7141Q7942J62357B19526K58299m5064A4997K91651b4119D58256
16365A32703b4284B87817J84704M1438a50249A71401N0455o3874d5042B22009
16354a33619A59206J66867C4066K62278K8696J0446i167B61995J98664j42662
16344C17997j38683h0942B00028Q5665j2057A31751L53659R4594C9166a03218
16333g3179B06028N2511l6987q5514l4299J84800J2550a07976A5217J22630D1649
16321a08218I4557E419M7138K59574j00229q9428J79331o1249F6563c7501k65310
$$ plain form
16310 -302811 -115057 343430 38512 -172501 283423 -20512 77903 430253 -465601 71968
16299 487857 183828 307729 95037 60656 -70585 330821 362969 109512 -41444 265309
16288 322250 290423 72664 175483 -47678 172569 261079 316021 155067 -4478 -107540 168831
16276 43974 216750 72009 169282 -15651 148285 111257 -158406 38870 -68594 142841 -83649
16264 -2618 -13567 69226 76484 -115082 -15561 182441 134517 -4073 -46454 321399 222308 11689
16251 -55025 209 25066 129610 91678 171446 87099 200481 -136397 -99544 -61026 -72018
16240 -72018 207163 229988 -146959 -181719 40266 -3308 -187990 293433 -147898 -289413 96020
16228 34397 247138 259562 85859 -74800 30313 93058 -237890 119262 76668 244680 331417
$$ packed form
16310c02811a15057C43430C8512a72501B83423b0512G7903L52350d65601G1968
16299D87857A83828J23901I5037l4381g0585C30821L2148A09512d1444B65309
16288C22250l1827G2664J02819d7678A72569Q8510N4942A55067d478j03062A68831
16276D3974J72776G2009R7273a5651A48285l7028a58406C8870f8594A42841h3649
16264b618j0949F9226P258a15082a5561A82441m7924d073m2381C21399r9091A1689
16251e5025B09K4857J04544l7932P9768q4347J13382a36397L6853L8518j0992
16240g2018B07163K2825a46959l4760D0266c308j84682B93433a47898j41515I6020
16228C4397K12741J2424H5859g4800C0313O2745b37890A19262m2594J68012Q6737
$$ plain form
16217 331417 -69462 -6824 205281 207167 455774 -130825 -70850 -83694 140074 100682 52267
16206 52267 -8828 171582 126656 -310445 -47954 180198 48373 -21398 232070 242630 -181208
16194 -50655 335033 -199911 330887 -121641 80115 287889 -104251 202220 -127139 405601
16183 -92798 -69690 -66008 -150723 158050 167257 -101448 22551 133157 174692 -83916 41816
16171 53506 -397891 -407824 78739 -167259 245237 252186 -292716 59999 388655 -150160 81732
16159 -206337 100511 -3507 363283 128698 -159990 201519 -133886 -163921 187498 -52281
16148 -221969 -79290 -49524 329183 329028 -108739 -33743 -19511 -5361 262332 -11258 107903
16136 -177059 126623 70750 88079 352175 14908 -84266 254375 -286052 128298 -196523
$$ packed form
16217C31417f9462f824B05281J886K48607a30825N9975j2844A40074l9392m8415
16206E2267h828A71582m4926c10445d7954A80198D8373b1398B32070J0560a81208
16194e0655C35033a99911C30887a21641H0115K07774a04251B02220a27139D05601
16183i2798K3108L682q4715A58050R207a01448B2551J10606M1535h3916D1816
16171E3506c97891r933G8739a67259B45237O949b92716E9999L28656a50160H1732
16159b06337A00511c507C63283A28698a59990B01519a33886l0035A87498e2281
16148b21969g9290K9766C29183j55a08739c3743J4232e361B62332a1258A07903
16136a77059A26623n5873J7329K64096A4908h4266B54375b86052A28298a96523
$$ plain form
16125 185623 103007 34033 -152586 14281 253181 -50925 -80538 84891 67622 -44819 -165153
16114 -165153 -53457 -148247 368218 41694 249707 -254266 -74291 170925 141039 38300 118472
16103 118472 -168148 5453 173576 -137070 -352553 168909 -98652 251220 -14961 -157177
16093 -157177 -80982 -45224 -192742 197134 155795 -143153 35374 -124399 79918 20682 -291552
16081 -343055 114302 -212381 67168 32767 248604 175022 -67755 -445267 -99409 34647 17404
16070 17404 -196291 -169931 204514 -257508 -121599 49009 -304211 -217047 -109325 156968
16059 -175608 289 -53610 -210386 -6855 -288189 80398 34956 -241600 -108736 711 130644
16048 130644 -41374 67690 121484 -178507 -197053 43094 -15681 -2112 -145311 -611836 -100015
$$ packed form
16125A85623q2616C4033a52586A4281K38900e0925k9613H4891j7269d4819j20334
16114a65153e3457r4790C68218D1694K08013b54266g4291A70925k9886C8300Q0172
16103A18472a68148E453J68123a37070k15483A68909i8652B51220a4961j42216
16093a57177P6195L5758j47518A97134m1339a43153C5374a24399G9918B0682b91552
16081c43055A14302b12381F7168C2767K15837p3582f7755l77512i9409C4647j7243
16070A7404a96291K6360B04514b57508a21599D9009c04211Q7164J07722A56968
16059a75608B89e3610j56776f855k81334H0398C4956b41600a08736G11J29933
16048A30644d1374F7690N3794a78507j8546D3094a5681b112j43199m66525a00015
$$ plain form
16036 211780 -141047 -370271 -259811 125437 -6336 138197 -105625 60571 28199 -147370
16025 101748 177486 -86847 60686 12074 -374474 -95380 -237518 165901 79566 -72101 -121360
16014 -121360 -350120 -82082 289980 -244491 -279099 154921 -249656 61572 -59847 -70553
16004 -70553 166543 -114110 -94179 -222505 226915 218122 -175629 33788 23041 -194090 -229142
15993 -229142 297892 -110855 86261 -45868 208561 96763 215463 61551 -7636 312553 428248
15982 428248 180955 290575 213566 273357 140097 134944 61274 -101959 -238310 -21997 -20741
15971 -20741 -161001 -1451 98299 1868 -224761 192060 7988 -161220 -309167 222367 -40794
15959 86587 -45454 -69955 98794 138057 129366 -216056 194332 -177476 38894 -250306 106381
$$ packed form
16036B11780a41047k29224J10460A25437f336A38197a05625F0571B8199a47370
16025A01748P5738h6847F0686A2074c74474i5380j42138A65901G9566g2101m9259
16014a21360k28760h2082B89980b44491l4608A54921b49656F1572e9847j0706
16004g0553A66543a14110J9931j28326B26915q793a75629C3788j0747a94090l5052
15993b29142B97892a10855H6261d5868B08561I6763J18700F1551g636C12553J15695
15982D28248A80955J09620p7009N9791j33260n153F1274a01959j36351b1997J256
15971b0741j40260a451I8299A868b24761A92060G988a61220j47947B22367d0794
15959H6587d5454k4501I8794L9263q691b16056A94332a77476C8894b50306A06381
$$ plain form
15947 90334 -157736 384886 32237 -153858 -290081 -10715 -48440 138370 -70919 -189953
15937 -189953 275858 177968 16005 -230704 -173373 -197758 87515 -142144 -93441 -62615 -95527
15926 -95527 115391 -85425 -5655 235167 -265950 131511 -162134 -197038 -239323 -59507 -210821
15915 -210821 -167667 -269711 -60336 142225 -319775 -206313 -298086 -88519 -101201 144644
15904 37676 -262014 5703 104058 -122429 7864 128190 -15791 243952 -52385 -191445 -227601
15893 -227601 -130199 16806 -228505 46 180591 111799 -164592 -353809 -260298 -118558 126810
15881 -154137 157054 199196 59848 154060 -15720 9400 333797 -35805 -77880 -124128 128313
15869 129862 -63916 -112643 -58116 -264814 -175375 -315221 -147820 -22445 -70626 -138362 -39016
$$ packed form
15947I0334a57736C84886C2237a53858j36223a0715l7725A38370g0919j19034
15937a89953B75858r7890A6005b30704N7331k4385H7515a42144M8703L0826l2912
15926i5527A15391h5425e655B35167b65950A31511a62134l4904m2285e9507j51314
15915b10821M3154j02044f0336A42225c19775J13462r1773h8519j2682A44644
15904C7676b62014E703R8355a22429G864J20326a5791B43952e2385j39060l6156
15893b27601R7402A6806b28505D6J80545o8792a64592j89217R3511a18558A26810
15881a54137A57054M2142E9848R4212a5720I400L24397c5805m2075m6248A28313
15869A29862f3916m8727N4527k06698Q9439j39846a47820b2445m8181o7736c9016
$$ plain form
15857 274803 90848 -53551 149709 117326 193343 -179793 60552 -182023 366927 120895
15846 -189812 74758 -25141 66392 -278065 -127884 -25389 -139820 43374 -143606 -122712 -37685
15834 -162127 26013 -259186 -203428 -34284 -58944 101026 -200701 -53279 -25269 29172 -128428
15822 -147548 65151 -261604 -120366 -257995 -77943 31014 91636 -62066 -289238 92152 -81314
15810 104457 -81054 -53792 111151 140746 136172 -501037 -183734 24822 -47381 -188465 -382546
15799 -382546 133740 -160603 -211051 -69893 -94586 -107917 -273174 -79237 -5639 322964 4648
15787 223085 -95581 -52393 -139898 151162 2657 202372 78149 -19849 208681 63386 -153372
15775 131712 -247006 110350 67584 62020 300931 -145880 30001 47291 45046 91979 97754
$$ packed form
15857B74803I0848e3551A49709l2383P6017a79793F0552a82023C66927A20895
15846a89812G4758b5141F6392b78065a27884b5389j14431D3374a43606K0894c7685
15834a62127B6013b59186N5758c4284k4660A01026b00701e3279b5269B9172a28428
15822a47548F5151b61604a20366j37629g7943C1014O0622f2066k27172I2152h1314
15810A04457h1054K7262A11151K9595m574e01037a83734B4822d7381j41084j94081
15799c82546A33740a60603n0448f9893k4693j3331j65257g9237e639C22964D648
15787B23085i5581M3188q7505A51162B657J99715G8149a9849B08681F3386a53372
15775A31712b47006A10350m2766n564K38911a45880C0001J7290k245M6933N775
$$ plain form
15764 97754 -182038 -130668 -164191 187821 24635 212379 45666 60528 -66347 -212454 159299
15752 98433 60631 -77215 88215 74018 -31913 52550 240663 529 -169856 -164904 -102115 -120661
15740 -120661 216238 36805 69477 85075 -70067 -125384 8977 95769 -302521 -293766 -319047
15729 -319047 -185209 15908 29055 50007 -80317 138299 151693 -56449 52384 -186652 -80505
15717 -128966 -191148 204649 -110011 -39852 86436 -301671 -194833 73894 -115640 13297
15706 -393704 -179374 -50986 342507 -54555 -48094 414826 -123425 13593 334170 -3438 160422
15694 50505 -127247 153937 91764 269459 193900 212256 242097 -121352 187853 173493 -138244
15682 147152 -35269 -188561 -45962 -264470 -137637 138277 56231 -82970 -164134 -406293
$$ packed form
15764I7754a82038N1370l3523A87821B4635J87744D5666J4862f6347j46107A59299
15752I8433l7802g7215H8215j4197c1913E2550J88113E29a69856M952O2789j8546
15740a20661B16238C6805L2672J5598g0067n5317H977Q6792c02521Q755k5281
15729c19047J33838A5908J3147K0952h0317A38299J3394e6449E2384a86652h0505
15717a28966o2182B04649a10011c9852H6436c01671J06838G3894a15640A3297
15706c93704a79374e0986C42507e4555O461D14826a23425A3593L20577c438A60422
15694E0505a27247A53937o2173J77695p5559J8356K9841a21352A87853j4360a38244
15682A47152c5269j53292d5962k18508J26833A38277E6231h2970q1164k42159
$$ plain form
15672 -406293 -37112 354492 231548 215464 238037 -159148 -132503 13211 -145897 14616 -3642
15660 -23359 44706 -199197 -256612 -227815 -270638 59940 -121383 -202915 -318750 18570 -225355
15648 -150107 163783 -200876 157917 -149430 95869 -9499 368840 241901 -62850 209674
15637 -57681 64637 -279246 313804 26117 117881 37221 -1683 337780 -1400 119363 272196
15626 272196 56622 -5861 -289147 -167500 -117617 -130821 133367 876 300361 76754 -79811
15614 69946 -20378 -5998 -129738 -19054 -140224 175757 25634 -154253 201106 269163 -238031
15602 60559 -126810 123013 -11275 -82517 -65440 -161888 -145024 30800 -217497 55220 21210
15590 -128301 -22169 50127 176199 -86529 -154401 -69946 -356329 -190636 -193316 -22134 62820
$$ packed form
15672d06293c7112C54492j22944j6084K2573a59148K6645A3211a45897A4616c642
15660b3359D4706a99197n7415K8797m2823E9940a21383q1532j15835A8570b25355
15648a50107A63783b00876A57917a49430I5869i499C68840j26939f2850B09674
15637e7681F4637b79246C13804B6117R1764C7221a683C37780a400A19363J52833
15626B72196E6622e861k83286J21647M9883j3204A33367H76K99485G6754g9811
15614F9946b0378e998j23740a9054j21170A75757B5634a54253B01106O8057b38031
15602F0559a26810A23013a1275p1242J7077r6448J6864C0800b17497E5220B1210
15590a28301b2169E0127J26072h6529o7872f9946k86383J65693k680b2134F2820
$$ plain form
15578 -59874 38030 153507 261641 9421 -92622 43190 48103 -310456 96403 -264385 -25699
15566 -93577 138689 -179180 96322 -38163 311394 -96312 -91691 -199698 -38669 207949 189594
15555 189594 -6096 70150 -115498 -61432 238419 137694 -68207 106249 88966 5001 71449
15544 71449 -79146 384827 -217573 -136762 169047 -319179 70792 -51544 -4802 544687 -14325
15532 -11229 481192 146430 -197216 -223715 -107072 -139316 44125 18863 61062 -26166 -225490
15521 -225490 -378507 -136015 192230 23087 -165632 -2578 62810 41599 -134117 102870
15510 95508 -197536 -112932 -355625 -253716 40936 311274 127316 48385 58509 125439 34114
15498 72299 295497 -19433 135514 34256 129608 -156312 -189427 187230 -34768 66065 -57690
$$ packed form
15578e9874C8030J15477J08134I421i2622D3190M913c10456I6403b64385b5699
15566i3577A38689a79180I6322c8163C11394i6312M621j08007c8669B07949j8355
15555A89594f096G0150a15498N4066B38419j00725f8207A06249j7283E001O6448
15544G1449g9146C84827b17573Q0811A69047c19179G0792e1544d802E44687a4325
15532a1229D81192A46430a97216k6499a07072l2244D4125A8863M2199b6166j99324
15521b25490j53017a36015A92230B3087a65632b578F2810k1211a34117A02870
15510I5508a97536Q4604k42693J01909D0936K70338A27316D8385J0124O6930C4114
15498G2299K23198a9433A35514C4256R5352a56312l3115A87230c4768F6065e7690
$$ plain form
15486 -63661 106045 -211957 -193822 81651 -183563 62 198462 -297895 238004 -297458 219337
15474 -87757 25398 -52822 -97651 147314 237650 -53650 8450 306276 -27582 -64840 11419
15462 -101210 98452 56253 48180 -33668 72180 196838 425846 -198650 150868 78166 38979
15450 51611 159491 -271693 -229166 196011 -194718 -48669 97192 -32499 -155535 242306
15439 80999 -205781 70748 -131652 10450 18479 12850 -47548 -228127 51886 5067 -119712
15427 -80776 -62444 -184768 236506 132688 200725 25500 -130991 86543 -201789 -139755 -59129
15415 233327 -170658 147823 109880 -151953 -345370 -40174 11400 75051 -113058 274867
15404 -334722 -259490 -116484 62464 -81262 -124150 -497727 -56299 -18965 -21312 -294878 -242642
$$ packed form
15486f3661A06045b11957J8135H1651a83563F2J98400b97895B38004b97458B19337
15474h7757B5398e2822m4829A47314R0336e3650H450K97826b7582l7258A1419
15462a01210I8452m2199q073c3668G2180J24658K29008a98650A50868p2702C8979
15450E1611J07880b71693M2527A96011a94718d8669I7192c2499j23036B42306
15439H0999b05781G0748a31652A0450Q029n629d7548j80579E1886E067a19712
15427h0776J8332j22324B36506j03818O8037B5500a30991H6543b01789O2034e9129
15415B33327a70658A47823l7943a51953j93417d0174A1400O3651a13058B74867
15404c34722P5232a16484F2464h1262m2888l73577e6299a8965k347k73566N2236
$$ plain form
15393 -242642 -12953 -76559 -21636 -84971 14144 -226143 13925 -242109 -275740 -125351 323047
15381 -202723 -193938 97472 96908 131964 296911 9351 -129716 293586 -197331 -39757 -193583
15370 -193583 213878 102526 -12305 73774 -232453 -27383 48363 14531 65994 -24317 1474
15358 80724 -658 112384 -12034 -215839 -184944 347322 55166 149772 227711 -135185 -53749
15346 -58837 40384 -202303 -86523 47184 57301 -21953 -44652 -4322 78662 24829 293827
15335 293827 104430 114802 -237994 50364 152522 18175 -65472 -182131 -341006 197985
15324 18654 -101373 10291 77247 -112260 111337 110530 -115591 -207352 193375 99199 97369
15313 97369 2521 -68293 -115568 -73493 -131276 2266 171646 55770 -150190 -156079 175363 105747
$$ packed form
15393b42642a2953o3606b1636o3335A4144b26143A3925b42109l3631a25351C23047
15381b02723Q785I7472n64L5056J64947I351a29716B93586a97331c9757j53826
15370a93583B13878A02526a2305G3774b32453b7383D8363A4531N1463b4317A474
15358H0724f58A12384a2034k03805L0895C47322E5166R4606P7939a35185e3749
15346e8837D0384b02303h6523D7184J0117b1953k2699d322G8662B4829K68998
15335B93827A04430J0372b37994E0364J02158A8175f5472j16659j58875A97985
15324A8654a01373A0291O6956a12260A11337q07a15591r1761A93375r4176j830
15313I7369B521f8293m7275M2075n7783B266J69380E5770a50190n889A75363o9616
$$ plain form
15301 105747 50635 -88274 41520 -227272 -53908 -67453 270313 121430 204190 23138 -48874
15289 -14048 5678 -304132 -72831 -75868 252866 156640 1299 159460 -51760 -120396 -94533 -97633
15277 -97633 -10494 106587 88302 239047 163300 -55137 48438 24215 -83027 226321 75223
15265 95650 40781 -105400 90797 -68390 -188431 -68989 96851 -98940 120469 -25476 282578
15253 338904 214733 144696 71051 246677 -113158 673162 1433481 1241883 1478416 1673588
15243 1673588 936973 797660 199077 343537 247127 12030 134812 44909 238531 -109970
15232 249786 136899 179277 -23411 -88363 127153 -221104 -74978 187999 73565 225445
15222 225445 -8552 38003 89774 145196 210419 339511 281571 200468 -152256 238934 350514
$$ packed form
15301A05747E0635h8274D1520b27272e3908j3545B70313A21430Q2760B3138d8874
15289a4048E678c04132g2831l037B52866r6226A299J58161e1760o8636K5863l100
15277i7633a0494A06587j8285J50745p5747e5137D8438B4215h3027B26321G5223
15265I5650D0781a05400I0797f8390j20041f8989I6851i8940A20469b5476B82578
15253C38904j24171p0037G1051J75626a13158F73162P60319j91598K36533J95172
15243A673588p36615j39313A99077J44460r6410A2030J22782D4909J93622a09970
15232B49786j12887M2378b3411o4952A27153b21104g4978A87999G3565J51880
15222B25445h552C8003N1771N5422O5223J29092n7940q1103a52256B38934J11580
$$ plain form
15211 350514 475381 157682 11488 -246485 58558 32965 -113695 95226 -93456 -366340
15201 -366340 -211502 237519 324385 -19015 -233454 -838 -13874 -148578 11812 -21135 42789
15189 -291417 114386 -29313 14157 142136 83197 128742 -122112 327386 7204 89374 -36564
15177 42328 161247 -5219 -61288 111815 79656 269502 140053 231065 -168514 209583 387576
15166 387576 49421 -138390 340604 12365 -208673 267230 -85745 201016 119886 100869
15156 100869 87564 50250 -56488 157817 115837 179510 34460 313728 -107479 49107 -108709
15144 -128411 569309 178799 132677 145059 75981 -11780 161977 149116 30597 494 -124801
15132 211419 262073 32673 243015 45495 30569 123623 144138 217276 -36009 129870 -230116
$$ packed form
15211C50514J24867A57682A1488b46485E8558k5593a13695I5226i3456k72884
15201c66340J54838B37519Q6866a9015k14439h38j3036j34704A1812b1135D2789
15189b91417A14386b9313A4157J27979n8939M5545a22112C27386G204Q2170c6564
15177D2328J18919e219n6069A11815l2159J89846j29449R1012a68514B09583J77993
15166C87576D9421a38390C40604A2365b08673B67230h5745B01016q1130j9017
15156A00869j3305l7314e6488A57817m1980O3673C4460K79268a07479D9107a08709
15144a28411E69309A78799m6122J2382o9078a1780A61977j2861C0597D94a24801
15132B11419N0654C2673K10342D5495j4926R3054K0515P3138c6009A29870b30116
$$ plain form
15120 255404 322957 112708 560174 -141923 287198 110935 -52982 -111454 225792 -188 15841
15108 -173405 61300 -127357 45646 164724 178432 48054 -46852 323250 -129220 5895 -27954
15096 154367 -38000 168990 -207263 34005 -10250 45754 68820 339478 -235888 -138113 385600
15084 -142305 140571 129513 -69752 -67642 406121 195389 -36134 304030 339751 538059 -64706
15072 328501 -81191 435763 -126802 236071 -175876 205662 404350 386302 -195438 481175
15061 293028 -44868 173028 185175 345986 77903 274890 -267549 187837 332100 28243
15050 32846 -68 136551 322840 116717 470122 343370 450967 48016 94226 347519 126475
15038 91730 281078 71122 38619 310515 -97593 -213596 187783 209533 152988 225214 373725
$$ packed form
15120B55404O7553A12708M47466a41923B87198A10935e2982n8472B25792a88A5841
15108a73405F1300a27357D5646J19078J3708D8054d6852C23250a29220E895b7954
15096A54367c8000A68990b07263C4005a0250D5754K3066K70658b35888R7775C85600
15084a42305A40571j1058f9752K110D06121A95389c6134C04030L5721J98308f4706
15072C28501h1191D35763a26802B36071a75876B05662J98688j8048a95438D81175
15061B93028d4868A73028J2147J60811G7903J96987b67549A87837J44263B8243
15050C2846f8A36551J86289A16717L53405j26752J07597D8016M6210K53293A26475
15038I1730J89348G1122l2503K71896i7593j16003A87783K1750n6545P2226J48511
$$ plain form
15027 373725 123157 -88274 149122 416113 319899 222983 162566 203999 274154 230596 -195307
15015 455816 450769 138768 185959 597051 330482 324458 207869 11468 251319 17659 73817
15004 73817 155332 -135866 225854 264822 551550 159512 237339 170301 250021 -115713 449158
14992 439821 260779 -12217 73952 508069 85283 318733 117228 321349 411959 -142876
14981 102541 420715 111463 -6602 327522 213514 54767 86077 244231 551287 374232
14971 374232 328587 288462 8543 266275 336445 178110 -36273 140578 482791 744961 341231
14959 367254 65922 -88160 190971 286748 254392 51297 269487 390188 436416 351439 230248
14948 230248 239980 374300 228111 119040 160830 239714 168934 125432 270456 511671 298405
$$ packed form
15027C73725A23157h8274A49122K66991r6214r6916o0417M1433P0155m3558a95307
15015D55816n047A38768M7191M11092k66569o024j16589A1468K39851A7659N6158
15004G3817Q1515a35866B25854L8968K86728A59512P7827o7038P9720a15713D49158
14992D39821j79042a2217G3952M34117H5283K33450A17228K04121R0610a42876
14981A02541L18174A11463f602C27522j14008E4767L1310J58154L07056j77055
14971C74232m5645m0125H543K57732P0170j58335c6273A40578L42213K62170C41231
14959C67254F5922h8160A90971R5777l2356E1297K18190J20701M6228q4977j21191
14948B30248R732J34320j46189j09071M1790P8884p0780m3502J45024K41215k13266
$$ plain form
14937 298405 84396 300812 493719 319742 557358 414163 435962 475700 380373 431541
14927 431541 364811 268798 133004 352699 589929 338664 508210 88205 713089 107899
14916 396639 403454 528504 358737 364704 140827 132805 275657 428621 251168 357622 436510
14905 436510 164177 294127 327072 119415 397984 173105 368363 284472 470038 -134975
14894 167569 355367 181934 329314 251244 200411 206001 329999 295426 45856 328777 -86772
14882 366036 285252 471598 336644 301442 486695 356466 407458 310715 45170 344868
14872 344868 392087 377130 441451 114957 212266 614819 518987 360384 583625 593221 299309
14861 299309 398419 430837 263829 454492 103648 617077 625499 288558 269759 291106 908815
$$ packed form
14937B98405H4396K16416J92907j73977K37616j43195K1799L9738r5327N1168
14927D31541o6730r6013A33004K19695K37230k51265J69546H8205O24884A07899
14916C96639O815J25050j69767N967A40827q022J42852J52964j77453J06454P8888
14905D36510A64177J29950L2945A19415K78569A73105J95258q3891J85566a34975
14894A67569J87798j73433J47380p8070n0833N590J23998l4573D5856K82921h6772
14882C66036q0784J86346j34954l5202J85253j30229N0992r6743D5170K99698
14872C44868M7219j4957O4321A14957R7309M02553r5832j58603K23241R596k93912
14861B99309R9110L2418j67008J90663A03648N13429Q422B88558j8799K1347O17709
$$ plain form
14850 908815 409894 370772 472501 823621 650332 471058 118370 61014 624365 282864
14839 425354 402872 420580 515111 260395 535276 525741 556201 661766 282630 286432 305413
14828 305413 276011 785336 638933 403708 782931 381037 616920 340274 449256 663110
14818 663110 514244 230580 646603 205872 391236 591022 788720 649717 467039 283182
14808 283182 560649 499502 466007 512432 488862 731363 610325 503209 707718 451857
14798 451857 555613 375886 499550 464835 622967 659956 171323 304307 524854 565081
14788 565081 521802 634013 443784 823309 698268 455244 490620 768734 582027 434116
14778 434116 518909 865240 553928 831676 548642 583818 806445 623198 884892 445068
$$ packed form
14850I08815D09894l9122J01729L51120j73289j79274A18370n7356N63351B82864
14839D25354k2482J7708R4531k54716K74881r535L0460J05565B82630L802J8981
14828C05413k9402N09325j46403k35225L79223C81037K35883k76646J08982K13854
14818F63110j48866B30580M16023B05872J85364J99786J97698j39003j82678j83857
14808B83182K77467o1147l3495M6425k3570K42501j21038j07116K04509k55861
14798D51857J03756j79727J23664l4715J58132L6989A71323J32984K20547M0227
14788E65081m3279J12211j90229L79525j25041k43024L5376K78114j86707j47911
14778D34116Q4793L46331l11312K77748k83034L5176K22627j83247K61694m39824
$$ plain form
14768 445068 592648 407762 736778 496245 506718 410003 593369 606626 748386 954435
14758 954435 503597 376345 481872 480207 484966 894706 832334 554547 566495 588311 773003
14747 773003 681714 465570 312648 559678 1082498 480155 842313 717637 1092024 687701
14737 687701 735135 544099 701827 960203 761198 554806 946022 506483 617663 910688
14727 910688 660467 566410 720839 483984 760409 772440 583707 756672 731687 1036415
14717 1036415 547490 1119104 904298 932081 683855 430020 628029 719647 784761 887215
14707 887215 950822 962944 1127179 716484 536549 1024846 1016438 971179 1134857 1014825
14697 1014825 714265 913930 785319 877724 1145432 935745 842773 964100 1000545 940196
$$ packed form
14768D45068J47580j84886L29016k40533J0473r6715J83366J3257J41760K06049
14758I54435m50838j27252J05527j665M759M09740o2372k77787J1948K1816J84692
14747G73003r1289k16144j52922K47030N22820D80155L62158j24676L74387m04323
14737F87701M7434j91036J57728K58376j99005k06392L91216m39539J11180K93025
14727I10688k50221r4057J54429k36855K76425J2031j88733J72965k4985L04728
14717A036415m88925N71614k14806K7783k48226k53835J98009R1618O5114J02454
14707H87215O3607J2122J64235m10695j79935M88297q408m5259J63678j20032
14697A014825l00560J99665j28611R2405K67708k09687r2972J21327L6445o0349
$$ plain form
14687 940196 1096958 1158365 1019535 1148826 587088 1049152 1084208 1192211 855368 1251662
14677 1251662 1087666 1170120 1022838 754078 1026624 1096666 1192273 1001739 1099829 1250552
14667 1250552 1093202 987435 1080450 1328582 911825 1037521 1292919 1155339 1043293 1103514
14657 1103514 1283464 856848 1156456 1038358 1041528 1170292 1215592 1130514 1177839 1257275
14647 1257275 1057894 1140808 1031304 1307128 1441745 769440 1016639 1280193 1305953 1175992
14637 1175992 1415066 1282961 1193073 1194532 1200515 1551091 1107249 1316187 1112522 1452105
14627 1452105 1124913 830858 1398689 1516339 1531813 1336409 1461682 1430950 1510127 1517843
14617 1517843 1543385 1616115 1434472 1288834 1486607 1273920 1435554 1314863 1674910 1641716
$$ packed form
14687I40196J56762O1407j38830J29291n61738M62064L5056J08003l36843L96294
14677A251662j63996Q2454j47282k68760K72546P0042R5607j90534R8090J50723
14667A250552j57350j05767R3015K48132m16757J25696K55398j37580j12046O0221
14657A103514J79950m26616K99608j18098L170J28764M5300q5078M7325P9436
14647A257275j99381Q2914j09504K75824J34617o72305K47199K63554K5760j29961
14637A175992K39074j32105q9888J459N983L50576m43842K08938k03665L39583
14627A452105l27192k94055N67831J17650J5474j95404J25273l0732P9177P716
14617A517843K5542P2730j81643j45638J97773k12687J61634j20691L60047l3194
$$ plain form
14607 1641716 1482977 1240862 1602919 1315370 1527295 1158461 1495795 1589145 1789709 1525078
14597 1525078 1544840 2116950 1575667 2174872 1526739 1719718 1675701 1361776 1839628 1753980
14587 1753980 1865850 1876561 2133617 1864679 1715494 2136200 1969555 1668120 2201126 2137062
14577 2137062 2177116 2115550 1959635 2146765 1950444 2428172 2262272 2428977 1922804 2247131
14567 2247131 2478548 2232798 2449589 2566854 2631386 2765264 2622381 2520338 2815033 3028488
14557 3028488 2921391 3283669 3518044 3299979 3827801 3968986 4877307 5587022 7069357
14548 7069357 11013363 19355198 38865846 46914636 21457666 11698868 6361622 3063977
14539 2443376 2178194 2084063 2066382 1996470 2206127 1682865 2049788 1976454 2042320 2215378
$$ packed form
14607A641716j58739k42115L62057k87549K11925l68834L37334R3350K00564k64631
14597A525078J9762N72110n41283N99205o48133J92979m4017l13925M77852q5648
14587A753980J11870J0711K57056k68938j49185M20706j66645l01435N33006o4064
14577B137062M0054o1566j55915J87130j96321M77728j65900J66705n06173L24327
14567B247131K31417k45750K16791J17265O4532J33878j42883j02043K94695K13455
14557C028488j07097L62278K34375k18065N27822J41185R08321P09715J482335
14548G069357L944006Q341835J9510648Q048790B1457666r758798n337246C063977
14539B443376k65182r4131j7681o9912K09657n23262L66923p3334O5866J73058
$$ plain form
14529 2215378 2392612 2261618 1785893 2182601 2325200 2176205 2335798 2250641 2211744 2406250
14519 2406250 2766041 2692115 2831439 2764084 2689156 2558290 2642778 3074982 2827812 2633517
14509 2633517 2697775 2941886 2946881 3103420 3147027 2985908 3217638 2913637 3088185 2987122
14499 2987122 3198900 3270874 3245845 3707515 3405402 3312576 2948038 3781828 3382997 3502540
14489 3502540 3470153 3620703 3823688 3886928 3778273 3575113 3777140 3780587 3783137 4151500
14479 4151500 4228157 4091462 4307094 4100346 4345295 4243005 4409984 4152858 4164443 4683157
14469 4683157 4377028 4358050 4222472 4748494 4470273 4597622 4450289 4875519 4524952 4868096
14459 4868096 4622122 5064375 4843861 5001734 5184221 5483910 5263515 5293972 5564090 5021086
$$ packed form
14529B215378J77234j30994m75725L96708J42599j48995J59593q5157l8897J94506
14519B406250L59791p3926J39324o7355p4928j30866Q4488M32204k47170j94295
14509B633517O4258K44111M995J56539M3607j61119K31730l04001J74548j01063
14499B987122K11778P1974k5029M61670l02113r2826l64538Q33790l98831J19543
14489C502540l2387J50550K02985O3240j08655k03160K02027L447K550L68363
14479D151500P6657j36695K15632k06748K44949j02290J66979k57126J1585N18714
14469D683157l06129j8978j35578N26022k78221J27349j47333M25230l50567L43144
14459D868096k45974M42253k20514J57873J82487K99689k20395L0457K70118n43004
$$ plain form
14449 5021086 5536180 5620341 5468301 5684558 6126280 5929279 5732139 5937319 6453261 6366823
14439 6366823 6161133 6431243 6043999 6470332 6436072 6689640 6753685 6733199 6824733 6873607
14429 6873607 7271385 7307544 7056703 7388777 7449710 7586895 7855876 7841762 7766009 8076935
14419 8076935 8061137 8097353 8557783 8364871 8522653 8460901 8613334 9148865 8837659 9387738
14409 9387738 9335576 9153481 9586314 9526974 9709317 9773375 10162821 10403091 10139225 10532503
14399 10532503 10848387 11196329 11105556 11120466 11201351 11603302 11768852 12213231 11991630 12528430
14389 12528430 12764255 12804443 13314399 13349373 13348911 13642419 14014349 14276620 14439207 14572029
14379 14572029 15070571 15529249 15323400 16214041 16122734 16468901 16599671 17178953 17503142
$$ packed form
14449E021086N15094Q4161j52040K16257M41722j97001j97140K05180N15942q6438
14439F366823k05690K70110l87244M26333l4260K53568O4045k0486R1534M8874
14429F873607L97778L6159k50841L32074O0933J37185K68981j4114p5753L10926
14419H076935j5798L6216M60430j92912J57782o1752J52433N35531l11206N50079
14409I387738n2162j82095M32833n9340J82343O4058L89446K40270k63866L93278
14399A0532503L15884L47942r0773J4910Q0885M01951J65550M44379k21601N36800
14389A2528430K35825M0188N09956L4974m62K93508L71930K62271J62587J32822
14379A4572029M98542M58678k05849Q90641r1307L46167J30770N79282L24189
$$ plain form
14370 17503142 17712124 18084831 18453323 18971928 19227468 19665786 20077879 20555837 20817173
14361 20817173 21365059 22090473 22664100 23015611 23395574 23691449 24795592 25095577 25670983
14352 25670983 25999095 26998454 27619564 28011885 29255557 29545189 30114332 31014275 32073309
14343 32073309 33017876 33517414 34188452 35503177 35929790 37131040 38521075 39397786 40134838
14334 40134838 41480034 42925977 43900217 45291017 46758873 48097133 49701796 51099022
14326 51099022 52648450 54762561 56522907 58411972 60040691 62597188 64533503 66882969
14318 66882969 69135634 71847530 74386073 77723119 80425288 83375224 86817973 90110798
14310 90110798 93743399 97891201 102072935 106516961 110749384 115908915 121282665 126361613
$$ packed form
14370A7503142K08982L72707L68492N18605K55540M38318M12093M77958K61336
14361B0817173N47886P25414N73627L51511L79963K95875J104143K99985N75406
14352B5670983L28112R99359O21110L92321J243672K89632N69143Q99943J059034
14343C2073309R44567M99538O71038J314725M26613J201250J390035Q76711P37052
14334D0134838J345196J445943R74240J390800J467856J338260J604663J397226
14326E1099022J549428K114111J760346J889065J628719K556497J936315K349466
14318F6882969K252665K711896K538543L337046K702169K949936L442749L292825
14310I0110798L632601M147802M181734M444026M232423N159531N373750N078948
$$ plain form
14302 126361613 132130852 138312426 144606426 151603413 158587667 166384025 174385826 182999891
14294 182999891 192290064 201597170 211795894 222687459 233326182 245226942 257378587
14287 257378587 270175890 283242176 297109203 311047992 325527131 340024768 354661574
14280 354661574 369190472 382919076 396673732 409704620 421452310 431792854 440732300
14273 440732300 447176902 449978468 450986049 451888529 451990061 449535365 447219108 443086650
14265 443086650 435714510 426211879 415615621 403483566 389800902 375654605 360741998
14258 360741998 345829344 330425784 315764661 300917860 287234803 274109629 261026406
14251 261026406 248304831 236415143 224609874 213398046 203478080 193462057 184114134
$$ packed form
14302A26361613N769239O181574O294000O996987O984254P796358Q001801Q614065
14294A82999891R290173R307106J0198724J0891565J0638723J1900760J2151645
14287B57378587J2797303J3066286J3867027J3938789J4479139J4497637J4636806
14280C54661574J4528898J3728604J3754656J3030888J1747690J0340544Q939446
14273D40732300O444602K801566J007581R02480J01532k454696k316257m132458
14265D43086650p372140r502631j0596258j2132055j3682664j4146297j4912607
14258C60741998j4912654j5403560j4661123j4846801j3683057j3125174j3083223
14251B61026406j2721575j1889688j1805269j1211828r919966j0016023r347923
$$ plain form
14244 184114134 175770131 167798794 159750502 152539638 145272453 138805844 133081684 127286175
14236 127286175 121872757 116614695 111512758 106832188 102775893 99109894 94980327 91286943
14228 91286943 87787971 84308142 81221362 78169382 75152290 72356947 70008903 67820603
14220 67820603 65533378 63189450 61003314 58902702 57159209 55323819 53520479 52589880
14212 52589880 50629091 49060910 47202725 45995736 44599043 44035321 43157811 41132290
14204 41132290 39974015 38575293 37888051 36912094 36181909 35603920 34055455 33258028 32026552
14195 32026552 31581413 30768232 30083308 29043340 28458010 27812587 27007386 26427538 25955004
14186 25955004 25272549 24770738 24428768 23636244 22925699 22380929 21893124 21489061 21150681
$$ packed form
14244A84114134q344003p971337q048292p210864p267185o466609n724160n795509
14236A27286175n413418n258062n101937m680570m056295l665999m129567l693384
14228I1286943l498972l479829l086780l051980l017092k795343k348044k188300
14220F7820603k287225k343928k186136k100612j743493j835390j803340r30599
14212E2589880j960789j568181j858185j206989j396693n63722q77510k025521
14204D1132290j158275j398722o87242r75957p30185n77989j548465p97427j231476
14195C2026552m45139q13181o84924j039968n85330o45423q05201n79848m72534
14186B5955004o82455n01811l41970p92524p10545n44770m87805m04063l38380
$$ plain form
14177 21150681 20888818 20249823 19840922 19466635 19108836 19217851 18618076 18339850 17379219
14168 17379219 17263011 17187718 17142323 16559369 16059661 15992330 15648546 15258956 14870243 14764416
14158 14764416 14831430 14013756 14093097 14001546 13652315 13340560 12673318 12884568 12638564 12539140
14148 12539140 12172806 12083411 11906293 11619297 11548354 11410164 11423998 11066962 10744368 10752272
14138 10752272 10180740 10323852 10226435 9923763 10031410 9592126 9774737 9468517 9353763
14129 9353763 9477538 8804856 8665833 8856161 8382870 8721005 8473934 8388701 8314052 8301924
14119 8301924 7723792 7786326 8180222 7499598 7679511 7976643 7342963 7285659 7284427 6817603
14109 6817603 6769968 6922476 6785079 7023362 6650995 6300375 6570718 6286773 6499167 6489510
$$ packed form
14177B1150681k61863o38995m08901l74287l57799J09015n99775k78226r60631
14168A7379219j16208p5293m5395n82954m99708o7331l43784l89590l88713j05827
14158A4764416O7014q17674P9341r1551l49231l11755o67242K11250k46004r9424
14148A2539140l66334q9395j77118k86996p0943j38190J3834l57036l22594P904
14138A0752272n71532J43112r7417l02672J07647m39284J82611l06220j14754
14129I353763J23775o72682j39023J90328m73291L38135k47071q5233p4649j2128
14119H301924n78132O2534L93896o80624J79913K97132o33680n7304j232m66824
14109F817603m7635J52508j37397K38283l72367l50620K70343k83945K12394r657
$$ plain form
14099 6489510 6149885 6101612 6029412 5850630 6108461 6012844 5548209 5391562 5749468 5783611
14089 5783611 5524690 5400566 5152413 5371672 5121259 5043304 5107779 5008516 5040880 4884753
14079 4884753 4941898 4913351 4808177 4866631 4816471 4507808 4623698 4358797 4680412 4595549
14069 4595549 4740988 4407908 4226124 4373848 4284784 4292570 4445771 4136948 4064295 4383192
14059 4383192 3889394 4470609 4083011 4092542 4130773 3993183 3723287 3933994 3644348 3919483
14049 3919483 3587638 4034539 3551663 3651101 3341852 3489475 3627292 3783976 3570941 3371012
14039 3371012 3368677 3121197 2993226 3467743 3340295 3072250 3060578 3312040 3551832 2863702
14029 2863702 3035455 3158475 3147808 3099386 2802028 2705504 2900522 3082978 2820916 2889176
$$ packed form
14099F489510l39625m8273p2200j78782K57831r5617m64635j56647L57906L4143
14089E783611k58921j24124k48153K19259k50413p7955O4475r9263L2364j56127
14079D884753N7145k8547j05174N8454n0160l08663J15890k64901L21615q4863
14069D595549J45439l33080j81784J47724q9064P786J53201l08823p2653L18897
14059D383192m93798N81215l87598R531L8231j37590k69896K10707k89646K75135
14049C919483l31845M46901m82876R9438l09249J47623J37817J56684k13035j99929
14039C371012k335k47480j27971M74517j27448k68045j1672K51462K39792o88130
14029B863702J71753J23020j0667m8422k97358r6524J95018J82456k62062O8260
$$ plain form
14019 2889176 2942254 2857276 2742094 2455848 2437384 2812689 2342796 2778441 2562348 2459332
14009 2459332 2328455 2254974 2253112 2231858 2660638 2260039 2428470 2259672 2618465 2349603
13999 2349603 2572170 2465986 2243882 2355122 2389036 1859277 2311473 2182911 1984772 2735397
13989 2735397 3234122 5906227 12548566 31343476 49820420 28032398 14137313 8228974
13981 8228974 5911053 4932756 4301758 3933465 3178521 3033748 2758562 2965588 2775561
13972 2775561 2688130 2818549 2850119 2191714 2370021 2428037 2498010 2237356 2376981 2076938
13962 2076938 2375954 2135809 2246215 2505328 2214807 2173552 2047224 2342367 2114535 2060555
13952 2060555 1995355 2021738 1992464 2159557 1976724 1998651 1882068 1855087 1904626 1994366 2056105
$$ packed form
14019B889176N3078q4978j15182k86246j8464L75305m69893M35645k16093j03016
14009B459332j30877p3481j862k1254M28780m00599J68431j68798L58793k68862
13999B349603K22567j06184k22104J11240L3914n29759M52196j28562j98139P50625
13989B735397M98725K672105O642339J8794910J8476944k1788022j3895085n908339
13981H228974k317921r78297o30998l68293p54944j44773k75186K07026j90027
13972B775561q7431J30419L1570o58405J78307N8016O9973k60654J39625l00043
13962B076938K99016k40145J10406K59113k90521m1255j26328K95143k27832n3980
13952B060555o5200K6383k9274J67093j82833K1927j16583k6981M9539Q9740O1739
$$ plain form
13941 2056105 1851140 1968390 1745217 1777395 1788422 1609306 1911534 1809424 2036593 1936776
13931 1936776 2143827 1953641 1650937 1703608 1684568 1790294 1283571 1788234 1830265 1735083
13921 1735083 1582387 1824075 1536550 1710656 1539258 1594358 1388595 1652891 1400823 1706014
13911 1706014 1489173 1658082 1993035 1267796 1687744 1520866 1264064 1730422 1443194
13902 1443194 1567143 1481171 1447776 1446307 1000803 1454165 1550286 1511488 1408836 1282190
13892 1282190 1477252 984535 1139690 1321859 1230304 1826514 1382789 924186 1538156 1132329
13882 1132329 1241835 1561022 1055053 1388565 1360402 1306533 1272575 834015 998279 1321153
13872 1321153 1333209 1238958 1097150 988062 1278569 1269035 1168218 1120048 871865 1111556
$$ packed form
13941B056105k04965J17250k23173L2178J1027j79116L02228j02110K27169r9817
13931A936776K07051j90186l02704N2671j9040J05726n06723N04663M2031r5182
13921A735083j52696K41688k87525J74106j71398N5100k05763K64296k52068L05191
13911A706014k16841J68909L34953p25239M19948j66878k56802M66358k87228
13902A443194J23949q5972l3395j469m45504M53362R6121l8798j02652j26646
13892A282190J95062m92717J55155J82169r1555N96210m43725m58603O13970m05827
13882A132329J09506L19187n05969L33512k8163n3869l3958m38560J64264L22874
13872A321153J2056r4251j41808j09088K90507r534j00817m8170k48183K39691
$$ plain form
13862 1111556 1297177 1210278 1383088 890947 1142591 1040994 1266496 1330790 810731 1281668
13852 1281668 1305980 1119932 1210728 962218 1051369 1379001 1082778 1111802 1190639 1045728
13842 1045728 983242 832921 1218665 906486 973615 1265653 724139 1027752 848751 1050651
13832 1050651 1105260 939767 1119545 1157793 841879 1021030 658223 751152 926266 750349
13822 750349 803214 782750 1368940 1064211 981030 887660 855818 953076 1122173 765346 614687
13811 614687 1100996 1084417 646203 751789 1285180 913588 1002902 1208600 890927 896218
13801 896218 790237 801788 1067379 678095 731893 1074019 816201 982208 658413 885804
13791 885804 804746 674615 771164 726792 668881 904360 545527 1131729 881566 772776
$$ packed form
13862A111556J85621q6899J72810m92141K51644j01597K25502O4294n20059M70937
13852A281668K4312j86048R0796k48510Q9151L27632k96223K9024P8837j44911
13842A045728o2486j50321L85744l12179O7129K92038n41514L03613j79001K01900
13832A050651N4609j65493J79778L8248l15914J79151l62807R2929J75114j75917
13822G50349N2865k0464N86190l04729q3181r3370l1842R7258J69097l56827j50659
13811F14687M86309j6579m38214J05586N33391l71592Q9314K05698l17673N291
13801H96218j05981J1551K65591l89284N3798L42126k57818J66007l23795K27391
13791H85804q1058j30131R6549m4372n7911K35479l58833N86202k50163j08790
$$ plain form
13781 772776 539554 747606 598610 633462 687324 674990 665697 774717 737732 735811 985166
13770 985166 842372 788682 889724 1077459 715250 573571 477036 587787 708424 861878
13760 861878 872336 757927 668010 585264 585682 642823 695337 823756 760576 434851 359287
13749 359287 442950 834158 786836 765072 687042 472399 672310 693368 463599 308472
13739 308472 505581 457771 455401 686700 541158 563166 644488 287663 401162 388663 361791
13728 361791 332651 518356 646352 855599 254024 578898 598760 737215 523958 664234
13718 664234 418868 643547 712428 428325 593154 610876 584152 434283 357413 542804
13708 542804 584344 867456 384009 623175 431622 748961 489657 291697 545125 548260
$$ packed form
13781G72776k33222K08052j48996L4852N3862j2334r293J09020l6985j921K49355
13770I85166j42794n3690J01042J87735l62209j41679r6535J10751J20637J53454
13760H61878J0458j14409q9917q2746M18N7141N2514J28419o3180l25725p5564
13749C59287Q3663L91208m7322k1764p8030k14643J99911K1058k29769j55127
13739C08472J97109m7810k370K31299j45542K2008Q1322B87663J13499j2499k6872
13728C61791k9140J85705J27996K09247B54024L24874J9862J38455k13257J40276
13718F64234k45366K24679O8881k84103J64829J7722k6724j49869p6870J85391
13708E42804M1540K83112C84009K39166j91553L17339k59304j97960K53428L135
$$ plain form
13698 548260 751819 368984 438879 274646 820077 273107 562702 595700 678190 453891
13688 453891 761963 411850 633961 463625 731570 915433 385045 295227 9634 1018108
13678 1018108 499322 490563 665277 45114 437646 617610 409274 326319 313458 691076
13668 691076 406512 561078 488785 204714 276514 594127 259103 301918 489983 233432
13657 753597 608331 128670 426039 337754 491073 453070 738800 515323 627018 715532
13647 715532 382263 511027 163147 692425 346520 449795 448784 452160 320441 622289
13637 622289 495159 496971 241235 338058 420132 598259 396411 375927 343868 287183 524437
13626 524437 278462 455445 429534 232457 321328 511556 480166 337071 244607 366598
$$ packed form
13698E48260K03559C68984O9895j64233N45431B73107K89595L2998Q2490k24299
13688D53891L08072l50113K22111j70336K67945J83863C85045q9818I634J008474
13678A018108D99322q759J74714D5114L92532J79964k08336q2955j2861L77618
13668F91076k84564J54566p2293B04714P1800L17613B59103M2815J88065B33432
13657G53597j45266A28670K97369q8285J53319l8003K85730k23477J11695Q8514
13647G15532l33269J28764A63147N29278l45905J03275j011L376j31719L01848
13637F22289j27130J812B41235R6823Q2074J78127k01848k0484l2059n6685K37254
13626E24437k45975J76983k5911j97077Q8871J90228l1390j43095r2464J21991
$$ plain form
13616 366598 645005 723636 560403 193668 460509 477236 392456 256970 706996 64342
13605 509475 468610 380736 166359 800307 140699 206582 421026 396818 297542 -19039 386769
13593 284265 555848 579151 39865 317435 440516 213938 321523 428144 680918 125489
13582 396202 498753 270508 300353 317019 344053 264645 377401 731135 476511 571709
13572 571709 438912 388415 527763 496038 275174 604752 208458 96975 404977 158805
13561 33373 62952 387304 368937 -15921 223688 320167 347317 424211 230962 559463 1920
13549 331596 575679 268047 46124 289878 568119 500625 492947 37110 151062 88851 100908
13538 100908 397713 632324 261661 392355 303209 -90530 449919 572908 481761 329411
$$ packed form
13616C66598K78407P8631j63233A93668K66841J6727q4780j35486M50026F4342
13605E09475m0865q7874A66359O33948A40699O5883K14444k4208r9276a9039C86769
13593B84265K71583K3303C9865K77570J23081B13938J07585J06621K52774A25489
13582C96202J02551k28245K9845J6666K7034p9408J12756L53734k54624R5198
13572E71709j32797n0497J39348l1725k20864L29578B08458I6975L08002A58805
13561C3373K9579L24352j8367a5921B23688R6479K7150P6894j93249L28501A920
13549C31596K44083B68047D6124K43754K78241o7494p678C7110J13952o2211J2057
13538A00908K96805K34611B61661J30694q9146i0530D49919J22989r1147j52350
$$ plain form
13528 329411 192808 324635 378590 625514 158358 164308 217359 200279 288172 412765 405253
13517 405253 324343 402985 397717 369264 374112 95918 593395 167292 271146 473085 641205
13506 641205 400183 263891 301099 358368 304803 -5403 537062 297397 453239 396934 501408
13495 501408 161458 295811 419891 387317 422158 134579 298389 231659 177950 244350
13485 244350 549141 279823 44623 811418 402222 356581 171360 142626 464945 143590
13474 462988 293752 337683 120946 -34297 34018 -114588 632617 276959 271101 169992
13464 169992 542161 38363 -83299 363043 162055 78043 48765 217040 17766 135611
13454 135611 322994 469660 225655 353537 478022 307732 50225 138960 209028 246540
$$ packed form
13528C29411j36603J31827N3955K46924A58358N950N3051j7080Q7893J24593p512
13517D05253q0910P8642n268k8453M848I5918M97477A67292J03854K01939J68120
13506F41205k41022j36292L7208N7269n3565e403E37062k39665J55842n6305J04474
13495E01408A61458J34353J24080l2574L4841A34579J63810o6730n3709O6400
13485B44350L04791k69318D4623P66795D02222m5641A71360k8734L22319A43590
13474D62988j69236M3931A20946c4297C4018a14588F32617B76959n858j01109
13464A69992L72169C8363h3299C63043A62055G8043k9278J68275A7766J17845
13454A35611J87383J46666B25655J27882J24485j70290E0225Q8735P0068L7512
$$ plain form
13444 246540 497977 -4982 378433 -119740 471136 335877 187913 533049 376487 552801
13434 552801 322061 185692 -58987 116829 305987 92021 268221 325020 188692 403948
13424 403948 329983 316538 332132 310817 231821 396081 437879 -189591 135399 121734 202242
13413 202242 -80375 80060 333745 168213 222595 359294 169157 101642 627 127802 313291
13402 313291 145218 295707 288197 323555 190747 473506 37592 91531 117876 55088 -19069
13390 139446 62772 423479 581905 11813 169598 -92112 350873 66055 -43698 183689
13379 -132841 188157 37989 199720 263744 86887 125951 145647 484965 301516 61857 58510
13368 58510 271001 522275 399860 328000 -78659 290136 -2605 312801 226807 317546 100366
$$ packed form
13444B46540K51437d982C78433a19740D71136j35259j47964L45136j56562J76314
13434E52801k30740j36369e8987A16829J89158I2021J76200N6799j36328K15256
13424D03948p3965j3445J5594k1315p8996J64260M1798a89591A35399j3665Q0508
13413B02242h0375H0060K53685j65532N4382J36699A69157o7515F27J27175J85489
13402C13291A45218J50489p510L5358j32808K82759C7592N3939K6345E5088a9069
13390A39446F2772L60707J58426A1813J57785i2112C50873F6055d3698A83689
13379a32841A88157C7989J61731O4024H6887L9064J9696L39318j83449F1857l347
13368E8510K12491K51274j22415p1860g8659B90136b605C12801q5994R0739A00366
$$ plain form
13356 106701 626964 356105 286136 415281 282072 312993 294352 -152079 251191 399807
13346 399807 437483 418437 362935 282228 495792 246773 -15125 566382 310686 364240 181367
13334 294314 178176 300679 476014 563585 120205 330766 147247 153699 -152101 96098
13323 -46436 260008 1743 -72915 787190 -119139 277374 177374 -43003 172733 487894
13313 487894 135694 224843 216351 -54688 306477 194731 393286 401612 270538 -175740 96115
13301 -218398 -33954 129068 18757 413352 10762 76131 135524 181697 291033 320076 33448
13289 -527328 340483 112128 260285 18761 127081 33460 357646 226602 214131 1535
13278 223293 -107964 280205 299496 151544 164212 -128703 376481 317972 14847 -78024
$$ packed form
13356A06701N20263k70859o9969J29145j33209L0921j8641a52079B51191J48616
13346C99807L7676j9046n5502q0707K13564B46773a5125E66382k55696N3554A81367
13334B94314j16138J22503J75335Q7571A20205K10561A47247O452a52101I6098
13323d6436B60008A743g2915G87190a19139B77374j00000d3003A72733L15161
13313D87894A35694Q9149q492e4688C06477j11746J98555Q326j31074a75740I6115
13301b18398c3954A29068A8757L94595A0762O5369N9393M6173J09336K9043C3448
13289e27328C40483A12128J48157A8761J08320C3460L24186j31044j2471A535
13278B23293a07964B80205J9291j47952J2668a28703C76481n8509A4847g8024
$$ plain form
13267 179807 30701 -188330 109597 12314 251786 34274 72782 130782 10975 -93543 216186
13255 279101 -19055 136076 225100 123017 273079 282175 315646 98791 483959 375405 113101
13243 371235 142368 277922 -41511 109707 135376 304377 159444 1180 399284 -261980
13232 137395 83220 100657 123605 327518 70962 -100511 370800 212456 131693 215430 254211
13221 254211 62602 127206 178453 -190876 -92732 -259027 186039 71966 65179 270363 84078
13209 75736 104523 78583 427089 132120 19514 -31155 -347321 -304656 38725 245019 150773
13198 150773 172106 68220 130961 -40245 276996 -95013 114560 -12199 43520 54316 330550
13187 330550 397729 271603 -145345 77253 201688 101756 148367 167061 -149545 74792 57941
$$ packed form
13267A79807C0701a88330A09597A2314K39472C4274L8508N8000A0975i3543B16186
13255B79101a9055A36076Q9024j02083J50062R096L3471I8791L85168j08554A13101
13243C71235A42368J35554d1511A09707K5669J69001j44933A180L98104b61980
13232A37395n4175J7437K2948K03913G0962a00511C70800j58344q0763Q3737L8781
13221B54211F2602O4604N1247a90876i2732j66295A86039G1966o787K05184H4078
13209G5736K8787k5940L48506A32120A9514c1155l16166M2665C8725K06294r4246
13198A50773K1333F8220O2741d0245B76996i5013A14560a2199D3520J0796K76234
13187C30550O7179j26126a45345G7253J24435r9932M6611J8694a49545G4792j6851
$$ plain form
13176 57941 16807 -253533 -149864 -10800 -4883 -44156 -95713 99094 378775 -316610 -645
13164 182517 181199 120527 67752 -117368 -224037 317901 134222 307917 128134 366608
13154 366608 14567 157378 96367 121285 -39770 258195 240044 61170 432034 -103445 -201323
13143 -201323 141532 165860 260297 -75308 -105079 259178 -84938 -186937 -25925 -49938 230040
13131 132130 82860 390322 235125 -23519 -154382 189645 64483 -206879 1831 276068
13121 276068 129114 103241 -138668 -26718 -2313 -324931 268851 6699 192249 26069 352508
13110 352508 283005 197939 26834 -359629 -50549 342782 9675 112619 -204573 180707 214050
13099 214050 243700 131097 -62846 153479 -120959 15318 -67376 -434483 208996 61489
$$ packed form
13176E7941A6807b53533J03669a0800d883l9273n1557I9094K79681c16610f45
13164A82517j318o0672n2775a17368j06669C17901A34222J73695A28134K38474
13154C66608A4567J42811o1011K4918c9770B58195j8151F1170L70864a03445r7878
13143b01323A41532K4328R4437g5308k9771B59178h4938j01999b5925k4013B30040
13131A32130m9270L07462j55197b3519j30863A89645F4483b06879A831K74237
13121B76068A29114k5873a38668b6718b313l22618B68851F699J85550B6069L26439
13110C52508o9503q5066B6834c59629e0549C42782I675J02944b04573A80707L3343
13099B14050K9650j12603f2846A53479a20959A5318f7376l67107B08996F1489
$$ plain form
13088 211297 100255 -22167 98437 222246 -69044 -191740 420653 -17758 484761 272999
13078 272999 -43597 -114336 28218 9028 46644 -364976 189656 278016 353724 239937 95976
13066 14545 11154 45087 271465 206799 106929 -27037 -37349 265513 234814 112813 268742
13055 268742 -14356 313781 27693 155499 147726 200311 118888 -284566 134493 333449 107495
13043 133735 219126 -60516 -35382 -44624 172438 146238 119581 94463 -129295 36684 182817
13032 182817 -937 -62448 576125 1181 196016 105005 151713 255758 166090 -7513 153882
13020 380887 395960 520383 -87973 151587 -238591 200900 40673 93602 -38172 -97120 266166
13008 180956 145816 -63442 -2922 -112157 -65644 107216 403673 -46032 -76551 -316182 -99258
$$ packed form
13088B11297A00255b2167I8437J23809f9044j22696D20653a7758D84761k11762
13078B72999d3597p0739B8218I028L7616c64976A89656Q8360P5708j13787I5976
13066A4545l391L3933K26378o4666r9870b7037j0312B65513l0699A12813J55929
13055B68742a4356C13781B7693J27806p773N2585q1423b84566A34493J98956A07495
13043A33735Q5391f0516K5134r242A72438k6200k6657k5118a29295C6684J46133
13032A82817i37o1511E76125A181J94835r1011M6708J04045q9668g513A53882
13020C80887J5073J24423h7973A51587b38591B00900D0673N2929c8172n8948B66166
13008A80956l5140f3442b922j09235M6513A07216K96457d6032l0519k39631i9258
$$ plain form
12996 -3517 216899 -175520 -99740 208307 121742 165335 8906 250452 238849 -42948 -159049
12985 -159049 29238 -313275 -183205 391350 144376 170979 33698 237780 54287 31110
12975 31110 -86636 -214443 -135254 105468 -46829 -313564 -76191 62498 -18177 118318 67105
12964 67105 -21434 86976 -160381 141411 39800 -511215 -49361 -201203 158174 86464 102804
12953 102804 -145440 191689 -79855 65450 524798 -3189 155997 -122484 118849 -89798
12942 -22165 37003 121101 3966 223939 -136827 127342 355593 -14097 -218178 20960 252529
12931 252529 -109975 -62439 295817 138579 112052 -170948 224957 136297 -50890 143999
12920 238792 63384 54934 -285489 106057 165034 104469 -33633 192190 179903 75602 -174558
$$ packed form
12996c517B16899a75520P5780B08307q6565M3593H906K41546j1603d2948j16101
12985a59049B9238c13275J30070C91350A44376K6603C3698K04082E4287k3177
12975C1110h6636j27807P9189A05468d6829k66735g6191F2498a8177A18318n1213
12964F7105b1434H6976a60381A41411C9800e11215d9361j51842A58174p1710J6340
12953A02804a45440A91689g9855F5450M59348c189A55997a22484A18849h9798
12942b2165C7003Q4098C966K19973a36827A27342K28251a4097k04081B0960K31569
12931B52529a09975M7536B95817A38579k6527a70948B24957q8660e0890A43999
12920B38792F3384q450b85489A06057N8977o0565c3633A92190j2287G5602a74558
$$ plain form
12908 -195747 340614 108023 226814 65527 -127380 133778 26388 249448 -11861 107142
12897 -1584 -270561 49202 87511 275509 163288 -238140 -48469 -29620 149027 169196 168460
12886 168460 15279 -170838 116908 -381269 358100 187728 -96132 112303 22832 -181730
12875 121883 99597 -178904 -19014 -8636 -145573 -101148 413269 124309 48731 115187 -48007
12863 -47214 67395 196815 286154 21908 5074 -79174 -85348 23096 70083 18424 -251734 278771
12850 152269 22383 -247073 67277 117479 -53986 236751 62620 -466366 57778 66855 200588
12839 200588 200406 170731 110868 223698 -84825 152931 188070 -56924 -51492 -29323 85586 311797
12827 311797 158994 -99683 -348018 52239 -123075 361926 129697 172601 118027 274417
$$ packed form
12908a95747C40614A08023J18791F5527a27380A33778B6388K23060a1861A07142
12897a584k68977D9202L8309J87998j12221b38140d8469J8849A49027K0169p36
12886A68460A5279a70838A16908c81269C58100j70372i6132A12303B2832a81730
12875A21883k2286a78904a9014h636j36937M4425D13269A24309D8731O6456d8007
12863d7214F7395J29420Q9339B1908E074g9174o174B3096M6987A8424b51734B78771
12850A52269B2383b47073F7277N0202e3986B36751F2620d66366E7778R077J33733
12839B00588j82k9675n9863J12830h4825A52931L5139e6924N432K2169H5586K26211
12827C11797j52803i9683k48335E2239a23075C61926A29697M2904n4574J56390
$$ plain form
12817 274417 449747 68430 61992 69049 -208105 127139 468363 -84447 254991 346849 -20437
12805 -267468 138615 -233953 235634 206566 325582 44764 445189 41240 -42597 252810
12794 -163498 -52457 13620 146272 -123307 -3506 89478 205650 50455 253739 -381482 102035
12782 208049 50457 -189238 60710 19009 191204 -32197 -28492 190194 217289 126590 -38072
12770 3081 -208889 -76547 82560 217513 20832 -89579 -197916 27987 -56199 140504 -196025
12758 149126 293223 86467 135791 22524 -97161 200421 108109 -33799 94403 -210582 150027
12746 53061 -172820 -262514 520223 117847 -3217 230326 -146260 -9810 37463 234192 398436
12735 398436 -93502 171971 220902 -77400 258012 -44921 143934 398846 62103 57343 134376
$$ packed form
12817B74417J75330F8430o438P057b08105A27139L41224h4447B54991R1858b0437
12805b67468A38615b33953B35634k9068J19016D4764M00425D1240d2597B52810
12794a63498e2457A3620J32652a23307c506H9478J16172E0455K03284c81482A02035
12782B08049E0457a89238F0710A9009J72195c2197L705A90194K7095r0699c8072
12770C081b08889g6547H2560J34953B0832h9579j08337B7987e6199A40504a96025
12758A49126J44097H6467M9324B2524i7161B00421r2312c3799I4403b10582A50027
12746E3061a72820q9694E20223A17847c217B30326a46260i810C7463J96729J64244
12735C98436i3502A71971M8931g7400B58012d4921A43934K54912F2103m760P7033
$$ plain form
12724 134376 68717 -29690 -257376 -374379 255616 -82361 312534 -284645 -297913 -64283
12713 173300 142001 14946 -5368 229993 -125921 390031 443 288404 329293 96402 80645
12702 80645 310983 257372 117744 281647 -8415 210034 26842 154445 510489 53609 -8186
12690 -21641 197204 -168829 -286104 -2573 142466 111328 201915 -4186 25187 148015 -27634
12678 -17056 349062 -4646 220049 172464 -200070 343586 290222 -302219 -265143 513628 63270
12666 147548 119125 315625 248383 11581 -122074 90762 64083 270335 45930 409309 169774
12654 177445 -28300 247638 152429 -3686 -132211 69787 265741 28325 -188674 -20704 -24117
12643 -24117 -132843 50214 289844 -132306 61640 79893 94168 56421 207168 235218 74194
$$ packed form
12724A34376o5659b9690k27686j17003B55616h2361C12534b84645j3268f4283
12713A73300l1299A4946e368B29993a25921C90031D43K87961M0889I6402j5757
12702H0645K30338n3611A17744J63903h415B10034B6842J27603L56044E3609h186
12690b1641A97204a68829j17275b573A42466l1138R0587d186B5187J22828b7634
12678a7056C49062d646B20049m7585b00070C43586n3364c02219L7076E13628F3270
12666A47548k8423J96500o7242A1581a22074I0762k6679K06252D5930L63379A69774
12654A77445b8300B47638r5209c686j28525F9787J95954B8325a88674b0704l413
12643b4117j08726E0214K39630a32306F1640J8253J4275l7747J50747K8050G4194
$$ plain form
12631 127155 419206 270302 -144788 85151 145317 -125528 176792 77065 418978 157556
12620 99730 -63165 -78205 437531 33467 -186047 358300 -229151 539373 -5777 95280 7391
12608 119549 166366 175524 187169 244749 18523 -382059 87101 161616 -139609 164559 51401
12596 49678 -10720 85033 106343 -35759 96918 -314133 241097 -214693 213687 89750 50426
12585 50426 -58858 -192362 181868 249043 234976 -209643 -88130 33401 83857 133132 285356
12574 285356 332483 150087 74908 77449 -304845 -141583 311195 18839 -287024 -145663
12564 -145663 122268 145240 142682 -90951 218835 285893 -36891 60083 -304507 -236258 -179575
12553 -179575 -97409 -32707 281527 50997 155598 -169009 -67885 -142597 -241239 110199 -127395
$$ packed form
12631A27155K92051j48904a44788H5151O0166a25528A76792G7065L41913A57556
12620I9730f3165j5040D37531C3467a86047C58300b29151E39373e777I5280G391
12608A19549M6817R158J1645N7580A8523c82059H7101P4515a39609A64559E1401
12596D9678a0720H5033K1310c5759I6918c14133B41097b14693B13687H9750l9324
12585E0426e8858j33504A81868O7175j4067b09643h8130C3401N0456M9275J52224
12574B85356M7127A50087G4908K541c04845a41583C11195A8839b87024J41361
12564a45663A22268K2972k558i0951B18835O7058c6891F0083c04507O8249N6683
12553a79575Q2166c2707B81527E0997J04601a69009f7885p4712r8642A10199a27395
$$ plain form
12541 106528 -171559 -25528 -382129 238646 -204504 280339 -26943 -184510 -286124 392585
12530 334593 -93333 5829 121971 36204 108777 -358109 -66700 177973 188005 45483 309411
12519 309411 100546 279958 55613 203834 -172259 90392 -164963 -174524 193240 182187
12509 182187 -73183 8570 342943 -73610 -153086 -101827 -296204 157545 -210969 1712 12975
12498 12975 -4967 -17323 -11531 -10585 21849 30324 -29252 -48311 -105441 -181652 259218 -58299
12485 82419 3414 137645 -322056 93552 -116866 -142119 129916 -220465 -100400 -83671 39766
12473 -40734 157661 127646 -58589 18067 -72950 -259170 239898 297799 -190022 173731 197221
12462 197221 -2469 32458 -209508 -161900 58088 -118119 -168492 105351 182278 147713 70104
$$ packed form
12541A06528a71559b5528l56601B38646b04504B80339b6943j57567j01614C92585
12530C34593i3333E829J16142C6204P2573c58109f6700A77973J0032D5483K63928
12519C09411A00546J79412E5613J48221a72259I0392a64963r561A93240j1053
12509A82187g3183H570L34373g3610p9476N1259j94377A57545b10969A712J1263
12498A2975d967j2356N792R46B1849Q475b9252j9059n7130p6211B59218e8299
12485H2419C414J34231c22056I3552a16866k5253A29916b20465a00400J6729C9766
12473d0734A57661l0015e8589A8067g2950j86220B39898N7901a90022A73731K3490
12462A97221b469C2458b09508M7608E8088a18119n0373A05351P6927l4565G0104
$$ plain form
12450 -126846 256303 -168734 65590 -372106 25507 -53892 35793 102871 327973 97750 14462
12438 170130 236166 -36565 -69997 46352 132234 -287237 -520809 121832 -254865 53782 -46284
12426 -362544 141616 20703 -188120 27161 207667 -32784 287638 -42171 72121 133307 -179374
12414 -115826 60491 -92399 -31237 -75132 149692 -155831 116370 -137874 -211176 119676
12403 126734 -46486 -219097 -54669 182332 -124219 298467 -4469 -97889 -34320 -28650 9535
12391 19450 -215595 26361 295784 -77848 145108 -9132 128941 -252657 -18371 -74076 -44753
12380 -44753 -313460 19870 51684 113879 23165 270061 -92562 130553 -153312 -170488 -183157
12369 -183157 93033 -40936 -124423 102147 -164385 -39315 -124040 84628 -128418 186665 34176
$$ packed form
12450a26846B56303a68734F5590c72106B5507e3892C5793O7078K25102I7750A4462
12438A70130O6036c6565l3432D6352Q5882b87237k33572A21832b54865E3782d6284
12426c62544A41616B0703a88120B7161J80506c2784B87638d2171G2121O1186a79374
12414a15826F0491i2399c1237m3895A49692a55831A16370a37874p3302A19676
12403A26734d6486j72611e4669A82332a24219B98467d469r3420c4320N670I535
12391A9450b15595B6361K69423g7848A45108i132A28941b52657a8371n5705K9323
12380d4753k68707A9870L1814O2195B3165K46896i2562A30553a53312j7176j2669
12369a83157I3033d0936q3487A02147a64385c9315q4725H4628a28418A86665C4176
$$ plain form
12357 -120894 -327091 52982 -27920 -7239 -68629 17264 -277950 247514 -128363 5815 294207
12346 294207 326534 346461 -250479 186717 221179 -12197 32918 -14056 160774 72724 -24497
12334 -27845 445397 18542 -93722 137606 -266607 292528 59517 149947 -12537 125451 120148
12323 120148 -159100 56324 86988 261 -226138 -16743 -79094 -167907 -135032 167095 -167532
12311 85508 192222 43453 119109 -126524 -212158 115547 170017 -41497 39292 -71677 -156078
12300 -156078 24242 -186903 50493 225073 175707 214838 -109600 7254 44167 -116998 64913
12288 -289355 105088 -46880 40702 233952 146581 135584 234088 35988 245491 -11087 37928
12276 199323 153785 338190 274240 745194 140904 291254 204724 354890 214942 384311
$$ packed form
12357a20894k06197E2982b7920g239o1390A7264b77950B47514a28363E815K88392
12346B94207L2327J9927b50479A86717L4462a2197C2918a4056A60774G2724b4497
12334b7845D45397A8542i3722A37606b66607B92528E9517R0430a2537A25451n303
12323A20148a59100E6324L0664B61b26138a6743o2351q8813L2875A67095a67532
12311H5508J06714D3453P5656a26524q5634A15547N4470d1497C9292g1677q4401
12300a56078B4242a86903E0493J74580m9366L9131a09600G254L6913a16998F4913
12288b89355A05088d6880D0702J93250q7371j0997R8504C5988K09503a1087C7928
12276A99323m5538J84405o3950M70954A40904J50350q6530J50166j39948J69369
$$ plain form
12266 384311 78239 233431 56221 -17492 81877 -8039 155938 -16576 98407 50282 77212
12255 77212 -5452 -101728 -131462 87989 -55805 423655 36499 144358 323675 125321 -64482
12243 210534 295114 129561 24268 260493 152439 346963 105751 190101 3315 465203
12233 465203 -38479 423112 42357 528913 160260 314841 511339 -170827 220801 -164794
12222 -113758 170914 212983 45133 17474 232319 289343 -47150 -123582 215711 152724 323428
12211 323428 -95622 285839 100031 167346 183642 105763 294422 163811 201635 88317 457945
12200 457945 307712 42553 184220 122704 159425 -22079 128653 21760 368893 69969 70206
12189 70206 165567 82452 155950 -87197 -75997 250105 -92906 36634 -20920 254790 -34321
$$ packed form
12266C84311G8239J55192E6221a7492H1877h039A55938a6576I8407m8125K6930
12255G7212e452r6276k9734H7989e5805D23655C6499J07859J79317A25321f4482
12243B10534Q4580A29561B4268K36225j08054J94524A05751Q4350C315M61888
12233D65203c8479D23112D2357M86556A60260J54581J96498a70827B20801a64794
12222a13758A70914M2069D5133A7474K14845N7024d7150p6432B15711o2987J70704
12211C23428i5622B85839A00031O7315J6296p7879J88659j30611L7824H8317L69628
12200D57945j50233D2553J41667o1516L6721b2079A28653B1760L47133F9969K37
12189G0206R5361H2452P3498h7197J1200B50105i2906C6634b0920B54790c4321
$$ plain form
12177 1272 380170 365196 296501 269363 -36235 -239300 322422 34707 111161 -36016 106484
12165 72339 477013 171678 291590 -23997 -137475 334962 493722 -181188 267823 -84365
12154 176691 156526 152907 217420 195699 14209 -80034 -114079 -56575 43560 -15209 -49705 -42386
12142 -42386 178873 -136897 -8605 273519 109832 115716 -188201 -48214 193153 312320 136338
12130 -109147 215884 267899 86037 -297999 -196614 73412 -162359 -133383 74035 178790
12120 178790 -113576 -118900 -198472 -16666 45722 46577 7 -1508 115615 -58890 -17106 74520 376274
12107 376274 59173 170449 -291956 242723 45252 191551 180484 -349163 -34789 193715
12096 -61766 102268 -148114 -167541 -59670 -7658 -1846 -329900 -8416 116227 -263073 -225841
$$ packed form
12177A272L78898j4974o8695k7138c6235k03065C22422C4707P6454c6016A06484
12165G2339M04674A71678J19912b3997j13478C34962J58760a81188B67823h4365
12154A76691k0165l619O4513k1721A4209h0034l4045e6575D3560a5209l4496P319
12142d2386A78873a36897h605B73519A09832N884a88201d8214A93153J19167A36338
12130a09147B15884N2015H6037b97999J01385G3412a62359K8976G4035J04755
12120A78790a13576n324p9572a6666D5722Q55Ga508A15615e8890a7106G4520L01754
12107C76274E9173J11276b91956B42723D5252J46299j1067c49163c4789A93715
12096f1766A02268a48114j9427e9670g658a846l28054h416A16227b63073L7232
$$ plain form
12085 -225841 -349101 -27733 -221861 89222 29314 134250 199299 102045 661647 2503047
12075 2503047 1170660 543713 118418 242286 -63125 -271430 -118172 230877 32241 -170802
12064 -97454 -54182 80154 244911 66620 -149241 393013 68264 -50760 40252 -124414 -7430
12052 -52058 -161525 916 -118623 186994 155243 -89533 255670 2163 118200 30876 -310772
12040 -101435 -221982 78247 17815 29542 -85824 9000 -15988 -153926 -268556 -269987 189845
12028 -213394 56962 76864 58359 -208345 -55892 116180 36025 -3364 -34898 -53329 9254
12016 -80235 -78986 71460 272757 -1609 -138051 -67359 276270 403626 -23859 -19078 18260
12004 62439 74464 -78844 -139454 -154971 -125547 -363728 -125696 262909 -175315 -130563 -140577
$$ packed form
12085b25841j23260b7733j94128H9222B9314J04936O5049r7254N59602J841400
12075B503047A170660E43713A18418J23868f3125k08305a18172B30877C2241a70802
12064i7454M3272H0154J64757F6620a49241C93013F8264e0760D0252a24414g430
12052e2058j09467I16a18623A86994l1751h9533B55670B163J16037C0876c10772
12040a01435j20547G8247A7815J1727h5824I000a5988j37938j14630j431A89845
12028b13394E6962J9902j8505b08345e5892A16180C6025c364l1534j8431I254
12016h0235J249G1460K01297a609j36442f7359B76270J27356b3859M781A8260
12004F2439J2025g8844o0610j5517K9424k38181a25696B62909a75315M4752j0014
$$ plain form
11993 -140577 29122 -8933 -77570 612 -104745 -109325 -243262 197085 174131 -203427 -76614
11981 109230 -61136 120173 55909 151546 -221382 -144446 -123979 -44110 -12737 -7146 80896
11969 -330908 36838 17038 -443981 -10328 -310302 198133 52262 317978 143287 17202
11958 169902 -139472 80591 -209184 179313 55499 -242424 -99365 247138 39495 -53838
11947 36076 76513 -17037 6352 -414600 -40636 7268 82265 -466410 -188903 103825 150415
11936 150415 100176 129208 -26514 164535 -105049 46970 -221270 -123263 -41583 230119 -201667
11924 39378 36519 6674 199330 280746 -174929 -5974 4963 -963 384814 88764 -225229 97695
11911 -27406 -286358 144646 -279501 -84894 -134588 126601 -40108 55373 -106098 173960
$$ packed form
11993a40577B9122h933o8637F12a04745m580j33937A97085k2954b03427g6614
11981A09230f1136A20173E5909R5637b21382P6936K0467d4110a2737N591H0896
11969c30908C6838A7038d43981a0328k99974A98133E2262K65716A43287A7202
11958A69902a39472H0591b09184A79313E5499b42424i9365B47138C9495e3838
11947C6076M0437a7037F352d14600d0636G268P4997d66410a88903A03825M6590
11936A50415n0239K9032b6514A64535a05049D6970b21270R8007d1583B30119b01667
11924C9378k859F674J92656Q1416a74929e974D963i63C84814H8764b25229I7695
11911b7406k58952A44646b79501h4894m9694A26601d0108E5373a06098A73960
$$ plain form
11900 -8335 83858 50535 -269356 -173505 -175072 214306 -85264 -56305 -13874 -45535 63932 -191825
11887 1644 -277492 191960 -5335 -140789 84634 -227964 -323201 212173 -298797 -271210 -11347
11875 1392 -273516 -16171 -26661 13805 -85607 -220266 91440 -338150 7923 251117 -94922
11863 -4251 87527 -83837 327538 141423 45128 108400 160422 100530 318824 -270784 -264666
11852 -264666 -303437 -330605 179083 59984 219419 9075 -201125 238338 21787 17681 -244466
11840 -71115 173669 -50967 -105184 154443 -135278 -207559 -69967 -152923 -122809 -149403 -19843
11828 -159067 24141 -52457 62848 -46536 -55660 -52861 -147826 -48336 19680 78074 -242250 -305270
11816 -305270 32536 -74200 25643 503546 -102032 68578 -36683 31185 142756 68545 -78365
$$ packed form
11900h335H3858l3323b69356R5851j567B14306h5264K8959a3874l1661F3932a91825
11887A644b77492A91960e335j35454H4634b27964r5237B12173b98797K7587a1347
11875A392b73516a6171j0490A3805h5607j34659I1440c38150G923K43194i4922
11863d251H7527h3837C27538A41423D5128O3272N2022n9892K18294b70784O118
11852b64666l8771k7168A79083E9984J59435I075b01125B38338B1787m106b44466
11840g1115A73669e0967n4217A54443a35278p2281f9967q2956L0114k6594a9843
11828a59067B4141e2457F2848d6536r124K799r4965d8336A9680N8394b42250o3020
11816c05270C2536g4200B5643M77903a02032F8578c6683C1185J11571F8545g8365
$$ plain form
11804 -85115 -92466 250099 100192 160286 -40531 -117681 -411344 67683 -95040 103474 206298
11793 206298 107237 190785 135438 26448 121097 -32030 1975 -182243 -75872 -144866 178520
11781 -121048 -168845 -274731 81500 -111312 -83361 -135592 -353753 -3214 -206219 -249137 -36167
11769 -52482 -432414 -6553 -222219 244782 -51854 -58985 81036 -328123 60149 61389 32117
11758 32117 145337 -20573 -48639 64799 216021 -14713 57458 -21341 -131186 63279 466112
11747 466112 113182 -11894 -220883 99074 -80218 -310 56381 -3383 -55409 293098 -323445
11735 -4548 -158467 22249 -51281 81357 103414 -5959 -77885 -123548 66889 -169460 -192666 20098
11722 192508 114686 -315007 160371 -99043 -59518 98534 260565 -65366 266069 151458
$$ packed form
11804h5115p351B50099A00192O0094d0531p7150k93663F7683i5040A03474J02824
11793B06298r9061Q3548n5347B6448R4649c2030A975a82243g5872o8994A78520
11781a21048m7797j05886H1500a11312K7951n2231k18161c214k03005m2918c6167
11769e2482l79932f553k15666B44782e1854p131H1036c28123F0149J240k9272
11758C2117J13220b0573k8066F4799J51222a4713E7458b1341j09845F3279M02833
11747D66112A13182a1894k08989I9074h0218c10E6381c383n2026B93098c23445
11735d548j53919B2249e1281H1357K2057e959p1926m5663F6889a69460k3206B0098
11722A92508p7822c15007A60371i9043L9525I8534J62031f5366B66069j14611
$$ plain form
11712 151458 125261 40601 -4855 114675 -75464 122653 -38760 -93118 219750 67332 -53176
11700 281771 117127 26661 -268767 -151120 130220 27778 42769 154748 101488 118807
11690 118807 109149 -132964 141210 248343 238039 203532 167499 -190165 181671 -81439 28973
11678 346572 287146 -79458 -92209 52510 96833 192927 105456 306109 75860 -315995 -10220
11666 -161377 -37742 -13372 56415 65483 92715 139971 -42922 1478 314237 -249534 96096
11654 385974 -405764 97653 154896 -57771 -65385 -46838 410190 -111119 229648 -57038 -176575
11643 -176575 103758 -145121 -303773 -35045 126457 -218370 139895 -333912 -2300 28545
11632 247713 114718 -425674 67723 -37122 128158 -143692 -173359 235836 -293288 163918
$$ packed form
11712A51458k6197D0601d855A14675g5464A22653c8760n4358B19750F7332e3176
11700B81771A17127B6661b68767J17647A30220B7778J4991J11979n3260J7319
11690A18807r658a32964A41210J07133j0304l4507l6033a90165A81671h1439B8973
11678C46572n9426g9458j2751E2510M4323R6094q7471K00653G5860c15995a0220
11666a61377c7742a3372E6415R068K7232M7256d2922A478L12759b49534I6096
11654C85974d05764I7653N7243e7771p614J8547D10190a11119B29648e7038j19537
11643a76575A03758a45121j58652c5045A26457b18370A39895c33912b300B8545
11632B47713A14718d25674F7723c7122A28158a43692k9667B35836b93288A63918
$$ plain form
11621 70889 6272 57176 286772 -52769 -141234 -66826 -30601 -72815 92889 -41637 239241
11609 458998 -26346 -211847 -144757 69081 178797 78270 -21749 199243 224472 205393 278873
11598 278873 105415 338423 -44346 44903 -65771 88959 -87367 48882 64499 -55450 161060
11586 283513 270581 133396 260835 511986 515840 105885 -25255 240246 118605 417312
11576 417312 156281 -151044 223574 1927 66725 -347268 -237692 -143588 -33235 130721
11565 201221 -181889 -40861 212277 -164676 388415 12742 -149642 137062 170996 -145847
11554 91191 -101775 56052 453459 183304 -79482 -52412 200954 41588 59350 44120 21059
11542 142219 176789 61923 272738 48141 -47201 206753 34182 49399 -325394 229506 -150230
$$ packed form
11621G0889F272N0904K29596e2769q8465f6826c0601m2214I2889d1637B39241
11609D58998b6346j85501O7090F9081J09716G8270b1749A99243K5229j9079P3480
11598B78873A05415K33008d4346D4903f5771H8959h7367D8882J5617e5450A61060
11586B83513j2932A33396J27439K51151L854A05885b5255B40246A18605K98707
11576D17312A56281a51044B23574A927O4798c47268J09576R4104c3235A30721
11565B01221a81889d0861B12277a64676C88415A2742a49642A37062L3934a45847
11554I1191a01775E6052L97407A83304g9482K7070B00954D1588J7762j5230B1059
11542A42219L4570F1923K10815D8141d7201B06753C4182J5217c25394B29506a50230
$$ plain form
11530 -155863 87369 242335 262505 158932 54731 440143 -90544 -20808 370008 -53077 154385
11518 22065 -240174 98220 236025 163889 503840 308012 -5965 184701 2223 254498 366470
11507 366470 649568 54578 35072 -49109 191807 239419 152098 89857 -94730 -136520 151278
11495 350489 201382 118804 -27438 358685 302402 173028 95995 152499 159160 132677 139124
11484 139124 53745 171481 90277 -25887 -32040 79194 51794 -57222 80345 161873 -90963
11472 561917 54823 376132 -25272 147400 -283682 -23286 233798 130766 112460 179080
11462 179080 238818 399683 -25229 411655 -119228 -60856 206749 -109443 287015 291538
11452 291538 391030 487493 -17777 32279 14849 91417 -240580 146650 214904 94455 56960
$$ packed form
11530a55863H7369J54966K0170j03573E4731L85412i0544b0808C70008e3077A54385
11518B2065b40174I8220J37805p2136L39951j95828e965A84701B223K52275J11972
11507C66470K83098E4578j9506d9109A91807M7612q7321o2241i4730m1790A51278
11495C50489j49107q2578b7438C58685n6283j29374p7033N6504O661k6483O447
11484A39124E3745J17736q1204b5887o153G9194k7400e7222H0345Q1528i0963
11472E61917E4823L21309b5272A47400b83682b3286B33798j03032j8306O6620
11462A79080N9738J60865b5229D11655a19228N8372B06749a09443B87015M523
11452B91538R9492R6463a7777C2279A4849P6568b40580A46650O8254I4455l7495
$$ plain form
11441 56960 -560 45103 200817 -316685 -133722 40051 87432 -219326 -157507 -358132 288560
11429 -88005 53607 -148493 -259242 193040 -287287 -83034 -49213 90666 66420 -2274 17924
11417 -33251 282827 -216504 -21274 -79099 -207451 54603 -68500 36717 23273 -115166 199797
11405 -4602 64814 -193733 257544 212520 242745 63997 89142 -113802 -65136 60464 22414
11393 -10186 -254856 215217 -123749 -291082 126647 56072 130578 -25749 -173829 48960
11382 -13794 -300901 -146495 -2662 -235901 -37485 -133505 -180006 27796 -61822 22955 -87339
11370 159454 95308 -30532 133474 1371 182700 39641 -134107 12615 -38086 -34327 -235607
11359 -235607 -59714 -72502 -288428 1620 -172796 -211963 -41400 167533 -95339 78813 164289
$$ packed form
11441E6960e60D5103J55714c16685a33722D0051M7381b19326O1819k00625B88560
11429h8005E3607a48493j10749A93040b87287h3034L3821I0666k4246b274A7924
11417c3251B82827b16504b1274n7825j28352E4603f8500C6717j3444a15166A99797
11405d602F4814a93733B57544m5024L0225F3997K5145a13802M8666F0464B2414
11393a0186k44670B15217a23749j67333A26647E6072P4506b5749j48080D8960
11382a3794k87107a46495b662k33239c7485r6020m6501B7796f1822B2955h7339
11370A59454o4146c0532A33474A371J81329C9641a34107A2615c8086L759k01280
11359b35607e9714j2788k15926A620a72796l9167d1400A67533i5339G8813Q5476
$$ plain form
11348 164289 -69081 -78757 109924 98814 25106 -161664 55828 -211139 161245 111591 108498
11337 108498 -430066 -181114 191392 45569 101736 33608 195726 2167 -198069 20675 -234815
11325 303705 -53077 156833 -13266 41443 26114 -105509 -63575 77247 -296926 -234160 26787
11313 119143 54549 131608 -167278 140656 -131496 -35556 62761 182668 2744 301578 -278028
11301 -461819 -225852 -13660 14612 -213939 215911 160720 -265890 -364526 -20273 422897
11290 -245021 1416 -208370 -365809 299801 51486 -35740 -170848 -155723 -227022 -89045 -350251
11279 -350251 193062 11557 279043 52212 -20343 11170 319080 151249 -540 348250 -264644
11267 -187453 64102 27102 -9947 10314 -263137 -132752 141090 -20410 -7976 -141197 -55435
$$ packed form
11348A64289f9081r676A09924j1110B5106a61664E5828b11139A61245m9654l093
11337A08498d30066a81114A91392D5569N6167C3608J62118B167a98069B0675b34815
11325C03705e3077A56833a3266D1443j5329a05509M1934G7247b96926O2766B6787
11313A19143E4549P7059a67278A40656a31496c5556F2761J19907B744K98834b78028
11301d61819b25852a3660A4612b13939B15911n5191b65890r8636b0273D22897
11290b45021A416b08370j57439B99801E1486c5740j35108J5125p1299h9045k61206
11279c50251A93062A1557K67486E2212b0343A1170L07910A51249e40C48250b64644
11267a87453F4102B7102i947A0314b63137J30385A41090b0410g976j33221e5435
$$ plain form
11255 -195426 149473 -12267 339671 -263670 -103168 -160485 281063 -420575 328028 66276
11244 -37695 165523 120218 18806 249606 45564 -134798 -191495 411399 -111432 140144
11233 -187435 -289350 -235738 15939 -259120 -288462 -127502 49235 -269890 -98147 -2557 55764
11221 -27036 -206334 -133296 -125947 -106827 44984 41735 144235 -78291 68725 -13436 62720 86648
11209 86648 -44133 -163406 73748 -48144 113230 -30923 -365576 -127161 -246021 -72379 -33889
11197 -380954 24013 -306567 -308914 -115434 125699 -108128 -272967 -101973 296449 298850
11187 298850 -289069 -245018 274798 -207494 -235704 27550 -358459 -197985 -126835 121232
11176 -215775 -109978 51363 103753 -90839 -28532 42687 -20656 -134919 252755 -81119 38166
$$ packed form
11255a95426A49473a2267C39671b63670a03168n7317B81063d20575C28028F6276
11244c7695A65523m5305A8806K30800D5564a34798n6697D11399a11432A40144
11233a87435j01915N3612A5939b59120k9342a27502D9235b69890i8147b557E5764
11221b7036j79298P3038P349J9120D4984l249J02500g8291F8725a3436F2720K3928
11209H6648d4133j19273G3748d8144A13230c0923l34653a27161j18860g2379c3889
11197c80954B4013c06567k347a15434A25699a08128j64839a01973B96449K401
11187B98850b89069M4051B74798b07494k8210B7550c58459J60474P1150A21232
11176b15775J05797E1363N2390i0839b8532D2687b0656j14263B52755h1119C8166
$$ plain form
11164 -176702 -283481 -216458 246750 272798 -185665 70191 -33070 81623 -121053 -166325 -328080
11153 -328080 256216 115744 269155 98512 125661 22710 72013 -81414 -293370 -54386 -290303
11142 -290303 -69351 -4487 41577 145579 -60572 -9589 -36138 57577 -57562 62857 -125885
11130 96172 -111490 209914 19671 65110 64007 -182006 374768 116156 57124 248447 -181705
11118 86304 141859 247901 -56154 281990 160815 76143 64964 297837 249584 71309 308625
11107 308625 38634 172067 61304 243339 278704 340193 256437 23834 192449 164442 391665
11096 391665 209393 233824 98060 132162 -126795 410438 428243 340908 487399 -103538
11085 31768 65559 -16007 535730 531867 352352 171874 368872 286168 -40774 144379 415040
$$ packed form
11164a76702j06779O7023B46750K6048a85665G0191c3070H1623a21053m5272j61755
11153c28080B56216A15744J53411I8512K7149B2710M9303h1414k11956e4386k35917
11142b90303f9351d487D1577J04002f0572i589k6549E7577e7562F2857a25885
11130I6172a11490B09914A9671M5439j103a82006C74768A16156E7124J91323a81705
11118H6304N5555J06042e6154B81990j21175G6143j1179K32873m8253G1309K37316
11107C08625C8634J33433F1304J82035L5365O1489q3756B3834J68615k8007K27223
11096C91665j82272K4431I8060L4102a26795D10438J7805q7335J46491a03538
11085C1768L3791a6007E35730l863j79515A71874J96998q2704d0774A44379K70661
$$ plain form
11074 415040 456394 -140762 273638 105516 197132 44654 39860 664960 298180 179062
11064 179062 522875 372507 459278 327724 508867 880158 324244 811015 692435 620164
11054 620164 762930 998309 451016 799678 567015 959512 696004 721612 668092 721504
11044 721504 907840 861801 705109 697096 796177 697936 782440 830976 589425 472517 866960
11033 866960 493943 298941 780926 520798 355679 576534 573369 791514 798549 819836
11023 819836 601330 495986 505110 816719 558403 464999 626832 511433 482245 559230
11013 559230 468963 768745 620108 596047 607778 417636 467366 499662 730936 596557
11003 596557 752343 739060 636643 604188 973618 1231373 480739 972241 491434 916871
$$ packed form
11074D15040M1354a40762B73638A05516R1616D4654m794O25100B98180j19118
11064A79062L43813j50368Q6771j31554J81143L71291C24244M86771j18580p2271
11054F20164J42766K35379D51016L48662k32663L92497k63508K5608n3520N3412
11044G21504J86336m6039j56692q013R9081r8241Q4504M8536k41551j16908L94443
11033H66960l73017j95002M81985k60128j65119K20855l165K18145P035K1287
11023H19836k18506j05344R124L11609k58316r3404J61833j15399k9188P6985
11013E59230r0267K99782j48637k4061J1731j90142M9730L2296K31274j34379
11003E96557J55786j3283j02417l2455L69430K57755D80739M91502m80807M25437
$$ plain form
10993 916871 709325 661098 787985 637662 492203 660239 1280992 793016 773017 1006965
10983 1006965 953557 1020436 1347774 1074782 1419450 1090386 1180702 1761561 1724379 1802128
10973 1802128 2334463 2565815 2700519 2752288 2762388 2838944 2501072 2135335 1668068 2412464
10963 2412464 2063664 2366307 1671804 1714887 1649355 1974664 2070803 1917612 2342331 2134132
10953 2134132 1910579 1569428 1437778 1253611 882905 668204 575754 546767 316696 110551
10942 122231 89548 642975 269547 172156 420071 334845 87086 146518 212304 179693 246366
10931 246366 117139 -10966 -89381 -132331 497466 -249858 229031 93564 271813 -192510
10920 301435 -92607 247329 -132374 -131302 -240460 158480 -240495 241637 -105779 -94931
$$ packed form
10993I16871k07546m8227J26887j50323j45459J68036O20753m87976j9999K33948
10983A006965n3408O6879L27338k72992L44668l29064R0316N80859l7182P7749
10973A802128N32335K31352J34704N1769J0100P6556l37872l65737m67267P44396
10963B412464l48800L02643o94503M3083o5532L25309R6139j53191M24719k08199
10953B134132k23553l41151j31650j84167l70706k14701r2450k8987k30071A10551
10942A22231l2683N53427B69547r7391K47915q5226H7086N9432O5786l2611O6673
10931B46366A17139a0966p8415m2950D97466b49858B29031I3564J78249a92510
10920C01435i2607B47329a32374J072j09158A58480b40495B41637a05779J0848
$$ plain form
10910 -94931 -12394 86522 -90551 99363 289547 30566 -63408 -643252 364975 -623 3029 30420
10898 30420 -24549 -176101 -510321 -42522 201807 222165 270140 -64177 -156508 -137635 -207702
10887 -207702 -271436 68958 88800 359351 128467 -30574 -152999 -126997 230062 361687
10877 361687 343124 -263552 -190002 -263408 -105704 -119563 63012 -89670 140066 345532 -127011
10865 310224 -206795 6384 -159558 105533 -11536 297170 -196077 -227276 31954 -46730 144977
10853 174603 -205708 80589 76753 -204078 -135633 -155370 71499 65238 219621 -299068 63958
10841 147844 56450 -230075 53953 -128458 123324 -251357 44788 136826 23710 -150877
10830 -36605 -28501 -53377 136912 -274285 212693 -186641 47415 -170373 4614 57519 132844
$$ packed form
10910i4931a2394H6522i0551I9363J90184C0566f3408n79844C64975f23C029K7391
10898C0420b4549j51552l34220d2522B01807K0358M7975f4177r2331J8873p0067
10887b07702o3734F8958J9842K70551A28467c0574j22425K6002B30062J31625
10877C61687j8563b63552P3550p3406a05704j3859F3012h9670A40066K05466a27011
10865C10224b06795F384a59558A05533a1536B97170a96077l1199C1954d6730A44977
10853A74603b05708H0589l836b04078O8445j9737G1499o261J54383b99068F3958
10841A47844E6450b30075E3953a28458A23324b51357D4788R2038B3710a50877
10830c6605Q104k4876A36912b74285B12693a86641D7415a70373D614N2905P5325
$$ plain form
10819 132844 -151325 106264 9162 -345730 -154013 144817 101820 -9704 25552 202010 195407
10808 195407 -79524 -89397 -293327 9184 -81446 100451 -65730 -69742 40284 -148494 41964
10796 -81212 -60070 -30420 -159878 -28979 -168 -522662 348078 -96677 -77858 -84232 -48218 315556
10783 -39981 -269866 109454 -275809 -1673 -130181 82124 302683 -79195 162096 158109 57712
10771 -115863 -158823 -187067 147227 136465 -159703 -503658 -35811 -212938 -86932 144444
10760 -293470 -69375 131098 -363271 -184874 10020 -26668 149871 -149948 -84577 -310380
10750 -310380 -115457 146106 -129614 18096 260551 -226402 268921 -67203 169439 -44509
10739 363961 -3510 89705 233217 18736 -201224 256379 52209 -442595 -22543 128993 96258
$$ packed form
10819A32844a51325A06264I162c45730a54013A44817m2997i704B5552J76458o603
10808A95407g9524r873k03930I184h1446A00451f5730m012D0284a48494D1964
10796h1212K1142K9650j29458b8979a68n22494C48078i6677J8819o374L6014C15556
10783c9981k29885A09454b75809a673j28508H2124K20559g9195A62096l987E7712
10771a15863m2960k8244A47227j0762a59703l43955c5811j77127h6932A44444
10760b93470f9375A31098c63271J78397A0020b6668A49871a49948O5371k25803
10750c10380a15457A46106a29614A8096K42455b26402B68921f7203A69439d4509
10739C63961c510H9705J43512A8736b01224B56379E2209d42595b2543A28993l2735
$$ plain form
10728 96258 175869 -4919 167376 -238328 -265205 -11947 48824 174807 29304 -125215 -94762
10717 -94762 -289857 -48629 107474 -97546 5580 144362 205133 -287220 -371689 128364 89058
10706 89058 -226439 171761 -440973 -31201 -222763 -76222 3920 -160497 -377959 38652 -150542
10694 -135456 242438 -240901 -169591 8726 90617 67672 -8553 169751 130805 82469 -48879
10682 -322914 -232188 -147941 -16971 -361164 -68691 71645 128062 16585 117741 -218038 -97990
10670 599584 -166848 -284322 -173586 38174 -166463 -351133 -314108 -18037 -91540 -149316
10660 -149316 112231 275447 -229273 -437358 -74953 31270 -163614 -36557 52178 104751
10650 104751 240760 -130439 -230377 -153973 -66943 -71677 165955 178361 -100845 -36034 282242
$$ packed form
10728I6258P9611d919A67376b38328k6877a1947D8824J25983B9304a25215L0453
10717i4762j95095d8629A07474i7546E580J38782O0771b87220q4469A28364l9306
10706H9058b26439A71761d40973c1201j91562g6222C920a60497k17462C8652a50542
10694a35456B42438b40901P1310H726Q1891k2945h553A69751l8946m8336d8879
10682c22914R0726Q4247a6971l44193f8691G1645N6417A6585J01156b18038i7990
10670E99584a66848j17474J10736C8174a66463j84670L7025a8037p3503n7776
10660a49316A12231J63216b29273k08085g4953C1270a63614c6557E2178N2573
10650A04751J36009a30439r9938P6404f6943m734A65955J2406a00845c6034B82242
$$ plain form
10638 86764 141701 -165261 -62712 -183103 -245253 -356776 -71746 175454 -304067 39264 18365
10626 29220 -48603 -132351 76081 -222587 -91863 -250206 -172333 -5105 45601 4724 46611 -94903
10613 107671 -54396 78797 -40979 129080 -163662 -289527 -131314 -189619 -39681 -125491 92118
10601 78162 -117210 -96305 -381546 -243522 234214 125966 -259657 162810 4295 -20897
10590 -187853 -75640 146498 -140754 -44005 -223798 6887 -107674 -11744 106410 -213538
10579 -223443 -18688 -149115 -44644 -68251 25621 18414 -129602 -157452 87784 -12403 -142288
10568 -142288 -661774 -45342 -86332 258542 -288 42244 264350 -75106 338598 180556 -248359
10556 -59796 -72138 74826 -262735 36264 48269 -138897 192023 -115583 114500 130462 111246
$$ packed form
10638H6764N4937a65261f2712j20391o2150j11523g1746A75454c04067C9264A8365
10626B9220d8603q3748G6081b22587i1863j58343P7873e105D5601D724M1887i4903
10613A07671e4396G8797d0979A29080a63662j25865a31314n8305c9681q5810I2118
10601G8162a17210K0905k85241J38024B34214j08248b59657A62810D295b0897
10590a87853g5640A46498a40754d4005j79793F887a07674a1744A06410b13538
10579b23443a8688j30427d4644k3607B5621p207a29602k7850H7784a2403j29885
10568a42288n19486d5342m0990B58542b88D2244K22106g5106C38598j58042b48359
10556e9796j2342G4826b62735C6264J2005a38897A92023a15583A14500J5962j9216
$$ plain form
10545 111246 -33135 209615 -64283 196676 -234069 -154631 -215944 -140817 -75100 -271146 -49687
10533 -315273 -94549 -218149 -68231 273232 51701 37116 -26789 -126994 -79249 31056 -197634
10521 81717 -14711 17240 112324 186110 -36546 -21592 15787 -114098 -76762 -73902 187364
10509 61247 -239958 -1255 157391 163788 -90811 190401 40123 -451257 -67240 284589 -98152
10497 182244 -270820 93333 186574 -112488 -179833 -170952 -26352 -307274 -122964 30311 -36099
10485 45866 375662 -29809 64093 443236 432114 585641 449722 396205 566909 176123
10474 54130 354877 -29549 -190736 82600 240530 67770 -98999 -71485 127051 -17497 -38030
10463 -38030 -50380 -137529 -170571 -243014 -91171 221140 102580 -134549 257072 299001 202438
$$ packed form
10545A11246c3135B09615f4283A96676b34069P9438o1313P5127O5717j96046d9687
10533c15273i4549j23600f8231B73232E1701j4585b6789j00205M7745C1056a97634
10521H1717a4711A7240R5084P3786c6546J4954A5787a14098L7336K860A87364
10509F1247b39958a255A57391O397i0811A90401D0123d51257f7240B84589i8152
10497A82244b70820I3333R3241a12488o7345Q881b6352k80922a22964C0311c6099
10485D5866L29796b9809F4093L79143j1122J53527j35919n3517J70704A76123
10474E4130L00747b9549j61187H2600J57930F7770i8999K7514A27051a7497k0533
10463c8030j2350q7149l3042p2443i1171B21140A02580a34549B57072M1929r6563
$$ plain form
10452 202438 -162498 -269242 113315 -52363 -344652 297159 103565 142039 34807 30672
10442 30672 -189546 -81122 -279902 56754 86784 76298 1029 9261 20886 -268994 177954
10430 -806481 100021 -107953 -36366 -37503 -104452 -127266 -92572 193593 -71491 143938 -35360
10418 24503 23370 -66347 -242989 421698 -155725 116239 112560 -34306 146995 -98180 -221858
10407 -221858 -112945 139737 53794 -223193 -18427 -44699 133657 -324211 -49293 -308930
10397 -308930 -277721 -69030 -2376 95004 154052 33959 -42641 52075 -68581 260834 43422
10385 -5503 24859 -119759 181382 -156380 189371 61000 221922 314085 129284 202573 173107
10374 173107 301214 205988 215845 237557 574045 359235 95765 644100 555851 397889 406690
$$ packed form
10452B02438a62498j06744A13315e2363k92289B97159A03565L8474C4807m135
10442C0672a89546h1122j98780E6754L0030j0486A029Q232J1625b68994A77954
10430h06481A00021a07953c6366j137o6949k2814L4694A93593g1491A43938c5360
10418B4503j133f6347j76642D21698a55725A16239l679c4306A46995i8180j23678
10407b21858J08913A39737E3794b23193a8427k6272A33657c24211d9293k59637
10397c08930L1209f9030b376I5004N9048C3959d2641E2075f8581B60834D3422
10385e503B4859a19759A81382a56380A89371F1000J60922R2163A29284P3289k9466
10374A73107J28107r5226R857K1712L36488k14810I5765N48335q8249j57962Q801
$$ plain form
10363 406690 413578 156259 128162 454516 252625 69493 165473 61506 137455 51143 521675
10352 521675 235563 587286 221328 387049 514942 46206 446966 -21451 448068 410971
10342 410971 313580 333490 330389 293168 100817 188308 357518 245652 -195049 17162 63503
10331 63503 74365 -398960 98283 182386 -153299 282033 70293 214412 146958 31761 229509
10320 229509 485824 77923 63609 -92592 139655 193785 203266 253280 111010 -148755 -38583
10308 65642 201849 -160747 -169442 -111574 -19765 -323004 34237 47104 -43080 -288516 69689
10296 -94563 -166918 257452 72493 -77655 132111 -38362 -118084 -116426 -95901 182611 -127717
10284 223417 97412 -68043 -123037 -39612 -110063 229002 24675 -232575 -206401 272837 114565
$$ packed form
10363D06690O888A56259k8097L26354k01891F9493R5980F1506P5949E1143M70532
10352E21675B35563L51723B21328J65721J27893D6206M00760b1451D48068l7097
10342D10971r7391J9910l101l7221A00817Q7491J69210j11866a95049A7162M6341
10331F3503J0862c98960I8283Q4103a53299B82033G0293J44119o7454C1761J97748
10320B29509K56315G7923j4314i2592A39655N4130R481N0014A11010a48755c8583
10308F5642J36207a60747q695N7868a9765l03239C4237J2867d3080k45436F9689
10296i4563p2355B57452G2493g7655A32111c8362p9722J658K0525A82611a27717
10284B23417I7412f8043n4994c9612p0451B29002B4675b32575K6174B72837A14565
$$ plain form
10272 -78130 -265690 -4056 -60973 -257598 -155907 -10672 -213300 549524 6592 293958 173960
10261 173960 132562 466828 230750 406451 95359 404505 207776 329313 171068 394547
10251 394547 59 261659 181799 286057 -153584 -49978 119536 -148645 -65606 12813 -451596
10239 -341788 85371 -77829 160986 155184 -150896 271442 -14572 -129019 152041 51763 -199981
10227 -116340 -213339 -275113 11582 266768 -265004 169862 165588 -21756 -222040 -65365 210135
10215 -39398 277683 93220 -19895 -87945 149541 -23718 -179126 -155743 65196 136324 -162196
10203 100268 62789 -148730 66699 -234535 -31574 199702 -114272 -434736 -115205 -146131
10193 -146131 -138854 -19196 -178418 -73403 212746 120297 98575 -149291 -122447 -207637 -76524
$$ packed form
10272g8130j87560d056n6917j96625J01691a0672k02628E49524F592K87366j19998
10261A73960m1398L34266B30750J75701I5359L09146j96729J21537j58245K23479
10251C94547E9K61600p9860J04258a53584d9978A19536a48645f5606A2813d51596
10239c41788H5371g7829A60986n802a50896B71442a4572j14447A52041E1763a99981
10227a16340r6999o1774A1582K55186b65004A69862m274b1756k00284f5365B10135
10215c9398B77683I3220a9895o8050A49541b3718j55408K3383F5196P1128a62196
10203A00268l7479a48730F6699b34535c1574A99702a14272l20464a15205l0926
10193a46131P277a9196j59222g3403B12746r2449k1722a49291K6844q5190g6524
$$ plain form
10181 -106239 -248529 -53555 395 -401879 254295 -11092 81614 22378 -106682 172304 -18449
10169 91862 -23344 10739 -431981 27261 91183 -129962 40711 -84148 -130729 -118261 -102683
10158 -102683 -297571 -94906 6589 61389 190080 -22871 -8560 12605 -191940 -112930 -526179
10147 -526179 -215348 -3457 -11829 -239964 -46252 -79849 -30620 -85398 -348333 341729 -233966
10135 -126613 -131593 -284394 -230558 -57276 -64225 -217677 -283638 -238581 -54300 -221995 -206865
10124 -206865 -235989 7257 -166046 -81070 -297910 -81291 23690 -110439 -565139 -375708 158913
10112 -216319 82019 4568 -193059 -373497 -69153 112311 135446 -206433 -130802 39063 -43117
10100 -267573 -67437 -74865 318859 -267228 -12302 -72713 179503 -61562 31990 61690 -21316
$$ packed form
10181a06239j42290e3555C95d01879B54295a1092H1614B2378a06682A72304a8449
10169I1862b3344A0739d31981B7261O3922a29962D0711h4148m6581J2468J5578
10158a02683j94888i4906F589N4800J28691b2871h560A2605a91940P9010m13249
10147e26179b15348c457q372k28135d6252l3597c0620n4778k62935C41729b33966
10135a26613m980j52801N3836e7276o949j53452o5961M5057e4300j67695J5130
10124b06865k9124G257a66046h1070k16840h1291B3690a10439m54700J89431A58913
10112b16319H2019D568a93059j80438f9153A12311K3135b06433P5631C9063d3117
10100b67573f7437p428C18859b67228a2302o0411A79503f1562C1990K9700b1316
$$ plain form
10088 152254 194826 83437 -119916 -139867 -116113 -525570 37165 39084 99278 -115864 93233
10076 -5564 142773 -258638 -12524 65087 118247 -26134 -66048 37300 56048 -169500 -384101
10065 -384101 -217346 170078 37870 30027 -245658 -282785 -17510 -273732 -313500 163867 -325110
10053 -9045 -154020 174427 34800 -739850 165129 8741 -105295 -58616 138709 173218 -104784
10041 53975 -36293 -229125 66711 -96021 104794 250610 51989 -380389 220374 -236163
10030 -103200 -319254 -7509 -120721 -243309 -362710 -107524 -301381 -345382 261915 35344
10019 -237620 72557 -344829 -533275 -25536 -123839 -156200 -120562 103405 187946 34255 -113124
10007 -391098 -228519 124948 -45295 -70691 -242241 63750 -157259 127639 -192537 -127080
$$ packed form
10088A52254M2572H3437a19916j9951K3754m09457C7165J919O0194a15864I3233
10076e564A42773b58638a2524F5087N3160b6134l9914C7300J8748a69500k14601
10065c84101J66755A70078C7870p843b45658l7127a7510k56222l9768A63867c25110
10053i045j44975A74427C4800g39850A65129H741a05295M6679A38709L4509a04784
10041E3975c6293j92832F6711i6021A04794J45816E1989c80389B20374b36163
10030a03200k16054g509j13212j22588j19401a07524j93857m4001B61915C5344
10019b37620G2557c44829j88446b5536r8303l2361L5638A03405Q4541C4255a13124
10007c91098J62579A24948d5295k5396j71550F3750a57259A27639a92537O5457
$$ plain form
9997 -127080 303876 -119843 -27306 -16546 99004 284853 -164966 222769 -73723 336898
9986 -95065 -40927 -140071 71868 14920 26407 -171651 -289847 -48507 274002 -99084 122101
9974 -226827 -399797 -137709 36711 26129 -17417 52603 291838 64457 -23555 -65858 -85823
9963 -85823 -328984 65062 87636 -440595 -105547 173355 77258 107230 44629 -133069 -124453
9952 -124453 151172 90488 -148845 -105377 -254206 -151188 -147206 58872 122263 254324 122842
9940 -334404 -173985 -238164 177230 -317551 -182382 -68525 45174 -241459 -325542 254004
9929 -96197 -77986 154804 196091 282823 212580 -79367 -81155 -372655 -33435 147528 173300
9918 173300 110680 -251495 166517 -228402 -374337 144507 -478609 4090 -102195 80976
$$ packed form
9997a27080C03876a19843b7306J0760I9004J85849a64966B22769g3723C36898
9986i5065d0927r9144G1868A4920J1487a71651j18196d8507B74002i9084A22101
9974b26827j72970a37709C6711j0582a7417E2603K39235F4457b3555m2303j9965
9963h5823k43161F5062K2574d40595a05547A73355G7258K9972D4629a33069Q616
9952a24453A51172o0684a48845M3468j48829J03018L982E8872O3391J32061A22842
9940c34404J60419o4179A77230c17551J35169f8525D5174b41459q4083B54004
9929i6197J8211A54804M1287Q6732p0243g9367j788k91500c3435A47528K5772
9918A73300o2620b51495A66517b28402j45935A44507d78609D090a02195H0976
$$ plain form
9907 -4526 -126718 -127998 -83706 -169723 -190676 -138886 243672 45051 93117 -23465 -207952 -126336
9895 -126336 -241946 -368940 -221373 -108253 -80733 -8473 -264375 235388 -37044 -108914 -263880
9884 -263880 -207253 -75677 172622 -187467 -235747 35661 -173495 -121457 -37256 122694 -245413
9872 158211 -267732 -18194 -69913 -227203 292838 -48971 -51167 69141 148690 45642 162801
9861 162801 -42558 -97493 -127642 -416523 -179888 105384 201559 -39683 130571 -345840 195774
9849 -161 -72856 -38461 69858 -107677 -223253 -145495 49899 -239283 255248 -193000 -49312
9837 -88034 -59276 -64649 -31667 -269518 117822 216508 -281856 -232199 -414829 290569 -45314
9825 -200883 66950 -409945 -37519 -38911 -53536 -263077 -145199 -188185 -112891 -517933 -104314
$$ packed form
9907d526j22192j280M4292q6017k0953N1790B43672D5051M8066b3465j84487Q1616
9895a26336j15610j26994J47567a08253K7520h473k55902B35388c7044p1870j54966
9884b63880N6627g5677A72622a87467m8280C5661a73495N2038c7256A22694b45413
9872A58211b67732a8194n1719j57290B92838d8971k196F9141P9549D5642J17159
9861A62801d2558n4935l0149k88881a79888A05384R6175c9683A30571c45840A95774
9849a61p2695L4395F9858a07677j15576P7758D9899b39283B55248a93000d9312
9837h8034K8758n373c1667k37851A17822R8686b81856M9657j82630B90569d5314
9825b00883F6950d09945c7519j392j4625k09541J17878m2986P5294m05042a04314
$$ plain form
9813 43636 -99896 -224171 -138038 62660 200861 151158 -312258 -275254 -131181 219777 105438
9801 -151948 -217758 8057 -268187 -179721 -44385 -14853 158316 -233475 -54947 -431589 214823
9789 -150488 -122592 49382 -135441 1314 -617376 51268 366839 -329512 -9548 -292846 -222453
9778 -222453 297810 -24095 7541 -238068 -201591 -64618 173433 -29794 -178736 -172584 114555
9766 6545 -304930 -214881 76178 36327 -125175 152283 5227 80712 -88081 -214987 -105771
9754 -102219 97642 335834 -106862 29652 203500 -67208 -335564 -14835 -230467 137815
9743 99671 -252010 -107269 -13563 -132314 -315514 -147367 -74797 162556 51539 -121875
9732 -250918 -292033 -14918 -407133 139338 17311 -33677 -13596 -126668 -286433 -265690 -30583
$$ packed form
9813D3636i9896j24275Q6133F2660J38201m9703c12258L7004a31181B19777A05438
9801a51948o5810H057b68187Q8466d4385a4853A58316b33475e4947l76642B14823
9789a50488K7896D9382a35441A314f17376E1268L15571c29512i548k83298P0393
9778b22453B97810b4095G541b38068L6477f4618A73433b9794j48942O152A14555
9766F545c04930R0049G6178C6327a25175A52283E227P5485h8081j26906a05771
9754a02219I7642K38192a06862B9652J73848f7208k68356a4835k15632A37815
9743I9671b52010a07269a3563j18751j83200a47367P2570A62556E1539a21875
9732b50918m1115a4918l92215A39338A7311c3677a3596j13072j59765K0743c0583
$$ plain form
9720 -98744 -253973 63587 -18532 52420 248112 100902 -115876 -351612 -153612 347428
9709 97459 -105935 -159359 -192644 29168 -110568 94289 -61344 -35653 11014 -83501 -189160
9698 -189160 -400047 -181227 -270571 -176207 221021 -29120 87386 133325 -185150 57270 -265249
9686 -47122 -112428 -334614 62127 106424 39059 -175037 47845 189582 -421094 48013 30855
9675 30855 -194282 -61180 -81986 -216417 -375614 -117279 -47772 231945 -69974 -177372 25126
9663 -248916 50595 -175032 29597 -139486 -256232 -320592 218385 264294 -90269 -86662 -60460
9652 -60460 -123287 -91874 -147559 70541 -24374 -57762 11507 146396 -34289 -46011 17362 2860
9639 100144 53753 188200 -312671 43950 -299553 -284264 -36233 19897 113790 -229246 120741
$$ packed form
9720i8744j55229F3587a8532E2420J95692A00902a15876k35736a53612C47428
9709I7459a05935n3424l3285B9168a10568I4289f1344K5691A1014h3501j05659
9698a89160k10887a81227q9344R4364B21021b9120H7386M5939a85150E7270b65249
9686d7122o5306k22186F2127M4297C9059a75037D7845J41737d21094D8013j7158
9675C0855a94282f1180k0806j34431j59197a17279d7772B31945f9974j07398B5126
9663b48916E0595a75032B9597a39486j16746o4360B18385M5909i0269L607K6202
9652f0460o2827L1413n5685G0541b4374l3388A1507J34889c4289j1722A7362B860
9639A00144m6391J34447c12671D3950b99553J5289c6233A9897R3893b29246A20741
$$ plain form
9627 -82746 -58103 -330436 24044 -273012 95267 -107962 347152 -53120 -154233 25069 -25592
9615 283490 15068 -276917 -369329 -150929 -3673 -28782 -382463 -400332 27577 -137089 126200
9603 -180185 -91836 -143121 80060 -288187 -160328 325862 -225981 113684 -248220 -226395
9593 -226395 -110078 120578 78491 160653 -59615 -51914 -29835 -121230 63140 -210241 -403356
9582 -403356 16054 108982 -32898 395701 32384 -257465 -137984 -53592 -155836 -125249 -266273
9571 -266273 -113096 -47548 100430 -87133 -191916 13951 103195 -122410 48542 15294 -517690
9559 -20390 -79865 -170569 42425 -416815 230691 40584 144529 62753 57084 -72129 151103
9547 -139034 89688 259856 -24584 -107665 -169167 -24729 -176651 87702 -39011 -298793 -163775
$$ packed form
9627h2746K4643k72333B4044b73012I5267a07962C47152e3120j01113B5069b5592
9615B83490A5068b76917r2412a50929c673k5109l53681j7869B7577a37089A26200
9603a80185Q8349n1285H0060b88187J27859C25862b25981A13684b48220K1825
9593b26395a10078A20578m2087Q2162e9615P701K2079r1395F3140b10241j93115
9582d03356A6054R2928c2898C95701C2384b57465J19481e3592j02244L0587j41024
9571b66273a13096d7548A00430h7133j04783A3951Q9244a22410D8542A5294e17690
9559b0390n9475r0704D2425d16815B30691D0584J03945F2753n669g2129A51103
9547a39034H9688J70168b4584q3081o1502b4729j51922H7702c9011k59782J35018
$$ plain form
9536 -163775 -69941 -326186 -99171 -194765 -185393 -26111 66675 19364 -245820 60562 -63807
9524 -112630 143045 276331 -4915 -84152 -292709 -103207 42345 -235178 104258 166445 -240831
9512 -117632 115734 75389 -15316 180843 -140323 60806 -310241 197582 57706 -91832 -38940
9500 6669 5034 -1385 -22547 -148381 -321043 -205623 -190458 -122275 -433807 -283348 231549
9488 -240604 67273 -51301 -232940 115969 -322994 73824 123953 58302 -181171 -5751 65818
9476 -256026 100143 -14688 -195477 -37707 -171860 -136887 32730 181182 234018 -188099 54953
9464 -380315 -329742 -156319 -279712 -61828 1043 98981 -106692 -240137 -300653 -112184 -51526
9452 57986 -208593 185640 -255772 27181 120247 -83142 188909 -50410 -16266 -459613 54800
$$ packed form
9536a63775f9941k56245i9171r5594R372b6111F6675A9364b45820F0562f3807
9524a12630A43045J33286d915p9237k08557a03207D2345b35178A04258O2187b40831
9512a17632A15734m0345a5316A80843a40323F0806c10241A97582E7706i1832c8940
9500F669j635a385k1162j25834j72662J15420J5165O8183l11532J50459B31549
9488b40604F7273e1301j81639A15969c22994G3824N0129E8302a81171e751F5818
9476b56026A00143a4688j80789c7707j34153L4973C2730J48452N2836a88099E4953
9464c80315N0573a56319j23393f1828A043R7938a06692j33445o0516a12184e1526
9452E7986b08593A85640b55772B7181R3066h3142A88909e0410a6266m43347E4800
$$ plain form
9440 5455 12761 -34835 -196905 -130513 140283 186362 -68118 -66314 191232 -77312 -285300 -35524
9427 -227550 -206530 -65862 -407834 -280792 -223229 111857 -356770 -125894 -104395 -458795
9417 -458795 -324812 -196545 163369 191489 3993 -143524 79619 -362139 -316385 -25542 305691
9405 -11370 403087 -106980 -255844 158981 -90155 -169173 -244724 219217 -40986 134641 186877
9394 186877 -217069 54482 -321091 317614 72017 156202 8638 -4702 -92621 40555 -189783
9382 -150890 109764 -245385 -79161 71419 -25503 -290803 -274543 25916 91504 130798 -92778
9370 6717 167331 -26830 -189697 185814 -92606 -97461 -71007 6238 -166738 -78184 44961 32501
9358 32501 331329 9731 -332376 97166 -69045 23753 -36644 -398691 -139257 -143445 -213473
$$ packed form
9440E455P306c4835j62070O6392A40283M6079f8118J804A91232g7312k07988c5524
9427b27550K1020f5862l41972J27042N7563A11857c56770a25894K1499l54400
9417d58795J33983J28267A63369K8120C993a43524G9619c62139M5754b5542C05691
9405a1370D03087a06980j48864A58981i0155p9018p5551B19217d0986A34641N2236
9394A86877b17069E4482c21091C17614G2017Q4185H638d702q7919D0555a89783
9382a50890A09764b45385g9161G1419b5503k65300J6260B5916O5588L9294i2778
9370F717J60614b6830j62867A85814i2606m855K6454F238a66738g8184D4961j2460
9358C2501K98828I731c32376I7166f9045B3753c6644l62047a39257m188p0028
$$ plain form
9347 -213473 247018 -369342 108486 -199084 46632 81917 75059 -40419 -177720 54314 -17808
9335 145219 -116124 -56473 33129 -52088 -374358 -313727 -151644 -314113 -55643 134308 147555
9324 147555 -324340 -35614 111470 -311943 -88462 -166392 -132545 -293647 118406 -356027
9313 -46482 -323176 -7477 10357 -217336 -621635 49892 -99527 7829 150916 -417605 19723
9301 -150661 63218 -138325 66461 -50257 -143813 -143613 -180065 7476 300593 -7745 -224927 -192658
9289 -192658 -341023 -167642 18772 21990 -194662 181318 -277178 167754 -36666 181977
9278 -160188 41400 90909 -110581 97239 -270879 86838 -7483 101589 -320521 -183035 -310642
9267 -310642 -220525 -167621 -134954 -257800 76914 -79478 -249125 96222 132367 -24130 50077
$$ packed form
9347b13473B47018c69342A08486a99084D6632L5285o858d0419j37301E4314a7808
9335A45219a16124e6473C3129e2088l22270O0631a51644j62469e5643A34308J3247
9324A47555c24340c5614A11470c11943h8462p7930L3847j61102A18406c56027
9313d6482k76694g477A0357b17336m04299D9892i9527G829J43087d17605A9723
9301a50661F3218a38325F6461e0257r3556K00l6452G476K93117g745k17182L2269
9289a92658j48365a67642A8772L218a94662A81318b77178A67754c6666A81977
9278a60188D1400M9509a10581I7239b70879H6838g483A01589c20521J37486j27607
9267c10642R0117N2904L2667j22846G6914g9478j69647I6222L6145b4130E0077
$$ plain form
9255 -137024 203460 -93612 258974 -24254 -326067 -209317 -61284 231194 -353992 -97078
9244 -233031 -117947 -176241 36747 -105164 99288 171204 198370 216265 230505 150562 -291005
9232 -172514 -73144 13367 -209996 -6176 -70735 211283 -278755 67676 -84985 -164794 -323001
9221 -323001 289222 -32467 -145142 -125823 78182 157809 -437679 110819 75714 225787 115080
9210 115080 -41189 -223811 100689 293914 -195394 46774 -122669 -195023 287184 -104701
9199 20240 18664 28950 319075 -103705 72931 -35090 -249818 39715 48600 -112869 -167367
9188 -167367 -174075 -169014 -272908 -107763 167269 -18057 60916 201365 -83635 -202008 -20448
9176 -10838 -58346 -96847 70535 72789 -1021 36138 248669 126097 -109068 -330680 -2689 119894
$$ packed form
9255a37024B03460i3612B58974b4254l01813J16750f1284B31194c53992i7078
9244b33031J15084n8294C6747a05164I9288P1916K7166J7895J4240p9943b91005
9232a72514g3144A3367b09996f176o4559B11283b78755F7676h4985p9809j58207
9221c23001B89222c2467j12675J9319G8182P9627d37679A10819l5105J50073j10707
9210A15080d1189j82622A00689J93225a95394D6774a22669p2354B87184a04701
9199B0240j576J0286K90125a03705G2931c5090k14728C9715Q885a12869n4498
9188a67367o708N061j03894a07763A67269a8057F0916J40449h3635j18373b0448
9176a0838m7508l8501G0535K254a021C6138K12531j22572a09068k21612b689A19894
$$ plain form
9163 378159 42122 -22363 -548793 145921 45211 74469 -112922 -127985 -122212 -3676 -15769
9152 -15769 -74966 148094 -50530 -213691 -43798 -127267 -106686 -222530 -205996 -26689 -261411
9141 -261411 108045 273804 -27568 101041 -160394 167060 -360915 110372 -328247 -51743
9130 -171116 -173715 5384 -95180 -234609 -289286 -195361 163347 -149667 39088 42490 -147796
9118 -93091 -109480 17667 -343263 -163234 307273 -98467 -240983 -272433 110969 -187218 -122516
9107 -122516 205128 -96321 -122677 -120628 207749 65895 -58582 77857 49358 119779 23347
9095 119633 152021 -17202 240811 308964 55555 49799 -259965 -120924 -435826 -94958 -50751
9084 -50751 210161 11255 -77177 -433083 -414460 -393403 -88190 -281197 -167624 -76805 -21977
$$ packed form
9163C78159D2122b2363n26430A45921D5211K9258a12922j5063N773c676j2093
9152a5769n9197A48094e0530j63161d3798q3469K0581j15844J6534b6689k34722
9141b61411A08045J65759b7568A01041a60394A67060c60915A10372c28247e1743
9130a71116k599E384i5180j39429n4677R3925A63347a49667C9088L402a47796
9118i3091j6389A7667c43263a63234C07273i8467j42516l1450A10969a87218O4702
9107a22516B05128i6321k6356K049B07749F5895e8582G7857k8499P0421B3347
9095A19633L2388a7202B40811O8153E5555n756b59965a20924l14902i4958M4207
9084e0751B10161A1255g7177l55906J8623K1057h8190j93007J13573g6805b1977
$$ plain form
9072 246693 84655 -285794 -35547 -236866 95858 -347438 17366 -187162 117979 25473 96627
9061 96627 268783 11930 -175722 48097 194338 -362298 174967 -3856 -151741 -51828 -244592
9050 -244592 33958 4156 135214 266030 -259440 24022 -574550 142930 -24014 39240 -106211
9038 -3490 36838 -113705 -29748 92300 68872 -207154 30171 -7131 -331910 170371 -196326
9026 -305301 -112565 -41043 -9098 -129490 -92103 -78930 56037 -118321 -153114 -230282 -245548
9015 -245548 21036 -15395 -235319 -330855 -30699 -122857 -194344 389122 -33969 -35769 -238384
9004 -238384 52689 -298513 -217967 -127195 -12856 -48155 15400 -134298 -31567 137008 170702
8993 170702 -11110 -87704 -390583 114801 -315863 11974 38364 -138663 -99122 -149451 165362
$$ packed form
9072B46693H4655b85794c5547k01319I5858c47438A7366a87162A17979B5473P1154
9061I6627J72156A1930a75722D8097J46241c62298A74967c856j47885e1828j92764
9050b44592C3958D156J31058J30816b59440B4022e74550A42930b4014C9240a06211
9038c490C6838a13705b9748I2300k3428b07154C0171g131l24779A70371a96326
9026c05301a12565d1043i098j20392L7387J3173E6037a18321l4793p7168j5266
9015b45548B1036a5395k19924r5536c0699r2158p1487C89122c3969j800k02615
9004b38384E2689b98513Q0546R0772a2856l5299A5400a34298c1567A37008L3694
8993A70702a1110p6594l02879A14801c15863A1974K6390a38663L9541n0329A65362
$$ plain form
8981 -48104 210728 -64642 38629 -173246 -64374 -285590 -151231 -141741 95965 166630 29790
8969 113179 70543 161599 -157852 -242030 -121275 -197862 35262 -99710 444444 129184 -260426
8957 86402 -64455 -325271 -101605 94613 -41455 -283556 -46116 -179074 -148963 -3184 -205441
8946 -205441 -340696 -100199 28591 -60164 214010 6095 26340 23402 -137876 -225026 265774
8934 216637 507236 160437 219586 102460 -233275 79995 94235 157736 203472 659612 1244253
8923 1244253 3130761 10749870 19477809 5615051 2083559 639300 709782 158126 -183696
8913 69317 -155429 167793 29801 163201 177464 363402 328796 -50477 240990 -192990 -34298
8901 312377 -203557 218631 -172228 -252400 -134679 -53451 88109 41988 -79626 -301979 -120992
$$ packed form
8981d8104B10728f4642C8629a73246f4374k21216J34359R490I5965P0665B9790
8969A13179m2636R1056a57852q4178J20755p6587C5262i9710D44444A29184b60426
8957H6402f4455k60816a01605I4613d1455k42101d6116j32958L0111c184k02257
8946b05441j35255a00199B8591f0164B14010F095K0245k938a37876q7150B65774
8934B16637K90599A60437N9149A02460b33275G9995J4240O3501M5736M56140N84641
8923A244253J886508P619109Q727939E615051B083559F39300P0482A58126a83696
8913F9317a55429A67793B9801J33400J4263J85938l4606e0477B40990a92990c4298
8901C12377b03557B18631a72228q0172J17721e3451H8109D1988g9626k22353a20992
$$ plain form
8889 -270773 -160121 -54337 -37372 -160773 -38850 -81832 151287 8086 14596 65576 -90111
8877 70722 146265 138723 -134865 40025 -176364 252679 -227075 197920 -203138 -116837 -137310
8866 -137310 66 -293855 21178 161710 -232882 -163799 -41841 -13192 6731 -235770 -36128 -130396
8854 -130396 -155058 171250 -238412 162884 -291921 253390 28933 -86257 148283 309157
$$ packed form
8889b70773J10652e4337J6965j23401c8850m2982A51287H086O510N0980i0111
8877G0722P5543p542a34865D0025a76364B52679b27075A97920b03138Q6301k0473
8866a37310F6b93855B1178J40532b32882O9083d1841a3192F731b35770c6128r4268
8854a30396k4662A71250b38412A62884b91921B53390B8933h6257A48283J60874
$$ [...]
##END NTUPLES=NMR SPECTRUM
##END=
