##TITLE=AC1480_CUNDIAS13306_8101136_fXrxJl3XZk
##JCAMPDX= 6.0         $$ Bruker NMR JCAMP-DX V2.0
##DATA TYPE= NMR SPECTRUM
##DATA CLASS= NTUPLES
##ORIGIN= BRUKER
##OWNER= Administrator
$$ 1.72 TOPSPIN		Version 2.1
$$ 2013-08-15 18:36:45.494 -0700  Administrator@X
$$ Compression mode = diff/dup
##.OBSERVE FREQUENCY= 400.02188249412
##.OBSERVE NUCLEUS= ^1H
##.ACQUISITION MODE= SIMULTANEOUS (DQD)
##.ACQUISITION SCHEME= undefined
##.AVERAGES= 8
##.DIGITISER RES= 22
##SPECTROMETER/DATA SYSTEM= spect
##.PULSE SEQUENCE= zg30
##.SOLVENT NAME= COFFEE_meoh
##.SHIFT REFERENCE= INTERNAL, COFFEE_meoh, 1, 14.98509
##AUDIT TRAIL= $$ (NUMBER, WHEN, WHO, WHERE, PROCESS, VERSION, WHAT)
$$ ##TITLE= Audit trail, TOPSPIN		Version 2.1
$$ ##JCAMPDX= 5.01
$$ ##ORIGIN= Bruker BioSpin GmbH
$$ ##OWNER= Administrator
$$ $$ E:\/data/COFFEE/nmr/AC1480_CUNDIAS13306_8101136_fXrxJl3XZk/20/pdata/1/auditp.txt
$$ ##AUDIT TRAIL=  $$ (NUMBER, WHEN, WHO, WHERE, PROCESS, VERSION, WHAT)
(   1,<2013-08-15 18:36:38.790 -0700>,<Administrator>,<X>,<go>,<TOPSPIN 2.1>,
      <created by zg
	started at 2013-08-15 18:35:32.165 -0700,
	POWCHK enabled, PULCHK disabled,
       configuration hash MD5:
       C8 4E 4E 5D D3 5C D8 9E 9F 52 82 E0 59 8A DE 15
       data hash MD5: 64K
       88 00 FB 14 A8 43 F2 22 91 F4 A2 5A AD 58 21 E7>)
(   2,<2013-08-15 18:36:41.712 -0700>,<Administrator>,<X>,<proc1d>,<TOPSPIN 2.1>,
      <Start of raw data processing
       efp LB = 0 FT_mod = 6 PKNL = 1 PHC0 = 0 PHC1 = 0 SI = 32K 
       data hash MD5: 32K
       61 2E DB 04 2A 06 38 17 85 29 6A 83 1E 20 15 D3>)
(   3,<2013-08-15 18:36:42.072 -0700>,<Administrator>,<X>,<proc1d>,<TOPSPIN 2.1>,
      <pk PHC0 = 98.91541 PHC1 = 0 
       data hash MD5: 32K
       A2 17 23 1B A1 3C C6 58 13 AA B3 D4 66 89 EF D1>)
(   4,<2013-08-15 18:36:42.212 -0700>,<Administrator>,<X>,<proc1d>,<TOPSPIN 2.1>,
      <abs ABSG = 1 
       data hash MD5: 32K
       9E 73 21 5D 41 A2 DF 07 F5 CD B5 1C 95 77 16 CD>)
(   5,<2013-08-15 18:36:42.290 -0700>,<Administrator>,<X>,<proc1d>,<TOPSPIN 2.1>,
      <abs ABSG = 2 
       data hash MD5: 32K
       B2 DE 58 03 55 E6 F2 73 F4 B0 24 56 2D 49 B4 B3>)
(   6,<2013-08-15 18:36:42.353 -0700>,<Administrator>,<X>,<proc1d>,<TOPSPIN 2.1>,
      <abs ABSG = 3 
       data hash MD5: 32K
       44 9F BA AF B0 71 00 F5 D1 85 DA CC E7 BD 48 EF>)
(   7,<2013-08-15 18:36:42.415 -0700>,<Administrator>,<X>,<proc1d>,<TOPSPIN 2.1>,
      <abs ABSG = 4 
       data hash MD5: 32K
       AB B9 64 34 4C 65 AB 60 14 22 C1 8B AE 7D 44 4B>)
(   8,<2013-08-15 18:36:42.478 -0700>,<Administrator>,<X>,<proc1d>,<TOPSPIN 2.1>,
      <abs ABSG = 5 
       data hash MD5: 32K
       51 82 EF 33 61 15 BD 94 34 0D E5 26 BC F7 76 97>)
$$ ##END=
$$ 
$$ $$ hash MD5
$$ $$ C3 14 1A 88 B0 F1 1B 95 BC 04 BF 20 08 05 30 1B
##$RELAX= 
##$RELAX= 
##$RELAX= 
##$RELAX= 
##$RELAX= 
##$RELAX= 
##$RELAX= 
$$ Bruker specific parameters
$$ --------------------------
##$DU= <E:\>
##$EXPNO= 20
$$ [...]
150 150 150 150 150 150 150 150
##$TP07= 0
##$TPNAME0= <>
##$TPNAME1= <>
##$TPNAME2= <>
##$TPNAME3= <>
##$TPNAME4= <>
##$TPNAME5= <>
##$TPNAME6= <>
##$TPNAME7= <>
##$TPOAL= (0..7)
0.5 0.5 0.5 0.5 0.5 0.5 0.5 0.5
##$TPOFFS= (0..7)
0 0 0 0 0 0 0 0
##$TUNHIN= 0
##$TUNHOUT= 0
##$TUNXOUT= 0
##$USERA1= <user>
##$USERA2= <user>
##$USERA3= <user>
##$USERA4= <user>
##$USERA5= <user>
##$V9= 5
##$VALIST= <valist>
##$VCLIST= <CCCCCCCCCCCCCCC>
##$VD= 0
##$VDLIST= <DDDDDDDDDDDDDDD>
##$VPLIST= <PPPPPPPPPPPPPPP>
##$VTLIST= <TTTTTTTTTTTTTTT>
##$WBST= 1024
##$WBSW= 4
##$XGAIN= (0..3)
0 0 0 0
##$XL= 0
##$YL= 0
##$YMAX_a= 647097
##$YMIN_a= -551232
##$ZGOPTNS= <>
##$ZL1= 120
##$ZL2= 120
##$ZL3= 120
##$ZL4= 120
##$ABSF1= 14.98509
##$ABSF2= -5.573092
##$ABSG= 5
##$ABSL= 3
##$ALPHA= 0
##$AQORDER= 0
##$ASSFAC= 0
##$ASSFACI= 0
##$ASSFACX= 0
##$ASSWID= 0
##$AUNMP= <proc_prof1d_extract_pilot.lims>
##$AXLEFT= 0
##$AXNAME= <>
##$AXNUC= <1H>
##$AXRIGHT= 0
##$AXTYPE= 0
##$AXUNIT= <>
##$AZFE= 0.1
##$AZFW= 0.1
##$BCFW= 0
##$BC_mod= 0
##$BYTORDP= 0
##$COROFFS= 0
##$CY= 15
##$DATMOD= 1
##$DC= 0
##$DFILT= <>
##$DTYPP= 0
##$F1P= 0
##$F2P= 0
##$FCOR= 0.5
##$FTSIZE= 32768
##$FT_mod= 6
##$GAMMA= 0
##$GB= 0
##$INTBC= 1
##$INTSCL= 1
##$ISEN= 128
##$LB= 0
##$LEV0= 0
##$LPBIN= 0
##$MAXI= 10000
##$MC2= 0
##$MEAN= 0
##$ME_mod= 0
##$MI= 0
##$NCOEF= 0
##$NC_proc= -8
##$NLEV= 6
##$NOISF1= 0
##$NOISF2= 0
##$NSP= 0
##$NTH_PI= 0
##$NZP= 0
##$OFFSET= 14.98509
##$PC= 1
##$PHC0= 98.91541
##$PHC1= 0
##$PH_mod= 1
##$PKNL= yes
##$PPARMOD= 0
##$PPDIAG= 0
##$PPIPTYP= 0
##$PPMPNUM= 2147483647
##$PPRESOL= 1
##$PSCAL= 4
##$PSIGN= 0
##$PYNMP= <proc.py>
##$REVERSE= no
##$SF= 400.02
##$SI= 32768
##$SIGF1= 0
##$SIGF2= 0
##$SINO= 400
##$SIOLD= 32768
##$SPECTYP= <>
##$SREGLST= <1H.CDCl3>
##$SSB= 0
##$STSI= 32768
##$STSR= 0
##$SW_p= 8223.68421052631
##$SYMM= 0
##$S_DEV= 0
##$TDeff= 65536
##$TDoff= 0
##$TI= <>
##$TILT= no
##$TM1= 0
##$TM2= 0
##$TOPLEV= 0
##$USERP1= <user>
##$USERP2= <user>
##$USERP3= <user>
##$USERP4= <user>
##$USERP5= <user>
##$WDW= 1
##$XDIM= 32768
##$YMAX_p= 451767882
##$YMIN_p= -772158
##$CURPLOT= <Network HP LaserJet P1505>
##$CURPRIN= <$Network HP LaserJet P1505>
##$DFORMAT= <normdp>
##$LAYOUT= <+/1D_H.xwp>
##$LFORMAT= <normlp>
##$PFORMAT= <normpl>
##$SURQMSG= 1
$$ End of Bruker specific parameters
$$ ---------------------------------
##NTUPLES= NMR SPECTRUM
##VAR_NAME=  FREQUENCY,     SPECTRUM/REAL,   SPECTRUM/IMAG
##SYMBOL=    X,             R,               I
##VAR_TYPE=  INDEPENDENT,   DEPENDENT,       DEPENDENT
##VAR_FORM=  AFFN,          ASDF,            ASDF
##VAR_DIM=   32768,         32768,           32768
##UNITS=     HZ,            ARBITRARY UNITS, ARBITRARY UNITS
##FACTOR=    0.250966925370066, 1,           1
##FIRST=     8223.43324360094, -89896,       -211314
##LAST=      0,             -184581,         -12759
##MIN=       0,             -772158,         0
##MAX=       8223.43324360094, 451767882,    0
$$ Real data points
##PAGE= N=1
##DATA TABLE= (X++(R..R)), XYDATA
$$ [...]
19529a29084p1973f0673G636L855h030A72280c7647j88749B03440K0818a11124
$$ -129084 -201057 -60673 7636 11491 -8030 172280 -37647 -226396 203440 224258 -111124
19517A29389a39442d8686m6392B362i4619M3117l49586D8932N3867L13232c38258
$$ 129389 -139442 -48686 -95078 2362 -94619 -51502 -401088 48932 102799 416031 -338258
19505A61092c35746D40413A32316e7042D9076g153j10695a3388j91369M2803A69588
$$ 161092 -335746 440413 132316 -57042 49076 -7153 -117848 -13388 -204757 -161954 169588
19493a93697O4664F1395J24908a37126m6443A97847K4638a71127j28115a14160
$$ -193697 -129033 61395 186303 -137126 -183569 197847 222485 -171127 -299242 -114160
19482c04658k0698I3326b55391j5680F1811C175e7985l09749A60532O1514H8099
$$ -304658 -325356 93326 -255391 -271071 61811 3175 -57985 -367734 160532 222046 88099
19470c50593C7422e6977o6078B61158N18C4593b75441J17693j8488A6226N4382
$$ -350593 37422 -56977 -123055 261158 261676 34593 -275441 -157748 -176236 16226 70608
19459G0608a33043B30182j10570a9282B66116D3643b98669C1985j370c9108E4417
$$ 70608 -133043 230182 119612 -19282 266116 43643 -298669 31985 30615 -39108 54417
19447I2839b01682G8691J74991B5063J1671A1365a00663j2708j03215i9228B1081
$$ 92839 -201682 78691 253682 25063 36734 11365 -100663 -113371 -216586 -99228 21081
19435D17840g4172f495b101j15263k13425a62545g1573C917b55791j19457D973
$$ 417840 -74172 -6495 -2101 -117364 -330789 -162545 -71573 3917 -255791 -375248 4973
19423I1384a57550F61b52641g2477F3600J70169r9820h9310B13314A9720b58618
$$ 91384 -157550 661 -252641 -72477 63600 233769 133949 -89310 213314 19720 -258618
19411A75667B1030d319A18415a28851A09425d1284B11194b50632a02530j5584
$$ 175667 21030 -4319 118415 -128851 109425 -41284 211194 -250632 -102530 -118114
19401a18114N1481L1553r3589H7116B6817b34395Q9446d5480F5710J18776G0494
$$ -118114 -66633 -35080 -128669 87116 26817 -234395 -144949 -45480 65710 184486 70494
19389b36665J9352A48645m4567L4253e4291A06894a49425F4969L47563a02360
$$ -236665 -217313 148645 104078 138331 -54291 106894 -149425 64969 412532 -102360
19378C7776N9779a87403K0762A76217d0468j90886A44694G0863o466c08594B27408
$$ 37776 97555 -187403 -166641 176217 -40468 -231354 144694 70863 64397 -308594 227408
19366h0695L3520a0386C4624K00129r5791k1012A6464K18032m716b05288k4192
$$ -80695 -47175 -10386 34624 234753 138962 117950 16464 234496 229780 -205288 -229480
19355b29480a08309l2853C53715C5660f6922o274a7936j1136A59849e7140K8494
$$ -229480 -108309 -141162 353715 35660 -66922 -73196 -17936 -29072 159849 -57140 -28646
19344b8646H0530b17516J06577k4298A9525c94639f0446F5154a62610O7618j76107
$$ -28646 80530 -217516 -110939 -135237 19525 -394639 -60446 65154 -162610 -94992 -271099
19333b71099q4794J38702C2780c28877C504a22456d7679O228m1666E8354c1756
$$ -271099 -355893 -217191 32780 -328877 3504 -122456 -47679 -41451 -83117 58354 -31756
19321a93783M3532A96628c59547i0882j09194f7487L1253D4612i249B54958c57838
$$ -193783 -150251 196628 -359547 -90882 -200076 -67487 -36234 44612 -9249 254958 -357838
19309h6143A76150a44950j15980A23459b8923m3382H9235a77565c45j69055r5179
$$ -86143 176150 -144950 -260930 123459 -28923 -72305 89235 -177565 -345 -169400 -264579
19298b64579B19891c08422g5453b2209A95242q3132b510D1954a14774A8410k427
$$ -264579 219891 -308422 -75453 -22209 195242 112110 -2510 41954 -114774 18410 15983
19287A5983a05125d486p587j98777j30083E766a22200A75086B7363c27334a48611
$$ 15983 -105125 -4486 -12073 -210850 -340933 5766 -122200 175086 27363 -327334 -148611
19275C0932b53456g8471j01654j86979J42008g9028m04626b27403m7191K7614
$$ 30932 -253456 -78471 -180125 -367104 -225096 -79028 -483654 -227403 -274594 -246980
19265b46980a12839K7007m7764B41378b00087h4271J4833H7206e8428k15238F5491
$$ -246980 -112839 -85832 -133596 241378 -200087 -84271 -69438 87206 -58428 -273666 65491
19253e7414n0888p6117Q0531j90104a39150A59924D3757b88774B0435K17181b4387
$$ -57414 -108302 -184419 -103888 -293992 -139150 159924 43757 -288774 20435 237616 -24387
19241B8472K4200d4252E5182B1838Q35R7099n6422J33195b54685j13817E9067
$$ 28472 52672 -44252 55182 21838 22673 119772 63350 196545 -254685 -368502 59067
19229b4709A87735m7548b33565c0525o0442j13640L7103N5081G0290c50119A20517
$$ -24709 187735 140187 -233565 -30525 -90967 -204607 -167504 -112423 70290 -350119 120517
19217h3436E089I68i8245D2513i8842B04468a07933p1925J9571a6930F6480f8436
$$ -83436 5089 968 -98245 42513 -98842 204468 -107933 -179858 -160287 -16930 66480 -68436
19204a83224r4095j67250P1586j61838a88396H2947b92061A40466b06847k6851
$$ -183224 -277319 -444569 -372983 -534821 -188396 82947 -292061 140466 -206847 -233698
19194b33698A35630a69746P705H2774c01404F9724k3380H56b66572j5516K4552
$$ -233698 135630 -169746 -162041 82774 -301404 69724 46344 856 -266572 -282088 -257536
19183b57536m0915c0716A42688j9766c7590E8459a668k55505D5097J05773g2706
$$ -257536 -298451 -30716 142688 122922 -37590 58459 -1668 -257173 45097 150870 -72706
19171d7054K2162D3441f1328A67416f4964A04381d8306B2602a60900A23203k9734
$$ -47054 -24892 43441 -61328 167416 -64964 104381 -48306 22602 -160900 123203 93469
19160I3469a49067B42243i3065F508a98710E9410a9496j36602L2646p4110j55702
$$ 93469 -149067 242243 -93065 6508 -198710 59410 -19496 -156098 -123452 -197562 -353264
19149c53264a4510A7943K658J31470a15237C46409d4367H002b26833A76337b18229
$$ -353264 -14510 17943 20601 152071 -115237 346409 -44367 8002 -226833 176337 -218229
19137a39297C38848G6269P9000e4969j24403A48503O8327d44921C1926O0122b33881
$$ -139297 338848 76269 155269 -54969 -179372 148503 216830 -444921 31926 92048 -233881
19125D8148J43328B0894h6761E5291O6113a21577A64064a03730C3368f4057A36547
$$ 48148 191476 20894 -86761 55291 121404 -121577 164064 -103730 33368 -64057 136547
19113E2436a01239c8360G6445N1856b43091A25386c21901b4856j93384E8843J03479
$$ 52436 -101239 -38360 76445 128301 -243091 125386 -321901 -24856 -218240 58843 162322
19102A62322o3076a02776k70358B531N0028j3676a48849G4273b15595A9608K32580
$$ 162322 99246 -102776 -373134 2531 52559 38883 -148849 74273 -215595 19608 252188
19091B52188a78517A7664a33254f6564l30442d1871l95010i8923q620l6940g793
$$ 252188 -178517 17664 -133254 -66564 -397006 -41871 -436881 -98923 -107543 -144483 -7793
19079b09125L4038R352A76395C2677b23445e0280J8391j6016j00445N9885i337
$$ -209125 -175087 -165735 176395 32677 -223445 -50280 -31889 -47905 -148350 -88465 -9337
19067B63013C107g2547a4354C2737a33184C75659a48674P1186m6983j27136j42659
$$ 263013 3107 -72547 -14354 32737 -133184 375659 -148674 -77488 -124471 -251607 -394266
19056c94266A17347l1867c15643D1767O1405k9667K09828B4840g3347b0531B17439
$$ -394266 117347 85480 -315643 41767 103172 73505 283333 24840 -73347 -20531 217439
19044a53939k3953l31885b45044a271j42432j63694J39281N9277E0447L70768
$$ -153939 -177892 -509777 -245044 -1271 -143703 -307397 -168116 -108839 50447 421215
19034D21215c53882A08833P6424H3834B3329P1142a08681A54492J85246F3391
$$ 421215 -353882 108833 185257 83834 23329 94471 -108681 154492 339738 63391
19023a70314L3215B83103a5113E6581J2171J76738E37R7757i9238B6403a12340
$$ -170314 -137099 283103 -15113 56581 68752 245490 537 98294 -99238 26403 -112340
19011A8706a60989b1749H5522a03710j14093A19007J67001n6706a48220B47971
$$ 18706 -160989 -21749 85522 -103710 -217803 119007 286008 229302 -148220 247971
19000E8041J13766b38051A81052b43965A86192E3267O8987i4417r6124K8282m9209
$$ 58041 171807 -238051 181052 -243965 186192 53267 122254 -94417 -190541 -162259 -211468
18989b11468g4989j02432o5158h2792A26127c24776C22736E7702K28516b1168
$$ -211468 -74989 -177421 -242579 -82792 126127 -324776 322736 57702 286218 -21168
18978a74819M1688a7597k93863J07001C6831i2647j6040m9462g3914j40526b4257
$$ -174819 -133131 -17597 -311460 -204459 36831 -92647 -108687 -158149 -73914 -214440 -24257
18966g0891A03098b5369m40056A33433m6742K79549e9786F1207G871a07185G7998
$$ -70891 103098 -25369 -465425 133433 86691 366240 -59786 61207 7871 -107185 77998
18954b4725C3280i6215k03882C2367a84347B7738g4165j54466Q6692j27995A71324
$$ -24725 33280 -96215 -300097 32367 -184347 27738 -74165 -228631 -141939 -269934 171324
18942a67303A42367a33783C48675A27310b1092C2117G880i8206L8862k8117c4759
$$ -167303 142367 -133783 348675 127310 -21092 32117 7880 -98206 -59344 -87461 -34759
18930a64226E8135B3014d1791E7146b14445M4304h4994b2335A2061c24347B2431
$$ -164226 58135 23014 -41791 57146 -214445 -170141 -84994 -22335 12061 -324347 22431
18918e8239j81786c5537j56042Q9663M8899l6711j8734l1881A0635i6275B45929
$$ -58239 -240025 -35537 -191579 -101916 -53017 -89728 -108462 -140343 10635 -96275 245929
18906d7729l44979J77924P7981O397a0114E8197o782K1945b10035D4124i5026
$$ -47729 -392708 -214784 -136803 -130406 -10114 58197 51415 73360 -210035 44124 -95026
18894D13250a76384A078i3479G7432I721K04421b7454B04182a5246A87290m5169
$$ 413250 -176384 1078 -93479 77432 9721 214142 -27454 204182 -15246 187290 142121
18883A42121a22835a0657j4899D6875a85514A10673b4278A6694b38869O0277A2188
$$ 142121 -122835 -10657 -25556 46875 -185514 110673 -24278 16694 -238869 -178592 12188
18871b83605f7103p888E6007i8021k8886A41784a55988K8978E8082n219a35016
$$ -283605 -67103 -74991 56007 -98021 -126907 141784 -155988 -127010 58082 52863 -135016
18859c95553J53090a4883k21966G4004b22198J6528j74279A16329L9047M07807
$$ -395553 -242463 -14883 -236849 74004 -222198 -205670 -379949 116329 155376 563183
18849E63183C9744j5908N0150J02699l7192c23431A15424f2237a9830j33119k12650
$$ 563183 39744 23836 73986 176685 139493 -323431 115424 -62237 -19830 -152949 -365599
18838c65599J60013m7659B00467B6038J68712E328a94045q6231i3688E6245e62123
$$ -365599 -205586 -253245 200467 26038 194750 5328 -194045 -280276 -93688 56245 -562123
18826I5057b35924c7793j47531g2078l3114N1155e481A58989a29609n6060K9961
$$ 95057 -235924 -37793 -185324 -72078 -105192 -54037 -5481 158989 -129609 -185669 -155708
18815a55708A21975e1247I8110J58755B1017Q274K27052a30098A12141b22064
$$ -155708 121975 -51247 98110 256865 21017 29291 256343 -130098 112141 -222064
18804a23810j24535H5322c47G6176b3798k55141I5464a0583j25387o1506P4265
$$ -123810 -248345 85322 -347 76176 -23798 -278939 95464 -10583 -135970 -197476 -123211
18793a23211a0375r6724B1542K12690a67895G1112b25100C169J93331J1945C1336
$$ -123211 -10375 -107099 21542 234232 -167895 71112 -225100 3169 196500 208445 31336
18781a1469k36607A32216b96669J23582f4001A60449g4859A15559a60590M7931
$$ -11469 -248076 132216 -296669 -173087 -64001 160449 -74859 115559 -160590 -112659
18771a12659j80774B5366a90132j14513R4536C2774b98116c4055B3547b93886
$$ -112659 -293433 25366 -190132 -304645 -210109 32774 -298116 -34055 23547 -293886
18760A06927g1037m7207B43521h9191B45626g9390A28510a18393n8866j9630i1320
$$ 106927 -71037 -118244 243521 -89191 245626 -79390 128510 -118393 -177259 -196889 -91320
18748a38391D43406f1873j6887A75200F4831k3245g648A07681J37424i5499E5968
$$ -138391 443406 -61873 -78760 175200 64831 41586 -7648 107681 245105 -95499 55968
18736b35299l0053C40817a54440A27737m0154d41251A13356a0058j82370A4985
$$ -235299 -265352 340817 -154440 127737 87583 -441251 113356 -10058 -192428 14985
18725a22110D7857P1402h3962C4837i4593L1787k31235e2356j46694K0234D8233
$$ -122110 47857 119259 -83962 34837 -94593 -62806 -294041 -52356 -199050 -178816 48233
18713g702k9930B66692n9440F2838b22453B03766c00170f4474C5350d9374A9325
$$ -7702 -37632 266692 207252 62838 -222453 203766 -300170 -64474 35350 -49374 19325
18701i1959j12327B25601b60042Q4592B3444a16220j25466F7568a90007b5483
$$ -91959 -204286 225601 -260042 -175450 23444 -116220 -241686 67568 -190007 -25483
18690c9076C8144R8531A146J41666c52912a57685A01561a51592D7266J73158b9731
$$ -39076 38144 136675 1146 142812 -352912 -157685 101561 -151592 47266 220424 -29731
18678a46225B84398q2068J43620F9252a62927A77527g2537m10995A0358J05767
$$ -146225 284398 202330 345950 69252 -162927 177527 -72537 -483532 10358 116125
18668A16125d1621q2057n0848F0976a20477A00946a1573j54498A5698c233k88591
$$ 116125 -41621 -123678 -174526 60976 -120477 100946 -11573 -166071 15698 -3233 -291824
18657b91824J42529G6191i8651A07901K7786a07559E448g7033C934J35236a42506
$$ -291824 -149295 76191 -98651 107901 135687 -107559 5448 -77033 3934 139170 -142506
18645A00554j5571h4437j40197B5854a54005G850O0531c75089B90031C1257M7455
$$ 100554 84983 -84437 -224634 25854 -154005 7850 68381 -375089 290031 31257 78712
18634G8712N878d39607J59410i0627E6792a08217D05013B7239a51455l8774O4688
$$ 78712 84590 -439607 -280197 -90627 56792 -108217 405013 27239 -151455 -190229 -125541
18623a25541j82779B21351b40555H3526B5779a58865A63145c85726a61872A81309
$$ -125541 -308320 221351 -240555 83526 25779 -158865 163145 -385726 -161872 181309
18612b32607J11377k9055I195f7589F1066i4522k60964A34159n6262K9382A96
$$ -232607 -121230 -150285 9195 -67589 61066 -94522 -355486 134159 77897 107279 196
18600E6932g581J022m9874k46219g9610A53731e1198j0702K405l27191h8026B30860
$$ 56932 -7581 -6559 -56433 -302652 -79610 153731 -51198 -61900 -59495 -386686 -88026 230860
18587c9325j08566B5256a35337A70302a09397r0455k39080A17693a7595l8032
$$ -39325 -147891 25256 -135337 170302 -109397 -199852 -438932 117693 -17595 -55627
18577e5627A78446a92248a9792A88797a69919G5603f2267k3046C0849b05625q6075
$$ -55627 178446 -192248 -19792 188797 -169919 75603 -62267 -85313 30849 -205625 -291700
18566b91700a19222k5239r4882M8367l3101h4406B91918p7993A4921J59201c09549
$$ -291700 -119222 -144461 -239343 -190976 -224077 -84406 291918 213925 14921 174122 -309549
18554a61100a4162o11396a42120f3515n0472F256J3096J07809d13469B04042a06798
$$ -161100 -14162 -625558 -142120 -63515 -113987 6256 19352 127161 -413469 204042 -106798
18542g5309A77175d1829B42929C704a5157j61454A58035a66257A4847c5971j68800
$$ -75309 177175 -41829 242929 3704 -15157 -176611 158035 -166257 14847 -35971 -204771
18531b04771D64716A54207a06568d3773l9012J2343o3825C8419b06041f5374A23827
$$ -204771 464716 154207 -106568 -43773 -82785 -70442 -134267 38419 -206041 -65374 123827
18519c29956e5229A54795E1683d8453k71255M4323H0483a76064F5745A6316J07557
$$ -329956 -55229 154795 51683 -48453 -319708 -275385 80483 -176064 65745 16316 123873
18508A23873p29b6829F2567b40063R9252K1318K8277j51308k34961C41317I8096
$$ 123873 123144 -26829 62567 -240063 -140811 -119493 -91216 -242524 -477485 341317 98096
18496c71902h9558m7698j0961A27871l085l4199a35244j58746g5601A38537a88120
$$ -371902 -89558 -137256 -148217 127871 124786 90587 -135244 -293990 -75601 138537 -188120
18484h374j74718I4751b58147a24981d0059A0369a57702g6808A47025f03796a70134
$$ -8374 -183092 94751 -258147 -124981 -40059 10369 -157702 -76808 147025 -603796 -170134
18472a74712j2775r6153B02060o3502c68749a00867F4894b95381b9929j93481
$$ -174712 -187487 -283640 202060 138558 -368749 -100867 64894 -295381 -29929 -223410
18462b23410b9412k68014I2336R5998d70578A15730C3756c60282a16101e5544
$$ -223410 -29412 -297426 92336 188334 -470578 115730 33756 -360282 -116101 -55544
18451G1871a3079j61902A09917J37383J67964A27497a64419b1437k06592J11764
$$ 71871 -13079 -174981 109917 247300 415264 127497 -164419 -21437 -228029 -116265
18441a16265E564L33450a65825F5078a73629P8150j13297J03208H3397c7510j53254
$$ -116265 5564 339014 -165825 65078 -173629 -95479 -208776 -105568 83397 -37510 -190764
18430a90764a0112C09187a89794P2959m5943A08771g5854K3838k3367G1103k5579
$$ -190764 -10112 309187 -189794 -116835 -162778 108771 -75854 -52016 -75383 71103 45524
18419D5524J86086a46075A29020e6728B00687O8517b6093D08566a98565E45797
$$ 45524 231610 -146075 129020 -56728 200687 269204 -26093 408566 -198565 545797
18408b20977O3624M0160H6968b07351i3576A03491O0599C7730K52613q6962B4796
$$ -220977 -157353 -117193 86968 -207351 -93576 103491 164090 37730 290343 203381 24796
18396d41974d9443A85475a57731j3718o8218P0346H8243L4743c7797q0954M473
$$ -441974 -49443 185475 -157731 -171449 -239667 -169321 88243 122986 -37797 -118751 -114278
18385a14278K8094k22040E74J61355b46929Q0827A96258c96660a70883N0745h816
$$ -114278 -86184 -308224 574 161929 -246929 -166102 196258 -396660 -170883 -120138 -8816
18373B56526E3882a02432C90527a02286I344i6103C40125A31398a61374M2249
$$ 256526 53882 -102432 390527 -102286 9344 -96103 340125 131398 -161374 -119125
18363a19125B58719m7843A9320Q4479h9367H9083b09459n732B6780e4775G8921
$$ -119125 258719 210876 19320 103799 -89367 89083 -209459 -215191 26780 -54775 78921
18351i7970B0736p530a2433B65237e457k45161o4860P0380B20050g883D4907p741
$$ -97970 20736 13206 -12433 265237 -5457 -250618 -315478 -245098 220050 -7883 44907 37166
18339C7166b78227j16685J94390p4961G923K11293e4069R268m1584C0894q890
$$ 37166 -278227 -394912 -200522 -275483 7923 219216 -54069 -44801 -86385 30894 22004
18328B2004J16413H172a31470j26809E0959a2996n0026n942D9768h6602j63660
$$ 22004 138417 8172 -131470 -258279 50959 -12996 -63022 -68964 49768 -86602 -250262
18317b50262J12397k36310a41560A88479a0528j30971J7117A77783b95707B2341
$$ -250262 -137865 -374175 -141560 188479 -10528 -141499 -124382 177783 -295707 22341
18306d38631a19382A89437a16436R432A3111a19022A57193g5196j72068g4383
$$ -438631 -119382 189437 -116436 -107004 13111 -119022 157193 -75196 -247264 -74383
18295C68420c5563A14738J2927N3792a55686j33158B7278f9167j35598E4284d3249
$$ 368420 -35563 114738 127665 181457 -155686 -288844 27278 -69167 -204765 54284 -43249
18283a78307C15197a7150B15305C7395a71332L7397M9072k60392a23680c3109
$$ -178307 315197 -17150 215305 37395 -171332 -133935 -84863 -345255 -123680 -33109
18272c74303D9429a15922I2170a8879l16028a38015A15382i9087r0025A42490
$$ -374303 49429 -115922 92170 -18879 -334907 -138015 115382 -99087 -189112 142490
18261a51796j9717A05692f0446j433G248a40151A5098a48362A75307d37678E7362
$$ -151796 -171513 105692 -60446 -61879 7248 -140151 15098 -148362 175307 -437678 57362
18249I3837c33634E1349J2080J72465b62141P9791J1995B37234F3296f725D0361
$$ 93837 -333634 51349 63429 235894 -262141 -182350 -170355 237234 63296 -6725 40361
18237B07804o2528A2684P870g7196A14812b17039J06407K0699k17702D1094L5397
$$ 207804 145276 12684 20554 -77196 114812 -217039 -110632 -89933 -307635 41094 76491
18226G6491K81565f6644k42954g291k17225j04210A69474b64413A05129b95532
$$ 76491 358056 -66644 -309598 -7291 -224516 -328726 169474 -264413 105129 -295532
18215a1415k63513B06990a83917p1872C28445A63484b92946H0111h6699k09891
$$ -11415 -274928 206990 -183917 -255789 328445 163484 -292946 80111 -86699 -296590
18205b96590a2237m3231j18987A24435c46455H9110c7548j03925O9472l9800C74011
$$ -296590 -12237 -55468 -174455 124435 -346455 89110 -37548 -141473 -72001 -111801 374011
18193a53656L9257G2178N5918b28560B33947Ga4344j60499a367k17716G8441a01809
$$ -153656 -114399 72178 128096 -228560 233947 7 -14344 -174843 -1367 -219083 78441 -101809
18180A77002q2144a17148B93172C8147K49237B7777b8051q2213A54132b10266
$$ 177002 94858 -117148 293172 38147 287384 27777 -28051 -110264 154132 -210266
18169e4379B76616a36650j2553N6907L4279o4192k02038D9447a08863O335m4370
$$ -54379 276616 -136650 -149203 -92296 -58017 -122209 -324247 49447 -108863 -102528 -146898
18158a46898k31105a40429A39533d39096e3272A92646a78446A24914i1777K9777
$$ -146898 -378003 -140429 139533 -439096 -53272 192646 -178446 124914 -91777 -62000
18148f2000A95323D4473c0298q6023J4317d2069r0358B28042g4741D1541J59204
$$ -62000 195323 44473 -30298 -116321 -102004 -42069 -132427 228042 -74741 41541 200745
18137B00745K880j01455e9783q698C52541b73555a17701M0435A63239a09813F749
$$ 200745 203625 102170 -59783 -68481 352541 -273555 -117701 -77266 163239 -109813 6749
18125h6140A7232d1478B07250R08r7137n4130b94899A86994a35472b5502B7335
$$ -86140 17232 -41478 207250 208158 111021 56891 -294899 186994 -135472 -25502 27335
18113B22069C2441d6362E959a30660k7387A9582p351a87066A95828E5911P5950
$$ 222069 32441 -46362 5959 -130660 -158047 19582 12231 -187066 195828 55911 131861
18102A31861a2927a88j35532k71276A30948a76058j80269a24074j86394J17367
$$ 131861 -12927 -188 -135720 -406996 130948 -176058 -356327 -124074 -310468 -193101
18092a93101b804q4329j11105j29759B3265m660h9755L9726A49551q192b17265
$$ -193101 -2804 -87133 -198238 -327997 23265 18605 -89755 -50029 149551 141359 -217265
18080B00107I4500a07899k08063F7322h6964k43673A5239c32047E858c65310A51428
$$ 200107 94500 -107899 -315962 67322 -86964 -330637 15239 -332047 5858 -365310 151428
18068b44700A67504b10555j21309G7075L0580b78586c9946j26604B76099H8581
$$ -244700 167504 -210555 -331864 77075 107655 -278586 -39946 -166550 276099 88581
18057A4780a13478k6563A46410a8451H2761f3669k9311A89479d4452A14679J06367
$$ 14780 -113478 -140041 146410 -18451 82761 -63669 -92980 189479 -44452 114679 221046
18046B21046a86922A9446d448j73316c1176B75999A21621H504a15434M4023I5902
$$ 221046 -186922 19446 -4448 -177764 -31176 275999 121621 8504 -115434 -71411 95902
18034F2718J13213G7893J61022F8553h6378o4043j30934B25936F5893J16895i7111
$$ 62718 175931 77893 238915 68553 -86378 -150421 -281355 225936 65893 182788 -97111
18022a30505L7215F9414L8028a93141c0907n0494D01514A48488E772J5700a57507
$$ -130505 -93290 69414 107442 -193141 -30907 -81401 401514 148488 5772 21472 -157507
18010a51167j3833c8342q0014k24131C6760c61685A43334g2020H1128g0874D3140
$$ -151167 -165000 -38342 -118356 -342487 36760 -361685 143334 -72020 81128 -70874 43140
17998A30457d1426C4227a64597A93703g8651j1478K3779j30304P551C40789f9561
$$ 130457 -41426 34227 -164597 193703 -78651 -90129 -66350 -196654 -189103 340789 -69561
17986a40889j75995B34696g2976G2964a06817j20371A73230a33081J4142d1982
$$ -140889 -316884 234696 -72976 72964 -106817 -227188 173230 -133081 -118939 -41982
17975a03115A3930M8459N5709a01137I8467d30416H3194g9768A16467k113k3327
$$ -103115 13930 62389 118098 -101137 98467 -430416 83194 -79768 116467 114354 91027
17964I1027C4323L5941J01033a23799L7854C688a37836n4214j53566E457b36950
$$ 91027 34323 70264 171297 -123799 -85945 3688 -137836 -192050 -345616 5457 -236950
17952C6398K80518q778p2505b17616B57565b15707R4697j8706L3751n6933K2810
$$ 36398 316916 308138 235633 -217616 257565 -215707 -121010 -139716 -105965 -162898 -140088
17941a40088B04846a30904K9541H8548b51879A55130J53479I4280a44043N78N9595
$$ -140088 204846 -130904 -101363 88548 -251879 155130 308609 94280 -144043 -143465 -83870
17930h3870a0681l23363a51534D44965c3102B73767G0582b22916B32393G9496
$$ -83870 -10681 -334044 -151534 444965 -33102 273767 70582 -222916 232393 79496
17919A91484h8681E4671b79564D02206j78817I804c3041A28250N9396a2006k03415
$$ 191484 -88681 54671 -279564 402206 223389 9804 -33041 128250 187646 -12006 -215421
17908b15421f3719b1483k1189j94798r5576J51895B48411a09085c1110l0741B40057
$$ -215421 -63719 -21483 -42672 -237470 -333046 -181151 248411 -109085 -31110 -61851 240057
17896A27090a87893R1411b6026C8210H068R9809b48641a12861L553K1895j23853
$$ 127090 -187893 -96482 -26026 38210 8068 107877 -248641 -112861 -109308 -87413 -211266
17885b11266i1952I5388O1375L31157C7513c9868l972A36728j2754B2916J56072
$$ -211266 -91952 95388 156763 487920 37513 -39868 -43840 136728 123974 22916 178988
17874A78988d3213e588C02488d1792k22903c4387A51888J11649b32632h0096k35
$$ 178988 -43213 -5588 302488 -41792 -264695 -34387 151888 263537 -232632 -80096 -80331
17863h0331o1166A55134a41111A90782A4624d0158C83788e5289l53464I0904a4656
$$ -80331 -141497 155134 -141111 190782 14624 -40158 383788 -55289 -408753 90904 -14656
17851d3354A62104c67633A32721a63102b526k95163C51487G5751a86433N1293
$$ -43354 162104 -367633 132721 -163102 -2526 -297689 351487 75751 -186433 -135140
17841a35140D42963d8687A90568o3404L0891C295J90064F4941Q9675O6005E7009
$$ -135140 442963 -48687 190568 127164 158055 3295 193359 64941 154616 220621 57009
17829A37465j7902J02913G4310a64939c9769p9862k3969c7246l956a3226l1918
$$ 137465 119563 222476 74310 -164939 -39769 -119631 -143600 -37246 -41202 -13226 -45144
17818d5144n38821b7033k30704A46850E0555a04035K2255B3348a727k8162A81492
$$ -45144 -583965 -27033 -257737 146850 50555 -104035 -81780 23348 -1727 -29889 181492
17806I7924k928a88275b9787C47265H4122L2751c872B72999a58025b6684n8383
$$ 97924 94996 -188275 -29787 347265 84122 116873 -3872 272999 -158025 -26684 -85067
17795h5067F662K51282B211a74431f8722G909b84151A82075G6306c8886B6054
$$ -85067 6662 257944 2211 -174431 -68722 7909 -284151 182075 76306 -38886 26054
17783F0481J19725j394c16777E4868a40669J8816j56672C64a54039a1859k59095
$$ 60481 180206 178812 -316777 54868 -140669 -121853 -278525 364 -154039 -11859 -270954
17772b70954a33344B16136d0554k77645a15182G8486e4178C47289D8316L9939
$$ -270954 -133344 216136 -40554 -318199 -115182 78486 -54178 347289 48316 88255
17762H8255c5522A1135a69821F89936A59759O4921f2076E5649a98639e5182j00807
$$ 88255 -35522 11135 -169821 689936 159759 224680 -62076 55649 -198639 -55182 -155989
17751a55989B08497a53437D6240b94525A49799E9137a65800A65178b50279F0113
$$ -155989 208497 -153437 46240 -294525 149799 59137 -165800 165178 -250279 60113
17740D9022b0913k58639A87354b1876N922A21643K5307d4465A40091a29629A31315
$$ 49022 -20913 -279552 187354 -21876 -15954 121643 146950 -44465 140091 -129629 131315
17728a49618b8333A19938m8381O5078n1728b7157m8612B63170b36369C3752e7622
$$ -149618 -28333 119938 71557 136635 84907 -27157 -75769 263170 -236369 33752 -57622
17716e1047m38j59225J00819p6733A43223i6182l3459J3109A95510j9197h7049
$$ -51047 -51485 -210710 -109891 -186624 143223 -96182 -129641 -116532 195510 176313 -87049
17704c5503j94017a08214h311A02916d8703B7134K9129A5443Q4603a32981A84532
$$ -35503 -229520 -108214 -8311 102916 -48703 27134 56263 15443 100046 -132981 184532
17692b11429g2485B0683N1186a34787A2745M3040a67387A86090J19426i9736A83913
$$ -211429 -72485 20683 71869 -134787 12745 55785 -167387 186090 305516 -99736 183913
17680B97246c03003D779J95544M2136P1308a89849F1277J50886a44503b2016C7624
$$ 297246 -303003 4779 200323 242459 313767 -189849 61277 212163 -144503 -22016 37624
17668B62600K620I5226J45507b25413A16913a64987B5150R0666B183J88994K59627
$$ 262600 265220 95226 240733 -225413 116913 -164987 25150 115816 2183 191177 450804
17657D50804A76520B1729J73202P5561h9074A25799n1454M4512a32549G1588a80780
$$ 450804 176520 21729 194931 270492 -89074 125799 74345 118857 -132549 71588 -180780
17645b87960Q3809D7529g3097C23366b9955B71128j6515e8678D46064h4064C13180
$$ -287960 -204151 47529 -73097 323366 -29955 271128 254613 -58678 446064 -84064 313180
17633C04582a09281D57203H8831J99897D2736a76167B4807b5512A2993L5357L5324
$$ 304582 -109281 457203 88831 288728 42736 -176167 24807 -25512 12993 48350 83674
17622H3674b09439B80277J58970a87679p8810a7474p1626B70512j26453J36323
$$ 83674 -209439 280277 439247 -187679 -266489 -17474 -89100 270512 144059 280382
17612B80382b03402C73370A34274a68566E04240b0040A42086j752I598c0777k26613
$$ 280382 -203402 373370 134274 -168566 504240 -20040 142086 140334 9598 -30777 -257390
17601b57390A49883g8618A97188J26919A1620a46977A03806k3561a17555E9333
$$ -257390 149883 -78618 197188 324107 11620 -146977 103806 80245 -117555 59333
17590c02350a31928i069p0743m4754o680M3664J7421B47046q7142e3130A70598
$$ -302350 -131928 -9069 -79812 -124566 -131246 -87582 -70161 247046 159904 -53130 170598
17578a18455H462c4217j20080j18830B71626a63387B05993g8460J6397B01377
$$ -118455 8462 -34217 -154297 -273127 271626 -163387 205993 -78460 -62063 201377
17567e3855q4869A07071a503B59068a49857j80206A96522j9813k2078P7735a32142
$$ -53855 -138724 107071 -1503 259068 -149857 -330063 196522 176709 154631 232366 -132142
17555a54220m52j18653A39171b5155A65952c5188j52408r7762a25257l1780n9544
$$ -154220 -154672 -273325 139171 -25155 165952 -35188 -187596 -285358 -125257 -157037 -216581
17544b16581e4547A7110Q8031J94072h3446H868J01803a69128P5432p5756F1290
$$ -216581 -54547 17110 105141 299213 -83446 8868 110671 -169128 -93696 -169452 61290
17532a46026B4244d39600G5101J10354d3682A12255g8413A78673J02087G2615
$$ -146026 24244 -439600 75101 185455 -43682 112255 -78413 178673 280760 72615
17521G7483P9360J1349j3730a3056A32494J4058Q4914n3322L81816k76904B3199
$$ 77483 156843 168192 154462 -13056 132494 146552 231466 178144 559960 283056 23199
17509e1709H7265J72673P1404A05710O3493a13199A0203Q5712J32170J06199j23815
$$ -51709 87265 259938 331342 105710 169203 -113199 10203 95915 228085 334284 210469
17498B10469a7725C62940e4836A25126J17515b7090F60268k97752G3657N841L13893
$$ 210469 -17725 362940 -54836 125126 242641 -27090 660268 362516 73657 79498 393391
17487C93391A41425b54787f15I6200a65372B69535A21476a17686C09475a10446
$$ 393391 141425 -254787 -615 96200 -165372 269535 121476 -117686 309475 -110446
17476C45252m3693A09961L04813a14110N2737A01304a93989A13399P7919D5998
$$ 345252 301559 109961 414774 -114110 -61373 101304 -193989 113399 191318 45998
17465F456Q4631c76399A24966N9078a45365g656k48405A59011B3098a38697C75482
$$ 6456 91087 -376399 124966 184044 -145365 -7656 -256061 159011 23098 -138697 375482
17453B14790M6908N9037a63136D09983A44293J51174J4564K87340A85491f7743
$$ 214790 261698 320735 -163136 409983 144293 295467 310031 597371 185491 -67743
17442A64869q0351K88351j14234I4049K64788A43916n7580K37497r4321J97675
$$ 164869 84518 372869 258635 94049 358837 143916 86336 323833 229512 427187
17432D27187E195N28510k14874C7079L44146A36747L18407j84568o8224J86317
$$ 427187 5195 533705 318831 37079 381225 136747 455154 270586 202362 388679
17422C88679l7766A55043J03129K77102c5844B70562J42710J53841A48968J27597
$$ 388679 350913 155043 258172 535274 -35844 270562 413272 567113 148968 276565
17412B76565A09702Q462N901A5942a3853B93822o113f0999j72273A38103n952
$$ 276565 109702 118164 124065 15942 -13853 293822 287709 -60999 -233272 138103 132151
17401A32151a06646E58798j48202H0334K02062J61655F2342j0011a36478E7843
$$ 132151 -106646 558798 410596 80334 282396 444051 62342 52331 -136478 57843
17390A40592J047b09937B27585g3219B84321h6116A17717L08007k03747j02261
$$ 140592 141639 -209937 227585 -73219 284321 -86116 117717 425724 221977 119716
17380A19716K10939G194K92954j27783L19875G1636c8882C31053a57490D06068
$$ 119716 330655 7194 300148 172365 492240 71636 -38882 331053 -157490 406068
17369A08246J9038a97765c2789A26403L08839A63843K71223A02660n99C6709L9742
$$ 108246 127284 -197765 -32789 126403 435242 163843 435066 102660 102061 36709 76451
17358G6451a6543C71676j13772q716E7800J09882A3155R6094k5128C9593e3590
$$ 76451 -16543 371676 257904 249188 57800 167682 13155 109249 84121 39593 -53590
17346B81314F8741A8745a73998I581b4626B98888J175B3333J42414c7721A19880
$$ 281314 68741 18745 -173998 9581 -24626 298888 300063 23333 165747 -37721 119880
17334A24943n2684N41176F5745A3668b0742A64481J05284E5390L9067a94587B11407
$$ 124943 72259 613435 65745 13668 -20742 164481 269765 55390 94457 -194587 211407
17322D54022k22556I3359J45691J27092E5018L88754A76441J65381j69698n1914
$$ 454022 231466 93359 239050 366142 55018 443772 176441 341822 172124 120210
17312A20210a3278A99309l8429j9944R0788R1734p6586J4653c3068C13745r1737
$$ 120210 -13278 199309 160880 140936 231724 323458 246872 261525 -33068 313745 222008
17301B22008n1651P9717n9406k0625o7138D9056c6275D25880J53897i0074C82623
$$ 222008 170357 250074 190668 170043 102905 49056 -36275 425880 579777 -90074 382623
17289A2303L22277G208K6821Q2204D2413J98514J85086d1418E51406j44045j50366
$$ 12303 334580 7208 34029 116233 42413 240927 426013 -41418 551406 407361 256995
17278B56995F3922k4316j3663M64913A80850e8823B59130k9253N9672K7746p7060
$$ 256995 63922 39606 25943 490856 180850 -58823 259130 229877 289549 317295 240235
17267B40235K2232f2036B19290o5556h8862G5996a29259C94559r8829B6739K08654
$$ 240235 262467 -62036 219290 153734 -88862 75996 -129259 394559 295730 26739 235393
17256B35393k8497J09696j24332a97616A62870c9408B54798C8833J94995l4928
$$ 235393 206896 316592 192260 -197616 162870 -39408 254798 38833 233828 198900
17246A98900J80539j64369r6083f9288C63608A18499L73240a17330D81516k40211
$$ 198900 379439 215070 118987 -69288 363608 118499 491739 -117330 481516 241305
17236B41305L6411L8619l6113M5039n4543f1033A69428J17123N5589F0857J91223
$$ 241305 277716 316335 280222 325261 270718 -61033 169428 286551 342140 60857 252080
17225B52080h526B37778J63123j95909J77506r5930J41582j66580k0804Q2717
$$ 252080 -8526 237778 400901 204992 382498 286568 428150 261570 240766 323483
17215C23483j51587k45K98841a06070D61289j34138A59868f4277C60656O0556
$$ 323483 171896 171651 470492 -106070 461289 327151 159868 -64277 360656 421212
17205D21212j93550q0611J51790j12632K18112A31882L2332L56056p4004p2042
$$ 421212 227662 147051 298841 186209 404321 131882 164214 520270 446266 374224
17195C74224O321A42113K46588l5284j22453J21865j47968a5924B69086E033K79993
$$ 374224 380545 142113 388701 353417 230964 352829 204861 -15924 269086 5033 285026
17184B85026A38875L20893k17036M02875j21375L2048j94541L6546B1424M68073
$$ 285026 138875 459768 242732 645607 524232 556280 361739 398285 21424 489497
17174D89497j90424R1822j08418K81493k05150L35903E2342k1101K21848P077
$$ 489497 299073 390895 282477 563970 358820 694723 52342 31241 253089 260166
17164B60166K11549q0582K029l7449A02528M81976k91897J94895l0182B28616
$$ 260166 471715 391133 393162 355713 102528 584504 292607 487502 457320 228616
17153C16938C0367L55822O0209j61714L5154j21784K84249J27021j44383d7414
$$ 316938 30367 386189 446398 284684 319838 198054 482303 609324 464941 -47414
17142C1974J72465C5277K60118R3531l6866P9663K40925B90710L0026R5326r8137
$$ 31974 204439 35277 295395 388926 352060 431723 672648 290710 320736 416062 317925
17131C17925K26116j7500J26157j81921j14980m7485n1376J17491Q9090r6929
$$ 317925 544041 526541 652698 470777 355797 308312 256936 374427 463517 366588
17121C66588J13152j54100L21435I041J40978J92328K88227n7079B41682J71365
$$ 366588 479740 325640 647075 9041 150019 342347 630574 573495 241682 413047
17111D13047o0196K25958E9573L51417r4986l7465K86799K6693n7076j41800m1430
$$ 413047 352851 578809 59573 410990 316004 278539 565338 592031 534955 393155 351725
17100C51725K47456q7632N6268j30916p8374L00783A64231J33853Q7378E6364
$$ 351725 599181 511549 567817 436901 358527 659310 164231 298084 385462 56364
17089G38606l22327K68956b09538D65905r5779K10021j01365l6387O4344A57693
$$ 738606 416279 685235 -209538 465905 370126 580147 478782 442395 506739 157693
17078C37109K04930l7602B39491J01903M8238n317J67107B54196K69833M3208
$$ 337109 542039 504437 239491 341394 389632 384315 551422 254196 524029 567237
17068E67237j43403n0528K55380j35057q2068P3353n4457j00266J39078l6829
$$ 567237 423834 373306 628686 493629 411561 484914 430457 330191 469269 432440
17058D32440N5967K00665k06296j66487N0632J04930J73506k99748N21210l35928
$$ 432440 488407 689072 482776 316289 366921 471851 645357 345609 866819 530891
17048E30891A89680M03908H5291O14882j71352R4394j48831M09411B37737J18063
$$ 530891 189680 593588 85291 700173 528821 623215 474384 883795 237737 355800
17038C55800J3461A42098K02050J18098j50705K23725j1097Q7560J84143C83994
$$ 355800 369261 142098 344148 462246 311541 535266 524169 611729 795872 383994
17027F68507J70141K21251D27234N07528l95265J63851L7472j88509N88016l53548
$$ 668507 838648 1059899 427234 934762 539497 703348 740820 552311 1140327 786779
17017G86779l38302L3794L61065r8471R3758r868j90762m4134J88785K6844j94723
$$ 786779 448477 482271 843336 744865 838623 828755 637993 593859 782644 809488 614765
17006F14765L0965L81090l52078L67977j70627j14433L34889p5124l55282O5344
$$ 614765 645730 1026820 674742 1042719 872092 757659 1092548 1017424 662142 727486
16996G27486K22084D32464M44223r6520n7206m9061O1632r6979J79562q1967Q6638
$$ 727486 949570 432464 876687 780167 722961 673900 735532 638553 818115 736148 822786
16985H22786K6647C91648O73490j73663Q4182j04405r6935P5043M444j76846K89048
$$ 822786 849433 391648 1065138 891475 975657 871252 774317 849360 853804 676958 966006
16974I66006k78640M70115m26255J73626L48518m00311K32286q2530o2997J52273
$$ 966006 687366 1157481 731226 904852 1253370 853059 1085345 1002815 939818 1092091
16964A092091j30462L10589k20374L0433J8518K01599m53793L7949N23708J23773
$$ 1092091 961629 1272218 1051844 1082277 1100795 1302394 848601 886550 1410258 1534031
16954A534031n30848K00483n848j53520J85144R9020m04133K40674K78579m70951
$$ 1534031 1003183 1203666 1197818 1044298 1229442 1328462 924329 1165003 1443582 972631
16944I72631K75049j20638J37208j33569L16780n41312L24427m927m0171M8795
$$ 972631 1247680 1127042 1264250 1130681 1447461 906149 1230576 1225649 1185478 1234273
16934A234273m2719J58729k52274K91207l29563J89722Q7574L9589J77618P6138
$$ 1234273 1191554 1350283 1098009 1389216 1059653 1249375 1336949 1376538 1554156 1630294
16924A630294k00869N1413O7086J25178m04732J10288J28757k54861L58778K14737
$$ 1630294 1429425 1480838 1547924 1673102 1268370 1378658 1507415 1252554 1611332 1826069
16914A826069k80627q7069k60101L71505K60443j66714K39677l87894J79924l1666
$$ 1826069 1545442 1458373 1198272 1569777 1830220 1663506 1903183 1515289 1695213 1663547
16904A663547L44177k38769q0847M47881n69157L91350j17143K03469l16780J29173
$$ 1663547 2007724 1768955 1688108 2135989 1566832 1958182 1841039 2044508 1727728 1856901
16894A856901L2412J15485p3271k37118M82157l11555J3305N120J86509j92936
$$ 1856901 1889313 2004798 1931527 1694409 2176566 1865011 1878316 1883436 2069945 1877009
16884A877009L49702J82247k31113j96733j66396K83227L52996j33870k22609
$$ 1877009 2226711 2408958 2177845 1981112 1814716 2097943 2450939 2317069 2094460
16875B094460J3605K15407j35616M0814J69442j25422L290O50111n68741J37314
$$ 2094460 2108065 2323472 2187856 2228670 2398112 2272690 2275980 2926091 2357350 2494664
16865B494664L96158j82987K57704j62152k29683M04978l46744L54497j40859
$$ 2494664 2890822 2707835 2965539 2803387 2573704 2978682 2631938 2986435 2845576
16856B845576J91051R4928p6922j65828M21852o954N6170J28784m20667K95622
$$ 2845576 3036627 3131555 3054633 2888805 3310657 3303703 3359873 3488657 3067990 3363612
16846C363612l26985L03372J74589M1312j90186L70656j46581L3928O08646o0895
$$ 3363612 3036627 3339999 3514588 3555900 3365714 3736370 3589789 3623717 4232363 4171468
16836D171468m32166O172K28085P0189L10152k61210L09210k42918L16522K55463
$$ 4171468 3739302 3745474 3973559 4043748 4353900 4092690 4401900 4158982 4475504 4730967
16826D730967Q075M95799p41732L32942J32282M9221J90722l63888O0444O67073
$$ 4730967 4739042 5234841 4493109 4826051 4958333 5007554 5198276 4834388 4894832 5561905
16816E561905l19901K05120K97765K22423j4990j2258L30424K00946J10567j90932
$$ 5561905 5242004 5447124 5744889 5967312 5952322 5940064 6270488 6471434 6582001 6391069
16806F391069K32783L28763k51720O21578R8032J02122K36787K22003l6553L73381
$$ 6391069 6623852 6952615 6700895 7322473 7420505 7522627 7759414 7981417 7944864 8318245
16796H318245M37865l12273L84128K16902M91676j5126L53743K19211N25478j70638
$$ 8318245 8756110 8443837 8827965 9044867 9536543 9521417 9875160 10094371 10619849 10449211
16786A0449211K68617J95483J79210P20316L13654J23232K56675O10476K70588
$$ 10449211 10717828 10913311 11092521 11812837 12126491 12249723 12506398 13116874 13387462
16777A3387462P35672L83162K21487M87187M03820O04147M35559N84763M93865
$$ 13387462 14123134 14506296 14727783 15214970 15618790 16222937 16658496 17243259 17737124
16768A7737124P13015O77517O36367O26292J132910N48575P17509Q76234R44779
$$ 17737124 18450139 19127656 19764023 20390315 21523225 22071800 22789309 23665543 24610322
16759B4610322J066687J219307R87897J106124J326322J158061J632650J287942
$$ 24610322 25677009 26896316 27884213 28990337 30316659 31474720 33107370 34395312
16751C4395312J425331J884781J734480J796406K171591K323543K257369K502373
$$ 34395312 35820643 37705424 39439904 41236310 43407901 45731444 47988813 50491186
16743E0491186K740398K812896L096113L349299L612988L777566L789785M234574
$$ 50491186 53231584 56044480 59140593 62489892 66102880 69880446 73670231 77904805
16735G7904805M840808M690902N403701N275659O517233O109891O625442O788538
$$ 77904805 82745613 87436515 92840216 98115875 104633108 110742999 117368441 124156979
16727A24156979P417663P316563P466029P614935P385681P120410O910858N890136
$$ 124156979 131574642 138891205 146357234 153972169 161357850 168478260 175389118 181279254
16719A81279254N532721M176056L208152J778283Q15852r08677j963926l442442
$$ 181279254 186811975 190988031 194196183 195974466 196790318 195881641 193917715 190475273
16711A90475273m683244n050727o554237o982450p486963p244876p563891q235305
$$ 190475273 185792029 180741302 174187065 167204615 159717652 152472776 144908885 136673580
16703A36673580p692842p615995o903371o898013o874025n778271n902531n495496
$$ 136673580 128980738 121364743 114461372 107563359 100689334 94911063 89008532 83513036
16695H3513036n154713m646569l950425m133291l965065l377151l473022k916914
$$ 83513036 78358323 73711754 69761329 65628038 61662973 58285822 54812800 51895886
16687E1895886k733405k367242l065920k115647j979402k026107j993504j559458
$$ 51895886 49162481 46795239 43729319 41613672 39634270 37608163 35614659 34055201
16679C4055201j607403j597444j356880j531388j043856p57291j121814j008552
$$ 34055201 32447798 30850354 29493474 27962086 26918230 26160939 25039125 24030573
16671B4030573j239470r57461o78795r65287r82188m77964j132845l13988n56615
$$ 24030573 22791103 21833642 21154847 20189560 19207372 18729408 17596563 17282575 16725960
16662A6725960p89569n60018n09866l82660o91855k81709j66458k23083q42446
$$ 16725960 15936391 15376373 14866507 14483847 13791992 13510283 13343825 13120742 12278296
16653A2278296l12153o07235K63457q15240k53380l26445m46186n57366K36805
$$ 12278296 11966143 11358908 11622365 10807125 10553745 10227300 9781114 9223748 9460553
16644I460553m73050R7344l37807m33569L9157l95617j07897l34890j45057m33370
$$ 9460553 8987503 9084847 8747040 8313471 8352628 7957011 7849114 7514224 7369167 6935797
16634F935797J39073m8726m50830j31983m01931J06932q7706l37610K92425o93047
$$ 6935797 7074870 7026144 6575314 6443331 6041400 6148332 6060626 5723016 6015441 5322394
16624E322394Q6551m3267J06375k36180n0633q0004j38528j37241n3074R2211
$$ 5322394 5408945 5365678 5472053 5235873 5185240 5105236 4966708 4829467 4776393 4868604
16614D868604m52029k54086k73506L16230j60042j12376k19207m8691K98363k42689
$$ 4868604 4416575 4162489 3888983 4205213 4045171 3932795 3713588 3664897 3963260 3720571
16604C720571p3396J70036n39022J02347o6296J40566k06097n06070L53133q7603
$$ 3720571 3647175 3817211 3278189 3380536 3314240 3454806 3248709 2742639 3095772 3008169
16594C008169j61673Q9682m4036l15745O0517N8889j80387p9553J47295M0179
$$ 3008169 2846496 2936178 2892142 2576397 2636914 2695803 2515416 2435863 2583158 2623337
16584B623337l1949k17653K81099l50846j23850N4759J23760k49428L1439J32995
$$ 2623337 2591388 2373735 2654834 2303988 2180138 2234897 2358657 2109229 2140668 2273663
16574B273663l29176J8489k39186J57871K87618n50954M02527l17834K50473j26265
$$ 2273663 1944487 1962976 1723790 1881661 2169279 1618325 2020852 1703018 1953491 1827226
16564A827226J26424r3144M932N0292j96949j01925J35810r0149J89500l99128
$$ 1827226 1953650 1860506 1865438 1915730 1718781 1616856 1752666 1662517 1852017 1452889
16554A452889M38269k61239k22340L9543j74229R9782K21034j22596p9320n833
$$ 1452889 1891158 1629919 1407579 1447122 1272893 1372675 1593709 1471113 1391793 1385960
16544A385960J42083m439p9373M0718p3065j85791j24316M80835p45157N08024
$$ 1385960 1528043 1523604 1444231 1484949 1411884 1226093 1101777 1582612 837455 1345479
16534A345479r744q477k91980J84959l46520M97592j31977k27979j69334J20939
$$ 1345479 1335735 1327258 1035278 1220237 873717 1371309 1239332 1011353 842019 962958
16524I62958j20630K15337J01860k54435K24414l96824K86013O1551n6792k58103
$$ 962958 842328 1057665 1159525 905090 1129504 732680 1018693 1080244 1023452 765349
16514G65349M14644l81171M68685l02791k6918J38561j81645r7035L46863M6269
$$ 765349 1179993 798822 1267507 964716 937798 1076359 894714 797679 1144542 1190811
16504A190811m97511j56742M09324l93675M23746j74885M9646n2996J36736m19540
$$ 1190811 693300 536558 945882 552207 975953 801068 850714 797718 934454 514914
16494E14914M9421L49385m53538K12716m1888M67359k86005l78164J41299K820
$$ 514914 564335 913720 460182 672898 631010 1098369 812364 434200 575499 578319
16484E78319m8884L50600j65393k84643J05600J3841M3979J04630C20431J14165
$$ 578319 529435 880035 714642 429999 535599 549440 593419 698049 320431 434596
16474D34596K00234j33979q0593K47213A72800L35955O3613K01207C30142K54566
$$ 434596 634830 500851 420258 667471 172800 508755 572368 773575 330142 584708
16464E84708p3426J40891j49019j04135K09588j41522O4668I9730K68870K44889
$$ 584708 511282 652173 503154 399019 608607 467085 531753 99730 368600 613489
16454F13489B99236K42973r0375Q5033K75889l24858n0997j68375Q6642Q3923
$$ 613489 299236 542209 451834 536867 812756 487898 436901 268526 355168 439091
16444D39091L4179k03441K8027J35604l9341q6271L55628j16338J67287A19606
$$ 439091 473270 269829 297856 433460 394119 307848 663476 547138 714425 119606
16433C18424q6353M15327G0275M51085k11245J13494O8091B00999M93996k46752
$$ 318424 232071 647398 70275 521360 310115 423609 491700 200999 694995 448243
16423D48243k00172J0887m2740L19278B37874l5653J5452K19918A61742o4047
$$ 448243 248071 258958 216218 535496 237874 202221 217673 437591 161742 97695
16413I7695L24874N2679j22025j64145J15800K14993j99224p7570m4532k5552
$$ 97695 422569 475248 353223 189078 304878 519871 320647 243077 198545 172993
16403A72993n8806L74176j60977q8760j03713O8008B9170L87597A30150K62269
$$ 172993 114187 488363 327386 238626 134913 202921 29170 416767 130150 392419
16393C92419A42467J96933M1627R1176k06296Q3110C1511J60786G7090L52571
$$ 392419 142467 339400 381027 472203 265907 349017 31511 192297 77090 429661
16383D29661j88862J04289A51432J52465j11616d1080C91467O8541k05535I1628
$$ 429661 240799 345088 151432 303897 192281 -41080 391467 460008 254473 91628
16372A54582J32163a68715B12984K78921I7733J11264j00443J55117g3266A02994
$$ 154582 286745 -168715 212984 491905 97733 208997 108554 263671 -73266 102994
16361B37228M7237Q7937H6005P3464a22428C83448j76904Q0390n1460g8464I1768
$$ 237228 284465 372402 86005 159469 -122428 383448 206544 286934 235474 -78464 91768
16349B14934A03580k9682L57938j80634a76337D49114c8807A19103J38507n5183
$$ 214934 103580 73898 431836 251202 -176337 449114 -38807 119103 257610 202427
16339B02427g3409b5347B27340L53420E184L20496n2727c8086B47387c3839G8558
$$ 202427 -73409 -25347 227340 580760 5184 325680 272953 -38086 247387 -33839 78558
16327D8767j0573g4542E25426b3026D8040J95630P8616J45882A5610l965J01878
$$ 48767 38194 -74542 525426 -23026 48040 243670 322286 468168 15610 11645 113523
16316A13523K97999A31650F2811L21669l0138d6680A43674a3447B75926h4298
$$ 113523 411522 131650 62811 384480 354342 -46680 143674 -13447 275926 -84298
16305B70731o0070r2531J05392q3169i1042H1683R7083b02697M9501A44214a48006
$$ 270731 210661 118130 223522 140353 -91042 81683 178766 -202697 -153196 144214 -148006
16293G2890K35966q8124M351b545A28835h7513A75392L81761B17917j04630J06660
$$ 72890 308856 220732 225083 -2545 128835 -87513 175392 557153 217917 113287 219947
16282B19947p3851l3461a36029E1424G680K00104K75462A72519a24050C2430J14119
$$ 219947 146096 112635 -136029 51424 7680 207784 483246 172519 -124050 32430 146549
16271A46549a26166A38920N0897I3406b23582A71780R1188E3899L507J46738a6291
$$ 146549 -126166 138920 189817 93406 -223582 171780 262968 53899 57406 204144 -16291
16259B33069N9851D9318f0150a6745I5137a7653D3979J34678a44695p0291E9212
$$ 233069 292920 49318 -60150 -16745 95137 -17653 43979 178657 -144695 -214986 59212
16247b68576P7856E5951d9771A67975a32617K9261K2076B92222c15922A70662
$$ -268576 -190720 55951 -49771 167975 -132617 -103356 -81280 292222 -315922 170662
16236b3287F9262a84752c1467B34330q1162i2760D0707J05943f2899G107K022
$$ -23287 69262 -184752 -31467 234330 153168 -92760 40707 146650 -62899 7107 9129
16225I129f2306P029j7994A79647q6619b66377H7845K52663A41374J67610G5352
$$ 9129 -62306 -55277 -73271 179647 93028 -266377 87845 340508 141374 308984 75352
16213A85089b7969R867l7768A81462B2455J4207a39836C75657A46673i0685A66851
$$ 185089 -27969 -18102 -55870 181462 22455 36662 -139836 375657 146673 -90685 166851
16201A45900C0826a56510A73549j0268f6009B40737J4035G3785A3563c1544k98204
$$ 145900 30826 -156510 173549 163281 -66009 240737 254772 73785 13563 -31544 -329748
16190c29748A90163C8407a11868m6112B14836a66367g3214B85066L572A26761
$$ -329748 190163 38407 -111868 -157980 214836 -166367 -73214 285066 288638 126761
16179a01885H2486e8450k8351a9559q5875A37992c65093A15441A5046a93556L8752
$$ -101885 82486 -58450 -86801 -19559 -105434 137992 -365093 115441 15046 -193556 -154804
16168a54804j01028a10523j86671O7390f3024l1879k02330g7211j81030A40974
$$ -154804 -255832 -110523 -297194 -229804 -63024 -94903 -297233 -77211 -258241 140974
16157H6498b66009A21601a89899A57487e3138l36281a6538B30355f2906n5778
$$ 86498 -266009 121601 -189899 157487 -53138 -389419 -16538 230355 -62906 -118684
16147a18684I4920J09548b50867e3175j10476K4983r0819L3376f0982A19633g1119
$$ -118684 94920 204468 -250867 -53175 -163651 -138668 -229487 -196111 -60982 119633 -71119
16135A13972C8109O2322b20019r9527F7786B1320a1570C00992C5151b3439k6417
$$ 113972 38109 100431 -220019 -319546 67786 21320 -11570 300992 35151 -23439 -49856
16124d9856A88025f00753D4101c61334b5703j09155q4620Q9915I9014J1078C2514
$$ -49856 188025 -600753 44101 -361334 -25703 -134858 -219478 -129563 99014 110092 32514
16112a18862j76106J46499K0712H4947h0678B12135O4046b4654G1904J31970b05358
$$ -118862 -294968 -148469 -127757 84947 -80678 212135 276181 -24654 71904 203874 -205358
16100i8466k76760C93177j82297h5501M1597j3156F5882M0423a1492F3199f7217
$$ -98466 -375226 393177 210880 -85501 -43904 -57060 65882 106305 -11492 63199 -67217
16088g0320n2438F1206b02087K6611d8147B84080a28506L3276D31972c60658C35158
$$ -70320 -122758 61206 -202087 -175476 -48147 284080 -128506 -95230 431972 -360658 335158
16076a76789m5664A01211b38753a05047k71585a47559G9578h248F4011g2986b1005
$$ -176789 -222453 101211 -238753 -105047 -376632 -147559 79578 -8248 64011 -72986 -21005
16064g2267A87319r2620A5662J7597b375A0606h3149q101d4449k75867e225j15048
$$ -72267 187319 94699 15662 33259 -2375 10606 -83149 -91250 -44449 -320316 -5225 -120273
16052a20273m405B35976d6768j41424A15731a76809B21217a78495A26469Q0325
$$ -120273 -124678 235976 -46768 -188192 115731 -176809 221217 -178495 126469 206794
16042B06794H3J5589N7051K8004a36180D7618P8862f9631B67877A32139N6292
$$ 206794 83 15672 72723 100727 -136180 47618 126480 -69631 267877 132139 188431
16031A88431A5536c50456a63910A16199N7531L59037g3684A74173j4903b6909
$$ 188431 15536 -350456 -163910 116199 173730 532767 -73684 174173 159270 -26909
16020F1119E864a3787p2936A39411k8563a61521N9184l9973D9612a20702A80681
$$ 61119 5864 -13787 -86723 139411 110848 -161521 -102337 -142310 49612 -120702 180681
16008b96391a10991C20641b79187B13778a2388l9277b2193j53378d1373m5294
$$ -296391 -110991 320641 -279187 213778 -12388 -51665 -22193 -175571 -41373 -86667
15998h6667B37282G0192c11424J11631Q3020k231A52688b90105C23743c8274A75513
$$ -86667 237282 70192 -311424 -199793 -116773 -119004 152688 -290105 323743 -38274 175513
15986a11941A19393a7131I7961J22599J14466K10435R7897F8684K68240p1250
$$ -111941 119393 -17131 97961 220560 335026 545461 643358 68684 336924 265674
15976B65674b25063A06106b39408H9763a73254k7478e020j34827A11226a04458
$$ 265674 -225063 106106 -239408 89763 -173254 -200732 -5020 -139847 111226 -104458
15965a96076A5818M4346K5309J95338j37219J13367A040a2689D3386a19021c5679
$$ -196076 15818 60164 85473 280811 143592 256959 1040 -12689 43386 -119021 -35679
15953B64831c11773A75698b73812N1053G006M1461b8736j15969f6589j45341M738
$$ 264831 -311773 175698 -273812 -222759 7006 48467 -28736 -144705 -66589 -211930 -207192
15942b07192B63979b16380f9041l43171H2619d5758j51300A67120j9996o1409
$$ -207192 263979 -216380 -69041 -412212 82619 -45758 -197058 167120 147124 85715
15932H5715l0272R0863c43897a47048K4259k46507i5957p7356d7931l24691H211
$$ 85715 55443 146306 -343897 -147048 -122789 -369296 -95957 -173313 -47931 -372622 8211
15920B31099I1273c2131p4379j22512G1177b9487k957n9930j06511i1585o0483
$$ 231099 91273 -32131 -106510 -229022 71177 -29487 -32444 -92374 -198885 -91585 -152068
15909a52068j7019G3835b4685j66962B30253p4783a33580j2200B20854B3242b57107
$$ -152068 -169087 73835 -24685 -191647 230253 155470 -133580 -145780 220854 23242 -257107
15897f5325k5030B5171a27643E0278A5323J73825b63433J02830p0864D6430R5158
$$ -65325 -90355 25171 -127643 50278 15323 189148 -263433 -160603 -231467 46430 141588
15886A41588B1726C588b76031A65646a04049k8159R736A22638a07180A32584m4214
$$ 141588 21726 3588 -276031 165646 -104049 -132208 -122472 122638 -107180 132584 88370
15875H8370b44484A96563l0656c33231C4113e8796E900c48013c2219A23216a29334
$$ 88370 -244484 196563 165907 -333231 34113 -58796 5900 -348013 -32219 123216 -129334
15863a01586A22988a57808d3832m1700k42711c3746j89067A28826f6257j54587
$$ -101586 122988 -157808 -43832 -85532 -328243 -33746 -222813 128826 -66257 -220844
15853b20844B27345E4135c58006H5306L652c1641B92031a30665B84862B5823h5948
$$ -220844 227345 54135 -358006 85306 88958 -31641 292031 -130665 284862 25823 -85948
15841B15514G9212J9985l9364J70086I2222c72732a5760j44019p6386B09400C1726
$$ 215514 79212 99197 59833 229919 92222 -372732 -15760 -159779 -236165 209400 31726
15829f5609j88315P9910B23717a45987k35685a39288p1920C1269b31801G3351
$$ -65609 -253924 -174014 223717 -145987 -381672 -139288 -211208 31269 -231801 73351
15818a77944P6215K3797K9361C2305P8124b86726a34104k19078J01429J25788
$$ -177944 -101729 -77932 -48571 32305 110429 -286726 -134104 -353182 -251753 -125965
15808a25965c7132a7494j44089A87175A6711P5685D4874a02854j49900B7429j1650
$$ -125965 -37132 -17494 -161583 187175 16711 92396 44874 -102854 -252754 27429 15779
15797A5779F334e0308p9891B6343P0189K4864a20188I3493c4093k35477H7333
$$ 15779 6334 -50308 -130199 26343 96532 121396 -120188 93493 -34093 -269570 87333
15785d5431j53762E12783b76663c6699l44940C2282N4042J08891b34023A45581
$$ -45431 -199193 512783 -276663 -36699 -381639 32282 86324 195215 -234023 145581
15774B0099M7467Q5271f3193r7498C85524b92025D8661h4275A24377g1687L4664
$$ 20099 67566 152837 -63193 -160691 385524 -292025 48661 -84275 124377 -71687 -37023
15763c7023E3770a34063o107b0979k0864B7966K29544H3586c8982D0652d8303
$$ -37023 53770 -134063 -140170 -20979 -41843 27966 257510 83586 -38982 40652 -48303
15751A2183a29442n0560B43114H5236p860b3725J1257A65609A8951a08543l40758
$$ 12183 -129442 -180002 243114 85236 77376 -23725 -12468 165609 18951 -108543 -449301
15740d49301d3782g571F6257b08303E0169J15887p9864L2198e0995B22500g6169
$$ -449301 -43782 -7571 66257 -208303 50169 166056 86192 118390 -50995 222500 -76169
15728A31913e7725k59275b3482C12679c893A57225n3849B7481d9051j8100A85380
$$ 131913 -57725 -317000 -23482 312679 -3893 157225 103376 27481 -49051 -67151 185380
15716B17599j635c96032B56038a13986G1253P0352b1699r0792E6795a28625E4321
$$ 217599 215964 -396032 256038 -113986 71253 141605 -21699 -112491 56795 -128625 54321
15704A17167D9157b03872A65413C0352O1919b33566a03872c7073r5160j9420E7820
$$ 117167 49157 -203872 165413 30352 92271 -233566 -103872 -37073 -132233 -151653 57820
15692D4705A0930a48270A73018B5230L0516b28448L3313B69299E1272b6176A6828
$$ 44705 10930 -148270 173018 25230 55746 -228448 -195135 269299 51272 -26176 16828
15680f0469K4276C8529L70382C6657M7882J16278c5672A56352j3750N1772A6503
$$ -60469 -36193 38529 408911 36657 84539 200817 -35672 156352 142602 194374 16503
15668D4897Q5147J2703a17261j17359M0189C2631P3153a37977A61180b9429A69913
$$ 44897 130044 142747 -117261 -234620 -194431 32631 105784 -137977 161180 -29429 169913
15656a34997j01097c3426l81328B42915a04360d4302J0141B39748n9269d7818
$$ -134997 -236094 -33426 -414754 242915 -104360 -44302 -34161 239748 180479 -47818
15645C00259A01342a59076D22491a32829e583B1836b99642G7610j8793c3120h281
$$ 300259 101342 -159076 422491 -132829 -5583 21836 -299642 77610 58817 -33120 -8281
15633e01248A1169O5195L5795a05891B08610g1426k35994r5181Q5542a48288C7252
$$ -501248 11169 76364 112159 -105891 208610 -71426 -307420 -402601 -317059 -148288 37252
15621c07962E1556j2718K15076J64839a16623B74720b06095D6789O220K92435
$$ -307962 51556 38838 253914 418753 -116623 274720 -206095 46789 53009 345444
15611C45444j12418q9535a22384C00052D2008b80843a36464B22361b65214p6560
$$ 345444 233026 143491 -122384 300052 42008 -280843 -136464 222361 -265214 -341774
15601c41774a37120H4333J38027R7444a9192A59005C1932g1044a6461r838j52792
$$ -341774 -137120 84333 222360 319804 -19192 159005 31932 -71044 -16461 -26299 -179091
15590a79091Q2465P868j64418D9365M9576A9705a84774A19689a69811P8972A6880
$$ -179091 -96626 -88758 -253176 49365 98941 19705 -184774 119689 -169811 -90839 16880
15578b96574j5390a0762l07071A23555d6948B09179d5115B2016a40430C4002a63525
$$ -296574 -311964 -10762 -317833 123555 -46948 209179 -45115 22016 -140430 34002 -163525
15566a00453j7131j18646I4792a2513l1891j56127k3015O0406L9255q5481E6261
$$ -100453 -117584 -236230 94792 -12513 -44404 -200531 -223546 -163140 -123885 -209366 56261
15554E567M52290I865e1396r7280o6460k5687B34971B1727K88287b3783F7488
$$ 5567 457857 9865 -51396 -148676 -215136 -240823 234971 21727 310014 -23783 67488
15542a31071O2299A12866J77858c2588A5966K86470j26585J1613M1496H4816P3922
$$ -131071 -68772 112866 290724 -32588 15966 302436 175851 187464 228960 84816 158738
15531A58738E9499a41260k14960H345J70063p8713M9808R0714a5442r0638r8901
$$ 158738 59499 -141260 -356220 8345 178408 99695 149503 240217 -15442 -106080 -204981
15520b04981M7797D0827L24604c8504H2957J309J77680m846H9631J47705b61991
$$ -204981 -157184 40827 365431 -38504 82957 84266 261946 257100 89631 237336 -261991
15508a73380h3580L551A27746k611a6873j36075G4437a41729A57998L1856r4776
$$ -173380 -83580 -80029 127746 125135 -16873 -152948 74437 -141729 157998 189854 95078
15497I5078k0628e0356c493j54345g0316A64718a4367k35493a427B56460i5866
$$ 95078 74450 -50356 -3493 -157838 -70316 164718 -14367 -249860 -1427 256460 -95866
15485a84993n6423C3357e1045m4134p0052f4818j00726A38344k1767a57570B9613
$$ -184993 -241416 33357 -51045 -95179 -165231 -64818 -165544 138344 116577 -157570 29613
15473B09166c02428A2023J06222c4510j52781A40340K9598e7717F3386b66090
$$ 209166 -302428 12023 118245 -34510 -187291 140340 169938 -57717 63386 -266090
15462D0629a02356C16735P3493r920A13628f7049B97414F8801J88744b45794B05388
$$ 40629 -102356 316735 390228 380308 113628 -67049 297414 68801 257545 -245794 205388
15450a17349F9842C4714N8420b84878A79531p1181L4308F1624g9308C46597A14540
$$ -117349 69842 34714 93134 -284878 179531 108350 142658 61624 -79308 346597 114540
15438g0027q299j82508b3457I6162A5925l110e3269j19508C5229J918K19478b1204
$$ -70027 -78326 -260834 -23457 96162 15925 12815 -53269 -172777 35229 37147 256625 -21204
15425G0739i5538j38051A64296h0735q515b5107A0033a4189j35765N7549C27936
$$ 70739 -95538 -233589 164296 -80735 -89250 -25107 10033 -14189 -149954 -92405 327936
15413A51844j0584P4904a94187h4907n0907F2986M9123j6640C0628K16670A0838
$$ 151844 141260 216164 -194187 -84907 -135814 62986 112109 95469 30628 247298 10838
15401b04904N7188k95726A20108b95976a31726A8621e284H1196E888R7834M751
$$ -204904 -147716 -443442 120108 -295976 -131726 18621 -5284 81196 5888 103722 108473
15390A08473e1304B15175c28259A49256E7461Q0398a54117J6649J6162N3433o2213
$$ 108473 -51304 215175 -328259 149256 57461 137859 -154117 -137468 -121306 -67873 -130086
15379a30086j46702h4185A95711b34697C9517M0032a3179A96872e495A63146P5378
$$ -130086 -276788 -84185 195711 -234697 39517 79549 -13179 196872 -5495 163146 238524
15368B38524a54446f8445m22046D05971h2040E5007K12106g8075C2444A063b69534
$$ 238524 -154446 -68445 -490491 405971 -82040 55007 267113 -78075 32444 1063 -269534
15356a26034g959A06694D7097a01759A67387n9366C8584L0584m126J50484b5889
$$ -126034 -7959 106694 47097 -101759 167387 108021 38584 69168 65042 215526 -25889
15344h112E0138Q3796b44564A42568j4970J78233b52043P2393B29545F0396a62050
$$ -8112 50138 133934 -244564 142568 127598 305831 -252043 -179650 229545 60396 -162050
15332B3303e5093a0501l87739A86897F1303b55036C92465b1244j7950m3911A34268
$$ 23303 -55093 -10501 -398240 186897 61303 -255036 392465 -21244 -39194 -83105 134268
15320A13598D1409j4861M3907O9798e8557A59739K07517A61100n835E4967j0379
$$ 113598 41409 26548 70455 140253 -58557 159739 367256 161100 155265 54967 44588
15309D4588M8880J64955B8888M289M23158F7886a34604k3168d8321I7194a65951
$$ 44588 93468 258423 28888 33177 456335 67886 -134604 -157772 -48321 97194 -165951
15297G556J20857O956j8593A8087M4006A0374N4719L9968i9117A62118A078O2756
$$ 7556 128413 135369 116776 18087 62093 10374 65093 105061 -99117 162118 1078 63834
15285F3834K5622c8861o5405D20985I1556a28472A84899a7013B07977A7376P3400
$$ 63834 89456 -38861 -104266 420985 91556 -128472 184899 -17013 207977 17376 90776
15274I0776J19921K7876A01980J70326I9320K47858A44871F2024O4458l2659J53536
$$ 90776 210697 238573 101980 272306 99320 347178 144871 62024 126482 93823 247359
15263B47359j02060J53545H9526a98488C22444j2490e4269p9910O0168k44695
$$ 247359 145299 298844 89526 -198488 322444 309954 -54269 -134179 -74011 -318706
15253c18706B5151a33662B41210J1919K15788B24600N29132O07589K01548j73293
$$ -318706 25151 -133662 241210 253129 468917 224600 753732 1361321 1562869 1389576
15243A389576J32817o39661A46515k7183a4538I084d2777B67878K4614n2519H5242
$$ 1389576 1522393 882732 146515 119332 -14538 9084 -42777 267878 292492 239973 85242
15231A09343k8365a34045D9657L6289a75269A34023L29490a97846C18006a519
$$ 109343 80978 -134045 49657 85946 -175269 134023 463513 -197846 318006 -1519
15220A91694J64290C4211K48066F4538c1358C07514p2527o7049g0059b8648G7138
$$ 191694 355984 34211 282277 64538 -31358 307514 234987 167938 -70059 -28648 77138
15208B43519F4943L0584d030A76854O9041j15377b4343k12494B77072o3805a86983
$$ 243519 64943 95527 -4030 176854 245895 130518 -24343 -236837 277072 213267 -186983
15196G7867J21330d828A24860c84705B48713A03383a35538C54842A61462J95120
$$ 77867 199197 -4828 124860 -384705 248713 103383 -135538 354842 161462 356582
15186C56582d03543C4463K91969a227C8505J17240b43115B09042P3006j13961
$$ 356582 -403543 34463 326432 -1227 38505 155745 -243115 209042 282048 168087
15176A68087J52904I447a42599B33075a64227g628j58001F291L76158c3774A05956
$$ 168087 320991 9447 -142599 233075 -164227 -7628 -165629 6291 382449 -33774 105956
15164A20395O8398L1226J23921A68368F2468h2814O76j85208R0661L4766F3845
$$ 120395 188793 220019 343940 168368 62468 -82814 -82138 -267346 -176685 -141919 63845
15152a52485B89244H3160K16635j36905B2779L12488A44399D4613J52702K6223
$$ -152485 289244 83160 299795 162890 22779 335267 144399 44613 197315 223538
15142B23538b57452c4381C74652c1637m6348A62620R088p0379d7186j88407A63732
$$ 223538 -257452 -34381 374652 -31637 -77985 162620 171708 101329 -47186 -235593 163732
15130A23786M1467b08060F4022M9676B2402K74054d6663A64393o7107O9014K64134
$$ 123786 165253 -208060 64022 113698 22402 296456 -46663 164393 97286 166300 430434
15119D30434j3913A17542L84621A48765e928p2933A5519a05762k9644A50719J57932
$$ 430434 416521 117542 502163 148765 -5928 -78861 15519 -105762 -135406 150719 308651
15108C08651a49899A33209J31298o6564q2358k8717k891a79990A26870i6088C24449
$$ 308651 -149899 133209 264507 197943 115585 86868 83977 -179990 126870 -96088 324449
15096d1956C32609a2292B24563m917H2129K31259A36329O922K71647A81221K56467
$$ -41956 332609 -12292 224563 219646 82129 313388 136329 143251 414898 181221 437688
15085D37688j21560q2810m2213F4029K83250A28992b19583E9143b2887F5786J14725
$$ 437688 316128 233318 191105 64029 347279 128992 -219583 59143 -22887 65786 180511
15074A80511P6636q2631H6740J56213q2037n5593O3188Q6875n8780O9909j09262
$$ 180511 257147 174516 86740 242953 160916 105323 168511 255386 196606 266515 157253
15063A57253F1104J07465g8663A75447k4153L3164j8518k1060j7497R4538L18582
$$ 157253 61104 168569 -78663 175447 151294 184458 165940 144880 127383 221921 540503
15052E40503j91673l7518j53073E6827J27229o7401j721J97292J05996f0816G8150
$$ 540503 348830 311312 158239 56827 184056 116655 114934 312226 418222 -60816 78150
15040C94813j72479I8102M09994B02151O3696J72186A05358K0276J21337K07948
$$ 394813 222334 98102 508096 202151 265847 438033 105358 125634 246971 454919
15030D54919A32471J41524o7279f329C52495j18154d217G9115J93137L1574Q4263
$$ 454919 132471 273995 206716 -6329 352495 234341 -4217 79115 272252 303826 388089
15019C88089P5876A41302K4948b8583A30658K39511j16734H0368M06984G8556
$$ 388089 463965 141302 166250 -28583 130658 370169 253435 80368 487352 78556
15008A60017d7566I8836F634K67685j26591J17621j15704K53166o2596l6172j45468
$$ 160017 -47566 98836 6634 274319 147728 265349 149645 402811 340215 304043 158575
14997A58575b5095p2698A18555k3185L2000K20190j71811P4797n7020J30152K60294
$$ 158575 -25095 -97793 118555 95370 127370 347560 175749 250546 193526 323678 583972
14986E83972j63482j61855r0408K08700H001K79690k3506E9355L04239D7578a53124
$$ 583972 420490 258635 168227 376927 8001 287691 264185 59355 363594 47578 -153124
14974F4926M33970A89676K61997j81414L3683L3204Q9924j56655a45661C02570
$$ 64926 498896 189676 451673 270259 303942 337146 427070 270415 -145661 302570
14963A55588N6156K80281k23164J38714k4687o5429M11767l63949K3566K57209
$$ 155588 211744 492025 268861 407575 382888 317459 729226 365277 388843 646052
14953F46052B44136h964C25854j29812R5146J95571k5595n0349A73550K68675
$$ 646052 244136 -8964 325854 196042 291188 486759 461164 410815 173550 442225
14943D42225j58188K5221K4844K38613e2525B78409J05696D0140J35379K19439
$$ 442225 284037 309258 334102 572715 -52525 278409 384105 40140 175519 394958
14933C94958O4255j52034m7691J75741J13572e7759E23002k15825J78323J2365
$$ 394958 459213 307179 259488 435229 548801 -57759 523002 307177 485500 497865
14923D97865k45854n1429K68948N8454k47683H465J50929J18026K45834j42821
$$ 497865 252011 200582 469530 527984 280301 8465 159394 277420 523254 380433
14913C80433j66190r2812L1344K97391A33207N5811R3999j39816M27254j09836
$$ 380433 214243 121431 152775 450166 133207 189018 283017 143201 570455 460619
14903D60619j19329j10227K00463j69923M46210B17728n3202J31331K21953m9528
$$ 460619 341290 231063 431526 261603 707813 217728 164526 295857 517810 468282
14893D68282A56186K97935I9677O3256N00988A88941M22809j28941r1618H0340
$$ 468282 156186 454121 99677 162933 663921 188941 611750 482809 391191 80340
14882E79375A35520K2371J88576H0590M84022k05196J08653J39552k04563o990
$$ 579375 135520 157891 346467 80590 564612 359416 468069 607621 403058 396068
14872C96068r1123L10386j71005K32515I7928N20733B78135K31577k28306m8195
$$ 396068 304945 615331 444326 676841 97928 618661 278135 509712 281406 233211
14862B33211J91762M8610A61803O9758M49301q0272B23112K33481j9785A86385
$$ 233211 424973 473583 161803 231561 680862 600590 223112 456593 436808 186385
14851D91724A38555J60726J2379l1759J05418J79065c9703E78110A40444M04318
$$ 491724 138555 299281 311660 279901 385319 564384 -39703 578110 140444 544762
14841E44762Q7053k04043j87780k9887M19818p1898j65420r2899L95301k87698
$$ 544762 631815 427772 239992 210105 629923 558025 392605 299706 695007 407309
14831D07309N45478l38094B09256J09405n4394R605K82312j25634J52867B58996
$$ 407309 952787 614693 209256 318661 264267 273872 556184 430550 583417 258996
14820F08537j5974k56009m3796J1999K70888m3239j2711l1002m3468A49547M15271
$$ 608537 592563 336554 292758 304757 575645 532406 519695 488693 445225 149547 564818
14809E64818j74844M77299j90146l6486J25348k55616J53661j16092J70316K5688
$$ 564818 389974 867273 677127 640641 765989 510373 664034 547942 718258 743946
14799G43946j34091l1390N0626l8673K2665B54825K18887l2695J20886p6623J15638
$$ 743946 609855 578465 629091 590418 613083 254825 473712 441017 561903 485280 600918
14788F00918B05307K60220J79835k9256j831p9612k6559J52807J48646j82394
$$ 600918 205307 465527 645362 616106 614275 534663 508104 660911 809557 627163
14778F27163n6704Q3771K28056r8608l2129l06491L68520j66480K18770k69310
$$ 627163 570459 654230 882286 783678 751549 445058 813578 647098 865868 596558
14768E96558Q6693k18911N82005m53019J2585k1526O5467K08636l71745M11176
$$ 596558 683251 464340 1046345 593326 605911 584385 649852 858488 486743 897919
14758H97919m4223j29272J12557j46528k76360k3913N3284M92295j81336K1023
$$ 897919 853696 724424 836981 690453 414093 390180 443464 935759 754423 775446
14748G75446l46092K54271j86506R5511J74388L4962k65900J20453k08113M42313
$$ 775446 429354 683625 497119 592630 767018 801980 536080 656533 448420 890733
14738H90733D37324N51719m18599J91109N0265q1675K25719k00533j46165K0776
$$ 890733 437324 989043 570444 761553 811818 730143 955862 755329 609164 629940
14728F29940K03879j53539L056N7831q6351l1459M10167j27902j43338j30082
$$ 629940 833819 680280 683336 741167 654816 623357 1033524 905622 762284 632202
14718F32202J62454L00832j64791k17617j66979K2831L01283o2467M4237J4388
$$ 632202 794656 1095488 930697 713080 546101 568932 870215 807748 851985 866373
14708H66373q5190J65473j68634K56323K3342m07349M06069j00893L7808J09529
$$ 866373 781183 946656 778022 1034345 1057687 650338 1056407 955514 993322 1102851
14698A102851j56356q6578k20331J8563K1363K60484J35810D08968L87111Q039
$$ 1102851 946495 859917 639586 658149 679512 939996 1075806 408968 796079 804118
14688H04118k8579L50697k65885J56267J113q3869K49198K0149E75690N64677
$$ 804118 775539 1126236 860351 1016618 1017731 933862 1183060 1203209 575690 1140367
14678A140367m03964L64596J65521l46145k10659K39558R7663j80194K6408L06829
$$ 1140367 736403 1100999 1266520 920375 709716 949274 1046937 866743 893151 1199980
14668A199980j10917m4885n6670j49425r7650J13750L551Q891J43831N6246j1886
$$ 1199980 1089063 1044178 987508 838083 740433 854183 857734 866625 1010456 1066702 1054816
14657A054816J18626k64507n7153L16436j32407L35548J0941k92253L33571k41518
$$ 1054816 1173442 908935 851782 1168218 1035811 1371359 1382300 1090047 1423618 1182100
14647A182100J09333K67208o28849J93111J36580J59310r6609J96827P579l78286
$$ 1182100 1291433 1558641 929792 1122903 1259483 1418793 1322184 1519011 1526590 1148304
14637A148304N87544n67025J25771p010j00882J85964l04701J99909J33115j16482
$$ 1148304 1735848 1168823 1294594 1287584 1186702 1372666 1067965 1267874 1400989 1284507
14627A284507J74908n4372j26046J54071l04052K23370M30180l53377j12280K54999
$$ 1284507 1459415 1405043 1278997 1433068 1129016 1352386 1782566 1429189 1316909 1571908
14617A571908j40062K2262R8524K49435j99107j5845k57547J08916p9543K30276
$$ 1571908 1431846 1454108 1552632 1802067 1602960 1587115 1329568 1438484 1358941 1589217
14607A589217k17189J31394L4996R725o3842m779M24142m15758K88689p8748J68667
$$ 1589217 1372028 1503422 1538418 1548143 1484301 1479522 1903664 1487906 1776595 1697847 1866514
14596A866514k21469K96268k81458j76594K02501J39461k35146K35050j91598
$$ 1866514 1645045 1941313 1659855 1483261 1685762 1825223 1590077 1825127 1633529
14587A633529n529L00844K98250l00138k0227O5817l1495J29938j99473J87606
$$ 1633529 1628000 1928844 2227094 1926956 1906729 1972546 1941051 2070989 1871516 2059122
14577B059122j49892p4809K2854L93917K81374l58730K10698k76586K40736m23254
$$ 2059122 1909230 1834421 1857275 2251192 2532566 2173836 2384534 2107948 2348684 1925430
14567A925430M76376k68287O9157N23230l23215r8916O03317k72846K70379j42878
$$ 1925430 2401806 2133519 2202676 2725906 2402691 2303775 2907092 2634246 2904625 2761747
14557B761747P1742N09291J28438K33038M2072M26713K36576J294543K563834
$$ 2761747 2833489 3342780 3471218 3704256 3746328 4173041 4409617 5704160 8267994
14548H267994L627681P795482J4781599Q099676j9626928A0768970l156699k605415
$$ 8267994 11895675 19691157 34472756 42572432 22945504 10768970 7612271 5006856
14540E006856j982405L3509o83470l82185q3994j3878J55777k79292N94130j85049
$$ 5006856 3024451 3057960 2374490 1992305 1908311 1894433 2050210 1770918 2365048 2179999
14530B179999K00569k41295K60478Q2531M9464j69313K77253m36116K66112k05404
$$ 2179999 2380568 2139273 2399751 2482282 2531746 2362433 2639686 2203570 2469682 2264278
14520B264278M01556k81884J01706M6000j09258M74893k75042j66678K99629P14
$$ 2264278 2665834 2383950 2485656 2531656 2422398 2897291 2622249 2455571 2755200 2755914
14510B755914o792K17827j89221J50125m9448L5996L65503J04629m10183K55984
$$ 2755914 2749122 2966949 2777728 2927853 2878405 2914401 3279904 3384533 2974350 3230334
14500C230334l3949J53921j20283j89205K37891k3471K92451p19347O20049j91622
$$ 3230334 3196385 3350306 3230023 3040818 3278709 3255238 3547689 2828342 3448391 3256769
14490C256769M96296n03302K90853L8332J39596m1743J30835q6362K58947l5186
$$ 3256769 3753065 3249763 3540616 3578948 3718544 3676801 3807636 3721274 3980221 3945035
14480C945035J31799J98773j67919l78139N57531k47042M0972l1377N54508j19229
$$ 3945035 4076834 4275607 4107688 3729549 4287080 4040038 4081010 4049633 4604141 4484912
14470D484912P1442K27315o4971k45285m37754N37592J05732j55183M48639p5721
$$ 4484912 4556354 4783669 4718698 4473413 4035659 4573251 4678983 4523800 4972439 4896718
14460D896718J35664j46963L61558l63270K78093k543j23705L78723j87155k83571
$$ 4896718 5032382 4885419 5246977 4883707 5161800 5159257 5035552 5414275 5227120 4943549
14450D943549P65253J9625l23566n0384J04479N70579l69508L98425l32133P18064
$$ 4943549 5708802 5728427 5404861 5354477 5458956 6029535 5660027 6058452 5726319 6444383
14440F444383k70511J98529k35576K56821j58129K24896J03011J26278P4631J48754
$$ 6444383 6173872 6372401 6136825 6393646 6235517 6460413 6563424 6689702 6764333 6913087
14430F913087j17279L35680p6548m4062K78353K02261K04619j09499L33766o7130
$$ 6913087 6795808 7131488 7054940 7010878 7289231 7491492 7696111 7586612 7920378 7853248
14420G853248J16464j01083K73897J3562L87883N9449K16804k68709K69367O04809
$$ 7853248 7969712 7868629 8142526 8156088 8543971 8603420 8820224 8551515 8820882 9425691
14410I425691o6462L27042k93835j03573Q53949l21142J23166J04021M09454k46040
$$ 9425691 9359229 9686271 9392436 9288863 10142812 9821670 9944836 10048857 10458311 10212271
14400A0212271K52271J35895j27620P38466J3227L48708k3543r1192P99354l28867
$$ 10212271 10464542 10600437 10472817 11211283 11224510 11573218 11549675 11458483 12257837 11928970
14390A1928970N23864K48836j9977M48447K25385J80801Q7235K06414R6733M93755
$$ 11928970 12452834 12701670 12681693 13130140 13355525 13536326 13623561 13829975 13926708 14420463
14380A4420463K78322K99445R4866P34951k80859N96998M20409L52872j46822
$$ 14420463 14698785 14998230 15093096 15828047 15547188 16144186 16564595 16917467 16770645
14371A6770645M24930N76185K88288J23054O27948K73312L29506M59205N61178
$$ 16770645 17195575 17771760 18060048 18183102 18811050 19084362 19413868 19873073 20434251
14362B0434251L13820K26937R86491n8141O44162O73436O15108N59668M63015
$$ 20434251 20748071 20975008 21961499 21903358 22547520 23220956 23836064 24395732 24858747
14353B4858747L80724R87300L41468O19095J021003K30793J158693N5769J240438
$$ 24858747 25239471 26226771 26568239 27187334 28208337 28439130 29597823 29653592 30894030
14344C0894030O33476J027914O42830Q90679J426367M34553J173898Q93707J253686
$$ 30894030 31527506 32555420 33198250 34088929 35515296 35949849 37123747 38017454 39271140
14335C9271140J258031J247609J249911J469342J243062P84146J817269J268405
$$ 39271140 40529171 41776780 43026691 44496033 45739095 46523241 48340510 49608915
14327D9608915K170357J509584J601729K003029K009982J810862K139972K483953
$$ 49608915 51779272 53288856 54890585 56893614 58903596 60714458 62854430 65338383
14319F5338383J986482K606527K891995K166994K913077L140775L174754L538985
$$ 65338383 67324865 69931392 72823387 74990381 77903458 81044233 84218987 87757972
14311H7757972L319037L550627L942121M330135M127531M777477M558363N488981
$$ 87757972 91077009 94627636 98569757 102899892 107027423 111804900 116363263 121852244
14303A21852244N331746O163241N869655O605042O752416P217847P636586Q357610
$$ 121852244 127183990 133347231 139216886 145821928 152574344 159792191 167428777 175786387
14295A75786387Q569079R228117R538167J0048198J0619675J1288993J1704962
$$ 175786387 184355466 193583583 203121750 213169948 223789623 235078616 246783578
14288B46783578J2267318J2795904J3092539J3972518J4106249J4385527J4524990
$$ 246783578 259050896 271846800 284939339 298911857 313018106 327403633 341928623
14281C41928623J4496100J4349436J4077361J3463157J2682692J1230332J0006089
$$ 341928623 356424723 370774159 384851520 398314677 410997369 422227701 432233790
14274D32233790P545255N603963L100208L72515J384344J527807j745919l756010
$$ 432233790 439779045 445383008 448483216 448855731 450240075 451767882 450021963 446265953
14266D46265953n001254p076602r494094j1396703j2272648j3130947j3752823
$$ 446265953 441264699 434188097 424694003 413297300 401024652 387893705 374140882
14259C74140882j4789343j5220726j5110886j5484386j4640957j4360642j3887435
$$ 374140882 359351539 344130813 329019927 313535541 298894584 284533942 270646507
14252B70646507j2341889j2635454j2211061j1796174j0909653j0303179r687657
$$ 270646507 258304618 245669164 233458103 221661929 210752276 200449097 190761440
14245A90761440r281877q490045p944330p887101p217818p008542o720331n703542
$$ 190761440 181479563 172989518 165045188 157158087 149940269 142931727 136211396 130507854
14237A30507854n607693n187749n400350n079090m450526m277723l544902l957402
$$ 130507854 124900161 119712412 114312062 109232972 104782446 100504723 96959821 93002419
14229I3002419l741862l296846l589969l287946k586683k741811k917320k333698
$$ 93002419 89260557 85963711 82373742 79085796 76499113 73757302 70839982 68506284
14221F8506284k269733k528042j928907j983209k096975j863132j949123j454849
$$ 68506284 66236551 63708509 61779602 59796393 57699418 55836286 53887163 52432314
14213E2432314j030595j669892j779993j774439j349859j152973r23625q01295
$$ 52432314 51401719 49731827 47951834 46177395 44827536 43674563 42750938 41949643
14205D1949643j703335j248884j075528j030412o68599o62513j530107q86581
$$ 41949643 40246308 38997424 37921896 36891484 36222885 35560372 34030265 33143684
14197C3143684p08386q51596o74114l73895j215857n08994o26832j125543l34911
$$ 33143684 32435298 31583702 30909588 30535693 29319836 28810842 28184010 27058467 26723556
14188B6723556o44239n51359r23466o03018l70684o02985l53867m11735m98416
$$ 26723556 26079317 25527958 24604492 24001474 23630790 23027805 22673938 22262203 21763787
14179B1763787o28613m27028n48341j75388k72329m80152m50616p3158o06977
$$ 21763787 21135174 20708146 20159805 19984417 19712088 19231936 18781320 18708162 18101185
14170A8101185k72048m88337j28399l67904L2838o16779m82155j29774o13395
$$ 18101185 17829137 17340800 17212401 16844497 16877335 16260556 15778401 15648627 15035232
14161A5035232j28623l23134j07435j59300j90474p35487M5733l46360k6192l59115
$$ 15035232 14906609 14583475 14476040 14316740 14126266 13390779 13436512 13090152 13063960 12704845
14151A2704845n0207j66492l70586m5837m16207J68772k17802k31016k83577k70863
$$ 12704845 12654638 12488146 12117560 12071723 11655516 11824288 11606486 11375470 11091893 10821030
14141A0821030r3945j67973q2853m02447j27166r1638k99629K51727j0423k70668
$$ 10821030 10727085 10559112 10476259 10073812 9946646 9855008 9555379 9807106 9796683 9526015
14131I526015n76358K21288k79872M58753n38254o552k79610k98289k3655k51275
$$ 9526015 8949657 9170945 8891073 9349826 8811572 8805020 8525410 8227121 8203466 7952191
14121G952191p1456p5746J45115q4436m51992o5455J5516r2493l6064j27696l6670
$$ 7952191 7880735 7804989 7950104 7865668 7413676 7348221 7363737 7271244 7235180 7107484 7070814
14110G070814m72517K23774L0100k16601M0218n7829j36191j76075k57641N47485
$$ 7070814 6598297 6822071 6852171 6635570 6675788 6617959 6481768 6305693 6048052 6595537
14100F595537n68151N016o0528j78250j89341K62918k68068K00216l99086L64573
$$ 6595537 6027386 6032402 5971874 5793624 5604283 5867201 5599133 5799349 5400263 5764836
14090E764836n56742J38438j99822j01158R4533P9704k97242J51427j89905p5019
$$ 5764836 5208094 5346532 5146710 5045552 5140085 5219789 4922547 5073974 4884069 4809050
14080D809050M04504m21087j31751J38161K8413k97620l1706N9896r5185l6354
$$ 4809050 5213554 4792467 4660716 4798877 4827290 4529670 4497964 4557860 4462675 4426321
14070D426321J41098j38783M0886l55788J54236R038k42454R9880M7362J79525
$$ 4426321 4567419 4428636 4469522 4113734 4267970 4277008 4034554 4134434 4181796 4361321
14060D361321j47151J98054j54448q2103n3796k9901k07917k15934r0375p5757
$$ 4361321 4214170 4412224 4257776 4175673 4121877 4091976 3884059 3668125 3577750 3501993
14050C501993K31179k46483P2969j35986q0671k1241K19981k03836k96947q6933
$$ 3501993 3733172 3486689 3559658 3423672 3343001 3321760 3541741 3337905 3040958 2954025
14040B954025M46112q5665J3404K3858j06828M9666J56593l81058l6405l15366
$$ 2954025 3400137 3314472 3327876 3351734 3244906 3294572 3451165 3070107 3033702 2718336
14030B718336O60780l63097l16018R9573K35849j88108R933j21407M92632m80022
$$ 2718336 3379116 3016019 2700001 2799574 3035423 2847315 2857248 2735841 3228473 2748451
14020B748451k64089K67597J56537l64924K22828j62646k6841n8087p100q3162
$$ 2748451 2484362 2751959 2908496 2543572 2766400 2603754 2576913 2518826 2511726 2428564
14010B428564M9351K26137k89664J6133O8841m98565K58355r6295K22492k45521
$$ 2428564 2477915 2704052 2414388 2430521 2499362 2000797 2259152 2162857 2385349 2139828
14000B139828R1386j3028N6604m5357J61453L4090k13741L76661k92252J31199
$$ 2139828 2231214 2218186 2274790 2229433 2390886 2424976 2211235 2587896 2295644 2426843
13990B426843P62222J159877K170566P053481J4541232J4238291j3342264j4241775
$$ 2426843 3189065 4348942 6519508 13572989 28114221 42352512 29010248 14768473
13982A4768473o051479k480638j416733m98543l47842n71824l9404l14131j63524
$$ 14768473 8716994 6236356 4819623 4321080 3973238 3401414 3362010 3047879 2884355
13973B884355k06615m52681M83175r994j27939j92619L54919k09304m33318K27391
$$ 2884355 2677740 2225059 2708234 2698240 2570301 2377682 2732601 2523297 2089979 2317370
13963B317370k15747J42386L8349p7420O0310j0066n07702M04410j92814M172
$$ 2317370 2101623 2244009 2282358 2204938 2265248 2255182 1747480 2151890 1959076 1963248
13953A963248L50811l59100K00575K65576m63065k2453K39089l69320j17441J46677
$$ 1963248 2314059 1954959 2155534 2421110 1958045 1935592 2174681 1805361 1687920 1834597
13943A834597K33783k36244R225J06972q9817j30007O5084k35587K01628R837
$$ 1834597 2068380 1832136 1841361 1948333 1858516 1728509 1793593 1558006 1759634 1769471
13933A769471j61103M58276l49569K0256K00960l01556j24287j42297K86648j11754
$$ 1769471 1608368 2066644 1717075 1737331 1938291 1636735 1512448 1370151 1656799 1545045
13923A545045k82585M32706k7844q5285J3971J23170J49184m03786J5105l95882
$$ 1545045 1262460 1695166 1667322 1582037 1596008 1719178 1868362 1464576 1479681 1083799
13913A083799K76929N2817L55664j96691j04367j03396p3704J38617k19831L53094
$$ 1083799 1360728 1413545 1769209 1572518 1468151 1364755 1291051 1429668 1209837 1562931
13903A562931m13861L49590l82496M09380p2260k14700M19286l322k99349M868
$$ 1562931 1149070 1498660 1116164 1525544 1453284 1238584 1657870 1654548 1355199 1360067
13893A360067N6098p2817k83853M14705j49108k67182j51388Q8019K9968L82945
$$ 1360067 1416165 1343348 1059495 1474200 1325092 1057910 906522 994541 1024509 1407454
13883A407454Q9127n344j93128j17704n5385J63438j26985j83016O12529p14184
$$ 1407454 1496581 1491237 1298109 1180405 1125020 1288458 1161473 978457 1590986 876802
13873H76802L83526k57012o7222J90304k2961l32502L29071q9573J50001Q7653
$$ 876802 1260328 1003316 936094 1126398 1103437 770935 1100006 1010433 1160434 1248087
13863A248087j03886L01132m85148R1077J11475k64584J93475p7982N5173J23616
$$ 1248087 1144201 1445333 960185 1051262 1162737 898153 1091628 1013646 1068819 1192435
13853A192435k84910p2413J7031J52375j47542J01810j21803O4963J69559m21399
$$ 1192435 907525 835112 852143 1004518 856976 958786 836983 901946 1071505 650106
13843F50106L08284l0197p6215J6404P7399k06161M66504k13496k7381L7620n1837
$$ 650106 958390 928193 851978 868382 945781 739620 1206124 992628 965247 1002867 951030
13832I51030k517j74062L55509J18240k09494k69234K39934j96274j01985J98619
$$ 951030 948513 774451 1129960 1248200 1038706 769472 1009406 813132 711147 909766
13822I09766J33391j31512k8091M09104m51998k8583L37001L1037k96447m8656
$$ 909766 1043157 911645 883554 1292658 840660 812077 1149078 1180115 883668 835012
13812H35012k26912L71348l30116k8805J12650J56014J17379l18407L47072k01829
$$ 835012 608100 979448 649332 620527 733177 889191 1006570 688163 1035235 833406
13802H33406J72918l04904J52268o5948J03298k03868m6961J97217j41543m3326
$$ 833406 1006324 701420 853688 787740 891038 687170 640209 837426 695883 652557
13792F52557j7976L58470D17931N01612J35405l88730J7258M30569o6705j74108
$$ 652557 634581 993051 417931 919543 1054948 666218 683476 1114045 1047340 873232
13782H73232l99193K74843K15991D11091K74409p1761J91280k3605Q72j17232
$$ 873232 474039 748882 964873 411091 685500 613739 805019 781414 782286 665054
13772F65054Q7175J47114p4732r823j38968C06496L87763j75164J64716L43752
$$ 665054 752229 899343 824611 814788 675820 306496 694259 519095 683811 1027563
13762A027563m23745K13712j26315j85491L62361j63485R710O696J14230j62756
$$ 1027563 603818 817530 691215 505724 868085 704600 714310 721006 835236 672480
13752F72480n74q7729K7827J53911j40779R6154n2149K80887j33077j73198k7348
$$ 672480 671906 584177 612004 765915 625136 721290 669141 950028 816951 643753 616405
13741F16405N6651M8557K1895J78924k71344K73127C30196J95472J3266j27834
$$ 616405 673056 721613 743508 922432 651088 924215 330196 525668 538934 411100
13731D11100L25449r068k15609J29538k45268K66769k43592K69315j97674J65801
$$ 411100 736549 727481 511872 641410 396142 662911 419319 688634 490960 656761
13721F56761j08322K11955R325B87446K07685J89800j31961J0587l7541j92918
$$ 656761 548439 760394 769719 287446 495131 684931 552970 563557 526016 333098
13711C33098J31948m4981r876M36476l59590k5707K57417k43603K92120j33413
$$ 333098 465046 420065 410189 846665 487075 461368 718785 475182 767302 633889
13701F33889j07859J40733k02983k27620L58077j15100j01861j6423K66850k57412
$$ 633889 526030 666763 463780 236160 594237 479137 377276 360853 627703 370291
13691C70291M47705A91789K36580j64353K92271J35162k29734P970A73777N45432
$$ 370291 817996 191789 428369 264016 556287 691449 461715 469685 173777 719209
13681G19209B05603N63665p043k87252K00079k51276k451m0424J89296j5145J4463
$$ 719209 205603 769268 762225 474973 675052 423776 421325 380901 570197 555052 569515
13670E69515N4253k13541n1483j43512M67396C41218o5816J80524K91310H5441
$$ 569515 623768 410227 358744 215232 682628 341218 275402 455926 747236 85441
13659E95535B69258J09943L239j04929L76n6912K72254n3192j93812O6434L53294
$$ 595535 269258 379201 382440 277511 277887 220975 493229 440037 246225 312659 665953
13648F65953M1419B78275M42889j73558G1393O9867K96369r9680P8719M4254q7697
$$ 665953 707372 278275 721164 547606 71393 141260 437629 337949 416668 460922 373225
13637C73225J53339k47450j01748J7949M61909B87955n8088L63128j68666J39040
$$ 373225 526564 279114 177366 195315 657224 287955 229867 592995 424329 563369
13627E63369j98369P7728l0189l4977M9378A22105K59403J1907j29934n2963M70543
$$ 563369 365000 442728 412539 377562 426940 122105 381508 393415 263481 210518 681061
13616F81061B85727J06139i4727B65281A00562J45984J3816I8437K91580e996
$$ 681061 285727 391866 -94727 265281 100562 246546 260362 98437 390017 -5996
13605D04137O7427r3616A03316M72800B18477J93688J4089I7816M85428p5250
$$ 404137 471564 377948 103316 576116 218477 412165 426254 97816 583244 507994
13595E07994F7740O00432j91993j54306J51217A77744l4654m1612L59876B13841
$$ 507994 67740 668172 476179 321873 473090 177744 143090 101478 461354 213841
13584B30832K75181n5187Q4414j84481K84449B10948o5862a52644A0050N31029
$$ 230832 506013 450826 535240 350759 635208 210948 145086 -152644 10050 541079
13574E41079D7438J74503P6134J02215B23M78324A50591O15403A17775J36159
$$ 541079 47438 221941 298075 400290 223 478547 150591 765994 117775 253934
13564B53934J08729j30117O6717j37153J42723a14040C27865o7962J16745j36639
$$ 253934 362663 232546 299263 162110 304833 -114040 327865 259903 376648 240009
13554B40009l2J90775q7283A58662j2314Q3511N9971c5685B74352A34756F4146
$$ 240009 239977 430752 343469 158662 146348 229859 289830 -35685 274352 134756 64146
13542A23040K34296R5209O7336j67333j09765L03829A56647L46343k44494J62302
$$ 123040 357336 452545 519881 352548 242783 546612 156647 502990 258496 420798
13532D20798A08614j8581L73687B12633K95140r2770E1154M25705J74979j12080
$$ 420798 108614 90033 463720 212633 507773 415003 51154 476859 651838 539758
13522E39758P1452A52482L2093J13188A02476L85940m1287A13339J13022N1608
$$ 539758 611210 152482 184575 297763 102476 488416 447129 113339 226361 277969
13512B77969j07585M9962E7815K93776j39289O0392L0246K22769B57703o4516
$$ 277969 170384 220346 57815 351591 212302 272694 302940 525709 257703 193187
13502A93187K32838B11514J03949c556B26950L23166I3043L78905B00542J66662
$$ 193187 426025 211514 315463 -3556 226950 550116 93043 471948 200542 367204
13492C67204j74315J19293J35530j86623L65919A70775L36702B07908J7718J00949
$$ 367204 192889 312182 447712 261089 627008 170775 507477 207908 225626 326575
13482C26575J30055A21794A6835K90730P7699O8603j63762a88141I3622L67673
$$ 326575 456630 121794 16835 307565 385264 453867 290105 -188141 93622 461295
13472D61295K97762C06936A17871k8054J82490J07760c2281D61624C1060P0839
$$ 461295 759057 306936 117871 89817 272307 380067 -32281 461624 31060 101899
13462A01899M45815A20099M29g0057A21540h1240F94823l41766J31918j01772
$$ 101899 547714 120099 120528 -70057 121540 -81240 694823 353057 484975 383203
13452C83203j70129P3487J52494A53310J46586j39990b02831C33082j50763n3263
$$ 383203 213074 286561 439055 153310 299896 159906 -202831 333082 182319 129056
13442A29056D2668J76268J79231j03802K0514J82790q2095r5174Q948K5912h356
$$ 129056 42668 218936 398167 294365 314879 497669 415574 320400 329348 355260 -8356
13430C39793j60224m46e0210k9835F0110L51671A92885B3359R2736J76120d3994
$$ 339793 179569 179123 -50210 -80045 60110 411781 192885 23359 116095 292215 -43994
13418B56711a89872H6897M96345F2722N3565K01726h9327I7145J92033k6453P4529
$$ 256711 -189872 86897 583242 62722 116287 318013 -89327 97145 289178 262725 337254
13407C37254F464J24808O9656b54872i7745A81609a03899D19352a45428a9064
$$ 337254 6464 131272 200928 -254872 -97745 181609 -103899 419352 -145428 -19064
13396A14470M8790O4114J75520j54548o8001l8030J07310i2904C06235K9755E4747
$$ 114470 163260 227374 402894 248346 180345 142315 249625 -92904 306235 335990 54747
13384D2498P200R7210L37040q3111B9362K13644j05915J97740a67173B67912J83892
$$ 42498 49698 146908 483948 400837 29362 243006 137091 334831 -167173 267912 451804
13373D51804d8251A57848J54169c1931D85387A53964L18150i9182C86359q8432
$$ 451804 -48251 157848 312017 -31931 485387 153964 472114 -99182 386359 297927
13363B97927L47478k03783A54751f8719p4574B86679E3882J14166a53601A79547
$$ 297927 645405 441622 154751 -68719 -143293 286679 53882 168048 -153601 179547
13352A38478a04740F7450J7169L04728C9141a02126D8192M89827j574b6249D59958
$$ 138478 -104740 67450 84619 389347 39141 -102126 48192 538019 536445 -26249 459958
13340D18263j41171j14348L30720B26065K35270j49275P4328j57669B9487J95744
$$ 418263 277092 162744 493464 226065 461335 312060 386388 228719 29487 225231
13330B25231Q0865A40654o5764a03734E71051H5853J70760K2557I5295l3627a78692
$$ 225231 306096 140654 74890 -103734 571051 85853 256613 279170 95295 61668 -178692
13318C25541O8802Q7871j70653B6275a63647I1572K1512A3639L83986C3389L52867
$$ 325541 394343 482214 311561 26275 -163647 91572 113084 13639 397625 33389 386256
13307C86256a10740D19859A04251D323a08139D47741p4996j17720j3571a13180
$$ 386256 -110740 419859 104251 4323 -108139 447741 372745 255025 241454 -113180
13296A4793L0322M18373B24642a42990a1702C28312A56842J84739M4479A15407
$$ 14793 45115 463488 224642 -142990 -11702 328312 156842 341581 386060 115407
13285C2531K3721L68394A59670c3986H568J15902J5857Q6122K27216G1702l5769
$$ 32531 56252 424646 159670 -33986 8568 124470 140327 226449 453665 71702 35933
13274C5933J07816j4258K11492K24508b55268I8517M28170i8770B02622l1285
$$ 35933 143749 129491 340983 565491 -255268 98517 526687 -98770 202622 171337
13264A71337O1808D5432h324G7873a34201N6506C00988H2307J6041J35314H5109
$$ 171337 233145 45432 -8324 77873 -134201 -77695 300988 82307 98348 233662 85109
13252C08159j01408k2616l1762J1741g3989B11353B3755K23327D627J45514L09
$$ 308159 206751 184135 152373 164114 -73989 211353 23755 247082 4627 150141 150450
13241A50450D1920M0325G380L1717J16771M12102A34210m6929J42997a44818B71381
$$ 150450 41920 82245 7380 39097 155868 567970 134210 87281 230278 -144818 271381
13229A1289a8751A46241l9328K14620P4736j0602A69559p472e702A28363A8231
$$ 11289 -18751 146241 106913 321533 396269 385667 169559 162087 -5702 128363 18231
13217c26480b0773j82483h0710c3654B83973M7621J67980j64772e5033j00431
$$ -326480 -20773 -203256 -80710 -33654 283973 331594 499574 334802 -55033 -155464
13207a55464B957N9742a59456b8307B69403I8667Q2862H4752j7306K4571J19416
$$ -155464 2957 62699 -159456 -28307 269403 98667 181529 84752 67446 92017 211433
13196B11433a3557q9421C71265b50401B29880r3804E3672K30318a35657I164K13411
$$ 211433 -13557 -102978 371265 -250401 229880 136076 53672 283990 -135657 9164 222575
13185B22575a433F5275J37575q2721h6156c1485a2610B18861b70535A20855k3009
$$ 222575 -1433 65275 202850 120129 -86156 -31485 -12610 218861 -270535 120855 97846
13174I7846g7902K5455b1336B75870f4268A04620m3808L46722h8543A25779r56
$$ 97846 -77902 -52447 -21336 275870 -64268 104620 60812 407534 -88543 125779 124823
13163A24823K64101A01909j163c8875F9178h748B36754b8332C4043J67069J76281
$$ 124823 388924 101909 100746 -38875 69178 -8748 236754 -28332 34043 201112 377393
13152C77393g8466A57215c05875B1453d5824E8490Q7924l9046l8732a61053G2191
$$ 377393 -78466 157215 -305875 21453 -45824 58490 146414 107368 68636 -161053 72191
13140D3435b62186a206B42183i2151A79176j4486i7016A13824b4144A58061o4909
$$ 43435 -262186 -1206 242183 -92151 179176 164690 -97016 113824 -24144 158061 93152
13129I3152B7624a91506C24248E2835J18316J52107B1143A178b7589g143j42222
$$ 93152 27624 -191506 324248 52835 171151 323258 21143 1178 -27589 -7143 -149365
13118a49365A49084P5407O4220A11138a00888a8887F1340O976a24906B5033L65112
$$ -149365 149084 224491 288711 111138 -100888 -18887 61340 68316 -124906 25033 390145
13107C90145p2548d2246a1143B90372A9276L55912d7099j77780C56878k7278A49859
$$ 390145 317597 -42246 -11143 290372 19276 375188 -47099 -224879 356878 329600 149859
13095I3063h0558j00885r7674A87270b0898A66852q1328A9116L8794L97147a01164
$$ 93063 -80558 -181443 -279117 187270 -20898 166852 85524 19116 57910 455057 -101164
13083B34539D6359M4554J01309a55356A02243K4673M8908b7803F4171j7068M508
$$ 234539 46359 90913 192222 -155356 102243 126916 175824 -27803 64171 47103 51611
13072E1611a50969h722B91017a12772C48879G9268M8537g7235A84a6551E64018
$$ 51611 -150969 -8722 291017 -112772 348879 79268 127805 -77235 184 -16551 564018
13060b4584D69111A71981d4673D6615j7956a06172Q496B65764G0142b9767k35838
$$ -24584 469111 171981 -44673 46615 28659 -106172 -97676 265764 70142 -29767 -265605
13049b65605C06041B3043a25111B3348N15452a5061E1378o816R8668E0019b91668
$$ -265605 306041 23043 -125111 23348 538800 -15061 51378 44562 143230 50019 -291668
13037C29534E7220J46273a46453A48158P0223r6983i0263J5789A13436K44657
$$ 329534 57220 203493 -146453 148158 218381 121398 -90263 -74474 113436 358093
13027C58093c9364E326J97359r7574I514Q2581C7507K04982d5963F8541e2320
$$ 358093 -39364 5326 202685 105111 9514 92095 37507 242489 -45963 68541 -52320
13015H9782O7475K83052I6387K27945i9621d91I7076J40505K45121E1096N0929
$$ 89782 157257 440309 96387 324332 -99621 -491 97076 237581 482702 51096 102025
13004A02025g0581D6483N0097d9762B69018m9985A7302J80556a16139J4242j50086
$$ 102025 -70581 46483 96580 -49762 269018 219033 17302 197858 -116139 -101897 -251983
12993b51983A60387d211p6064C06792L6519a48790A42404N2037m9081a31871B50714
$$ -251983 160387 -4211 -80275 306792 343311 -148790 142404 194441 145360 -131871 250714
12981A2629K13622H432Q9754H187b22257A65043n6305c3130j27505j48016J29562
$$ 12629 226251 8432 98186 8187 -222257 165043 108738 -33130 -160635 -308651 -179089
12970a79089g1983A62583j3853K17565I7312J92613I4480K26095E1673J44587
$$ -179089 -71983 162583 148730 366295 97312 289925 94480 320575 51673 196260
12960A96260p5088l9975f8749c1295A6517b53474B5245b37817C2257f6231k72917
$$ 196260 121172 81197 -68749 -31295 16517 -253474 25245 -237817 32257 -66231 -339148
12949c39148F3409a4685k40666C8466R5818l4736a40013I8244L2746E826N6854
$$ -339148 63409 -14685 -255351 38466 134284 99548 -140013 98244 130990 5826 62680
12938F2680J27978l6699L3240q6031a41095C31878r1108o7844q806K9782a27221
$$ 62680 190658 153959 187199 101168 -141095 331878 240770 172926 164120 193902 -127221
12926a75455C35918D0233N7291b91891B86751A25948j5226i9350B45739a32649
$$ -175455 335918 40233 97524 -291891 286751 125948 110722 -99350 245739 -132649
12915A55832P8008C5089J23746N4186p5853J05224P6883a9012K455I7086a38177
$$ 155832 233840 35089 158835 213021 137168 242392 319275 -19012 -16557 97086 -138177
12903G8518b47344G0396P5500b5022k84192C79380a88026c6938B98663A5604b21990
$$ 78518 -247344 70396 145896 -25022 -309214 379380 -188026 -36938 298663 15604 -221990
12891b24004A4603d0844B67395A23504a0549j85354N8011B27729I7100a27014
$$ -224004 14603 -40844 267395 123504 -10549 -195903 -137892 227729 97100 -127014
12880B83507a72519D3273h7533A47596b10292c509A8237K26358g3717j6120j82967
$$ 283507 -172519 43273 -87533 147596 -210292 -3509 18237 244595 -73717 -89837 -272804
12869b72804g6491A20160b02692A22280b05029O2009B52456c62211a05624B1305
$$ -272804 -76491 120160 -202692 122280 -205029 -143020 252456 -362211 -105624 21305
12858F512K30673J41801p1721j41411a89850h9287L7266B49329O7159a28226F8693
$$ 6512 237185 378986 307265 165854 -189850 -89287 -52021 249329 316488 -128226 68693
12846IL58276C8960a91931R3350j24624C23617a14121o4226N4765e5097A3779
$$ 9 358285 38960 -191931 -98581 -223205 323617 -114121 -178347 -123582 -55097 13779
12834a29858J2187B96251I2319a95762C6518K8441J19368L0800e7012r5244E0415
$$ -129858 -117671 296251 92319 -195762 36518 64959 184327 215127 -57012 -152256 50415
12822G6557M160K87055I0237b3671A69563n2414a6897F3748b04306o3836a13278
$$ 76557 80717 367772 90237 -23671 169563 117149 -16897 63748 -204306 -268142 -113278
12810a81231A80920L3992a02547d6954J5225A59047a30165D2258b30040b7568
$$ -181231 180920 214912 -102547 -46954 -31729 159047 -130165 42258 -230040 -27568
12799i1637b3231A60154d6853A18826l0994a235B90172C4492c73204B75675A20928
$$ -91637 -23231 160154 -46853 118826 87832 -1235 290172 34492 -373204 275675 120928
12787a23904l6408O0258A63755F8353g2534E4278a22644j85873A13334a74103
$$ -123904 -160312 -100054 163755 68353 -72534 54278 -122644 -308517 113334 -174103
12776d6320k6012A05066P9001A1623J10054a94593c3384H4168a61963I6414a71075
$$ -46320 -72332 105066 184067 11623 121677 -194593 -33384 84168 -161963 96414 -171075
12764b85298a09145A02116A9070K26931L4947j7252J36741f3217j86858J02418
$$ -285298 -109145 102116 19070 246001 280948 263696 400437 -63217 -250075 -147657
12754a47657B0694L7301f3534B46998G5696B1854h3088B52629A5745n001L6133
$$ -147657 20694 57995 -63534 246998 75696 21854 -83088 252629 15745 10744 46877
12743D6877Q2083a04102p3472A4192K17317r2909G340J95003p1019O1209l0828
$$ 46877 128960 -104102 -177574 14192 231509 138600 7340 202343 131324 192533 161705
12732A61705O5145o6439K45511E8342b62065Q3461C2826f5915p0728j3317g3991
$$ 161705 226850 160411 405922 58342 -262065 -178604 32826 -65915 -136643 -149960 -73991
12720c00032B10034a97689R8265A7371a82942p8530B16359F7357b60240F1406
$$ -300032 210034 -197689 -99424 17371 -182942 -261472 216359 67357 -260240 61406
12709b0931A58179K04344G6351J8958b8778A51511i755q1321C33961A62643n0941
$$ -20931 158179 362523 76351 95309 -28778 151511 -9755 -91076 333961 162643 111702
12698A11702K75991b03264c8922q2274A40210B6712J16832K11332a11589B08033
$$ 111702 387693 -203264 -38922 -121196 140210 26712 143544 354876 -111589 208033
12687a05614D5677i183D95184C7694q719a23210B37661h784l1787C995J50865
$$ -105614 45677 -9183 495184 37694 28975 -123210 237661 -8784 -40571 3995 154860
12676A54860J04448m9129H0576a81003G0992H733L70043C9874M0775c39016B19056
$$ 154860 259308 210179 80576 -181003 70992 8733 378776 39874 80649 -339016 219056
12664a88209G57K0184a54391C7091b0771k7678R455I822b186A81770r0323J65993
$$ -188209 757 20941 -154391 37091 -20771 -48449 -38994 9822 -2186 181770 91447 257440
12652B57440G6804K91281C5824b25156Q2825A49968B6556J1516a21324i105r2918
$$ 257440 76804 368085 35824 -225156 -142331 149968 26556 38072 -121324 -9105 -102023
12641a02023A82666h4061I0103J53379a7416A90307P645e7937B74360g231A53988
$$ -102023 182666 -84061 90103 243482 -17416 190307 197952 -57937 274360 -7231 153988
12629A29270a24514D9973K69620K6473b3799A37686a35642C88320A06208K52779
$$ 129270 -124514 49973 319593 346066 -23799 137686 -135642 388320 106208 358987
12619C58987g5002C06207j7544j29114M1468J19031f1567A54213a08335b6602
$$ 358987 -75002 306207 288663 159549 201017 320048 -61567 154213 -108335 -26602
12608I0606a7620B81704h4835B60K82348g2442A86861A0095a37616D19767A93105
$$ 90606 -17620 281704 -84835 260 282608 -72442 186861 10095 -137616 419767 193105
12596B55009J48239f7517A34542i1449A26199L3875a46654B58857D3535M02591
$$ 255009 403248 -67517 134542 -91449 126199 160074 -146654 258857 43535 446126
12586D46126A40463B2895J43280M8842H9577b67859A30938b53822C3054h3233
$$ 446126 140463 22895 166175 215017 89577 -267859 130938 -253822 33054 -83233
12575B6242J69010J54731f9472B45249I1387B3978a98533B15450M7842o5844a4273
$$ 26242 195252 349983 -69472 245249 91387 23978 -198533 215450 263292 197448 -14273
12563A0812J3150P0592m4537J91437b94651A67041c81924f7996G658b24726A40981
$$ 10812 23962 94554 50017 241454 -294651 167041 -381924 -67996 7658 -224726 140981
12551B31804m9970m2467b04417i2568B65845N9433e7296C31705a6623G1868K12077
$$ 231804 181834 139367 -204417 -92568 265845 325278 -57296 331705 -16623 71868 283945
12540B83945D5035J70108H2252B2895h1602I5549J05915B8032M7078a5976C4303
$$ 283945 45035 215143 82252 22895 -81602 95549 201464 28032 75110 -15976 34303
12528e6052B49735d3459l48092D8508J13203a30447A2215a1489p0559B63348b29091
$$ -56052 249735 -43459 -391551 48508 161711 -130447 12215 -11489 -82048 263348 -229091
12516B2732K74220f1596j09257j32189a03274j41729a12317k15174i3450A98290
$$ 22732 296952 -61596 -170853 -303042 -103274 -245003 -112317 -327491 -93450 198290
12505A53137a90389B39916o1119L531q2905L9519E4186N9373C2328b53635Q2040
$$ 153137 -190389 239916 178797 182328 99423 138942 54186 113559 32328 -253635 -171595
12494a71595d5520o697E7714R3253I247A760J60948D1558a31682j79667c6122
$$ -171595 -45520 -52217 57714 150967 9247 1760 162708 41558 -131682 -311349 -36122
12482f8504A13094g7573A23751a10045E7429K72706A30942c11095i0238n3383
$$ -68504 113094 -77573 123751 -110045 57429 330135 130942 -311095 -90238 -143621
12472a43621b026A02561e3601a4419o436A37083b39483A58438F8052j7569O6239
$$ -143621 -2026 102561 -53601 -14419 -20855 137083 -239483 158438 68052 50483 116722
12461A16722b70329A84542K22904F6258l0075Q9518a44187B14882c361o0479A56164
$$ 116722 -270329 184542 407446 66258 36183 125701 -144187 214882 -3361 -63840 156164
12449B80814H8093e8261A38205a97306f0964k6550c0579B39319b7837I9106C6291
$$ 280814 88093 -58261 138205 -197306 -60964 -87514 -30579 239319 -27837 99106 36291
12437a40803H7840b87875k8721D5174J10615K3566G114a89758A2247c13530m3830
$$ -140803 87840 -287875 -316596 45174 155789 179355 7114 -189758 12247 -313530 -357360
12426c57360c2378k22974G3057a41811D7324I116K91104A46043g9418k91044c1744
$$ -357360 -32378 -255352 73057 -141811 47324 9116 300220 146043 -79418 -370462 -31744
12414I4524i6739k0767n5884j556l8150C8148a62571C1096O7613a87950A44540
$$ 94524 -96739 -117506 -173390 -174946 -213096 38148 -162571 31096 98709 -187950 144540
12402A41362A2505c35434a16340G6159J54191b86761G9666J60622K29967c14888
$$ 141362 12505 -335434 -116340 76159 230350 -286761 79666 240288 470255 -314888
12391h3879B83844e1097j32259P4590b6086l7130k75095C57022g1970C8672J82621
$$ -83879 283844 -51097 -183356 -108766 -26086 -63216 -338311 357022 -71970 38672 221293
12380B21293r843b00878B00854b25992H9134J41005J07724H0878a5423A708J8203
$$ 221293 211450 -200878 200854 -225992 89134 230139 337863 80878 -15423 1708 19911
12369A9911a26571B05387c6337D2420b74827C2690M00715c19244C10845o6935
$$ 19911 -126571 205387 -36337 42420 -274827 32690 433405 -319244 310845 243910
12359B43910a3032D6655e4673B78046H8850e0691j35330A25491J3396a1775A95464
$$ 243910 -13032 46655 -54673 278046 88850 -50691 -186021 125491 138887 -11775 195464
12347H0500J8010a10724m5961A19595b8950j70889j12723e3512B70022i0624j6041
$$ 80500 98510 -110724 -156685 119595 -28950 -199839 -312562 -53512 270022 -90624 -106665
12336a06665I2936a20222C19451j16999J01948j30426n6182N6839a57543P3657
$$ -106665 92936 -120222 319451 202452 304400 173974 117792 174631 -157543 -83886
12326h3886B18716f1870D80384j80048g8643c4071m1984B1047J22935a41016F2835
$$ -83886 218716 -61870 480384 300336 -78643 -34071 -76055 21047 143982 -141016 62835
12314C81948q7402a8244j33003G5647a22187A34585C3668L4116J5660O1024D5924
$$ 381948 294546 -18244 -151247 75647 -122187 134585 33668 67784 83444 144468 45924
12302h3579E6225J96578D1784b38490A10326a26843j44861f7569A55978a86193
$$ -83579 56225 252803 41784 -238490 110326 -126843 -271704 -67569 155978 -186193
12291C68500A30997b84B2860M47995A63717E3865J00940D0890J31616b60078L7652
$$ 368500 130997 -284 22860 470855 163717 53865 154805 40890 172506 -260078 -222426
12280b22426A56354b97362E9821J93839I4880J21207D0780M62594A89475d8372
$$ -222426 156354 -297362 59821 253660 94880 216087 40780 503374 189475 -48372
12269B72934c3434A28194K21620j00193j09961d9342A94709l7912L6920F2380
$$ 272934 -33434 128194 349814 249621 139660 -49342 194709 156797 193717 62380
12258C5798J00927B186K25329a39559E6521J72095a33981C36158d5682A6641c20386
$$ 35798 136725 2186 227515 -139559 56521 228616 -133981 336158 -45682 16641 -320386
12246a45110A32266h4988A69034i2317C92036J2046A65668a06174d1756J4225
$$ -145110 132266 -84988 169034 -92317 392036 404082 165668 -106174 -41756 -27531
12236b7531B29757l2421a7757C0772J89729J09867A40265j3264J07106j7504n4882
$$ -27531 229757 197336 -17757 30772 220501 330368 140265 127001 234107 216603 161721
12225A61721N1997L9841J68838k09689a00167C99770N4855A41277J34676o4087
$$ 161721 213718 253559 422397 212708 -100167 399770 454625 141277 275953 211866
12215B11866J04442j03187e3928D75106j73450d05064A49784J62023a5824I8448
$$ 211866 316308 213121 -53928 475106 301656 -405064 149784 311807 -15824 98448
12204A1788J68465G2338K30445j12062M332J74785o8812o4983K89011G4754J54310
$$ 11788 180253 72338 302783 190721 195053 369838 301026 236043 525054 74754 229064
12193B29064M6072n2231G4950K02884j33719n5755f3551C7365J95556G7364K16137
$$ 229064 275136 222905 74950 277834 144115 88360 -63551 37365 232921 77364 293501
12182B93501j05855l9777k7833K11550l7066g706A92531C8886a11724F2752h6169
$$ 293501 187646 147869 120036 331586 294520 -7706 192531 38886 -111724 62752 -86169
12170A07072a09676K9548C70353A07025g029k2451B6066Q8053K43429A45335p425
$$ 107072 -109676 -80128 370353 107025 -7029 -29480 26066 114119 357548 145335 137910
12159A37910J9577L8956j0773c36631B82929D9300K43073H2598L8981j6706g0875
$$ 137910 157487 196443 185670 -336631 282929 49300 292373 82598 121579 104873 -70875
12147H0181e6713J1011A06355P123m9374J73467g6263k2550A1825c874q6023C84613
$$ 80181 -56713 -45702 106355 113478 64104 237571 -76263 -98813 11825 -3874 -89897 384613
12134D09853I749f8129p709A42965l0940j6132j7618J15900I080d6475B16428
$$ 409853 9749 -68129 -75838 142965 112025 95893 78275 194175 9080 -46475 216428
12122E6627O1155b09136i6353E0789J19476a32513A16713b24727B80126n6587
$$ 56627 117782 -209136 -96353 50789 170265 -132513 116713 -224727 280126 223539
12112B23539A03793L05397a96450l156e9643q3128A02789j1089K54813E0213a08952
$$ 223539 103793 409190 -196450 -199606 -59643 -142771 102789 91700 346513 50213 -108952
12100G5930B1798a4430D6542i8218r7920E1994K58159j09991A8635b8266j17479
$$ 75930 21798 -14430 46542 -98218 -196138 51994 310153 200162 18635 -28266 -145745
12089a45745I4663b21979C65678B2169L8404a816F1665c15258e7042B44347J68272
$$ -145745 94663 -221979 365678 22169 60573 -1816 61665 -315258 -57042 244347 412619
12078D12619R89457L44435G29195k20756B43168K16279A0328a1283j23735E5344
$$ 412619 1402076 1746511 729195 508439 243168 459447 10328 -11283 -135018 55344
12067a04109D59572A09722D016M4847c21977G7145L0229Q706C8235f2158I4461
$$ -104109 459572 109722 4016 48863 -321977 77145 107374 116080 38235 -62158 94461
12055B26923f3926K2571H5821i3494j6119P761j548R331j1503I0950D3277c8799
$$ 226923 -63926 -41355 85821 -93494 -109613 -101852 -103400 -94069 -105572 90950 43277 -38799
12042e30894K04348C9941P9645n8974a58509M5102c5721H6020a23559o8377h8840
$$ -530894 -326546 39941 119586 60612 -158509 -113407 -35721 86020 -123559 -191936 -88840
12030a98750A5305J3015n022a25404l7624k4818h9516B8682j981J49169H3819
$$ -198750 15305 28320 23298 -125404 -163028 -187846 -89516 28682 26701 175870 83819
12018d4825A51105a15880A58593e9732B89362h362A77541b3768A65013p0489i4179
$$ -44825 151105 -115880 158593 -59732 289362 -8362 177541 -23768 165013 94524 -94179
12006B7633o875J54469j3357a23962A03268a00568M9920k54545H5709b17502M5855
$$ 27633 20758 175227 161870 -123962 103268 -100568 -50648 -305193 85709 -217502 -171647
11995a71647A86429a22499M0290j48204A3926i760k92961J36096a2149I2769M06765
$$ -171647 186429 -122499 -82209 -230413 13926 -9760 -302721 -166625 -12149 92769 499534
11984D99534k12312b43106A15446K303K11681I2191J49657a06588I322K60194
$$ 499534 287222 -243106 115446 117749 329430 92191 241848 -106588 9322 269516
11974B69516a059p0413F0687b3344E0681b6135l5726q7839h838C9552i8519b3410
$$ 269516 -1059 -71472 60687 -23344 50681 -26135 -61861 -149700 -8838 39552 -98519 -23410
11961c38914B5746j2591P4153a88894A6267c38484J51892C391J31047P6208L2736
$$ -338914 25746 13155 87308 -188894 16267 -338484 -186592 3391 134438 210646 243382
11950B43382F6584k7831a49928p2350f0760D9201c1412j82309B95768a33685J9563
$$ 243382 66584 38753 -149928 -222278 -60760 49201 -31412 -213721 295768 -133685 -114122
11939a14122K9878A9012e0221A26162i9146B05493e94G6924J20122q5610J14016
$$ -114122 -84244 19012 -50221 126162 -99146 205493 -594 76924 197046 111436 225452
11928B25452j4350d47314f8453j164J2958k55701A32733E7085a06447A06878K34257
$$ 225452 211102 -447314 -68453 -69617 -56659 -312360 132733 57085 -106447 106878 341135
11917C41135c17524d4331k88612G8399b1006A10222h4345j62486L7918R4807G7430
$$ 341135 -317524 -44331 -332943 78399 -21006 110222 -84345 -246831 -208913 -114106 77430
11905A54097c4422A33889K9583o7082h9592L6718j48205A44706j6128F2557Q0974
$$ 154097 -34422 133889 163472 96390 -89592 -52874 -201079 144706 128578 62557 143531
11894A43531F423b6861r534m3096B16332b06666I2679b49841B19060b4857B6625
$$ 143531 6423 -26861 -36395 -79491 216332 -206666 92679 -249841 219060 -24857 26625
11882a47389f60k29792L3664e3545l3875B27828e5801I8022G774c58016b2278
$$ -147389 -660 -230452 -196788 -53545 -87420 227828 -55801 98022 7774 -358016 -22278
11870a95451f7542j90722a8462j22380c6129D06O2240b81771a40736j14017o6221
$$ -195451 -67542 -258264 -18462 -140842 -36129 406 62646 -281771 -140736 -254753 -320974
11859c20974J16278A85765g7809j72338j8739A20817e3705a785l60463a30571
$$ -320974 -204696 185765 -77809 -250147 -268886 120817 -53705 -1785 -362248 -130571
11848a48972A5464a24047A0447h4013m7366A4376O4582C8247a77563h4873m12254
$$ -148972 15464 -124047 10447 -84013 -131379 14376 78958 38247 -177563 -84873 -497127
11837d97127a96793M0715B20631F0574d939j1503p73B53088G9864d88515E3553
$$ -497127 -196793 -156078 220631 60574 -4939 -16442 -17215 253088 79864 -488515 53553
11825A3006P730b55121f8754E402e8537l07400R5465A65923b18858E4816B3574
$$ 13006 20736 -255121 -68754 5402 -58537 -365937 -270472 165923 -218858 54816 23574
11813i3971q7860f4784C3388R8848b22719j0352A36594b92399a01823c124A30406
$$ -93971 -181831 -64784 33388 132236 -222719 -233071 136594 -292399 -101823 -3124 130406
11801B31674b48082J00249C14639a75982B02017a12663n6538f4017k57442A68470
$$ 231674 -248082 -147833 314639 -175982 202017 -112663 -169201 -64017 -321459 168470
11790b5873A18587e0627G5332e5076q3218j98017A56009K7807i3328l3764p7742
$$ -25873 118587 -50627 75332 -55076 -138294 -336311 156009 183816 -93328 -127092 -204834
11779b04834C10241a2437B7798h986I2183j1590f0280k08167A61252a76127m4162
$$ -204834 310241 -12437 27798 -8986 92183 80593 -60280 -268447 161252 -176127 -220289
11768b20289A94429c8498l4320H6515b90237i7869j09422B5738b91073l3756b5210
$$ -220289 194429 -38498 -72818 86515 -290237 -97869 -207291 25738 -291073 -324829 -25210
11756A25808j9400a06785A42114a15862D73380F772b44915A45017J14606a73345
$$ 125808 106408 -106785 142114 -115862 473380 6772 -244915 145017 259623 -173345
11745B88983b76883G5986L937N1626d364G5433K56419I585K3716M6636d2544C73910
$$ 288983 -276883 75986 79923 131549 -4364 75433 331852 9585 33301 79937 -42544 373910
11732b6944j99942R8722e1360r1766C7333K02311h101A20009a50998o3794F9743
$$ -26944 -226886 -128164 -51360 -143126 37333 239644 -8101 120009 -150998 -214792 69743
11720e3109G9949b76098A42706M70376A26786A5501a9044G3779a68395A9519L01863
$$ -53109 79949 -276098 142706 613082 126786 15501 -19044 73779 -168395 19519 321382
11709C21382D2131L32550j20730C5971J43507k7382L357a30651A41218a84729
$$ 321382 42131 374681 253951 35971 179478 152096 155453 -130651 141218 -184729
11698A49182r420m9955C0159e9289j41331h8978B73181a21554e9612e986B52643
$$ 149182 139762 89807 30159 -59289 -200620 -88978 273181 -121554 -59612 -5986 252643
11686A66184K6053R0276K2890a09995b7080j34511f1250h476L050A62963a72740
$$ 166184 192237 282513 305403 -109995 -27080 -161591 -61250 -8476 -5426 162963 -172740
11674A86231b13438c8814j30980C45642a67989q6122C6749d8690B06536G1749
$$ 186231 -213438 -38814 -169794 345642 -167989 -254111 36749 -48690 206536 71749
11663a15094M7146k4100D3571f1677A18599e11D8941b36632A65066K3533M8464
$$ -115094 -67948 -92048 43571 -61677 118599 -511 48941 -236632 165066 188599 237063
11652B37063b05406d6014a5379A67876R236h8890m4550C70282h4841A10207a10818
$$ 237063 -205406 -46014 -15379 167876 177112 -88890 -133440 370282 -84841 110207 -110818
11640b43822B70770c49027B4944K40764A2741J15847a18197a0616B49092A0324
$$ -243822 270770 -349027 24944 265708 12741 128588 -118197 -10616 249092 10324
11629I2602c1422n7862k14882i2226A88401r4099g1301A31206L22634A57513b19879
$$ 92602 -31422 -89284 -304166 -92226 188401 94302 -71301 131206 453840 157513 -219879
11617A13878O6671n4351K01748b07896H2691b05786A00343a2493B8422a63739
$$ 113878 180549 126198 327946 -207896 82691 -205786 100343 -12493 28422 -163739
11606a22495D17888A43556R1688g268j35811A73288D7845J68111F2728J6999C8742
$$ -122495 417888 143556 235244 -7268 -143079 173288 47845 215956 62728 79727 38742
11594B88335c14928Q1742C3088M07469a53887E3251a23858C71452a41479A16295
$$ 288335 -314928 -233186 33088 440557 -153887 53251 -123858 371452 -141479 116295
11583E1459L78726a02715K7464D8748J0646a08142D30241h4150A50155l8402N8570
$$ 51459 430185 -102715 -75251 48748 59394 -108142 430241 -84150 150155 111753 170323
11572A70323h9351B45489H2562l4251O2859P5963e5665G0201e9401e127F7540
$$ 170323 -89351 245489 82562 48311 111170 187133 -55665 70201 -59401 -5127 67540
11560A85290n1742K23119C730J78259n8822a73283B15624b7902A20997M2890c8061
$$ 185290 133548 356667 3730 181989 123167 -173283 215624 -27902 120997 163887 -38061
11548B02124K21168I9679f9994B13334m4218P2157L5479a8414C17885g1950A77015
$$ 202124 423292 99679 -69994 213334 169116 241273 276752 -18414 317885 -71950 177015
11536H6253J50907b31006a5437B55767A06302l533K56906k1407B6730a0208B1053
$$ 86253 237160 -231006 -15437 255767 106302 102769 359675 338268 26730 -10208 21053
11524A58102Q1491A03212a28192A37864J07810L5337H9096J38134B6825g1336
$$ 158102 239593 103212 -128192 137864 245674 281011 89096 227230 26825 -71336
11513A42866n3995K87084A30411a21976H039L64973A31012c20717D6114K44314
$$ 142866 88871 375955 130411 -121976 8039 373012 131012 -320717 46114 290428
11503B90428j10966N5456j07976Q5759I2926J99885n829F026J95223K59359b13543
$$ 290428 179462 234918 126942 212701 92926 292811 286982 6026 201249 460608 -213543
11491d9261A67688F245R7723E092K48645G0942K50773a97622B31041F1633c985
$$ -49261 167688 6245 103968 5092 253737 70942 321715 -197622 231041 61633 -3985
11479B24660H7625J17758l9132J28999o5339a7950D5094A7056R59a53175A51005
$$ 224660 87625 205383 166251 295250 229911 -17950 45094 17056 18015 -153175 151005
11467A52172O8217l205Q9775b6370C67510e4917A0579K21370a4735B36619A07935
$$ 152172 220389 217184 306959 -26370 367510 -54917 10579 231949 -14735 236619 107935
11455A45036D5208g2447B90130A31921J80296J79694r7897R6457A77576a62582
$$ 145036 45208 -72447 290130 131921 312217 491911 394014 490471 177576 -162582
11444c51159B88132e8601D4981M0930k4984K02569m3642e1264F9277Q434P4484
$$ -351159 288132 -58601 44981 85911 60927 263496 219854 -51264 69277 77711 152195
11433A52195N0997K39079h5161A8291b6413A48749a40768r8601J3243D4673M7084
$$ 152195 203192 442271 -85161 18291 -26413 148749 -140768 -239369 -226126 44673 91757
11422I1757i4600I3060a82642K5061j61344E48566C506b38744P1397B03250d6778
$$ 91757 -94600 93060 -182642 -157581 -318925 548566 3506 -238744 -167347 203250 -46778
11410B44786c5648J2118A55481f6607q8606J5534A65456n1803g8472a2279F7980
$$ 244786 -35648 -23530 155481 -66607 -155213 -139679 165456 113653 -78472 -12279 67980
11398i9047D3018b53856D4583K19847c9240B16458I939Q4506b91643A14038b539
$$ -99047 43018 -253856 44583 264430 -39240 216458 9939 94445 -291643 114038 -2539
11386b61021j4867B25135P9277A49694a9941j10639C8486J88292o7523m5433M0540
$$ -261021 -275888 225135 304412 149694 -19941 -130580 38486 226778 159255 113822 154362
11375A54362a33702I4313a79250B0693N2883J84391c24687A90024q3508a25783
$$ 154362 -133702 94313 -179250 20693 73576 257967 -324687 190024 106516 -125783
11364a91768Q0681k7404I5527b04077I029g484k1544B67431r709p8949f2798k0908
$$ -191768 -111087 -138491 95527 -204077 9029 -7484 -29028 267431 257722 178773 -62798 -83706
11352h3706A33238E6450a28687E40130B01336n8459a45358A78787l5193a42387
$$ -83706 133238 56450 -128687 540130 201336 142877 -145358 178787 143594 -142387
11341d7141b808k563p8125D4394f3769k36771A05875m6176J01806g099j64578
$$ -47141 -2808 -5371 -83496 44394 -63769 -300540 105875 59699 161505 -7099 -171677
11330a71677C97143c50509B94296a66902I6555b5875A94369E0056J0217P6137
$$ -171677 397143 -350509 294296 -166902 96555 -25875 194369 50056 60273 136410
11320A36410M4844b47634A2779J62650c21133C22931G9713J9715i2209m7179G3629
$$ 136410 181254 -247634 12779 175429 -321133 322931 79713 99428 -92209 -139388 73629
11308F9952c9859m2434j02743M1555j0115j51163D0614K66117A08371k2543c27806
$$ 69952 -39859 -82293 -185036 -143481 -153596 -304759 40614 306731 108371 85828 -327806
11296f523A82831h4905B46077Q6258a0896k4710H2452D0856c63855I05a83762
$$ -6523 182831 -84905 246077 332335 -10896 -35606 82452 40856 -363855 905 -183762
11284d04202C35313A35166a94885j60927e5042K6006r5931j20631J11225n400
$$ -404202 335313 135166 -194885 -355812 -55042 -29036 -124967 -245598 -134373 -139773
11274a39773k4731j15716B76592G3991e8363n1321A39131c08331a34309K1155
$$ -139773 -164504 -280220 276592 73991 -58363 -109684 139131 -308331 -134309 -113154
11264a13154L0120G0863c67530h748j49072k1952B52380a7180l56565A52521M8540
$$ -113154 -83034 70863 -367530 -8748 -157820 -179772 252380 -17180 -373745 152521 201061
11253B01061a22601B00978a24588a1364C19358D2240a1277m84490E8433a68452
$$ 201061 -122601 200978 -124588 -11364 319358 42240 -11277 -495767 58433 -168452
11242B0441O3612C4176c79176A13476J3183a41149C4644L85998r3006b40416a10088
$$ 20441 84053 34176 -379176 113476 126659 -141149 34644 420642 327636 -240416 -110088
11230h3984C0860d1242k87649a50595f2082C58570e0161q3135d666A11926M0184
$$ -83984 30860 -41242 -328891 -150595 -62082 358570 -50161 -133296 -4666 111926 152110
11219A52110i1352A66458m0408n9037f1656C3324a44710r6914j12870A05758h1557
$$ 152110 -91352 166458 126050 67013 -61656 33324 -144710 -241624 -354494 105758 -81557
11207F4966O9807a56311O2889b1586j00051b3086B69801c7005o5304k02871G6731
$$ 64966 134773 -156311 -93422 -21586 -121637 -23086 269801 -37005 -102309 -305180 76731
11195g4562j18407e1109A1777c4256F2164K62451c3221C6432J48376k4984b98634
$$ -74562 -192969 -51109 11777 -34256 62164 324615 -33221 36432 184808 159824 -298634
11183E8238N7334K1404c35218A40159d9350k72661a56993e7128F4346a75564Q4312
$$ 58238 115572 136976 -335218 140159 -49350 -322011 -156993 -57128 64346 -175564 -91252
11172i1252H2891K10090c04330B13145a16627k05617d5365n5370j1051J0385j54908
$$ -91252 82891 292981 -304330 213145 -116627 -322244 -45365 -100735 -111786 -101401 -256309
11161b56309h6180j35186mP2499n7428h1840j83796Q2811O7356c9484I9201a69360
$$ -256309 -86180 -221366 -221370 -148871 -206299 -81840 -265636 -182825 -115469 -39484 99201 -169360
11148b11617j8914I3814a82673k5898a02733E4990a05105I82c9209j0630a664
$$ -211617 -230531 93814 -182673 -208571 -102733 54990 -105105 982 -39209 -49839 -1664
11136c044A9259K11759F3718Q690b13850Q3234A49946J9491e6054A09407b3806
$$ -3044 19259 231018 63718 72408 -213850 -130616 149946 169437 -56054 109407 -23806
11124c1046A64780M9116L8515l4231A07298A0766K5744H651a33228b5191F0785
$$ -31046 164780 213896 252411 218180 107298 10766 36510 8651 -133228 -25191 60785
11112a19423H6356a08840M8512C868K5211J30600J37509q1707N0096J21639a44693
$$ -119423 86356 -108840 -60328 3868 29079 159679 297188 215481 265577 387216 -144693
11100B53334P8984j7377G562N7685P3476L9562J62310K7754k7317N876D2001N00493
$$ 253334 332318 314941 7562 65247 138723 178285 340595 368349 341032 346908 42001 542494
11088E42494A09986J67814J01346f3087j8861A90931K298K64997A65835J22501
$$ 542494 109986 277800 379146 -63087 -81948 190931 193229 458226 165835 288336
11078B88336l5130q4767l2654J63571J12827r2522e355B60788K5569k8067K32153
$$ 288336 253206 168439 135785 299356 412183 319661 -5355 260788 286357 258290 490443
11067D90443M2148F0261L44125N0334j50969J59859L00266C58535L95475B19563
$$ 490443 532591 60261 404386 454720 303751 463610 763876 358535 754010 219563
11056E22095K15518r5597k47130K60881L33071k88659j34910K78456j14485p0545
$$ 522095 737613 642016 394886 655767 988838 700179 565269 843725 729240 658695
11046F58695M71981j39021m03034J79409K81850n08756J43413L075J74218J61335
$$ 658695 1130676 991655 588621 768030 1049880 541124 684537 687612 861830 1023165
11036A023165j59435l1172r6801J40736k44308J98437j71752K98696D38392L48051
$$ 1023165 863730 832558 735757 876493 632185 830622 658870 957566 438392 786443
11026G86443k23900K76914j26381j21204l1534Q5993O51133n00947l16475K67529
$$ 786443 562543 839457 713076 591872 560338 646331 1297464 796517 480042 747571
11016G47571O2423l36753L09709k64696K33153B61501L24717j26993K73193p497
$$ 747571 809994 473241 782950 518254 751407 261501 586218 459225 732418 724921
11006G24921n8620q5762K89307k16307P4673m5116L55846m67715L79998k47076
$$ 724921 666301 580539 869846 653539 728212 683096 1038942 571227 951225 704149
10996G04149q2306K52778j60633k25036M78144K34536m04619k40236L67858j62213
$$ 704149 621843 874621 713988 488952 967096 1201632 797013 556777 924635 762422
10986G62422J84332J74919j87497K10863K0654J25802j43565O9754L65840k4480
$$ 762422 946754 1121673 934176 1145039 1165693 1291495 1147930 1217684 1583524 1559044
10976A559044K46487K30771M32045j9625M31723j55701P3387J48787j46820k71910
$$ 1559044 1805531 2036302 2468347 2448722 2880445 2724744 2798131 2946918 2800098 2528188
10966B528188m05640n4016J28987m06467N8804k7892j99312K91422P7212K5337
$$ 2528188 2122548 2068532 2197519 1791052 1849856 1821964 1622652 1914074 1991286 2016623
10956B016623R7424l0225p0600q9425m06205j03582k00867l29400J22745m58326
$$ 2016623 2114047 2083822 2013222 1923797 1517592 1414010 1213143 883743 1006488 548162
10946E48162K82014k65220j7649j10318A42705L49590e5401A41420J69883A51098
$$ 548162 830176 564956 547307 436989 142705 492295 -55401 141420 311303 151098
10935B60847j12684O0704b7971B19226K3672K4492A01119a43852l7222A8935J03522
$$ 260847 148163 208867 -27971 219226 242898 267390 101119 -143852 -181074 18935 122457
10924A22457J1101M4952A7385O8842L9224b63017B40834a57810A12332A8065i6355
$$ 122457 133558 178510 17385 86227 125451 -263017 240834 -157810 112332 18065 -96355
10912F4667O0856a59664A13044b81827A05890e704A38403i1200n8621M1432F3026
$$ 64667 125523 -159664 113044 -281827 105890 -5704 138403 -91200 -149821 -108389 63026
10900c0376o3887M2649i181B15949a23279c6918j01894b2017B3560J43183a09161
$$ -30376 -94263 -51614 -9181 215949 -123279 -36918 -138812 -22017 23560 166743 -109161
10888b67892A49211a91910B79062d4355A86407b13907A58822J5202j849K03726
$$ -267892 149211 -191910 279062 -44355 186407 -213907 158822 174024 172175 375901
10878C75901b16526h7137A36284k6158b63689D8353a89461A90182a2856A95521
$$ 375901 -216526 -87137 136284 110126 -263689 48353 -189461 190182 -12856 195521
10867c13052c4043A54416B213a31837m3883A09018e4447n806H0256J18528K21828
$$ -313052 -34043 154416 2213 -131837 -175720 109018 -54447 -60253 80256 198784 420612
10856D20612A8534b39264J3520B39597M4380G6367a84682C32252c44713a28462
$$ 420612 18534 -239264 -225744 239597 283977 76367 -184682 332252 -344713 -128462
10845a72612D6235a5815C81518a85330g2074o4031B278J97643q1490r109K4597
$$ -172612 46235 -15815 381518 -185330 -72074 -136105 2278 199921 118431 109322 133919
10834A33919e90279a7163D9988a67359A56241C5906a52689q7290g8299B21388
$$ 133919 -590279 -17163 49988 -167359 156241 35906 -152689 -239979 -78299 221388
10823A47253g4224C100a62975B7310a41982j5636J7216A69433B7283a71107a9926
$$ 147253 -74224 3100 -162975 27310 -141982 -157618 -140402 169433 27283 -171107 -19926
10811B7512L04297A15928O9478d24669h4459l02978A49212E4374Q2756I036d02075
$$ 27512 331809 115928 185406 -424669 -84459 -387437 149212 54374 137130 9036 -402075
10799a75682a0403l25463d9133j02241f0449j49664C4923a05004o3424k2960A0933
$$ -175682 -10403 -335866 -49133 -151374 -60449 -210113 34923 -105004 -168428 -191388 10933
10787A53129a94665d8054j75259i3594j17838b4661o5620j05752C5500O7164K5089
$$ 153129 -194665 -48054 -223313 -93594 -211432 -24661 -90281 -196033 35500 102664 127753
10776A27753b52233c7440q0060d9862A36809a53192B2367J4304b87989I9891c17698
$$ 127753 -252233 -37440 -117500 -49862 136809 -153192 22367 36671 -287989 99891 -317698
10764B59930d64194a69326A56567b43881J6654b8760B49176b85741J14198A31162
$$ 259930 -464194 -169326 156567 -243881 -227227 -28760 249176 -285741 -171543 131162
10753b40270C23377b19471h6876j37221m166h0918L3674a2316C8956M2135J37229
$$ -240270 323377 -219471 -86876 -224097 -228263 -80918 -47244 -12316 38956 81091 218320
10742B18320a79410F2379B7404a82797c4757H5658a0872r9691H6927J76749j1760
$$ 218320 -179410 62379 27404 -182797 -34757 85658 -10872 -110563 86927 263676 251916
10731B51916b06743g4209m2570A35546j4649C4633L2866h8674B22039o7732b09337
$$ 251916 -206743 -74209 -116779 135546 120897 34633 67499 -88674 222039 154307 -209337
10719a71767j28598a31611j59802G4051b71958g9793m4668G796J1459J58219d93775
$$ -171767 -300365 -131611 -291413 74051 -271958 -79793 -124461 7796 19255 177474 -493775
10707A6997M0704b31414A55770g4571j3640B96824b1764j18187N6575A2415c2590
$$ 16997 57701 -231414 155770 -74571 -88211 296824 -21764 -139951 -83376 12415 -32590
10695e6689r6117A77629Q9450f2497E21244d0279k388A37119a52906A07150O0406
$$ -56689 -152806 177629 267079 -62497 521244 -40279 -42667 137119 -152906 107150 167556
10684A67556d7886B96417e296A46324a25673q7047H3897J02619a10458j94613
$$ 167556 -47886 296417 -5296 146324 -125673 -212720 83897 186516 -110458 -305071
10674c05071A36599c6438p7679A03088d2367H7476b54241F9761a96040M3492D6205
$$ -305071 136599 -36438 -114117 103088 -42367 87476 -254241 69761 -196040 -152548 46205
10662E3126b16205f6846E1946f2159J1176C1915J25473b50267E944b61125h1558
$$ 53126 -216205 -66846 51946 -62159 -50983 31915 157388 -250267 5944 -261125 -81558
10650A60897e6444b1532A93104B5305b00925A77468g5358m5676A26635c62064
$$ 160897 -56444 -21532 193104 25305 -200925 177468 -75358 -121034 126635 -362064
10639d425I729J60979k7474j3832b0217A73388a57673k08167h7642m6994L7854
$$ -4425 9729 170708 143234 129402 -20217 173388 -157673 -365840 -87642 -134636 -96782
10628i6782A38612D7773o449J69463a82324j52224a29719O247B5126i3480A65719
$$ -96782 138612 47773 41324 210787 -182324 -334548 -129719 -123472 25126 -93480 165719
10616a1180k9A09943J15598H7296e4742l3952j9763p6498K6100c9431o0835c8842
$$ -11180 -11209 109943 225541 87296 -54742 -88694 -108457 -184955 -158855 -39431 -100266 -38842
10603a23647j17403l1730B62152a87229b613k43552J09425b833k28424j80207
$$ -123647 -241050 -272780 262152 -187229 -2613 -246165 -136740 -2833 -231257 -411464
10593d11464a41127A88407a38579A6353J70130f4746p7505C1232L57380a83591
$$ -411464 -141127 188407 -138579 16353 186483 -64746 -142251 31232 388612 -183591
10582b1877A33489f8571p2783b4049L583l8834q6275f3053J1055r545K1985A90258
$$ -21877 133489 -68571 -141354 -24049 -20466 -59300 -145575 -63053 -51998 -61543 -39558 190258
10569H6027h8650J9123A3691J06751E9727a0042k83940J42669A03604b13817A02047
$$ 86027 -88650 -69527 13691 120442 59727 -10042 -293982 -151313 103604 -213817 102047
10557c72446A72838j8798f7396E242J29273g2573I0851b3418j35524N8271l52929
$$ -372446 172838 154040 -67396 5242 134515 -72573 90851 -23418 -158942 -100671 -453600
10546d53600b134l40992a08627J6719B63442f5681a5704O072j79710A32667m668
$$ -453600 -2134 -343126 -108627 -91908 263442 -65681 -15704 -9632 -189342 132667 127999
10535A27999e8501c461m05405f9755a0618A5009a17566E158f659j3559i318a386
$$ 127999 -58501 -3461 -408866 -69755 -10618 15009 -117566 5158 -6659 -20218 -9318 -1386
10522A57939f5884j18587A90534B981M0290K23537b8173I1782a85061L1011n7011
$$ 157939 -65884 -184471 190534 2981 43271 266808 -28173 91782 -185061 -154050 -211061
10511b11061C93449E4668L8552j8377b03349H2333i8937a9263k60222A71369h1463
$$ -211061 393449 54668 93220 74843 -203349 82333 -98937 -19263 -279485 171369 -81463
10499A81494b1695A86844a29917J0501D8801h2129j45369C0906P7132A0125b09519
$$ 181494 -21695 186844 -129917 -119416 48801 -82129 -227498 30906 108038 10125 -209519
10487A44628Q6471r4554i1187E6126L9841J1898b117F43068j58128j41145Q8553
$$ 144628 231099 136545 -91187 56126 95967 107865 -2117 643068 484940 343795 432348
10476D32348p4357l5470j23893o5580Q3635H5350c8266j14419A19333a41362O0998
$$ 432348 357991 322521 198628 133048 216683 85350 -38266 -152685 119333 -141362 -80364
10465h0364j34092F8194a04389K7367j77655a19890K6071G6219b34127J07688
$$ -80364 -214456 68194 -104389 -77022 -254677 -119890 -93819 76219 -234127 -126439
10455a26439I345J87673J60396b74475B1439b35291R6679e2737j37565i1983B30089
$$ -126439 9345 197018 357414 -274475 21439 -235291 -138612 -52737 -190302 -91983 230089
10443d0170l3682A84736K79367D8972J79764H5534j763c35754A58526a86557Q7770
$$ -40170 -73852 184736 464103 48972 228736 85534 83771 -335754 158526 -186557 -98787
10432i8787A05618c4396q6638h47D5399A8331a65083l0641G3110J66532F9917
$$ -98787 105618 -34396 -121034 -847 45399 18331 -165083 -195724 73110 239642 69917
10420a15959k25497B85941a42512i648B52729C6792c67093e515j26790m1147j23009
$$ -115959 -341456 285941 -142512 -9648 252729 36792 -367093 -5515 -132305 -173452 -296461
10409b96461j11180J16717C2426A0854P0808d33721I3886a23165j12416Q8990
$$ -296461 -407641 -290924 32426 10854 81662 -433721 93886 -123165 -235581 -146591
10399a46591A48783p657a11509I7846j9118J69776n3336e6396G7472k177J56348
$$ -146591 148783 141126 -111509 97846 78728 248504 195168 -56396 77472 75295 231643
10388B31643B3502K4768J8160d1548A28979j9506b82895B21614J06851K8298A71835
$$ 231643 23502 48270 66430 -41548 128979 109473 -282895 221614 328465 356763 171835
10376E46220I170K35710C6408K50770o1752J5682J56796j37916j20734R3021L43313
$$ 546220 9170 244880 36408 287178 225426 241108 397904 259988 139254 232275 575588
10365E75588L8464q7324j08774j02832j01350r1196J78420J87688a91893K461
$$ 575588 614052 526728 417954 315122 213772 122576 300996 488684 -191893 -189432
10355a89432f6219C30889E6481M98492K693N9447K0082B61045J89356a4806D21432
$$ -189432 -66219 330889 56481 554973 557666 617113 637195 261045 450401 -14806 421432
10343B56630A07095N72192C11298K56673j06672a00831E04137j13947A73983O42
$$ 256630 107095 679287 311298 567971 461299 -100831 504137 390190 173983 174625
10333A74625a32840a2203I7468O5100i1148B73310J18289c51728A61533F1095
$$ 174625 -132840 -12203 97468 162568 -91148 273310 391599 -351728 161533 61095
10322e2313C18059J35609A26448b47866E6625J70618g931k0120C10978A00567
$$ -52313 318059 453668 126448 -247866 56625 227243 -7931 -28051 310978 100567
10311C95800r1478P610a8547p1844j28720A47449b47444K0375J06558o0633Q4204
$$ 395800 304322 311932 -18547 -90391 -219111 147449 -247444 -227069 -120511 -181144 -96940
10300i6940d229j43539A41477F0998K925b43489A41356C3159c83059H4925a12634
$$ -96940 -4229 -147768 141477 60998 63923 -243489 141356 33159 -383059 84925 -112634
10288i0759A68325g6467k52503I3077c273h61B09143M5657h293a614j94450j72765
$$ -90759 168325 -76467 -328970 93077 -3273 -861 209143 254800 -8293 -1614 -196064 -368829
10276c68829l468B33328j13247J65761A17037a41957C67440a12079j92110J41049
$$ -368829 -372297 233328 120081 285842 117037 -141957 367440 -112079 -304189 -163140
10266a63140q9927A40759K07532a20990D5947J01501k0670M9928B5701L05178
$$ -163140 -253067 140759 348291 -120990 45947 147448 126778 176706 25701 330879
10256C30879L4661A7535M8496K01694M6452D3407b50026d6955J4207A47900b9663
$$ 330879 365540 17535 66031 267725 314177 43407 -250026 -46955 -32748 147900 -29663
10244a75974d0963C8973a14964A60115c5153q6739A99856O722b15296J1504F2702
$$ -175974 -40963 38973 -114964 160115 -35153 -121892 199856 206578 -215296 -203792 62702
10232D35001k10836M3581A0872Q6314c85350E5316a0774C07669j28397c1853j44934
$$ 435001 224165 267746 10872 97186 -385350 55316 -10774 307669 179272 -31853 -176787
10221a76787g0674q4523b7479C9662R4962b01760a6432H2311a3158j25999b4028
$$ -176787 -70674 -155197 -27479 39662 134624 -201760 -16432 82311 -13158 -139157 -24028
10209A46953m7671d3988a0332A0131b67493A8100P3365b04057Q7170F4624e6210
$$ 146953 99282 -43988 -10332 10131 -267493 18100 91465 -204057 -116887 64624 -56210
10197a94613F9944N6159j5543a08779j98611d3981j68421h1669j03691N3857a5769
$$ -194613 69944 126103 110560 -108779 -307390 -43981 -212402 -81669 -185360 -131503 -15769
10185C08447b57120j82542g4450j43464C20408E4327a29421j04901a4302j01755
$$ 308447 -257120 -439662 -74450 -217914 320408 54327 -129421 -234322 -14302 -116057
10175a16057M1333m5821m1838o0319j8803E887J3451o525a20759B0594J59743
$$ -116057 -74724 -120545 -162383 -222702 -241505 5887 19338 12813 -120759 20594 180337
10164A80337a08485k28063a57577B16843n7442b38307E423J36373f8065A6904
$$ 180337 -108485 -336548 -157577 216843 159401 -238307 5423 141796 -68065 16904
10153a03900I6899a18437I9553a75858A21281b10999F6038b75997A99756b1368
$$ -103900 96899 -118437 99553 -175858 121281 -210999 66038 -275997 199756 -21368
10142b5024j41662k38240a5152A251a37180c5147n7106A16163n7076c07079D0086
$$ -25024 -166686 -404926 -15152 1251 -137180 -35147 -92253 116163 59087 -307079 40086
10130a52777j37742f3523I7720b09236O4048k9813m8092K7179K9272J6826B74912
$$ -152777 -290519 -63523 97720 -209236 -145188 -175001 -223093 -195914 -166642 -149816 274912
10118A55525F410J01001a0204j60154J1751A15283e9053k1223A23349n5536a83413
$$ 155525 6410 107411 -10204 -170358 -158607 115283 -59053 -80276 123349 67813 -183413
10106i4563j94698a8111j7620k00383J762q494J07335D4372O1632h5305c9479
$$ -94563 -289261 -18111 -35731 -236114 -234352 -242846 -135511 44372 106004 -85305 -39479
10094b6374k3818G673c6113A07102a13161H1267a88411f2698C4512b5992k00049
$$ -26374 -50192 7673 -36113 107102 -113161 81267 -188411 -62698 34512 -25992 -226041
10083b26041e160k06341c1130k30671A60664b83705a8314j67917h7804F9615b74082
$$ -226041 -5160 -211501 -31130 -261801 160664 -283705 -18314 -186231 -87804 69615 -274082
10071B02117q8224a40098L3750J7575B32869A9966L1909a28177d9569k22396H3929
$$ 202117 113893 -140098 -106348 -88773 232869 19966 51875 -128177 -49569 -271965 83929
10059g32G6442a22039C8581o439C003b89251J16769e6140I5044a19734k64520
$$ -732 76442 -122039 38581 32142 3003 -289251 -172482 -56140 95044 -119734 -384254
10048c84254a49347k08743g9674A17291b9026q7675A61519P536a78905k24203
$$ -384254 -149347 -358090 -79674 117291 -29026 -116701 161519 169055 -178905 -403108
10038d03108g3664I1514R8362d0689B22130c71552C9490a483k5075B74968e8221
$$ -403108 -73664 91514 189876 -40689 222130 -371552 39490 -1483 -26558 274968 -58221
10026G3800i1026j4515Q14A44638a23014p0470b9181n2831j23384I4312k0783
$$ 73800 -91026 -105541 -104727 144638 -123014 -193484 -29181 -82012 -205396 94312 73529
10015G3529a1990o9846C43044a6628j52561e1695f793q8194I691a81144j05909
$$ 73529 -11990 -81836 343044 -16628 -169189 -51695 -6793 -94987 9691 -181144 -287053
10004b87053M3417H3875b06390e0320D6641a53280k72623a37594m86926b26057
$$ -287053 -243636 83875 -206390 -50320 46641 -153280 -425903 -137594 -624520 -226057
9993f3596j24317F0506i043l7238j89899o3245b1194l30817a08599k6838M5512
$$ -63596 -187913 60506 -9043 -46281 -236180 -299425 -21194 -352011 -108599 -135437 -89925
9982h9925I1301a56508A18098h3142j6602p6166D2761K29460i2114j07200B03694
$$ -89925 91301 -156508 118098 -83142 -99744 -175910 42761 272221 -92114 -199314 203694
9970A66599f92075B48956j12550a40895A98468b64978j30230J65108o499J09966
$$ 166599 -692075 248956 136406 -140895 198468 -264978 -395208 -230100 -236599 -126633
9960a26633N8424L0377I7953N1570i2297J8540A65382f3707C0867N7840L7260
$$ -126633 -68209 -37832 97953 149523 -92297 -73757 165382 -63707 30867 88707 125967
9949A25967J5517d9756B42922F830Q9254Q7158h5456I3265g424n7055n1428A13163
$$ 125967 141484 -49756 242922 6830 96084 183242 -85456 93265 -7424 -64479 -115907 113163
9936D1130j6196L48959i20A98652G2219B4995a28447r3016N8733p5392b8443n8739
$$ 41130 24934 373893 -920 198652 72219 24995 -128447 -221463 -162730 -238122 -28443 -87182
9924h7182B49680q3865i0971A2620a82541j1824A00928b62511O6367A14J63116
$$ -87182 249680 165815 -90971 12620 -182541 -194365 100928 -262511 -196144 114 163230
9913A63230a09593M965p1579r1430f1520r5362e6361l61518f3309A00990a96363
$$ 163230 -109593 -104628 -176207 -267637 -61520 -156882 -56361 -417879 -63309 100990 -196363
9901e5769j13816k21455E6926a76982A47426a53285f7307i358n48901e9686m97106
$$ -55769 -169585 -391040 56926 -176982 147426 -153285 -67307 -9358 -558259 -59686 -556792
9890e56792G2436L48751c78160D8435b3657k8862q6858l735j9624e5040j90921
$$ -556792 72436 421187 -378160 48435 -23657 -52519 -139377 -143112 -162736 -55040 -245961
9879b45961c5536j08636d0867q536p4660b1887j90881g4433I8346l5136a05362
$$ -245961 -35536 -144172 -40867 -49403 -124063 -21887 -212768 -74433 98346 63210 -105362
9867H7575a72155I8377l4921c11711A13175i235c844l40161D1809b16063I539
$$ 87575 -172155 98377 63456 -311711 113175 -9235 -3844 -344005 41809 -216063 9539
9855e0238B37315j18591K5114c51644h2175o428l9730A77357k4699i7719K0381
$$ -50238 237315 118724 143838 -351644 -82175 -88603 -128333 177357 152658 -97719 -77338
9844g7338p8918j33903f420l36006L2963M8040Q0446n8353A10044D5000a18232
$$ -77338 -156256 -290159 -6420 -342426 -309463 -261423 -180977 -239330 110044 45000 -118232
9832c0523A08161c45576A11866J17483c5374A1429b75022g973A96244e9494j71424
$$ -30523 108161 -345576 111866 229349 -35374 11429 -275022 -7973 196244 -59494 -230918
9821b30918c6413j94863A59542m2077i2230c8369b783H3829a08568A33159a50658
$$ -230918 -36413 -231276 159542 117465 -92230 -38369 -2783 83829 -108568 133159 -150658
9809B09273a53623f8604d258l9772k11367E5780A5959K71467f6724A25201e4987
$$ 209273 -153623 -68604 -4258 -44030 -255397 55780 15959 287426 -66724 125201 -54987
9797i5542d0038A09727i2942k01146J19297K3000j60646g6669K9765j4838b7795
$$ -95542 -40038 109727 -92942 -294088 -174791 -151791 -312437 -76669 -46904 -61742 -27795
9785A00260Q4488i511j02430H195L0390g716p3284A27821c58119B2378q869c30423
$$ 100260 184748 -9511 -111941 8195 38585 -7716 -81000 127821 -358119 22378 13509 -330423
9772a49562A88848a11606A67436D8583K4300R1361B8663M8609a55295l13697d899
$$ -149562 188848 -111606 167436 48583 72883 164244 28663 77272 -155295 -468992 -4899
9760a65568A12374g5675G8696K4325c21550C89193A15744i5041C5608b31522E6719
$$ -165568 112374 -75675 78696 103021 -321550 389193 115744 -95041 35608 -231522 56719
9748A72142b15718M3868B1279L1850b04405E1954e4269j23684A50042E2669J68349
$$ 172142 -215718 -171850 21279 53129 -204405 51954 -54269 -177953 150042 52669 221018
9737B21018b11186D6848j1116B219a62910k04375J23796K5644b4542A19560b89957
$$ 221018 -211186 46848 35732 2219 -162910 -367285 -243489 -217845 -24542 119560 -289957
9725H6466a88508G8660b96421O1670B3646b40486N5275G5079N790j5841b54306
$$ 86466 -188508 78660 -296421 -234751 23646 -240486 -185211 75079 80869 65028 -254306
9713D7039a62700I6982C3693a7300j74058n1056d0472j2630j69617N9230q1692
$$ 47039 -162700 96982 33693 -17300 -191358 -242414 -40472 -53102 -222719 -163489 -245181
9702b45181I7500B907b06001I8524a85728j58405J63672D1578a32209D76321i9625
$$ -245181 97500 2907 -206001 98524 -185728 -344133 -180461 41578 -132209 476321 -99625
9690A83637b8660k40579F2765g0690n4689C203b4143A4371a33436p9477A08189
$$ 183637 -28660 -269239 62765 -70690 -125379 3203 -24143 14371 -133436 -212913 108189
9678C1096N8617i2607n0217j69565a34170A31666L002b34439g8658K476E9480
$$ 31096 89713 -92607 -142824 -312389 -134170 131666 134668 -234439 -78658 -76182 59480
9666b46443i4844D6242a62039K273K6916N7093j08171L2337a735A1618M5911a91360
$$ -246443 -94844 46242 -162039 -159766 -132850 -75757 -183928 -151591 -1735 11618 57529 -191360
9653a22548M4320A60379n8740a20802p2259b3056o1308K8247G7932j3371i4019
$$ -122548 -78228 160379 101639 -120802 -193061 -23056 -84364 -56117 77932 64561 -94019
9641c16548J40635N2879F5622g6782B92402a05340A9277L3825e2366k21507J8435
$$ -316548 -175913 -123034 65622 -76782 292402 -105340 19277 53102 -52366 -273873 -255438
9630b55438G3501a45048l0800q8414B25521P6310b26791O6960a8685B25498a569
$$ -255438 73501 -145048 -175848 -264262 225521 301831 -226791 -159831 -18685 225498 -1569
9618I1936h4089K3656R258j62069k58191E1536J34485e4460j1794B79851G4431
$$ 91936 -84089 -60433 -51175 -213244 -471435 51536 186021 -54460 -66254 279851 74431
9606a05634d1646k56661G045N1491J55672f4184C69325j66836e45869e2822k44674
$$ -105634 -41646 -298307 7045 58536 214208 -64184 369325 202489 -545869 -52822 -297496
9595b97496j13524B45571A5089J96395d4483q8719j12919d9951B05051b83986
$$ -297496 -411020 245571 15089 211484 -44483 -133202 -246121 -49951 205051 -283986
9584a00749I9588d9273q547j77006A06048p521d1565E7374b12844p8558R8294
$$ -100749 99588 -49273 -57820 -234826 106048 98527 -41565 57374 -212844 -291402 -193108
9573a93108o4527j36691b0423B77145C3671a4490k23816c0580k30169M5856H8611
$$ -193108 -257635 -394326 -20423 277145 33671 -14490 -238306 -30580 -260749 -214893 88611
9561a17456k79227J95588e2347d641A35474J08710i7454l96373J89733B6344a30978
$$ -117456 -396683 -201095 -52347 -4641 135474 244184 -97454 -493827 -304094 26344 -130978
9549C2395d8390B00784e9516n3588H9929i9473a8486o8434I6147a35103B97793
$$ 32395 -48390 200784 -59516 -113104 89929 -99473 -18486 -86920 96147 -135103 297793
9537e4904m9730j61160f2706B38842f6289A60121o2866B3022a70941e3232G73
$$ -54904 -104634 -265794 -62706 238842 -66289 160121 97255 23022 -170941 -53232 773
9525D6507N2593k8862J7767b49520O1825p0485f4755p6432m7932A43080b66338
$$ 46507 99100 70238 88005 -249520 -187695 -258180 -64755 -141187 -189119 143080 -266338
9513A22391j9631a29964j62866A265g0622j39381E3538B5580P789J39791b23073
$$ 122391 102760 -129964 -292830 1265 -70622 -210003 53538 25580 33369 173160 -223073
9501a33050A9268c35918D6452c07331a13561o1457G235N9872i2379C6414g1894
$$ -133050 19268 -335918 46452 -307331 -113561 -175018 7235 67107 -92379 36414 -71894
9489b92677G678O4131i7343k38943e1526k7756j8993j06594C48876f7809j45464
$$ -292677 7678 71809 -97343 -336286 -51526 -79282 -98275 -204869 348876 -67809 -213273
9478b13273H9809b03549i1731C9767L5374a97663D876b40710A19116M9388a7464
$$ -213273 89809 -203549 -91731 39767 75141 -197663 4876 -240710 119116 168504 -17464
9466b54720O0942l664i4493C649a71712E2579a5918E6604b54562k13939j4071
$$ -254720 -193778 -197442 -94493 3649 -171712 52579 -15918 56604 -254562 -468501 -482572
9455d82572G8302c02378b8849m4547B63282a61621A12474c6971k83364f0728a2976
$$ -482572 78302 -302378 -28849 -73396 263282 -161621 112474 -36971 -320335 -60728 -12976
9443A57147a11215B58625j07873a81403B57874a50168B74823g1087p9579o7049
$$ 157147 -111215 258625 150752 -181403 257874 -150168 274823 -71087 -150666 -217715
9433b17715i0683b6983o0368B14071r9714f2133j62904Q9401k02783E528a09495
$$ -217715 -90683 -26983 -87351 214071 114357 -62133 -225037 -135636 -338419 5528 -109495
9421E2340c43045a01982a3439A43996b29597E8222b5098n5439n4872I34R4355
$$ 52340 -343045 -101982 -13439 143996 -229597 58222 -25098 -80537 -135409 934 95289
9410I5289d2867B06074H3034L7389c42829A9719a23112B9590c11159H5134b02153
$$ 95289 -42867 206074 83034 120423 -342829 19719 -123112 29590 -311159 85134 -202153
9398C9186N2922e1070C4583P3620a59682P9357b2023A82498g5703L4062j96913
$$ 39186 92108 -51070 34583 108203 -159682 -80325 -22023 182498 -75703 -41641 -238554
9387b38554h1475L2985p3579H3482i2956A42819a21374J0435A4919D638b15934
$$ -238554 -81475 -48490 -122069 83482 -92956 142819 -121374 -110939 14919 4638 -215934
9375A65386a3075A3683J5852J65083r3974J6778d4993m55514e3831j27569d6465
$$ 165386 -13075 13683 29535 194618 100644 117422 -44993 -500507 -53831 -181400 -46465
9363i4301p4155k4584g5804F6666b1558l28668J73341o41p3177B2271a79716O1749
$$ -94301 -168456 -193040 -75804 66666 -21558 -350226 -176885 -177526 -250703 22271 -179716 -117967
9351a17967L787B1901K14370B0813J92762K73796g2792j56761F1862d7677j09284
$$ -117967 -114180 21901 236271 20813 213575 487371 -72792 -229553 61862 -47677 -156961
9340a56961g0716o3229A35487r459a94651L5419G2288b68655a31071m13438D05000
$$ -156961 -70716 -133945 135487 126028 -194651 -159232 72288 -268655 -131071 -544509 405000
9328c362r13n18359f4011I3099g5462E4413P6556b73657m050A02109O470b28359
$$ -3362 -4275 -522634 -64011 93099 -75462 54413 130969 -273657 -277707 102109 108579 -228359
9315H1918a24355M669B04240A8444b25013A71828a38931A9953a94822K6972E4371
$$ 81918 -124355 -119686 204240 18444 -225013 171828 -138931 19953 -194822 -167850 54371
9303b75324A46531a19318A62720d41873F0587b51824B81878b93823a20786M4963
$$ -275324 146531 -119318 162720 -441873 60587 -251824 281878 -293823 -120786 -75823
9293g5823a2914D1797b57253e0592n9291F731L58543j77544b9425j48935o4225
$$ -75823 -12914 41797 -257253 -50592 -109883 6731 365274 187730 -29425 -178360 -242585
9282b42585N8006K5651g0839j62653i1017I0202J44898H6905a47531A3927J07239
$$ -242585 -184579 -158928 -70839 -233492 -91017 90202 235100 86905 -147531 13927 121166
9271A21166c64l38231A71617b24239C1175a06651k51261J05644c8032k30099A05118
$$ 121166 -364 -338595 171617 -224239 31175 -106651 -357912 -252268 -38032 -268131 105118
9259a81125A04001a23555B17223I2190b35791g7114C8168b63150N9319j787F1858
$$ -181125 104001 -123555 217223 92190 -235791 -77114 38168 -263150 -203831 -205618 61858
9247C21236a94875R5824A81477b38126O6896C20192b32585N2388p5001B4104a90384
$$ 321236 -194875 -99051 181477 -238126 -171230 320192 -232585 -180197 -255198 24104 -190384
9235g8371A5100c66506b4777C1723b45736a5431n9333A74808i4022j42122j18227
$$ -78371 15100 -366506 -24777 31723 -245736 -15431 -74764 174808 -94022 -236144 -354371
9224c54371C1976a56749j61287A11602d2023j7802k49756D725a94555h7397j49594
$$ -354371 31976 -156749 -318036 111602 -42023 -59825 -309581 4725 -194555 -87397 -236991
9213b36991j32102C07134f4948I9630J48403a935r6896k78894a31086L5217B7838
$$ -236991 -369093 307134 -64948 99630 248033 -1935 -98831 -377725 -131086 -95869 27838
9201A64651a0885A38651j8408a66113I8097c16789E0275d09745E1621J41404H9741
$$ 164651 -10885 138651 120243 -166113 98097 -316789 50275 -409745 51621 193025 89741
9189c74723I0592N1805B5795L3430h647A6500b01037A70452a16771j13864r2969
$$ -374723 90592 142397 25795 59225 -8647 16500 -201037 170452 -116771 -230635 -323604
9178c23604H1516a0832j95367C1603M505i1122m0492j56991M1941N9337A54611
$$ -323604 81516 -10832 -206199 31603 36108 -91122 -131614 -288605 -246664 -187327 154611
9166b10479n1167H1956b10839A697f8270o6828C511a06996j95366B30971m8791
$$ -210479 -261646 81956 -210839 1697 -68270 -135098 3511 -106996 -302362 230971 182180
9155A82180e1687A71497C2203c0540j91915O8661A22289n1352a68544B7994J14852
$$ 182180 -51687 171497 32203 -30540 -222455 -153794 122289 70937 -168544 27994 142846
9144A42846n6680N4116R6488H6339J87196r969k8886F2721J82164b3407p9746
$$ 142846 86166 140282 236770 86339 273535 263566 234680 62721 244885 -23407 -103153
9133a03153Q413A1772b2777A59766c66096A60014a47048j98694J01717R1303k10418
$$ -103153 -94740 11772 -22777 159766 -366096 160014 -147048 -345742 -244025 -152722 -363140
9122c63140P7966E994a82320A24653b8474a1112q2455B8987b06051m47E3960L36402
$$ -363140 -285174 5994 -182320 124653 -28474 -11112 -93567 28987 -206051 -206498 53960 390362
9110C90362A34386e5746k9793j33436K5413j21682h8037B11928N3581f6663j40344
$$ 390362 134386 -55746 -85539 -218975 -193562 -315244 -88037 211928 265509 -66663 -207007
9099b07007B09385a29473F4870k3231a58978D7315i712m3570a6806j49705d9954
$$ -207007 209385 -129473 64870 41639 -158978 47315 -9712 -53282 -16806 -166511 -49954
9087b63983C18012B5162g1070A86392a43473A15055g5572l53659k0982C36926
$$ -263983 318012 25162 -71070 186392 -143473 115055 -75572 -429231 -450213 336926
9076I3354K12869A6609f2818m5952B26841a91211j38I0783a90382i1514l52005
$$ 93354 306223 16609 -62818 -108770 226841 -191211 -191349 90783 -190382 -91514 -443519
9065d43519e8512A27f4889l36130J71013C5972J00146a14783A6717a22183d4773
$$ -443519 -58512 127 -64889 -401019 -230006 35972 136118 -114783 16717 -122183 -44773
9053e9596a1583C05824f1518m8824A14525b73616L7606B4579a05774A94750H6589
$$ -59596 -11583 305824 -61518 -110342 114525 -273616 -236010 24579 -105774 194750 86589
9041b63814h3310A15305R8775h0606m5851I3438a8909j5659A62571a01822B16548
$$ -263814 -83310 115305 214080 -80606 -126457 93438 -18909 -34568 162571 -101822 216548
9029G2671a8960F5867l2814K16384a27651l0329A84339b02778A79O7690h0331
$$ 72671 -18960 65867 33053 249437 -127651 -157980 184339 -202778 179 67869 -80331
9017A71207b55615p9325j72415a35286I2462b6582I167a16044n5238B317h5631
$$ 171207 -255615 -334940 -507355 -135286 92462 -26582 9167 -116044 -171282 2317 -85631
9005b32378J08694C19747b08958O5804o6949L1794A16751a8876a71q6961A94743
$$ -232378 -123684 319747 -208958 -143154 -210103 -178309 116751 -18876 -171 -87132 194743
8993H7059d22284B69912p1711g5034F0787K1428b8318k13478Q6082K4019k15531
$$ 87059 -422284 269912 198201 -75034 60787 82215 -28318 -241796 -155714 -131695 -347226
8982c47226a49278c9960q3445N0502G9465o324h0405l3917n6511G4032a92247
$$ -347226 -149278 -39960 -123405 -72903 79465 73141 -80405 -114322 -170833 74032 -192247
8970b29256N5268A17334a39837m9926H6511F201b5328R006l75475e8811b8450
$$ -229256 -173988 117334 -139837 -189763 86511 6201 -25328 -16322 -391797 -58811 -28450
8958a19544j22904Q7427J7560D6594M5899e6750k77212a47355B20822C532a9958
$$ -119544 -242448 -155021 -137461 46594 92493 -56750 -333962 -147355 220822 3532 -19958
8946E4099i8574b5891G7254B4921a8771A87977F6312h7110K7065l24227B35611
$$ 54099 -98574 -25891 77254 24921 -18771 187977 66312 -87110 -60045 -384272 235611
8934f463D82464A63774N6577d9250B52885b08703C93263j05988J30566N96530
$$ -6463 482464 163774 220351 -49250 252885 -208703 393263 287275 417841 1014371
8924A014371N06347K152036M474690P504718p139031B863008j275137E32526A61139
$$ 1014371 1520718 3672754 8147444 15652162 8513131 2863008 1587871 532526 161139
8914B74393G3666K67187A30323h5488F9303N7748M34036B47000o8586J27774C3937
$$ 274393 73666 340853 130323 -85488 69303 127051 561087 247000 178414 306188 33937
8902a82750E0847a71643K595N5073o983b4557k76174a06254n4309B3444c92421
$$ -182750 50847 -171643 -169048 -113975 -120958 -24557 -300731 -106254 -160563 23444 -392421
8890a87554b5202I3612d57947a17663o4210Q4098A04494K36973D7364h793l20156
$$ -187554 -25202 93612 -457947 -117663 -181873 -97775 104494 341467 47364 -8793 -328949
8879c28949a6451j92770k8168B55611f3175A22666n6533L6676K4834d013C13749
$$ -328949 -16451 -209221 -237389 255611 -63175 122666 66133 102809 127643 -4013 313749
8867c5674A15669n4256Q4239a4738F4387N02699a79631h4331k3853A73104J70614
$$ -35674 115669 61413 145652 -14738 64387 567086 -179631 -84331 -108184 173104 343718
8856C43718j33733c04886k6033J24787R6014m0548J8056A47341c13561g8790G492
$$ 343718 209985 -304886 -330919 -206132 -110118 -150666 -132610 147341 -313561 -78790 7492
$$ [...]
##END NTUPLES=NMR SPECTRUM
##END=
