##TITLE=AC1480_CUNDIAS13306_8101136_fXrxJl3XZk
##JCAMPDX= 6.0         $$ Bruker NMR JCAMP-DX V2.0
##DATA TYPE= NMR SPECTRUM
##DATA CLASS= NTUPLES
##ORIGIN= BRUKER
##OWNER= Administrator
$$ 1.72 TOPSPIN		Version 2.1
$$ 2013-08-15 18:49:44.900 -0700  Administrator@X
$$ Compression mode = diff/dup
##.OBSERVE FREQUENCY= 400.02188249412
##.OBSERVE NUCLEUS= ^1H
##.ACQUISITION MODE= SIMULTANEOUS (DQD)
##.ACQUISITION SCHEME= undefined
##.AVERAGES= 64
##.DIGITISER RES= 22
##SPECTROMETER/DATA SYSTEM= spect
##.PULSE SEQUENCE= noesygpps1d.comp
##.SOLVENT NAME= COFFEE_meoh
##.SHIFT REFERENCE= INTERNAL, COFFEE_meoh, 1, 14.96124
##AUDIT TRAIL= $$ (NUMBER, WHEN, WHO, WHERE, PROCESS, VERSION, WHAT)
$$ ##TITLE= Audit trail, TOPSPIN		Version 2.1
$$ ##JCAMPDX= 5.01
$$ ##ORIGIN= Bruker BioSpin GmbH
$$ ##OWNER= Administrator
$$ $$ E:\/data/COFFEE/nmr/AC1480_CUNDIAS13306_8101136_fXrxJl3XZk/22/pdata/1/auditp.txt
$$ ##AUDIT TRAIL=  $$ (NUMBER, WHEN, WHO, WHERE, PROCESS, VERSION, WHAT)
(   1,<2013-08-15 18:49:39.884 -0700>,<Administrator>,<X>,<go>,<TOPSPIN 2.1>,
      <created by zg
	started at 2013-08-15 18:38:09.931 -0700,
	POWCHK enabled, PULCHK disabled,
       configuration hash MD5:
       C8 4E 4E 5D D3 5C D8 9E 9F 52 82 E0 59 8A DE 15
       data hash MD5: 64K
       0D 67 56 A2 D1 FE 15 7E 5D BA CE A5 C8 90 5E C9>)
(   2,<2013-08-15 18:49:42.869 -0700>,<Administrator>,<X>,<proc1d>,<TOPSPIN 2.1>,
      <Start of raw data processing
       efp LB = 0.3 FT_mod = 6 PKNL = 1 PHC0 = 0 PHC1 = 0 SI = 128K 
       data hash MD5: 128K
       D6 C5 2F 1A CA 3D F8 45 35 41 01 FA 36 B5 0A 05>)
(   3,<2013-08-15 18:49:43.869 -0700>,<Administrator>,<X>,<proc1d>,<TOPSPIN 2.1>,
      <pk PHC0 = -78.75549 PHC1 = 0 
       data hash MD5: 128K
       DA 13 CB 1C 36 F1 F0 E0 85 74 C0 C1 48 39 F2 37>)
(   4,<2013-08-15 18:49:44.306 -0700>,<Administrator>,<X>,<proc1d>,<TOPSPIN 2.1>,
      <abs ABSG = 1 
       data hash MD5: 128K
       90 68 03 D2 B3 75 76 19 7E 81 16 DC 13 19 EF 7A>)
(   5,<2013-08-15 18:49:44.384 -0700>,<Administrator>,<X>,<proc1d>,<TOPSPIN 2.1>,
      <abs ABSG = 2 
       data hash MD5: 128K
       CD A3 14 DD F3 CF 70 77 18 5B CD EF 0D 79 C2 E9>)
(   6,<2013-08-15 18:49:44.478 -0700>,<Administrator>,<X>,<proc1d>,<TOPSPIN 2.1>,
      <abs ABSG = 3 
       data hash MD5: 128K
       F3 65 72 50 31 08 8D 6F 18 ED ED 8B C9 4A 8E DF>)
(   7,<2013-08-15 18:49:44.587 -0700>,<Administrator>,<X>,<proc1d>,<TOPSPIN 2.1>,
      <abs ABSG = 4 
       data hash MD5: 128K
       45 DD E7 FD ED 7D F3 D7 9A E1 69 96 09 9D A3 47>)
(   8,<2013-08-15 18:49:44.681 -0700>,<Administrator>,<X>,<proc1d>,<TOPSPIN 2.1>,
      <abs ABSG = 5 
       data hash MD5: 128K
       85 4E A6 71 F2 57 FC 64 C2 56 79 79 6A 77 BF 1C>)
$$ ##END=
$$ 
$$ $$ hash MD5
$$ $$ E0 9B AB 85 5D 6C 99 DA 93 16 16 4F B6 3A 78 4A
##$RELAX= 
##$RELAX= 
##$RELAX= 
##$RELAX= 
##$RELAX= 
##$RELAX= 
##$RELAX= 
##$RELAX= 
$$ Bruker specific parameters
$$ --------------------------
##$DU= <E:\>
##$EXPNO= 22
$$ [...]
##$TP07= 0
##$TPNAME0= <>
##$TPNAME1= <>
##$TPNAME2= <>
##$TPNAME3= <>
##$TPNAME4= <>
##$TPNAME5= <>
##$TPNAME6= <>
##$TPNAME7= <>
##$TPOAL= (0..7)
0.5 0.5 0.5 0.5 0.5 0.5 0.5 0.5
##$TPOFFS= (0..7)
0 0 0 0 0 0 0 0
##$TUNHIN= 0
##$TUNHOUT= 0
##$TUNXOUT= 0
##$USERA1= <user>
##$USERA2= <user>
##$USERA3= <user>
##$USERA4= <user>
##$USERA5= <user>
##$V9= 5
##$VALIST= <valist>
##$VCLIST= <CCCCCCCCCCCCCCC>
##$VD= 0
##$VDLIST= <DDDDDDDDDDDDDDD>
##$VPLIST= <PPPPPPPPPPPPPPP>
##$VTLIST= <TTTTTTTTTTTTTTT>
##$WBST= 1024
##$WBSW= 4
##$XGAIN= (0..3)
0 0 0 0
##$XL= 0
##$YL= 0
##$YMAX_a= 6528398
##$YMIN_a= -15100338
##$ZGOPTNS= <>
##$ZL1= 120
##$ZL2= 120
##$ZL3= 120
##$ZL4= 120
##$ABSF1= 14.96124
##$ABSF2= -5.596942
##$ABSG= 5
##$ABSL= 3
##$ALPHA= 0
##$AQORDER= 0
##$ASSFAC= 0
##$ASSFACI= 0
##$ASSFACX= 0
##$ASSWID= 0
##$AUNMP= <proc_prof1d_extract.lims>
##$AXLEFT= 0
##$AXNAME= <>
##$AXNUC= <1H>
##$AXRIGHT= 0
##$AXTYPE= 0
##$AXUNIT= <>
##$AZFE= 0.1
##$AZFW= 0.1
##$BCFW= 0
##$BC_mod= 0
##$BYTORDP= 0
##$COROFFS= 0
##$CY= 15
##$DATMOD= 1
##$DC= 0
##$DFILT= <>
##$DTYPP= 0
##$F1P= 0
##$F2P= 0
##$FCOR= 0.5
##$FTSIZE= 131072
##$FT_mod= 6
##$GAMMA= 0
##$GB= 0
##$INTBC= 1
##$INTSCL= 1
##$ISEN= 128
##$LB= 0.3
##$LEV0= 0
##$LPBIN= 0
##$MAXI= 10000
##$MC2= 0
##$MEAN= 0
##$ME_mod= 0
##$MI= 0
##$NCOEF= 0
##$NC_proc= -2
##$NLEV= 6
##$NOISF1= 0
##$NOISF2= 0
##$NSP= 0
##$NTH_PI= 0
##$NZP= 0
##$OFFSET= 14.96124
##$PC= 1
##$PHC0= -78.75549
##$PHC1= 0
##$PH_mod= 1
##$PKNL= yes
##$PPARMOD= 0
##$PPDIAG= 0
##$PPIPTYP= 0
##$PPMPNUM= 2147483647
##$PPRESOL= 1
##$PSCAL= 4
##$PSIGN= 0
##$PYNMP= <proc.py>
##$REVERSE= no
##$SF= 400.020009541151
##$SI= 131072
##$SIGF1= 0
##$SIGF2= 0
##$SINO= 400
##$SIOLD= 131072
##$SPECTYP= <>
##$SREGLST= <1H.CDCl3>
##$SSB= 0
##$STSI= 131072
##$STSR= 0
##$SW_p= 8223.68421052631
##$SYMM= 0
##$S_DEV= 0
##$TDeff= 65536
##$TDoff= 0
##$TI= <>
##$TILT= no
##$TM1= 0
##$TM2= 0
##$TOPLEV= 0
##$USERP1= <user>
##$USERP2= <user>
##$USERP3= <user>
##$USERP4= <user>
##$USERP5= <user>
##$WDW= 1
##$XDIM= 131072
##$YMAX_p= 393865833
##$YMIN_p= -13396
##$CURPLOT= <Network HP LaserJet P1505>
##$CURPRIN= <$Network HP LaserJet P1505>
##$DFORMAT= <normdp>
##$LAYOUT= <+/1D_H.xwp>
##$LFORMAT= <normlp>
##$PFORMAT= <normpl>
##$SURQMSG= 1
$$ End of Bruker specific parameters
$$ ---------------------------------
##NTUPLES= NMR SPECTRUM
##VAR_NAME=  FREQUENCY,     SPECTRUM/REAL,   SPECTRUM/IMAG
##SYMBOL=    X,             R,               I
##VAR_TYPE=  INDEPENDENT,   DEPENDENT,       DEPENDENT
##VAR_FORM=  AFFN,          ASDF,            ASDF
##VAR_DIM=   131072,        131072,          131072
##UNITS=     HZ,            ARBITRARY UNITS, ARBITRARY UNITS
##FACTOR=    0.0627417313425164, 1,          1
##FIRST=     8223.62146879497, 3605,         -73942
##LAST=      0,             5874,            -73549
##MIN=       0,             -13396,          0
##MAX=       8223.62146879497, 393865833,    0
$$ Real data points
##PAGE= N=1
##DATA TABLE= (X++(R..R)), XYDATA
$$ [...]
67674 77418 79232 80871 82322 83895 85682 87317 88419 88975 89089 88678 87855 87377 88060 89681 91027 91313
67658 91313 91105 91465 92502 93282 92972 91574 89565 87338 85178 83413 82276 81754 81691 81943 82369 82887 83565
67641 83565 84453 85333 85902 86266 86822 87547 87826 87278 86358 85773 85678 85905 86672 88371 90684 92495 92897 92012
67623 92012 90862 90710 92344 95441 98629 100650 101544 102275 103258 103945 103970 103922 104588 106002 107694 109379 110887
67606 110887 111825 111966 111734 111788 112212 112515 112249 111227 109361 106819 104216 102097 100295 98192 95570 92775
67590 92775 90210 88145 86912 86701 87140 87606 87932 88221 88019 86555 84050 81949 81251 81212 80423 78783 77609
67573 77609 77842 78924 79645 79610 79455 79873 80796 81573 81745 81433 81042 80771 80535 80174 79542 78516 77171 75857
67555 75857 74825 73861 72610 71242 70426 70593 71634 73295 75381 77454 78952 79878 80833 81960 82401 81346
67539 81346 79231 77244 75962 75122 74548 74446 74694 74606 73750 72504 71465 70700 69940 69235 69040 69637 70702
67522 70702 71419 71038 69492 67571 66301 66054 66361 66603 66678 66876 67334 67840 68080 67866 67136 65908 64384 63103
67504 63103 62814 63884 65779 67391 68103 68323 68695 69144 69190 68969 69138 69710 69800 68959 68054 68178 69188 70077
67486 70077 70506 71042 71873 72238 71561 70439 69916 70166 70517 70589 70735 71266 71789 71642 70723 69558 68683 68233 68115
67467 68115 68305 68780 69303 69498 69168 68458 67688 67140 67047 67579 68612 69596 69987 69905 70049 70815 71799 72477 73014
67448 73014 73853 74687 74634 73607 72780 73175 74342 75049 74888 74414 73978 73363 72629 72403 72955 73769 74445 75363 76869
67429 76869 78419 79252 79474 79694 79856 79346 78158 77086 76503 75796 74350 72528 71206 70720 70703 70704 70552 70265
67411 70265 69945 69704 69499 69087 68331 67448 66835 66773 67355 68498 69853 70846 71051 70503 69591 68720 68119 67830 67753
67392 67753 67777 67908 68190 68561 68958 69567 70642 72011 72991 72992 72056 70732 69578 68836 68360 67830 67239 67139 68059
67373 68059 69600 70603 70371 69357 68397 67756 67283 67056 67276 67713 67805 67282 66370 65439 64822 64811 65453 66344 66999
67354 66999 67360 67703 68161 68717 69564 70996 72853 74485 75372 75537 75285 74844 74354 73981 73863 74020 74348 74663
67336 74663 74861 75090 75577 76163 76336 75979 75702 76112 77113 78400 80215 82813 85453 86847 86710 86006 85521
67319 85521 85051 84322 83804 83977 84476 84630 84442 84382 84490 84289 83394 81801 79803 78074 77525 78478 80114 81231
67301 81231 81440 81211 80974 80795 80784 81192 81969 82750 83373 83963 84473 84672 84713 85207 86440 87948 89113 89806 90122
67282 90122 89884 88890 87512 86522 86278 86355 86081 85198 83932 82636 81571 80952 80948 81535 82402 83179 83753 84282 84858
67263 84858 85297 85404 85346 85521 86066 86677 87024 87179 87467 87961 88338 88294 87937 87610 87427 87195 86808 86429 86141 85713
67243 85713 85000 84399 84426 84856 84763 83639 82104 81254 81529 82492 83457 84000 83991 83495 82718 81922 81381 81381 82060 83130
67223 83130 84034 84532 84864 85177 85184 84744 84398 84784 85740 86562 87054 87673 88645 89553 90005 90188 90488 90980 91566 92278
67203 92278 93112 93836 94244 94436 94636 94902 95186 95493 95772 95805 95433 94859 94609 95178 96641 98450 99697 99866
67185 99866 99340 98903 98764 98471 97788 97093 96704 96352 95714 95038 94710 94568 94228 93875 94084 94843 95411 95344 95175
67166 95175 95768 97253 98937 100134 100813 101440 102370 103483 104390 104863 105006 105063 105224 105611 106241 106919 107341 107466
67148 107466 107641 108206 109088 109893 110345 110493 110635 111083 111837 112518 112906 113571 115443 118500 121388 122865 123199
67131 123199 123602 124611 125783 126754 127683 128539 128888 128725 128871 130019 131839 133495 134581 135137 135114 134439 133428
67114 133428 132639 132361 132607 133454 134964 136836 138595 140124 141674 143340 144894 146198 147410 148662 149805
67099 149805 150652 151218 151565 151595 151247 150733 150401 150398 150642 151092 151850 152907 153934 154513 154643 154882 155839 157534 159391
67080 159391 160888 162056 163251 164633 166030 167193 168018 168587 169230 170499 172770 175758 178594 180556 181681
67065 181681 182595 183838 185427 187096 188780 190740 193117 195467 197008 197479 197645 198698 201083 204051 206383
67050 206383 207514 207958 208753 210520 212991 215364 217121 218423 219744 221254 222688 223693 224154 224283 224591
67035 224591 225689 227868 230828 233991 237037 239952 242663 245025 247201 249685 252720 255916 258670 260807
67021 260807 262631 264531 266698 269089 271455 273546 275437 277484 279829 282169 284301 286634 289779 293759
67007 293759 298005 302049 305810 309188 311911 314008 316029 318511 321454 324602 328012 332028 336778 341978
66993 341978 347228 352260 356921 361155 365047 368763 372346 375715 378909 382255 386115 390503 395041 399359
66979 399359 403504 407866 412709 417949 423440 429343 435941 443106 450158 456458 462045 467621 473964 481418
66965 481418 489832 498776 507750 516314 524181 531341 538079 544827 551917 559524 567845 577149 587465 598292
66951 598292 608887 618963 628920 639276 650029 660728 671065 681203 691622 702828 715182 728753
66939 728753 743230 758080 772920 787700 802513 817322 832025 846752 861917 877869 894539
66928 894539 911602 928961 946934 965901 985943 1006891 1028554 1050720 1073103 1095587 1118503
66917 1118503 1142353 1167182 1192468 1217686 1242816 1268227 1294329 1321480 1349962 1379774 1410507
66906 1410507 1441701 1473316 1505733 1539244 1573616 1608212 1642589 1676998 1712171 1748534 1785767
66895 1785767 1823331 1861207 1899683 1938551 1977096 2015011 2052751 2090716 2128613 2166038 2203115
66884 2203115 2240032 2276312 2311302 2345151 2378519 2411355 2442657 2471623 2498407 2523485 2546807
66873 2546807 2567888 2586352 2601995 2614635 2624242 2631051 2635311 2637046 2636268 2633228 2628197 2621125 2611662
66860 2611662 2599469 2584338 2566157 2545001 2521354 2496067 2469842 2442547 2413092 2380432 2344922
66849 2344922 2308357 2272260 2236385 2199346 2160506 2120549 2080328 2040051 1999825 1960154 1921279
66838 1921279 1882598 1843344 1803553 1763855 1724606 1685743 1647243 1609250 1571899 1535462 1500427
66827 1500427 1466937 1434342 1401855 1369536 1338069 1307674 1277787 1247905 1218146 1188876 1160337
66816 1160337 1132879 1106993 1082757 1059516 1036486 1013488 990876 968941 947644 926790 906272
66805 906272 886124 866491 847491 829054 810974 793138 775602 758443 741704 725547 710279
66794 710279 696097 682842 670051 657268 644345 631504 619067 607128 595642 584819 575067 566240
66782 566240 557335 547456 536899 526716 517237 507727 497689 487825 479220 472048 465596 459253 452883
66769 452883 446358 439366 431868 424357 417452 411356 405817 400459 395060 389591 384063 378406 372606 366933
66755 366933 361831 357394 353185 348778 344274 339982 335734 330957 325551 320256 315932 312671 309869 307011
66741 307011 304114 301437 298989 296472 293596 290399 287224 284321 281515 278339 274599 270686 267156 264093
66727 264093 261114 257973 254877 252049 249330 246494 243720 241344 239205 236818 234274 232396 231637 231239 230074
66712 230074 228104 226327 225268 224171 221967 218601 214966 211811 209154 206650 204137 201750 199784 198500
66698 198500 197874 197441 196582 195037 193009 190793 188534 186422 184796 183770 182932 181769 180375 179336 178823
66683 178823 178232 176966 175187 173388 171489 169018 166166 163933 162896 162372 161307 159646 158255 157648 157400
66668 157400 156812 155659 154155 152607 151317 150478 149879 148917 147191 144999 143070 141861 141236 140788 140316 139927
66652 139927 139711 139441 138793 137872 137251 137210 137187 136399 134893 133474 132528 131482 129753 127756 126477 126257 126475
66635 126475 126410 125996 125643 125676 126136 126885 127622 127904 127428 126360 125245 124423 123723 122840 121851 121039 120310 119272
66617 119272 118001 117215 117372 118049 118656 119271 120199 121044 121092 120495 120162 120367 120307 119353 117961 116908 116312 115933
66599 115933 115801 115865 115481 114015 111802 109867 108830 108540 108603 108688 108505 108010 107644 107885 108617 109320 109739 109920
66581 109920 109784 109225 108546 108214 108135 107743 106871 106010 105630 105721 106120 106770 107473 107832 107655 107106 106373 105541 104833
66562 104833 104504 104388 104059 103579 103499 103895 104039 103415 102503 101982 101622 100670 99105 97814 97514 98040 98732 99067
66544 99067 98827 98079 97232 96872 97305 98285 99210 99523 99007 97934 96902 96330 96064 95594 94662 93510 92525 91822
66526 91822 91278 90874 90847 91443 92537 93546 93833 93265 92322 91610 91333 91249 91054 90652 90093 89384 88482 87460 86585
66507 86585 86050 85646 84933 83853 82922 82621 82760 82817 82678 82595 82459 81779 80578 79745 80099 81460 83033 84392
66489 84392 85618 86671 87177 86928 86249 85751 85884 86650 87603 88179 88187 87902 87596 87189 86558 85952 85781 86156 86950
66470 86950 88068 89264 89894 89403 88042 86648 85726 85232 85214 85952 87184 87871 87260 85857 84855 84794 85250
66453 85250 85679 86094 86823 87916 88927 89210 88520 87465 87139 88063 89597 90705 91125 91372 91743 91953 91859 91898
66435 91898 92384 92872 92781 92391 92575 93593 94745 95330 95354 95087 94493 93533 92575 91934 91256 90000 88452 87595
66417 87595 87861 88575 88876 88684 88450 88399 88469 88685 89081 89429 89517 89590 90079 90858 91237 90799 89900 89206 89006 89143
66397 89143 89343 89411 89252 88900 88503 88187 87968 87797 87561 87066 86209 85207 84475 84178 84104 84051 84172 84775 85898
66378 85898 87227 88337 88915 88925 88685 88666 88985 89201 88824 88055 87749 88466 89653 90011 88777 86488 84378 83135
66360 83135 82467 81853 81328 81271 81721 82277 82605 82679 82534 82160 81724 81575 81859 82371 82830 83061 82891 82295 81719 81785
66340 81785 82429 82839 82617 82520 83463 85144 86422 86864 87124 87728 88270 88101 87201 85953 84588 83304 82534 82536
66322 82536 82947 83233 83462 84078 84975 85371 84838 84010 83996 85304 87592 90271 92946 95306 96937 97479 96928
66305 96928 95642 94051 92470 91128 90226 89845 89878 90153 90576 91047 91353 91303 90936 90467 90064 89858 90048 90631
66287 90631 91066 90681 89622 88978 89566 90857 91551 91042 89844 88686 87792 87191 87177 88019 89472 90911 91897
66270 91897 92417 92684 92962 93459 94200 94924 95258 95020 94362 93709 93554 94098 94939 95274 94649 93460 92561 92434 92840
66251 92840 93174 92933 91897 90177 88237 86694 85929 85870 86180 86612 87187 88096 89448 91028 92320 92904 92878
66234 92878 92754 92877 93039 92826 92260 91887 92182 93020 93878 94431 94720 94780 94424 93577 92577 91886 91592 91440 91273
66215 91273 91104 90771 89948 88680 87584 87285 87839 88862 89929 90658 90729 90232 89812 90012 90572 90782 90516 90438
66197 90438 91080 92129 92800 92660 91935 91233 91137 91817 92829 93431 93227 92430 91493 90720 90240 90069 90057 90046 90225
66178 90225 91043 92584 94332 95740 96730 97354 97322 96365 94878 93672 93066 92615 91795 90590 89338 88399 88094
66161 88094 88648 89909 91298 92252 92657 92781 92903 93097 93235 93142 92851 92696 92939 93294 93098 92133 91007 90469
66143 90469 90599 90973 91434 92245 93519 94915 96042 96828 97321 97459 97304 97283 97830 98915 100185 101473 102798
66126 102798 103939 104420 104055 103159 102080 100881 99721 99161 99672 100999 102456 103729 104961 106090 106642 106399
66110 106399 105865 105708 105948 105976 105328 104219 103350 103264 103895 104720 105391 106084 107045 107884 107768 106464 104858 104231
66092 104231 105191 107425 110152 112500 113800 113962 113567 113281 113225 113128 112929 112847 112986 113276 113800 114762 116005 116951
66074 116951 117191 116894 116484 116095 115563 114825 114109 113677 113475 113121 112306 111209 110374 110064 109933 109498 108812 108400
66056 108400 108627 109393 110383 111332 112107 112847 113987 115753 117613 118658 118703 118583 119074 119863 120009 119183 118046
66039 118046 117411 117409 117542 117290 116541 115628 115117 115509 116944 119101 121396 123360 124880 126072 127016 127727 128403
66022 128403 129418 130902 132476 133663 134453 135191 136010 136732 137317 138053 139163 140512 141804 142862 143656 144352
66006 144352 145403 147264 149899 152842 155848 159126 162829 166783 170935 175631 181043 186693 191947 196662
65992 196662 200911 204388 206672 207886 208530 208788 208576 208152 207923 207633 206469 204197 201493 198839 195854 192260
65976 192260 188840 186567 185073 182913 179377 175252 171609 168583 165764 163216 161385 160242 159111 157412
65962 157412 155182 152858 150943 149941 150123 151134 152140 152719 153341 154606 156240 157318 157512 157615 158667
65947 158667 160892 163699 166482 169153 172029 175461 179512 183808 187695 190616 192389 193211 193533 193931 194806
65932 194806 196041 197120 197741 198225 199170 200822 202927 205086 207120 209160 211486 214233 217250 220325 223521
65917 223521 227023 230725 234355 238099 242605 248057 253694 258591 262562 265823 268208 269411 269799 270237 271094
65902 271094 272038 272796 273414 273668 272992 271335 269455 267921 266387 264264 261640 258897 255835 251861 246929
65887 246929 241589 236099 230052 223123 215805 209118 203705 199336 195206 190664 185700 180694 175801 170889
65873 170889 166209 162708 161172 161167 161352 160860 159976 159364 159131 158933 158626 158399 158391 158524 158734 159096 159649 160267 160764
65854 160764 161051 161122 160951 160503 159832 159175 158894 159317 160500 162141 163685 164654 164956 164943 165117 165713 166564 167303
65836 167303 167661 167603 167318 167136 167384 168225 169653 171601 174017 176865 180289 184789 190926 198586 206719 214157
65820 214157 220644 226800 233112 239305 244733 248991 251933 253419 253404 252096 249768 246448 242133 237187 232192
65805 232192 227389 222557 217598 212903 208933 205653 202628 199604 196776 194533 193102 192368 191851 190916 189290
65790 189290 187473 186431 186775 188327 190475 192776 195169 197878 201286 205719 211101 216873 222384 227365
65776 227365 231985 236640 241805 247825 254487 260815 265600 268252 269049 268650 267501 265524 262127 256613 249028
65761 249028 240606 232992 226938 222130 218273 215784 215128 216009 217703 219939 222998 227182 232643 239553 247931
65746 247931 257331 267154 277258 287871 298881 309659 319576 328201 334981 339341 341354 341696 340525
65733 340525 336896 329899 320076 309094 298143 287241 275999 264413 252778 241438 230898 221648
65721 221648 213524 205590 197158 188696 181354 175769 171702 168628 166175 163955 161512 158653 155578 152623
65707 152623 150140 148605 148353 148988 149463 149079 148158 147453 147216 147254 147564 148314 149289 149927 150068 150194 150761 151697
65689 151697 152693 153725 155047 156922 159484 162609 165745 168236 170040 171902 174554 177944 181586 185438
65675 185438 190092 196147 203720 212597 222615 233805 246150 259282 272503 285397 298362 312182
65663 312182 326926 341661 355407 367885 379047 388453 395768 401443 406144 409677 411318 411199 410564
65650 410564 410505 411116 412072 413296 414671 415776 416423 416992 417687 417798 416194 412277 406025 397390 386193 372517
65634 372517 356822 339741 322052 304633 288067 272404 257601 243928 231560 220100 209067
65623 209067 198730 189887 182841 177203 172670 169325 166926 164552 161422 157793 154630 152534 151328 150547
65609 150547 149992 149690 149525 149121 148210 147033 146191 146021 146339 146897 147783 149016 150067 150300 149768 149098 148654 148376
65591 148376 148433 149339 151154 153217 155059 157121 160074 163796 167524 170858 174158 178087 183136 189500 197074
65576 197074 205521 214587 224279 234621 245394 256385 267713 279643 292115 304674 316707 327546
65564 327546 336522 343304 348029 350856 351443 349241 344206 336868 327759 317207 305699 293978 282468
65551 282468 270844 258465 245230 231877 219486 208786 199967 193010 187926 184519 182157 180260 178990
65538 178990 178905 179798 180508 180307 179916 180548 182402 184736 187044 189260 191079 192038 192295 192393 192134 190692 188105
65521 188105 185635 184100 182742 180431 177236 173972 170864 167655 164629 162454 161105 159872 158506 157521
65507 157521 157190 157037 156635 156231 156152 156137 155795 155429 155868 157456 159562 161180 161875 162090 162621 163847 165514 167210
65489 167210 168900 170878 173368 176429 180180 184814 190156 195348 199241 201293 202071 202676 203549 204079 203623
65474 203623 202625 202136 202301 202065 200627 198330 195643 192016 186714 180360 174655 170607 167876 165780 164029
65459 164029 162287 159993 157060 154120 151646 149406 147189 145533 145175 146136 147792 149524 150937 151814 152367
65444 152367 153290 155038 157192 158910 159900 160582 161495 162892 164806 167116 169560 171974 174413 176849 178947
65429 178947 180501 181874 183601 185631 187324 188105 187839 186673 184935 183143 181684 180416 178949 177277 175803
65414 175803 174707 173717 172580 171443 170609 170195 170155 170378 170667 170908 171322 172283 173774 175375 176911 178738 181141
65397 181141 183827 186399 189042 192267 196052 199732 202753 205088 206805 207702 207662 207011 206113 204808 202710
65382 202710 200008 197467 195524 193853 192076 190456 189485 189149 189110 189435 190466 192024 193364 194132 194795 195903
65366 195903 197448 199296 201746 205174 209443 214130 219076 224290 229631 235141 241477 249373 258693 268628
65352 268628 278780 289434 300568 311224 320186 326914 331546 334274 335096 333972 331043 326743 321804
65339 321804 316884 312047 306777 300601 293524 285835 277786 269617 261621 253955 246558 239438 232842 226921
65325 226921 221398 215848 210334 205585 202479 201282 201315 201368 200583 198998 197180 195475 193842 192258 190862
65310 190862 189636 188326 186846 185449 184298 183196 182012 181117 181055 181902 183216 184494 185486 186207 186955 188267
65294 188267 190567 193795 197479 201180 204781 208361 211886 215038 217359 218630 219077 219122 218983 218758 218695 219009
65278 219009 219371 219147 218351 217930 218713 220378 221863 222481 222207 221117 219173 216583 213878 211432 209188 206941
65262 206941 204648 202377 200194 198229 196695 195722 195240 195004 194631 193696 191996 189768 187537 185700 184272
65247 184272 182950 181360 179369 177318 175795 174993 174457 173663 172654 171823 171198 170388 169273 168377 168342 169244 170551
65230 170551 171636 172233 172542 172987 173846 175038 176211 176965 176976 176090 174438 172396 170307 168362 166808 166036
65214 166036 166244 167163 168350 169618 170969 172256 173210 173714 173826 173658 173456 173621 174284 175002 175199 174815 174170
65197 174170 173435 172707 172448 173192 174759 176371 177644 178915 180359 181444 181648 181282 181194 181924 183547 186000
65181 186000 189099 192370 195294 197682 199576 200861 201338 201232 201362 202596 205082 208041 210368 211545 211970
65166 211970 212360 213055 214069 215557 217785 220737 224206 228263 233190 238964 245317 252331 260284 268820 277025
65151 277025 284762 293271 303907 316787 331277 347263 365222 385389 407672 432258 459551 489483
65139 489483 521475 555031 589682 624249 656867 686136 712001 735379 757163 777611 796230
65128 796230 812052 824206 832289 836011 834640 827363 814416 797470 778608 758884 737827 714117
65116 714117 686739 655783 622294 587326 551358 514850 479070 445823 416257 390303 367298
65105 367298 346737 328389 312128 297906 285607 274841 265174 256608 249552 244185 240155 236916 234021
65092 234021 231062 227785 224443 221659 219779 218686 218291 218726 219824 220887 221238 220688 219297 217147 214646
65077 214646 212582 211499 211343 211960 213467 215722 217978 219620 220889 222277 223528 223874 223056 221472 219518
65062 219518 217417 215613 214555 214064 213558 213017 213066 214002 215383 216859 218737 221257 223785 225256 225205 223992
65046 223992 222260 220532 219187 218380 217969 217706 217427 216946 215916 214057 211429 208377 205311 202637 200606
65031 200606 198992 197133 194619 191795 189296 187224 185118 182739 180446 178738 177763 177452 177838 178976 180704
65016 180704 182665 184511 185967 186851 187233 187467 187847 188298 188710 189500 191427 194628 198218 201220 203665 206330
65000 206330 209447 212271 214076 215078 216016 217201 218490 219948 221919 224400 226887 229125 231596 234942
64986 234942 239069 243108 246171 247993 248985 249908 251418 253591 255784 257125 257158 255970 253768 250634 246756
64971 246756 242589 238536 234551 230329 225862 221548 217701 214252 211051 208178 205652 203074 199999 196659
64957 196659 193852 191987 190657 189314 187985 186974 186240 185606 185366 186078 187676 189283 190072 189990 189485 188839
64941 188839 187999 186852 185478 184251 183754 184399 186036 188110 190236 192394 194515 196233 197208 197466 197237 196754
64925 196754 196402 196703 197791 199110 200000 200428 200833 201407 201963 202411 202919 203539 204115 204695 205665 207284 209331
64908 209331 211398 213306 215053 216655 218371 220921 225036 230621 236611 241965 246772 252145 258922 266597
64894 266597 273741 279417 283840 287661 291015 293606 295452 297017 298592 299963 300821 301165 301081 300423 298948
64879 298948 296642 293676 290205 286321 282087 277407 272078 266264 260851 256990 255210 255078 255651 256051 255725
64864 255725 254596 253107 251743 250288 247889 244169 240037 236886 235036 233412 230834 227209 223290 219665
64850 219665 216397 213389 210700 208462 206784 205715 205105 204606 204060 203813 204287 205293 206190 206819 207744 209259
64834 209259 210565 210481 208898 207074 206417 207230 208708 209889 210458 210815 211578 213062 215170 217662 220443 223579
64818 223579 227202 231476 236572 242592 249563 257542 266562 276464 286922 297688 308572 319151 328894
64805 328894 337756 346217 354245 360579 363659 363200 360305 356101 350859 344578 337683 330746 323918 317064
64791 317064 310169 303259 296177 288836 281543 274780 268766 263510 259151 255904 253757 252513 252108 252617 254041
64776 254041 256337 259637 264070 269347 274801 280003 285163 290898 297770 306051 315599 325754 335516 344098
64762 344098 351292 357235 362000 365576 368191 370336 372362 374261 375923 377415 378748 379507 379069 377293 374660
64747 374660 371592 367909 363250 357803 352157 346462 340176 332810 324635 316513 309213 302974 297496 292244
64733 292244 286978 282140 278462 276144 274708 273752 273455 274042 275174 276317 277460 278987 281007 283320 286032
64718 286032 289645 294420 300040 306063 312356 318869 325223 330799 335080 337835 339096 339052 337773 334967 330186
64703 330186 323451 315545 307534 300032 293007 286245 279847 274319 270193 267581 266122 265384 265243 265764 266859
64688 266859 268269 269914 272016 274797 278157 281721 285123 288271 291449 295146 299664 304926 310735 317161
64674 317161 324489 332824 341918 351283 360262 368052 373985 377839 379709 379583 377283 372769 366216 357808
64660 357808 347822 336968 326276 316519 308041 301168 296310 293453 291948 291116 290774 290969 291584 292606 294489
64645 294489 297799 302637 308760 316048 324456 333683 343388 353770 365541 379231 394726 411437 428631
64632 428631 445542 461410 475492 486967 495087 499756 501820 502387 501833 499743 495759 490104 483320 475962
64618 475962 468630 461826 455556 449432 443424 438131 434019 430638 427025 422774 418375 414446 410900 406996
64604 406996 402106 396341 390330 384436 378303 371271 363094 354067 344633 335271 326730 319797 314592 310479
64590 310479 307040 304833 304738 306780 310149 314310 319507 325952 333026 339746 345753 351374 356701 361095 363815
64575 363815 364814 364616 363567 361552 358437 354388 349661 344340 338499 332342 325985 319314 312356 305587 299488
64560 299488 293919 288333 282577 277054 272093 267602 263476 259872 256881 254337 252208 250822 250346 250390 250497
64545 250497 250757 251524 252711 253855 254774 255726 256945 258434 260161 262025 263554 264120 263615 262617 261771 261293
64529 261293 261157 261334 261649 261798 261867 262527 264353 267105 270016 272705 275455 278670 282433 286660 291446 297118
64513 297118 304047 312363 321701 331246 340230 348413 355945 362838 368864 373954 378363 382326 385871 389147
64499 389147 392638 396747 401299 405665 409221 411376 411412 408762 403560 396598 388605 379821 370347 360614 351305
64484 351305 342958 335821 329930 325146 321210 317954 315411 313648 312534 311693 310546 308489 305306 301495
64470 301495 297856 294597 291206 287422 283961 281895 281565 282570 284512 287177 290176 293086 295953 299009
64456 299009 301793 303325 303409 303113 303504 304409 304957 304912 304879 305371 306270 307204 308094 309307 311540 315375 320687 326605
64438 326605 332371 338147 344724 352609 361661 371497 381945 393249 406075 421204 438980 459330 482481
64425 482481 509237 540207 575311 614707 659707 711932 771912 839454 915156 1000187 1094263
64414 1094263 1194862 1298729 1403121 1505248 1601871 1690582 1770707 1841871 1902177 1948780
64404 1948780 1979779 1994484 1992221 1972314 1935509 1884407 1822071 1750705 1671659 1585745 1493322
64393 1493322 1395024 1293096 1191420 1093685 1001847 916646 838864 769263 707699 653249 605312
64382 605312 564031 529497 500997 477224 456961 439493 424625 412454 402903 395308 388540 381640
64370 381640 374323 366857 359531 352311 345006 337682 330771 324681 319401 314687 310599 307530 305582 304247
64356 304247 302996 302026 302069 303528 306162 309626 313955 319344 325727 332815 340436 348523 356763 364448 370768
64341 370768 375223 377714 378311 377067 374202 370454 367028 364877 363926 363195 361814 359871 358239 357777 358869
64326 358869 361466 365232 369637 374230 378887 383583 387867 390825 391700 390352 387072 382327 376833 371416
64312 371416 366330 360976 354794 348271 342531 337944 333712 328910 323417 317617 311840 306428 301905 298534
64298 298534 295967 293727 291874 290768 290387 290327 290423 290957 292340 294878 298702 303544 308696 313717 319125 325872
64282 325872 333998 342392 350063 357199 364632 372628 380621 387933 394356 400117 405570 410963 416297 421348
64268 421348 425816 429358 431461 431528 429388 425731 421864 418855 416924 415652 414802 414719 415736 417289 418112 417505
64252 417505 415941 414025 411316 406869 400734 394057 387680 381466 375184 369174 363617 357859 351186 343834
64238 343834 336632 330020 324038 318936 315015 312002 309350 307171 306257 307044 309019 311222 312871 313546 313350
64223 313350 313014 313331 314239 314924 314963 314858 315185 315692 315686 314926 313720 312373 311056 310068 309767 310191 311088 312415
64205 312415 314448 317298 320599 323932 327336 331030 334621 337053 337631 336945 336385 336816 338107 340007 342935
64190 342935 347585 354144 362358 372140 383625 396739 411122 426342 441627 455487 466277 473373
64178 473373 477274 478387 476272 470486 461623 450992 439524 427542 415405 403795 393241 383798 375378
64165 375378 368128 362236 357516 353432 349669 346489 344339 343048 341708 339595 337053 335061 333979 333159
64151 333159 331920 330435 329383 329094 329418 330202 331476 333227 335354 337805 340463 342906 344576 345293 345417
64136 345417 345451 345616 345811 345879 345899 346255 347387 349357 351677 353609 354627 354652 354041 353402 353231 353598 354324 355514
64118 355514 357667 361136 365744 371159 377390 384633 392805 401587 410820 420556 430773 441291 451859
64105 451859 462033 471071 478320 483715 487671 490624 493034 495782 500013 506296 514146 522470 530328 537230
64091 537230 543015 547670 551167 553399 554358 554312 553576 552123 549672 546184 541941 537041 531147 523908 515403
64076 515403 506045 496303 486741 477991 470290 463185 456036 448836 442241 436798 432405 428618 425214 422247
64062 422247 419799 417923 416762 416351 416230 415627 414341 413266 413643 415813 419076 422792 427101 432399 438631
64047 438631 445566 453457 462841 473826 486053 499305 513688 529167 545365 561907 578629 595400
64035 595400 612058 628486 644281 658318 669181 676274 680120 681350 679910 675557 668700 660326 651333
64022 651333 642311 633653 625481 617609 609923 602562 595322 587156 576921 564702 551920 540003 529302
64009 529302 519371 509879 500920 492662 485071 478069 471874 467009 463859 462174 461156 460121 459014 458271
63995 458271 458394 459786 462699 467022 472232 477876 484078 491313 499711 508840 518148 527350 536368 545190
63981 545190 553886 562503 570833 578460 585215 591521 598194 605943 615025 625320 636746 649644 664638
63968 664638 681935 700922 720775 741510 764124 789606 818055 848943 882024 917693 956618
63957 956618 999355 1046482 1098824 1157311 1222687 1295643 1377361 1469713 1574698 1693921 1828969
63946 1828969 1982083 2155750 2351291 2568343 2806098 3064563 3343925 3642813 3957862
63937 3957862 4284934 4620073 4959085 5296867 5627491 5944463 6240441 6507227 6737017
63928 6737017 6924088 7065212 7158574 7202622 7196041 7138481 7031085 6876430 6678208 6441091
63918 6441091 6170815 5874170 5558600 5231510 4899720 4569210 4245037 3931288 3631203
63909 3631203 3347446 3082267 2837377 2613674 2411145 2229123 2066719 1923051 1796989
63900 1796989 1686795 1590340 1505835 1432100 1367922 1311501 1260975 1215360 1174472 1137858 1104184
63889 1104184 1071802 1039613 1007349 975368 944320 914678 886449 859471 833952 810370 788926
63878 788926 769635 752948 739586 729433 721267 714091 708284 704896 704303 706201 710479 717225 725987
63865 725987 735958 746992 759682 774193 789681 805232 820820 836886 853380 869702 885295 899841
63853 899841 912980 924291 933608 941055 946686 950251 951350 949723 945397 938619 929698 918851 906207
63840 906207 891811 875493 856749 835102 810794 785021 759231 734134 709410 684323 658582
63829 658582 632693 607615 584065 562099 541352 521640 503213 486356 470966 456744 443775
63818 443775 432613 423536 415787 407907 399038 389846 381958 376454 373034 370582 368219 365721 363238 360979
63804 360979 359053 357390 355805 354250 352848 351517 349802 347460 344998 343144 341806 340045 337185 333447
63790 333447 329305 324793 319906 315266 311678 309066 306404 302890 298854 295297 292814 291237 290116 289242
63776 289242 288639 288324 288233 288258 288169 287572 286189 284250 282402 281096 280156 279080 277633 276072 274933 274715 275481
63759 275481 276557 276864 275992 274785 274459 275291 276577 277721 278696 279459 279788 279987 280969 283042 285188 286235
63743 286235 286388 286891 288433 290631 293007 295642 298690 301888 304907 307726 310394 312775 314845 316973 319485
63728 319485 322102 324101 325048 325224 325385 326262 328219 331146 334619 338244 341983 346112 350744 355376 359047
63713 359047 361181 362185 362943 363720 363984 363442 362750 362732 363231 363357 362744 361951 361549 361454 361414 361680 362756 364722
63695 364722 367137 369447 371289 372606 373721 375162 377123 379185 380794 381933 383037 384248 385058 384869 383790
63680 383790 382657 382200 382307 382256 381610 380627 379762 379116 378648 378602 379233 380230 380915 381071 381090 381218 381184 380767 380267 380058
63660 380058 380057 379952 379539 378494 376299 372991 369673 367575 366634 365592 363519 360654 357673 354847 352226 350150
63644 350150 348993 348614 348499 348381 348441 348994 350279 352528 355889 360111 364509 368459 371977 375728 380427 386255
63628 386255 392860 399786 406807 413862 420920 427996 435263 443027 451649 461487 472748 485311 498869
63615 498869 513433 529570 547903 568472 590837 614686 640046 666933 695178 724707 755573
63604 755573 787456 819399 850349 879784 907417 932315 952712 966970 974671 976725 974542 969236
63592 969236 961548 952227 942072 931478 920078 907169 892553 876722 860029 841876 821150 797529
63580 797529 772098 746544 721992 698888 677651 658804 642361 627683 614453 603456 595823 591575
63568 591575 589500 588596 589060 591512 595699 600496 604982 609058 613068 617325 622139 627893 634868 643125 652751
63553 652751 664141 677898 694489 713996 736148 760662 787590 817281 849906 885139 922365
63542 922365 960894 999664 1036905 1070494 1098714 1120401 1134627 1140927 1140054 1133997 1124814 1113624
63530 1113624 1100889 1087147 1072964 1058341 1042669 1025267 1005627 983216 957543 928607 897040
63519 897040 863708 829413 795054 761689 730104 700387 672230 645624 621086 599201 580152
63508 580152 563735 549571 537115 525699 514928 505103 496881 490335 484547 478403 471647 464872 458691
63495 458691 453373 449281 447028 446671 447073 446590 444506 441554 439036 437739 437690 438501 439554 440090 439683 438845
63479 438845 438854 440615 443752 447029 449673 452014 454795 458236 461996 465769 469456 472860 475649 477760 479539
63464 479539 481393 483476 485756 488067 489956 490777 490245 488791 487243 486280 486288 487441 489656 492588 496037 500329
63448 500329 506025 513139 520819 527869 533597 538209 542559 547582 553799 561181 569301 577625 585904 594616
63434 594616 605025 618501 635611 655900 678536 702872 728374 754393 780196 804961 827650
63423 827650 847405 864525 880687 897689 916133 935791 956999 980957 1008571 1039568 1072873
63412 1072873 1107293 1141595 1174394 1204374 1230378 1251146 1265339 1272208 1272096 1266131 1255730 1242606
63400 1242606 1228675 1215214 1202043 1187893 1171646 1152928 1131647 1107499 1080194 1049922 1017365
63389 1017365 983372 948772 914406 881155 849900 821371 795964 773688 754365 737893 724201
63378 724201 713027 703974 696873 691886 689115 688255 688877 691009 695200 701905 710882 721278 732215 743312
63364 743312 754738 766925 780269 795017 811323 829385 849517 872133 897668 926421 958350
63353 958350 992883 1028960 1065308 1100688 1133857 1163399 1187822 1206002 1217529 1222635 1221898 1216104
63341 1216104 1206327 1193849 1179846 1165055 1149722 1133713 1116670 1098081 1077370 1054019 1027741
63330 1027741 998678 967517 935361 903316 872107 842119 813810 787905 765042 745340 728565
63319 728565 714691 703944 696103 690047 684362 678226 671292 662815 651516 636685 619102 600542 582539
63306 582539 565913 551193 538845 528893 520741 513760 507948 503754 501291 499963 498959 497939 497060 496370
63292 496370 495382 493321 489750 484873 479268 473408 467407 461174 454771 448569 442964 437942 433147 428493
63278 428493 424498 421731 420021 418552 416755 414868 413575 413318 413991 415052 415902 416435 417252 419043 421702
63263 421702 424464 426944 429541 432556 435464 437604 439305 441753 445769 451110 456863 462227 466985 471665
63249 471665 477228 484280 492518 501180 509904 518880 528306 538198 548770 560570 574069 589318 606116
63236 606116 624292 643796 664701 687210 711516 737699 765813 795885 827587 860113 892693
63225 892693 925117 957441 989439 1020793 1051616 1082199 1112283 1141232 1169037 1196559 1224574
63214 1224574 1253026 1281401 1309298 1336327 1361820 1384929 1404760 1420263 1430355 1434408 1432366 1424295
63202 1424295 1410203 1390372 1365416 1335853 1302216 1265820 1228819 1193009 1158978 1126833 1097253
63191 1097253 1071250 1049267 1031071 1016341 1004791 996020 989806 986506 986678 990435 997545 1007949 1021638
63178 1021638 1038127 1056611 1076546 1097597 1119136 1140424 1161285 1182014 1202586 1222557 1241813
63167 1241813 1260751 1279349 1296585 1311167 1322486 1330566 1335387 1336657 1334060 1327313 1316035 1299850
63155 1299850 1278694 1252971 1223480 1191266 1157347 1122449 1087025 1051577 1016844 983563 952152
63144 952152 922705 895221 869782 846569 825716 807134 790604 776233 764646 756368 750983 747287
63132 747287 744461 742735 742681 744192 746637 749799 754034 759423 765379 771502 778465 787460 798770 811297
63118 811297 823550 834663 844371 852551 859187 864427 868211 870077 869861 868376 866763 865235 863103 860027
63104 860027 856486 852798 848536 843375 837827 832526 827304 821622 815531 809533 803857 798635 794498 792152
63090 792152 791384 791260 791294 791692 792417 792874 792879 793223 794917 798274 803006 808688 814783 820740 826524 832732 839829
63073 839829 847568 855491 863689 872690 882806 894029 906358 919827 934255 949405 965480 983228
63061 983228 1003437 1026327 1051412 1078006 1106053 1136523 1170769 1209429 1252146 1298400 1348221
63050 1348221 1401861 1459158 1519648 1583152 1649732 1719059 1790266 1862558 1935685 2009544 2083442
63039 2083442 2156081 2226348 2294027 2359677 2423918 2486969 2548792 2609398 2668814 2726826 2782763
63028 2782763 2835344 2882657 2922569 2953429 2974243 2984028 2981311 2964669 2933682 2889060 2832096 2764520
63016 2764520 2688778 2607765 2523992 2439272 2355236 2273719 2196421 2124524 2058764 1999653 1947598
63005 1947598 1903047 1866573 1838490 1818465 1805930 1800792 1803198 1812627 1827831 1847831 1872226 1900340
62993 1900340 1930828 1962597 1995514 2029697 2064659 2099682 2134513 2169049 2202784 2235206 2266260
62982 2266260 2295562 2321452 2341728 2355258 2362088 2361986 2353800 2336488 2310089 2275340 2232912 2183384
62970 2183384 2127559 2066495 2001486 1934170 1866223 1798607 1731421 1664855 1600011 1538390 1480627
62959 1480627 1426095 1373882 1323970 1277309 1234721 1195809 1159122 1123444 1088793 1056039 1025771
62948 1025771 997803 971668 947153 924270 902950 882993 864145 846188 829086 813116 798685
62937 798685 785890 774374 763735 754032 745729 739162 734158 730203 726892 724077 721604 719196 716777
62924 716777 714728 713425 712506 711037 708566 705694 703339 701608 699637 696418 691598 685676 679602 674041
62910 674041 668867 663499 657744 652041 646790 641909 637350 633569 631001 629335 627877 626489 625679 625787 626533
62895 626533 627376 627972 628266 628448 628842 629573 630420 631160 631868 632638 633347 634090 635504 638107 641593 645460 650103
62878 650103 656414 664311 672551 680190 687336 694118 699766 703475 705598 707176 708485 708722 707131 703819
62864 703819 699329 693834 687080 679083 670635 662982 656962 652492 648880 645440 641770 637819 634055 631345
62850 631345 630150 629935 629771 629440 629434 629908 630309 630168 629673 629171 628579 627595 626124 624219 621931 619488 617305
62833 617305 615550 613925 612114 610259 608912 608746 610208 613050 616220 618800 621079 624094 628036 632015
62819 632015 635657 639927 645639 651991 657592 662425 667758 674365 681833 689619 697831 706782 716506 726964
62805 726964 738170 749848 761365 772205 782239 791525 800187 808526 816825 825000 832847 840701 849510
62792 849510 860154 873001 888176 905873 926255 949377 975403 1004802 1038308 1076855 1121420
62781 1121420 1172613 1230400 1294448 1364731 1441488 1524706 1613957 1708650 1808008 1910840 2015791
62770 2015791 2121877 2228313 2333661 2435479 2530808 2616623 2689916 2748066 2789513 2813739
62760 2813739 2820408 2808992 2779499 2733027 2671246 2595760 2508408 2411730 2308443 2200652 2090148
62749 2090148 1979326 1871056 1767424 1669083 1576045 1488663 1407489 1332526 1263144 1198774 1139368
62738 1139368 1085181 1036416 993230 955726 923544 895527 870250 847043 826240 808318 793120
62727 793120 780117 769062 759914 752326 745732 739972 735392 732269 730458 729699 729911 731126 733452 737210
62713 737210 742755 750128 759207 770221 783641 799478 817289 837146 859994 886568 916447 948846
62701 948846 984008 1023104 1066872 1115051 1167201 1223398 1283849 1348313 1416314 1487690 1562607
62690 1562607 1641040 1722266 1804602 1885516 1962173 2032109 2093443 2144556 2183837 2209869 2221764
62679 2221764 2219274 2202706 2172740 2130163 2075784 2010817 1937342 1858087 1775559 1691532 1607388
62668 1607388 1524614 1444632 1368356 1296234 1228677 1166155 1108874 1056660 1009194 966160 927061
62657 927061 891209 858105 827753 800399 776046 754408 735217 718276 703145 689077 675529
62646 675529 662605 650755 640051 630029 620270 610934 602573 595577 589968 585638 582594 580923 580585
62633 580585 581196 581974 582030 580865 578640 575916 573231 570979 569501 568927 568884 568641 567741 566466 565641 566031 567930
62616 567930 571086 574988 579350 584411 590557 597511 604202 609771 614644 620225 627511 636270 645735 655755
62602 655755 666966 680021 695054 711991 731104 752955 777823 805436 835436 868037 904023
62591 904023 944028 987910 1034918 1084316 1135670 1188544 1242137 1295165 1345911 1392402 1432865
62580 1432865 1466239 1492075 1509845 1518619 1517702 1507376 1488621 1462249 1428727 1388857 1344147 1296312
62568 1296312 1246671 1196193 1145860 1096714 1049636 1005232 963721 924852 888251 854121 823348
62557 823348 796546 773178 752011 732341 714396 698618 685116 673906 665137 658665 653673 649128
62545 649128 644597 640451 637308 635408 634368 633462 632266 631151 630917 631697 632508 632264 631129 630447 631305 633556
62529 633556 636355 639170 641991 644956 648420 653341 660967 671754 684876 699181 714545 731973 752342
62516 752342 775446 800478 827220 856432 889137 925849 966508 1010756 1058016 1107465 1158304
62505 1158304 1210101 1262612 1315172 1366451 1414917 1459430 1499256 1533723 1562194 1584425 1600744
62494 1600744 1611820 1618531 1622227 1624791 1628079 1633323 1641400 1653566 1671343 1695436 1725192 1759507
62482 1759507 1798026 1840967 1887875 1937046 1986163 2032944 2074967 2109329 2133125 2144448 2142938
62471 2142938 2129458 2105151 2070409 2024419 1965926 1894880 1813490 1725659 1635375 1545540 1457851
62460 1457851 1373304 1292736 1217133 1147554 1084742 1028933 980127 938382 903601 875141 851917
62449 851917 832926 817539 805416 796407 790482 787460 786817 787975 790776 795370 801687 809348 818107 827941
62435 827941 838523 848981 858419 866432 872915 877709 880650 881635 880314 875983 868242 857661 845489
62422 845489 832741 819749 806361 792289 777414 762131 747289 733495 720687 708653 697620
62411 697620 687784 678575 669157 659700 651341 644740 639371 634529 630309 627125 624882 623244 622319 622391 623222
62396 623222 624247 625386 627145 629954 633824 638592 644022 649640 654933 659852 664828 670233 676054 682114
62382 682114 688353 694852 701798 709418 717728 726349 734810 742973 750994 758987 766991 775139 783493 791848
62368 791848 800134 808988 819509 832327 847268 863912 882156 902261 924861 951066 982045 1018241
62356 1018241 1059253 1104578 1154062 1207493 1264162 1323047 1383010 1442602 1500077 1553875 1602752
62345 1602752 1645250 1679634 1704822 1721105 1729546 1731002 1726099 1715680 1700542 1680862 1656511 1627956
62333 1627956 1596417 1563166 1529124 1495084 1461833 1429867 1399298 1370094 1342168 1315215 1288800
62322 1288800 1262687 1236900 1211397 1185820 1159535 1131807 1102176 1071018 1039605 1009298 980640
62311 980640 953395 927268 902255 878483 856192 835864 817969 802552 789320 778007 768300 759662
62299 759662 751765 745042 740227 737391 735951 735610 736509 738362 740246 741670 743171 745355 747889 750097 752118
62284 752118 754832 758755 763500 768306 772682 776676 780837 785772 791459 797197 802558 808119 814793 822674
62270 822674 831093 839744 849035 859300 870340 882088 895169 910363 927823 947370 969383 994891
62258 994891 1024748 1059095 1097765 1140819 1188418 1240420 1296448 1356199 1419215 1484237 1549101
62247 1549101 1611504 1669637 1721945 1766738 1802557 1828766 1845307 1851920 1848141 1834163 1811087 1780049
62235 1780049 1741518 1695843 1644140 1588172 1529495 1469158 1408227 1348261 1291090 1238183 1190149
62224 1190149 1146762 1107541 1072436 1041810 1015681 993208 973190 954943 938495 924088 911765
62213 911765 901334 892445 884730 878131 873071 870060 869122 869750 871377 873727 876827 880939 886337 892801
62199 892801 899390 905110 909949 914931 920972 927878 934618 940302 944723 948202 951278 954544 958394 962708
62185 962708 966935 970710 974411 978964 985014 992403 1000508 1008893 1017385 1025640 1033090 1039436 1044978 1050299
62171 1050299 1055966 1062685 1071442 1083027 1097586 1115021 1135723 1160460 1189497 1222238 1257868 1295983
62159 1295983 1336323 1378139 1420050 1460323 1497033 1528199 1552305 1568876 1578371 1581358 1578030 1568594
62147 1568594 1553805 1534646 1511517 1484216 1452884 1418569 1382530 1345385 1307489 1269964 1234594
62136 1234594 1202521 1173598 1147274 1123569 1102821 1084934 1069400 1055800 1043735 1032530 1021555
62125 1021555 1010807 1000673 991124 981595 971653 961418 951291 941789 933724 928036 925095 924322 924680
62112 924680 925380 926143 927089 928501 930456 932546 934121 934807 934522 933061 930124 925937 921380 917186 913316
62097 913316 909459 905860 903164 901451 899777 896792 891708 884766 877016 869701 863654 859027 855507 852737
62083 852737 850669 849641 850129 852299 855828 860270 865562 872087 880316 890623 903269 918169 934723
62070 934723 952312 971063 991631 1014069 1037486 1061227 1085932 1112872 1142464 1173999 1206646
62059 1206646 1240081 1273983 1307418 1338943 1367107 1390830 1409645 1423687 1433154 1437683 1436455 1428975
62047 1428975 1415411 1396129 1371368 1341624 1307936 1271294 1231993 1190075 1146316 1102228 1058925
62036 1058925 1016518 974914 934791 897308 863014 831598 802762 776781 753944 733758 715220
62025 715220 697807 681886 668024 656186 645688 635718 625711 615399 604849 594523 585124 577169
62013 577169 570661 565200 560347 555812 551380 546868 542370 538397 535509 533749 532623 531747 531277 531561 532578
61998 532578 534025 535875 538449 541845 545517 548579 550530 551640 552689 554297 556337 557971 558252 556723
61984 556723 553487 548994 543911 538967 534530 530336 525907 521188 516558 512302 508476 505282 503123 502047
61970 502047 501424 500410 498625 496346 494271 493104 493026 493431 493472 492932 492243 491584 490486 488573 486216 484027
61954 484027 482060 479987 477812 475958 474801 474572 475487 477514 480113 482665 485153 488020 491511 495607 500473
61939 500473 506368 513135 520385 528184 536876 546070 554558 561703 568292 575447 583132 590392 596744 602588
61925 602588 608240 613260 617014 619435 620912 621640 621403 619980 617595 614878 612458 610630 609482 609201 610013
61910 610013 611832 614265 617179 621035 626378 633166 640864 649104 657838 666886 675691 683640 690410 695940
61896 695940 700321 703809 706654 708792 709995 710450 710898 711910 713269 714341 714859 715055 715193 715378 715676 715915
61880 715915 715257 712460 706857 698898 689610 679777 669752 659746 649960 640576 631858 624156 617618 612061
61866 612061 607399 604028 602426 602426 603232 604274 605736 608102 611428 615332 619577 624429 630385 637700 646300
61851 646300 656098 667209 679652 692945 706278 719239 732175 745681 759880 774302 788207 800760
61839 800760 811137 818921 824387 828035 829914 829756 827769 824825 821708 818558 815272 812156 809939 809291
61825 809291 810444 813147 816914 821493 827075 833751 840816 847070 851932 855770 858929 860996 861340 859861
61811 859861 856756 852014 845777 838879 832311 826265 820377 814796 810204 806601 802818 797664 791153 784185
61797 784185 777302 770126 761871 752151 741361 730508 720585 711922 704151 696839 690087 684438 680316 677613
61783 677613 675738 673980 671867 669297 666412 663486 660958 659334 658816 659029 659312 659267 658971 658745 658931 659801
61767 659801 661491 664068 667744 672873 679498 687108 695184 703829 713453 723958 734724 745411 756259
61754 756259 767375 778110 787355 794194 798140 799049 797030 792272 784852 774935 763188 750606 737828
61741 737828 724947 712084 699716 688228 677597 667826 659271 652131 645964 640189 634910 630724 627844
61728 627844 625810 624068 622421 620902 619554 618420 617545 616864 616208 615431 614535 613708 613254 613289 613450 613143 612152
61711 612152 610744 609044 606718 603567 600110 597127 594817 592739 590358 587295 583351 578801 574517 571211
61697 571211 568574 565610 561816 557622 553740 550492 547731 544930 541423 537062 532632 529046 526193 523220
61683 523220 519913 516961 514664 512294 509299 506398 504754 504500 504751 504726 504187 503021 501098 498649 496245
61668 496245 494321 492975 492110 491520 491007 490740 491299 492971 495214 497267 499017 500802 502657 504467 506683
61653 506683 510048 514477 519026 523142 527213 531531 535469 538247 539942 541086 541703 541445 540459 539382 538544
61638 538544 537754 536907 536221 535784 535437 535316 536047 538043 540873 543679 546068 548306 550697 552996 554438 554207
61622 554207 551914 547800 542544 536814 531003 525372 520248 515885 512161 508636 505012 501409 498076 494944
61608 494944 491619 487743 483200 478007 472295 466481 461202 456794 452939 449037 444912 440984 437794 435526
61594 435526 433938 432486 430569 427958 425079 422642 420910 419601 418528 417960 418084 418476 418454 417820 416905 416024
61578 416024 415229 414524 413950 413422 412789 412088 411511 411102 410768 410628 411014 412020 413313 414561 415840 417424 419321
61561 419321 421250 423036 424857 427040 429650 432357 434788 436965 439246 441695 443714 444597 444409 444007 444183
61546 444183 445075 446416 447996 449670 451228 452501 453476 454098 454129 453442 452343 451403 450995 451123 451687 452730 454383
61529 454383 456558 458752 460327 461100 461548 462143 462603 462221 460919 459460 458395 457306 455487 452933 450211
61514 450211 447659 445364 443782 443643 445070 447268 449340 451120 453048 455538 458684 462316 466081 469553
61500 469553 472539 475308 478446 482489 487636 493612 499755 505407 510324 514745 519009 523208 527140 530436
61486 530436 532673 533562 533195 532131 531132 530704 530835 531172 531556 532391 534355 537682 541885 546262 550512 554695
61470 554695 558784 562480 565317 566707 566024 563035 558278 552784 547409 542549 538273 534332 530126 525161
61456 525161 519728 514801 511170 508867 507464 506577 505989 505663 505802 506605 507856 509118 510510 512831 516511
61441 516511 520756 524181 526152 527165 528028 529109 530337 531512 532455 533078 533460 533813 534413 535550 537366 539531
61425 539531 541328 542319 542842 543545 544622 545940 547804 550930 555387 560059 563613 565706 566830 567254 566790
61410 566790 565560 564329 563685 563366 562836 562254 562303 563166 564234 564923 565279 565595 566057 567059 569304 572927 576846
61393 576846 579701 581333 582618 583923 584555 583978 582754 581762 581128 580553 580277 580898 582402 584071 585406 586592
61377 586592 587923 589284 590413 591304 592112 592974 594091 595675 597545 598997 599404 598836 597784 596402 594342
61362 594342 591383 587805 584005 580033 575836 571752 568357 565861 564036 562793 562478 563397 565461 568516 572653
61347 572653 577790 583282 588457 593296 598050 602438 605945 608822 611946 615586 619168 622504 626275 630751
61333 630751 634882 637533 639020 640503 642296 643794 644877 646270 648460 651176 654166 657638 661611 665556
61319 665556 669162 672903 677395 682621 688210 694087 700414 707257 714801 723646 734360 746763 759991
61306 759991 773267 786403 799713 813704 828739 844633 860470 874997 887216 896568 902747 905536
61294 905536 904860 900938 894387 886174 877207 867813 857683 846395 833865 820388 806566 793286 781347
61281 781347 770813 761068 751803 743567 736924 731404 726007 720660 716407 713940 712589 711210 709690 708918
61267 708918 709431 710605 711292 710880 709549 707837 706315 705655 706594 709514 714046 719213 724102 728440 732559
61252 732559 736875 741369 745527 748719 750682 751687 752294 752944 753825 755030 756700 758904 761412 763696 765278
61237 765278 766093 766492 766844 767215 767570 768251 770054 773691 779256 786329 794437 803322 812936 823492 835384
61222 835384 848698 862813 876753 889984 902529 914339 925058 934593 943510 952450 961432 970062
61210 970062 978167 985788 992741 998670 1003503 1007465 1010647 1013014 1014885 1016974 1019754 1023145 1027021 1031718
61196 1031718 1037786 1045514 1054931 1065998 1078416 1091367 1103877 1115425 1125965 1135364 1143156 1148858
61184 1148858 1152227 1153126 1151479 1147561 1142035 1135425 1127651 1118381 1107731 1096288 1084401 1071789 1058046
61171 1058046 1043326 1028274 1013316 998276 982774 966863 951104 936059 921882 908395 895354
61160 895354 882484 869489 856434 844114 833628 825303 818325 811765 805764 801309 798982 798455 799215
61147 799215 801213 804547 808944 813860 818782 823119 826171 827667 828203 828771 829986 832077 835309 839916 845719
61132 845719 852423 860306 870099 882098 895899 911180 928229 947411 968569 991327 1015720 1042073
61120 1042073 1070461 1100636 1132407 1165798 1200874 1237662 1276222 1316565 1358463 1401392 1444631
61109 1444631 1487400 1529143 1569797 1609677 1648928 1687296 1724534 1760701 1795729 1828862 1858883
61098 1858883 1884937 1906939 1925197 1939893 1950868 1957704 1959959 1957466 1950439 1939308 1924600 1907038
61086 1907038 1887474 1866360 1843425 1818195 1790850 1762249 1733087 1703280 1672310 1640013 1606947
61075 1606947 1574107 1542341 1511968 1482878 1454919 1428022 1401973 1376389 1351187 1326849 1303899
61064 1303899 1282246 1261384 1241126 1221768 1203600 1186710 1171328 1157940 1146813 1137739 1130386 1124683
61052 1124683 1120692 1118405 1117820 1118988 1121769 1125741 1130608 1136585 1144196 1153782 1165306 1178511 1193094
61039 1193094 1208858 1225802 1243922 1262885 1282101 1301251 1320527 1340122 1359771 1379147 1398592
61028 1398592 1419022 1440978 1464054 1487500 1511307 1536507 1564400 1595614 1630065 1667742 1709181
61017 1709181 1754974 1805095 1859156 1917303 1980444 2049642 2125905 2210760 2306494 2415311 2538589
61006 2538589 2677387 2833409 3008978 3206498 3428886 3681043 3970703 4307943 4704329
60997 4704329 5172622 5726794 6381853 7153737 8059894 9120139 10355717 11783833 13407685
60988 13407685 15207162 17135898 19122752 21069633 22846869 24305003 25319751 25853558
60980 25853558 25986226 25881694 25711211 25587483 25542448 25535041 25462187 25173915 24513557 23382588
60970 23382588 21792828 19866345 17782458 15710473 13768303 12017519 10478915 9149578
60962 9149578 8014128 7051659 6240305 5559403 4989709 4513239 4113658 3776790 3490756
60953 3490756 3245837 3034222 2849521 2686339 2540447 2409163 2291024 2184759 2088719 2001268
60943 2001268 1921238 1847727 1779763 1716428 1656932 1600272 1545213 1491110 1438396 1387775 1339231
60932 1339231 1292461 1247984 1206934 1169760 1135917 1105001 1077323 1053010 1031267 1011077 992085
60921 992085 974316 957630 942073 928239 916458 905908 895355 884640 874640 865802 857568 849458
60909 849458 841896 835524 830164 824880 818740 811300 802765 793926 785533 777435 768774 759351 750261 742620
60895 742620 736097 729373 721801 713819 705840 697621 689000 680564 673128 666883 661432 656422 651840 647885
60881 647885 644747 642343 640125 637468 634437 631849 630274 629333 628355 627387 626980 627175 627369 627234 627176 627720 628923
60864 628923 630619 632776 635346 638123 641060 644359 647930 651185 653780 656223 659158 662312 664835 666575
60850 666575 668259 670237 671729 671736 670213 667933 665575 663379 661410 659550 657294 654033 649656 644490 638568
60835 638568 631364 622490 612347 601817 591483 581475 571974 563436 556131 549731 543671 537851 532724
60822 532724 528629 525281 522063 518695 515429 512649 510482 508778 507309 505930 504610 503341 501972 500217
60808 500217 497960 495490 493288 491622 490513 490011 490196 490954 492020 493320 494942 496737 498327 499685 501335
60793 501335 503621 506065 507782 508397 508279 508038 508184 509034 510424 511445 510963 508643 505246 501826 498832 496050
60777 496050 493080 489719 486074 482519 479381 476556 473615 470432 467464 465224 463677 462422 461360 460808
60763 460808 460959 461524 462026 462282 462445 462729 463235 463968 464877 465902 467027 468239 469320 469837 469619 469239 469667
60746 469667 471248 473252 474763 475819 477256 479461 481706 482919 482763 481737 480494 479335 478184 476802
60732 476802 475079 473281 471885 471054 470526 470185 470413 471533 473197 474802 476311 478147 480360 482553 484691
60717 484691 487288 490443 493221 494467 494021 492755 491608 490974 490904 491367 492102 492449 491668 489521 486491 483298
60701 483298 480223 477036 473601 470191 466986 463670 459970 456374 453652 451739 449821 447645 445971 445337
60687 445337 445123 444482 443698 443830 445263 447313 449200 450805 452500 454779 458053 462246 466491 469778 472033
60672 472033 474149 476815 479765 482382 484573 486689 488889 490901 492199 492192 490475 487279 483540 480231 477600
60657 477600 475248 472898 470828 469510 469022 468998 469157 469745 471232 473593 476090 478029 479499 481050 482724
60642 482724 483855 483930 483221 482341 481460 480244 478381 475916 473188 470639 468583 466990 465605 464382 463630 463579
60626 463579 464011 464480 464756 464839 464805 464900 465587 467051 468729 469710 469657 469030 468424 468067 468052 468672 470170 472328 474497
60607 474497 476059 476781 476831 476560 476248 475997 475824 475802 475947 476069 475901 475470 475173 475339 475799 475991 475584 474979 475141
60588 475141 476824 479938 483780 487803 491920 496000 499601 502513 505214 508244 511358 513840 515528 516902
60574 516902 518200 519252 520364 522575 526560 531887 537838 544370 551705 559488 567208 575175 584221 594513
60560 594513 605430 616602 628234 640178 651394 660772 667969 673121 676161 676867 675325 672039 667785
60547 667785 663576 660477 659063 659150 660207 661873 663960 666410 669585 674366 681520 691046 702441 715530
60533 715530 730730 748549 769048 791799 816182 841725 868207 895285 921977 946777 968306
60522 968306 985522 997225 1002065 999705 991602 979963 966092 950320 933224 915859 898683 881342
60510 881342 864101 848734 837214 829884 825561 823166 822571 824015 827533 833199 841396 852514 866673
60497 866673 884003 904979 930243 960213 994948 1034209 1077404 1123547 1171411 1219772 1267501
60486 1267501 1313530 1356852 1396552 1431861 1462298 1487840 1508893 1526053 1539854 1550526 1557575
60475 1557575 1559461 1554050 1539755 1516167 1483457 1441577 1390710 1332508 1270199 1207041 1144944 1084796
60463 1084796 1027633 974792 927003 884011 845284 810706 780318 753743 730254 709297 690683
60452 690683 674249 659577 646149 633735 622556 613003 605151 598631 593003 588110 583906 580066 576106
60439 576106 571945 568095 565209 563550 562867 562507 561654 559842 557373 554967 552915 550910 548730 546605 544683
60424 544683 542712 540689 539348 539418 540609 541879 542479 542285 541458 540504 540564 542684 546609 550854 554210 556662
60408 556662 558709 560502 562035 563568 565342 567212 569045 571176 574003 577327 580532 583337 586018 588997
60394 588997 592437 596117 599497 602121 604262 606863 610485 614580 618299 621770 625907 631003 636257 640874
60380 640874 645001 649138 653172 656571 659308 662012 665148 668484 671483 673957 676158 678426 680891 683453
60366 683453 685928 688229 690454 692757 695129 697408 699543 701775 704470 707842 711860 716299 720771 724848
60352 724848 728383 731726 735452 739933 745284 751607 758900 766717 774347 781445 788149 794297 798941 801042
60338 801042 800431 797678 793302 787673 781523 775794 770800 766059 761191 756482 752234 748060 743296 737870
60324 737870 732284 726874 721594 716498 711975 708302 705204 702102 698748 695537 693231 692423 693252 695560 699277
60309 699277 704606 711828 720931 731420 742559 753922 765742 778523 792165 805724 818222 829491
60297 829491 839884 849411 857592 864037 868490 870218 868069 861564 851507 839097 824806 808666 791420
60284 791420 774753 760197 748068 737563 727679 717977 708644 699987 692020 684637 677944 672052 666594
60271 666594 660914 654915 649220 644254 639663 635062 630877 627780 625550 623276 620728 618820 618410 619141 619816
60256 619816 619703 619149 619011 619701 620863 621954 623029 624746 627408 630233 631941 632089 631511 631353 631919 632614
60240 632614 632801 632453 632000 631713 631487 631177 630944 631039 631423 631993 633141 635627 639640 644466 649393 654590 660685
60223 660685 667806 675539 683593 691919 700283 708404 716614 725828 736532 748170 759710 770550 780720
60210 780720 790547 800387 810533 821091 831991 843117 854364 865492 876138 886066 895319 904041
60198 904041 912176 919305 924743 927961 929117 929100 928857 928604 927770 925554 921431 915399 908092 900517 893341
60183 893341 886443 879385 872211 865414 859248 853501 847951 842604 837488 832599 828112 824311 821247 818817
60169 818817 817124 816335 816086 815513 814003 811553 808332 804388 799926 795360 790827 786166 781651 778223 776482
60154 776482 775910 775643 775664 776632 778698 781176 783461 785701 788351 791398 794287 796471 797934 799270 801260
60139 801260 804251 807891 811542 814942 818372 822263 826822 832025 837787 844009 850500 856893 862764 867957
60125 867957 872786 877758 883002 888121 892697 896814 900991 905703 911086 916935 922802 928195 932934 937319
60111 937319 941796 946446 950962 955108 958994 962733 965960 967934 968158 966812 964454 961523 958328 955400
60097 955400 953395 952442 951857 950791 949091 947265 945757 944469 942887 940378 936414 930875 924210 917094 909893
60082 909893 902579 895100 887564 880105 872840 865931 859445 853178 846842 840362 833651 826189 817264 806795
60068 806795 795616 784880 775369 767229 759975 752779 745198 737717 731244 726036 721572 717400 713564 710172
60054 710172 707213 705037 704299 705025 706298 707322 708354 710085 712612 715594 719030 723225 728160 733514 739219
60039 739219 745443 752101 758857 765524 771926 777414 781140 782993 783853 784647 785384 785250 783459 779914 775191
60024 775191 769963 764369 757906 750003 740599 730125 719070 707788 696622 685896 675780 666315 657605
60011 657605 649921 643672 639256 636760 635717 635385 635452 636306 638413 641610 645172 648360 650706 651967 652165
59996 652165 651660 650949 650434 650430 651280 653184 656020 659423 663028 666570 669999 673572 677617 682069 686425 690171
59980 690171 692960 694342 693919 692019 689663 687457 684957 681593 677693 673964 670349 666262 661847 658166
59966 658166 655959 654840 654003 653278 653216 654445 657117 660849 665050 669366 673806 678391 682879 686977 690574
59951 690574 693557 695730 697288 699082 701915 705683 709551 712769 714911 715627 714812 712979 710876 708753 706496
59936 706496 704319 702722 701728 700870 700093 700137 701755 705030 709631 715273 721657 728307 734724 740496 745185
59921 745185 748391 750023 750288 749481 748118 747208 747777 749968 752976 756022 759025 762253 765736 769186 772162
59906 772162 774194 775052 774983 774421 773522 772311 771075 770036 768732 766472 763524 761151 760279 760809 762428 765273
59890 765273 769334 773971 778654 783760 790071 797806 806549 815680 824459 832244 839183 846294 854241 862376
59876 862376 869589 875760 881649 887587 893063 897535 900928 903195 904020 903185 900849 897334 893030 888554 884671
59861 884671 881797 879778 878151 876495 874595 872562 870820 869739 869221 868860 868465 868199 868253 868614 869163 869775
59845 869775 870360 871053 872355 874845 878744 883863 889921 896656 903704 910658 917323 923731 929851 935449 940310
59830 940310 944495 948434 952814 958250 964787 971697 977838 982253 984429 984266 982136 978879 975360 971903
59816 971903 968362 964746 961560 959340 958048 957119 956023 954602 952794 950270 946655 942078 937215 932565
59802 932565 927927 922915 917802 913334 909626 905782 900839 894738 888059 881146 873849 865975 857654 849364
59788 849364 841793 835409 829925 824384 818118 811497 805429 800361 796099 792390 789185 786447 784216 782935
59774 782935 783236 785293 788732 793266 798989 805881 813459 821207 829122 837528 846523 855860 865304 874868
59760 874868 884765 895225 906274 917518 928261 938089 947319 956710 966688 976978 986945 996116 1004310
59747 1004310 1011508 1017816 1023489 1028783 1033709 1037980 1041130 1042594 1041860 1038961 1034844 1030830 1027429 1023951
59733 1023951 1019578 1014552 1009955 1006525 1004152 1002367 1000803 999157 997279 995480 994312 993936 994025 994361 994992
59718 994992 995732 996051 995818 995641 996165 997467 999551 1002875 1007807 1013901 1020325 1026853 1033928 1042020 1051427
59703 1051427 1062505 1075346 1089271 1103237 1116803 1130189 1143416 1156025 1167723 1178678 1188887
59692 1188887 1197868 1205384 1212019 1218480 1224452 1228568 1229539 1227134 1222128 1215539 1207974 1199570 1190404 1180744
59678 1180744 1170792 1160317 1148872 1136427 1123539 1110810 1098394 1086249 1074701 1064511 1056300 1050021
59666 1050021 1045023 1040710 1037089 1034682 1033967 1035031 1037707 1041812 1047211 1053955 1062478 1073288 1086125 1099653
59652 1099653 1112382 1123790 1134255 1144051 1152794 1159655 1163615 1163550 1158665 1149042 1135448 1118571 1098812
59639 1098812 1076875 1053998 1031325 1009392 988485 969113 951799 936629 923352 911693 901287
59628 901287 891524 881889 872427 863540 855254 846896 837597 827039 815692 804413 793859 784278 775775
59615 775775 768539 762566 757320 752143 747122 743167 740989 740350 740614 741644 743575 745914 747604 748228 748607
59600 748607 749789 751717 753325 753833 753549 753360 753806 754879 756462 758567 761047 763268 764370 763954 762491
59585 762491 760964 760044 759640 759236 758472 757233 755334 752478 748646 744254 739714 735009 729930 724642 719734
59570 719734 715764 712870 710717 708639 706046 703019 700400 698894 698159 697239 695850 694722 694498 694868 695057
59555 695057 694732 694036 693115 692126 691487 691691 692914 695073 698115 701913 706025 709980 713857 718399 724518 732759
59539 732759 743049 754764 767227 780317 794516 810244 827374 845436 863772 881087 895239
59528 895239 904153 907115 905090 900063 894196 889082 885112 881630 878030 874495 871362 868244 864378 859535
59514 859535 853902 847350 839578 830845 821717 812146 801703 790809 780867 772834 766377 760705 755555 751019
59500 751019 747064 743707 741161 739532 738808 739390 741924 746167 750677 754237 757079 760189 763902 767890 772102
59485 772102 776874 782226 787756 793183 798404 803106 806967 810343 814135 818708 823365 827176 830089 832914
59471 832914 836356 840304 844081 847197 849680 851686 853052 853519 853228 852634 851933 851046 850265 850379 851860 854339
59455 854339 857330 861135 866601 874119 883245 893134 902960 912073 920165 927259 933304 937921 940868 942482
59441 942482 943193 942703 940152 935190 928531 921429 914928 909614 905657 902948 901435 901370 903006 906127 910246
59426 910246 915261 921502 929027 937380 946382 956832 969976 986264 1004828 1024239 1043663 1063313
59414 1063313 1083903 1105735 1128393 1151278 1174166 1197043 1219557 1240916 1260144 1275923 1286187
59403 1286187 1288692 1282688 1270090 1254745 1240484 1229800 1223702 1221968 1223335 1225905 1227765 1227163 1222129
59390 1222129 1210509 1191125 1165093 1135696 1106600 1080030 1056448 1035578 1017446 1002467 990886
59379 990886 982338 976057 971497 968724 968086 969431 971828 974233 976365 978739 981803 985323 988732 991911
59365 991911 995376 999741 1005232 1011729 1019048 1027042 1035662 1045161 1056147 1069002 1083195 1097554 1111534
59352 1111534 1125907 1141718 1158794 1175963 1192710 1209890 1228419 1247843 1266759 1284241 1300277
59341 1300277 1314945 1327811 1338196 1345638 1350006 1351420 1350038 1345744 1338192 1327381 1313936 1298481
59329 1298481 1281032 1261478 1240340 1218403 1195777 1172068 1147471 1122917 1099072 1075972 1053854
59318 1053854 1033558 1015618 999486 984138 969061 954339 940220 926979 914827 903543 892513
59307 892513 881452 870824 861308 853244 846757 841915 838389 835535 833226 832135 832770 834737 837540 841651
59293 841651 848114 857416 869361 883645 899816 916940 934072 950852 966823 980326 989100 992232
59281 992232 990887 987042 982279 977939 975446 975731 978706 983876 991286 1001500 1014854 1031010 1049099
59268 1049099 1068060 1086962 1105175 1122224 1137552 1150699 1161728 1171015 1178399 1182947 1183948 1181948
59256 1181948 1178344 1173987 1168607 1161721 1153731 1145720 1138259 1130860 1122812 1114249 1106055 1098813 1092301 1086026
59242 1086026 1079798 1073627 1067488 1061517 1056101 1051382 1046921 1042195 1037193 1032125 1026831 1020940 1014453 1007618
59228 1007618 1000320 992147 983043 973396 963501 953527 944041 935818 928800 921813 913878 905496 898166 892843
59214 892843 889308 886937 885524 885223 886000 887475 889217 891042 892953 894908 896802 898693 900896 903739 907268
59199 907268 911250 915355 919173 922191 924106 925245 926433 928215 930209 931411 931250 930296 929721 929928 929968 928586
59183 928586 925751 922667 920195 917775 914274 909434 904010 898726 893680 888732 883926 879432 875454 872325
59169 872325 870396 869660 869677 869958 870324 870866 871782 873237 875195 877317 879162 880507 881275 881259 880177 878124 875721
59152 875721 873619 871852 869837 867029 863503 859728 855819 851310 845872 839905 833947 827683 820261 811590
59138 811590 802622 794120 785921 777774 770089 763207 756680 750159 744517 741094 740083 740640 742436 746065
59124 746065 751844 759170 767336 776180 785672 795603 806032 817409 829842 842748 855573 868384 881399
59111 881399 894348 906632 917767 927388 935169 941103 945550 948710 950241 949655 946926 942572 937387 932164
59097 932164 927340 922734 917900 912829 908002 903679 899533 895129 890344 885226 879927 875016 871281 868777
59083 868777 866438 863087 858573 853583 848628 843675 838644 833779 829466 825925 823123 820815 818716 816709
59069 816709 814900 813428 812324 811523 810825 809799 807931 804977 801096 796707 792308 788276 784544 780560 775908
59054 775908 770947 766572 763372 761330 760127 759273 758107 756304 754425 753370 753218 753182 752746 752193 751843 751507
59038 751507 751040 750816 751240 752243 753564 755102 756742 758342 760223 763096 767186 771967 777127 783196 790777
59023 790777 799779 810002 821838 835588 850389 864545 876756 886521 893733 898562 901465 902617 901422
59010 901422 897235 890492 882575 874681 867393 861208 856756 854377 853955 855273 858124 862115 866774 871910
58996 871910 877438 882935 887832 892062 896101 900377 905055 910334 916333 922504 927720 931357 933978 936730
58982 936730 940352 945030 950918 958296 967202 977289 988298 1000555 1014736 1031065 1048908 1067288
58970 1067288 1085676 1104065 1122456 1140682 1158695 1176542 1193905 1210065 1224551 1237454 1248852
58959 1248852 1258222 1264704 1267651 1266724 1261863 1253540 1242704 1230039 1215400 1198267 1178503 1156453 1132697
58946 1132697 1108125 1083933 1061051 1039781 1020340 1003378 989477 978441 969716 963251 959287 957465
58934 957465 956906 957197 958578 961060 963965 966562 968566 969799 969868 968623 966570 964371 962092 959252 955584
58919 955584 951451 947490 944027 941029 938580 937159 937225 938619 940683 943009 945765 949264 953640 959171 966449
58904 966449 975834 986946 999074 1011938 1025850 1041348 1058891 1078570 1099799 1121613 1143571 1166059
58892 1166059 1189392 1213103 1236552 1259849 1283577 1307913 1332577 1357360 1382001 1405724 1427567
58881 1427567 1447101 1464283 1478714 1489673 1496828 1500362 1500472 1497335 1491445 1483354 1473028 1460080 1444671
58868 1444671 1427681 1410036 1392437 1375643 1360232 1345949 1331888 1317504 1302924 1288250 1273211
58857 1273211 1257656 1241827 1225940 1210078 1194595 1179975 1166081 1152143 1137743 1123230 1108908
58846 1108908 1094438 1079437 1064131 1048896 1033591 1017809 1001552 985296 969592 954901 941597
58835 941597 929792 919278 909795 901280 893805 887512 882599 879075 876520 874467 873083 872994 874392 876762
58821 876762 879676 883318 888015 893688 900039 906870 913857 920352 925786 930104 933638 936701 939382 941464
58807 941464 942463 942034 940346 937759 934211 929446 923749 917768 911506 904304 896137 888114 881192 875069 868989
58792 868989 863072 858102 854385 851582 849500 848403 848631 850438 854104 859682 866700 874573 883306 893347
58778 893347 904765 917022 929484 941715 953201 963152 970740 975309 976361 973638 967280 957624 944857
58765 944857 929174 911417 893261 876379 861439 848054 835699 824488 814981 807457 801651 797177
58753 797177 793835 791392 789437 787839 787135 787978 790219 792952 795518 798155 801623 806579 813430 822420 833547
58738 833547 846368 859986 873305 885590 897025 908461 920358 932256 943635 954769 965982
58727 965982 976395 984407 989445 992329 993834 993899 992605 990960 990052 990095 990841 992367 994891 998349 1002651
58712 1002651 1007814 1013297 1017722 1019861 1019542 1017110 1012531 1005598 996436 985065 970918 953608 933873
58699 933873 912965 891385 869015 846297 824390 804108 785431 768096 752037 737223 723715
58688 723715 711962 702462 695053 689021 683895 679554 675607 671391 666816 662630 659545 657502 655991 654649
58674 654649 653361 652182 651430 651553 652750 654993 658556 664073 671850 681478 692415 704653 718396 733199
58660 733199 747818 760867 771399 778776 782324 781462 776309 767929 757722 746539 734564 721960 709260
58647 709260 697042 685662 675574 667458 661522 656919 652388 647482 642801 639133 636768 635575 635249 635428
58633 635428 635915 636812 638150 639417 639850 639228 637962 636384 634373 631864 629283 627245 626050 625646 625822 626337
58617 626337 627151 628740 631882 636843 642986 649396 655733 662196 668792 675043 680441 684934 688876 692637
58603 692637 696336 699844 702917 705404 707402 709227 711116 712956 714385 715273 716051 717447 719886 723292 727517
58588 727517 732771 739488 747894 757885 769331 782216 796377 811231 826008 840255 853943 867004
58576 867004 879026 889649 899134 908178 917200 926226 935626 946428 959572 975292 993670 1015402
58564 1015402 1041230 1070785 1102753 1136217 1171136 1207308 1243601 1278502 1310830 1339483 1363066
58553 1363066 1380473 1391686 1397589 1399086 1396636 1390444 1380785 1368251 1353828 1338500 1322575 1305535
58541 1305535 1286657 1265522 1241877 1215435 1186155 1154508 1121302 1087506 1054314 1022863 993609
58530 993609 966358 941192 918867 899924 883833 869547 856610 845164 835154 826181 818127 811399
58518 811399 806353 802707 799615 796277 792509 788792 785706 783331 781401 779856 778789 777942 776881 775799
58504 775799 775429 775935 776571 776827 777232 778499 780549 782974 785828 789194 792468 795037 797431 800998 806485
58489 806485 813581 821750 830844 840922 852068 864462 878242 893328 909701 927706 947711 969590
58477 969590 992900 1017240 1041997 1065924 1087406 1105003 1117476 1123730 1123306 1116758 1105195 1089763
58465 1089763 1071852 1053282 1035681 1020024 1007152 998140 993448 992283 993583 997205 1003419 1011791 1021561
58452 1021561 1032663 1045214 1058166 1069470 1077471 1081306 1080310 1074307 1064428 1052388 1038751 1022932
58440 1022932 1005109 987024 970552 956337 944214 934151 926363 921101 918562 918441 919568 920772 922237
58427 922237 925224 930319 936789 943812 951387 959674 968209 976153 982585 986326 986339 982811 977208 970812 963749
58412 963749 955686 946755 937401 928005 919065 911138 904168 897408 890442 883776 878072 873298 869063 865316
58398 865316 862323 860343 859644 860464 862662 865677 869005 872437 875869 879341 883179 887469 891424 894079 895738
58383 895738 897931 901675 906522 911537 916435 921389 926572 932338 939142 946750 954112 960552 966589 973221
58369 973221 980938 989751 999601 1010271 1021469 1033394 1046693 1061487 1077028 1092696 1108603 1124718
58357 1124718 1140027 1153266 1164026 1172534 1178798 1182698 1184662 1185597 1186180 1186626 1187010 1187516 1188423 1190050 1192612
58342 1192612 1196071 1200364 1205770 1212734 1221384 1231601 1243474 1257096 1271969 1287298 1302967 1319510
58330 1319510 1336906 1354062 1369800 1383813 1396422 1407901 1418236 1427052 1433697 1437913 1440537 1442962
58318 1442962 1445923 1449348 1453222 1457781 1462928 1468430 1474733 1482656 1492190 1502561 1513552 1525691 1539015
58305 1539015 1552800 1566782 1581508 1597159 1613141 1629175 1645628 1662448 1678975 1695264 1712363
58294 1712363 1730805 1750038 1769775 1790548 1812321 1834090 1855689 1878610 1903983 1930948 1958165
58283 1958165 1985866 2015288 2046962 2080586 2115846 2152365 2189590 2227549 2267040 2308390 2350949
58272 2350949 2394455 2439871 2488136 2539187 2592975 2650354 2712089 2777977 2847635 2920894 2996659
58261 2996659 3072849 3148539 3224780 3302199 3379184 3453713 3525522 3595182 3662559 3727974 3793671
58250 3793671 3862295 3934662 4010547 4090625 4176071 4267167 4363969 4467516 4578860 4697769 4823887
58239 4823887 4958311 5102438 5256199 5419048 5591959 5776824 5974618 6185560 6410329
58230 6410329 6649789 6904476 7175756 7466457 7779091 8114726 8474928 8863243 9283095
58221 9283095 9735963 10223702 10751184 11324575 11948656 12628244 13370815 14185360 15080326
58212 15080326 16065717 17156317 18370502 19727631 21249978 22966300 24910339 27116807
58204 27116807 29622577 32472282 35721441 39437590 43705845 48638148 54378705 61104548
58196 61104548 69027630 78398737 89504088 102651593 118160353 136365300 157611535
58189 157611535 182173888 210068717 240839235 273464278 306421030 337729387 364844117
58182 364844117 384626177 393865833 390450767 374513354 348632944 316847727 283184429
58175 283184429 250647893 221007320 195059354 172953720 154438786 139041677 126170818
58168 126170818 115146166 105251726 95883488 86717542 77753542 69197483 61287312 54177360
58160 54177360 47912594 42457896 37739501 33673182 30174170 27159731 24554697 22296531
58152 22296531 20333152 18618130 17111174 15780896 14602639 13553940 12614310 11767409
58144 11767409 11000074 10300232 9658201 9068357 8526542 8026960 7564090 7136046 6742999
58135 6742999 6383200 6053094 5750332 5473803 5221291 4989536 4776145 4579206 4395418
58126 4395418 4220742 4052793 3891062 3735319 3585442 3442299 3307066 3179884 3060301
58117 3060301 2948365 2843931 2745653 2652075 2563141 2479313 2400055 2324552 2253105 2186258 2123185
58106 2123185 2062487 2004033 1948530 1895801 1844986 1796029 1749511 1705321 1662857 1622273 1584232
58095 1584232 1548654 1514860 1482760 1452815 1425048 1399081 1374904 1352735 1332467 1314063 1298021
58084 1298021 1284519 1272516 1260594 1248118 1234755 1219569 1201758 1181828 1160916 1139375 1116953
58073 1116953 1093896 1070827 1048009 1025671 1004497 984784 965721 946704 928713 913123 899641
58062 899641 886749 873815 861372 849629 838149 826940 816504 806744 796923 786693 776151 765117
58050 765117 753589 742698 733829 726711 719634 711709 703685 696393 689622 682931 676394 670064 663551 656619
58036 656619 649481 642258 634830 627425 620566 614200 607642 600588 593396 586096 577978 568611 558664 549258
58022 549258 540903 533326 525959 518443 511022 504520 499481 495386 491244 486865 482886 479649 476871 474516
58008 474516 473050 472513 472129 471250 470107 469220 468595 468015 467718 468315 470127 472879 475929 478753 481354 484184
57992 484184 487514 491026 494268 497201 499860 501848 502811 503161 503555 503771 502956 500986 498690 496567 494191
57977 494191 491204 488112 485660 484051 483157 482940 483303 484001 485051 486643 488315 488915 487944 486440 485882 486452
57961 486452 486961 486257 484149 481036 477112 472122 465768 458305 450661 443721 437443 430972 423685 415864 408350
57946 408350 401976 397450 395197 394894 395500 396107 396648 397661 399668 403010 407883 414184 421481 429344 437509
57931 437509 445569 452850 458859 463603 467214 469604 470732 470855 470111 468049 463924 457383 448702 438661
57917 438661 428472 419475 412375 406804 401949 397511 393769 390963 389101 388255 388492 389415 390215 390437 390386 390564
57901 390564 390903 390708 389191 385917 380949 374915 368944 364193 361120 359212 357633 356208 355597 356381 358144
57886 358144 359720 360361 360370 360537 361264 362419 363807 365406 367169 368922 370581 372297 374276 376533 378960 381554
57870 381554 384445 387689 391210 395071 399676 405421 412045 418535 423886 427949 431357 434715 438070 441156
57856 441156 443869 446315 448528 450396 451830 452838 453374 453288 452508 451181 449464 447233 444179 440269 435943
57841 435943 431752 427926 424426 421255 418467 415954 413507 411111 409012 407453 406556 406418 407061 408285 409797
57826 409797 411511 413495 415682 417961 420523 423707 427437 431236 434896 438632 442385 445545 447671 449051
57812 449051 450130 450794 450667 449777 448427 446737 444743 442654 440457 437526 433150 427324 420524 412986 404735
57797 404735 396140 387786 379891 372415 365611 359874 355140 351134 348116 346618 346400 346446 346170 345912 346036 346331
57781 346331 346615 347204 348256 349307 349959 350588 351794 353593 355703 358248 361430 364666 366765 367036 365734
57766 365734 363366 360063 355887 351363 347314 344170 341626 339020 335990 332693 329483 326604 324308 323021
57752 323021 323090 324376 326341 328557 331009 334009 337972 343130 349170 355349 361282 367376 374029 380670 386282
57737 386282 390805 395192 399907 404217 407321 409463 411391 413289 414864 416069 417078 417794 417941 417521 416733
57722 416733 415588 414011 412124 410054 407675 404932 402162 399679 397285 394714 392312 390707 389904 389352 388846
57707 388846 388690 388924 389012 388520 387574 386433 385154 383967 383550 384530 386985 390677 395458 401138 407269 413441
57691 413441 419553 425421 430379 433767 435690 436823 437538 437719 437513 437676 438936 441416 445030 450074 457044
57676 457044 466163 477653 492371 511659 536434 566873 603078 645687 695578 753225 818383 889849
57664 889849 964930 1039082 1106195 1159254 1191148 1196169 1172185 1121943 1052134 970998 886375 804752
57652 804752 730500 665308 608789 560114 519064 485597 458966 437725 420479 406360 394861
57641 394861 385482 377619 370760 364685 359351 354525 349760 344856 340093 335714 331395 326704 321947 318037
57627 318037 315440 313693 312019 309951 307292 304031 300553 297487 294960 292312 288887 284886 281135 278171
57613 278171 275831 273613 271264 269028 267381 266423 265620 264416 263017 262180 262132 262207 261720 260721 259621 258480
57597 258480 257095 255529 254136 253158 252548 252124 251741 251448 251586 252529 254228 256178 257903 259246 260184 260692
57581 260692 260835 260592 259561 257321 254204 251140 248503 245701 242202 238413 235047 232116 229066 225600 221919
57566 221919 218462 215775 214210 213325 211984 209555 206671 204358 202837 201784 201302 201772 202944 204002 204567
57551 204567 205032 205876 207145 208637 210152 211567 213001 214764 216804 218480 219360 219912 220809 221837 222243 221992
57535 221992 221853 222293 223040 223723 224134 223788 222102 219350 216712 215025 214020 213088 212176 211493 210837 209761 208217
57518 208217 206681 205787 205981 207284 209209 211137 212881 214683 216662 218572 220192 221590 222950 224396 226001
57503 226001 227650 228960 229751 230520 231924 233791 235243 235904 236326 237018 237654 237609 236823 235725 234649 233634
57487 233634 232544 231145 229330 227416 225879 224683 223251 221217 218789 216261 213754 211598 210321 209867
57473 209867 209387 208292 207024 206293 205969 205279 203784 201582 198812 195647 192725 191014 191042 192452 194341 195923
57457 195923 196993 197919 199098 200365 201156 201245 200965 200571 199925 199104 198806 199607 201127 202455 203250 203991 205251
57440 205251 207060 208893 210036 210119 209543 209205 209635 210626 211902 213704 216365 219686 223125 226245 228561 229419
57424 229419 228665 227172 226042 225444 224840 224116 223697 223587 223135 221998 220665 219725 219114 218419 217578 216896 216607
57407 216607 216772 217491 218969 221212 223695 225481 225942 225419 224892 224824 224707 223982 222968 222380 222319 222407 222689 223633
57389 223633 225246 226997 228696 230746 233262 235681 237627 239601 242298 245606 248785 251339 253289 254811
57375 254811 256064 257287 258661 260080 261239 261918 262060 261740 261229 260909 260836 260568 259719 258591 257938 258110 258762
57358 258762 259495 260449 262042 264294 266710 268780 270376 271650 272852 274403 276865 280456 284629 288476 291574
57343 291574 294153 296493 298610 300661 303104 306057 308938 311206 313196 315672 318794 322082 325280 328652
57329 328652 332380 336277 340160 344052 347916 351686 355689 360536 366388 372727 379010 385125 391079 396760
57315 396760 402259 407961 414036 420262 426593 433415 440862 448431 455710 462981 470513 477759 484007 489584
57301 489584 495629 502758 510718 519302 528761 539085 549639 559960 570433 581715 593823 606179
57289 606179 618354 630411 642705 655687 669813 685307 701998 719470 737297 755030 772178
57278 772178 788475 804099 819400 834460 849043 862841 875546 886779 896313 904454 911949 919408
57266 919408 926938 934470 942247 950816 960617 971753 984124 997628 1012119 1027260 1042548 1057518
57254 1057518 1071883 1085511 1098332 1110396 1122018 1133712 1145854 1158427 1171199 1184179 1197854
57243 1197854 1212967 1230033 1248965 1269085 1289602 1310261 1331451 1353508 1375940 1397677 1418173
57232 1418173 1437965 1457973 1478551 1499493 1520708 1542430 1564778 1587547 1610541 1633796 1657351
57221 1657351 1681127 1705220 1730035 1755860 1782455 1809394 1836721 1864977 1894521 1925103 1956239
57210 1956239 1987821 2020097 2053082 2086269 2119093 2151572 2184279 2217664 2251639 2285941 2320714
57199 2320714 2356596 2394287 2434095 2475676 2517993 2559753 2600264 2639945 2679826 2720607 2762283
57188 2762283 2804404 2846260 2886914 2925580 2962153 2997150 3031136 3064589 3098266 3133162 3169914
57177 3169914 3208658 3249625 3293428 3340520 3390794 3444008 3500175 3559233 3620799 3684795 3751984
57166 3751984 3823279 3898587 3976726 4056380 4136673 4216891 4296182 4373765 4449263 4522764 4594626
57155 4594626 4665082 4733883 4800345 4863847 4924030 4980370 5031928 5078026 5119164 5156948 5193066
57144 5193066 5228380 5262787 5295595 5326056 5353782 5378866 5401762 5423358 5445114 5468708 5495297
57133 5495297 5525484 5560241 5601498 5651396 5711045 5780071 5857009 5939898 6026913 6116898 6209354
57122 6209354 6304206 6402233 6505770 6618152 6742085 6879356 7032353 7204616 7398808 7614926
57112 7614926 7851711 8109549 8391386 8701665 9045686 9429652 9860149 10343804 10888583
57103 10888583 11505593 12209364 13017462 13951267 15036730 16303270 17782566 19509807 21525146
57094 21525146 23871535 26590575 29721074 33299802 37359863 41926596 47014984 52627975
57086 52627975 58750940 65342071 72321566 79555592 86830272 93830700 100157662 105396362
57078 105396362 109207567 111391795 111902206 110818598 108306905 104580185 99869472 94408135
57070 94408135 88424393 82131707 75715470 69325415 63079541 57072862 51381849 46064272
57062 46064272 41159275 36688801 32658653 29059829 25871823 23066625 20611367 18470291
57054 18470291 16607546 14989531 13584929 12363687 11297535 10361805 9536274 8804400
57046 8804400 8152332 7568508 7043460 6569536 6140426 5750447 5394017 5066130 4763400
57037 4763400 4484025 4226407 3988292 3767482 3562805 3373896 3200470 3042136 2898412
57028 2898412 2768471 2651290 2546385 2454049 2374577 2307910 2254360 2214962 2190405 2179957 2181887
57017 2181887 2194217 2214341 2238369 2261655 2279486 2286412 2275546 2240397 2178554 2093524 1992977
57006 1992977 1885424 1777928 1675275 1579936 1492596 1413170 1341594 1277912 1221894 1172819 1129595
56995 1129595 1091199 1057114 1027371 1002132 981351 964870 952608 944480 940334 940137 943972 951575
56983 951575 962034 974165 986936 999175 1009123 1014820 1015063 1009787 999688 985835 969623 952596
56971 952596 935977 920417 906182 893486 882661 874204 868645 866208 866596 869202 873560 879605 887599
56958 887599 897873 910446 924688 939392 953134 964384 971283 971833 964818 950585 930844 907890
56946 907890 884029 861190 840498 822238 806545 793975 785107 779903 777990 779502 785100 795130
56934 795130 809300 827283 849088 874482 902323 930690 957337 979695 994779 999801 993264 975578
56922 975578 948767 915751 879724 843643 809749 779251 752404 728886 708189 689855 673611
56911 673611 659404 647226 636801 627576 619261 612239 607091 603638 600829 597727 594277 590885 587690
56898 587690 584796 582991 583451 586511 591200 596397 602164 609615 619652 632216 646735 662906 680870
56885 680870 700847 722656 745314 766821 784581 796427 801472 800058 793175 782271 769383 756713
56873 756713 745690 736691 729882 725916 725445 728434 734654 744736 760114 781827 809878 843830 883438
56860 883438 928368 977601 1029288 1080725 1128087 1166459 1190792 1197404 1185372 1157250 1118501 1075392
56848 1075392 1032685 993097 958596 931267 912546 902273 899366 903297 914577 934191 963176 1002562
56836 1002562 1052971 1114076 1184564 1262379 1344397 1425900 1500756 1562122 1602951 1616891 1600487
56825 1600487 1555530 1488937 1409834 1326523 1245492 1171569 1107599 1054101 1010231 975495 950347
56814 950347 935357 930512 935597 950681 975729 1009996 1052239 1101279 1155639 1212336 1266349 1311502
56802 1311502 1341785 1352180 1339547 1304067 1250081 1184850 1115847 1048808 987416 933608 887774
56791 887774 849322 817775 793287 776040 765601 761246 762689 770109 783576 802659 826330 852867
56779 852867 879962 905149 926099 940430 945571 939329 920836 891153 853287 811507 769918 730978
56767 730978 695289 662788 633699 608149 585532 564992 546408 530274 516682 504902 494046
56756 494046 483811 474560 466868 460896 456012 451189 446019 441125 437259 434308 431576 428752 426051 423573
56742 423573 421094 418483 415856 413396 411360 410120 409684 409348 408387 406953 405673 404545 403110 401681 401366
56727 401366 402513 404010 404748 405070 406061 407905 409746 410967 411814 412769 413928 415159 416393 417551 418473 419115
56711 419115 419705 420574 421890 423522 425112 426330 427198 428100 429299 430510 431188 431202 431018 431023 430932 430089 428348 426366
56693 426366 424978 424442 424386 424294 423899 423282 422846 423070 424019 425181 426013 426478 426742 426547 425481 423875 422784 422896
56675 422896 423935 425249 426385 426807 425829 423455 420780 418885 417645 416207 414312 412506 411263 410560 410199
56660 410199 409936 409357 408183 406662 405220 403892 402555 401481 401007 400847 400419 399770 399476 399638 399703 399320 398736
56643 398736 398191 397563 396726 395736 394588 393329 392429 392392 392897 393006 392326 391354 390507 389518 388052 386239 384313
56626 384313 382308 380375 378823 377538 375929 373731 371328 369079 366926 364978 363736 363279 362880 361946 360766
56611 360766 359815 358860 357433 355787 354667 354356 354499 354667 354649 354330 353772 353291 353101 353027 352776 352323 351750 351021
56593 351021 350190 349578 349447 349762 350465 351643 353156 354475 355252 355767 356510 357628 358982 360405 361631 362404
56577 362404 362851 363304 363581 363167 362440 362859 365195 368283 370512 372019 374388 378440 383471 388758 394698 402113
56561 402113 411154 421394 432539 444590 457519 471083 484846 498186 510256 519956 526172 528447
56549 528447 527664 525677 523924 522489 520733 518383 515629 512509 508843 504646 500093 495161 489736 484026
56535 484026 478463 473211 468065 462764 457062 450712 443764 436811 430585 425311 420645 416078 411198 405911
56521 405911 400767 396680 393893 391536 388673 385410 382353 379410 375948 371976 368209 364923 361561 357730
56507 357730 353876 350665 348190 346102 344084 341924 339507 337016 334908 333551 332957 332848 332766 332267 331338 330557
56491 330557 330451 330818 331083 331221 331737 332775 333789 334158 333634 332198 330109 328137 327085 326757 325995 324063
56475 324063 321598 319849 319355 319666 320000 319843 319183 318516 318483 319255 320458 321756 323183 324756 326057 326527 325960
56458 325960 324512 322527 320628 319671 320114 321442 322535 322698 322212 321868 322115 322732 323210 323345 323383 323639 324144
56441 324144 324728 325253 325598 325553 325018 324268 323748 323560 323322 322556 321136 319337 317619 316309 315418 314791 314518 315003
56423 315003 316472 318532 320459 321809 322587 322963 323064 322985 322822 322733 323030 324004 325525 327038 328117 328731 328831
56406 328831 328144 326784 325623 325497 326239 326990 327243 327047 326407 325154 323412 321659 320290 319572 319887 321441
56390 321441 323746 325954 327785 329644 331841 334209 336538 338778 340674 341776 342040 342006 342160 342513 342868 343116
56374 343116 343154 342954 342866 343420 344620 345792 346330 346299 346175 346339 346961 348057 349435 350816 352118 353456 354879
56357 354879 356337 357843 359315 360374 360779 361005 361835 363293 364513 364822 364480 364150 364116 364297 364612 365006 365350
56340 365350 365571 365785 366197 367052 368680 371324 374913 379189 383947 388851 393298 396942 400259 403931 407771
56325 407771 410932 413241 415546 418491 421687 424515 427094 429862 432649 434765 435841 436117 436026 435879 435989
56310 435989 436710 438179 440130 442059 443768 445739 448803 453311 458820 464708 470786 477057 483384 489846
56296 489846 497055 505460 514542 523284 531254 538675 545714 552484 559491 567257 575554 583838 592331 601765
56282 601765 612101 622534 632895 644003 656369 669523 682961 696793 711109 725739 741218
56271 741218 759014 779991 803313 827634 852844 880005 910032 943144 979265 1018381 1060663
56260 1060663 1106656 1157190 1212982 1274747 1343751 1421571 1509112 1606525 1714412 1834274 1967248
56249 1967248 2113121 2271191 2441407 2623907 2817803 3021110 3231538 3446734 3663950
56240 3663950 3879885 4090653 4291600 4477496 4643267 4784365 4896517 4975872 5019843 5027490
56230 5027490 4999033 4935794 4840786 4718465 4573275 4409068 4230127 4041641 3848281 3653006
56220 3653006 3457930 3265632 3078792 2899165 2727718 2565275 2412276 2268443 2133508
56211 2133508 2007843 1891697 1784340 1684807 1592966 1508959 1432027 1360872 1294920 1234354 1179143
56200 1179143 1128868 1083296 1042233 1004952 970564 938891 910219 884300 860381 838213 818328
56189 818328 801167 786448 773456 761536 750385 740164 731249 723553 716333 708978 701640 694790 688607
56176 688607 683322 679633 678056 678042 678370 678288 677827 677316 677121 677675 679244 681740 685078 689414 694772 700808
56160 700808 707316 714555 722792 731970 742154 753615 766115 778761 791195 804238 818769 834611
56148 834611 851233 868929 888569 910721 935774 964403 997218 1034477 1076822 1125715 1182402
56137 1182402 1246922 1318596 1396499 1478592 1561398 1641809 1718535 1790740 1856211 1912537 1959653
56126 1959653 1999700 2034614 2065264 2092518 2117181 2138329 2153083 2158730 2154467 2141067 2119819 2092016
56114 2092016 2058482 2019034 1972709 1918620 1856402 1786334 1709794 1629398 1547967 1467676 1390719
56103 1390719 1320169 1258895 1207617 1164815 1128474 1097286 1070624 1048423 1031002 1018267 1009147
56092 1009147 1002347 997242 993497 990526 988217 987485 988984 991865 994971 998701 1004342 1011916 1020121 1028191
56078 1028191 1036483 1045277 1054343 1063796 1074289 1086212 1099472 1114020 1129810 1146387 1163245 1180316
56066 1180316 1197510 1214359 1230891 1248042 1266216 1284188 1300550 1315424 1329517 1342433 1353511
56055 1353511 1363551 1373992 1384955 1395778 1406946 1419716 1434238 1449723 1466115 1483959 1503061
56044 1503061 1522967 1544279 1567768 1592768 1618300 1645170 1674853 1706756 1738799 1770409 1802757
56033 1802757 1836338 1870601 1905847 1943187 1982650 2023454 2065956 2111087 2158113 2205422 2253269
56022 2253269 2303092 2354269 2404485 2453545 2503952 2557277 2612830 2670417 2731459 2796433 2863920
56011 2863920 2933192 3005462 3081738 3161823 3246163 3336310 3432688 3534172 3640490 3752748 3871101
56000 3871101 3994451 4123119 4259258 4404065 4557142 4719061 4891756 5075770 5270038
55991 5270038 5475046 5693223 5925638 6171485 6431655 6709612 7007983 7327549 7670307
55982 7670307 8039985 8438846 8867859 9331066 9835807 10387619 10989164 11645382 12365256
55973 12365256 13157364 14029037 14992189 16065196 17267097 18615626 20134011 21854411
55965 21854411 23811469 26038328 28573792 31469702 34789452 38608151 43023636 48166877
55957 48166877 54200604 61316777 69744393 79754329 91645378 105727119 122325547
55950 122325547 141791970 164447259 190419951 219434437 250671918 282761927 313813931
55943 313813931 341374540 362421969 373753584 372957225 359554254 335478173 304410786
55936 304410786 270391656 236630517 205097648 176741591 151864290 130392118 112052261
55929 112052261 96499764 83382202 72352250 63078840 55271667 48689133 43123945
55922 43123945 38395695 34357975 30896890 27916388 25332100 23077850 21104895 19370172
55914 19370172 17832344 16459618 15231378 14128901 13131494 12223190 11395377 10640093 9947048
55905 9947048 9309132 8724310 8189503 7697983 7244760 6828973 6448714 6098500 5774141
55896 5774141 5475448 5201852 4949508 4714839 4497004 4294920 4105581 3927273 3761009
55887 3761009 3606974 3462834 3327063 3200577 3083477 2973501 2869480 2773167 2685774 2605567
55877 2605567 2530701 2461671 2399074 2341456 2287197 2236245 2188152 2140388 2090272 2036994 1980660
55866 1980660 1921341 1860204 1799642 1741101 1684588 1630993 1582579 1540010 1501139 1464038 1429137
55855 1429137 1397106 1366812 1336972 1308015 1280686 1254352 1228177 1202537 1177884 1153466 1128438
55844 1128438 1103129 1078150 1053450 1029132 1005957 984177 963120 942625 923440 905528 887629
55833 887629 869405 852424 837973 825369 813426 802049 791303 780449 769214 758643 749406 740484
55821 740484 730798 720957 712051 703743 694954 685613 676520 668170 660838 655109 651271 648755 646982 646190
55807 646190 646751 648459 651227 655600 661773 668828 675717 682322 688869 695051 700299 704075 705338 702693
55793 702693 695832 686026 674498 661129 645452 628082 610417 593704 578921 566776 557202 549645
55781 549645 544302 542042 542620 544065 544523 543649 541675 538521 534795 532365 532702 535580 540461 548087 559366
55766 559366 573440 588045 601017 610236 612976 607105 593049 573490 551243 528212 505951 485870
55754 485870 468589 453677 440216 427395 414937 403348 393408 385084 377445 369974 363196 357489 352046
55741 352046 345854 339201 333419 329492 327429 326596 326109 325326 324422 324040 324027 323194 320770 317332 313809 310344
55725 310344 306720 303018 299094 294244 288282 282328 277611 274055 270887 268042 266118 265472 266176 268426 272105
55710 272105 276421 280754 285431 290915 296753 302099 306723 310588 312916 312693 309822 305067 299181 292807
55696 292807 286680 281081 275442 269287 263116 257644 252809 248435 245268 244169 244755 246010 247895 251041
55682 251041 255058 258509 260780 262868 266048 270603 275990 281457 286244 289827 292193 293507 293632 292505
55668 292505 290797 289478 288870 288670 288668 288736 288445 287601 287032 287845 289903 291916 293105 293940 295149 296868 298885
55651 298885 300888 302126 301603 299027 295108 290632 285701 280070 273764 267103 260494 254381 249058 244373
55637 244373 239835 235048 229858 224225 218328 212721 207999 204352 201745 200293 200045 200559 201208 201733 202078
55622 202078 201913 200921 199404 197916 196395 194293 191632 189250 187805 187039 186191 184742 182672 180368 178432
55607 178432 177270 176737 176300 175493 174118 172314 170666 169895 170017 170148 169555 168505 167542 166444 164656 162394
55591 162394 160395 158734 156844 154729 153195 152738 153027 153664 154669 155961 157143 158164 159525 161467 163563
55576 163563 165521 167792 170894 174617 178454 182531 187451 193369 199725 205959 212175 218936 226604 234894
55562 234894 242963 249811 254658 257144 257360 255674 252341 247333 240735 233240 225841 218982 212445 206146
55548 206146 200477 195616 191114 186674 182839 180356 179207 178785 178680 178749 178786 178697 178713 178837 178425 176984 175075
55531 175075 173695 172966 172128 170626 168488 165802 162601 159159 155708 152013 147913 143999 140908 138155 134758
55516 134758 130959 128140 126848 126039 124723 123313 122724 122951 123268 123272 123069 122751 122302 121785 121239 120547 119676 118888
55498 118888 118539 118864 119954 121603 123130 123833 123791 123897 124878 126508 127841 128029 126966 125487 124794 125351 126458
55481 126458 127233 127724 128519 129583 130286 130418 130353 130265 129985 129603 129333 128792 127378 125452 124132 123694 123217 122112
55463 122112 120919 120142 119388 118297 117334 116892 116528 115912 115686 116346 116987 116333 114625 113327 113143 113363 113202
55446 113202 112835 112847 113352 113924 114031 113431 112423 111716 111712 112002 111849 111038 109926 108877 108082 107791 108155 108782 108874
55427 108874 108037 106753 105981 106364 107822 109780 111754 113680 115576 117067 117640 117421 117258 117809 118951 120266
55411 120266 121701 123382 125171 126848 128479 130146 131448 131733 130763 128881 126558 124086 121640 119337 117187
55396 117187 115179 113474 112460 112541 113799 115705 117282 117779 117195 115994 114529 113025 111876 111361 111101 110499
55380 110499 109825 110165 112016 114529 116484 117469 117746 117516 116778 115605 114144 112648 111710 111983 113323 114651
55364 114651 115070 114702 114079 113268 112105 110866 110090 109977 110382 111041 111419 110760 108865 106539 104745 103641 102863
55347 102863 102349 102254 102394 102418 102359 102472 102749 103047 103467 104089 104639 104917 105244 105904 106540 106689 106592 106735 106979 106938
55327 106938 106901 107413 108112 108036 107092 106241 106079 106154 105948 105681 105758 106132 106609 107246 108047 108794 109371 109830 109947 109302
55307 109302 108087 107244 107457 108438 109491 110268 110651 110424 109579 108616 108115 108207 108662 109179 109356 108816 107793 107228
55289 107228 107864 109424 111004 112082 112763 113293 113742 114105 114380 114542 114602 114593 114375 113656 112462 111364 110977 111330
55271 111330 111949 112407 112545 112353 112000 111942 112605 113790 114668 114537 113525 112431 111955 112205 112935 113994 115344
55254 115344 116750 117799 118341 118637 118869 118795 118218 117573 117546 118116 118403 117628 115858 113747 111823 110257 109008
55237 109008 107964 107043 106299 105889 105865 106126 106539 106953 107165 107183 107462 108479 109965 110976 110955 110383 110119 110356
55219 110356 110548 110202 109406 108665 108432 108793 109458 110034 110414 110805 111387 112050 112496 112455 111831 110879 110243 110455 111279
55200 111279 111863 111700 111113 110586 110047 109142 107970 107062 106798 107170 108001 108987 109668 109785 109689 109996 110800 111588 111925
55181 111925 111873 111647 111341 111171 111597 112815 114389 115728 116728 117576 118071 117671 116365 115080 114883 115949 117527
55164 117527 118792 119471 119765 120034 120645 121747 122968 123582 123264 122493 121917 121473 120584 119179 117970 117498 117401
55147 117401 116999 116261 115696 115501 115396 115272 115414 115892 116209 115929 115305 114930 114964 115130 115333 115821 116685 117558 117995
55128 117995 117908 117567 117338 117500 118027 118471 118337 117783 117628 118376 119437 119748 119066 118230 118123 118742 119453 119811 119869
55109 119869 119836 119771 119616 119400 119317 119549 120013 120375 120461 120576 121224 122505 124046 125514 126920 128299 129392 129880
55091 129880 129797 129477 129226 129189 129421 129875 130409 131013 131931 133340 134952 136185 136778 137037 137357 137671 137585 137022 136563
55072 136563 136918 138071 139139 139272 138632 138293 139177 141169 143193 144022 143092 140852 138364 136446 135204 134446
55056 134446 134241 134694 135409 135779 135757 135773 135859 135488 134463 133198 131854 129995 127627 125844 125610 126425 127013 126958
55038 126958 126776 126667 126264 125589 125191 125090 124527 123169 121845 121562 122354 123546 124679 125669 126400 126679 126465
55021 126465 125849 124991 124266 124124 124463 124462 123459 121816 120548 120224 120597 121191 121847 122641 123602 124668 125795 126984
55003 126984 128197 129241 129792 129682 129178 128783 128735 128916 129361 130485 132476 134640 135780 135347 134000 132936
54987 132936 132805 133330 133869 134110 134177 134220 134135 133759 133128 132396 131675 131193 131407 132629 134501 136161 137012 137157 137098
54968 137098 137268 137797 138389 138407 137470 136135 135565 136312 137704 138717 139117 139424 140016 140725 141202 141313 141158 140952
54950 140952 140928 141207 141794 142790 144379 146393 148074 148655 148107 147018 145798 144423 142988 142036 142061 143002 144535
54933 144535 146576 149129 151754 153740 154952 156141 158165 161200 164961 169431 174874 181197 187851 194557
54919 194557 201698 209665 218083 226016 232704 237682 240383 240203 237148 232069 226004 219429 212285 204555
54905 204555 196672 189355 183069 177636 172488 167421 162977 159898 158313 157692 157495 157521 157722 158095 158881 160492
54889 160492 163026 166010 168773 170939 172581 174138 176280 179565 184031 189246 194814 200695 207052 213916
54875 213916 221053 227958 234037 238998 242979 245949 247152 245619 241272 235054 227866 219958 211518 203171
54861 203171 195443 188214 181257 174990 170128 166762 164321 162356 160879 159937 159252 158437 157310 155899 154284
54846 154284 152404 149966 146732 143093 140124 138709 138604 138654 137963 136673 135586 135213 135237 134820 133440 131447
54830 131447 129749 129001 129260 130331 132007 133857 135243 135877 136153 136569 137097 137400 137373 137121 136688 136237 136278 137143
54812 137143 138340 138977 138804 138330 137936 137512 137100 137231 138224 139607 140660 141329 142146 143414 144840 145956 146550
54795 146550 146629 146296 145821 145616 145899 146454 146906 147218 147632 148100 148102 147317 146304 146125 147331 149622 152399 155215
54777 155215 157735 159818 161932 164936 169142 173937 178684 183585 189222 195668 202568 209849 217726 226137
54763 226137 234692 243034 250684 256741 260463 262175 262837 262575 260353 255404 248340 240407 232235 223873 215645
54748 215645 208211 201870 196319 191194 186456 182212 178470 175263 172824 171468 171273 171906 172806 173666 174717
54733 174717 176376 178591 180794 182626 184478 187067 190650 194933 199690 205110 211386 218181 224748 230555
54719 230555 235650 240351 244656 248063 249964 250018 248072 243860 237150 228322 218669 209787 202565 196778 191670
54704 191670 186837 182429 178627 175241 171992 168949 166416 164492 163044 162012 161328 160512 158883 156415 153976
54689 153976 152403 151681 151339 151289 151772 152707 153630 154199 154321 153924 153062 152203 151857 151936 151934 151742 151745 152053 152199 151773
54669 151773 150898 149859 148750 147746 147201 147200 147339 147230 146867 146248 145172 143806 142965 143232 144087 144489 144120 143478
54651 143478 142926 142338 141696 141353 141512 141961 142583 143632 145192 146749 147717 148132 148409 148581 148258 147356 146395 145840
54633 145840 145440 144590 143276 142302 142410 143387 144270 144354 143810 143284 143164 143331 143471 143434 143346 143527 144275 145553 146845
54614 146845 147419 146844 145320 143584 142440 142229 142601 142824 142469 141805 141454 141719 142353 142992 143551 144110 144580 144806
54596 144806 144992 145731 147357 149448 151172 152101 152380 152142 151183 149488 147743 146890 147171 147967 148607 148993 149354
54579 149354 149658 149569 148847 147613 146253 145159 144509 144217 144113 144149 144378 144713 144899 144812 144656 144754 145214 145875 146508
54560 146508 146987 147357 147824 148594 149647 150696 151418 151650 151372 150691 149992 149864 150579 151672 152310 152167 151777 151981
54542 151981 153192 155198 157381 158966 159344 158542 157355 156711 156851 157316 157741 158278 159140 160084 160670 160802 160653
54525 160653 160284 159718 159229 159050 158785 157727 155854 154005 152829 152096 151392 150920 151070 151562 151727 151473 151344
54508 151344 151659 152197 152784 153603 154674 155509 155624 155113 154511 154286 154634 155494 156516 157187 157217 156728 156064 155564
54490 155564 155591 156440 158009 159710 160925 161481 161623 161717 162129 163133 164616 165927 166356 165888 165326 165496 166369
54473 166369 167114 167153 167005 167886 170369 173713 176631 178536 179742 180646 181178 181108 180585 180125 180139 180577 180986 180969
54455 180969 180594 180242 179977 179304 177825 175848 174037 172598 171278 170044 169251 169060 169150 169155 168990 168640 168005 167115
54437 167115 166170 165249 164312 163608 163635 164470 165503 166059 165973 165370 164358 163225 162532 162557 162871 162905 162770 163171 164542
54418 164542 166585 168595 170006 170658 170772 170690 170630 170717 171148 172047 173086 173613 173356 172759 172495 172874 173812 175046
54400 175046 176211 177019 177572 178211 178962 179503 179818 180401 181518 182749 183655 184435 185509 186796 187928 188821 189486
54383 189486 189593 188822 187512 186393 185770 185417 185128 184869 184494 183926 183617 184373 186689 190544 195655 201418 206770
54366 206770 210801 213596 215978 218356 220347 221566 222145 222242 221616 220109 218213 216698 215780 214978 213772 212230
54350 212230 210925 210240 209843 208982 207329 205237 203025 200459 197323 194147 191769 190289 189031 187539 186058
54335 186058 184967 184311 184028 184188 184710 185187 185192 184576 183442 182060 180821 179993 179472 179039 178759 178760 178773 178361 177607
54316 177607 177030 176801 176605 176358 176445 176950 177240 176700 175546 174554 174207 174345 174458 174168 173596 173303 173633 174215 174437
54297 174437 174302 174262 174296 173968 173497 173849 175354 176961 177491 177023 176458 176244 176269 176601 177515 178900 180269 181352
54279 181352 182214 182902 183451 184136 185237 186630 187950 189019 189745 189876 189365 188781 188746 189044 188912 188242 187861 188483
54261 188483 189876 191277 192188 192539 192494 192408 192711 193552 194682 195806 196897 198036 199140 199958 200256 199996 199475
54244 199475 199269 199753 200566 200833 200092 198852 198032 197942 197995 197380 195892 194014 192372 191271 190784 191049 192142
54227 192142 193670 194814 195062 194733 194602 195065 195830 196315 196141 195340 194233 193126 191989 190551 188811 187275
54211 187275 186493 186464 186715 186892 186982 187019 186856 186316 185409 184339 183392 182806 182672 182983 183809 185260 187163 188954
54193 188954 190120 190682 191086 191681 192444 193094 193352 193145 192711 192401 192337 192458 192910 193980 195464 196580 196862 196811
54175 196811 197182 197991 198748 199418 200378 201497 202009 201471 200295 199117 198066 196818 195007 192464 189457 186826
54159 186826 185460 185471 186231 187189 188159 188782 188455 187198 186016 185845 186466 186911 186612 185713 184541 183295 182167
54142 182167 181299 180651 180222 180296 181149 182587 184081 185363 186589 187933 189257 190223 190615 190597 190676 191274 192279
54125 192279 193222 193991 195019 196637 198658 200908 203661 207060 210489 213218 215531 218530 222778 227728 232507
54110 232507 236609 239647 241092 240699 238881 236344 233584 230855 228247 225522 222267 218506 214905 212077
54096 212077 209995 208406 207401 207089 207002 206467 205537 204925 204930 204981 204470 203550 202759 202225 201699 201195 201136 201828 203144
54077 203144 204794 206622 208506 210206 211530 212525 213333 213949 214445 215312 217196 220034 222742 224161 224248 224015
54061 224015 224301 224977 225495 225716 225804 225595 224682 223121 221526 220346 219440 218615 218159 218531 219751 221496 223546
54044 223546 225796 228023 230187 232820 236459 240596 243897 245879 247815 251426 256948 263086 268704 273843
54030 273843 279015 284158 288747 292593 296095 299773 303819 308049 312108 315729 318973 322155 325342 327946
54016 327946 329090 328561 327211 326206 325874 325522 324369 322369 319901 316937 312991 307859 302015 296151 290730
54001 290730 286147 282845 280789 279141 276981 274241 271508 269050 266592 263965 261374 258954 256627 254531
53987 254531 253039 252185 251663 251620 252679 254735 256469 256871 256726 257711 260253 263256 265891 268687 272611 277861
53971 277861 283969 290379 296393 301002 303399 303586 302133 299511 295919 291558 286717 281693 276835 272523
53957 272523 268886 265685 262705 260129 258301 257340 257185 257802 259027 260417 261703 263279 265804 269309 273168
53942 273168 277024 281243 286226 291677 296925 301703 306167 310270 313561 315755 317175 318420 319746 320950
53928 320950 321748 322138 322404 322938 324065 325893 328275 330944 333744 336675 339816 343330 347504 352544 358235
53913 358235 364019 369621 375415 381948 389226 396696 403839 410437 416293 421103 424778 427603 429919 431792
53899 431792 433085 433627 433245 431859 429634 426816 423387 419253 414820 410765 406911 401906 394731 386219 378392
53884 378392 372339 367415 362476 357127 351534 345731 339641 333412 327322 321592 316594 312846 310427 308616
53870 308616 306583 304276 302163 300230 297759 294160 289635 284922 280704 277409 275148 273536 271776 269261
53856 269261 266092 262848 259949 257444 255298 253577 252291 251277 250409 249705 249109 248312 247074 245700 244881
53841 244881 244934 245349 245271 244405 243312 242844 243363 244519 245672 246455 246941 247307 247482 247276 246776 246400 246464 246884 247411
53822 247411 247982 248688 249509 250295 250912 251274 251339 251220 251162 251249 251318 251421 252119 253950 256663 259424 261766 263954
53804 263954 266426 269283 272482 276125 280356 285250 290856 297006 303003 307938 311642 314975 318918 323629
53790 323629 328605 333411 337890 341930 345478 348685 351683 354266 355992 356497 355615 353485 350735 348200 346096
53775 346096 343746 340477 336524 332624 329077 325697 322408 319212 315703 311396 306621 302422 299331 296762
53761 296762 293803 290143 286074 282069 278648 276179 274485 272916 271097 269290 267860 266710 265514 264184
53747 264184 262852 261687 260969 261024 261732 262403 262439 261880 261015 259892 258638 257912 258369 259776 261194 262010 262320
53730 262320 262362 262212 262163 262737 263989 265232 265899 266360 267469 269428 271571 273209 274359 275562 277309 279737
53714 279737 282601 285386 287599 289211 290698 292493 294503 296373 298134 300251 303005 306132 309250 312321
53700 312321 315419 318349 320906 323449 326725 331072 336129 341357 346435 351006 354516 356715 358121 359582
53686 359582 361482 363588 365538 367104 368066 368205 367573 366483 365143 363456 361343 359123 357382 356450 356096
53671 356096 355813 355402 355258 355928 357355 358741 359346 359312 359389 359883 360269 359998 359336 358966 358990 358822 358112 357235 356629
53652 356629 356091 355225 354268 353932 354501 355643 357111 358982 361016 362445 362826 362656 362651 362821 362853 363003 363933 365783
53634 365783 368111 370690 373678 376959 380043 382860 385990 389797 393861 397606 400984 404170 407047 409459
53620 409459 411630 413823 415860 417480 418950 420865 423425 426357 429478 432957 436964 441387 445971 450544
53606 450544 455057 459508 463786 467580 470579 472790 474504 475945 477223 478591 480316 482122 483295 483602
53592 483602 483682 484165 484870 485292 485383 485260 484630 483228 481570 480410 479539 477923 475145 472029 469588 467929 466432
53575 466432 464544 462159 459567 457221 455289 453440 451353 449324 447883 446888 445630 443898 442225 440890
53561 440890 439449 437668 436229 435892 436422 437003 437403 438032 439001 439802 440030 439957 440259 441422 443453 445919 448211
53544 448211 450008 451512 453174 455256 457834 461018 464850 469046 473213 477394 482091 487610 493574 499269
53530 499269 504351 509131 514327 520717 528915 539158 551110 563973 576993 589968 603200 616938
53518 616938 630983 644981 659056 673962 690495 708794 728292 748327 768780 790115 812803
53507 812803 836709 861124 885368 909408 933837 959277 985743 1012487 1038477 1063150 1086672
53496 1086672 1109354 1130983 1151105 1169925 1188466 1207561 1227046 1246216 1264739 1282764 1300494
53485 1300494 1318212 1336566 1356192 1376953 1397915 1418139 1437262 1455384 1472783 1489737 1506236
53474 1506236 1521856 1536207 1549426 1561824 1573114 1582514 1589600 1594522 1597271 1597284 1594073 1587870 1579422
53461 1579422 1569409 1558204 1545886 1532341 1517596 1502065 1486170 1469861 1453007 1436146 1420044
53450 1420044 1404405 1387837 1369520 1350190 1331043 1312434 1294269 1276915 1260733 1245103 1228976
53439 1228976 1212446 1197016 1184162 1174195 1166584 1160734 1156264 1152949 1150718 1149551 1149308 1149882 1151499 1154595
53425 1154595 1159357 1165568 1172828 1180733 1188929 1197379 1206588 1217288 1229838 1244073 1259702 1276624 1294898
53412 1294898 1314684 1336225 1359684 1384933 1411634 1439551 1468729 1499450 1532019 1566446 1602259
53401 1602259 1638896 1676375 1715296 1756048 1798398 1842131 1887649 1935511 1985672 2037642 2091110
53390 2091110 2145892 2201469 2257184 2312848 2368663 2424581 2480141 2534851 2588237 2639661 2688655
53379 2688655 2735414 2780392 2823346 2863336 2899663 2932241 2960903 2984992 3003928 3017669 3026343
53368 3026343 3029880 3028328 3022106 3011552 2996489 2976525 2951468 2921215 2885605 2844810 2799726 2751732
53356 2751732 2702157 2652125 2602521 2553739 2505595 2457784 2410270 2363152 2316478 2270596 2226423
53345 2226423 2184816 2145622 2107686 2069875 2031865 1993942 1956345 1919085 1882310 1846656 1812965
53334 1812965 1781589 1752167 1724266 1698147 1674490 1653428 1634276 1616358 1599589 1583925 1568659
53323 1568659 1552863 1536393 1519920 1503872 1487782 1470823 1452800 1434472 1416985 1400995 1386276
53312 1386276 1372214 1358808 1346973 1337604 1330457 1324360 1318616 1313804 1310978 1310421 1311543 1313833 1317424
53299 1317424 1322656 1329514 1337757 1347453 1359049 1372932 1389097 1407179 1426626 1446876 1467649 1489140
53287 1489140 1511696 1535179 1558936 1582470 1605813 1628934 1651071 1671147 1688708 1704090 1717697
53276 1717697 1729567 1739575 1747518 1752788 1754478 1752201 1746496 1738177 1727570 1714721 1700001 1683933
53264 1683933 1666518 1647229 1625827 1602757 1578615 1553590 1527687 1501202 1474590 1447937 1420941
53253 1420941 1393471 1365874 1338586 1311638 1284779 1257993 1231657 1206190 1181686 1157880 1134337
53242 1134337 1110721 1087088 1063968 1041919 1020893 1000233 979380 958395 937737 917835 899039
53231 899039 881665 865822 851334 838039 825930 814786 804022 793253 782727 772800 763236 753473
53219 753473 743309 732713 721234 708351 694359 680097 665705 650506 634328 618097 602666
53208 602666 587856 573262 559384 547129 536519 526647 516773 506847 497104 487760 479114 471330 464012
53195 464012 456346 447776 438281 428123 417742 407851 399144 391707 385003 378500 372080 365884 360054 354708
53181 354708 349850 345287 340887 336907 333707 331117 328515 325629 322908 320938 319817 319299 319138 318997 318386
53166 318386 317096 315536 314192 312896 311052 308572 306108 304240 302877 301714 300954 301077 302006 302904 302940 302025
53150 302025 300690 299468 298574 297983 297554 297081 296416 295575 294642 293659 292768 292354 292743 293726 294626 294934 294664 294063
53132 294063 293308 292694 292801 294058 296175 298315 299876 300915 301838 302930 304269 305846 307578 309277 310817
53117 310817 312359 314256 316656 319288 321764 324065 326570 329499 332452 334628 335468 335058 334006 333027 332504
53102 332504 332236 331645 330357 328530 326491 324237 321635 318985 316963 315862 315189 314095 312033 309043 305750
53087 305750 303114 301762 301365 300977 300128 299195 298600 298118 297301 296141 294885 293552 292118 290954 290538 290843
53071 290843 291398 291878 292259 292538 292713 292923 293188 293098 292200 290628 288952 287429 285950 284684 284171 284501 284887
53054 284887 284441 283179 282004 281866 283017 284886 286515 287286 287366 287309 287290 287006 286374 285899 286120 286947 287809 288316
53036 288316 288531 288715 289040 289562 290268 291129 292076 292904 293273 292993 292299 291669 291375 291366 291606 292214 293167 294126 294702
53017 294702 294776 294452 293959 293713 294237 295708 297663 299313 300118 300021 299342 298589 298199 298276 298695 299514 301028 303221
52999 303221 305422 306871 307477 307730 308007 308363 308948 310118 311954 314046 315982 317760 319478 320899 321738 322274
52983 322274 323207 324851 326707 327985 328331 327987 327460 327192 327289 327405 327026 326103 325206 324860 324909 324932 325112 326162
52965 326162 328315 330869 332981 334543 336004 337693 339607 341536 343033 343495 342709 341201 339661 338213 336669
52950 336669 335255 334453 334110 333375 331742 329720 328198 327517 327436 327674 328112 328647 329120 329337 329061 328145 326810
52933 326810 325551 324636 323941 323376 323169 323414 323650 323261 322206 320967 319917 319108 318612 318628 319129 319767 320305 320861
52915 320861 321511 321886 321527 320602 319913 320048 320706 321061 320667 319776 318809 317889 317092 316773 317153 317618 317016 314928
52897 314928 312334 310679 310511 311334 312607 314288 316330 318191 319268 319663 320062 320835 321571 321636 320934 319892
52881 319892 318899 318118 317778 318212 319380 320646 321389 321720 322355 323848 326210 329198 332623 336276 339813 342878
52865 342878 345228 346727 347367 347355 346987 346329 345166 343383 341225 339077 337049 334894 332251 328943 325111
52850 325111 321073 317003 312806 308459 304380 301141 298766 296636 294212 291636 289428 287833 286681 285755
52836 285755 285061 284736 284811 285030 284967 284458 283976 284285 285634 287505 289228 290568 291503 291862 291569 291052 290909 291203
52818 291203 291449 291346 291158 291276 291697 292119 292381 292621 293074 293776 294485 294857 294778 294447 294084 293644 292966 292094 291217
52799 291217 290295 289021 287285 285429 283874 282655 281524 280455 279745 279537 279435 278878 277882 277184 277505 278794
52783 278794 280360 281610 282442 282998 283375 283712 284258 285080 285827 286009 285511 284726 284217 284291 284793 285216 285106 284448
52765 284448 283599 282824 282110 281518 281396 281976 282966 283894 284729 285819 287255 288659 289682 290388 291030 291678 292223
52748 292223 292549 292604 292476 292476 292952 293874 294824 295551 296360 297684 299414 301042 302425 304000 306025 307962 309022
52731 309022 309192 309267 309834 310637 311203 311652 312490 313776 315034 315971 316727 317283 317124 315857 313870 311994 310630
52714 310630 309568 308556 307672 307130 307027 307313 307861 308451 308881 309128 309358 309796 310638 312001 313776 315560 316905
52697 316905 317650 317957 318058 318089 318104 318120 318147 318226 318373 318465 318291 317814 317189 316424 315220 313421 311511 310348 310389 311269
52677 311269 312071 311943 310678 308932 307710 307386 307344 306863 306101 305863 306545 307814 309230 310619 311787 312431 312588
52660 312588 312692 312948 313054 312752 312314 312182 312512 313403 315210 318133 321668 324961 327672 330142 332649 334845
52644 334845 336002 335667 334045 331921 330157 329074 328303 327332 326076 324776 323525 322209 320866 319731 318866
52629 318866 318063 317294 316994 317636 319186 321140 323032 324661 325881 326453 326233 325386 324288 323284 322589 322262
52613 322262 322115 321769 321088 320557 320894 322214 323829 325066 325932 326695 327162 326922 326141 325477 325156 324796 324385 324761
52595 324761 326540 328959 330471 330446 329759 329654 330498 331797 332983 333844 334377 334602 334587 334564 334881 335781 337208 338870
52577 338870 340502 341955 343056 343579 343505 343076 342442 341475 340156 338932 338270 337995 337542 336795 336174 335786 335086
52560 335086 333666 331950 330644 329807 328902 327674 326529 326037 326379 327280 328194 328563 328155 327261 326382 325739 325259
52543 325259 324933 324881 325050 325199 325318 325722 326537 327344 327584 327152 326333 325416 324662 324503 325319 326936 328688 330064
52525 330064 331085 331976 332795 333547 334373 335354 336300 337002 337609 338494 339790 341345 343121 345346 348170 351428
52509 351428 354823 358133 361108 363469 365250 366864 368447 369308 368546 366245 363561 361365 359241 356171 351900
52494 351900 347210 343020 339746 337503 336340 336039 336043 335892 335541 335090 334500 333789 333266 333230 333527 333685 333370 332607
52476 332607 331679 331095 331439 332880 334898 336854 338750 341020 343645 346013 347843 349704 352250 355279 358015
52461 358015 360160 362186 364546 366993 368848 369716 369686 368879 367101 364153 360396 356700 353647 350979 348073
52446 348073 344799 341600 338811 336343 334057 331956 329822 327149 323913 321159 320272 321611 324097 326242
52432 326242 327372 327858 328342 328931 329188 328847 328318 328227 328573 328772 328622 328802 330052 332172 334234 335608 336466
52415 336466 337374 338760 340711 342956 345035 346727 348299 350233 352804 356164 360603 366353 373132 380206
52401 380206 386971 393262 399222 405070 410882 416260 420305 422294 422312 420863 417977 413279 407023 400468 394921
52386 394921 390762 387648 385317 383772 382887 382224 381348 380210 379230 378957 379554 380705 382193 384441 388045 392801
52370 392801 397647 401771 405348 408983 412783 416284 419001 420687 421329 421227 420944 420770 420362 419226 417462
52355 417462 415735 414595 414153 414372 415317 416998 419254 421859 424576 427087 429111 430693 432168 433801 435656
52340 435656 437891 440844 444537 448329 451491 454142 457265 461624 467025 472904 479358 487133 496641 507482
52326 507482 519096 531451 544839 559267 574399 589922 605667 621440 637044 652349 667201
52315 667201 681489 695506 710024 725627 742221 759604 778238 798833 821279 844681 868475
52304 868475 892838 917840 942964 967847 992921 1018762 1045141 1071169 1096028 1119172 1140119
52293 1140119 1158574 1174636 1188466 1199860 1208537 1214759 1219274 1222643 1224840 1225510 1224429 1221796 1218230
52280 1218230 1214367 1210294 1205565 1199928 1193757 1187565 1181436 1175377 1170020 1166403 1164990 1165264 1166383 1167941
52266 1167941 1170060 1173047 1177122 1182406 1189030 1197248 1207238 1218687 1230748 1242710 1254777 1268028 1283612
52253 1283612 1301941 1322521 1344286 1366153 1387371 1407447 1425861 1442064 1455809 1467218 1476412
52242 1476412 1483339 1488082 1491063 1492741 1493269 1492551 1490369 1486351 1480170 1471933 1462106 1450942 1438416 1424908
52228 1424908 1411295 1398030 1384669 1370802 1356883 1343501 1330346 1316804 1303204 1290559 1279159
52217 1279159 1268323 1257571 1247193 1237518 1228466 1220081 1212852 1207185 1203062 1200430 1199321 1199384 1199966 1200945
52203 1200945 1202902 1206059 1209651 1212805 1215628 1218880 1222938 1227586 1232629 1238190 1244475 1251550 1259292 1267307
52189 1267307 1275044 1282176 1288665 1294320 1298619 1301235 1302426 1302522 1301262 1298043 1292695 1285634 1277376 1268308
52175 1268308 1258923 1249858 1241481 1233657 1226051 1218598 1211615 1205574 1200899 1197916 1196805 1197369 1198844 1200266
52161 1200266 1201265 1202387 1204438 1207595 1211377 1215135 1218166 1219658 1219202 1217444 1215578 1214099 1212633 1211032
52147 1211032 1209865 1209498 1209483 1209503 1210260 1212665 1216490 1220585 1224222 1227491 1230483 1232852 1234337 1235117 1235432 1235388
52131 1235388 1235391 1236410 1239469 1245000 1252838 1262665 1274300 1287719 1302988 1320146 1339101 1359558 1381038
52118 1381038 1403022 1425274 1448046 1471727 1496116 1520322 1543591 1565976 1587924 1609431 1630081
52107 1630081 1649762 1668909 1687970 1707102 1726502 1746600 1767596 1788973 1809744 1829204 1847347
52096 1847347 1864566 1880904 1895565 1907190 1914715 1917912 1917107 1912627 1904760 1894030 1881070 1866208
52084 1866208 1849482 1831214 1812363 1794142 1777327 1761829 1746763 1731018 1714178 1697059 1681158
52073 1681158 1667452 1655774 1645403 1635997 1627919 1621915 1618640 1618281 1620385 1624183 1629353 1636407 1646051
52060 1646051 1658174 1671760 1685907 1700704 1716850 1734598 1753331 1772180 1790643 1808475 1825193
52049 1825193 1840053 1852474 1862369 1870067 1875983 1880227 1882348 1881609 1877708 1871162 1862776 1852923 1841608
52036 1841608 1828986 1815308 1800458 1784172 1766783 1749186 1731838 1714406 1696694 1679328 1662926
52025 1662926 1646988 1630252 1611994 1592492 1572434 1552481 1533329 1515550 1499128 1483515 1468291
52014 1468291 1453544 1439549 1426352 1413777 1401616 1389721 1378034 1366504 1354847 1342462 1328721
52003 1328721 1313256 1295876 1276414 1254956 1232079 1208649 1185469 1163242 1142522 1123285 1104747
51992 1104747 1086076 1067175 1048418 1029791 1010805 991113 970696 949541 927739 905890 884814
51981 884814 864785 845566 827232 810205 794325 778702 762945 747933 734738 723206 712230
51970 712230 701268 691057 682919 677746 675631 676085 678511 682540 687892 693965 699968 705628 711369 717416
51956 717416 722940 726510 727332 725851 723275 720812 719225 718828 719853 722919 728991 738790 752483 770091
51942 770091 791801 817494 846219 876540 907263 937300 964970 987981 1004264 1012597 1012562 1004464
51930 1004464 989494 969537 946400 921241 894772 867689 840636 813893 787451 761467 736511
51919 736511 713235 691777 671605 652093 633324 616225 601771 590141 580693 572711 566025 561013
51907 561013 558170 557625 558944 561359 564272 567505 571035 574632 577904 580563 582444 583242 582383 579205 573273
51892 573273 564694 554246 543054 531964 521313 511369 502686 495797 490759 487359 485591 485528 486907 489319
51878 489319 492794 497669 503832 510691 518046 526425 536142 546453 556100 564421 571447 577073 580701 581818
51864 581818 580592 577811 574428 571186 568459 566341 564891 564177 564046 564115 564228 564725 565886 567238 567801 567036
51848 567036 565104 562185 557973 552131 544851 536655 527914 518892 510052 501900 494532 487696 481386 476131
51834 476131 472536 470651 469936 469778 470005 470834 472368 474240 475927 477280 478496 479506 479765 478876 477155 475248
51818 475248 473428 471677 470292 469817 470299 471106 471713 472294 473266 474560 475684 476332 476572 476489 475916 474638 472829
51801 472829 471248 470820 471758 473168 473930 474018 474518 476214 478609 480650 481894 482477 482414 481627 480493 479611 479038
51784 479038 478332 477407 476740 476637 476840 477051 477287 477515 477473 477199 477303 478338 480206 482567 485507 489466 494714
51767 494714 501246 508906 517219 525291 532335 538210 543156 547116 549711 550674 549835 546735 540911 532811 523987
51752 523987 515979 509134 502740 496122 489299 482668 476446 470637 465372 461021 457893 455979 455109 455220 456313
51737 456313 458231 460803 464254 469179 475849 483655 491429 498344 504449 510390 516582 522578 527286 529995
51723 529995 531177 532109 533732 536169 539269 542971 546804 549520 549838 547524 543465 538882 534696 531284 528276
51708 528276 524741 520079 514806 510030 506258 503160 500447 498361 497113 496451 496032 495841 495918 495968 495522 494217
51692 494217 491808 488315 484410 481285 479681 479207 478916 478294 477300 475786 473495 470677 468162 466552 465673
51677 465673 465053 464720 465295 467361 470864 475098 479193 482632 485392 487716 489945 492619 496505 502195 509669
51662 509669 518475 528297 539087 550507 561466 570478 576452 579080 578562 575162 569177 561328 553030 545994
51648 545994 541347 539168 538935 540270 542990 546576 550037 552490 553527 552819 549715 543672 535010 524881
51634 524881 514429 504180 494151 484238 474515 465465 457901 452353 448498 445525 443081 441439 440640 440083
51620 440083 439281 438494 438035 437357 435557 432644 429615 427210 425249 423334 421479 419716 417633 414905 412030
51605 412030 410036 409512 410229 411573 413076 414636 416578 419468 423586 428550 433689 438828 444524 451474 459789
51590 459789 468876 477979 486717 495040 502651 508640 511934 512107 509615 505416 500724 497043 495700 496954
51576 496954 499913 503729 508557 515056 523355 533047 543952 556217 569769 584260 599643 616257 634212
51563 634212 653172 672947 693884 716412 740496 765833 792376 820333 849630 879509 908662
51552 908662 935672 959347 978614 992240 998940 998008 989756 975226 955720 932766 908061 882834
51540 882834 857370 831618 806073 781466 757710 734033 710326 687579 666508 646540 626854
51529 626854 607932 591242 577483 565848 555086 544694 534882 525845 517494 509765 502894 497307 493272
51516 493272 490611 488721 486838 484362 481077 477254 473498 470317 467748 465498 463353 461312 459342 457336
51502 457336 455329 453553 452218 451467 451575 452822 455046 457636 460107 462437 464752 467007 469122 471042 472472
51487 472472 472934 472429 471697 471437 471512 471272 470320 468505 465479 460954 455416 450015 445559 441950 438681 435557
51471 435557 432726 430303 428171 426091 423874 421424 418648 415432 411907 408701 406597 405776 405702 405901 406443
51456 406443 407322 407866 407426 406456 406197 407298 409339 411775 414704 418500 423228 428797 435356 443138 452060
51441 452060 461703 471635 481690 492053 502976 514116 524217 531819 536430 538670 539207 538039 535033
51428 535033 530658 525656 520241 514056 506839 498801 490369 481912 473763 466230 459518 453710 448876 445064
51414 445064 442179 439962 438153 436699 435849 435989 437284 439422 441838 444212 446605 449117 451624 454060 456774
51399 456774 460328 464867 469846 474549 478911 483738 490012 497956 506911 516136 525548 535597 546691 559027
51385 559027 572843 588430 605894 625256 646901 671671 700335 733064 769395 808544 849706
51374 849706 892238 935573 978794 1020380 1058524 1091523 1117533 1134168 1139069 1131207 1111412 1081600
51362 1081600 1043905 1000594 954106 906605 859590 814090 770858 730174 691900 656179 623852
51351 623852 595903 572728 554130 539506 527629 516807 506043 495960 487945 482392 478223 474014
51339 474014 469043 463380 457559 452310 448047 444403 440576 436186 431526 427023 422942 419550 417020 415000
51325 415000 412823 410358 408178 406733 405815 405154 404938 405306 405746 405630 405152 405155 406067 407479 408891 410474 412843
51308 412843 416196 419854 422731 424339 425258 426436 428048 429316 429556 429065 428693 428849 429215 429221 428404 426489 423623
51291 423623 420556 418153 416626 415548 414652 414256 414712 415793 416962 418139 419936 423093 427787 433467 439235
51276 439235 444359 448546 451906 454754 457379 459807 461714 462722 462853 462506 461905 460902 459577 458698 459003
51261 459003 460138 460968 461061 461222 462166 463205 462945 461070 458768 457291 456591 455590 453426 450172 446573 443379
51245 443379 440872 438806 436760 434663 432964 432207 432449 433137 433558 433335 432492 431153 429338 427083 424631 422340
51229 422340 420381 418643 416993 415485 414247 413257 412340 411328 410212 409251 408968 409797 411560 413460 414774
51214 414774 415442 415861 416438 417649 420163 424233 428977 432917 435426 437181 439105 441500 444469 448405 453342
51199 453342 458287 462041 464550 466768 469205 471286 472230 471884 470501 468286 465527 462732 460199 457802 455521
51184 455521 453937 453708 454722 456150 457297 458046 458452 458276 457174 455172 452772 450546 448724 447232 446054
51169 446054 445358 445168 445079 444518 443295 441690 440115 438953 438676 439652 441669 443997 446183 448454 451076 453629
51153 453629 455406 456402 457401 458964 460725 461953 462602 463430 465005 466834 467795 467427 466439 465732 465198 463947
51137 463947 461621 458934 456834 455646 455248 455543 456325 457127 457700 458428 459761 461410 462620 463171 463607 464490
51121 464490 465900 467666 469690 471868 474075 476366 478901 481585 484004 485796 486858 487225 487038 486743 486944
51106 486944 487927 489464 491153 492722 493973 494770 495213 495634 496297 497267 498592 500328 502317 504198 505741 507000
51090 507000 508039 508746 508977 508691 507990 507263 507204 508293 510178 512017 513487 515000 516815 518514 519684 520602
51074 520602 521783 523243 524682 526168 528142 530923 534614 539294 544922 551235 558203 566412 576442 588008
51060 588008 600253 612914 626623 641956 658711 676259 694060 711487 727547 741246 752088
51049 752088 759984 765024 767708 769221 770902 773294 775950 778182 779656 780140 779060 775786 770361 763587
51035 763587 756281 748662 740666 732661 725493 719785 715310 711099 706011 699330 691146 682362 674211 667601
51021 667601 662959 660586 660783 663456 667871 673170 679120 686157 694717 704603 714943 724651 732983 739844
51007 739844 745530 750177 753557 755434 755905 755254 753700 751445 748783 745923 742889 739808 737137 735285 734122
50992 734122 733247 732763 733488 736298 741401 748306 756370 765367 775615 787544 801145 816023 832067 849778
50978 849778 869696 891723 915398 940727 968287 998479 1031028 1065321 1100951 1137855 1176222
50967 1176222 1216489 1259369 1305737 1356414 1411927 1472279 1537034 1605740 1678230 1754337 1833435
50956 1833435 1914440 1996071 2076856 2155092 2229197 2298110 2361034 2416904 2464559 2503534 2534316
50945 2534316 2557730 2574328 2584372 2588133 2586137 2579490 2569999 2559590 2549347 2539212 2528527 2516547
50933 2516547 2502524 2485850 2466409 2444503 2420355 2393884 2364899 2333121 2298003 2258975 2216029
50922 2216029 2169602 2119830 2066448 2009548 1949895 1888276 1825163 1761373 1698448 1637871 1580327
50911 1580327 1526092 1475600 1429045 1385921 1345679 1308538 1274951 1244521 1216236 1189708 1165401
50900 1165401 1143603 1123846 1105531 1088568 1073213 1059751 1048552 1040002 1033994 1029740 1026273 1023054
50888 1023054 1020063 1017594 1016049 1015726 1016593 1018340 1020630 1023268 1026247 1029854 1034600 1040834 1048544 1057696
50874 1057696 1068501 1081018 1094759 1109190 1124495 1141288 1159707 1179404 1200417 1223387 1248682
50863 1248682 1275996 1305103 1336480 1370755 1407992 1448027 1491250 1538673 1591429 1650554 1717032
50852 1717032 1791602 1874635 1966565 2068311 2180866 2304375 2437971 2580651 2732149 2892798
50842 2892798 3062530 3240029 3422837 3608216 3793772 3977204 4155616 4325374 4482563
50833 4482563 4623386 4744266 4842232 4915627 4964368 4989435 4992450 4975865 4943121 4898066 4844204
50822 4844204 4784686 4722780 4661934 4605250 4554886 4511752 4475419 4444342 4416297 4388585 4357846
50811 4357846 4320131 4271768 4210369 4135013 4045597 3942290 3825582 3696601 3557263 3410083
50801 3410083 3257741 3102747 2947562 2794992 2648096 2509453 2380641 2262469 2155346
50792 2155346 2059134 1973061 1896345 1828833 1770617 1721080 1678756 1642109 1610104 1582127 1557938
50781 1557938 1537739 1521700 1509099 1498374 1488302 1478741 1469985 1461894 1454107 1446721 1439996 1433453 1425964
50768 1425964 1416917 1406819 1396500 1386064 1375007 1363092 1350681 1338284 1326192 1314632 1303903
50757 1303903 1294116 1285026 1276439 1268700 1262491 1258199 1255826 1255607 1258280 1264471 1274094 1286758 1302550 1321941
50743 1321941 1344921 1370780 1399008 1430076 1465084 1504885 1549714 1599361 1653358 1711253 1773174
50732 1773174 1840062 1912893 1991590 2075006 2162005 2252230 2345687 2441962 2540034 2638422 2735187
50721 2735187 2828109 2915394 2996204 3070082 3135908 3191767 3235778 3266512 3282590 3282712 3266734 3236487
50709 3236487 3194944 3144796 3088296 3028296 2968549 2912597 2862760 2820353 2786202 2760329 2741406
50698 2741406 2727217 2715737 2705451 2694712 2681245 2662383 2635531 2598460 2549756 2489374 2418712
50687 2418712 2340030 2255864 2168832 2081412 1995544 1912636 1834075 1761430 1695788 1637147 1584882
50676 1584882 1538738 1499100 1466417 1440728 1421662 1408500 1400231 1395940 1395192 1397812 1403313 1410938 1420222
50663 1420222 1431023 1442995 1455623 1468978 1483759 1500109 1516969 1533252 1549295 1566505 1585763
50652 1585763 1606874 1629406 1653369 1678971 1706392 1735914 1767678 1801240 1836000 1872300 1911467
50641 1911467 1954469 2001111 2050844 2103657 2159635 2218207 2278490 2339965 2402165 2464086 2524608
50630 2524608 2583277 2639952 2693943 2744329 2791063 2834853 2875831 2913177 2946265 2975270 3000015
50619 3000015 3018790 3028985 3028686 3017415 2995951 2966353 2932140 2897609 2866358 2840309 2819938 2805004
50607 2805004 2794844 2788270 2783712 2779749 2775401 2769675 2760875 2746651 2724828 2693976 2653239 2602317
50595 2602317 2542051 2474469 2401516 2323999 2242450 2158744 2075773 1995462 1917993 1843216 1771821
50584 1771821 1704717 1642196 1584458 1532179 1485678 1444062 1406156 1372001 1342589 1318263 1298239
50573 1298239 1281701 1268581 1259123 1253342 1251129 1252443 1257178 1265135 1276148 1289914 1305745 1322909
50561 1322909 1341268 1361159 1382543 1404650 1426635 1448313 1470129 1492670 1516286 1540986 1566557
50550 1566557 1592821 1619721 1647096 1674628 1702137 1729666 1757037 1783693 1809448 1835157 1862227
50539 1862227 1891738 1924441 1961166 2002395 2047648 2096195 2148439 2205893 2269738 2340124 2416908
50528 2416908 2500181 2589807 2685386 2787138 2896136 3013077 3137316 3267456 3402278 3540580
50518 3540580 3680572 3819938 3956044 4085738 4205549 4312717 4405636 4482775 4541758 4580246
50508 4580246 4597457 4594151 4571462 4530475 4472685 4400092 4314894 4219683 4117961 4013845 3911337
50497 3911337 3814242 3726476 3651600 3591932 3548497 3521586 3510635 3513786 3528427 3552235 3582841
50486 3582841 3616375 3647310 3670170 3680787 3675756 3651834 3606842 3540733 3455135 3352263 3234871
50475 3234871 3106817 2972675 2836520 2701296 2569072 2441333 2319146 2203646 2096404
50466 2096404 1998814 1911034 1831947 1760399 1696157 1639559 1590616 1548738 1513182 1483459 1459334
50455 1459334 1440625 1427117 1418666 1415265 1416840 1422835 1432197 1444054 1458417 1475954 1497053 1521315
50443 1521315 1548024 1576780 1607430 1639632 1672845 1706613 1740406 1773017 1802512 1827083 1845852
50432 1845852 1858677 1865464 1866157 1861445 1852991 1842697 1831869 1821227 1811328 1802623 1795238 1789197 1784951
50419 1784951 1783420 1785391 1791114 1800556 1813852 1831358 1853413 1880276 1912258 1949755 1993078 2042204
50407 2042204 2096676 2155730 2218484 2283960 2350899 2417806 2483432 2547069 2608135 2665499 2717597
50396 2717597 2763205 2801666 2832218 2853455 2863802 2862224 2848183 2821220 2781198 2728981 2666468
50385 2666468 2595904 2519511 2439842 2359994 2283046 2211366 2146616 2090191 2043297 2006662 1980461
50374 1980461 1964477 1958041 1959733 1967519 1979443 1994034 2009761 2024254 2034514 2038030 2033528 2020573
50362 2020573 1998962 1968939 1931818 1889776 1844894 1798642 1752280 1707066 1663569 1621059 1578151
50351 1578151 1534037 1488704 1442178 1394305 1345654 1298054 1253629 1213365 1176951 1143958 1114737
50340 1114737 1090158 1070814 1056562 1046529 1039429 1034181 1030495 1028782 1029346 1031806 1035396 1039664 1044618
50327 1044618 1050395 1057013 1064396 1072332 1080458 1088574 1097033 1106545 1117445 1129297 1141344 1153231 1165254
50314 1165254 1177993 1191801 1206435 1221030 1234560 1246469 1256878 1266216 1274838 1283116 1291747 1301820
50302 1301820 1314614 1331322 1352710 1378900 1409670 1445114 1485756 1531666 1581518 1632660 1681703
50291 1681703 1724481 1755586 1769091 1761013 1731665 1685767 1630205 1571331 1513546 1459411 1410340
50280 1410340 1367010 1329368 1296773 1268619 1244916 1226142 1212519 1203630 1198707 1197063 1198116 1201263
50268 1201263 1206037 1212370 1220497 1230540 1242221 1254978 1268300 1282041 1296402 1311502 1326934 1341895
50256 1341895 1355880 1369075 1381955 1394621 1406758 1418062 1428376 1437404 1444562 1449171 1450661 1448620
50244 1448620 1442931 1433923 1422165 1408127 1392382 1376200 1361443 1349459 1340287 1333229 1327842 1323895
50232 1323895 1320596 1316552 1310607 1302221 1291045 1276843 1260192 1242644 1225636 1209536 1194157 1179708
50220 1179708 1166558 1154276 1141821 1128727 1115487 1102561 1089692 1076527 1063414 1051103 1039886
50209 1039886 1029413 1019199 1009092 999366 990465 982444 974609 966061 956783 947766 939771 932391 924714
50196 924714 916558 908503 900971 893823 886809 879877 873104 866680 860999 856310 852355 848715 845397 842684
50182 842684 840491 838438 836489 834904 833494 831635 829204 826836 824859 822612 819408 815748 812944 811682
50168 811682 811420 811087 809935 807835 805216 802835 801290 800652 800701 801449 803219 806328 810906 816987 824498 833176
50152 833176 842717 853117 864795 878395 894490 913271 934321 956809 980091 1004107 1029084 1054970
50140 1054970 1081290 1107410 1132731 1156862 1179951 1202741 1225958 1249557 1272715 1294395 1313564
50129 1313564 1328932 1339001 1342628 1339446 1329691 1313976 1293286 1268869 1241880 1213302 1184308 1156375
50117 1156375 1130683 1107546 1086732 1068221 1052270 1038737 1026793 1015528 1004663 994479 985292
50106 985292 977266 970641 965767 962794 961498 961434 962008 962341 961491 959168 956027 952841 949487 945201 939843
50091 939843 934295 929395 924978 920448 915934 912284 909995 908801 908408 909014 910744 912940 914622 915612 916851
50076 916851 919428 923525 928526 933946 940004 947186 955535 964541 973633 982601 991503 1000389 1009193 1017780
50062 1017780 1025995 1033667 1040578 1046416 1050866 1053857 1055633 1056408 1056047 1054372 1051726 1048839 1046034 1042944
50048 1042944 1039242 1035312 1031886 1029236 1027094 1025238 1023889 1023553 1024745 1027794 1032680 1039139 1047064 1056677
50034 1056677 1068138 1081230 1095732 1111881 1130066 1150208 1171875 1194951 1219691 1246027 1273243
50023 1273243 1300408 1326786 1351754 1374734 1395452 1413948 1430144 1443696 1454461 1462788 1469031 1472900
50011 1472900 1473480 1469751 1460909 1446443 1426280 1400944 1371484 1339168 1305149 1270258 1235057 1200301
49999 1200301 1167342 1137817 1112752 1092154 1075538 1062565 1052957 1046007 1040539 1035387 1029815 1023604
49987 1023604 1016892 1009848 1002288 993638 983411 971702 959071 945964 932324 917868 902712 887638
49975 887638 873591 860863 849027 837819 827824 819867 813883 808934 804329 800149 796502 792938 789028
49962 789028 785096 781865 779606 778029 776775 775666 774766 774647 776287 780143 785449 790989 796429 802338 809003
49947 809003 815973 822818 829570 836043 841360 844678 846111 846465 846250 845246 842869 838659 832538 824941 816719
49932 816719 808675 801125 793815 786171 777612 767898 757395 746918 737234 728800 721849 716430 712268 708930
49918 708930 706306 704625 703878 703631 703709 704682 707174 710955 715175 719351 723641 728270 733299 738984 745796
49903 745796 753827 762557 771512 780791 790752 801428 812399 822980 832292 839547 844627 848227 851075
49890 851075 853074 853475 851661 847468 840921 832132 821552 809956 798001 786002 774138 762653 751818
49877 751818 741940 733453 726663 721314 716708 712477 708991 706812 705992 706159 707070 708748 711189 714238 717755
49862 717755 721668 725973 730897 736946 744457 753091 762077 770933 779675 788426 797252 806460 816408 826655
49848 826655 835673 841989 845521 847506 849207 851009 852520 852991 851564 847661 841473 833843 825466 816401
49834 816401 806543 796299 786484 777697 770187 764172 759875 757073 755058 753319 752131 752143 753488 755666
49820 755666 758346 761936 767072 773742 781186 788622 795805 802866 809935 817020 823992 830473 835952 840217
49806 840217 843558 846258 848014 848190 846605 843758 840253 836366 832250 828017 823345 817435 809896 801473
49792 801473 793320 785623 777477 768211 758306 748781 740253 732994 727396 723670 721274 719331 717702 717070
49778 717070 717784 719200 720598 722298 725232 729566 734361 738798 743220 748648 755561 763636 772498 782102
49764 782102 792114 801379 808590 813404 816492 818497 819468 819453 818997 818469 817268 814404 809769 804182 798184
49749 798184 791548 784205 776947 770687 765529 761099 757446 754956 753581 752737 751980 751347 751012 751008 751329 752059
49733 752059 753393 755691 759303 764087 769383 774801 780709 787381 794072 799753 804640 810085 816928 824828
49719 824828 833443 843247 854706 867380 880456 893489 906040 917179 926132 932989 938068 940949 940825
49706 940825 937488 931237 922226 910835 898577 887713 879697 874525 871570 870353 870465 871422 872829 874161
49692 874161 874408 872666 869332 866106 864519 864858 866626 869421 873115 877759 883658 891017 899316 907669 916143
49677 916143 926016 938363 953053 969685 988608 1010025 1032589 1053973 1072619 1087921 1098876 1103888
49665 1103888 1102486 1096393 1088376 1080536 1074087 1070019 1068997 1070651 1073645 1076687 1079175 1080704 1080116 1075371
49651 1075371 1064599 1047491 1025713 1001977 978733 957542 939187 923811 911007 900260 891533
49640 891533 885238 881593 880270 880685 882320 884598 886794 888286 888749 887979 885772 882127 877295 871415 864384
49625 864384 856359 848117 840560 833989 828211 823190 819107 815819 812739 809454 806153 803323 801295 800240
49611 800240 800288 801412 803330 805725 808425 811202 813657 815567 817254 819279 821744 824165 826037 827341 828414
49596 828414 829506 830569 831417 832010 832584 833443 834572 835585 836178 836499 836803 836948 836618 836010 835778 836108 836362
49579 836362 836032 835705 836563 839059 842541 846124 849493 852822 856392 860496 865407 871219 877900 885606 894645
49564 894645 904945 915741 926015 935160 943173 950404 957204 963569 968861 972022 972330 969944 965688 960482
49550 960482 955064 950023 945723 942238 939526 937633 936612 936394 936896 938173 940241 942843 945627 948509 951586
49535 951586 954738 957587 959950 962191 965063 969271 975121 982476 991139 1001448 1014355 1030670 1050315
49522 1050315 1072586 1096987 1123333 1151010 1178639 1204626 1227621 1246266 1259098 1265372 1265913 1262766
49510 1262766 1258085 1253598 1250761 1250571 1252866 1256244 1258985 1259969 1258566 1254047 1245517 1232440 1214989 1193983
49496 1193983 1170781 1147144 1124832 1104972 1087804 1072998 1060131 1048917 1039259 1031331 1025467 1021780
49484 1021780 1019865 1018956 1018360 1017760 1017206 1016950 1017172 1017741 1018313 1018817 1019687 1021387 1023787 1026258 1028373 1030243
49468 1030243 1032231 1034727 1038201 1042955 1048584 1054114 1059021 1063812 1069282 1075502 1081947 1088284 1094419 1099921
49454 1099921 1104076 1106631 1107938 1108207 1107132 1104473 1100560 1095893 1090609 1084757 1078822 1073521 1069170 1065549
49440 1065549 1062417 1059901 1058363 1058047 1058863 1060503 1062835 1066218 1071229 1078029 1086258 1095686 1106676 1119682
49426 1119682 1134551 1150642 1167530 1185222 1203735 1222754 1241711 1259941 1276868 1292319 1306593
49415 1306593 1319650 1330095 1335426 1333879 1326114 1314993 1303850 1295043 1289756 1288448 1291073 1297067 1305586
49402 1305586 1316017 1328129 1341649 1355851 1369872 1383417 1396868 1410535 1424000 1436389 1447162
49391 1447162 1456442 1464633 1471862 1477666 1481056 1481090 1477656 1471684 1464345 1456131 1446922 1436754 1426103 1415403
49377 1415403 1404843 1394820 1386138 1379371 1374317 1370525 1368223 1368294 1371232 1376471 1382917 1389856 1397062 1404086
49363 1404086 1409861 1413284 1414068 1412742 1409857 1405548 1399956 1393572 1386750 1379128 1370119 1359940 1349699 1340401
49349 1340401 1332280 1325137 1318852 1313342 1308495 1304418 1301441 1299525 1297978 1295984 1293156 1289410 1284772 1279735
49335 1279735 1275340 1272298 1270314 1268869 1268420 1270114 1274377 1280550 1287936 1296404 1305610 1314308 1320890 1324270
49321 1324270 1324029 1320205 1313461 1305077 1296233 1287353 1278415 1269596 1261201 1253152 1244992 1236379 1227320 1218070
49307 1218070 1209164 1201439 1195601 1191762 1189601 1188877 1189431 1190817 1192415 1194016 1195924 1198362 1201063 1203500
49293 1203500 1205225 1205904 1205373 1203860 1201903 1199816 1197343 1193925 1189112 1182712 1174886 1166330 1158090 1150872
49279 1150872 1144607 1138864 1133560 1129094 1125973 1124554 1125016 1127271 1130895 1135327 1140151 1145123 1150003 1154544
49265 1154544 1158536 1161673 1163503 1163732 1162592 1160717 1158766 1157367 1157270 1159138 1163163 1169207 1177416 1188389
49251 1188389 1202582 1219702 1238732 1258247 1276601 1292184 1303846 1310979 1313102 1309737 1301060 1288371
49239 1288371 1273460 1257572 1241440 1226170 1213403 1204280 1198593 1195310 1193668 1193545 1195088 1198490 1204014
49226 1204014 1211679 1220815 1230339 1239755 1249569 1260426 1272017 1283291 1293735 1304028 1315239 1327708
49214 1327708 1340951 1354365 1367513 1379823 1390675 1400139 1409256 1419171 1430217 1442196 1455329 1470247
49202 1470247 1486998 1504677 1522393 1540091 1558053 1576006 1593334 1609886 1625892 1641142 1655009
49191 1655009 1667516 1679653 1692171 1704554 1715748 1725555 1734673 1743595 1752210 1760598 1769514 1779767
49179 1779767 1791631 1805208 1821011 1839742 1861760 1887201 1916458 1950077 1988166 2030311 2076081
49168 2076081 2125198 2176941 2229488 2279929 2324833 2361089 2386837 2402096 2408457 2408091 2403102 2395711
49156 2395711 2388426 2383347 2381101 2380694 2380608 2380133 2379805 2380692 2383352 2387522 2392864 2399804 2409250 2421391 2435226
49141 2435226 2449647 2464667 2481167 2499592 2519362 2539567 2559674 2579506 2599070 2618687 2638947
49130 2638947 2660153 2681991 2703939 2725752 2747339 2768538 2789472 2810924 2833783 2858134 2883341
49119 2883341 2909241 2936786 2967264 3001194 3038406 3079180 3124961 3177814 3239374 3310526 3392115
49108 3392115 3485853 3594332 3720020 3864060 4025828 4203187 4392581 4588460 4782877 4966811
49098 4966811 5133472 5281079 5411488 5524142 5610253 5653807 5640584 5568396 5449746 5304591
49088 5304591 5149205 4989619 4823448 4647252 4463123 4279658 4107494 3953935 3821178
49079 3821178 3708324 3613880 3536250 3473094 3421428 3378585 3342725 3312498 3286582 3263679 3242741
49068 3242741 3223138 3204680 3187470 3171598 3156927 3143196 3130168 3117635 3105437 3093643 3082540
49057 3082540 3072239 3062393 3052535 3042641 3033183 3024767 3017879 3012789 3009340 3006934 3005057 3003780 3003301 3003046
49043 3003046 3001673 2998134 2992397 2985048 2976670 2967939 2959855 2953388 2949002 2946864 2947233 2950169 2955007 2960711
49029 2960711 2966907 2974093 2982639 2991939 3000743 3008066 3013517 3017028 3018732 3019084 3018755 3018272 3017871 3017675 3017850
49014 3017850 3018556 3019890 3021939 3024712 3027980 3031338 3034608 3038034 3041920 3046158 3050306 3054126 3057781 3061403
49000 3061403 3064680 3067141 3068761 3069988 3071106 3071792 3071535 3070414 3069156 3068327 3067613 3066079 3063058 3058623 3053227
48985 3053227 3047169 3040542 3033499 3026287 3019054 3011820 3004623 2997490 2990262 2982668 2974627 2966249 2957500 2948155
48971 2948155 2938265 2928335 2918694 2908927 2898400 2887341 2876930 2868229 2861430 2856369 2853364 2853143 2856078
48958 2856078 2861921 2870239 2880829 2893706 2908994 2926882 2947380 2969951 2993658 3017905 3042931 3069338
48946 3069338 3097224 3126032 3155214 3184713 3214623 3244604 3273937 3302165 3329570 3357084 3385855
48935 3385855 3416745 3449904 3484765 3520735 3558035 3597601 3639962 3684535 3730434 3777847 3828055
48924 3828055 3881996 3939162 3998206 4058268 4119443 4182185 4246689 4312834 4380262 4448344 4516256
48913 4516256 4583346 4649414 4714617 4779168 4843090 4906122 4967732 5027366 5084811 5140290 5194091
48902 5194091 5246088 5295642 5341871 5383981 5421554 5454754 5484217 5510444 5533220 5551825 5565933
48891 5565933 5576138 5583463 5588486 5591109 5591020 5588084 5582292 5573638 5562182 5548096 5531531 5512491 5490847
48878 5490847 5466362 5438735 5407778 5373588 5336401 5296394 5253860 5209514 5164131 5117676 5069191
48867 5069191 5017881 4964049 4908696 4852549 4796035 4739916 4685250 4632613 4581946 4533258 4486866
48856 4486866 4442678 4399835 4357678 4316742 4278220 4242531 4208956 4176744 4146035 4117465 4091276
48845 4091276 4067266 4045442 4026218 4009870 3996215 3985073 3976794 3971818 3969769 3969484 3970232 3972546 3977542
$$ [...]
##END NTUPLES=NMR SPECTRUM
##END=
