##TITLE=AC1500_CRIANN13307_8125335_qdL5fto03a
##JCAMPDX= 6.0         $$ Bruker NMR JCAMP-DX V2.0
##DATA TYPE= NMR SPECTRUM
##DATA CLASS= NTUPLES
##ORIGIN= BRUKER
##OWNER= Administrator
$$ 1.72 TOPSPIN		Version 2.1
$$ 2013-08-15 19:10:24.364 -0700  Administrator@X
$$ Compression mode = diff/dup
##.OBSERVE FREQUENCY= 400.02188249412
##.OBSERVE NUCLEUS= ^1H
##.ACQUISITION MODE= SIMULTANEOUS (DQD)
##.ACQUISITION SCHEME= undefined
##.AVERAGES= 8
##.DIGITISER RES= 22
##SPECTROMETER/DATA SYSTEM= spect
##.PULSE SEQUENCE= zg30
##.SOLVENT NAME= COFFEE_meoh
##.SHIFT REFERENCE= INTERNAL, COFFEE_meoh, 1, 14.98509
##AUDIT TRAIL= $$ (NUMBER, WHEN, WHO, WHERE, PROCESS, VERSION, WHAT)
$$ ##TITLE= Audit trail, TOPSPIN		Version 2.1
$$ ##JCAMPDX= 5.01
$$ ##ORIGIN= Bruker BioSpin GmbH
$$ ##OWNER= Administrator
$$ $$ E:\/data/COFFEE/nmr/AC1500_CRIANN13307_8125335_qdL5fto03a/10/pdata/1/auditp.txt
$$ ##AUDIT TRAIL=  $$ (NUMBER, WHEN, WHO, WHERE, PROCESS, VERSION, WHAT)
(   1,<2013-08-15 19:10:17.400 -0700>,<Administrator>,<X>,<go>,<TOPSPIN 2.1>,
      <created by zg
	started at 2013-08-15 19:09:11.228 -0700,
	POWCHK enabled, PULCHK disabled,
       configuration hash MD5:
       C8 4E 4E 5D D3 5C D8 9E 9F 52 82 E0 59 8A DE 15
       data hash MD5: 64K
       C9 2E 3F 9D AE DF 8F CE E1 5C 8C 8E AD DF A2 31>)
(   2,<2013-08-15 19:10:20.384 -0700>,<Administrator>,<X>,<proc1d>,<TOPSPIN 2.1>,
      <Start of raw data processing
       efp LB = 0 FT_mod = 6 PKNL = 1 PHC0 = 0 PHC1 = 0 SI = 32K 
       data hash MD5: 32K
       69 35 83 15 49 AD CF 0F 69 2E 89 F2 7F CD 79 4E>)
(   3,<2013-08-15 19:10:20.759 -0700>,<Administrator>,<X>,<proc1d>,<TOPSPIN 2.1>,
      <pk PHC0 = 100.2502 PHC1 = 0 
       data hash MD5: 32K
       BC B0 EA 32 6F 62 C0 73 19 9F 6D 12 B5 30 A6 97>)
(   4,<2013-08-15 19:10:20.931 -0700>,<Administrator>,<X>,<proc1d>,<TOPSPIN 2.1>,
      <abs ABSG = 1 
       data hash MD5: 32K
       C9 90 08 5F 03 A2 23 68 16 71 8E 37 3C 5A D7 DC>)
(   5,<2013-08-15 19:10:20.994 -0700>,<Administrator>,<X>,<proc1d>,<TOPSPIN 2.1>,
      <abs ABSG = 2 
       data hash MD5: 32K
       40 B1 FB 72 C0 91 17 05 89 D4 1C 41 09 E3 B9 3D>)
(   6,<2013-08-15 19:10:21.072 -0700>,<Administrator>,<X>,<proc1d>,<TOPSPIN 2.1>,
      <abs ABSG = 3 
       data hash MD5: 32K
       BD D1 B1 7D 1F C6 89 2A 24 0A 68 AE F3 6F 23 0A>)
(   7,<2013-08-15 19:10:21.150 -0700>,<Administrator>,<X>,<proc1d>,<TOPSPIN 2.1>,
      <abs ABSG = 4 
       data hash MD5: 32K
       3D EC 7C F3 04 65 D3 B6 79 6A E0 64 18 B4 77 ED>)
(   8,<2013-08-15 19:10:21.212 -0700>,<Administrator>,<X>,<proc1d>,<TOPSPIN 2.1>,
      <abs ABSG = 5 
       data hash MD5: 32K
       D9 A6 E3 54 59 2A 23 B9 E4 6E CB DE 82 2E 2A B2>)
$$ ##END=
$$ 
$$ $$ hash MD5
$$ $$ CD 97 CE 32 A1 0E B3 60 D4 F2 9E F6 E8 B5 CC 7D
##$RELAX= 
##$RELAX= 
##$RELAX= 
##$RELAX= 
##$RELAX= 
##$RELAX= 
##$RELAX= 
$$ Bruker specific parameters
$$ --------------------------
##$DU= <E:\>
##$EXPNO= 10
##$NAME= <AC1500_CRIANN13307_8125335_qdL5fto03a>
$$ [...]
##$TP= (0..7)
150 150 150 150 150 150 150 150
##$TP07= 0
##$TPNAME0= <>
##$TPNAME1= <>
##$TPNAME2= <>
##$TPNAME3= <>
##$TPNAME4= <>
##$TPNAME5= <>
##$TPNAME6= <>
##$TPNAME7= <>
##$TPOAL= (0..7)
0.5 0.5 0.5 0.5 0.5 0.5 0.5 0.5
##$TPOFFS= (0..7)
0 0 0 0 0 0 0 0
##$TUNHIN= 0
##$TUNHOUT= 0
##$TUNXOUT= 0
##$USERA1= <user>
##$USERA2= <user>
##$USERA3= <user>
##$USERA4= <user>
##$USERA5= <user>
##$V9= 5
##$VALIST= <valist>
##$VCLIST= <CCCCCCCCCCCCCCC>
##$VD= 0
##$VDLIST= <DDDDDDDDDDDDDDD>
##$VPLIST= <PPPPPPPPPPPPPPP>
##$VTLIST= <TTTTTTTTTTTTTTT>
##$WBST= 1024
##$WBSW= 4
##$XGAIN= (0..3)
0 0 0 0
##$XL= 0
##$YL= 0
##$YMAX_a= 649324
##$YMIN_a= -553886
##$ZGOPTNS= <>
##$ZL1= 120
##$ZL2= 120
##$ZL3= 120
##$ZL4= 120
##$ABSF1= 14.98509
##$ABSF2= -5.573092
##$ABSG= 5
##$ABSL= 3
##$ALPHA= 0
##$AQORDER= 0
##$ASSFAC= 0
##$ASSFACI= 0
##$ASSFACX= 0
##$ASSWID= 0
##$AUNMP= <proc_prof1d_extract_pilot.lims>
##$AXLEFT= 0
##$AXNAME= <>
##$AXNUC= <1H>
##$AXRIGHT= 0
##$AXTYPE= 0
##$AXUNIT= <>
##$AZFE= 0.1
##$AZFW= 0.1
##$BCFW= 0
##$BC_mod= 0
##$BYTORDP= 0
##$COROFFS= 0
##$CY= 15
##$DATMOD= 1
##$DC= 0
##$DFILT= <>
##$DTYPP= 0
##$F1P= 0
##$F2P= 0
##$FCOR= 0.5
##$FTSIZE= 32768
##$FT_mod= 6
##$GAMMA= 0
##$GB= 0
##$INTBC= 1
##$INTSCL= 1
##$ISEN= 128
##$LB= 0
##$LEV0= 0
##$LPBIN= 0
##$MAXI= 10000
##$MC2= 0
##$MEAN= 0
##$ME_mod= 0
##$MI= 0
##$NCOEF= 0
##$NC_proc= -8
##$NLEV= 6
##$NOISF1= 0
##$NOISF2= 0
##$NSP= 0
##$NTH_PI= 0
##$NZP= 0
##$OFFSET= 14.98509
##$PC= 1
##$PHC0= 100.2502
##$PHC1= 0
##$PH_mod= 1
##$PKNL= yes
##$PPARMOD= 0
##$PPDIAG= 0
##$PPIPTYP= 0
##$PPMPNUM= 2147483647
##$PPRESOL= 1
##$PSCAL= 4
##$PSIGN= 0
##$PYNMP= <proc.py>
##$REVERSE= no
##$SF= 400.02
##$SI= 32768
##$SIGF1= 0
##$SIGF2= 0
##$SINO= 400
##$SIOLD= 32768
##$SPECTYP= <>
##$SREGLST= <1H.CDCl3>
##$SSB= 0
##$STSI= 32768
##$STSR= 0
##$SW_p= 8223.68421052631
##$SYMM= 0
##$S_DEV= 0
##$TDeff= 65536
##$TDoff= 0
##$TI= <>
##$TILT= no
##$TM1= 0
##$TM2= 0
##$TOPLEV= 0
##$USERP1= <user>
##$USERP2= <user>
##$USERP3= <user>
##$USERP4= <user>
##$USERP5= <user>
##$WDW= 1
##$XDIM= 32768
##$YMAX_p= 448536119
##$YMIN_p= -714780
##$CURPLOT= <Network HP LaserJet P1505>
##$CURPRIN= <$Network HP LaserJet P1505>
##$DFORMAT= <normdp>
##$LAYOUT= <+/1D_H.xwp>
##$LFORMAT= <normlp>
##$PFORMAT= <normpl>
##$SURQMSG= 1
$$ End of Bruker specific parameters
$$ ---------------------------------
##NTUPLES= NMR SPECTRUM
##VAR_NAME=  FREQUENCY,     SPECTRUM/REAL,   SPECTRUM/IMAG
##SYMBOL=    X,             R,               I
##VAR_TYPE=  INDEPENDENT,   DEPENDENT,       DEPENDENT
##VAR_FORM=  AFFN,          ASDF,            ASDF
##VAR_DIM=   32768,         32768,           32768
##UNITS=     HZ,            ARBITRARY UNITS, ARBITRARY UNITS
##FACTOR=    0.250966925370066, 1,           1
##FIRST=     8223.43324360094, -160754,      -246
##LAST=      0,             -77093,          -42926
##MIN=       0,             -714780,         0
##MAX=       8223.43324360094, 448536119,    0
$$ Real data points
##PAGE= N=1
##DATA TABLE= (X++(R..R)), XYDATA
$$ [...]
19546c8264q1453H548J96153C4686i0073j47007B9772a78513l7520c0506l784
19535c4290H7253B1387P1342j0916a7069D7209c74626d2274l17753a00942l6620
19524a37562E6190a33684A70561H608h0541m4464L8423k18804k6483J48008C6282
19512i391B81535a3736k14508F5575a84184G3622c81644B25993a16220j03199
19502b19419N9035o3406c6292j14625I5546f6130H5225a87393C6617b9367o556
19491c5923j13607k2479j12716a37772J8394l7485I3916A4804b70541f7420A27507
19479h9598A5270a98507d083E7732L3729b21487R4855B30156m2245f7077j41704
19468b08781A24248b60523b886o8311c4945A03583f2504l62152a02750a5421l8562
$$ plain form
19546 -38264 -119717 8548 204701 34686 -90073 -237080 29772 -178513 -216033 -30506 -34290
19535 -34290 87253 21387 92729 81813 -17069 47209 -374626 -42274 -360027 -100942 -137562
19524 -137562 56190 -133684 170561 8608 -80541 -125005 -86582 -305386 -331869 -183861 36282
19512 -9391 281535 -13736 -228244 65575 -184184 73622 -381644 225993 -116220 -219419
19502 -219419 -160384 -223790 -36292 -150917 95546 -66130 85225 -187393 36617 -29367 -35923
19491 -35923 -149530 -172009 -284725 -137772 -119378 -156863 93916 14804 -270541 -67420 127507
19479 -89598 15270 -198507 -4083 57732 91461 -221487 -126632 230156 187911 -67077 -208781
19468 -208781 124248 -260523 -2886 -71197 -34945 103583 -62504 -424656 -102750 -15421 -53983
19457e3983D7062f8098A84883C9841q686L3462b61313F3031J40178D6497b0804
19445c56347C6748a91034F6211g521I6869a30592j44260d5842C5387K07088d2652
19433b55727A14158e7856j03898c2893C65637i2375M250I1522J85832e1279H1542
19421A77560a02472E9703b74721h7643B35245p0969e0928k58469R7321F3867M5018
19410A08885d1743C19490b09032N2921j47515B26197a62699C15817H4904a91927
19399a73475g9608r4183B06967F9900a30559k25058F6066k6892N5744B7296a57149
19387C1324a14109l7694B0822a16849N0629p1977m6639O3951I1604b36521P9951
19376a56570k12168i4086k26010I5894L1620b21077J10462j18157O5736N7796
$$ plain form
19457 -53983 47062 -68098 184883 39841 31155 64617 -261313 63031 203209 46497 -20804
19445 -356347 36748 -191034 66211 -7521 96869 -130592 -274852 -45842 35387 242475 -42652
19433 -255727 114158 -57856 -161754 -32893 365637 -92375 -88125 91522 277354 -51279 81542
19421 177560 -102472 59703 -274721 -87643 235245 164276 -50928 -309397 -212076 63867 108885
19410 108885 -41743 319490 -209032 -156111 -303626 226197 -162699 315817 84904 -191927
19399 -173475 -79608 -173791 206967 69900 -130559 -355617 66066 39174 94918 27296 -157149
19387 31324 -114109 -151803 20822 -116849 -66220 -138197 -184836 -120885 91604 -236521 -156570
19376 -156570 -368738 -94086 -320096 95894 127514 -221077 -110615 -228772 -163036 -105240
19366a05240L3995j61484M4700A67293a43342b3954j35002K786N3423j26831J05245
19355a24333b9355n4421p0690G6832a7789q1835k42506B36054i2986q1553O1241
19344a13298k2609E508a55529H7766b90780k4345l1119Q6916K7900J0517J2076
19333b08835h46j92639Q4845e3765k14882A2627a94577P3226l95122a10230h913
19321A49839L670i2944A69543g1860o7466G0977c37987A86745E2289A3254J04261
19310A17515d877k36598F5251b51870M0421B0521f2295m500j02615A4646a78627
19298D6807L01370a35285c9559r7869j95000a11919j89722A21190a24619c1727
19287e9500A5359L62646a64504B4767a268j51680j13060R0444C122b61833d0434
$$ plain form
19366 -105240 -71245 -232729 -188029 167293 -143342 -23954 -158956 -156170 -102747 -229578 -124333
19355 -124333 -29355 -83776 -154466 76832 -17789 -99624 -342130 236054 -92986 -174539 -113298
19344 -113298 -135907 5508 -155529 87766 -290780 -315125 -346244 -259328 -231428 -220911 -208835
19333 -208835 -846 -193485 -108640 -53765 -268647 12627 -194577 -121351 -516473 -110230 -8913
19321 149839 153509 -92944 169543 -71860 -139326 70977 -337987 186745 52289 13254 117515
19310 117515 -4877 -241475 65251 -251870 -211449 20521 -62295 -66795 -169410 14646 -178627
19298 46807 348177 -135285 -39559 -137428 -332428 -111919 -301641 121190 -124619 -31727
19287 -59500 15359 378005 -164504 24767 -1268 -152948 -266008 -175564 3122 -261833 -40434
19275A1734b6474G6207K56163J8758b69717B07195d3463A19138b28129J1903J6799
19264a99427A7495b48629A42367e9244G4991M5763a6679A26634a41281j867F8100
19252a18738j40787M3297G1415J1518b15135D907b90604F5592O9932c25079K4925
19241c00154B0488a21285b6540A72667f2056K9237j01783m531H6969l5149d1146
19229d93900B2882F207e8535R204j20263M2538A60157e5632I089a19252C19080
19217F2466b68050i8243G5277c60861P1779A37057Q1698E6990a13883C1784d7306
19205D5874J2591A6691a2320F4697a09804c3522B941a88993A47754o9242a07938
19193A75998a14536d7153j83052h1882c3376l80847c5166p9482e4610A32623a64382
$$ plain form
19275 11734 -26474 76207 332370 351128 -269717 207195 -43463 119138 -228129 -216226 -199427
19264 -199427 17495 -248629 142367 -59244 74991 120754 -16679 126634 -141281 -143148 68100
19252 -118738 -259525 -216228 71415 82933 -215135 4907 -290604 65592 135524 -325079 -300154
19241 -300154 20488 -121285 -26540 172667 -62056 -32819 -134602 -139133 86969 51820 -41146
19229 -493900 22882 6207 -58535 -49331 -169594 -127056 160157 -55632 9089 -119252 319080
19217 62466 -268050 -98243 75277 -360861 -289082 137057 218755 56990 -113883 31784 -47306
19205 45874 58465 16691 -12320 64697 -109804 -33522 2941 -188993 147754 78512 -107938
19193 175998 -114536 -47153 -230205 -81882 -33376 -414223 -35166 -114648 -54610 132623 -164382
19181b47546F1761c28517d4012A7965e3728k22910g2698p7755I3514M5182a79284
19169e5679k7596l8586l02047C2068N2967b5505A16041A7634K27470p7102D0135
19157D5880J6649c47942K7133A31305b78045q2290G9593c2736j99574o8066d1717
19145c89315J40081J24587f0156j3820C3347d1863F5812d73846a52304A7992K7453
19134D5445a4447j55552A0263a34172A06788g7969j73934O8316c7358E499c38678
19122c5399n9402k01556F4719J92377i6923c7942F5331h2983B6894i7255c065
19110a58741H6517N0424A4050g083A2936N0382b22638P6316h4k1452j09796j02212
19098b33544C08249E7177d1156p3208F7309g7374k46474B5892N8144a48420A3526
$$ plain form
19181 -247546 61761 -328517 -44012 17965 -53728 -276638 -72698 -150453 93514 138696 -179284
19169 -55679 -83275 -121861 -423908 32068 85035 -25505 116041 17634 245104 168002 40135
19157 45880 62529 -347942 -320809 131305 -278045 -360335 79593 -32736 -232310 -300376 -41717
19145 -389315 -249234 -124647 -60156 -73976 33347 -41863 65812 -473846 -152304 17992 45445
19134 45445 -14447 -169999 10263 -134172 106788 -77969 -251903 -183587 -37358 5499 -338678
19122 -35399 -94801 -296357 64719 257096 -96923 -37942 65331 -82983 26894 -97255 -3065
19110 -158741 86517 136941 14050 -7083 12936 63318 -222638 -146322 -84 -21536 -131332 -233544
19098 -233544 308249 57177 -41156 -114364 67309 -77374 -323848 25892 84036 -148420 13526
19086G3244K85561I6795k8377J78741b18402A3628i8878C5830J73703e7523r7444
19075a54967C8785P116N798b20787I6787h6198j79512j45571J57942A53259e3880
19063d8468m49301a29981d2097C9838P5058a72925O4177F1559J73399D5721a9740
19051E2968B2542Q0825a59881A32055j8519B0980c1984j8100C8280b52519J25979
19040a26540L8380j40518A2070J07926B9447K05371G8256e6887l50532D12011
19029g3978D5186j3328h6430B62569a29571F25168B32468H8481b0773D499e4720
19017a71751A30469a69356C87619b52403h0704A0311a44645k91666a33900A58586
19006a86278M7081f6173D0979K13912D9811B3194e3473k27848H7053j4381B6233
$$ plain form
19086 73244 358805 96795 68418 247159 -218402 13628 -98878 35830 209533 -57523 -154967
19075 -154967 38785 45901 51699 -220787 96787 -86198 -265710 -411281 -253339 153259 -53880
19063 -48468 -497769 -129981 -42097 39838 114896 -172925 -108748 61559 234958 45721 -19740
19051 52968 22542 103367 -159881 132055 113536 20980 -31984 -50084 38280 -252519 -126540
19040 -126540 -88160 -228678 12070 119996 29447 234818 78256 -56887 -407419 412011
19029 -73978 45186 31858 -86430 262569 -129571 625168 232468 88481 -20773 4499 -54720
19017 -171751 130469 -169356 387619 -252403 -80704 10311 -144645 -436311 -133900 158586
19006 -186278 -139197 -66173 40979 254891 49811 23194 -53473 -281321 87053 72672 26233
18994D0413R6246g966j99872C5956a01072C4224a78193J3264O7528K4337j34062
18983b07126L9255g4993q16j81788A30954a7462A21316a1317n53579c9154k29465
18972b68619e8112K1984k10253L0939a4420b78j84036j79210B17614b22698r8813
18961c21511B06905q7266a67301j32530H7940n138b27702f6305k2302o9733B32993
18949a99422A8811a41474p8065g6883f430k88374I4812c53002a3740B17966q365
18938B09601k5751a27774C39333b41674c5062A57163c7046B48343b7224A2559
18927a10588c6049J2801p9973c2076G1552M6116a84801B40567a47673d0022j1792
18916e1814E4051a38206j93935a20099A82473A2841P5433Q7151J34522d245j9608
$$ plain form
18994 40413 136659 -7966 -207838 35956 -101072 34224 -178193 -164929 -97401 -73064 -207126
18983 -207126 -167871 -74993 -75809 -257597 130954 -17462 121316 -11317 -564896 -39154 -268619
18972 -268619 -58112 -36128 -246381 -215442 -14420 -278 -184314 -363524 217614 -222698 -321511
18961 -321511 206905 119639 -167301 -299831 87940 82802 -227702 -66305 -88607 -158340 232993
18949 -199422 18811 -141474 -219539 -76883 -6430 -294804 94812 -353002 -13740 217966 209601
18938 209601 183850 -127774 339333 -241674 -35062 157163 -37046 248343 -27224 12559
18927 -110588 -36049 -23248 -103221 -32076 71552 117668 -184801 240567 -147673 -40022 -51814
18916 -51814 54051 -138206 -332141 -120099 182473 12841 88274 175425 309947 -4245 -23853
18905b3853p2461j23168e2739k78645J13605Q2009A33371g4506L3352K0546I8348
18893d3342m50704a8318A04681J28719a12043B3310J21286a61247N6043k742k068
18882a10014A29354a90228B5454a60501a0172A34917a06776C07906d4324K0716
18872b3608h35l19370k27387b58874B70543E402K8542a76187H1318a76505a2674
18860A50933I245J20490c7034k18318C76719b54300F5118M3915a02806m9659B5957
18848C46512A1011L5830a52455E2527a12058j05848F8390J37020a28643F6066
18837G9173a60148E7398J4603C4904b38260e2956J8025C02516A2558b02021B17014
18825G4982J03579a53256f7768B96656a81578g9792m9542a064I9966l158j2779
$$ plain form
18905 -23853 -96314 -219482 -52739 -331384 -217779 -135770 133371 -74506 -41154 -20608 98348
18893 -43342 -494046 -18318 104681 233400 -112043 23310 144596 -161247 -105204 -107946 -110014
18882 -110014 129354 -190228 25454 -160501 -10172 134917 -106776 307906 -44324 -23608
18872 -23608 -835 -320205 -547592 -258874 270543 5402 33944 -176187 81318 -176505 -12674
18860 150933 9245 129735 -37034 -255352 376719 -254300 65118 109033 -102806 -152465 25957
18848 346512 11011 46841 -152455 52527 -112058 -217906 68390 205410 -128643 66066
18837 79173 -160148 57398 72001 34904 -238260 -52956 -34931 302516 12558 -202021 217014
18825 74982 178561 -153256 -67768 296656 -181578 -79792 -129334 -1064 99966 96808 84029
18814H4029b75536A66891C8921g1599C25521F1632a73994j73104A40984L9254
18804A80238a58177B5985a03142j00330R6150H0934a78884p4548j43436a61675
18793a87285A44223b8167j76460I7658P998j0852b10530A94565m3777a83967A78220
18781c09053j36846a75110g4341F8197c23078G5410j7242B1941a19486I5498N8605
18770A54103a07196M7689A66193b7157k2644B01971L6746C7994h6354A58689b5959
18758G0818i0378j80315a01738n4523a4545j05743j4124A97793a12653p7624m0396
18747b30673K7717d6966J3188o7943F08O6240d29500g7685b8354k29730O0042
18736a98042R3361A30795a84735B18099F2125c62689Q7219J05978B37024p6274
$$ plain form
18814 84029 -275536 166891 38921 -71599 325521 61632 -173994 -347098 140984 180238
18804 180238 -158177 25985 -103142 -203472 -107322 80934 -178884 -253432 -396868 -161675
18793 -187285 144223 -28167 -204627 97658 105656 94804 -210530 194565 150788 -183967 178220
18781 -309053 -445899 -175110 -74341 68197 -323078 75410 58168 21941 -119486 95498 154103
18770 154103 -107196 -59507 166193 -27157 -49801 201971 238717 37994 -86354 158689 -25959
18758 70818 -90378 -270693 -101738 -156261 -14545 -120288 -134412 197793 -112653 -190277 -230673
18747 -230673 -202956 -46966 -33778 -101721 608 66848 -429500 -77685 -28354 -258084 -198042
18736 -198042 -104681 130795 -184735 218099 62125 -362689 -275470 -169492 237024 160750
18726A60750A0949f8167D7651a65792a0169r9773k15988J21658B31213b68896
18715A36904a58169B67132A02227c7576G2083a40439j49540h4501J8215j25670
18705a91956L339B87563A32045m1825K4137c14759a02557j31644Q9655b7465k66645
18694b94110a25383j46700a17990c5694Q678M902D6537J1814f3100k17372a7009
18682A38122b36651A96965a99955C84221c94262H6759b51344n7551K4130a3518
18671C4541A594L20823h4302A26854O1359c1248F3789e8194j23107B09050E0442
18659A0017b72206B6380a60802C34656a63846I3163Q97a08846A43884a20057A25906
18647F6886b60528b4333B5848b39953B18168b08229K2540A25101K68646a62564
$$ plain form
18726 160750 10949 -68167 47651 -165792 -10169 -109942 -325930 -204272 231213 -268896
18715 136904 -158169 267132 102227 -37576 72083 -140439 -289979 -84501 -66286 -191956
18705 -191956 -188617 287563 132045 90220 114357 -314759 -102557 -234201 -144546 -27465 -294110
18694 -294110 -125383 -272083 -117990 -35694 -27016 -22114 46537 58351 -63100 -280472 -17009
18682 138122 -236651 196965 -199955 384221 -394262 86759 -251344 -308895 -284765 -13518
18671 34541 1594 322417 -84302 126854 188213 -31248 63789 -58194 -181301 209050 50442
18659 10017 -272206 26380 -160802 334656 -163846 93163 94060 -108846 143884 -120057 125906
18647 66886 -260528 -24333 25848 -239953 218168 -208229 -185689 125101 393747 -162564
18636a53837A12633b72906h2777b3756k23749A23294J19804a3759j30257n1705
18626a95721L2704G6010a36147A31640a20234k83340a87869A32605E8118J05017
18616A63135r038a13611A23252a41086O5465G4275P5192a73621f3153j77606C0259
18604B43435A10158c8868j48664R3200l6809A94568F2822h1506A9878g8631j46018
18593b24649A8421b6942m74726H2637c7999j47753g577r5690j5757B00291H9067
18581B42797d93832g3747D4804a2836j21783A05354J0052a95523A46307c26547
18570A05279J1063b76327a2886j23851k3010m47751d6263k60125a3212A4806K09842
18559B24648e2419m0306k4291B23181b04860c2184q3412A92394b38357A94818
$$ plain form
18636 -153837 112633 -272906 -82777 -23756 -247505 123294 243098 -13759 -144016 -195721
18626 -195721 -163017 76010 -136147 131640 -120234 -403574 -187869 132605 58118 163135
18616 163135 154097 -113611 123252 -141086 -75621 74275 149467 -173621 -63153 -240759 30259
18604 243435 110158 -38868 -187532 -94332 -131141 194568 62822 -81506 19878 -78631 -224649
18593 -224649 18421 -26942 -501668 82637 -37999 -185752 -7577 -103267 -119024 200291 89067
18581 242797 -493832 -73747 44804 -12836 -134619 105354 115406 -195523 146307 -326547
18570 105279 116342 -276327 -12886 -136737 -159747 -607498 -46263 -306388 -13212 14806 224648
18559 224648 -52419 -92725 -117016 223181 -204860 -32184 -115596 192394 -238357 194818
18548A03137k7891a15665r7991B2038b84166J06713f7954j0986k81632h7695I8674
18536c43275M0725B15123c59441A34233f3349j55765P5198j90791b5567r8767
18526a24334F4891K14731b40242b7513q383j22802O3050d4897A91187m5847a85708
18514A04560m7340K4417a79668N0675I4686e4970B48049M0720F265K16561H3919
18502i26l59926i3288k55992J54540K9329H4378e7039C0278a25396A84433f721
18490d90009B09273i415j67647A18635J13414g2638a3795p1897J9407B96721d6707
18478A54977k5135N6000G6066d561A0313N3058g6835A78769E0053b47518G8844
18466g7115R856p7267j74448c3302k02001P0904j08283J31736A13745e1448B94091
$$ plain form
18548 103137 75246 -115665 -213656 22038 -284166 -177453 -67954 -78940 -360572 -87695 98674
18536 -343275 -302550 215123 -359441 134233 -63349 -219114 -143916 -334707 -25567 -124334
18526 -124334 64891 279622 -240242 -27513 -35896 -158698 -95648 -44897 191187 145340 -185708
18514 104560 57220 81637 -179668 -128993 94686 -54970 248049 288769 6265 222826 83919
18502 -926 -360852 -93288 -349280 -194740 -165411 84378 -57039 30278 -125396 184433 -6721
18490 -490009 209273 -9415 -177062 118635 232049 -72638 -13795 -85692 -66285 296721 -46707
18478 154977 129842 185842 76066 -4561 10313 63371 -76835 178769 50053 -247518 78844
18466 -77115 -67259 -144526 -318974 -33302 -235303 -164399 -272682 -140946 113745 -51448 294091
18454a4002G7674a85340g290F5450c961l44858F6775N3631c02815b4115P783l0640
18442d6972J3436k01646a11145I2824J84634g5025K4623m18215J37125a63413
18431E9123i6107B1891a07913A23643A8363P5944J09655c6017D5301a05083j98256
18420c03339J02750j14799a5064l5581A21734a72095B72481A19868d33630O5608
18410c68022A97938a96358A88182B064b84888A80447b00502M8854B24631c82438
18399g4545A92161H7152C3707c01355A97280D1339A3440M7325b49427R9473k76927
18388d26881g568j45612A54601e7976k248l8029C6771L1940m786a68921A9651
18376A1456J06607m4775c3871B71662b29779A1922f8609k0445B22022g4328E9197
$$ plain form
18454 -14002 77674 -185340 -7290 65450 -3961 -348819 66775 120406 -302815 -24115 -16332 -46972
18442 -46972 -33536 -235182 -111145 92824 277458 -75025 -50402 -468617 -331492 -163413
18431 59123 -96107 21891 -107913 123643 18363 94307 203962 -36017 45301 -105083 -303339
18420 -303339 -200589 -315388 -15064 -50645 121734 -172095 272481 119868 -433630 -368022
18410 -368022 197938 -196358 188182 2064 -284888 180447 -200502 -151648 224631 -382438
18399 -74545 192161 87152 33707 -301355 197280 41339 13440 60765 -249427 -149954 -426881
18388 -426881 -7568 -153180 154601 -57976 -60224 -98253 36771 68711 63925 -168921 19651
18376 11456 118063 73288 -33871 271662 -229779 11922 -68609 -89054 222022 -74328 59197
18364C2380a9344I1749a59778O8205k7160h005k65240a32899g389p1963C17130
18352E643i5822j89801E9063c2718j99259c7044r0202M9080J3715k5267L574F2278
18339a5981A0082P6016H515L86957j47055o1898b78497l4343E8973g3748j59768
18328b33516o6107c0092p3247b2114n753B48090A21368A5794G160J3982L6076
18317E7218e8811A04464a90198n74A17351b2793p6820A2497J87328b66535C63283
18305A09051c91139F0248i987C0699K3103O1388D1220b13716A95449o4485f4385
18293a55668F226O4031e7239F4675L3834m3005d0662k4149j95968g1581I6791
18281e6462j08109I3413J74818a89791A41910o6070d60679h2423o6801j24751
$$ plain form
18364 32380 -19344 91749 -159778 -91573 -118733 -8005 -273245 -132899 -7389 -79352 317130
18352 5643 -95822 -285623 59063 -32718 -231977 -37044 -127246 -78166 -64451 -89718 -86144 62278
18339 -15981 10082 86098 8515 395472 248417 186519 -278497 -312840 58973 -73748 -233516
18328 -233516 -299623 -30092 -103339 -22114 -27867 248090 121368 15794 7160 21142 57218
18317 57218 -58811 104464 -190198 -190772 117351 -22793 -99613 12497 199825 -266535 363283
18305 109051 -391139 60248 -9987 30699 53802 115190 41220 -213716 195449 130964 -64385
18293 -155668 6226 70257 -57239 64675 98509 55504 -40662 -64811 -260779 -71581 96791
18281 -56462 -164571 93413 268231 -189791 141910 75840 -460679 -82423 -149224 -273975
18271b73975B05127r6487b43727J19321H4497a83128B44071a86915F1915E649
18260a34546A27807b33392a05438k25980R1341c7378J4079j28706j12123a0963
18249A2723L2135d7663j51683e1386B7710b98601A27107L01447A3585g3593j55684
18238b29277B29276b909C6292L60666b71208d2789C6788L05293b55737L549A01160
18226C1523g0334B25736n4479c2433A01172a07724B34475G1853b25875i0787B71419
18214f6091A86548a41440M7558l9685H9832i5044o5559a7388k55095J31316K1621
18203a19546N8741a6272I976e9241A0189a35653C18048D5778J89556e9795m3696
18192a03491q967j78354J19698P1023C8966A4414J53821A902b47777a09915A60934
$$ plain form
18271 -273975 205127 108640 -243727 -124406 84497 -183128 244071 -186915 61915 5649
18260 -134546 127807 -233392 -105438 -331418 -240077 -37378 -23299 -152005 -264128 -10963
18249 12723 44858 -47663 -199346 -51386 27710 -298601 127107 428554 13585 -73593 -229277
18238 -229277 229276 -2909 36292 396958 -271208 -42789 36788 342081 -255737 -252188 101160
18226 31523 -70334 225736 171257 -32433 101172 -107724 234475 71853 -225875 -90787 271419
18214 -66091 186548 -141440 -93882 -133567 89832 -95044 -160603 -17388 -272483 -141167 -119546
18203 -119546 -60805 -16272 9976 -59241 10189 -135653 318048 45778 235334 -59795 -103491
18192 -103491 -112458 -290812 -171114 -100091 38966 14414 168235 1902 -247777 -109915 160934
18180c64018J42624E1539a7264A64814g3665l5569A08055b68194A22644l2191
18170I0453M8637F3122c2542H684a80263k4627H3485a629o5566A78637d20851
18158a39879L4812F9636B7244p399J02505a52628F5347a12307m42480B52923a8174
18146h4241j26131j03613G9786J0371a03535D2580J84450g1894A70770p0025P3582
18135A74327d43826e2894F809O2798J66262m7527O1569C898L33601G084P5387
18124H2471a41399M2149A41234b27160O2909N65L8114A23375N1786j2664F9440
18112d64502J77907k4032E0476a16800q5919J130R8366j64574d3429j69214b3917
18100b64737C3468M9113l5207b547k0858j13221b0710l9419I0932O3461d10500
$$ plain form
18180 -364018 -221394 51539 -17264 164814 -73665 -109234 108055 -268194 122644 90453
18170 90453 139090 63122 -32542 8684 -180263 -204890 83485 -1629 -67195 178637 -420851
18158 -139879 -105067 69636 27244 19845 122350 -152628 65347 -112307 -554787 252923 -18174
18146 -84241 -210372 -313985 79786 90157 -103535 42580 227030 -71894 170770 100745 174327
18135 174327 -443826 -52894 6809 69607 235869 188342 249911 3898 337499 7084 82471
18124 82471 -141399 -99250 141234 -227160 -164251 -163686 -125572 123375 175161 162497 69440
18112 -464502 -286595 -310627 50476 -116800 -202719 -201589 -103223 -267797 -43429 -212643 -23917
18100 -264737 33468 82581 47374 -2547 -23405 -136626 -20710 -60129 90932 154393 -410500
18088B21974d3708j40463k03474i4821j34948c7537B11351g6432A14589J34929
18078B49518I5843J62772i9792J5247I1879b305l7944E36c3094o2825j8218G429
18065a3415o3729A92511b09869A40722J48303q753a0510j36664o0393I9422h9804
18053b0862B25575c15394a15100A78261N8407b7561j75499N3645A52670b07814
18042b52645e8974j84077A18873c74857J0829a4668A09743E0815b22738M5255
18032a77483L1024j44404J44185B28690K1118a46948e592I8878d3765B3101b01717
18020a34965K0280A87372a7867k05783k0304A25432a03286C9502J35109p6698
18010I7913i4687L5426j19266A70634F1619a35726B5838c01346a29184k2289D0607
$$ plain form
18088 221974 -43708 -184171 -387645 -94821 -229769 -37537 211351 -76432 114589 249518
18078 249518 95843 258615 -99792 -84545 91879 -2305 -40249 536 -33094 -95919 -114137 7429
18065 -13415 -77144 192511 -209869 140722 289025 280272 -10510 -147174 -207567 99422 -89804
18053 -20862 225575 -315394 -115100 178261 236668 -27561 -203060 -149415 152670 -207814
18042 -252645 -58974 -243051 118873 -374857 -364028 -14668 109743 50815 -222738 -177483
18032 -177483 -146459 -290863 -146678 228690 249808 -146948 -5592 98878 -43765 23101 -201717
18020 -134965 -114685 187372 -17867 -223650 -243954 125432 -103286 39502 174611 97913
18010 97913 -94687 -59261 -178527 170634 61619 -135726 25838 -301346 -129184 -151473 40607
17998b61707J22101j85989D6858J26041O220g8289j49719l344d0664r4998L6597
17987i9065c0292o154n2397D92916b70633a20553c7736F2566f2304A77592a63483
17975D6513J74574H9930A6317Q6765D2484b99723R7040e2127B47248d6061e03
17963B63823E5465a51351b7192A29364d9486A14983c5329o3318A01517i7917j0069
17952a07986A26599i0980A23014a78603k8717B58755a41325b4575k2617k47139
17942b94331B35183b31339A44174b23885C41b95496O5956k1646a1273l08843h4330
17930D3031L57853j69499E9037K25766a83745A39507j3605k1426D7891b26913
17919A36412l3548c634j7659D2461M30176k01930B7316b08545K8249l9058E9037
$$ plain form
17998 -261707 -139606 -325595 46858 172899 179119 -78289 -228008 -231352 -40664 -135662 -99065
17987 -99065 -30292 -36446 -88843 492916 -270633 -120553 -37736 62566 -62304 177592 -163483
17975 46513 221087 89930 16317 103082 42484 -299723 -202683 -52127 247248 -46061 -503
17963 263823 55465 -151351 -27192 129364 -49486 114983 -35329 -98647 101517 -97917 -107986
17952 -107986 126599 -90980 123014 -178603 -207320 258755 -141325 -24575 -47192 -294331
17942 -294331 235183 -231339 144174 -223885 341 -295496 -229540 -251186 -11273 -320116 -84330
17930 43031 400884 231385 59037 284803 -183745 139507 125902 104476 47891 -226913
17919 136412 102864 -3634 -21293 42461 472637 270707 27316 -208545 -180296 -219354 59037
17907I948a33906n1350k3075e367k16143f8719j6703j8193k56729G7582Q8480
17896A66062B7903R2508J44797E8077K8964L21641h5858C938a14747b4478A02158
17884b40240R9031E3798L10269d4129B46766a37975C20397o7785q128a52049f2500
17872E6998g2430b1377A02393M9396a14524b3447o5961B72307b13472d3429B3595
17860G4028a19480j28148g4025j01006N7566A98477p7444c97166a46540H8587
17849a32271l9062I1430b47226B71487c08579a04426D6751a3092j52912I3144
17838b08600e7576p3813O3627F9482J50411b2736l13577D9425j9791a49736A5982
17826C6883d01906H3027C1771K58613A14509a05312c762r0632F5369a73406a7274
$$ plain form
17907 9948 -133906 -185256 -208331 -5367 -221510 -68719 -85422 -103615 -360344 77582 166062
17896 166062 27903 120411 265208 58077 87041 408682 -85858 3938 -114747 -24478 102158
17884 -240240 -141209 53798 364067 -44129 246766 -137975 320397 252612 244484 -152049 -62500
17872 56998 -72430 -21377 102393 151789 -114524 -23447 -89408 272307 -213472 -43429 23595
17860 74028 -119480 -247628 -74025 -175031 -117465 198477 121033 -397166 -146540 88587
17849 -132271 -171333 91430 -247226 271487 -308579 -104426 46751 -13092 -166004 93144
17838 -208600 -57576 -131389 -67762 69482 219893 -22736 -336313 49425 29634 -149736 15982
17826 36883 -401906 83027 31771 290384 114509 -105312 -3762 -94394 65369 -173406 -17274
17814C39708b23622A40607D9603H367b5628I9400k2681e0386k21225A47321b03643
17802A23383e1202C38760b10507K7620D7701K90267b84322h6825A03064b66175
17791A08792K98753C1948b13703f6048k1660C00942a5780j98238A41134R9035
17781B40169G1247a62712J4847A95752J94211A59982D3556a19138B58277g1423
17770g4515A95236J88446j8631h6992A86907m6266F0321e6648o3777b053j28232
17759a30285k3997C5018R1645a6050m1178l7898A19937a59329B60164a76033j50964
17748c26997Q3193B34507E5334J91455B6263a55859n6977e0639m7037j6665n5015
17737a69356a7146d427l79362E8709A6938K78475b15397C53917E6254J79284a50094
$$ plain form
17814 339708 -223622 140607 49603 8367 -25628 99400 76719 -50386 -271611 147321 -203643
17802 123383 -51202 338760 -210507 -182887 47701 337968 -284322 -86825 103064 -266175
17791 108792 407545 31948 -213703 -66048 -87708 300942 -15780 -214018 141134 240169
17781 240169 71247 -162712 -147865 195752 389963 159982 43556 -119138 258277 -71423
17770 -74515 195236 383682 365051 -86992 186907 140641 60321 -56648 -120425 -2053 -130285
17759 -130285 -154282 35018 126663 -16050 -57228 -95126 119937 -159329 260164 -176033 -326997
17748 -326997 -243804 234507 55334 246789 26263 -155859 -212836 -50639 -97676 -114341 -169356
17737 -169356 -17146 -4427 -383789 58709 16938 295413 -215397 353917 56254 235538 -150094
17725a88308B02037N8640j04673a69093p980m7941B50469b3800C80136A70488
17714B87233a3291e679j43859D7384J51626a73182c6526B2060g2360l96219J1103
17703d57476g2475L1720r815j11462A5324b02031f1233G4176d07317A11153k5301
17692H5852j2316h6587B3418J3941K14492i1092p2198c4684D892P7771b05984
17680B91431j30044b12397j95745B19879A5509K5139R5232B9294L18668A06004
17669F4747a31299o7282K7083h3041H280a43654f336r3083H5982L6769e5738A15638
17656b4929j2401B47790d0847j5465D0541K50773h24D4011a00463j87251i7523
17644B47546c546A22130l6506J8988i6613A30718r522D1861P7395l4566B1214
$$ plain form
17725 -188308 202037 260677 156004 -169093 -177073 -225014 250469 -23800 380136 170488
17714 287233 -13291 -5679 -149538 47384 199010 -173182 -36526 22060 -72360 -468579 -457476
17703 -457476 -72475 -40755 -50570 -162032 15324 -202031 -61233 74176 -407317 111153 85852
17692 85852 73536 -86587 23418 37359 251851 -91092 -163290 -34684 4892 82663 -205984
17680 291431 161387 -212397 -408142 219879 15509 40648 135880 29294 347962 106004
17669 64747 -131299 -198581 -171498 -83041 8280 -143654 -6336 -99419 85982 122751 -55738 115638
17656 -24929 -37330 247790 -40847 -56312 40541 291314 -824 44011 -100463 -287714 -97523
17644 247546 -3546 122130 85624 104612 -96613 130718 121196 41861 119256 84690 21214
17632e1452I670a2047I1016c87690a62886b18E7432a49615f2553K5135j42500
17621a79918h7643j28531R3372A11921J75000I8977h321k16517b4670A60824b80598
17609H8634J99233G6493e8104l3225B10764b51740A0815e5471A68648i9932n0426
17598a50358A22058B5176M53282a0219D2392M21087D31K31665J87372j92861a757
17586A34220P1649c7672B2635J02652e8076j22925Q5162A2829c72039e6037D35493
17574C3805b98421J46461j0008O2105M0053A30334A7616M2154k663k3668a48250
17562B82511c5168j72399b7398j48935B61474B8990i7454r9286B83225e9802j6255
17551g6057B89512A21261l8020b74469A00485J11045a61197B62215b17367i1756
$$ plain form
17632 -51452 9670 -12047 91016 -387690 -162886 -218 57432 -149615 -62553 -37418 -179918
17621 -179918 -87643 -216174 -122802 111921 286921 98977 -8321 -224838 -24670 160824 -280598
17609 88634 287867 76493 -58104 -91329 210764 -251740 10815 -55471 168648 -99932 -150358
17598 -150358 122058 25176 478458 -10219 42392 463479 431 232096 419468 226607 -1757
17586 134220 205869 -37672 22635 125287 -58076 -181001 -95839 12829 -372039 -56037 435493
17574 33805 -298421 -151960 -161968 -99863 -59810 130334 17616 59770 57107 33439 -148250
17562 282511 -35168 -207567 -27398 -176333 261474 28990 -97454 -196740 283225 -59802 -76057
17551 -76057 289512 121261 83241 -274469 100485 211530 -161197 262215 -217367 -91756
17540B33187e4111o4640A09823d273A01439Q830R7896c9893B9368P9363J25793
17529B34524H4672M7290J88686o3323I8665O256P9376H6350J51145R3937q2399
17518B49033q8938a29028H0396J33150i4602j80404C67605A28477K48152d5401
17507H7364O5182O245A0556f7486j6038A89719M8064a33230B17099h5380F9460
17495E600K33491G3741j4362I439J7853K97095b20000H0627J4229Q3251J2171
17484A90278o7550K54770A61812P7654L1323a10111C1076J54031K59247A82582
17473H6459R3728l0079e2543D2477e0236D85023k23902C2634L71548A86382K6035
17462B12417E5806g4379c715C2028b13749A48112f7995A76816c74898C6474K69260
$$ plain form
17540 233187 -54111 -118751 109823 -4273 101439 110269 208165 -39893 29368 108731 234524
17529 234524 84672 131962 320648 257325 98665 104921 184297 86350 237495 331432 249033
17518 249033 160095 -129028 80396 213546 -94602 -275006 367605 128477 376629 -45401
17507 87364 152546 158791 10556 -67486 -83524 189719 237783 -133230 217099 -85380 69460
17495 5600 239091 73741 59379 9439 27292 324387 -220000 80627 94856 178107 190278
17484 190278 122728 377498 161812 239466 270789 -110111 31076 185107 444354 182582
17473 86459 180187 150108 -52543 42477 -50236 485023 261121 32634 404182 186382 212417
17462 212417 55806 -74379 -3715 32028 -213749 148112 -67995 176816 -374898 36474 305734
17451C05734l8694M2481p8112J24345l438j30271K54239J17921j01201B27786
17440A50771K82303o8088J4721j74619p8900M83107C02498J84469A79756c5160
17429H1034B9095O03701A50331N5679N4025F1765L29655m3991L8629A57470K5708
17418A83178L6944J81157L1737j55542J15043A69807L5267J93772A41819a48099
17407I9644K34243F6884P347C3304f1517D24442b08495A17217C7950b7010C74251
17395A14895b48960c303j58622C00008i6719C7362J76406a59525C1704b7912P538
17384b0374q3323G9498N8958J54073C4591Q7327j5022O0960g4891C2311i7873
17372B00409G1067K8932D8870K84840A51732b73744e4872B62985J06438j22777
$$ plain form
17451 305734 267040 309521 231409 355754 352316 222045 476284 594205 493004 227786
17440 150771 433074 364986 379707 205088 126188 609295 302498 486967 179756 -35160
17429 81034 29095 632796 150331 206010 260035 61765 391420 347429 386058 157470 183178
17418 183178 220122 401279 433016 277474 392517 169807 205074 398846 141819 -148099
17407 99644 333887 66884 74231 33304 -61517 424442 -208495 117217 37950 -27010 374251
17395 114895 -248960 -3303 -161925 300008 -96719 37362 213768 -159525 31704 -27912 -20374
17384 -20374 -103697 79498 138456 292529 34591 121918 106896 167856 -74891 32311 -97873
17372 200409 71067 99999 48870 333710 151732 -273744 -54872 262985 369423 246646
17362B46646a89827A30540K50861j59008J87674a2579A49750F8857L71119d6301
17351b03999G8648O5800k8646K2198H724g4791A9081K33775k9751a53310B6397
17339C14480b2290E01119C096b04022a3027G0716c6429a5060A18808L7164R2396
17328B48368K03433j86446F8845P6822P3834E5784J2073M0192J78784g3158B8996
17316C09095O8599e3516B18150n8683L76896e6228B32460a17902c6032k04B28297
17304A17020d7214E33882B13714L3441J7720a3685F7474f7511H6676J6509J39473
17293B42658A1868K87752A12402a3833A9163K45620l6132K05864A99398O9990
17283B69388A22333J32230K20028B02929I2928K90852B959J16477D7439g4553
$$ plain form
17362 246646 -189827 130540 381401 222393 410067 -12579 149750 68857 439976 -46301
17351 -203999 78648 144448 115802 138000 8724 -74791 19081 252856 223105 -153310 26397
17339 314480 -22290 501119 3096 -204022 -13027 70716 -36429 -15060 118808 155972 248368
17328 248368 451801 265355 68845 145667 219501 55784 67857 108049 286833 -73158 28996
17316 309095 377694 -53516 218150 159467 536363 -56228 232460 -117902 -36032 -36236 228297
17304 117020 -47214 533882 213714 247155 264875 -13685 67474 -67511 86676 103185 242658
17293 242658 11868 299620 112402 -13833 19163 264783 228651 434515 199398 269388
17283 269388 122333 254563 474591 202929 92928 383780 2959 119436 47439 -74553
17272F8716M0013H300J29409q557J59527B9554K1168J09341i9511A01026O8976
17261A70002L51a13890A37842P2060a06933j6764A61028d4836B05310I1434g2426
17249B10216R053a19863L7214B83486H4474J39088J01820K25092k54384k2105
17239B73985j26238L20143b4925I6191J6827a04518C25240p5518L976J68647A58140
17227a63470B91257e0593A8369L40945a57534B16568k0705M08128i7583D66425
17216A87200A6972J83956J96958j87902Q0384k8189B8822N4198K82899i663C06853
17204A52787P3218P0941q165C7961J46740L93436b00501B60821n1820J23512m135
17193C28378i418B55590M2719J69123B06761R9476A08915O756K53929F9275J35258
$$ plain form
17272 68716 108729 8300 137709 129152 288679 29554 50722 160063 -99511 101026 170002
17261 170002 170353 -113890 137842 209902 -106933 -123697 161028 -44836 205310 91434 -72426
17249 210216 219269 -119863 -82649 283486 84474 223562 325382 550474 296090 273985
17239 273985 147747 467890 -24925 96191 113018 -104518 325240 249722 253698 422345 158140
17227 -163470 291257 -50593 18369 359314 -157534 216568 195863 603991 -97583 466425
17216 187200 16972 200928 397886 209984 290368 262179 28822 83020 365919 -9663 306853
17204 152787 226005 296946 288781 37961 184701 578137 -200501 260821 209001 332513 328378
17193 328378 -9418 255590 298309 467432 206761 306237 108915 115671 369600 69275 204533
17182B04533L8580K64198j02776j09823m0088j0553M4140j26252L54307j94377
17172C21889A21644P8079a25919C92226j7126m1734A45815P1937P1753H018L45855
17161C53873j44101J00995l9514n7608a24547A43421A8356J59879Q710g5982B27958
17149A15419K32707j4822j33314L07449J147k51444r5322R834K50738N9764j73736
17138C08420j30537J14777j21078K58766r3398N4996P8720K4415L3143j82575
17128C45649B2918K64814J14598J54353A07979L38191A84248K66450Q7489A68490
17117C25332j44647J62476a14965A50139a0584E27658k2679B47518J22604A81098
17106B86407r2486K24961j50883R3586N3787j99382J31582b5745A13088L42805
$$ plain form
17182 204533 243113 507311 404535 294712 254624 244071 288211 161959 516266 321889
17172 321889 121644 199723 -125919 392226 375100 333366 145815 217752 289505 8018 353873
17161 353873 209772 310767 271253 213645 -124547 143421 18356 178235 186945 -75982 227958
17149 115419 348126 333304 199990 507439 508586 257142 161820 171654 422392 482156 308420
17138 308420 177883 292660 171582 430348 336950 391946 470666 495081 528224 345649
17128 345649 22918 287732 402330 556683 107979 446170 184248 450698 538187 168490
17117 325332 180685 343161 -114965 150139 -10584 527658 504979 247518 370122 181098
17106 286407 193921 418882 267999 361585 415372 215990 347572 -25745 113088 455893
17096D55893k8926J63550B77744L68604A71743K14126j386J27898A90462N32321
17086G22783A19350M26325n0313j51540K81564B13811K68460B09897K79455m719
17076D84633p2466J86287j01446A08532M43500L54264k95195k83091B6866L58038
17066C84904M65517k75432A87511K63086q6998o4248K26855j24935J91373k48651
17056C43993P759J46508k38896K9463m7251J42730J0005k9067J67292j51826L48297
17045G29007k0242C37526L9767L9771K13513j85008k1169K07788B30502R4681
17035C25183K8846J62430M4712l801m7448K53782j74939j50735J23189q6098K49079
17024G24200K86597D01147L62041l54023K65030R7709j62023M3658j72873q8718
$$ plain form
17096 455893 426967 590517 277744 646348 171743 385869 384483 512381 190462 722783
17086 722783 119350 545675 495362 343822 625386 213811 482271 209897 489352 484633
17076 484633 412167 598454 497008 108532 552032 906296 611101 328010 26866 384904
17066 384904 850421 574989 187511 450597 363599 299351 526206 401271 592644 343993
17056 343993 351752 498260 259364 288827 241576 384306 394311 365244 532536 380710 729007
17045 729007 708765 337526 377293 417064 630577 445569 424400 632188 230502 325183
17035 325183 354029 516459 561171 557370 509922 763704 588765 438030 561219 475121 724200
17024 724200 1010797 401147 763188 409165 674195 771904 609881 653539 480666 391948
17014C91948J3696M89678j07929J6815k30409J90260J16666q6523k13098L49915
17004I31019l42590J8007J71997j86175L21781q0579j34612P9735j03657K43765
16994I18691r1549j50678L43567J64226D24194L96859J3646r1019r2197L00221
16984I51704m38452M34806l33678L33283J49860l83940m5817k7415L8741L94836
16974A073928k72411J0497n7497j68111J62570K0794K86357j58349k53871M3079
16964F86986K30206o0960M675n5358j67825Q7317R3141J82577r947m7106L8142
16953I81848J90524l09956P8261j16843L3656K91751j32823o9496k04676L62255
16943A104501j5118j80653r0058K4225K30763M89125o05905O1813L0069J62721
$$ plain form
17014 391948 405644 895322 787393 804208 573799 764059 880725 794202 581104 931019
17004 931019 588429 606436 778433 592258 914039 833460 698848 778583 674926 918691
16994 918691 827142 676464 1020031 1184257 424194 821053 834699 743680 651483 951704
16984 951704 513252 948058 614380 947663 1097523 713583 667766 640351 679092 1073928
16974 1073928 801517 812014 754517 586406 748976 769770 1056127 897778 643907 686986
16964 686986 917192 856232 860907 805549 637724 725041 818182 1000759 990812 943706 981848
16953 981848 1172372 862416 940677 823834 857490 1149241 1016418 946922 742246 1104501
16943 1104501 1089383 908730 818672 842897 1073660 1562785 956880 1018693 1048762 1211483
16933A211483J01337k13288L21247m8079q4154l2062P1620k61914k1443J70816
16923A215563m9267K19636k39753k8447N52229m36057k07631L42181l5218R2681
16913A425917K60078k62631O9679J3623Q9118k84933J69316L8131k59267J88178
16903A447209R4615J83612M4043j76112j21658O0686L05311k40284J58144P1934
16893A827500j11040j11325K13801p5761k097J10397J1081L54864n31403K71677
16883A957694L17445n8162J35005m52155l2103L49654j44301R1226n356r9278
16873B059669J19180j10571J48944K89075k37578k4354K95592J28830n1611J7509
16863B634685j90798L16800l64297K82949k08335J89144K51902k26071O9211n1721
$$ plain form
16933 1211483 1312820 1099532 1420779 1372700 1288546 1256484 1328104 1066190 1044747 1215563
16923 1215563 1166296 1385932 1146179 1117732 1669961 1233904 1026273 1368454 1333236 1425917
16913 1425917 1685995 1423364 1493043 1506666 1595784 1310851 1480167 1518298 1259031 1447209
16903 1447209 1541824 1725436 1769479 1593367 1471709 1532395 1837706 1597422 1755566 1827500
16893 1827500 1716460 1605135 1818936 1743175 1741078 1851475 1862556 2217420 1686017 1957694
16883 1957694 2275139 2216977 2351982 1899827 1867724 2217378 2073077 2164303 2158947 2059669
16873 2059669 2178849 2068278 2217222 2506297 2268719 2244365 2539957 2668787 2617176 2634685
16863 2634685 2443887 2760687 2396390 2679339 2471004 2660148 2912050 2685979 2755190 2703469
16853B703469L23599j52926J74418P5864j03150J45267N3216j56048J77072j8058
16843C222723L0592J52250Q578J30845l8974J61914O398K18741n2898j1102L0518
16832C859585J26307K660K98256k01264L06467k3987J89170K9936L41077l31027
16822D597180j52692L90009j85959J99400K55268J74951m1094L18502J77668j8649
16812E714584J86142l5528k8827K83002J04328K50936r6465L12931L1063l6671
16802F685495K18640K37263K13770L93246Q4094k05720O24994J93724J70626L57617
16792H973749k20509K75970L29066q6701L87083N51813J96923r3091O91035L90500
16782A1395838K85316M47685J42187P29091k72780R62029Q3857O60403K87586
$$ plain form
16853 2703469 3027068 2874142 3048560 3124424 3021274 3166541 3219757 3063709 3240781 3222723
16843 3222723 3253315 3405565 3414143 3544988 3506014 3667928 3674326 3893067 3840169 3829067 3859585
16832 3859585 3985892 3988552 4286808 4085544 4392011 4368024 4557194 4587130 4928207 4597180
16822 4597180 4444488 4834497 4648538 4847938 5103206 5278157 5237063 5555565 5733233 5714584
16812 5714584 5900726 5865198 5836371 6119373 6223701 6474637 6378172 6691103 6722166 6685495
16802 6685495 6904135 7141398 7355168 7748414 7832508 7626788 8251782 8445506 8616132 8973749
16792 8973749 8753240 9029210 9358276 9271575 9658658 10210471 10407394 10314303 11005338 11395838
16782 11395838 11681154 12128839 12271026 13000117 12727337 13689366 13773223 14433626 14721212
16773A4721212O95518P98368J08371P82457K92784O56601P40521L28774J265051
16764B0389657N45905N35027Q91205R51671R57742R00744J039759J054507J244573
16755B8510790J554514J156884J743845J400626J458107J899826J832551J918577
16747D1475720J865327K433305K374016K626531K457518L117026L205773L411025
16739F2966241L751275L589298M384820M643634M815879N397333N781877N546472
16731A00876829O648994O449373P281888P194138P349328P806087P951998Q070370
16723A59629005P322701P168390O927999N754145N043293L879720K607837J160846
16715A99493936n8189j599632k483447m016624n008890o017263p034585p411851
$$ plain form
16773 14721212 15416730 16215098 16323469 17105926 17398710 18055311 18795832 19124606 20389657
16764 20389657 20935562 21470589 22361794 23313465 24271207 25171951 26211710 27266217 28510790
16755 28510790 30065304 31222188 32966033 34366659 35824766 37724592 39557143 41475720
16747 41475720 43341047 45774352 48148368 50774899 53232417 56349443 59555216 62966241
16739 62966241 66717516 70306814 74691634 79335268 84151147 89548480 95330357 100876829
16731 100876829 107525823 113975196 121257084 128451222 135800550 143606637 151558635 159629005
16723 159629005 166951706 174120096 181048095 186802240 191845533 195725253 198333090 199493936
16715 199493936 199435747 197836115 195352668 191336044 186327154 180309891 173275306 165863455
16707A65863455p843421p895447q125484q055418p872264p476633p538946o454667
16699A04601175o690228n751716n900753n490608m796917m704725m073932m150631
16691F3041665l491693l710031l070357k797120k727940k287363k653498j665729
16683D0637934k050840k283207j802324j631083j416023j276200j505907j395238
16675B7277112r01507j275958j102408j037574j011844r35510n21627j154011
16667A9336673o54636n25448r40076l95989n36938m62770q04604k92621m02283
16658A4321308o10408m52535q10877J58415l53698n26718l35465o49991j67299
16649A0572732j45736o44599j14129l96453r6410m84017n6394L0626n76916l46353
$$ plain form
16707 165863455 158020034 150124587 141999103 133943685 126071421 118594788 111055842 104601175
16699 104601175 97910947 92159231 86258478 80767870 75970953 71266228 67192296 63041665
16691 63041665 59549972 55839941 52769584 49972464 47244524 44957161 42303663 40637934
16683 40637934 38587094 36303887 34501563 32870480 31454457 30178257 28672350 27277112
16675 27277112 26375605 25099647 23997239 22959665 21947821 21012311 20490684 19336673
16667 19336673 18682037 18156589 17216513 16820524 16283586 15820816 15016212 14723591 14321308
16658 14321308 13710900 13258365 12447488 12605903 12252205 11725487 11390022 10740031 10572732
16649 10572732 10426996 9782397 9668268 9271815 9175405 8691388 8634994 8665620 8088704 7742351
16639G742351N9291J7257o30670P7038k85500j68436l97143K71983k73709l90032
16629F022430k23974R5285j16444k36368j04207j76435j1297k86059L85320l83254
16619D964997j63122l47486P4936n1262j86968K39360m79629J22365o4907J05982
16609D214266j84002k97311O9010R8238m37469L2309k8866j79612K7512l8992
16599C275083M4122j83030J28215n4360l11694N4006R2755K4763r5072j76598
16589B798190J09832l26641l19362J29009K88781J13423j14626J63572j38562
16580B703616k91089L5708m33468L33100m71946N39487n68587K42882o6546k76570
16570A746587N30738n16212L61231O3217k02654L4419l77491J08438J95754k65207
$$ plain form
16639 7742351 7801642 7818899 7188229 7265267 6979767 6811331 6414188 6686171 6412462 6022430
16629 6022430 5798456 5893741 5777297 5540929 5436722 5260287 5248990 4962931 5348251 4964997
16619 4964997 4801875 4454389 4529325 4478063 4291095 4530455 4050826 4173191 4108284 4214266
16609 4214266 4030264 3732953 3801963 3900201 3462732 3495041 3466175 3286563 3314075 3275083
16599 3275083 3319205 3136175 3264390 3210030 2898336 2952342 3045097 3069860 2974788 2798190
16589 2798190 2908022 2581381 2262019 2391028 2679809 2793232 2678606 2842178 2703616
16580 2703616 2412527 2448235 2014767 2347867 1875921 2415408 1846821 2089703 2023157 1746587
16570 1746587 2277325 1761113 2122344 2185561 1982907 2017326 1639835 1748273 1944027 1678820
16560A678820k11766M67990k84211J29084K20842m03094R0649j60190K42278n39313
16550A231089L07534m22154K22920J76673j89741J67293k02106J54389r2580j33083
16540A220234K8308J71867j5638l44849K78014k08906J79728j56617N0481m5569
16530A157053J26839l71396L10958l84229M19727m7329m9889J30808k66393J68269
16520A194418j18095j48246L614J63253j53336J92548j20293k0J36153r1879k58924
16509G99193L55939l50295N59891m60485k9905N7739Q271D46346R22369n89848
16499G78867L4353L1166r0699K09147p6036L2033j12671o1450j36643K45017j32969
16488G20115l42085M54726k85466L55479B74120N94365k86461J07287k17206L01153
$$ plain form
16560 1678820 1467054 1935044 1650833 1779917 2000759 1597665 1688314 1528124 1770402 1231089
16550 1231089 1538623 1116469 1339389 1516062 1326321 1493614 1291508 1445897 1353317 1220234
16540 1220234 1248542 1420409 1404771 1059922 1337936 1129030 1308758 1152141 1202622 1157053
16530 1157053 1283892 912496 1223454 839225 1258952 1211623 1161734 1292542 1026149 1194418
16520 1194418 1076323 928077 931691 1094944 941608 1134156 1013863 1013843 1149996 1058117 799193
16509 799193 1155132 804837 1364728 904243 874338 932077 940348 446346 1368715 778867
16499 778867 813220 844386 753687 962834 886798 918831 806160 744710 608067 853084 720115
16488 720115 378030 832756 547290 902769 274120 868485 582024 689311 472105 773258
16478G73258J9351N0325j82488l25577K16727K31J43446k65930J97470K86192
16468I13005D16410K07023J12230j34756j96595J51365K18161l44256K27819A83491
16457C92080O9677k8140J17378B55592L11508J15518B59472J68996R8939R733
16447E37140o0086j91828r1966M39595O7897C01413J74243J51875j85950j04502
16437C37079R5620G1897K95373j77145O59413C07562M79872C92455N2332O6451
16427E11238j09226n0108Q5187L2900B23072J60016J11428j17060L2555o8926
16417C41085J96585B38086J38842j13127L84326k58552l6878R5644j73235K50752
16407E25858R465j85909j53788L23562k25545j08109o7802R4888l691m382J46939
$$ plain form
16478 773258 792609 842934 660446 334869 551596 551827 695273 429343 626813 913005
16468 913005 416410 623433 735663 600907 404312 555677 773838 429582 657401 183491
16457 392080 461757 433617 550995 255592 567100 682618 259472 428468 527407 537140
16447 537140 477054 285226 193260 632855 700752 301413 475656 627531 441581 337079
16437 337079 432699 71897 367270 190125 849538 307562 787434 392455 444787 511238
16427 511238 402012 351904 437091 469991 223072 383088 494516 377456 410011 341085
16417 341085 537670 238086 376928 263801 648127 389575 352697 448341 275106 525858
16407 525858 535323 349414 195626 519188 293643 185534 117732 212620 208929 204547 351486
16396C51486J3476o9106o9879M72780B05184L65095j13770e4463A75481p80J05633
16385B80334F6525J68849J76846A78447J82529j72403l9682M8910M1741M8373
16375B87915R5050A26836M81441A66645F9076J54394k1183J16346B2325J05255
16365A27580K54517O3349j25673K8409J16950j40368A34452J29347A19577i9588
16354E36092k26604a76723A92601n8333J18258m2457N7117J39024j46240A14365
16343A9843K00689r3475J02210K33827Q777q6167N3165G9046M3726J95060c1650
16331b46270A18114G699K44293a6732G6799K38361j44402a11665n5599A2562J05563
16320A18125a48521F4558O4217E3703K23101k9888B7266P8688L68484k15018A27185
$$ plain form
16396 351486 364962 295856 225977 698757 205184 570279 456509 -54463 175481 174701 280334
16385 280334 66525 235374 412220 178447 360976 188573 148891 197801 239542 287915
16375 287915 382965 126836 608277 166645 69076 223470 202287 318633 22325 127580
16365 127580 382097 445446 319773 348182 465132 324764 134452 263799 119577 -99588
16354 536092 309488 -176723 192601 134268 252526 210069 267186 406210 259970 114365
16343 19843 220532 127057 229267 463094 471871 385704 438869 79046 122772 317832 -31650
16331 -246270 118114 7699 251992 -16732 76799 315160 170758 -111665 -167264 12562 118125
16320 118125 -148521 64558 128775 53703 276804 246916 27266 105954 474438 259420 127185
16308B01824f9955B14343J8386i9140I0985d7446A912J20089q569D9471M97448
16297E46919A68363M3665D8955J80217a43787B38530m0583J23016P0369j32964
16287B58368o4039D3888K01929i7801A4643i4479j04866K301G2213J70308a0233
16275B53065a4548m8902A85347A0532c3555B19544K47933A08711b55072D20561
16264H4641M9653L20595a61670A84345a39232C16475j30950c337A5030K957J17967
16253A35954D2630b44190A94623e9440l29329A05627M42202A86964J74561a64846
16242A42703b31753a01782B9000J02163l5362O1887a03625A43892n6452d1744
16231A61928o2991O8088b9123B47771q8377k3615g1491F7881L67402h161o5582
$$ plain form
16308 201824 -69955 214343 232729 -99140 90985 -47446 1912 122001 113432 49471 546919
16297 546919 168363 212028 48955 229172 -143787 238530 197947 320963 391332 258368
16287 258368 194329 43888 245817 -97801 14643 -94479 -199345 -197044 72213 242521 -10233
16275 253065 -14548 -63450 185347 10532 -33555 219544 467477 108711 -255072 420561
16264 84641 134294 454889 -161670 184345 -139232 316475 185525 -3337 15030 17987 135954
16253 135954 42630 -244190 194623 -59440 -388769 105627 547829 186964 361525 -164846
16242 142703 -231753 -101782 29000 131163 95801 157688 -103625 143892 87440 -41744
16231 161928 98937 167025 -29123 247771 159394 135779 -71491 67881 435283 -8161 -73743
16220g3743E7482J35000k4023a61417A17492O6018D9813f4486r2389A00887O4651
16209A65538b13587J88O3594a1241B90054F6616e8827I1053c8239F7873K25761
16198B93634a41905j60159a46689B04524G9976J96835n8839j04329e03q4752b3608
16186b35847H4122j9962N2364a31737A04463a26049A82416E6348J13490a51782
16175c8135A20136K6440g6835q7001e2489j54739E60283c0300j63740d1021j90105
16164b31126a6841q788j43583O3099I4217A6346b51061e1728j48392i5751k1738
16153a17489m7778O8895F5309c76625g1350C34998D5423b29261j96365b0749C06905
16141f4258k34170c0710q343A73241b79368h827k94063a304q5790B4230a6564
$$ plain form
16220 -73743 57482 192482 168459 -161417 117492 183510 49813 -64486 -156875 100887 165538
16209 165538 -213587 -213399 -149805 -11241 290054 66616 -58827 91053 -38239 67873 293634
16198 293634 -141905 -302064 -146689 204524 79976 276811 217972 113643 -503 -85255 -23608
16186 -235847 84122 64160 116524 -131737 104463 -126049 182416 56348 169838 -151782
16175 -38135 120136 146576 -76835 -163836 -52489 -207228 560283 -30300 -194040 -41021 -231126
16164 -231126 -16841 -25629 -169212 -106113 94217 16346 -251061 -51728 -200120 -95751 -117489
16153 -117489 -165267 -96372 65309 -376625 -71350 334998 45423 -229261 -425626 -20749 306905
16141 -64258 -298428 -30710 -39053 173241 -279368 -8827 -302890 -1304 -87094 24230 -16564
16129c55131a69546j00647C6657J77693E6437O9836A1445b5452E7533B3573j466
16118B2107i3847A73715b82517A68375N6005F0414c02628C13273F4788a597B29523
16106c9828j90244g7620m2005C89290A41470a27009C96187a1983Q83k250B09163
16094a09638A50922Q9927A0399K16011B5831K7053K6005C5374b10168B32425c94323
16082C16294B4919J847N723J602J26636K18033C8657K7386d9458B92542j44687
16071A47855b12186Q7556B26915b24905E9573L01983J4053j81185F3363K63103
16061C26466a51333j21300k1372c4227A48173J5259b99574Q7202b6240C6156J2083
16050D8239J68397q8020m4341h3463K0387A60133N6731i3012E2840b7586p6808
$$ plain form
16129 -355131 -169546 -270193 36657 214350 56437 126273 11445 -25452 57533 23573 22107
16118 22107 -93847 173715 -282517 168375 224380 60414 -302628 313273 64788 -1597 229523
16106 -39828 -230072 -77620 -119625 389290 141470 -127009 396187 -11983 -11100 -13350 209163
16094 -109638 150922 240849 10399 226410 25831 52884 78889 35374 -210168 232425 -394323
16082 316294 24919 26766 32489 34091 160727 378760 38657 66043 -49458 292542 147855
16071 147855 -212186 -124630 226915 -224905 59573 361556 375609 194424 63363 326466
16061 326466 -151333 -272633 -294005 -34227 148173 163432 -299574 -212372 -26240 36156 48239
16050 48239 216636 128616 84275 -83463 -63076 160133 216864 -93012 52840 -27586 -104394
16039a04394r981c4934j49844d0340j37036G2968K35264a72667A1685K83828E0192
16027b19709Q6783A15919c10859N7594b355A32259b58035a19174F6506a27724
16016a02473l53998a40087j89726J29117E6243i5097k83711J36789A83614G3072
16005a10434D2023b99622a26640L2797B05355a95278B11617a21456B79147A28211
15994a17152Q74L8541k55974l4149A08143M0021b08046E2853J22250p7898B8052
15982B14919K3510A16189O8971M6302I1029h812j28773f2209j62128d4825j18151
15971a62976j1624A09304N1514c07093A18146l8924J20522b87942D6868M6671
15961I3539l2266K83605f7744j53425P089J00498R243J9121K1365N602j74713
$$ plain form
16039 -104394 -114375 -34934 -184778 -40340 -177376 72968 308232 -172667 11685 295513 50192
16027 -219709 -132926 115919 -310859 -253265 -2355 132259 -258035 -119174 66506 -127724
16016 -102473 -456471 -140087 -329813 -200696 56243 -95097 -378808 -242019 183614 73072
16005 -110434 42023 -299622 -126640 -93843 205355 -195278 211617 -121456 279147 128211
15994 -117152 -116278 -77737 -333711 -367860 108143 148164 -208046 52853 175103 97205 28052
15982 214919 238429 116189 185160 231462 91029 -8812 -137585 -62209 -224337 -44825 -162976
15971 -162976 -174600 109304 160818 -307093 118146 79222 199744 -287942 46868 93539
15961 93539 61273 344878 -67744 -221169 -214080 -113582 -104339 -85218 -63853 -58251 -232964
15950b32964A86718c57826k3923a34924N9078H3402d23342K11229A50005b10704
15939B16297g3652E40e7832j32288E5859c33703J31551G7486B0542K32174M9270
15928C01986I1694h9186D4740c28761G3176j3074B2622O3091a88852n286A02378
15916b23256B30866a30849A55374b6226j30777O0557o3126F1067b01290j84933
15906c86223c6597l7885k64550a38801F8979d4207j96128j14065a6464C31630
15895F7859K21526j40696a37140p6266A61679p5314b67494A73728P3444a66223
15884a48682c441F3269a34574C9919h1633A52017c45880A24983a16145i604k75623
15873b85227E2879j6596J68718n0852j1079J9848a48678C14852a13191B56466
$$ plain form
15950 -232964 186718 -357826 -381749 -134924 -75846 83402 -423342 -212113 150005 -210704
15939 216297 -73652 540 -57832 -190120 55859 -333703 -202152 77486 20542 252716 301986
15928 301986 91694 -89186 44740 -328761 73176 60102 22622 85713 -188852 -194138 102378
15916 -223256 230866 -130849 155374 -26226 -157003 -96446 -159572 61067 -201290 -386223
15906 -386223 -36597 -74482 -339032 -138801 68979 -44207 -240335 -354400 -16464 331630
15895 67859 289385 148689 -137140 -213406 161679 86365 -267494 173728 247172 -166223
15884 -148682 -3441 63269 -134574 39919 -81633 152017 -345880 124983 -116145 -9604 -285227
15873 -285227 52879 36283 205001 154149 143070 162918 -148678 314852 -113191 256466
15862b77847C26592b2138k31865A06024b163F1075b03729n067B86842I54M7601
15851D8555b66930A66600E8575a69993A5686O8678c56517J47712D5149A3694a86400
15839I3881N8025D1294f7755k33643I1894K58301f8171P115K2267a0256l07030
15828c17286J34893j04336A5758O0070a22747A30170b39265K9588n5435e4582
15817b72672A22152c5o8798l9528n2514f2238A86091a90059c2231E7965M9369
15806A07334l9334J18273a65741a3602D0778J21146F3328j7739b64537J04416
15796a60121B6843c5030D14163A63922J50241a09098K5639A37126a49565c1587
15785G0470h2393H2441J34332e3150K5772l87428F2292c11509A9533b4355B4708
$$ plain form
15862 -277847 326592 -22138 -254003 106024 -2163 61075 -203729 -208796 286842 954 48555
15851 48555 -266930 166600 58575 -169993 15686 84364 -356517 -208805 45149 13694 -186400
15839 93881 151906 41294 -67755 -301398 91894 350195 -68171 -61056 -38789 -10256 -317286
15828 -317286 -182393 -286729 15758 75828 -122747 130170 -239265 -209677 -265112 -54582
15817 -272672 122152 -35 -68833 -108361 -160875 -62238 186091 -190059 -32231 57965 107334
15806 107334 68000 186273 -165741 -13602 40778 161924 63328 45589 -264537 -160121
15796 -160121 26843 -35030 414163 163922 314163 -109098 -83459 137126 -149565 -31587
15785 70470 -82393 82441 216773 -53150 -27378 -414806 62292 -311509 19533 -24355 24708
15773H6213K6248f0184D1994d41579a18589j03960F2266a84681I6265J74659a42230
15761f9592L781o4057I206O8615h5241m6315B1951K23088c46689C12258j21541
15750A90717c15591A49755a26360j75058i428A22851b2455o0615p778j09611j66781
15739c67240A5469J0936M0317L67672a44466B20966a89720A34520b7164e973F4504
15727A15054D227K7101J54281c782A26633f8692E4235D137J48080E7130i21k38054
15715b38975J18538j01228b131j41028d9323n4741d2392A08924b0956j68320j08716
15704b97992B08284m0144c56021a40905N6653E989c10973H0811B8363r625L2036
15693E0774J22540l219G2734C5373a73367c9287k16441d1010E107J2821J20703
$$ plain form
15773 86213 112461 -60184 41994 -441579 -118589 -222549 62266 -184681 96265 270924 -142230
15761 -69592 -65811 -129868 9206 77821 -85241 -131556 21951 245039 -346689 312258 190717
15750 190717 -315591 149755 -126360 -301418 -9428 122851 -22455 -83070 -90848 -200459 -367240
15739 -367240 15469 26405 66722 434394 -144466 220966 -189720 134520 -27164 -5973 64504
15727 115054 4227 31328 185609 -3782 126633 -68692 54235 4137 152217 57130 -921 -238975
15715 -238975 -120437 -221665 -2131 -143159 -49323 -104064 -42392 108924 -20956 -189276 -297992
15704 -297992 208284 168140 -356021 -140905 -84252 5989 -310973 80811 28363 18738 50774
15693 50774 173314 170095 72734 35373 -173367 -39287 -255728 -41010 5107 17928 138631
15682A38631c03696b6479d405j37241b0987n2480G041L49546A43267i8212A19088
15670F8273J77168e5288C12805H5934e2574k81394a01848o5956o5388N4248H1980
15658b4413j02379H672a0518H932K27531h6159e176k2766j60363H2964O163b14108
15645f4125l9915B45285A10282a06019j34518d8827J6733r6740B20559i9641F0006
15633a02185O681H571b25713A61623B6035g6769B02754a45949B64704b7228P465
15622a9763D5189J43393H3636c5283E5664R5201f0476j25505b1725j18437d2321
15610f6l15943C52183j27558a23631k21065A77081F7680b68506G9159l7143i7403
15598a33903j1184B39900j8679a07249d1441E6813A1725c33799g4185A08685k9655
$$ plain form
15682 138631 -303696 -26479 -4405 -141646 -20987 -73467 7041 356587 143267 -98212 119088
15670 68273 245441 -55288 312805 85934 -52574 -333968 -101848 -167804 -233192 -178944 81980
15658 -24413 -126792 8672 -10518 8932 236463 -86159 -5176 -27942 -188305 82964 89127 -214108
15645 -64125 -104040 245285 110282 -106019 -240537 -48827 -32094 -128834 220559 -99641 60006
15633 -102185 -95504 8571 -225713 161623 26035 -76769 202754 -145949 264704 -27228 -19763
15622 -19763 45189 188582 83636 -35283 55664 150865 -60476 -185981 -21725 -140162 -42321
15610 -66 -316009 352183 224625 -123631 -344696 177081 67680 -268506 79159 42016 -97403
15598 -133903 -145087 239900 221221 -107249 -41441 56813 11725 -333799 -74185 108685 79030
15587G9030h8374B52200b88292H5167K63974I1607K34709d3059A01575K018J03840
15576B07433a48278A7388L04827b40933M9666C1358a63919n8593N3899f2703o3324
15565a26027F0355d5901m7174B53795b3364G9131b10475M8929P5958B00555H9926
15553h6779D3859a8672A00147a09932k00557C69814h071q6150A29159f1058k0004
15542h1062q0936R414A80801L6226e2216J2503q8533D3087h9817J7478c4517A45837
15529A09192C869M7715J06096C9241d32278a878D1667i6382B12042j7241m1735
15518A53066e0151j0061F2878J1952h3932k6323j20585N8178A79108a78343G3232
15506b38062A017d6530j29430j64271b0656P600m1270D8719a24406a4249B49664
$$ plain form
15587 79030 -88374 252200 -288292 85167 349141 91607 326316 -43059 101575 103593 207433
15576 207433 -148278 17388 322215 -240933 -191267 31358 -163919 -222512 -168613 -62703 -126027
15565 -126027 60355 -45901 -93075 253795 -23364 79131 -210475 -161546 -85588 200555 89926
15553 -86779 43859 -18672 100147 -109932 -310489 369814 -8071 -94221 129159 -61058 -81062
15542 -81062 -161998 -152584 180801 217027 -52216 -39713 -128246 43087 -89817 -72339 -34517 145837
15529 109192 3869 51584 157680 39241 -432278 -1878 41667 -96382 212042 194801 153066
15518 153066 -50151 -60212 62878 74830 -83932 -110255 -230840 -172662 179108 -178343 73232
15506 -238062 1017 -46530 -175960 -340231 -20656 -13056 -54326 48719 -124406 -14249 249664
15494b28817a07241C2247M9418c01726C3900J88799o6232a1079D8836L04334G2542
15482G3830j7495a61680C9273b34935C3369Q6374i8948p272F142K58454a73798
15470A2315a87360J8014G5413a80931M2005b6872F7599c41374B51313O7927D2716
15458a20405n4243a0930A56595o3850c96123A31984b3034I6339h07j41237I3532
15446b13907B35954a94493B22998H5892C6261c1509B15389a1404A34040e5258
15435b37251p7720f639B6659a14525A86583A1968a54664I9218C3178J19126a48090
15423A42471D9821J5311c30166G2306a54407c2719J1668A34790b59898A70262
15412a8844A61768a49076B12555a12575b5009D5277J54047C8673b73804I5904
$$ plain form
15494 -228817 -107241 32247 81665 -301726 33900 222699 156467 -11079 48836 353170 72542
15482 73830 56335 -161680 39273 -234935 33369 119743 -98948 -106220 6142 264596 -173798
15470 12315 -187360 -169346 75413 -180931 -138926 -26872 67599 -341374 251313 319240 42716
15458 -120405 -174648 -10930 156595 92745 -396123 131984 -23034 96339 -807 -142044 93532
15446 -213907 235954 -194493 222998 85892 36261 -31509 215389 -11404 134040 -55258
15435 -237251 -314971 -6639 26659 -114525 186583 11968 -154664 99218 33178 152304 -148090
15423 142471 49821 65132 -330166 72306 -154407 -32719 -21051 134790 -259898 170262
15412 -18844 161768 -149076 212555 -112575 -25009 45277 199324 38673 -273804 95904
15401c476j63181A17357f4660a6631C1168O1690K33996D4305e2023C18954h7004
15389A67003L3340m4795g4914j77287C76645a36966o2755b6681A38471d357B14451
15377B59251e2503A36201m8261i4293I9003m2551M5501k3301f2067o7852e9281
15365c09316D3825c1541E2983J48358N503B0117b28203A3367L2520b77230c8630
15353b9511l919j27427a9544B974N5089R2686a9115k07941m2301e9258C55829
15341A29819E2446J65197b82948R0931p4787a07399L7712B5407J12111g2799K9107
15330d3692b1350B04885A6281c21912A51604K40120A73889a25704A88292a40006
15319A68654l4641L9874i2167r4597Q5493J5817A29796e9964C8919M9261e2394
$$ plain form
15401 -3476 -166657 117357 -64660 -16631 31168 92858 326854 44305 -52023 318954 -87004
15389 167003 200343 155548 -74914 -252201 376645 -136966 -199721 -26681 138471 -4357 214451
15377 259251 -52503 136201 87940 -94293 99003 56452 101953 78652 -62067 -129919 -59281
15365 -309316 43825 -31541 52983 201341 206844 20117 -228203 13367 45887 -277230 -38630
15353 -29511 -33430 -160857 -19544 2974 58063 150749 -19115 -227056 -269357 -59258 355829
15341 129819 52446 217643 -282948 -192017 -266804 -107399 -69687 25407 137518 -72799 -43692
15330 -43692 -21350 204885 16281 -321912 151604 391724 173889 -125704 188292 -140006
15319 168654 134013 173887 -92167 -186764 -101271 -85454 129796 -59964 38919 88180 -52394
15307b26499A73875B0560f3190D51944b1581h868C9362J35078J7597C049J40293
15296A43342K6969C2594a28291c7551K135A22054j5691a86799C52626F84a79500
15284c62921l9580c885A19810l525a26675B5156a02808B55289J26069n0748G7088
15272a23424A31601J54172F4499O1540N8195E0381a57219b8265k81157a1596k9222
15261d0818J6971B152a63891b0017h102H5878A9670e5649A55409B6441L55517
15250C81958B4454N08943K90529N99232L07360n00276n1244O1636D80913j18009
15240C62904A75740P340B6873c3240B05181J2263C0003r87Q9503J98814d017k0126
15228b4143B32596j10917l3269i2796C1116J18940A2540J49958b8643A00119R5861
$$ plain form
15307 -226499 173875 20560 -63190 451944 -21581 -8868 39362 174440 192037 3049 143342
15296 143342 170311 32594 -128291 -37551 -35416 122054 106363 -186799 352626 684 -179500
15284 -362921 -402501 -3885 119810 116285 -126675 25156 -102808 255289 381358 330610 77088
15272 -123424 131601 285773 64499 126039 184234 50381 -157219 -28265 -309422 -11596 -40818
15261 -40818 -23847 2152 -163891 -20017 -8102 85878 19670 -55649 155409 26441 381958
15250 381958 24454 533397 823926 1423158 1730518 1230242 1178998 1240634 480913 362904
15240 362904 175740 183080 26873 -33240 205181 217444 30003 29016 118519 317333 -4017 -24143
15228 -24143 232596 121679 88410 -92796 31116 150056 12540 162498 -28643 100119 195980
15217A95980D4691c64659J81660B07940O2750c50771d8074o09A0501J47176K50186
15206D07863i8052b4334E4901r279g5858n5126k4344C48275A51355b5974A14033
15194b25715n4889J17684B49667D655b27641B35250A0458J19847J29691N7039
15184C17035a42269A98608q4782f5420R381F7114B5330J37540b17598N9108k4873
15173a83363C95909A68971b5121A0664b0237l2634A59076E4860a28924B12141
15162a4640j6622j35728B2523J04160g166E6478J57022F448d05577B86427e2278
15150B63410K503H3558K49165A06776P5670J06482A26485d7026A75375a68597
15139B8344a04145B71063A29010b57783A85242O6269I1764a53618B25257k8295
$$ plain form
15217 195980 44691 -364659 -182999 207940 270690 -350771 -48074 -48683 10501 157677 407863
15206 407863 -98052 -24334 54901 45622 -75858 -130984 -155328 348275 151355 -25974 114033
15194 -225715 -280604 -162920 249667 4655 -227641 235250 10458 130305 259996 317035
15184 317035 -142269 198608 113826 -65420 -56039 67114 25330 162870 -217598 -158490 -183363
15173 -183363 395909 168971 -25121 10664 -20237 -52871 159076 54860 -128924 212141
15162 -14640 -31262 -166990 22523 126683 -7166 56478 213500 6448 -405577 286427 -52278
15150 263410 265913 83558 332723 106776 182446 288928 126485 -47026 175375 -168597
15139 28344 -104145 271063 129010 -257783 185242 251511 91764 -153618 225257 196962
15129A96962N7168A10588J91043A37843b40000B77347l5450j9934f5992B42449
15118c8096A08504J12930E788L40457I5662k5747a0783D1627P3101Q6422a61896
15106A39140e8896C5178e8762B46205A17067l6087K58940R0566a41821D2188L24842
15095C67030j27205D5344k961K00202J42979A33257K0331P9960n2067J02128j05762
15084A77847a9980C92098f8625G61603B98453q6447j02264c32852B67700q3651
15074A84049N0575e9759A80119E0204K2393K58675a2523l0511m5156G9118a63571
15062a88883E0040K2667H084K3968a26030A46065j5975a28858q4915B43306q1292
15051A62014m4914i6574B93677q5633p5495Q2287h9536C80205j06966j24587n8795
$$ plain form
15129 196962 254130 110588 301631 137843 -240000 277347 241897 221963 -65992 242449
15118 -38096 108504 221434 5788 346245 95662 69915 -10783 41627 114728 201150 -161896
15106 139140 -58896 35178 -58762 246205 117067 80980 339920 430486 -141821 42188 367030
15095 367030 239825 45344 42383 242585 385564 133257 153588 233548 181481 283609 177847
15084 177847 -19980 392098 -68625 761603 298453 212006 109742 -332852 267700 184049
15074 184049 234624 -59759 180119 50204 72597 331272 -12523 -43034 -88190 79118 -163571
15062 -188883 50040 72707 8084 32052 -126030 146065 130090 -128858 -213773 243306 162014
15051 162014 117100 -96574 293677 208044 132549 214836 -89536 380205 273239 148652 89857
15040H9857b34121B82177j13182K9348a48889H7706L44908J3764F2243J57366
15030B19609J1365J79188I4627J85429j16406B2676a66311A50578R6810A20326
15019A42380k9522J00377N0740J3517H5436b65372h465A30702J4793J11958f9665
15007B16287J21653j21233J44176A20709R1502J00207c20410B98864Q4722J43486
14997E27072j92866p1848E5347K55200i7117F4351J2265J29090q0149N1354P2812
14986B49723J71250o0566d1838B78473b80466C19698A2770L83334P6552A83942
14975A90030O2152E7787i6928C54639J37187k38895B7278L7979L15644j04147
14965B76754M8937A17142h0865B40526r6750K3968K106n023m771n612K82229j09963
$$ plain form
15040 89857 -234121 282177 168995 198343 -148889 87706 432614 446378 62243 219609
15030 219609 230974 410162 94627 280056 163650 22676 -166311 150578 247388 120326
15019 142380 112858 213235 263975 277492 85436 -265372 -8465 130702 145495 257453 -69665
15007 216287 337940 216707 360883 120709 212211 312418 -320410 298864 383586 527072
14997 527072 334206 262358 55347 310547 -97117 64351 76616 205706 125557 176911 249723
14986 249723 420973 360407 -41838 278473 -280466 319698 12770 396104 472656 183942
14975 190030 252182 57787 -96928 354639 491826 252931 27278 65257 380901 276754
14965 276754 325691 117142 -80865 240526 143776 167744 169850 164827 160056 154444 436673 326710
14953C26710Q0149H3671J15291N2482F9501J87561L9103j35883b5927C97348m3759
14942C53589A60832N1205H5820J73248J07334A80377m201K2897J09081K59147
14932E67301k75298a63235B30798o3357R4412i6456B41094g4104B24621A00883
14921B59512p4726L53214j75645k2707j67880M0491L88707B37259J25956Q6022
14911D49237d432B61162M9877N1135A75212d7288C52432A33233J36984Q6114A68575
14899D46559b7651D93893A85222L33861A61957K20961O137J45348A45483J16985
14889B62468Q3793j07676P5948K75771j33508j10233N1172j48401J75535j46814
14879B78055A31114M96292k49495A51375O5380J84389J69304R0024j71556A82022
$$ plain form
14953 326710 406859 83671 198962 251444 69501 257062 296165 160282 -25927 397348 353589
14942 353589 160832 212037 85820 259068 366402 180377 176176 199073 308154 567301
14932 567301 292003 -163235 230798 167441 261853 -96456 241094 -74104 224621 100883
14921 259512 184786 538000 362355 339648 171768 212259 600966 237259 363215 449237
14911 449237 -4432 261162 311039 362174 175212 -47288 352432 133233 270217 356331 168575
14899 446559 -27651 493893 185222 519083 161957 382918 389055 534403 145483 262468
14889 262468 346261 238585 314533 590304 456796 346563 397735 249334 424869 278055
14879 278055 131114 627406 377911 151375 216755 401144 570448 660472 488916 182022
14868b8817A20470L56986p3921I8706L31354m1632J42207k42702q4247N05569
14858G09255C23732M43301B51383K33447k41557R0779L90000k44421k12828K29139
14848D95942L9332j86196J1733n6852K71108Q3999j0057C19315j30716J55455
14838C44054J6861A56220K09613M9715k2658J04744J19467B91985K0781J14817
14828D27583K56108N0139B31082J27809A53100L15960q9961n308j14633K05813
14818D64971j66017P859j18407K45508J03705A91477K63966J90974k73703J73450
14808E46164j00435P7710k204J18367B67564K94833l4866L2713J58424p2606j1334
14797F34728j38023j36440J25494n9635m5699L00731j42856K21361k08186q6551
$$ plain form
14868 -28817 120470 477456 403535 98706 430060 388428 530635 287933 203686 709255
14858 709255 323732 767033 251383 484830 243273 334052 724052 479631 266803 495942
14848 495942 535274 349078 360811 303959 575067 659066 649009 319315 188599 344054
14838 344054 360915 156220 365833 415548 392890 497634 617101 291985 312766 427583
14828 427583 683691 733830 231082 358891 153100 469060 379099 373791 259158 464971
14818 464971 298954 306813 188406 433914 537619 191477 455443 646417 372714 546164
14808 546164 445729 523439 521235 639602 267564 562397 527531 560244 718668 646062 634728
14797 634728 496705 360265 485759 426124 380425 681156 538300 759661 551475 464924
14787D64924K01631j53604m2483Q8428n7667q296r9054K51642n0822j52529K65886
14776G08056r0558M9070K23386k26633o6560r3344J52261J699L3844k5540j07087
14765E58594J71195k55157J26482K2993B38879K97154N8174M0648m8786j63221
14755D22848K30449J4305l23081M85006m6000k09629k028k0705j00375K95811
14745G46601o3688J88538l74651K95778K2575D06286N77294l10911j3671k17291
14735D41707K80320j71860j43243L43827R0771l87087N11896k81544Q1964C26657
14724D06493K02154L06879J02015Q2398E19180Q2261L3723J78845k23926L14721
14714I04804N1716j22392M8279k15118L16350k5489j26501j88758L8199L0351
$$ plain form
14787 464924 666555 512951 470468 558896 501229 492933 393879 645521 594699 442170 708056
14776 708056 617498 666568 889954 663321 596761 503417 655678 657377 691221 665681 558594
14765 558594 729789 474632 601114 624107 238879 536033 594207 634855 586069 422848
14755 422848 653297 667602 344521 829527 783527 573898 571870 551165 450790 746601
14745 746601 682913 871451 496800 792578 815153 406286 983580 672669 658998 441707
14735 441707 722027 550167 406924 750751 841522 454435 966331 684787 766751 326657
14724 406493 608647 915526 1017541 1099939 519180 601441 635164 814009 590083 904804
14714 904804 956520 834128 882407 667289 983639 958150 831649 642891 681090 711441
14704G11441L708k62631M15908k58788P10686n54271L66751l71672J25171k09807
14694F76496N621m4792M37697l71046j92942J55653K84756j28440J60347Q2939
14684A066289J56999l67002k77423K68098J96410j7063k55665M6478K48239o6797
14674I98563m4615K31131j13958J68377l29153J00510K67942j75069l3714L9164
14664A109178K11854m20919j0584J86559J1987j89585K83005j24642j58673K78514
14654A176694p8686J05471l2235j19021K82491l11023L7421o2114O5043K89333
14644A353374J16440P4595l81675J24747k70257L9756K80812k00217L71969j58199
14634A351345r7852K59285j69646j80219R0512k98285N71137l84738p2972J66063
$$ plain form
14704 711441 715149 452518 868426 609638 1320324 766053 1132804 761132 886303 676496
14694 676496 682117 637325 1075022 703976 511034 666687 951443 823003 983350 1066289
14684 1066289 1223288 856286 578863 846961 1043371 1026308 770643 817121 1065360 998563
14674 998563 953948 1185079 1071121 1239498 910345 1010855 1278797 1103728 1070014 1109178
14664 1109178 1321032 900113 889529 1076088 1088075 898490 1181495 1056853 898180 1176694
14654 1176694 1098008 1203479 1171244 1052223 1334714 1023691 1061112 998998 1064041 1353374
14644 1353374 1469814 1544409 1162734 1287481 1017224 1056980 1337792 1137575 1509544 1351345
14634 1351345 1253493 1512778 1343132 1162913 1253425 955140 1526277 1141539 1068567 1234630
14624A234630J30946K46947m20675K71964j26987r2853K33504j02533O4224l7163
14614A402004K58039k54739K03813k73661M16263j95803j91097N33693m19717
14605A478795p5567J42658k9815k00548L46675p8691L50362l50029j19097N1444
14595A516187K37784J05696m3070m29438K86049K4317j27209M5388J11099J48102
14585A874905j07522J07896j45974J71263l44936N6219L74709j79000N13512o63615
14575A657457K62132K77155P235j58579K60854l06202J51564j18491L22893J77966
14565B533984l03301J92450l5870K07024q4345l2926N54831l84964J78638Q19799
14555C645320l21216K99136J68260P45030M65126J495301K079814N300017Q374279
$$ plain form
14624 1234630 1365576 1612523 1191848 1463812 1336825 1243972 1477476 1374943 1439167 1402004
14614 1402004 1660043 1405304 1609117 1335456 1751719 1555916 1364819 1898512 1478795
14605 1478795 1403228 1545886 1516071 1315523 1662198 1583507 1933869 1583840 1464743 1516187
14595 1516187 1753971 1859667 1816597 1387159 1673208 1697525 1570316 1615704 1726803 1874905
14585 1874905 1767383 1875279 1729305 1900568 1555632 1611851 1986560 1807560 2321072 1657457
14575 1657457 1919589 2196744 2203979 2045400 2306254 2000052 2151616 2033125 2356018 2533984
14565 2533984 2230683 2423133 2387263 2594287 2509942 2477016 3031847 2646883 2825521 3645320
14555 3645320 3324104 3623240 3791500 4536530 5001656 6496957 8576771 13876788 22251067
14546B2251067J1150127j091609n026383j2751970o712682k646565k166413p23410
14538B282162k80059k08702R3411M70577m93948J58314M24612m40743K71227k65487
14528B011364j03903L81432j23724L18367j48904r7785P244K22516L9037k21858
14518B283786J54481M0925o2056J04784K4859Q5038J81181m61947K84233N85029
14508C220313l22195o03919R14288k93948n3001K23882j06490j44024j09143L39507
14498C065270p6754N33942j15846m04213N56643l47940J12220M4502J23819k4126
14488C467517q4931J29130k39660N19352J97721k22262J52676J95757k83114j06953
14478C725233M02102j0361k34411k32944M45355k39353M60278l94632M51938J50724
$$ plain form
14546 22251067 33401194 32309585 27283202 14531232 7818550 5171985 3005572 2282162
14538 2282162 2002103 1793401 1886812 2357389 1863441 2021755 2446367 2005624 2276851 2011364
14528 2011364 1907461 2288893 2165169 2483536 2334632 2236847 2244091 2466607 2505644 2283786
14518 2283786 2438267 2479192 2417136 2521920 2546779 2631817 2812998 2351051 2635284 3220313
14508 3220313 2898118 2294199 3208487 2914539 2861538 3085420 2978930 2834906 2725763 3065270
14498 3065270 2988516 3522458 3406612 3002399 3559042 3211102 3323322 3367824 3491643 3467517
14488 3467517 3382586 3511716 3272056 3791408 3989129 3766867 3919543 4115300 3832186 3725233
14478 3725233 4127335 4116974 3882563 3649619 4094974 3855621 4315899 3921267 4373205 4523929
14468D523929L4465l02246K35412l0513J45787k05172L95025j07888n8478K60667
14458D890988J71646J00929j05843J56506q9626j84649L24544l9285j95803J70057
14448E199464L61428j84512N6544M58925k04226J07591n6612L89899j323r8460
14438F028718J14932J5102M2298M00906k60674K56776l43925N12806j56589M55702
14428G066052j99667J1540j21182M94167j90598L57157L77695k20740n304L91812
14418G960932Q9931k32601N46487L5918k03428M19937j0026J01828l5904K44059
14408H917133o8028J85094L92606k08453M79577K06826J71176N2525j14655L99577
14398A0413378K30171J86824L37400q3629N48259O9630K15001o6175L08456M23754
$$ plain form
14468 4523929 4558394 4256148 4491560 4461047 4606834 4401662 4796687 4688799 4630321 4890988
14458 4890988 5062634 5163563 5057720 5214226 5124600 4939951 5264495 5225210 5029407 5199464
14448 5199464 5560892 5376380 5432924 5891849 5687623 5795214 5738602 6128501 6127178 6028718
14438 6028718 6143650 6158752 6201050 6601956 6341282 6598058 6254133 6766939 6610350 7066052
14428 7066052 6866385 6877925 6756743 7250910 7060312 7417469 7795164 7574424 7569120 7960932
14418 7960932 8050863 7818262 8364749 8400667 8197239 8617176 8607150 8708978 8673074 8917133
14408 8917133 8849105 9034199 9426805 9218352 9697929 9904755 10075931 10128456 10013801 10413378
14398 10413378 10643549 10830373 11167773 11084144 11632403 11702033 11917034 11850859 12159315 12583069
14388A2583069k7313R8664M52624J64145K68131K87498M01258P1250J62151K85327
14378A4746804N20729P3612L72003K13508L94198K57250N18174K08571M29893
14369A7734742k2452K15617O39415O98296R645M22528N74240J75954Q00445N84962
14359B1833392m7785O10776P46750M11243O43179M95643O73900N39574M74433
14350B6381105O28833N93686Q57779L54855J073059Q19426K76502J244841M74017
14341C2704103J061905J142014J002317J033809P81364R86216J054087J423920
14333D1189735J151841J385079J296579J437457J482466J083539J927663J614882
14325E2569241J822764J506214K418502J961420J618097K290391K410136K376596
$$ plain form
14388 12583069 12555756 12654420 13107044 13271189 13539320 13826818 14228076 14299326 14461477 14746804
14378 14746804 15267533 15341145 15713148 15926656 16320854 16578104 17096278 17304849 17734742
14369 17734742 17712290 17927907 18567322 19265618 19275263 19697791 20272031 20447985 21248430 21833392
14359 21833392 21785607 22396383 23143133 23554376 24197555 24693198 25367098 25906672 26381105
14350 26381105 27009938 27603624 28461403 28816258 29889317 30708743 30985245 32230086 32704103
14341 32704103 33766008 34908022 35910339 36944148 37725512 38711728 39765815 41189735
14333 41189735 42341576 43726655 45023234 46460691 47943157 49026696 50954359 52569241
14325 52569241 54392005 55898219 58316721 60278141 61896238 64186629 66596765 68973361
14317F8973361K525448L130034K396111K782006L315613L611694L470491L687115
14309I3891873L867848M010845M256635M669747M831184N132640N570502N722934
14301A31954208O149903O030031P063436P560900P218726Q192002Q457397R308280
14293A91934883R009412J0528083J0677688J1086116J1944896J2277947J2884219
14286B70343244J3357675J3753918J4324163J4595674J4482111J5244602J4727469
14279C70828856J4325472J4012973J3396643J2024424J0984865Q084009M017500
14272D47674742J85070q20371j991836j569441N057955p51029l260034o963885
14264D37561171q496569r951256j2166231j2870690j3668657j4450052j4923075
$$ plain form
14317 68973361 71498809 74628843 77024954 79806960 83122573 86734267 90204758 93891873
14309 93891873 97759721 101770566 106027201 110696948 115528132 120660772 126231274 131954208
14301 131954208 138104111 144134142 151197578 158758478 165977204 174169206 182626603 191934883
14293 191934883 200944295 211472378 222150066 233236182 245181078 257459025 270343244
14286 270343244 283700919 297454837 311779000 326374674 340856785 356101387 370828856
14279 370828856 385154328 399167301 412563944 424588368 435573233 443657242 447674742
14272 447674742 447859812 447039441 445047605 443478164 448536119 447785090 444525056 437561171
14264 437561171 429064602 419113346 406947115 394076425 380407768 365957716 351034641
14257C51034641j5644869j5515713j5193120j4703486j3606112j3098992j2852458
14250B50419891j2834895j1486366j1623331j0524310j0003829r242262r011021
14243A75693877p969665q035778p491078p294950o209742o145519o079578n468016
14235A20999551n059593m961173m719802m167147m258666l652577l598033l423796
14227H7158764l916450k770101l132217k648306k596059l021925k151525j975150
14219F4947031k380121k047974k247023j940735j291382k058701j662292j330063
14211D9988740j740894j188987j566545j201157o74985j597984j056559j368189
14203C9593440q97277j409306p92740j009367n61387j229727o49269j165439r15235
$$ plain form
14257 351034641 335389772 319874059 304680939 289977453 276371341 263272349 250419891
14250 250419891 237584996 226098630 214475299 203950989 193947160 184704898 175693877
14243 175693877 167724212 159688434 152197356 144902406 138692664 132547145 126467567 120999551
14235 120999551 115939958 110978785 106258983 102091836 97833170 94180593 90582560 87158764
14227 87158764 83242314 80472213 77339996 74691690 72095631 69073706 66922181 64947031
14219 64947031 62566910 60518936 58271913 56331178 55039796 52981095 51318803 49988740
14211 49988740 48247846 47058859 45492314 44291157 43616172 42018188 40961629 39593440
14203 39593440 38696163 37286857 36494117 35484750 34923363 33693636 33044367 31878928 30963693
14194C0963693j71584q07827q41077q07013p44562p95142o63733n06098q07957
14185B4818700p26483K29749q21223n58932n48743m40552l49166n38183l91409
14176B0673758m40228n78850l55764l13009m65085l06344o91428l5567m18210
14167A7069273j4771o73535R6866m09079j67631o35482J83688q18595k39971M7673
14157A4438436j91983l67322J16042o68358m3500j42258l54595m56507L9172j08042
14147A2261085p0469n30715j0314J02879m48575r5561l19313k55267j13247l34620
14137A0185883K58001r8753m16890M4650m77148O237j58099N5037j74519K8990
14127I253389m77867l443J7832k13183j76169k94742J40887J23509l61048l26718
$$ plain form
14194 30963693 30792109 29984282 29143205 28336192 27591630 26796488 26132755 25626657 24818700
14185 24818700 24092217 24321966 23500743 22941811 22393068 21952516 21603350 21065167 20673758
14176 20673758 20233530 19654680 19298916 18985907 18520822 18214478 17523050 17487483 17069273
14167 17069273 17054502 16380967 16477833 16068754 15901123 15265641 15449329 14630734 14390763 14438436
14157 14438436 14246453 13879131 13995173 13326815 13283315 13141057 12786462 12329955 12369127 12261085
14147 12261085 12190616 11659901 11649587 11752466 11303891 11208330 10889017 10633750 10520503 10185883
14137 10185883 10443884 10345131 9928241 9972891 9495743 9501980 9343881 9398918 9224399 9253389
14127 9253389 8775522 8772079 8789911 8576728 8400559 8105817 8246704 8370213 8009165 7682447
14117G682447K40516j98392J0697n02043L0931j45782K26290n8854j32215N0838
14107G204433n82124K31892K0570l03095r0673Q0008k11978L1048n0640j94593
14097F134848j89382K39638q1199j44089k07878J33801k08288n25968N8238M33684
14087E643405k03864l8876n8316r8689J15776k63083o2659j48546Q9618N2477
14077E027243m39204N86597k84811m21611J75639j39331o1078L27127j43112k10465
14067D416994K52904l94986l08868J50049O3446Q3429R5630k8603l42651K67032
14057D254376N2844m87887L55489l63042K8798j46360J87502j92427q1940Q6352
14047C693705l5391j03722J00988r3786J40819k99144j62380L93390l90277j3102
$$ plain form
14117 7682447 7922963 7724571 7735268 7233225 7264156 7118374 7344664 7285810 7153595 7204433
14107 7204433 6622309 6854201 6874771 6571676 6481003 6561011 6349033 6380081 6329441 6134848
14097 6134848 5945466 6185104 6103905 5959816 5751938 5885739 5677451 5151483 5209721 5643405
14087 5643405 5439541 5400665 5342349 5243660 5359436 5096353 5033694 4885148 4974766 5027243
14077 5027243 4588039 5174636 4889825 4468214 4643853 4504522 4443444 4770571 4627459 4416994
14067 4416994 4669898 4274912 3966044 4116093 4179539 4262968 4358598 4329995 3987344 4254376
14057 4254376 4307220 3819333 4174822 3811780 3840578 3694218 3881720 3689293 3607353 3693705
14047 3693705 3658314 3554592 3655580 3561794 3702613 3403469 3241089 3634479 3244202 3231100
14037C231100k7352L02277l13371J80171l32158O49367m10056j44008J73353k39280
14027C070043m3495n0032K0909j17728N9175J87103j43956l02645M7671J01108
14017B828153p8562P7608K71938n64830J25392l65030K90661L09448k29503k19555
14007B445720J04695J4822Q4905k41335j69134P5103J72153K78775m84897O1799
13997B342606o9468j13359K21523l74454Q4812L03582J00067O67421J514746L839169
13987H516645Q120155J3320995K293100j962574j2452265p737495l225347j630513
13979E242701q40431k47751o27832m65743p6661J54303l94320L7955Q7299m40417
13969B429103J71636L2006l03578J97184l49373K25377R0106l15465P2528J35655
$$ plain form
14037 3231100 3203748 3506025 3192654 3372825 3040667 3690034 3279978 3135970 3309323 3070043
14027 3070043 3026548 2976516 2997425 2879697 2938872 3125975 2982019 2679374 2727045 2828153
14017 2828153 2749591 2827199 3099137 2534307 2659699 2294669 2585330 2894778 2665275 2445720
14007 2445720 2550415 2565237 2650142 2408807 2239673 2314776 2486929 2765704 2280807 2342606
13997 2342606 2273138 2159779 2381302 2006848 2091660 2395242 2495309 3162730 4677476 8516645
13987 8516645 16636800 29957795 32250895 30288321 17836056 10098561 6873214 5242701
13979 5242701 4402270 4154519 3526687 3060944 2984283 3138586 2744266 2782221 2869520 2429103
13969 2429103 2600739 2632745 2329167 2526351 2176978 2402355 2492461 2176996 2249524 2385179
13959B385179n3444n14918M69125o7316Q2003m65969N9973O3597r3469J26518
13949A991279K01931r6959m29922J58013m3009J93551k09050K71832k14468K11290
13939B034488k23533N1066N4652j51090j7186M69274j51224k37351q6804k62571
13929A479721K66116L157N4171K0411l12245O9924L48696k21350p8917k83863
13919A345821K56270J20967P126o6115l49662L38229N1329l19216J19861m1107
13909A463503j60091J13249j60908L00788J7296k06806j64166J50193K69539m11520
13899A211077J45976j37837K74541j5688O5250n163O5497k40498n08m7350j30801
13888A184496L29714j37900j58321j33762J97448L4257Q312J83694k99979j63963
$$ plain form
13959 2385179 2331735 1816817 2285942 2218626 2300629 1834660 1894633 1958230 1864761 1991279
13949 1991279 2193210 2096251 1666329 1824342 1781333 1974884 1765834 2037666 1823198 2034488
13939 2034488 1810955 1862021 1916673 1765583 1748397 2217671 2066447 1829096 1742292 1479721
13929 1479721 1745837 1748994 1803165 1823576 1511331 1581255 1929951 1708601 1629684 1345821
13919 1345821 1602091 1723058 1730184 1664069 1314407 1652636 1703965 1384749 1504610 1463503
13909 1463503 1303412 1416661 1255753 1556541 1573837 1367031 1202865 1353058 1622597 1211077
13899 1211077 1357053 1219216 1493757 1478069 1543319 1538156 1603653 1363155 1362647 1315297 1184496
13888 1184496 1514210 1376310 1217989 1084227 1281675 1315932 1324244 1507938 1207959 1043996
13878A043996j44307K42935J2684J22165j69724J18674J46469j79645r5115J71954
13868A270086j26822j00277l5169K95770j95402M935j99603K02530E52684N48672
13858A101356P3175Q5032l02757L21241p5741J02572k25375l4886P4217K19280
13848A338114k38328j49919K10949k12675J479M8253P4934k14174K33744j12726
13838I79651j02712j8233P1811P7477J10580k65675k0712L11753k34831J19023
13828A028132J24693j72255m64670M02273j71113K20717l9529L0267J2450j6126
13818I54839q0237k3168R9591p9195J77904n2988k569o808l60775J99563k24880
13807F01277j94561L93126L08914j44931k92624L11226j26927j95904M3427K14271
$$ plain form
13878 1043996 899689 1142624 1155308 1277473 1107749 1226423 1372892 1193247 1098132 1270086
13868 1270086 1143264 1042987 1007818 1303588 1108186 1113121 913518 1116048 552684 1101356
13858 1101356 1174531 1259563 956806 1278047 1202306 1304878 1079503 1044617 1118834 1338114
13848 1338114 1099786 949867 1160816 948141 949620 997873 1072807 858633 1092377 979651
13838 979651 876939 858706 930517 1007994 1118574 852899 832187 1143940 909109 1028132
13828 1028132 1152825 980570 515900 918173 747060 967777 928248 958515 970965 954839
13818 954839 874602 851434 951025 871830 1049734 996746 994177 987369 626594 826157 601277
13807 601277 406716 799842 1108756 963825 671201 982427 855500 659596 703023 917294
13797I17294O3496n8089j83706l9350K38084J258l29432K56795k0898J86046l38609
13786F92889R311L30288k46358C04027M26413J90325j77447J53299C89087J62756
13776E51843o0058M18882j12458C80925J380M61392M8866l19097R7012k18466
13766D52012M8602L11028J38304C99725L62836r0388K59430k72034K00014o1711
13756G97872l08027K43893q2771L44714l65331J65479j66085L11484J59619m36809
13746F64038r8165J83519j01793k41866K98375Q9892q5889j54925K59580k40445
13736E72321J19010C41667L73106R7819o5620j25143j26873J18606R7347O1371
13726G72280j44591L3346k5377k29789L11108K63202k29979J62558l06214J7630
$$ plain form
13797 917294 980790 922701 738995 699645 937729 938987 609555 866350 845452 1031498 692889
13786 692889 702200 1032488 786130 304027 730440 920765 743318 896617 389087 551843
13776 551843 491785 910667 798209 380925 382305 843697 892563 573466 670478 452012
13766 452012 500614 811642 949946 399725 762561 672173 931603 659569 859583 797872
13756 797872 489845 733738 650967 995681 630350 795829 629744 941228 1100847 664038
13746 664038 565873 749392 647599 405733 704108 794000 708111 553186 812766 572321
13736 572321 691331 341667 714773 812592 746972 621829 494956 613562 710909 772280
13726 772280 627689 661035 635658 405869 716977 980179 750200 912758 606544 624174
13716F24174J40098k93185j47902L39250l25586L00426j06036j6446O6339j64588
13706D16544L56949C54465K52290J16549k44525K81733k53626K9801k14235J00899
13696D23351N07941l06849O3690j58587J04988q1634K56940k75016j01825K94422
13686G27421j68782M3899J15482C41949K51942K01950j75017j45481j36433K05256
13676E44166k13456J66127Q3142j03911J74011k62017K03070L6345M4249j66211
13666E05515k00J06188B14792L50467j1792r0586P4487j54282J40034o2575j87627
13655B72918L63451A31679K23202L02825j62668K36898l18364j75791P6624A18598
13644C05632j06775L18815L6556j30587K33052j94523P514j13277J42134J31577
$$ plain form
13716 624174 764272 471087 323185 662435 336849 637275 531239 514793 581132 416544
13706 416544 773493 354465 606755 723304 478779 760512 506886 536687 322452 423351
13696 423351 931292 624443 688133 529546 634534 552900 809840 534824 432999 727421
13686 727421 558639 602538 718020 341949 593891 795841 620824 475343 338910 544166
13676 544166 330710 496837 579979 476068 650079 388062 591132 627477 671726 505515
13666 505515 505315 611503 214792 565259 553467 462881 537368 383086 523120 460545 272918
13655 272918 636369 131679 354881 657706 495038 731936 413572 237781 314405 118598
13644 305632 198857 517672 554228 423641 656693 462170 469684 356407 498541 630118
13634F30118j72265j73056J74815n7924o7204j094A56705L20023J16051k95058
13624B97721K37406j81734K18079j20418K97008k27908j77230p665J42240A74100
13613B15446M3819L44158k30894J84756B53499K36738p5053A67753k8798K86698
13603D25653j45310K1532J39357j05996R6796k0545J64739n553k20446k79A18273
13591C92237n4588j09954M64159C43897j12653j5049M90235k81344J2248N2083
13581D89417J14234k46078M11821C40248J86581j37300n41j57941L44357D5212
13570D83419J99085k51345A91589J60948p1105J47697j81295J40077d3909E64938
13559C69687N4616j37221Q2192O1294k3119d8154B3286K98585J45239l4747q0291
$$ plain form
13634 630118 457853 284797 459612 401688 334484 333390 156705 476728 592779 297721
13624 297721 535127 353393 571472 451054 748062 520154 342924 335259 477499 174100
13613 215446 259265 603423 372529 557285 253499 490237 415184 167753 138955 425653
13603 425653 280343 301875 441232 335236 432032 411487 576226 570673 350227 349948 118273
13591 392237 337649 227695 691854 343897 231244 216195 706430 425086 437334 489417
13581 489417 603651 357573 769394 340248 526829 389529 388988 231047 575404 45212
13570 483419 682504 431159 191589 352537 281432 429129 247834 387911 -43909 564938
13559 369687 424303 287082 369274 430568 407449 -48154 23286 321871 467110 432363 352072
13548C52072j16096J2581K05481a56746B90894A42459J14923M20933n8016k24031
13538C96268A42660J99968J24456j58515j43458l9316B5280J83021J49408j62315
13528A95394R2230H4400K07571J29295i9506C11523J31876r5981A69469K8116
13518A97585J47825P7848j22360J07612N426k04121K96318j38741p7908b41262
13507d2889B31362J73747J05526A26580R0150n100q6621L0664R9602B8531K30683
13496B59214I0484O78009C67398J62127A58249L8481P9865K57340j60623j50143
13486B23169K70895K6354A77047J09151n6759K83123B51225Q4309J74237j82040
13476C27731j6008H1736K15454C5198J80906J20410Q477H747J41280m2087R0411
$$ plain form
13548 352072 235976 248557 454038 -156746 290894 142459 257382 678315 620299 396268
13538 396268 142660 342628 467084 308569 165111 125795 25280 208301 357709 195394
13528 195394 287624 84400 291971 421266 -99506 311523 443399 347418 169469 197585
13518 197585 345410 423258 300898 408510 413936 209815 506133 367392 289484 -241262
13507 -42889 231362 405109 510635 126580 216730 211630 125009 155673 255275 28531 259214
13496 259214 90484 768493 367398 529525 158249 196730 276595 533935 373312 223169
13486 223169 494064 520418 177047 286198 229439 512562 251225 335534 509771 327731
13476 327731 311723 81736 297190 35198 216104 336514 344991 8747 150027 107940 198351
13465A98351J19220Q5338I6758R5310J92609Q6338j21378j33774E4032N08614
13455E62646A72941g8763D17332j56346j6062J30778A41071k3134J23889A20867
13444B30703J29577j64893Q0066B6873J26516P6645M2085P5592J94610A74280
13433E52746A22898J74684j073R885j39346K44l5366J49726K638J62508j48209
13422B98589e2560A48728K83874j54187j08253R1630a12951D39732H8167J16186
13412B04353J84238H334c20141D1893K49363N4503q4894a7369B13460b49805C48838
13400D31705A67698K44221j78909m3075m0492n4985N9698c7779B93403r8359B1431
13388B60449N3697H2145l9739L91883A95801M9485O9244N0174J12494A16899M97499
$$ plain form
13465 198351 317571 402909 96758 192068 384677 471015 349637 215863 54032 562646
13455 562646 172941 -78763 417332 260986 244924 375702 141071 117937 241826 120867
13444 230703 360280 195387 275453 26873 153389 230034 272119 347711 542321 174280
13433 552746 122898 297582 296509 306394 167048 167292 131926 281652 284290 446798 298589
13422 298589 -52560 148728 432602 278415 170162 261792 -112951 439732 88167 204353
13412 204353 388591 8334 -320141 41893 291256 345759 260865 -17369 213460 -249805 348838
13400 431705 167698 411919 233010 189935 149443 94458 154156 -37779 293403 195044 21431
13388 260449 314146 82145 42406 434289 195801 245286 314530 364704 477198 116899 614398
13377F14398k59403l3330N6339B4825J25769J13138K3317J21088A98426a0493
13366C53311b2777B42007p4879Q7617m1612K46467j28918L10060D5499J47729
13356A93228L4048J20741A71874G3465M07811j40101P5495A97669K3077n1418
13346A69328K19934A22316N6529i0664C96648P782A76882K97728B01646J90953
13336C92599m3783n5216A3223M11025j2106k00320k9747p6475L19823j65102D37
13324a12417A14248R4170a55518B97768r3156k3515K51263r2596A0639a3498C68022
13312d6735B52423J0497J4086J26288h1012A19448l3608k3888h654B22762J04514
13301C27276f4960B38091l0773J40712q3674j12049o834J81857j13886D9444i6411
$$ plain form
13377 614398 354995 321665 378004 24825 150594 263732 287049 408137 198426 -10493
13366 353311 -22777 242007 167128 254745 213133 459600 330682 640742 45499 193228
13356 193228 227276 348017 171874 73465 481276 341175 416670 197669 220746 169328
13346 169328 389262 122316 178845 -90664 396648 404430 176882 474610 201646 392599
13336 392599 348816 293600 13223 424248 412142 211822 182075 105600 425423 260321 437
13324 -112417 114248 208418 -155518 297768 204612 181097 432360 339764 10639 -13498 368022
13312 -46735 252423 262920 277006 403294 -81012 119448 85840 61952 -8654 222762 327276
13301 327276 -64960 238091 207318 348030 264356 152307 145473 327330 213444 49444 -96411
13289I3417k6747j4721N6663a42706B9261K01722O7016F3433K20561c28230J10248
13278b17982a4147k43012A16479K05436H4285J19775b7455A34840J78187J3405
13268C26432b2630B73217A22140L80507k14922A09597J13498M3886m3813J86316
13258D09484e1465D35532B17361L2686I3815n670a02023C3762J72055l880E8200
13246A135J47463d8522A63401A9925b86058B05030k2768D3076J08751h3693B80062
13234C15199j28212O9414D0174j0471R3997R8134I700K07109q2234J84869K3892
13223C43336A56097g307A8454M45678l0795j86222i269D18526m944A09016M5679
13212A54695d2798E50994c2205F6220a09092B47717k5682F8129c6018A94799a04055
$$ plain form
13289 93417 66670 51949 108612 -142706 29261 230983 297999 63433 283994 -328230 -217982
13278 -217982 -14147 -257159 116479 321915 84285 204060 -27455 134840 313027 326432
13268 326432 -22630 273217 122140 502647 287725 109597 223095 266981 223168 409484
13258 409484 -51465 435532 217361 250047 93815 88145 -102023 33762 205817 201937 58200
13246 1135 148598 -48522 163401 19925 -286058 205030 182262 43076 151827 -83693 280062
13234 315199 186987 256401 40174 29703 123700 221834 9700 216809 134575 319444 343336
13223 343336 156097 -7307 18454 464132 433337 247115 -9269 418526 413582 109016 154695
13212 154695 -42798 550994 -32205 66220 -109092 247717 222035 68129 -36018 194799 -104055
13200A95756J24747j36972b0392j9265k26515C48586A27669J51501F0479c0916
13189a12894C08426I8435f7913l0732l2570C88067c1249j56021H475c95685I9481
13177E11265A60646L5180o2988a12913D16065A02145M4624L1179O2495r3791j2126
13166A34526a24406B47767J40678a6503l170A69291J14458A19033b6722A19156
13155C4543J77632J9664E4296K46513F6560L48261j57497n4640I9524L9705C7050
13143B57209L4472l6455j11509K071d9711B94011E3151O8524K6910m959P5186
13132B18812J19779H4036k4368j0370c24628A16033J04238p6392D7438J94649
13122B42087A0050J65145o2457c0682C14808H1498b1575l25507B43216J45978
$$ plain form
13200 195756 320503 183531 -20392 -39657 -266172 348586 127669 279170 60479 -30916
13189 -112894 308426 98435 -67913 -98645 -131215 388067 -31249 -187270 8475 -395685 99481
13177 511265 160646 195826 132838 -112913 416065 102145 146769 177948 240443 146652 134526
13166 134526 -124406 247767 388445 -16503 -19673 169291 283749 119033 -26722 119156
13155 34543 212175 231839 54296 300809 66560 414821 257324 202684 99524 139229 37050
13143 257209 291681 255226 143717 145788 -49711 294011 53151 121675 148585 143626 218812
13132 218812 338591 84036 59668 49298 -324628 116033 220271 143879 47438 242087
13122 242087 10050 175195 112738 -30682 314808 81498 -21575 -347082 243216 389194
13112C89194r9349j44795b54396B91968A04657H398K88194I3328A2506A374R1463
13101I2837K50900a9678B54831a17438B93366r3211J49736F8055B8658b26854
13090D61199A88506a02575C15172C6489a24374A6045b51462A87788a09416d6969
13079a59182F0964K98949A46858C0786L84729A69876P9747j02192K62817A40573
13068a2955A53611o357l9440a37213C98912E4483j1215J04264L23836H0239m0046
13057D0193a02214I1499K22966C5074J58101A8908N13342A31330E7816K45820
13047C03636B9133J7765G263a98120A37531K26993E5260H249c44343A18605L5717
13036A54322f9063B46390a00434N0126A55053D4738g0273A85432a58868G0416
$$ plain form
13112 389194 289845 145050 -254396 291968 104657 8398 296592 93328 12506 1374 92837
13101 92837 343737 -19678 254831 -117438 293366 200155 349891 68055 28658 -226854
13090 461199 188506 -102575 315172 36489 -124374 16045 -251462 187788 -109416 -46969
13079 -159182 60964 359913 146858 30786 415515 169876 249623 147431 410248 140573
13068 -12955 153611 147254 107814 -137213 398912 54483 43268 147532 471368 80239 40193
13057 40193 -102214 91499 314465 35074 193175 18908 532250 131330 57816 303636
13047 303636 29133 46898 7263 -198120 137531 364524 55260 8249 -344343 118605 154322
13036 154322 -69063 246390 -100434 -50308 155053 44738 -70273 185432 -158868 70416
13025A8079L22130E8924k6978K06894l5257M4531N6866K0194j21036c27501D78179
13013C74111F5062K59681A53645E5368P3309L34212b3974A86820l0221J43730
13003C00329a6918G5261K58590A14133M5988C8270K51993A35889J62472j47372
12993A50989a09540F7386P6256J14124B9637a02545B25008a19626A09821E0823
12982A04345a63755A0285K4429M1219j3480K78120C8190J61062d2459G0862K26149
12971B97011a18184E5318K63425A35057P1362c8181C37422A11195a06819B21912
12960C35574a69948A76581i2856j48002e8945j04335A15537B1768K4856i6599
12949A18833j2676a0685m6290A41175b61206B75175k5456b7559A80027A8378b03919
$$ plain form
13025 18079 340209 58924 31946 238840 203583 248114 304980 325174 204138 -327501 478179
13013 374111 65062 324743 153645 55368 128677 462889 -23974 186820 156599 300329
13003 300329 -16918 75261 333851 114133 160121 38270 290263 135889 298361 150989
12993 150989 -109540 67386 143642 257766 29637 -102545 225008 -119626 109821 50823
12982 104345 -163755 10285 34714 75933 62453 340573 38190 199252 -42459 70862 297011
12971 297011 -118184 55318 318743 135057 206419 -38181 337422 111195 -106819 221912
12960 335574 -169948 176581 -92856 -240858 -58945 -163280 115537 21768 46624 -96599
12949 118833 106157 -10685 -56975 141175 -261206 275175 249719 -27559 180027 18378 -203919
12937A63525b93466A94929a1826A35748e6755J7308D34961A94117m7266G468d751
12925B8656K53951A14809c29863B16495A03368B4765L7688c382H5162K68460a54730
12913H1108L48915A40576N3910H7257j185h2044L0677B67068A07951b37249k358
12902b39607A1228L9892g1533B92253h6519A00310C9209a79170B91487A37969
12891g1676c1218B8830a79845A07250k2719g7930A14131P6786O520p0472b655
12879b18057L5619C9189c25845A43639b55270d4475B11846p117b6406M329j1150
12868c3227j85291A13291c30669a01836b5661A26961m8120J8280b4666A92102
12857B41137c43007C85917A83407J7187J33338F4349j4589k1629Q4924R4560I5438
$$ plain form
12937 163525 -293466 194929 -11826 135748 -56755 -39447 434961 194117 146851 7468 -4751
12925 28656 282607 114809 -329863 216495 103368 24765 62453 -3382 85162 353622 -154730
12913 81108 430023 140576 194486 87257 86072 -82044 -51367 267068 107951 -237249 -239607
12902 -239607 11228 51120 -71533 292253 -86519 100310 39209 -179170 291487 137969
12891 -71676 -31218 28830 -179845 107250 84531 -77930 114131 190917 197437 126965 -2655
12879 -218057 -182438 39189 -325845 143639 -255270 -44475 211846 204729 -26406 -22077 -33227
12868 -33227 -218518 113291 -330669 -101836 -25661 126961 78841 97121 -24666 192102
12857 241137 -343007 385917 183407 200594 333932 64349 49760 28131 113055 207615 95438
12845G0747E557d0927A11015J85105j31153k4679g1325B4288c02387A80647a28200
12833b60303B7191J92434m4876D7051J8411B1613K78605h8727L1562A17951f6219
12821A90286q7267D5982A8220J4350b72000J06611g0376a3097A47272i5841A04695
12809A41405K6848H055M29688E1300B4958e2514o0839b5099F8536a21022C08798
12797A56454P7942b1242C46500A35381h9347A70979b65371B46289D2471L14748
12787C57219A40563a23000G8490a45000m7602C42876c1549I403a01553A93737
12776G8749c6155A09409k3192i4733A65343J04726C84b19638d8352a440j0589
12765a2029F0969J49090i757A07401a1627C59405A6163L57772a9868q973J0545
$$ plain form
12845 70747 5557 -40927 111015 296120 164967 140288 -71325 24288 -302387 180647 -128200
12833 -260303 27191 219625 174749 47051 65462 21613 300218 -88727 -57165 117951 -66219
12821 190286 103019 45982 18220 32570 -272000 -165389 -70376 -13097 147272 -95841 104695
12809 141405 168253 8055 437743 51300 24958 -52514 -113353 -25099 68536 -121022 308798
12797 156454 234396 -21242 346500 135381 -89347 170979 -265371 246289 42471 357219
12787 357219 140563 -123000 78490 -145000 -192602 342876 -31549 9403 -101553 193737
12776 78749 -36155 109409 86217 -94733 165343 270069 384 -219638 -48352 -1440 -12029
12765 -12029 60969 210059 -9757 107401 -11627 359405 16163 373935 -19868 -28841 -18296
12754a8296j80975A8651Q9702k7816l7656K18508C4651N967C37c6735D0311a44898
12741A39376f2278A09749Q2122e517q8445D09579E9219J1169J30297J98981a50059
12729f7160C14502E8141H306a16589C19660a84149A47766d0514d807G5477b00430
12717C04863p7662h8943B61230B8485J37536J2230a07307A23345J1888L00394
12707D35627A76022f233A50229b0412B58994J64962c2141C42158b8237I8591P8284
12696A76875k9740D5719K05714G2389N9645K8248d2200E5998i7936b2657k17817
12685b40474A23797C0057K2518O1307c2654D11100d9925G5674J81049r4562J9044
12674A81205L5515p8899a04306H4357a72801A81914d9821a5554M767A41745i2879
$$ plain form
12754 -18296 -199271 18651 108353 80537 42881 261389 34651 40618 337 -36735 40311 -144898
12741 139376 -62278 109749 191871 -5517 -93962 409579 59219 70388 200685 399666 -150059
12729 -67160 314502 58141 8306 -116589 319660 -184149 147766 -40514 -4807 75477 -200430
12717 304863 227201 -88943 261230 28485 166021 178251 -107307 123345 135233 435627
12707 435627 176022 -6233 150229 -20412 258994 423956 -32141 342158 -28237 98591 176875
12696 176875 147135 45719 251433 72389 132034 160282 -42200 55998 -97936 -22657 -240474
12685 -240474 123797 30057 52575 113882 -32654 411100 -49925 75674 256723 162161 181205
12674 181205 216720 137821 -104306 84357 -172801 181914 -49821 -15554 -10787 141745 -92879
12662A46816k9296L1311A0101a27971A08459M87188B03243E4029a7202B01602
12651A87449L1618b7069B01464K21699A50755A1123N9648P0676P8569a07510r1870
12640a99380B4214b5356G7700e6005A95482J56349A53057R0833A18610J1866B190
12628E05577k52391D4975J60068l3616A407J42271Q263K34242H3085l2044K37553
12617B88594g4610D04405D278L2324A0621J33114b06282H291i1704B28846a09332
12605a46521I1171a69261C50254c2012k57500g793B18277N7752I1753C3479a01421
12593h0941j45916A34808N6967r5098B0547K31494J04373A16902a12471G6888
12582a88475C5679i8270j02233e8689B22196F8825b44183A57748c9975m1824j17543
$$ plain form
12662 146816 117520 148831 10101 -127971 108459 595647 203243 54029 -17202 201602
12651 187449 219067 -27069 201464 423163 150755 11123 70771 141447 220016 -107510 -199380
12640 -199380 24214 -25356 77700 -56005 195482 351831 153057 243890 118610 130476 2190
12628 505577 253186 44975 205043 171427 1407 143678 151941 386183 83085 51041 288594
12617 288594 -74610 404405 4278 36602 10621 143735 -206282 8291 -91704 228846 -109332
12605 -146521 91171 -169261 350254 -32012 -289512 -7793 218277 276029 91753 33479 -101421
12593 -80941 -226857 134808 191775 96677 20547 252041 356414 116902 -112471 76888
12582 -188475 35679 -98270 -200503 -58689 222196 68825 -244183 157748 -39975 -81799 -199342
12571a99342A87562J684n5547b67636J10726A35661F5734L1777M73587e8794A6982
12559D405a91777f7705a719j79733b5155m1895B62414H8644L45346D5288a29924
12547A96589J8643G4994a35923G5430k5952J01982c216j78508B9908J45701c5444
12535A99650g0091j41225G6996b14292B47314e0505D68356b5835B09972P5019
12525B84991B1131a66081D34478A82703d9156k48158I1103l4368A4962f5299n9838
12514a25137r0440f1615K8580J0346j72833b917A21004A3749K5115K73163j43025
12503A69002N1513O03a07130r8732q7630B85555j20890g5950o7779A38691F6240
12491c02211c1231B44914e731m35007D54050b70861A12863B6705J85135I3969
$$ plain form
12571 -199342 187562 189246 133699 -267636 -156910 135661 65734 97511 571098 -58794 16982
12559 4405 -191777 -67705 -1719 -181452 -25155 -67050 262414 88644 433990 45288 -129924
12547 196589 215232 74994 -135923 75430 49478 151460 -3216 -181724 29908 175609 -35444
12535 199650 -70091 -211316 76996 -214292 247314 -50505 468356 -25835 209972 284991
12525 284991 21131 -166081 434478 182703 -49156 -297314 91103 56735 14962 -65299 -125137
12514 -125137 -215577 -61615 -33035 -22689 -195522 -2917 121004 13749 38864 312027 169002
12503 169002 220515 221118 -107130 -205862 -293492 285555 164665 -75950 -143729 138691 66240
12491 -302211 -31231 244914 -5731 -440738 454050 -270861 112863 26705 211840 93969
12480B08798a86796B13174a85498N3409k6446A052c1929n444j67372a01244j11092
12469b12336B17581E9754J81256p5891F2240e3174I9402O6125J30523F7663J79112
12458B46775q6436c6415c734n7944B51772n162C7765b56432J22999k73249F3022
12446a65212a486q9242H8168i5887l5624a7018r8595r0019A06924d5357D11931
12434C83676E4885M4386O4590a34203j32895D00027e8291E7173B5600R8231c9971
12422E2003d7222o2362p3123b8418q2260l5675f4757B05928n1038a4512A04774
12410e0621C17851C6894K69314a32425e7117B8369c5792B08600c42509A16290
12399C8322a8504j68637A41226b7844G136b34906C32813d8860o1445A72590k4513
$$ plain form
12480 208798 -186796 213174 -185498 -132089 -158535 1052 -31929 -37373 -204745 -101244 -212336
12469 -212336 217581 59754 241010 165119 62240 -53174 99402 165527 296050 67663 246775
12458 246775 160339 -36415 -3734 -61678 251772 246610 37765 -256432 -133433 -406682 63022
12446 -165212 -1486 -90728 88168 -95887 -131511 -17018 -115613 -205632 106924 -45357 411931
12434 383676 54885 99271 163861 -134203 -267098 400027 -58291 57173 25600 123831 -39971
12422 52003 -47222 -109584 -182707 -28418 -110678 -146353 -64757 205928 154890 -14512 104774
12410 -50621 317851 36894 306208 -132425 -57117 28369 -35792 208600 -342509 116290
12399 38322 -18504 -187141 141226 -27844 7136 -234906 332813 -48860 -110305 172590 148077
12388A48077d18896a7342A15539h560A76311q1884a85730I3a63085B67582N4784
12377C22366j21006l9049A6876a83609G75a64853K7952G5485g4287K8583K1958
12366b3746C80825B1412J7958o393J20279f1877D00264d38765B90397j32926g8884
12354I6746c0973H6606J81134A13548j2272B2417Q2630J37362A09926J30629F5990
12342g882A0394K52695b38664D4926b03261N4258A33868b17590A26614L0786a57338
12330e1338B99630o6519r3221p780F3414e4160j22711g1361A17091d5285A8235
12318B57592G0210j633J35424a1002A74543a24064F1916b72317B47605h4032A27771
12306A27131i2832a6972k40267M8426A39174c25411A17131f4586B96973A04134
$$ plain form
12388 148077 -418896 -17342 115539 -8560 176311 94427 -185730 93 -163085 267582 322366
12377 322366 201360 162311 16876 -183609 775 -164853 -136901 75485 -74287 -45704 -23746
12366 -23746 380825 21412 39370 32977 153256 -61877 400264 -438765 290397 157471 -78884
12354 96746 -30973 86606 267740 113548 101276 22417 105047 242409 109926 240555 65990
12342 -7882 10394 263089 -238664 44926 -203261 -149003 133868 -217590 126614 157400 -157338
12330 -51338 299630 233111 139890 132110 63414 -54160 -176871 -71361 117091 -45285 18235
12318 257592 70210 68577 204001 -11002 174543 -124064 61916 -272317 247605 -84032 127771
12306 127131 -92832 -16972 -257239 -208813 139174 -325411 117131 -64586 296973 104134
12295A89371Q4029b81507B5695R1303g409A27773k8261b19549N1226A82786G5638
12283b46559P5907G2563i6699A14327J2163g9608j3518L8094m4859C09099K7865
12272C36964j21603F169a42895A60877b11839F5009J62156e8497k15780A10470
12261i4421B1278O8481b2944A3442J42269e8766G4144J36981f2654I7951c11643
12249D14931H3941e7565o2056C61160j80361K64615j31395e9513j15089C45761
12238D77280e2690j48110n0585I9823K63781b19760B46336k6695d1453A53008
12227I1547K41217H7801L94833A84975q3210q215K88760A30887K51119A13642
12216B12488K65821B30620f4137C15779F9478L75006m5772G0625J83847l9668
$$ plain form
12295 189371 273400 -281507 25695 116998 -7409 127773 99512 -219549 -168323 182786 75638
12283 -246559 -170652 72563 -96699 114327 126490 -79608 -93126 -55032 -99891 309099 336964
12272 336964 215361 6169 -142895 160877 -211839 65009 227165 -58497 -274277 110470
12261 -94421 21278 89759 -22944 13442 155711 -58766 74144 211125 -62654 97951 -311643
12249 414931 83941 -57565 -119621 361160 180799 445414 314019 -59513 -174602 345761
12238 477280 -52690 -200800 -251385 99823 363604 -219760 246336 219641 -41453 153008
12227 91547 332764 87801 482634 184975 101765 93550 382310 130887 382006 113642
12216 212488 478309 230620 -64137 315779 69478 444484 398712 70625 254472 214804
12206B14804C3692i0615D02065A30198b4329B87325E3407N1604D9186J50339k6099
12195A73426m4801K07571J11286b6962B48029A7615J47814n1945J81522j20557
12185A74449F0027g2650A964K03335q7606J59596q751e1349l141B77567a69827
12173a06491C27793B3194M6523b1736G6357M65013D2340J14828l216n6978K10255
12162C07229b1304j64923G0763j6024g2447A32718b70164J16375A35024P2351
12152B07375P567a04901B69815C036L49239j38050K33877d230C25148a86398B3146
12140a59298C99492q7139A7703R0782c6419l1947A54129d9536A57290G8272J02763
12129A81035e9461q3486n9970B06363H4010J54777A15908D2778M4502P7028b3510
$$ plain form
12206 214804 33692 -90615 402065 130198 -24329 287325 53407 105011 49186 199525 173426
12195 173426 128625 336196 447482 -26962 248029 17615 165429 113484 295006 174449
12185 174449 60027 -72650 1964 205299 117693 277289 268538 -51349 -54490 277567 -169827
12173 -106491 327793 23194 69717 -21736 76357 541370 42340 157168 153952 96974 307229
12162 307229 -21304 -186227 70763 54739 -72447 132718 -270164 -153789 135024 207375
12152 207375 214942 -104901 269815 3036 352275 214225 448102 -4230 325148 -186398 23146
12140 -159298 399492 312353 17703 108485 -36419 -68366 154129 -49536 157290 78272 181035
12129 181035 -59461 -142947 -202917 206363 84010 238787 115908 42778 87280 164308 -23510
12117C15755e7780C0811R0004a00962F4690n219J39279b13174i6809G034J06594
12106A13628a50412B85627b54956a6865E0758K44357n8336A06601d1631A45111
12095A62542f9368o7530J25A08175f8588C77589A6240c8482A20731a18338A36846
12083C12892C2768a88192C19324a18545A2746J13587a65007b5980C63654a28980
12072A70746J60765K72509O64366M1847M6040n07755B55652p3966J04083a84073
12061B12402n5569R9638J19412a88817D45118A31569D7901L17501a08013K7130
12051h0883k37000D3671K87543j60875J9820b19247k8543J19693K0312j51726
12041b59511h4963l0124D1426N6453m1806a3465k59445l83132I0723M0397a26138
$$ plain form
12117 315755 -57780 30811 120815 -100962 64690 59471 198750 -213174 -96809 7034 113628
12106 113628 -150412 285627 -254956 -16865 50758 295115 236779 106601 -41631 145111
12095 162542 -69368 -136898 -136773 108175 -68588 377589 16240 -38482 120731 -118338 136846
12083 312892 32768 -188192 319324 -118545 12746 126333 -165007 -25980 363654 -128980
12072 170746 331511 604020 1268386 1310233 1356273 848518 255652 181686 285769 -184073
12061 212402 156833 256471 375883 -188817 445118 131569 47901 365402 -108013 -80883
12051 -80883 -317883 43671 331214 170339 190159 -219247 -247790 -128097 -107785 -259511
12041 -259511 -84963 -115087 41426 97879 56073 -13465 -272910 -656042 90723 131120 -126138
12029i4609C33421A18892n434D7711b57951F7714K6818b35831A29959b44656a012
12017f4178B29803b739C18015d3885k33034A64937a95080G4508e5896A14311k8503
12006H5808N6926a31363m21984J96372a39883D9627a84243Q4492l1411f4745A40967
11994b03359i3804C02371a78452H8690J44227n6980m4747h1249D2052J80405H3254
11982e5865B85439a41580o1778R9598j692E0335f1960A69960a97709j13070a41729
11970a33753A37056j0507f1476m5196d2201D9073d2531l5682K6997E8967a60546
11958C89976e3517l00647a62408m7793N1187A05497a06013C09277g836j61292
11948a69128M4389A07447g0362D5299Q2230A5054a3936j38176f7469B07532e7668
$$ plain form
12029 -94609 333421 118892 113458 47711 -257951 67714 94532 -235831 129959 -244656 -1012
12017 -64178 229803 -2739 318015 -43885 -276919 164937 -195080 74508 -55896 114311 85808
12006 85808 142734 -131363 -553347 -356975 -139883 49627 -184243 -99751 -131162 -64745 140967
11994 -203359 -93804 302371 -178452 88690 232917 175937 131190 -81249 42052 222457 83254
11982 -55865 285439 -141580 -203358 -103760 -105452 50335 -61960 169960 -197709 -310779 -141729
11970 -133753 137056 126549 -61476 -106672 -42201 49073 -42531 -78213 -51216 58967 -160546
11958 389976 -53517 -354164 -162408 -210201 -159014 105497 -106013 309277 -7836 -169128
11948 -169128 -124739 107447 -70362 45299 127529 15054 -13936 -152112 -67469 207532 -57668
11936A13928b79982A35989b12023C0047i5991l59141d4416A28378J7853J48462
11926B94693N4065j49507a08498j17969B44927I6605b84797A68586d8216J1992
11916c6224E6578g7301H2004A4101a87890C27663R2979A41757d215j22850A6533
11904A48439E1880J3428B6544Q3871a57477D0059J33426a36078A52241a18032
11893D4132B091J05716a32226m1006j73305C3792K0761b64202a8926H8498a84130
11881A04500b53236h8526F5896P7224g326j01732E35176C4028M7611C8188e8818
11869a932k508n3595l6843k21417a15241e2472A23443a92608A72087n9464a20829
11857G2868M8267g1827C41481e6676J9658k4450J096m3807E3169f1059B745b34199
$$ plain form
11936 113928 -279982 135989 -212023 30047 -95991 -455132 -44416 128378 146231 294693
11926 294693 348758 199251 -108498 -226467 244927 96605 -284797 168586 -48216 -36224
11916 -36224 56578 -77301 82004 14101 -187890 327663 420642 141757 -4215 -127065 16533
11904 148439 51880 65308 26544 110415 -157477 40059 173485 -136078 152241 -118032
11893 44132 2091 107807 -132226 -173232 -346537 33792 54553 -264202 -18926 88498 -184130
11881 104500 -253236 -88526 65896 143120 -7326 -109058 535176 34028 81639 38188 -58818
11869 -1932 -4440 -58035 -94878 -316295 -115241 -52472 123443 -192608 172087 112623 -120829
11857 72868 121135 -71827 341481 -56676 -37018 -61468 -60372 -104179 53169 -61059 2745 -234199
11844a65494D12382a37391b4255A04321h2301A32415C4046e917A4354P2078C7478
11832c88957J70785H5136B4068M7469A0646Q5765b33070D1130c80215E4188I283
11820b73535f4868E9688J72880b14899F0935d447j9859A17611a21517b2719B0667
11808B0041P0998f8924j35505R4999C16752i9999r3424A20427b32232B0462M47479
11797D67941H23f9893c1736p1330I610J77572f050E9826J36320a9356k25793B390
11784D5411a04961H140Q2871m4857k0332c62654A07396b14817a8841k0100I1961
11772A43688m72a9564C27018G2435h4004B04083D9021b3445G4334a09882o7762
11761a77644B04815b44949H5853a42136F646O0146M8215a81667p4844o4430a49694
$$ plain form
11844 -165494 412382 -137391 -24255 104321 -82301 132415 34046 -5917 14354 86432 37478
11832 -388957 -218172 85136 24068 71537 10646 96411 -233070 41130 -380215 54188 9283
11820 -273535 -64868 59688 232568 -214899 60935 -4447 -24306 117611 -121517 -22719 20667
11808 20041 91039 -68924 -204429 -109430 316752 -99999 -193423 120427 -232232 20462 467941
11797 467941 823 -69893 -31736 -103066 9610 187182 -6050 59826 196146 -19356 -245149 2390
11784 45411 -104961 8140 91011 46154 25822 -362654 107396 -214817 -18841 -38941 91961
11772 143688 143216 -19564 327018 72435 -84004 204083 49021 -23445 74334 -109882 -177644
11761 -177644 204815 -244949 85853 -142136 6646 66792 115007 -181667 -256511 -320941 -149694
11749g3791j1204k52064c0061j5144l3974B1038a20731j67880C27114A61945E6454
11737B25089c48935a7959j67682F3973K37241r3122b13375G8262a90155P8131
11727a12024J5868F3863h4307k12924a15539L704o526e8741C66641a81779L2849
11716a48930o2591C7645J65330i1922q8693H8868L3907K2700a12615A61401A4876
11704C90980I8865K1875c22243A48660b81098i1310A48873m8708a8752A28607
11693E4006A0177N1634a15963A76710b44106A55004J1807b40869h712A21123b154
11681c5654E7978a50315M9823B07559k1466E2475P2075f7512J8916B08794f6719
11669A00013J25046b44387B30507C0466a20071d3864C59724b2994k32098O1701
$$ plain form
11749 -73791 -84995 -337059 -30061 -45205 -79179 21038 -120731 -288611 327114 161945 56454
11737 225089 -348935 -17959 -185641 63973 301214 208092 -213375 78262 -190155 -112024
11727 -112024 -96156 63863 -84307 -297231 -115539 -111835 -118361 -58741 366641 -181779 -148930
11716 -148930 -211521 37645 202975 -91922 -180615 88868 122775 145475 -112615 161401 14876
11704 390980 98865 120740 -322243 148660 -281098 -91310 148873 100165 -18752 128607
11693 54006 10177 61811 -115963 176710 -244106 155004 166811 -240869 -8712 121123 -2154
11681 -35654 57978 -150315 -100492 207559 186093 52475 124550 -67512 -48596 208794 -66719
11669 100013 225059 -244387 230507 30466 -120071 -43864 359724 -22994 -255092 -193391
11659a93391B90076b77343H3310K3985e4005I1549K361b37144B83005p6705a04649
11647D10636B03185r8352b3720A39966j933g9528A61281p1071e131I5957b9185
11635B39579b87579a04862n589a1291B7380J30928f9832A18729a36230E5848K5213
11624H1061a3807A70384b46879B50926d1189A4292C653Q7678A9233K62572H5307
11612B0507J67921j9081a2336B24916a52353C33262C2835K24741r5692e1098B22193
11600C7764L03844A07424i4833j75843a08647C97652D7936a21757L899I2571K05502
11589B98073i7690A59246a8231B715g0192A4075a35156A04855b0544C5078J14342
11578A49420m2510a60081c8047r2799c4989F7842f9133H0067C0891K19144c0898
$$ plain form
11659 -193391 290076 -277343 83310 107295 -54005 91549 93910 -237144 283005 206300 -104649
11647 410636 203185 104833 -23720 139966 138033 -79528 161281 90210 -5131 95957 -29185
11635 239579 -287579 -104862 -110451 -11291 27380 158308 -69832 118729 -136230 55848 81061
11624 81061 -13807 170384 -246879 250926 -41189 14292 3653 91331 19233 281805 85307
11612 20507 188428 169347 -12336 224916 -152353 333262 32835 257576 161884 -51098 222193
11600 37764 341608 107424 -94833 -270676 -108647 397652 47936 -121757 -117858 92571 298073
11589 298073 -97690 159246 -18231 2715 -70192 14075 -135156 104855 -20544 35078 149420
11578 149420 106910 -160081 -38047 -130846 -34989 67842 -69133 80067 30891 250035 -30898
11566A5576J32767a16882C50230j38957p1518h6518I5349a25169A62815e444k5258
11555c0702E57501A8141b39997E3056J23470a54828d639A34288K6899d2420A54115
11543F5649a05667C67262d7388r3238j91766J08369C29236a66490g1666I8451
11532E7545k1472f7389I9980L9996C4761K758P5494J00329h766k07698C49307
11520A7229b8958p2619L0735D05397j80422F7234a1107G8006J03617P0039r5872
11509A55790D036K37299n8056J06128G3794J17081P2286q5486i5701k71088a44900
11497A70091h0452C21553B8929L86843G4633b197B70406I6958j5626O59L0250
11486A12241J15443b05705D18827C0011M32301A11124b3139D869J90768i6661
$$ plain form
11566 15576 148343 -116882 350230 211273 139755 -86518 95349 -125169 162815 -5444 -30702
11555 -30702 557501 18141 -239997 53056 176526 -154828 -4639 134288 161187 -42420 154115
11543 65649 -105667 367262 -47388 -140626 -332392 -224023 329236 -166490 -71666 98451
11532 57545 36073 -67389 99980 139976 34761 37519 113013 213342 -8766 -216464 349307
11520 17229 -28958 -101577 -70842 405397 224975 67234 -11107 78006 181623 251662 155790
11509 155790 4036 241335 183279 289407 73794 190875 263161 177675 -95701 -366789 -144900
11497 170091 -80452 321553 28929 415772 74633 -2197 270406 96958 81332 81991 112241
11486 112241 227684 -205705 418827 30011 462312 111124 -23139 4869 195637 -96661
11475f2088A162L03602K0240A61917J23367e2502A79411C1767N7465j4176N0395
11464A25451M0014o0534M618a55931B08104n8557g2750n0500A88554J29325A50761
11452A20609J6176g957m5286A96008K0553M5634D3083J93767a3239A00605L6224
11441A36829J02706Q4269F3190g8345j16761d3802G9622b2358B62507A8604O1560
11430H0164J38420b92527a30452e6027G922J1165K90368B5781p014K45847b00920
11418b35233c2422F1490a27724B28796a28684j17013G9848J8572b29866P1112
11408a58754B0416O3701G996K53756d535E9781J45876b24385j07898E3638J5029
11397F8667K86118B9685J12851i5675D88696b12813C6220i6803j67817H3528K5954
$$ plain form
11475 -62088 1162 304764 325004 161917 285284 -52502 179411 31767 89232 75056 125451
11464 125451 165465 104931 109549 -155931 208104 149547 -72750 -123250 188554 317879 150761
11452 120609 136785 -7957 -53243 196008 216561 262195 43083 236850 -13239 100605 136829
11441 136829 239535 323804 63190 -78345 -195106 -43802 79622 -22358 262507 18604 80164
11430 80164 218584 -292527 -130452 -56027 7922 19087 309455 25781 18767 264614 -200920
11418 -235233 -32422 61490 -127724 228796 -128684 -245697 79848 98420 -229866 -158754
11408 -158754 20416 84117 7996 261752 -4535 59781 205657 -224385 -332283 53638 68667
11397 68667 354785 29685 142536 -95675 488696 -212813 36220 -96803 -264620 83528 109482
11386A09482j1498f5473o5779H6255N0088f0053A0170a74515b5223j47965b2027
11374A96852G7092k9903J25473o7875a24304G3260h053l7475A23256J07725d7889
11362A50661C7683a84098j00378b5223C8149b11787a7485C78216P9932d3579A51322
11350E4855a13172I1889c24330D4620J51266c6937k72170A88733b02488B1184
11339a37677A37127a51503G9981a16775B15146a33715b2326I3736c14508A41498
11328a9873A6031Q2726g0975A4353K27363a16009B86698n8482n8453b47016B18693
11316G9047c85350a51440G86e4845A1609L196c52252Q0870C40164F8537b71559
11304C34185c50076C37306c60633a71625L6212j40327F6507a37997F7400B3099
$$ plain form
11386 109482 97984 -65473 -131252 86255 136343 -60053 10170 -174515 -25223 -173188 -22027
11374 196852 77092 47189 172662 104787 -124304 73260 -8053 -45528 123256 230981 -47889
11362 150661 37683 -184098 -284476 -25223 38149 -211787 -17485 378216 458148 -43579 151322
11350 54855 -113172 91889 -324330 44620 195886 -36937 -309107 188733 -202488 21184
11339 -137677 137127 -151503 79981 -116775 215146 -133715 -22326 93736 -314508 141498
11328 -19873 16031 98757 -70975 14353 241716 -116009 286698 228216 169763 -247016 218693
11316 79047 -385350 -151440 786 -54845 11609 14805 -352252 -271382 340164 68537 -271559
11304 334185 -350076 337306 -360633 -171625 -135413 -275740 66507 -137997 67400 23099
11293e29A53043a01504B7762M1907J00534d30461F2929L10745F7795a83360O3379
11282a19981E2134J03587c4120C9774Q8595p345O0491R6522D4068K89511m012
11271C29567a8420j50983C8858K67921k8842a84150a8755B43395b0737m36957
11261d57694J66335a28361d585H1712g1187E3421d4734j2241B47008j21710A2676
11249A48596B1549c1947n3527C41346a23852m9461d1795a4721k53149B60502b53483
11237a00444b6666l0260j27468j45498l7140m4291c3996l547R574D5134a83696
11225e7146j09144L5524B38541b17634j7481d2826k1152K2491C01478e7654B18870
11213a573l6395A27092m8533J16566a30118N4898j63203a15041C9509b11336C8365
$$ plain form
11293 -529 153043 -101504 27762 69669 170203 -430461 62929 373674 67795 -183360 -119981
11282 -119981 52134 155721 -34120 39774 128369 121024 181515 278037 44068 333579 329567
11271 329567 -18420 -169403 38858 306779 277937 -184150 -18755 243395 -20737 -457694
11261 -457694 -291359 -128361 -4585 81712 -71187 53421 -44734 -56975 247008 125298 12676
11249 148596 21549 -31947 -85474 341346 -123852 -173313 -41795 -14721 -267870 260502 -253483
11237 -100444 -26666 -56926 -184394 -329892 -367032 -411323 -33996 -37543 -27969 45134 -183696
11225 -57146 -166290 -130766 238541 -217634 -235115 -42826 -63978 -41487 301478 -57654 218870
11213 -1573 -37968 127092 78559 195125 -130118 -75220 -238423 -115041 39509 -211336 38365
11201a09194B91843C046a19851A18291b80412J12804l1523c3850I2921a12572
11190b19267c7147k03038K4897B53931g4770k52008A0572a51202A91748b66895
11179F2252h1963d13q2452K3655A22861c09422n1726A68784C928a50872A58749
11167a47774d5769A59030b10097J6314R190j25504L1567f121k97545a14365M5202
11156f9163c926q6810k49663b063j49909L5602j23877I582K0582c19694i0504
11144B31124G2251A0292M5687J09453K05353a34758P342J6130b231B1825K35455
11133B57280C0262Q3250c11448A72677k2751J7498E3172J56577b1055F35L56751
11122C57386a12848D6241a05599b6332F1107L5504L9291F1391B1501K19611l8502
$$ plain form
11201 -109194 291843 3046 -119851 118291 -280412 -167608 -199131 -33850 92921 -112572
11190 -219267 -37147 -240185 -215288 253931 -74770 -326778 10572 -151202 191748 -266895
11179 62252 -81963 -413 -82865 -59210 122861 -309422 -361148 168784 3928 -150872 158749
11167 -147774 -45769 159030 -210097 -193783 -184593 -310097 -278530 -6121 -303666 -114365 -69163
11156 -69163 -3926 -90736 -340399 -2063 -151972 -116370 -240247 9582 30164 -319694 -90504
11144 231124 72251 10292 55979 165432 370785 -134758 -127416 -111286 -2231 21825 257280
11133 257280 30262 113512 -311448 172677 149926 167424 53172 209749 -21055 635 357386
11122 357386 -112848 46241 -105599 -26332 61107 96611 135902 61391 21501 241112 202610
11111B02610N5775G3161K8174e2595J7067A19366J27200g2528A17326n870L53384
11100D64840A70637L37768G0440c5833A78723P8633a7539o8552A10661J30085
11090B40746L77055a19730C12822R364g9814l5321C7188K80178a2503E8081Q9729
11079A47810L52525B27772J05799J24008r5050o9317N2858j26951Q21C6369M72568
11068E08937j32373Q6444A65464L72020k39593J70954O2149j65951J85874j90572
11058C60345K21328p839j3511l4062J71122r7622j09576L38871J4027C82718M96036
11047H78754k16518K36169N0871m18469R8098L67553M9049j95321j95451P8654
11037G33389n9954r4698L82711j75755k03393k1654K94956l31998j44804L06595
$$ plain form
11111 202610 258385 73161 101335 -52595 -35528 119366 246566 -72528 117326 111456 464840
11100 464840 170637 508405 70440 -35833 178723 257356 -17539 -86091 110661 240746
11090 240746 617801 -119730 312822 322186 -79814 -115135 37188 317366 -12503 58081 147810
11079 147810 500335 227772 333571 457579 362529 293212 346070 219119 219940 36369 508937
11068 508937 376564 463008 165464 537484 297891 468845 530994 365043 550917 360345
11058 360345 581673 573834 560323 526261 697383 599761 490185 829056 843083 382718 878754
11047 878754 662236 898405 949276 530807 628905 996458 1045507 850186 654735 733389
11037 733389 673435 578737 961448 785693 582300 560646 855602 523604 378800 685395
11027F85395Q1090l9415N9439j93226J59771L43909l50074K27653j92828M9924
11017H31638j81742j70639J97681J51930C76341J73879N3038K34412j63912Q9116
11007G62874k06398m7021k3700K43864n0843k5418k32083L78716B93382L02006
10997E95388B82897M71602O5759k93337J39120J00076C63383L04356K57811k39131
10987F86419l153J31572l57999N99037n4411p2749J09777P6848J56878J32854
10977A405073K16445K50078K71419J75684M43975j1601P3847q3613l24701K59623
10967B676229l83187n0326m14077J0823r9624j0449l88116K99051j34550J92887
10957A698661J02070l75917J30835j10697n76074L98331j83047n17755O9778k18175
$$ plain form
11027 685395 766485 727070 786509 593283 753054 1096963 746889 974542 781714 831638
11017 831638 649896 479257 676938 828868 376341 550220 603258 837670 673758 762874
11007 762874 556476 509455 485755 729619 678776 653358 421275 799991 293382 595388
10997 595388 282897 754499 820258 526921 666041 766117 363383 667739 925550 686419
10987 686419 683266 814838 456839 1055876 1001465 928716 1038493 1115341 1272219 1405073
10977 1405073 1621518 1871596 2143015 2318699 2762674 2751073 2824920 2741307 2416606 2676229
10967 2676229 2293042 2242716 1828639 1839462 1739838 1729389 1341273 1640324 1505774 1698661
10957 1698661 1800731 1424814 1555649 1444952 868878 1267209 1084162 566407 636185 418010
10947D18010J27279K3416k24240L8863j65517E3863K3281P2356g2803A31078K72806
10936D03884H0236O9151J95341R9255j51458p6209Q05a54817A00376K3225e192
10924E8702a35198B64665C7814O0186g5758A12697a02998J969B05255a86274A65873
10912F4643J90786b05650d115l90657B1430F320f16477H1726i0123A41433J18297
10901B59730F0749b34501C6695L04685A64371C2618h6874K9893j61209h583A15654
10889f1334j03689A11867b2072A63066J39552L3803g9712a5619G5049a33890e7227
10877d1272k2186A0470P5471b00611C34314h9299J1117A2651b59615D7098d2773
10865A29460J28686a41541A48801j9398b50109J12925k15441L3361b9111C619
$$ plain form
10947 418010 545289 568705 344465 383328 217811 53863 77144 149500 -72803 131078 403884
10936 403884 80236 149387 344728 443983 292525 216316 217121 -154817 100376 123601 -5192
10924 58702 -135198 264665 37814 98000 -75758 112697 -102998 -101029 205255 -186274 165873
10912 64643 255429 -205650 -4115 -394772 21430 6320 -616477 81726 -90123 141433 259730
10901 259730 60749 -234501 36695 341380 164371 32618 -86874 -56981 -218190 -8583 115654
10889 -61334 -165023 111867 -22072 163066 302618 336421 -79712 -15619 75049 -133890 -57227
10877 -41272 -63458 10470 85941 -200611 334314 -89299 -78182 12651 -259615 47098 -42773
10865 129460 258146 -141541 148801 129403 -250109 -137184 -352625 -319264 -29111 3619
10854a14318J0201o521B99677J13256c8980F972J62486i5828p4412A08819D1032
10842B38894b93156J41353B68325a7540o3076q2818j07608D05986b57245D8884
10831E1558c19152a05398A15919a89909C89210A15405a90975H2831J31744D1833
10820a99838A08593J34741B8343a66468A47276a9613C01829c13387F0206J2666
10810G2872Q6112a40433K4040q8300b0152q3925A11795e61367a80844O4905j85418
10799c01357l8904d9513B58997H5102a17434k32276J33208B10969b27223F0091
10788a18808A14182b3347q3196a4868j25610A55215k7167a36548C18961D1710
10777a15040F763b98020A84055P006n2354J03805I3879e6459l1881a3260j08254
$$ plain form
10854 -114318 -104117 -110638 299677 412933 -38980 6972 169458 -95828 -170240 108819 41032
10842 238894 -293156 -151803 268325 -17540 -80616 -163434 -271042 405986 -257245 48884
10831 51558 -319152 -105398 115919 -189909 389210 115405 -190975 82831 214575 41833
10820 -199838 108593 243334 28343 -166468 147276 -19613 301829 -313387 60206 72872
10810 72872 158984 -140433 -116393 -204693 -20152 -104077 111795 -561367 -180844 -115939 -301357
10799 -301357 -340261 -49513 258997 85102 -117434 -349710 -216502 210969 -227223 60091
10788 -118808 114182 -23347 -106543 -14868 -140478 155215 128048 -136548 318961 41710
10777 -115040 6763 -298020 184055 191061 138707 242512 93879 -56459 -88340 -13260 -121514
10766a21514j1557H2405J5806i2655j22678A70576d7367k39978J39611H3469L22577
10755D06046c36454A67299d5442l09783a23113L78A04693q127c946j5198j27299
10744a46443B07036a00214b8130j51352d9702B25432G5420b03005C7184g4084
10733b77501a5237E4808g4625j50166j1602K8113A90014L5326i712Q08l31168
10722c40072B8535J37849b06625B09507r1080A0849K30345b91595J6232I1195
10711d7178j13916B41414e6235A05920l4177a90256P6249o4246B3612L9227R498
10700G2337P0398b90889a28443k13137a16047j4128j32487i9265A83938e389j85222
10689a90611A32886c4995j02457a2202H114J14018a15594G8079b95632A98960
$$ plain form
10766 -121514 -133071 82405 98211 -92655 -215333 170576 -47367 -287345 -147734 83469 406046
10755 406046 -336454 167299 -45442 -355225 -123113 -122735 104693 96566 -3946 -19144 -146443
10744 -146443 207036 -100214 -28130 -179482 -49702 225432 75420 -203005 37184 -74084
10733 -277501 -15237 54808 -74625 -224791 -236393 -208280 190014 225340 -9712 -8904 -340072
10722 -340072 28535 166384 -206625 209507 118427 10849 241194 -291595 -275363 91195
10711 -47178 -161094 241414 -56235 105920 71743 -190256 -114007 -178253 23612 62839 72337
10700 72337 142735 -290889 -128443 -341580 -116047 -130175 -262662 -99265 183938 -5389 -190611
10689 -190611 132886 -34995 -137452 -12202 8114 122132 -115594 78079 -295632 198960
10678C6317C688J24529K9659c9540C1326J51433a11773N1265C34305G1913B3877
10666C9825b21616P0235N529c3457G373b32433d9109B98533j27473b39633e7921
10654E5152e5187q92A41169h063C6580b8617D64558F1119L5158g5421B21173I5175
10641F7983e9480k77320C8035i7288l89080B76777a36982H3191b71556J388M4531
10630b25637R2337O6128a621F680g9608A82090B0921N8732d4799a6170F2220K7953
10618I0173d76589a89615j43784C6728K00943b19803P184A45343i4727a6766B78584
10606b24795c5416k0576k4411K7699A74846c10761a15211C5957i8943p8370a4542
10594g1811I2437b12142g827k9944n4640A1670J76565E6618b6566k49740f1262
$$ plain form
10678 36317 3688 128217 157876 -39540 31326 182759 -111773 -60508 334305 71913 23877
10666 39825 -221616 -151381 -145852 -33457 7373 -232433 -49109 298533 171060 -239633 -57921
10654 55152 -55187 -56079 141169 -8063 36580 -28617 464558 61119 96277 -75421 221173 95175
10641 67983 -59480 -336800 38035 -97288 -486368 276777 -136982 83191 -271556 -270168 -225637
10630 -225637 -133300 -67172 -1621 6680 -79608 182090 20921 79653 -44799 -16170 62220 90173
10618 90173 -476589 -189615 -333399 36728 237671 -219803 -212619 145343 -94727 -16766 278584
10606 -224795 -35416 -55992 -80403 -52704 174846 -310761 -115211 35957 -98943 -177313 -14542
10594 -71811 92437 -212142 -7827 -37771 -92411 11670 188235 56618 -26566 -276306 -61262
10582C80139g6928B13599h9913m7771G4050c4683B28275a26609L4278j28572G1475
10570a43595A82466e5650b0629A32263O019e6841A11559M1516K41470a40871e9233
10558c30936J24136C32119D1363J7736k5413K91278b28970N1414E7962P9175M1924
10547A79061A3603a07071A65528b42025a18638D9269a06974j37251A7280a1318
10536A57675G1270J2058k4207j1905d4201E0512B2237b60809A45442d10716a54400
10524c1522j98429B41536G000c1299m7393r9792A88517c59354J65562a7692A47096
10512a50077M9265D6797d09408J79913J06525j0992D79766b48374G4830b14075
10501a1624k02147H4894f5105j59157A38105F7263M3955B002Q6403C4476P1599
$$ plain form
10582 380139 -76928 213599 -89913 -137684 74050 -34683 228275 -126609 -92331 -220903 71475
10570 -143595 182466 -55650 -20629 132263 138282 -56841 111559 153075 394545 -140871 -59233
10558 -330936 -206800 332119 41363 59099 33686 324964 -228970 -177556 57962 137137 179061
10547 179061 13603 -107071 165528 -242025 -118638 49269 -106974 -244225 17280 -11318
10536 157675 71270 83328 59121 47216 -44201 50512 22237 -260809 145442 -410716 -154400
10524 -31522 -229951 241536 7000 -31299 -78692 -178484 188517 -359354 -193792 -17692 147096
10512 -150077 -100812 46797 -409408 -229495 -122970 -133962 479766 -248374 74830 -214075
10501 -11624 -213771 84894 -65105 -224262 138105 67263 111218 2002 88405 34476 106075
10490A06075a40782n8197B3488A676a91898a9917B12542M6250K56817r3673j2839
10479D09097J8047A66987a47557O511A90579B8327A3743C489a26626E4049c7917
10467B44755B8266h1885b0403r7010B2422Q1955b60654Q2376C97279a58028K6267
10456a31761O0082A97806b43791f6990A34405M7043d16594a5534C83814b94609
10445C47606A52060a59357L1520m153j45458J38283l11055B57582l2010l6369
10435A89203h8397F8695a83338d1014C77646a86555q2370J32681A73468O6595
10425B40063A00664C2919a50701d0078A06953A5511d1938P045j51664a7713C12163
10413A12283G863B53a1794k41903L4022K7473B90694i1355B9730J15850k0724
$$ plain form
10490 106075 -140782 -198979 23488 1676 -191898 -19917 212542 258792 515609 421936 409097
10479 409097 427144 166987 -147557 -141046 190579 28327 13743 3489 -126626 54049 -37917
10467 244755 28266 -81885 -20403 -117413 22422 104377 -260654 -178278 397279 -158028 -131761
10456 -131761 -71679 197806 -243791 -66990 134405 181448 -416594 -15534 383814 -294609
10445 347606 152060 -159357 -127837 -131990 -277448 -139165 -450220 257582 225572 189203
10435 189203 -88397 68695 -183338 -41014 377646 -186555 -268925 -136244 173468 240063
10425 240063 100664 32919 -150701 -40078 106953 15511 -41938 -34893 -186557 -17713 312163
10413 112283 7863 253 -11794 -253697 -219675 -192202 290694 -91355 29730 145580 124856
10402A24856L5450g3875A28178M553F5259J99172e2236C58983A33878P5964n3793
10391A56049o8281Q8682G875K18167O6024A18796c36165A71254E5488d3172A61901
10379A11160P7161K06353D629M36158j51236g0505C98992C5647J21028M0031q3012
10368A13694L11724J25034j64834N4657m8778K82233B06277K49525B13902n2636
10358A61266o1571c9906I6380J48098A21672M96677C06684M41228j88234K4206
10348E83884k61242p7431K79334B02104L71386n9648j92485J27066k15257M848
10338B38014J48083I6952M68038e0821r7960A02450J09230q91b6063F1646a79831
10326B24111c7332C34989D2312K20485r3670e1306B1530e117j30919b6703l2348
$$ plain form
10402 124856 160306 -73875 128178 132731 65259 264431 -52236 358983 133878 209842 156049
10391 156049 87768 176450 7875 226042 292066 118796 -336165 171254 55488 -43172 161901
10379 111160 188321 394674 4629 440787 289551 -70505 398992 35647 156675 196706 113694
10368 113694 425418 550452 385618 440275 391497 673730 206277 455802 213902 161266
10358 161266 99695 -39906 96380 244478 121672 618349 306684 747912 559678 583884
10348 583884 322642 245211 524545 202104 573490 513842 321357 448423 233166 238014
10338 238014 386097 96952 564990 -50821 -148781 102450 211680 210789 -26063 61646 -179831
10326 224111 -37332 334989 42312 262797 169127 -51306 21530 -5117 -136036 -26703 -59051
10315e9051A97820E9258a2229j93254A08614M3450b52396G2879a81847D5270a66231
10303a50220n3657C3954J57942a64528A91967c4755C42198a495C4193a7932r5074
10292a13006F8825b38995d3787j08302e0759B05700a9531A1258K8591K7406c7786
10280C2982b26824i2776j38162I2045b64418A98491i2764l08549A22056k0537
10270A01519b57622j7495c0023G8531J42840b4093A46442a08981L6234A73620
10259C82128j29831J04380O3781n392j4886A87543j4670o1029b69808A01466a39127
10247B21660E8787k1057c37872A36179E184a99524G3756a59373J7140O7617C87074
10235H0892a3348j77791j77231f0807B13007a46545M4061I4756a8962m0312o4886
$$ plain form
10315 -59051 197820 59258 -12229 -205483 108614 152064 -252396 72879 -181847 45270 -166231
10303 -150220 -203877 33954 191896 -164528 191967 -34755 342198 -1495 34193 -17932 -113006
10292 -113006 68825 -238995 -43787 -152089 -50759 205700 -19531 11258 39849 67255 -37786
10280 32982 -226824 -92776 -230938 92045 -264418 198491 -92764 -401313 122056 101519
10270 101519 -257622 -275117 -30023 78531 221371 -24093 146442 -108981 -72747 173620
10259 382128 252297 356677 420458 415066 400180 187543 172873 111844 -269808 101466 -139127
10247 221660 58787 37730 -337872 136179 5184 -199524 73756 -159373 -142233 -74616 387074
10235 80892 -13348 -191139 -368370 -60807 213007 -146545 -102484 94756 -18962 -59274 -124160
10224a24160c0444j96910h8449H9937d48182J20510J12350h0954B8498J49379
10214A77877p1519i7985C23279I2482C6581c6543a329A39096e3578r8950B67317
10202B5461f9297o15k04090d5770l0431B06310i2432D741L3307j6490N962b87526
10189c30409A59579f1054G1909i8917B81188a84713L3484j28929p7033a54509
10178E321P1566a26717a4092j31326C6026a32114m5567f1585j45475H5651O5762
10167A51413C5415a05917m5159r4067D44137b29700j23308B9270c7060r0665n3112
10156a80837d0320m5198L0894k49923C36257A24615O5716g3585n8339d0005j01555
10145a41560g0011k25169C8829b41944A50930d27900f1954b7176m2579A63489
$$ plain form
10224 -124160 -30444 -227354 -88449 89937 -448182 -327672 -215322 -80954 28498 177877
10214 177877 106358 -97985 323279 92482 36581 -36543 -1329 139096 -53578 -152528 267317
10202 25461 -69297 -69912 -274002 -45770 -76201 206310 -92432 4741 38048 21558 27520 -287526
10189 -330409 159579 -61054 71909 -98917 281188 -184713 -151229 -280158 -357191 -154509
10178 5321 76887 -126717 -14092 -145418 36026 -132114 -177681 -61585 -207060 85651 151413
10167 151413 35415 -105917 -151076 -245143 444137 -229700 -353008 29270 -37060 -127725 -180837
10156 -180837 -40320 -85518 -54624 -304547 336257 124615 190331 -73585 -131924 -40005 -141560
10145 -141560 -70011 -295180 38829 -241944 150930 -427900 -61954 -27176 -69755 163489
10134c37141d2202o8129A33039c4756G3077J30695G9935c38792D367K71250b24676
10122a891j55232A34492b18802o1542J03177F1452J31861J72105a46117n7672
10112b03789Q4675j46122A91046a88797m7117A68466A4293a13373B648a6939A1599
10100A51459J5324a40815k9940e7762q0847F068a57821M2187A86288F7265a88876
10088h0697l6509B47M3326b1752B12709o4660a36009a2746j08379l2413j19848
10077b73386Q5100p7717D1724j2085e3822f277l35551a4351m12098b2543k07339
10066b29882G1038a74182L4383I3394J3886a15501M2269a4556o0053k18939d1348
10054C30203a85123C76593a64062c4491A66a82678H3112a87565i2052r4827j51043
$$ plain form
10134 -337141 -42202 -110331 133039 -34756 73077 203772 79935 -338792 4367 275617 -224676
10122 -1891 -157123 134492 -218802 -280344 -177167 61452 193313 365418 -146117 -203789
10112 -203789 -119114 -265236 191046 -188797 -235914 168466 14293 -113373 2648 -16939 11599
10100 151459 166783 -140815 -170755 -57762 -138609 6068 -157821 -115634 186288 67265 -188876
10088 -80697 -117206 247 43573 -21752 212709 148049 -136009 -12746 -121125 -153538 -273386
10077 -273386 -188286 -266003 41724 29639 -53822 -6277 -341828 -14351 -426449 -22543 -229882
10066 -229882 71038 -174182 -139799 93394 107280 -115501 -73232 -14556 -74609 -293548 -41348
10054 330203 -185123 376593 -164062 -34491 166 -182678 83112 -187565 -92052 -186879 -337922
10043c37922B36552B6472b2031k16980A50625M210i2385q3001K5602A98529a42841
10031C7009J26405b34256A03934a65897l1136i3147j59062e0676A16908B4841
10020c74081a27662L2262q0709B77790d9863B6634Q69a27463d5985j38789K0439
10009a64335F2224J32171I3871J39461b23051D66607a16219K1763M1971C04728
9998e7858A02141m9734B1977g8736C591a01792k0520L6626B19693f5881D7660
9986a25050b6023l9382L1047B9135f270C7293Q5797b11051k391q0020F9450b15440
9973G4173g9743l7568A72195M2621G224J23010a83556d0364B0546b31840a12740
9961c8373k7603A36316g9304j81280n2334a17032k3712A2590R2754c00050A03402
$$ plain form
10043 -337922 236552 26472 -22031 -239011 150625 154835 -92385 -175386 -149784 198529 -142841
10031 37009 163414 -234256 103934 -165897 -197033 -93147 -252209 -50676 116908 24841
10020 -374081 -127662 -95400 -176109 277790 -49863 26634 27503 -127463 -45985 -184774 -164335
10009 -164335 62224 194395 93871 233332 -223051 466607 -116219 -94456 -52485 304728
9998 -57858 102141 52407 21977 -78736 3591 -101792 -122312 -85686 219693 -65881 47660
9986 -125050 -26023 -65405 -34358 29135 -6270 37293 123090 -211051 -213442 -293462 69450 -215440
9973 74173 -79743 -117311 172195 214816 7224 130234 -183556 -40364 20546 -231840 -112740
9961 -38373 -65976 136316 -79304 -260584 -312918 -117032 -140744 12590 105344 -300050 103402
9949g9589a6851l09855J21680j33593e670r6953k53341e941A1687L3792f5513
9937b29205b7651k0997E0282b32940A7083O6460a89526j06301A923h3236B16039
9925C3898b55464e3551j23565N2231o3544b4337p8q3524o7185F8533c47365q7151
9913d34516J84788j37783a39134n0404a8847D5974L2849b86424O8901g9393q7090
9902a66483M8455l40765A9356a10442m0929g1653A84140a1560j48759M4571B32565
9890f2334o7585j04070G9239a24584N7826k34001f2356C4652b2724j4027k88141
9879c24892p4010J66834i0944B2385b96195a24799C73120A28517a34137M9400
9869h4737D0203M01235r2552a12192j1017C08988H1812C4025P1746b20337Q7770
$$ plain form
9949 -79589 -16851 -326706 -205026 -338619 -5670 -102623 -355964 -5941 11687 45479 -65513
9937 -229205 -27651 -48648 50282 -232940 17083 83543 -189526 -295827 1923 -83236 216039
9925 33898 -255464 -53551 -177116 -124885 -188429 -24337 -24415 -107939 -175124 68533 -347365 -434516
9913 -434516 -249728 -387511 -139134 -189538 -18847 45974 78823 -286424 -217523 -79393 -166483
9902 -166483 -118028 -458793 19356 -110442 -151371 -71653 184140 -11560 -160319 -115748 232565
9890 -62334 -129919 -233989 79239 -124584 -66758 -300759 -62356 34652 -22724 -36751 -324892
9879 -324892 -398902 -232068 -90944 22385 -296195 -124799 373120 128517 -134137 -84737
9869 -84737 40203 441438 348886 -112192 -123209 308988 81812 34025 105771 -220337 -132567
9858a32567j66185Q2789E1389q527h9671C25420a74656q7625C1120R517a07930
9846a60954l0969k341D0879a11968l8468c1384j09454l1927f9898j25800E3738
9834A18654E2191b69912P0716P5485N9688m3852p2149e5581F938a45177N9080
9823h6097j13376l823A9042L50235b81920A9778b28405h6994k30722f8521j08590
9812a77111e4110l02781C6843J18789j6197B2549J18628a25527e269k64396m3588
9801c13253J25685h446m20904A41636C4344J62593a21902b8269A5586L1956a65872
9789c18185F8362J10479f1028j58714p6295i5257j24117O3151H191P4613A258
9777B1458M7701a9643e357j72629d548p0791k45003a18159D5927c3668B7423N0990
$$ plain form
9858 -132567 -298752 -215963 51389 42862 -89671 325420 -174656 -262281 31120 40637 -107930
9846 -160954 -191923 -194264 40879 -111968 -150436 -31384 -140838 -172765 -69898 -195698 53738
9834 118654 52191 -269912 -199196 -123711 -64023 -107875 -180024 -55581 6938 -145177 -86097
9823 -86097 -199473 -203296 19042 369277 -281920 19778 -228405 -86994 -317716 -68521 -177111
9812 -177111 -54110 -356891 36843 155632 139435 22549 141177 -125527 -5269 -269665 -313253
9801 -313253 -187568 -8446 -429350 141636 34344 196937 -121902 -28269 15586 47542 -165872
9789 -318185 68362 178841 -61028 -219742 -296037 -95257 -219374 -156223 8191 82804 1258
9777 21458 69159 -19643 -5357 -177986 -4548 -75339 -320342 -118159 45927 -33668 27423 78413
9765G8413I111Q3668a30382a8975H9781B8950a26746M1647j67671R5430P3062
9754h4278j0157M3147m8089A38952a30080D57696b45190j56268C327L5169a88227
9742b73033J32342A52744E4133a40916j51432A27528b3469G7906c12837F4621
9731a07937k66342B5521c8584C98826e58046a64328A5394K73378A5387d90617
9720B05366d5516A26302a4053F2698J8734e1394r5345o6632P0392j48564a08922
9708e1703F8834a45494F1664K39777I9837a52348j24973C5628b05774d2954j66219
9697b09173f8362l06100A10826A4982J21267D7177Q3006n0813L8723g8010j69822
9686b47832e886j6565A06906k7656J29359H1550a84446A98377n5463J11734a98238
$$ plain form
9765 78413 9111 92779 -130382 -18975 89781 28950 -126746 -85099 -252770 -157340 -84278
9754 -84278 -94435 -51288 -99377 138952 -130080 457696 -245190 -401458 3327 38496 -188227
9742 -273033 -140691 152744 54133 -140916 -292348 127528 -23469 77906 -312837 64621
9731 -107937 -374279 25521 -38584 398826 -558046 -164328 15394 288772 15387 -490617
9720 205366 -45516 126302 -14053 62698 81432 -51394 -146739 -213371 -142979 -291543 -108922
9708 -51703 68834 -145494 61664 301441 99837 -152348 -277321 35628 -205774 -42954 -209173
9697 -209173 -68362 -374462 110826 14982 136249 47177 130183 79370 118093 -78010 -247832
9686 -247832 -5886 -22451 106906 79250 208609 81550 -184446 198377 142914 254648 -198238
9674a77450r7596d5735E9066a73370k0816b450j55983B00165D2364G223a08913
9662a09652A86056m7336k0171K4869E5245Q8362i9727p6045j68837C8246a82725
9650b62702N9729N8690e7078j91261f0837G9177i7695A12693b54239o4733J00258
9639b18714P8313C21624n2453a84685m6097I554b57395c1747m43281a42912D1306
9627g6261a5675k41732E2946b8379A78111J5842d2176B06574h5085k31443a45825
9615b07735B11686c61173h652k15047D0586L52222a40995A54033a74093Q778J9984
9604a45331N8264n8447A17031f014j80192G4934l1772a86776b188j31084M5365
9593h7907k83409Q9360a09707n0297P4442J8195r0349j02412e0051j73449L850
$$ plain form
9674 -177450 -275046 -45735 59066 -173370 -194186 -2450 -158433 200165 42364 7223 -108913
9662 -109652 186056 138720 118549 143418 55245 143607 -99727 -175772 -344609 38246 -182725
9650 -262702 -202973 -144283 -57078 -248339 -60837 79177 -97695 112693 -254239 -318972 -218714
9639 -218714 -140401 321624 269171 -184685 -230782 9554 -257395 -31747 -475028 -142912 41306
9627 -76261 -15675 -257407 52946 -28379 178111 193953 -42176 206574 -85085 -316528 -145825
9615 -207735 211686 -361173 -8652 -223699 40586 392808 -140995 154033 -174093 -165315 -145331
9604 -145331 -87067 -145514 117031 -6014 -186206 74934 43162 -186776 -2188 -133272 -87907
9593 -87907 -371316 -281956 -109707 -160004 -85562 -67367 -157716 -260128 -50051 -223500 -219650
9582b19650A64031p1514G538a24016A1405J25655c16278F4729b1479m40866a14310
9570b1836G232J71763a72568j16223Q4350k5249A61274c9495r9900B10963g044
9558a01819k49148k6870a39953E108e3762a1896k13904F8343P6587c47846F4862
9546e9534A3818e416k06639h0367a0407j07691p5736H7012b656j63990k69588
9535d36234A47268a30977B75762d234r9848G6796c63957F1377A6735h4643B6274
9523b8082k96563J57595I3320b97967B2636b62766A43682c35326i3493g092H6988
9511a76602B25544A2229a00487M5891B48052a20823F2608a34726n8556A53688
9500h3555M0544k56296h9414j35063Q6062c8781o8328c3180D9129R8695F3228
$$ plain form
9582 -219650 164031 92517 7538 -124016 11405 137060 -316278 64729 -21479 -462345 -114310
9570 -21836 7232 178995 -172568 -288791 -204441 -229690 161274 -39495 -139395 210963 -7044
9558 -101819 -350967 -377837 -139953 5108 -53762 -11896 -225800 68343 144930 -347846 64862
9546 -59534 13818 -5416 -212055 -80367 -10407 -118098 -193834 87012 -2656 -166646 -436234
9535 -436234 147268 -130977 275762 -4234 -104082 76796 -363957 61377 16735 -84643 26274
9523 -28082 -324645 -167050 93320 -297967 22636 -262766 143682 -335326 -93493 -7092 86988
9511 -176602 225544 12229 -100487 -54596 248052 -120823 62608 -134726 -193282 153688
9500 -83555 -43011 -299307 -89414 -224477 -138415 -38781 -107109 -33180 49129 147824 63228
9488A7519K77123b89580j05707b7661k9309H1493b16173l5478J10667k58593J86068
9477b13509H4873b06313g2739j50406j7162h4375j0834j96550A80485a25203j52131
9466b77334a18773k2650N2204G1016c7711o5223A72909O2h4147r5903a1408E9002
9453A74069P584E0439b1249H4416K41585a69980o1516a07224h006k50447a23560
9441a7187k597A61519J40556b47789A07521b49469e9827A57897d7864l3035B94903
9429b71863A98455H1944a85312f1720I7022a61363p2461M6356O8193L9026j36736
9418b16985M0027M6645C52611F6618b06397H0241b63962O7078o4938i7081A78051
9406d13723e132l59705a31859Q202N3615j9302E8333f2232j60385B78466a22853
$$ plain form
9488 17519 294642 -289580 -395287 -27661 -56970 81493 -216173 -251651 -140984 -399577 -213509
9477 -213509 84873 -206313 -72739 -223145 -240307 -84375 -95209 -291759 180485 -125203 -277334
9466 -277334 -118773 -141423 -89219 71016 -37711 -102934 172909 172971 -84147 -180050 -11408 59002
9453 174069 181653 50439 -21249 84416 326001 -169980 -231496 -107224 -8006 -258453 -123560
9441 -17187 -19784 161519 302075 -247789 107521 -249469 -59827 157897 -47864 -80899 294903
9429 -271863 198455 81944 -185312 -61720 97022 -161363 -233824 -187468 -119275 -80249 -216985
9418 -216985 -176958 -130313 352611 66618 -206397 80241 -263962 -196884 -261822 -97081 178051
9406 -413723 -5132 -364837 -131859 -123657 -70042 -89344 58333 -62232 -222617 278466 -122853
9394i2331C6595R0912F1675a49407K6820A246a15465c1431p7230e0847A82313
9382a57021j29137c3416j88913A1731a3776p0337c4933B5830b67496e7599p4455
9371a32054D43257A32449b9858n07617B8967R45R8386c42405a23055K977j20205
9360b40283B07625h8725A63430c5268p7899K4806A16715J71115A38713J17637
9350B56350a39977b0848A42197K39467a51977B52682g5855k64026J09416j14958
9340c45423J59389A48988A3603E310f01873B7438h9171k34172J27744b1441c822
9328f9592o2666l54285a76819L5157b3357B1477J18249b06439O1039a9941O481
9317a3460j02618K5059q8278k06928A13100j4440l8292e033j45014f8468G6561
$$ plain form
9394 -92331 36595 127507 61675 -149407 -122587 1246 -115465 -31431 -108661 -50847 182313
9382 -157021 -286158 -33416 -222329 11731 -13776 -84113 -34933 25830 -267496 -57599 -132054
9371 -132054 443257 132449 -29858 -537475 28967 29912 128298 -342405 -123055 -120078 -240283
9360 -240283 207625 -88725 163430 -35268 -113167 -88361 116715 287830 138713 256350
9350 256350 -139977 -20848 142197 381664 -151977 252682 -75855 -339881 -230465 -345423
9340 -345423 -186034 148988 13603 5310 -601873 27438 -89171 -323343 -195599 -21441 -3822
9328 -69592 -132258 -486543 -176819 -141662 -23357 21477 139726 -206439 -145400 -19941 -13460
9317 -13460 -116078 -91019 -179297 -386225 113100 98660 60368 -5033 -150047 -68468 76561
9305b12568c3568A12101Q8026a41813j99388D6412L6604L7927D2169d19609a84991
9293B26547B8238b50967C33615N1188B8606h697B1457b65862J10400j37644J30258
9282a62848G4545b4974j54780g5797j07233a7217q6970m120B0893J6527Q2257
9271A19677d8901J0504H8548M3290d78591H4172L500f464Q75F2714d6759A26702
9258E1175i5458k1056B53625I7780a38823f3788A91776b32504K7628B90202F0641
9246a90192A61984n9947B3076a43575C1750c66697h3934A10357a6453j65707C8984
9234a25555p8945I7863b06812l22099G5888K4876J24676a29831q1831d3132B99103
9222b20954I9659K5177h2284E7963b06008B8224a08269d2044k1264k42594a10662
$$ plain form
9305 -212568 -33568 112101 200127 -141813 -341201 46412 83016 120943 42169 -419609 -184991
9293 226547 28238 -250967 333615 384803 28606 -8697 21457 -265862 -155462 -293106 -162848
9282 -162848 74545 -24974 -179754 -75797 -183030 -17217 -104187 -108307 20893 37420 119677
9271 119677 -48901 -38397 88548 131838 -478591 84172 87672 -6464 -5589 62714 -46759 126702
9258 51175 -95458 -116514 253625 97780 -138823 -63788 191776 -232504 -204876 290202 60641
9246 -190192 161984 102037 23076 -143575 31750 -366697 -83934 110357 -16453 -182160 38984
9234 -125555 -204500 97863 -206812 -528911 75888 100764 225440 -129831 -211662 -43132 299103
9222 -220954 99659 124836 -82284 57963 -206008 28224 -108269 -42044 -63308 -305902 -110662
9210b21160J07974n8292j17492a11695B7353a81673G838L7692R3859A7380f9661
9198B5338j2326M3141i1847A09398L9167N0298g1020k51068a01080O340j15616
9187b10356h1507C6885e1479o9363A39461a10672d4785j62741B55066e3764B1385
9175a89077D8095b86783a21003l2440r387P0632j19577B9199a06375J3287C15457
9163a6053F6860a34307F4636b37068k08454A95746c3589B66039a57650C9398P8031
9152A17429j061J5157a04366q0679h2587A41789a5086k26871C82728d6878l8563
9141h5441p7116m0596h3159k5142d5065A28176n2105c61117D77a95131l4321D20009
9128a48322A16895f0958j43249R5422a6214C07378N4147E6534a3350G6228a1696
$$ plain form
9210 -221160 -113186 -171478 -288970 -111695 27353 -181673 7838 45530 139389 17380 -69661
9198 25338 13012 56153 -91847 109398 148565 198863 -71020 -322088 -101080 -94740 -210356
9187 -210356 -81507 36885 -51479 -120842 139461 -110672 -44785 -207526 255066 -53764 21385
9175 -189077 48095 -286783 -121003 -153443 -162830 -92198 -211775 29199 -106375 -93088 315457
9163 -16053 66860 -134307 64636 -237068 -445522 195746 -33589 266039 -157650 39398 117429
9152 117429 116368 131525 -104366 -185045 -82587 141789 -15086 -241957 382728 -46878 -85441
9141 -85441 -162557 -203153 -83159 -108301 -45065 128176 76071 -361117 477 -195131 -229452 420009
9128 -148322 116895 -60958 -204207 -108785 -16214 307378 361525 56534 -13350 76228 -11696
9116b11223N5426j14930E6431J07332C9923L33359F2017J09722b31654A04664
9105A10712a95182h3638j89576Q3105n5117D38838a36334C00826d02434J64188
9095b38246G6835R796A7700J19554a64295q8913b351m116l6A0618L1603f1644
9082c7162r3848G1704k4808J16321e342j67977c1411j65731I3586m1872c11271
9070i8580r9434D8416g1253I5861h1166j0360B90206A13089l1461c70909g0522
9058A54440b1715G7616a84635i0387A7041n865a91521B4807d2374H2871g4469
9046a25370j3121f069q7783E5800d8161j19119k03234H5995L6181a59011B6107
9034C433h5074A43369D3558K60633n0243A02569b10397A16260f3572q8718k4740
$$ plain form
9116 -211223 -155797 -270727 56431 163763 39923 373282 62017 171739 -231654 104664
9105 110712 -195182 -83638 -273214 -190109 -245226 438838 -136334 300826 -402434 -238246
9095 -238246 76835 86631 17700 137254 -164295 -253208 -2351 -6467 -6503 10618 42221 -61644
9082 -37162 -131010 71704 46896 163217 -5342 -173319 -31411 -197142 93586 51714 -311271
9070 -98580 -198014 48416 -71253 95861 -81166 -91526 290206 113089 81628 -370909 -70522
9058 154440 -21715 77616 -184635 -90387 17041 11176 -191521 24807 -42374 82871 -74469
9046 -125370 -138491 -6069 -93852 55800 -48161 -167280 -370514 85995 122176 -159011 26107
9034 3433 -85074 143369 43558 304191 253948 102569 -210397 116260 -63572 -152290 -177030
9023a77030h6809R010n6162K3098m22132A34856c0559A42694A5224e4758k69636
9012c24394B20352f8355a8588A44577C6727J51359c56835E4937a18285k68321
9002c86606a4258B48473a20238N6056p5324K0296B59760a69400q6944a3259l46379
8991c59638f8454A636b00453m0215g7783j83628B38177j08202c14058A00401f3283
8979c00825A32599a24709D43J181e2038j32371A59663A1619M3399b08473f6496
8967f4611D20629b81420b6421C9934e3603A72651l4840C3195e1969E660b07210
8955b59014f2210q9238A27801d0063A79843a43862j0397K4790E9030K7000a24245
8943b67407A09565d0562j3131E4174a5437E1410J52555M8732I6201K18674J19663
$$ plain form
9023 -177030 -86809 -77799 -133961 -110863 -532995 134856 -30559 142694 15224 -54758 -324394
9012 -324394 220352 -68355 -18588 144577 36727 188086 -356835 54937 -118285 -386606
9002 -386606 -14258 248473 -120238 -64182 -139506 -119210 259760 -169400 -256344 -13259 -359638
8991 -359638 -68454 1636 -200453 -240668 -77783 -261411 238177 129975 -314058 100401 -63283
8979 -300825 132599 -124709 443 1624 -52038 -184409 159663 11619 55018 -208473 -66496
8967 -64611 420629 -281420 -26421 39934 -53603 172651 137811 33195 -51969 5660 -207210
8955 -259014 -62210 -151448 127801 -40063 179843 -143862 -154259 -129469 59030 86030 -124245
8943 -267407 109565 -40562 -53693 54174 -15437 51410 203965 252697 96201 314875 434538
8932D34538A52477D1142K39574A01548K08736l1269J06206P52179J420638K857784
8922E415822O015728q57180k238152C049681A270692n25431B61173D304f9953
8912B11016h8122a9536G3021K47947j52827K99277A42850D7315Q5478b64963m4600
8901c09563J49550B44531b45306d7749r6106a5276A70176c5870o6521C95920a4299
8889A93L729J37319F3618a01936k7j1526o9961A06065C8466R1420b39528E8687
8876g8624b3322R031j87428k094l4015i6293j32739E7787L8329b2650B24034C0250
$$ plain form
8932 434538 152477 41142 280716 101548 310284 279015 385221 1137400 2558038 5415822
8922 5415822 11431550 10574370 8336218 3049681 1270692 745261 261173 4304 -69953
8912 211016 -88122 -19536 73021 320968 168141 467418 142850 47315 132793 -264963 -309563
8901 -309563 -160013 244531 -245306 -47749 -143855 -15276 170176 -35870 -102391 395920 -14299
8889 193 3922 141241 63618 -101936 -101963 -113489 -183450 106065 38466 129886 -239528 58687
8876 -78624 -23322 -14291 -201719 -203813 -237828 -96293 -229032 57787 96116 -22650 224034 30250
$$ [...]
##END NTUPLES=NMR SPECTRUM
##END=
