##TITLE=AC1500_CRIANN13307_8125335_qdL5fto03a
##JCAMPDX= 6.0         $$ Bruker NMR JCAMP-DX V2.0
##DATA TYPE= NMR SPECTRUM
##DATA CLASS= NTUPLES
##ORIGIN= BRUKER
##OWNER= Administrator
$$ 1.72 TOPSPIN		Version 2.1
$$ 2013-08-15 19:23:23.339 -0700  Administrator@X
$$ Compression mode = diff/dup
##.OBSERVE FREQUENCY= 400.02188249412
##.OBSERVE NUCLEUS= ^1H
##.ACQUISITION MODE= SIMULTANEOUS (DQD)
##.ACQUISITION SCHEME= undefined
##.AVERAGES= 64
##.DIGITISER RES= 22
##SPECTROMETER/DATA SYSTEM= spect
##.PULSE SEQUENCE= noesygpps1d.comp
##.SOLVENT NAME= COFFEE_meoh
##.SHIFT REFERENCE= INTERNAL, COFFEE_meoh, 1, 14.96122
##AUDIT TRAIL= $$ (NUMBER, WHEN, WHO, WHERE, PROCESS, VERSION, WHAT)
$$ ##TITLE= Audit trail, TOPSPIN		Version 2.1
$$ ##JCAMPDX= 5.01
$$ ##ORIGIN= Bruker BioSpin GmbH
$$ ##OWNER= Administrator
$$ $$ E:\/data/COFFEE/nmr/AC1500_CRIANN13307_8125335_qdL5fto03a/12/pdata/1/auditp.txt
$$ ##AUDIT TRAIL=  $$ (NUMBER, WHEN, WHO, WHERE, PROCESS, VERSION, WHAT)
(   1,<2013-08-15 19:23:18.480 -0700>,<Administrator>,<X>,<go>,<TOPSPIN 2.1>,
      <created by zg
	started at 2013-08-15 19:11:49.183 -0700,
	POWCHK enabled, PULCHK disabled,
       configuration hash MD5:
       C8 4E 4E 5D D3 5C D8 9E 9F 52 82 E0 59 8A DE 15
       data hash MD5: 64K
       17 F1 A6 58 51 F8 2C ED AE C4 22 61 BB 15 C5 DB>)
(   2,<2013-08-15 19:23:21.464 -0700>,<Administrator>,<X>,<proc1d>,<TOPSPIN 2.1>,
      <Start of raw data processing
       efp LB = 0.3 FT_mod = 6 PKNL = 1 PHC0 = 0 PHC1 = 0 SI = 128K 
       data hash MD5: 128K
       AC 8A A6 CF 7D DA 85 55 6A 1B 35 EC 4A 13 28 0B>)
(   3,<2013-08-15 19:23:22.370 -0700>,<Administrator>,<X>,<proc1d>,<TOPSPIN 2.1>,
      <pk PHC0 = -77.76123 PHC1 = 0 
       data hash MD5: 128K
       83 F8 A0 A2 45 0E EF B0 F0 DE E1 70 D2 71 F9 38>)
(   4,<2013-08-15 19:23:22.777 -0700>,<Administrator>,<X>,<proc1d>,<TOPSPIN 2.1>,
      <abs ABSG = 1 
       data hash MD5: 128K
       A0 58 C8 BF 0A EC 1D DB 7F 46 A1 2D 67 36 86 C1>)
(   5,<2013-08-15 19:23:22.886 -0700>,<Administrator>,<X>,<proc1d>,<TOPSPIN 2.1>,
      <abs ABSG = 2 
       data hash MD5: 128K
       A9 CA 7C D2 35 2E FF 25 6F 7F 43 92 BE 05 F0 B1>)
(   6,<2013-08-15 19:23:22.980 -0700>,<Administrator>,<X>,<proc1d>,<TOPSPIN 2.1>,
      <abs ABSG = 3 
       data hash MD5: 128K
       A2 39 19 2E F5 20 C1 AC 81 FD F1 3A C3 0F 79 00>)
(   7,<2013-08-15 19:23:23.073 -0700>,<Administrator>,<X>,<proc1d>,<TOPSPIN 2.1>,
      <abs ABSG = 4 
       data hash MD5: 128K
       CD C2 C9 F2 22 15 74 D8 E6 BD 8C 3A 36 06 3B 54>)
(   8,<2013-08-15 19:23:23.167 -0700>,<Administrator>,<X>,<proc1d>,<TOPSPIN 2.1>,
      <abs ABSG = 5 
       data hash MD5: 128K
       61 16 F3 C6 18 C4 26 0D 31 54 B9 0A 6C BF 7A 09>)
$$ ##END=
$$ 
$$ $$ hash MD5
$$ $$ F2 08 C3 65 D8 67 20 5D CE A7 36 E7 F2 DE 34 C9
##$RELAX= 
##$RELAX= 
##$RELAX= 
##$RELAX= 
##$RELAX= 
##$RELAX= 
##$RELAX= 
##$RELAX= 
$$ Bruker specific parameters
$$ --------------------------
##$DU= <E:\>
##$EXPNO= 12
$$ [...]
##$TP07= 0
##$TPNAME0= <>
##$TPNAME1= <>
##$TPNAME2= <>
##$TPNAME3= <>
##$TPNAME4= <>
##$TPNAME5= <>
##$TPNAME6= <>
##$TPNAME7= <>
##$TPOAL= (0..7)
0.5 0.5 0.5 0.5 0.5 0.5 0.5 0.5
##$TPOFFS= (0..7)
0 0 0 0 0 0 0 0
##$TUNHIN= 0
##$TUNHOUT= 0
##$TUNXOUT= 0
##$USERA1= <user>
##$USERA2= <user>
##$USERA3= <user>
##$USERA4= <user>
##$USERA5= <user>
##$V9= 5
##$VALIST= <valist>
##$VCLIST= <CCCCCCCCCCCCCCC>
##$VD= 0
##$VDLIST= <DDDDDDDDDDDDDDD>
##$VPLIST= <PPPPPPPPPPPPPPP>
##$VTLIST= <TTTTTTTTTTTTTTT>
##$WBST= 1024
##$WBSW= 4
##$XGAIN= (0..3)
0 0 0 0
##$XL= 0
##$YL= 0
##$YMAX_a= 6661274
##$YMIN_a= -13601301
##$ZGOPTNS= <>
##$ZL1= 120
##$ZL2= 120
##$ZL3= 120
##$ZL4= 120
##$ABSF1= 14.96122
##$ABSF2= -5.596962
##$ABSG= 5
##$ABSL= 3
##$ALPHA= 0
##$AQORDER= 0
##$ASSFAC= 0
##$ASSFACI= 0
##$ASSFACX= 0
##$ASSWID= 0
##$AUNMP= <proc_prof1d_extract.lims>
##$AXLEFT= 0
##$AXNAME= <>
##$AXNUC= <1H>
##$AXRIGHT= 0
##$AXTYPE= 0
##$AXUNIT= <>
##$AZFE= 0.1
##$AZFW= 0.1
##$BCFW= 0
##$BC_mod= 0
##$BYTORDP= 0
##$COROFFS= 0
##$CY= 15
##$DATMOD= 1
##$DC= 0
##$DFILT= <>
##$DTYPP= 0
##$F1P= 0
##$F2P= 0
##$FCOR= 0.5
##$FTSIZE= 131072
##$FT_mod= 6
##$GAMMA= 0
##$GB= 0
##$INTBC= 1
##$INTSCL= 1
##$ISEN= 128
##$LB= 0.3
##$LEV0= 0
##$LPBIN= 0
##$MAXI= 10000
##$MC2= 0
##$MEAN= 0
##$ME_mod= 0
##$MI= 0
##$NCOEF= 0
##$NC_proc= -2
##$NLEV= 6
##$NOISF1= 0
##$NOISF2= 0
##$NSP= 0
##$NTH_PI= 0
##$NZP= 0
##$OFFSET= 14.96122
##$PC= 1
##$PHC0= -77.76123
##$PHC1= 0
##$PH_mod= 1
##$PKNL= yes
##$PPARMOD= 0
##$PPDIAG= 0
##$PPIPTYP= 0
##$PPMPNUM= 2147483647
##$PPRESOL= 1
##$PSCAL= 4
##$PSIGN= 0
##$PYNMP= <proc.py>
##$REVERSE= no
##$SF= 400.020009549974
##$SI= 131072
##$SIGF1= 0
##$SIGF2= 0
##$SINO= 400
##$SIOLD= 131072
##$SPECTYP= <>
##$SREGLST= <1H.CDCl3>
##$SSB= 0
##$STSI= 131072
##$STSR= 0
##$SW_p= 8223.68421052631
##$SYMM= 0
##$S_DEV= 0
##$TDeff= 65536
##$TDoff= 0
##$TI= <>
##$TILT= no
##$TM1= 0
##$TM2= 0
##$TOPLEV= 0
##$USERP1= <user>
##$USERP2= <user>
##$USERP3= <user>
##$USERP4= <user>
##$USERP5= <user>
##$WDW= 1
##$XDIM= 131072
##$YMAX_p= 325449328
##$YMIN_p= -12220
##$CURPLOT= <Network HP LaserJet P1505>
##$CURPRIN= <$Network HP LaserJet P1505>
##$DFORMAT= <normdp>
##$LAYOUT= <+/1D_H.xwp>
##$LFORMAT= <normlp>
##$PFORMAT= <normpl>
##$SURQMSG= 1
$$ End of Bruker specific parameters
$$ ---------------------------------
##NTUPLES= NMR SPECTRUM
##VAR_NAME=  FREQUENCY,     SPECTRUM/REAL,   SPECTRUM/IMAG
##SYMBOL=    X,             R,               I
##VAR_TYPE=  INDEPENDENT,   DEPENDENT,       DEPENDENT
##VAR_FORM=  AFFN,          ASDF,            ASDF
##VAR_DIM=   131072,        131072,          131072
##UNITS=     HZ,            ARBITRARY UNITS, ARBITRARY UNITS
##FACTOR=    0.0627417313425164, 1,          1
##FIRST=     8223.62146879497, 1191,         -64053
##LAST=      0,             2213,            -64896
##MIN=       0,             -12220,          0
##MAX=       8223.62146879497, 325449328,    0
$$ Real data points
##PAGE= N=1
##DATA TABLE= (X++(R..R)), XYDATA
$$ [...]
$$ plain form
63859 913975 941395 969611 998279 1026488 1053385 1078406 1101006 1120521 1136381 1148368 1156696 1161874
63847 1161874 1164291 1163692 1159183 1149936 1135819 1117268 1094904 1069600 1042545 1014601 985578 954659
63835 954659 921630 887302 852727 818498 784910 752201 720300 688814 657686 627661 599732
63824 599732 574294 551054 529559 509543 490965 473974 458705 444889 431901 419421 407871
63813 407871 397875 389471 382135 375422 369204 363393 357843 352597 347940 344120 341131 338680 336200 333059
63799 333059 329085 324825 321026 317874 315034 312328 309920 307764 305327 302130 298321 294508 291169 288377
63785 288377 285854 283160 280059 276960 274782 274049 274156 273830 272364 270206 268317 267204 266681 266300 265771 264997
63769 264997 263998 262936 262136 261904 262239 262755 262985 262791 262456 262311 262343 262244 261812 261163 260538 260082 259927 260314 261375
$$ packed form
63859I13975K7420K8216K8668K8209K6897K5021K2600J9515J5860J1987Q328N178
63847A161874K417n99m509r247j4117j8551k2364k5304k7055k7944k9023l0919
63835I54659l3029l4328l4575l4229l3588l2709l1901l1486l1128l0025k7929
63824E99732k5438k3240k1495k0016j8578j6991j5269j3816j2988j2480j1550
63813D07871r996q404p336o713o218n811n550n246m657l820k989k451k480l141
63799C33059l974m260l799l152k840k706k408k156k437l197l809l813l339k792
63785B88377k523k694l101l099k178p33J07l26j466k158j889j113n23l81n29p74
63769B64997r99j062q00k32L35N16K30j94l35j45L2r9m32o49o25m56j55L87J061
$$ plain form
63750 261375 262790 263941 264541 264894 265447 266249 267070 267885 268933 270337 271920 273466 275016 276845 279253 282411
63734 282411 286234 290380 294496 298468 302318 305983 309478 313231 317844 323289 328685 333194 336937 340740
63720 340740 345121 349874 354536 358760 362180 364413 365566 366455 367858 369585 370617 370228 368665 366653 364586
63705 364586 362502 360601 359309 358720 358303 357364 355694 353727 352226 351805 352475 353539 354237 354680 355843 358366
63689 358366 361641 364467 366374 367845 369436 371264 373363 375854 378467 380418 381131 380888 380469 380361 380569
63674 380569 380998 381744 383066 385202 388094 391182 393638 394998 395472 395616 395859 396370 397130 397968 398693 399168 399129
63657 399129 398059 395625 392223 388582 384783 380282 375035 369936 365794 362526 359838 358030 357435 357579 357687
63642 357687 357740 358187 358934 359538 360377 362598 366692 371824 376823 381237 385223 389126 393517 399012 405644 412744
$$ packed form
63750B61375J415J151O00L53N53Q02Q21Q15J048J404J583J546J550J829K408L158
63734B82411L823M146M116L972L850L665L495L753M613N445N396M509L743L803
63720C40740M381M753M662M224L420K233J153Q89J403J727J032l89j563k012k067
63705C64586k084j901j292n89m17r39j670j967j501m21O70J064O98M43J163K523
63689C58366L275K826J907J471J591J828K099K491K613J951P13k43m19j08K08
63674C80569M29P46J322K136K892L088K456J360M74J44K43N11P60Q38P25M75l9
63657C99129j070k434l402l641l799m501n247n099m142l268k688j808n95J44J08
63642C57687N3M47P47O04Q39K221M094N132M999M414L986L903M391N495O632P100
$$ plain form
63626 412744 419823 427139 435136 443791 452918 462679 473281 484505 496095 508446 522361 538162 555479
63613 555479 573945 593757 615414 639154 664769 691788 719693 747964 776044 803452 829983
63602 829983 855667 880361 903490 924404 942821 958638 971467 980812 986692 989461 988928 984299 975365
63589 975365 963228 949358 934359 918119 900802 882946 864697 845591 825246 803840 781818
63578 781818 759503 737219 715591 695508 677749 662549 649421 637548 626526 616755 609056 604028
63566 604028 601790 602000 603900 606673 610180 615198 622546 632046 642645 653451 664370 675920 688899
63553 688899 704129 721971 741936 763203 785667 810165 837509 867576 899440 932072 964676
63542 964676 996589 1027181 1055949 1082730 1107799 1131470 1153195 1171085 1182782 1187037 1184366 1176249
$$ packed form
63626D12744P079P316P997Q655R127R761J0602J1224J1590J2351J3915J5801J7317
63613E55479J8466J9812K1657K3740K5615K7019K7905K8271K8080K7408K6531
63602H29983K5684K4694K3129K0914J8417J5817J2829R345N880K769n33m629q934
63589I75365j2137j3870j4999j6240j7317j7856j8249j9106k0345k1406k2022
63578G81818k2315k2284k1628k0083j7759j5200j3128j1873j1022r771p699n028
63566F04028k238K10J900K773L507N018P348R500J0599J0806J0919J1550J2979
63553F88899J5230J7842J9965K1267K2464K4498K7344L0067L1864L2632L2604
63542I64676L1913L0592K8768K6781K5069K3671K1725J7890J1697M255k671q117
$$ plain form
63530 1176249 1164051 1148698 1130846 1110998 1089595 1067147 1044104 1020521 996083 970506 943637
63519 943637 915213 884980 853270 821026 789007 757348 726151 696063 667841 641713 617647
63508 617647 595902 576715 559630 543840 529196 516321 505548 496273 487629 479416 472105 466115
63496 466115 461323 457152 453003 448644 444240 439975 435773 431578 427785 425046 423650 423322 423655 424443 425632
63481 425632 427304 429742 433047 436608 439414 441131 442474 444221 446248 447962 449283 450652 452225 453660
63467 453660 454666 455274 455437 454868 453460 451546 449476 447166 444342 441092 438003 435765 434712 434644 435015 435412
63451 435412 435960 437173 439397 442524 446312 450814 456353 463165 471189 480171 489927 500557 512465 526064
63437 526064 541478 558655 577789 599308 623230 648750 674763 700735 726817 753178 779569
$$ packed form
63530A176249j2198j5353j7852j9848k1403k2448k3043k3583k4438k5577k6869
63519I43637k8424l0233l1710l2244l2019l1659l1197l0088k8222k6128k4066
63508F17647k1745j9187j7085j5790j4644j2875j0773r275q644q213p311n990
63496D66115m792m171m149m359m404m265m202m195l793k739j396l28L33P88J189
63481D25632J672K438L305L561K806J717J343J747K027J714J321J369J573J435
63467D53660J006O08J63n69j408j914k070k310k824l250l089k238j053o8L71L97
63451D35412N48J213K224L127L788M502N539O812Q024Q982R756J0630J1908J3599
63437E26064J5414J7177J9134K1519K3922K5520K6013K5972K6082K6361K6391
$$ plain form
63426 779569 805611 831181 856291 880672 903729 924886 943978 961398 977934 994393 1011291
63415 1011291 1028907 1047582 1067746 1089512 1112360 1135411 1157975 1179676 1200035 1218129 1232779
63404 1232779 1243068 1248644 1249571 1245932 1237631 1224645 1207505 1187431 1165752 1143134 1119428 1094237
63392 1094237 1067502 1039490 1010407 980216 948812 916262 883007 850007 818613 789957 764240
63381 764240 740779 718899 698733 681046 666420 654867 646161 640203 636872 635738 636257 638272 642148
63368 642148 648366 657116 668370 682110 698249 716419 736111 757180 780019 805088 832388 861567
63356 861567 892407 924883 958637 992692 1025981 1058073 1089127 1119093 1147204 1172373 1193972
63345 1193972 1212035 1226739 1237826 1244600 1246439 1243238 1235362 1223238 1207134 1187417 1164953 1140997
$$ packed form
63426G79569K6042K5570K5110K4381K3057K1157J9092J7420J6536J6459J6898
63415A011291J7616J8675K0164K1766K2848K3051K2564K1701K0359J8094J4650
63404A232779J0289N576R27l639q301j2986j7140k0074k1679k2618k3706k5191
63392A094237k6735k8012k9083l0191l1404l2550l3255l3000l1394k8656k5717
63381G64240k3461k1880k0166j7687j4626j1553q706n958l331j134N19K015L876
63368F42148O218Q750J1254J3740J6139J8170J9692K1069K2839K5069K7300K9179
63356H61567L0840L2476L3754L4055L3289L2092L1054K9966K8111K5169K1599
63345A193972J8063J4704J1087O774J839l201p876j2124j6104j9717k2464k3956
$$ plain form
63333 1140997 1116525 1091746 1066399 1040366 1013720 986276 957639 928003 898571 870672 844581
63322 844581 819725 796022 774309 755114 737598 720396 703249 687139 672908 660432 649242
63311 649242 639184 629960 620479 609279 595496 579129 560654 540909 521271 503320 487954 474939
63299 474939 463386 452630 442670 433965 426879 421258 416557 412362 408592 405171 401766 398117 394373 390801
63285 390801 387346 383807 380284 377077 374271 371833 369992 368904 367997 366289 363606 360986 359580 359506 360022
63270 360022 360401 360349 359997 359886 360718 362739 365444 368085 370270 371951 373256 374590 376555 379372 382721 386417
63254 386417 390763 395708 400190 403116 404818 406733 409674 413211 416846 420951 426139 432379 439249 446680
63240 446680 454917 463966 473558 483594 494282 505823 518135 530953 544074 557560 571692 586644
$$ packed form
63333A140997k4472k4779k5347k6033k6646k7444k8637k9636k9432k7899k6091
63322H44581k4856k3703k1713j9195j7516j7202j7147j6110j4231j2476j1190
63311F49242j0058r224r481j1200j3783j6367j8475j9745j9638j7951j5366j3015
63299D74939j1553j0756r960q705p086n621m701m195l770l421l405l649l744l572
63285C90801l455l539l523l207k806k438j841j088r07j708k683k620j406p4N16
63270C60022L79n2l52j11Q32K021K705K641K185J681J305J334J965K817L349L696
63254C86417M346M945M482K926J702J915K941L537L635M105N188O240O870P431
63240D46680Q237R049R592J0036J0688J1541J2312J2818J3121J3486J4132J4952
$$ plain form
63228 586644 602168 617723 632919 647699 662182 676583 691302 706739 722884 739316 755650
63217 755650 771692 787067 801159 813673 825013 835740 845860 854919 862582 868694 872891 874601
63205 874601 873570 870059 864413 856667 846794 835132 822347 808957 795110 780879 766637 753028
63193 753028 740679 730132 721976 716699 714256 714024 715452 718631 724019 731774 741686 753640 767682
63180 767682 783630 801012 819548 839227 859686 879903 898914 916669 933849 950846 967178
63169 967178 981914 994505 1005149 1014376 1022244 1028019 1030787 1030330 1027110 1021370 1012665 1000437 984703
63156 984703 965880 944297 920376 895055 869449 843957 818098 791386 764176 737578 712755
63145 712755 690340 670218 651669 633896 616717 600804 587092 575869 566451 557841 549667 542422
$$ packed form
63228E86644J5524J5555J5196J4780J4483J4401J4719J5437J6145J6432J6334
63217G55650J6042J5375J4092J2514J1340J0727J0120R059P663O112M197J710
63205H74601j031l511n646p746r873j1662j2785j3390j3847j4231j4242j3609
63193G53028j2349j0547q156n277k443k32J428L179N388P755R912J1954J4042
63180G67682J5948J7382J8536J9679K0459K0217J9011J7755J7180J6997J6332
63169I67178J4736J2591J0644R227P868N775K768m57l220n740q705j2228j5734
63156I84703j8823k1583k3921k5321k5606k5492k5859k6712k7210k6598k4823
63145G12755k2415k0122j8549j7773j7179j5913j3712j1223r418q610q174p245
$$ plain form
63133 542422 536752 532691 529744 527559 526216 525858 526311 527195 528230 529366 530815 532976 536052 539640 543005
63118 543005 545973 549223 553510 558792 564361 569506 573814 577164 579881 582652 585846 589005 591460 593329
63104 593329 595384 597980 600642 602858 604745 606671 608614 610229 611368 612226 613061 613953 614783 615339 615496 615381
63088 615381 615314 615580 616322 617552 619119 620675 621914 622892 623891 624927 625575 625416 624556 623653 623516 624653 627048
63071 627048 630366 634475 639721 646538 654877 664242 674217 684635 695333 706262 718013 731724 748069
63058 748069 766580 786364 807304 830117 855315 882663 911796 942908 976383 1011896 1048389
63047 1048389 1085115 1122403 1161055 1201137 1241792 1282292 1322849 1364072 1405933 1447707 1488784
63036 1488784 1529043 1568373 1606273 1642122 1675545 1706258 1733792 1757644 1777592 1793645 1805737
$$ packed form
63133E42422n670m061k947k185j343l58M53Q84J035J136J449K161L076L588L365
63118E43005K968L250M287N282N569N145M308L350K717K771L194L159K455J869
63104E93329K055K596K662K216J887J926J943J615J139Q58Q35Q92Q30N56J57j15
63088F15381o7K66P42J230J567J556J239R78R99J036O48j59q60r03j37J137K395
63071F27048L318M109N246O817Q339R365R975J0418J0698J0929J1751J3711J6345
63058G48069J8511J9784K0940K2813K5198K7348K9133L1112L3475L5513L6493
63047A048389L6726L7288L8652M0082M0655M0500M0557M1223M1861M1774M1077
63036A488784M0259L9330L7900L5849L3423L0713K7534K3852J9948J6053J2092
$$ plain form
63025 1805737 1813570 1816647 1814322 1805995 1791516 1771395 1746451 1717271 1684185 1647806 1609409 1570623
63013 1570623 1532732 1496322 1461611 1428999 1399267 1373356 1352163 1336480 1326737 1322597 1323093 1327529
63001 1327529 1336137 1349556 1367753 1389832 1414825 1442243 1471803 1503078 1535595 1568915 1602399
62990 1602399 1635218 1666887 1697477 1727013 1754843 1779884 1801357 1818984 1832602 1841883 1846427 1845900
62978 1845900 1840088 1828941 1812468 1790509 1762760 1729226 1690524 1647560 1601082 1551724 1500287
62967 1500287 1447636 1394428 1341263 1289001 1238560 1190366 1144320 1100369 1058802 1019959 983971
62956 983971 950941 921038 894084 869223 845320 821776 798852 777195 757195 738796 721798
62945 721798 706181 692059 679318 667400 655587 643541 631532 620081 609410 599320 589541 580117
$$ packed form
63025A805737P833L077k325q327j4479k0121k4944k9180l3086l6379l8397l8786
63013A570623l7891l6410l4711l2612k9732k5911k1193j5683r743m140M96M436
63001A327529Q608J3419J8197K2079K4993K7418K9560L1275L2517L3320L3484
62990A602399L2819L1669L0590K9536K7830K5041K1473J7627J3618R281M544n27
62978A845900n812j1147j6473k1959k7749l3534l8702m2964m6478m9358n1437
62967A500287n2651n3208n3165n2262n0441m8194m6046m3951m1567l8843l5988
62956I83971l3030k9903k6954k4861k3903k3544k2924k1657k0000j8399j6998
62945G21798j5617j4122j2741j1918j1813j2046j2009j1451j0671j0090r779r424
$$ plain form
62933 580117 571378 563585 556691 550450 544670 539349 534695 531041 528541 526783 524845 522030 518562 515306
62919 515306 512837 511061 509713 508834 508511 508476 508254 507622 506716 505786 504961 504123 502927 501219 499563 499021 500065
62902 500065 501932 503394 503909 503693 503005 502030 501329 501602 502732 503701 503823 503571 503758 504283 504263 503231 501684
62885 501684 500486 500121 500555 501362 501876 501596 500742 500211 500730 502132 503566 504294 504099 503111 501582 499896 498516
62868 498516 497693 497238 496704 495745 494303 492574 490908 489685 489146 489290 489920 490706 491220 491121 490473 489767 489451 489473
62850 489473 489462 489219 488804 488298 487868 488062 489533 492273 495425 498087 500060 501641 503035 504254 505308 506135
62834 506135 506567 506695 507048 507983 509112 509801 510099 510597 511471 512300 512934 513885 515519 517366 518702 519488 520336
62817 520336 521770 523909 526687 529899 533080 535722 537761 539649 541903 544684 547759 550668 553004 554783
$$ packed form
62933E80117q739p793o894o241n780n321m654l654k500j758j938k815l468l256
62919E15306k469j776j348q79l23l5k22o32r06r30q25q38j196j708j656n42J044
62902E00065J867J462N15k16o88r75p01K73J130R69J22k52J87N25k0j032j547
62885E01684j198l65M34Q07N14k80q54n31N19J402J434P28j95r88j529j686j380
62868D98516q23m55n34r59j442j729j666j223n39J44O30P86N14r9o48p06l16K2
62850D89473j1k43m15n06m30J94J471K740L152K662J973J581J394J219J054Q27
62834E06135M32J28L53R35J129O89K98M98Q74Q29O34R51J634J847J336P86Q48
62817E20336J434K139K778L212L181K642K039J888K254K781L075K909K336J779
$$ plain form
62803 554783 556581 559047 562218 565530 568682 572329 577676 585391 595003 605387 615734 626116 637260
62790 637260 649980 664724 681442 699709 719121 739831 762724 788928 819019 852733 889423
62779 889423 928695 970582 1015272 1062760 1112680 1164347 1217020 1270151 1323278 1375594 1425828
62768 1425828 1472721 1515511 1553694 1586408 1612364 1630554 1640833 1643582 1638927 1626508 1606035 1577874
62756 1577874 1542960 1502326 1456869 1407523 1355392 1301571 1246908 1192092 1137928 1085405 1035382
62745 1035382 988227 943797 901796 862183 825271 791414 760629 732564 706905 683765 663632
62734 663632 646814 632910 620861 609670 599173 589947 582380 576037 570257 565215 561871 560717 561048
62721 561048 561782 562671 564306 567190 571287 576439 582794 590736 600624 612543 626118 640793 656635 674689
$$ packed form
62803E54783J798K466L171L312L152L647N347P715R612J0384J0347J0382J1144
62790F37260J2720J4744J6718J8267J9412K0710K2893K6204L0091L3714L6690
62779H89423L9272M1887M4690M7488M9920N1667N2673N3131N3127N2316N0234
62768A425828M6893M2790L8183L2714K5956J8190J0279K749m655j2419k0473k8161
62756A577874l4914m0634m5457m9346n2131n3821n4663n4816n4164n2523n0023
62745A035382m7155m4430m2001l9613l6912l3857l0785k8065k5659k3140k0133
62734F63632j6818j3904j2049j1191j0497r226p567o343n780n042l344j154L31
62721E61048P34Q89J635K884M097N152O355P942R888J1919J3575J4675J5842J8054
$$ plain form
62707 674689 696002 720353 746538 773874 802868 834351 868761 906518 948296 994277 1043653
62696 1043653 1095447 1149459 1205772 1263752 1322300 1380848 1439287 1496934 1552320 1604153 1651734
62685 1651734 1694178 1729911 1757419 1776111 1786045 1787123 1778958 1761336 1734457 1698881 1655552 1605820
62673 1605820 1551145 1492740 1431576 1368598 1304787 1241172 1178888 1119062 1062409 1009064 958965
62662 958965 912244 869072 829386 793135 760625 732156 707267 684757 663662 643966 626179
62651 626179 610458 596375 583393 571285 560153 550247 541766 534591 528161 521869 515750 510585 507071
62638 507071 504921 503027 500538 497568 494799 492635 490943 489458 488169 487326 487243 488067 489533 490942 491558
62623 491558 491099 489812 488177 486701 485833 485711 485970 486118 486232 486950 488655 491048 493783 497112 501468 506666
$$ packed form
62707F74689K1313K4351K6185K7336K8994L1483L4410L7757M1778M5981M9376
62696A043653N1794N4012N6313N7980N8548N8548N8439N7647N5386N1833M7581
62685A651734M2444L5733K7508J8692R934J078q165j7622k6879l5576m3329m9732
62673A605820n4675n8405o1164o2978o3811o3615o2284n9826n6653n3345n0099
62662I58965m6721m3172l9686l6251l2510k8469k4889k2510k1095j9696j7787
62651F26179j5721j4083j2982j2108j1132r906q481p175o430o292o119n165l514
62638E07071k150j894k489k970k769k164j692j485j289q43q3Q24J466J409O16
62623D91558m59j287j635j476q68j22K59J48J14P18J705K393K735L329M356N198
$$ plain form
62607 506666 512079 517616 523969 531772 540886 550758 561159 572366 584777 598572 613648 629739 646728
62594 646728 664987 685188 707511 731092 754529 777004 798850 820953 843711 866586 888546
62583 888546 908731 926593 941540 952814 959878 962689 961340 955643 945513 931671 915417 897487
62571 897487 877556 855172 830819 805698 780740 756253 732332 709143 686815 665473 645373
62560 645373 626760 609630 593926 579817 567335 555905 544840 534386 525624 519046 513833 508932
62548 508932 504349 500745 498184 495981 493728 491748 490410 489529 488731 488037 487774 488111 488945 490159 491745 493709
62532 493709 496027 498686 501681 504946 508417 512253 516924 522911 530228 538453 547474 558071 571364 587633
62518 587633 606078 625957 647539 671564 698120 726540 756290 787390 819983 853989 889287
$$ packed form
62607E06666N413N537O353P803R114R872J0401J1207J2411J3795J5076J6091J6989
62594F46728J8259K0201K2323K3581K3437K2475K1846K2103K2758K2875K1960
62583H88546K0185J7862J4947J1274P064K811j349n697j0130j3842j6254j7930
62571H97487j9931k2384k4353k5121k4958k4487k3921k3189k2328k1342k0100
62560F45373j8613j7130j5704j4109j2482j1430j1065j0454q762o578n213m901
62548E08932m583l604k561k203k253j980j338q81p98o94k63L37Q34J214J586J964
62532D93709K318K659K995L265L471L836M671N987P317Q225R021J0597J3293J6269
62518E87633J8445J9879K1582K4025K6556K8420K9750L1100L2593L4006L5298
$$ plain form
62507 889287 925739 962787 999394 1034651 1068221 1099968 1129415 1155859 1178908 1198660 1215401
62496 1215401 1229227 1239900 1247048 1250678 1251515 1250671 1249048 1247376 1246858 1249118 1255138 1264611 1276881 1292230
62482 1292230 1311625 1335156 1361359 1388261 1414743 1440611 1465695 1489264 1510218 1527435 1539836
62471 1539836 1546283 1545641 1537055 1520275 1495790 1464695 1428284 1387521 1342661 1293387 1239578 1182099
62459 1182099 1122800 1063689 1006128 950825 898320 849254 804263 763774 727891 696347 668646
62448 668646 644395 623463 605789 591193 579488 570535 563949 558923 554714 551199 548628 546890 545427
62435 545427 543920 542618 541820 541400 541036 540611 540062 539108 537505 535435 533283 531057 528336 524792 520522 515804
62419 515804 510757 505376 499810 494456 489761 485846 482327 478669 474892 471762 470014 469423 468979 467964 466458
$$ packed form
62507H89287L6452L7048L6607L5257L3570L1747K9447K6444K3049J9752J6741
62496A215401J3826J0673P148L630Q37q44j623j672n18K260O020R473J2270J5349
62482A292230J9395K3531K6203K6902K6482K5868K5084K3569K0954J7217J2401
62471A539836O447o42q586j6780k4485l1095l6411m0763m4860m9274n3809n7479
62459A182099n9299n9111n7561n5303n2505m9066m4991m0489l5883l1544k7701
62448F68646k4251k0932j7674j4596j1705q953o586n026m209l515k571j738j463
62435E45427j507j302p98m20l64m25n49r54j603k070k152k226k721l544m270m718
62419E15804n047n381n566n354m695l915l519l658l777l130j748n91m44j015j506
$$ plain form
62404 466458 464720 462556 459790 457030 455421 455524 456826 458424 459806 460837 461432 461674 462137 463619 466432
62389 466432 470115 473951 477641 481464 485892 491089 496748 502360 507667 512822 518129 523780 529933 536904
62375 536904 545014 554295 564506 575452 587128 599562 612720 626567 641111 656436 672919 691356
62363 691356 712615 737084 764657 795186 828622 864755 903334 944604 989211 1037145 1087164
62352 1087164 1137668 1187920 1237913 1287236 1334647 1378806 1418902 1454440 1484709 1508656 1525148
62341 1525148 1533355 1533136 1525129 1510323 1489529 1463335 1432350 1397250 1358699 1317586 1275164 1232559
62329 1232559 1190177 1148014 1106449 1066227 1027706 990772 955655 923177 893843 867147 842041
62318 842041 817673 793434 769003 744908 722585 703155 686334 671029 656709 643591 631744
$$ packed form
62404D66458j738k164k766k760j609J03J302J598J382J031N95K42M63J482K813
62389D66432L683L836L690L823M428N197N659N612N307N155N307N651O153O971
62375E36904Q110R281J0211J0946J1676J2434J3158J3847J4544J5325J6483J8437
62363F91356K1259K4469K7573L0529L3436L6133L8579M1270M4607M7934N0019
62352A087164N0504N0252M9993M9323M7411M4159M0096L5538L0269K3947J6492
62341A525148Q207k19q007j4806k0794k6194l0985l5100l8551m1113m2422m2605
62329A232559m2382m2163m1565m0222l8521l6934l5117l2478k9334k6696k5106
62318H42041k4368k4239k4431k4095k2323j9430j6821j5305j4320j3118j1847
$$ plain form
62307 631744 620774 610429 600836 592071 584031 576855 570879 566015 561661 557442 553584 550412 548003 546563
62293 546563 546571 548038 550009 551373 552056 552953 554783 557463 560602 564113 568077 572233 575963 578922 581522
62278 581522 584589 588489 592792 597024 601512 607078 613963 621543 629276 637466 646869 657917 670681 685288
62264 685288 701994 721013 742590 767053 794523 824824 858002 894632 935134 978943 1024907
62253 1024907 1072401 1121527 1172256 1223914 1275511 1325944 1373732 1417203 1455242 1487442 1513250
62242 1513250 1531495 1541113 1541923 1534298 1518533 1495035 1464769 1428884 1388079 1342951 1294751 1245106
62230 1245106 1194946 1144376 1093778 1044375 997401 953217 911726 873289 838677 808259 781750
62219 781750 758784 739317 723320 710423 700111 692151 686541 683038 680950 679534 678526 678191 678902
$$ packed form
62307F31744j0970j0345r593q765q040p176n976m864m354m219l858l172k409j440
62293E46563QJ467J971J364O83Q97J830K680L139L511L964M156L730K959K600
62278E81522L067L900M303M232M488N566O885P580P733Q190R403J1048J2764J4607
62264F85288J6706J9019K1577K4463K7470L0301L3178L6630M0502M3809M5964
62253A024907M7494M9126N0729N1658N1597N0433M7788M3471L8039L2200K5808
62242A513250J8245R618Q10p625j5765k3498l0266l5885m0805m5128m8200m9645
62230A245106n0160n0570n0598m9403m6974m4184m1491l8437l4612l0418k6509
62219G81750k2966j9467j5997j2897j0312p960n610l503k088j416j008l35P11
$$ plain form
62206 678902 680803 683842 687837 692315 696443 699488 701470 703181 705434 708338 711345 713873 715749 717170
62192 717170 718478 720063 722341 725562 729559 733755 737646 741278 745222 750047 755883 762416 769126 775525
62178 775525 781391 786987 792973 799988 808314 817956 828865 840987 854322 869097 885738 904496 925280
62165 925280 948079 973333 1001522 1032479 1065376 1099308 1133567 1167534 1200757 1233079 1264113
62154 1264113 1292433 1315829 1332699 1342886 1346978 1345213 1337454 1323934 1305545 1283429 1258454 1230957
62142 1230957 1200758 1167652 1132183 1095788 1059934 1025266 991882 960175 930955 904748 881407
62131 881407 860536 842029 826068 812859 802531 795124 790423 787773 786231 785116 784526 785183 787536
62118 787536 791124 795092 799286 804396 810878 818202 825443 832180 838391 843869 848348 852069 855596 859016
$$ packed form
62206F78902J901L039L995M478M128L045J982J711K253K904L007K528J876J421
62192G17170J308J585K278L221L997M196L891L632L944M825N836O533O710O399
62178G75525N866N596N986P015Q326R642J0909J2122J3335J4775J6641J8758K0784
62165I25280K2799K5254K8189L0957L2897L3932L4259L3967L3223L2322L1034
62154A264113K8320K3396J6870J0187M092j765p759j3520j8389k2116k4975k7497
62142A230957l0199l3106l5469l6395l5854l4668l3384l1707k9220k6207k3341
62131H81407k0871j8507j5961j3209j0328p407m701k650j542j115n90O57K353
62118G87536L588L968M194N110O482P324P241O737O211N478M479L721L527L420
$$ plain form
62104 859016 861743 863185 863186 861807 859137 855525 851702 848474 846381 845585 845733 846016 845773 845219 845257 846485 848778
62087 848778 851960 856431 862746 870816 879981 889836 900694 913154 927389 943049 959883 978206 998512
62074 998512 1020653 1043800 1067351 1091475 1116482 1142150 1168231 1195194 1223637 1253048 1282062
62063 1282062 1310065 1337729 1365705 1393602 1420639 1446554 1471215 1493947 1513915 1530823 1544661
62052 1544661 1555115 1561792 1564595 1563164 1556264 1542628 1522445 1497332 1468776 1437187 1402440 1364622
62040 1364622 1324079 1281338 1237209 1192479 1147268 1101278 1054959 1009917 967743 928795 892498
62029 892498 858508 827086 798578 773052 750386 730287 712149 695279 679361 664511 650834
62018 650834 638162 626307 615336 605454 596710 588960 581970 575474 569216 563168 557720 553481 550707
$$ packed form
62104H59016K727J442Jj379k670l612l823l228k093p96J48K83k43n54L8J228K293
62087H48778L182M471O315Q070R165R855J0858J2460J4235J5660J6834J8323K0306
62074I98512K2141K3147K3551K4124K5007K5668K6081K6963K8443K9411K9014
62063A282062K8003K7664K7976K7897K7037K5915K4661K2732J9968J6908J3838
62052A544661J0454O677K803j431o900j3636k0183k5113k8556l1589l4747l7818
62040A364622m0543m2741m4129m4730m5211m5990m6319m5042m2174l8948l6297
62029H92498l3990l1422k8508k5526k2666k0099j8138j6870j5918j4850j3677
62018F50834j2672j1855j0971r882q744p750o990o496o258o048n448m239k774
$$ plain form
62005 550707 548945 547394 545709 544441 544586 546616 549951 553445 556404 559110 562308 566306 570673 574664
61991 574664 577617 579022 578649 576903 574687 572491 569803 565850 560764 555470 550411 545066 538931 532467
61977 532467 526606 521675 517269 513024 509131 506133 504419 503875 503873 503773 503593 503970 505280 507051 508510 509385
61961 509385 509920 510409 511123 512434 514485 516872 519136 521448 524329 527848 531649 535725 540510 546067 551850
61946 551850 557539 563633 570830 579210 588406 598341 609349 621663 635082 649208 663853 679197 695499
61933 695499 712608 729760 746060 761103 774989 787831 799613 810508 820879 830721 839388 846103
61921 846103 850590 853111 854069 853730 852180 849486 846075 842943 841181 841172 842462 844421 846687 849018 851286
61906 851286 853947 857936 863612 870078 876044 881131 885815 890240 893719 895514 895577 894233 891392 886403 878606
$$ packed form
62005E50707j762j551j685j268J45K030L335L494K959K706L198L998M367L991
61991E74664K953J405l73j746k216k196k688l953n086n294n059n345o135o464
61977E32467n861m931m406m245l893k998j714n44kj00j80L77J310J771J459Q75
61961E09385N35M89P14J311K051K387K264K312K881L519L801M076M785N557N783
61946E51850N689O094P197Q380R196R935J1008J2314J3419J4126J4645J5344J6302
61933F95499J7109J7152J6300J5043J3886J2842J1782J0895J0371R842Q667O715
61921H46103M487K521R58l39j550k694l411l132j762rJ290J959K266K331K268
61906H51286K661L989N676O466N966N087M684M425L479J795O3j344k841m989p797
$$ plain form
61891 878606 867883 854712 839885 824275 808721 793879 779931 766463 752898 739089 725372
61880 725372 712054 699140 686606 674590 663087 651795 640584 629992 620905 613749 608222 603743
61868 603743 599969 596919 594811 593826 593908 594843 596590 599454 603851 610072 618357 628993 642092 657414
61854 657414 674607 693514 714055 736048 759419 784432 811278 839459 867928 895921 923326
61843 923326 950193 976162 1000589 1023024 1043352 1061487 1077074 1089541 1098520 1104281 1107740 1109891
61831 1109891 1111186 1111467 1110478 1108379 1105863 1103840 1102948 1103287 1104621 1106801 1109826 1113474 1117078 1119827 1121130
61816 1121130 1120563 1117631 1111802 1102706 1090185 1074273 1055201 1033242 1008504 981156 951952 922138
61804 922138 892564 863307 834549 807341 782821 760903 740468 720845 702486 686129 671942
$$ packed form
61891H78606j0723j3171j4827j5610j5554j4842j3948j3468j3565j3809j3717
61880G25372j3318j2914j2534j2016j1503j1292j1211j0592r087p156n527m479
61868F03743l774l050k108r85Q2R35J747K864M397O221Q285J0636J3099J5322
61854F57414J7193J8907K0541K1993K3371K5013K6846K8181K8469K7993K7405
61843I23326K6867K5969K4427K2435K0328J8135J5587J2467Q979N761L459K151
61831A109891J295K81r89k099k516k023q92L39J334K180L025L648L604K749J303
61816A121130n67k932n829r096j2521j5912j9072k1959k4738k7348k9204k9814
61804I22138k9574k9257k8758k7208k4520k1918k0435j9623j8359j6357j4187
$$ plain form
61793 671942 659650 648918 639336 630441 622049 614255 607001 600026 593371 587425 582294 577636 573384 570065
61779 570065 567935 566309 564318 561985 559963 558478 557190 555917 554768 553597 552031 550208 548856 548347
61765 548347 548232 548075 548235 549287 550948 552234 552678 552860 553598 555053 556825 558563 560106 561282 562002 562515
61749 562515 563135 563688 563607 562742 561716 561161 560916 560368 559354 558250 557248 556052 554465 552841 551670 551010
61733 551010 550599 550310 550249 550502 551049 551875 552987 554335 555887 557818 560487 564112 568398 572514 575637 577688
61717 577688 579479 581910 584999 587842 589515 589833 589286 588547 588064 587828 587326 585887 583220 579545 575278 570867
61701 570867 566889 563856 561643 559440 556427 552377 547509 542233 537196 533101 530045 527357 524493 521749
61687 521749 519663 518053 516254 514064 511778 509359 506331 502652 499035 496079 493606 491203 489045 487715
$$ packed form
61793F71942j2292j0732r582q895q392p794p254o975o655n946n131m658m252l319
61779E70065k130j626j991k333k022j485j288j273j149j171j566j823j352n09
61765E48347j15j57J60J052J661J286M44J82P38J455J772J738J543J176P20N13
61749E62515O20N53q1q65j026n55k45n48j014j104j002j196j587j624j171o60
61733E51010m11k89o1K53N47Q26J112J348J552J931K669L625M286M116L123K051
61717E77688J791K431L089K843J673L18n47p39m83k36n02j439k667l675m267m411
61701E70867l978l033k213k203l013m050m868n276n037m095l056k688k864k744
61687E21749k086j610j799k190k286k419l028l679l617k956k473k403k158j330
$$ plain form
61673 487715 487339 487274 486652 485067 482851 480760 479357 478560 477867 476983 476081 475387 474735 473715 472214 470711 469978
61656 469978 470399 471508 472314 472301 471997 472286 473238 474057 474261 474535 476053 479147 482938 486233 488608 490603 492979
61639 492979 495803 498296 499599 499698 499431 499661 500589 501786 502642 502735 501993 500637 498808 496318 493016 489320
61623 489320 485928 482892 479522 475549 471890 469721 468967 468301 466647 464175 461668 459322 456527 452721 448138
61608 448138 443621 439808 436601 433399 429689 425260 420029 414033 407675 401662 396450 391943 387902 384406
61594 384406 381595 379147 376397 373018 369319 365816 362720 359911 357282 355030 353594 353223 353571 353785 353142
61579 353142 351541 349365 347056 344954 343278 341945 340560 338865 337135 335876 335225 334883 334570 334225 333815
61564 333815 333341 332988 332981 333226 333425 333554 333899 334589 335412 336173 336878 337516 338065 338853 340417 342752 345082 346666
$$ packed form
61673D87715l76o5o22j585k216k091j403p97o93q84r02o94o52j020j501j503p33
61656D69978M21J109Q06j3l04K89R52Q19K04K74J518L094L791L295K375J995K376
61639D92979K824K493J303R9k67K30R28J197Q56R3p42j356j829k490l302l696
61623D89320l392l036l370l973l659k169p54o66j654k472k507k346k795l806m583
61608D48138m517l813l207l202l710m429n231n996o358o013n212m507m041l496
61594C84406k811k448k750l379l699l503l096k809k629k252j436l71L48K14o43
61579C53142j601k176k309k102j676j333j385j695j730j259o51l42l13l45m10
61564C33815m74l53pK45J99J29L45O90Q23P61P05O38N49P88J564K335K330J584
$$ plain form
61546 346666 347530 348165 348911 349978 351597 353589 355170 355852 356421 358258 361650 365418 368316 370165 371335
61531 371335 371876 371748 371480 371828 372870 373987 374778 375461 376213 376565 375757 373519 370306 366902 363940 361591
61515 361591 359482 357008 354048 351357 349962 350123 351073 351834 352069 352029 351988 351984 351926 351571 350592 349033 347681 347454
61497 347454 348258 348877 348310 346869 345581 344817 344101 343227 342889 343893 346103 348502 350160 350928 351263 351581 351776
61480 351776 351305 349879 348178 347621 349140 352214 355359 357569 359059 360608 362475 364202 365329 366041 366996
61465 366996 368542 370180 370922 370280 368866 367855 367863 368505 369058 369335 369720 370557 371752 372934 373804 374307 374667
61448 374667 375202 375912 376285 375835 374931 374771 376298 379282 382654 385503 387568 389021 390260 391841 394099 396707
61432 396707 398980 400749 402559 404821 407177 409089 410717 412720 415314 418016 420317 422148 423574 424496
$$ packed form
61546C46666Q64O35P46J067J619J992J581O82N69J837L392L768K898J849J170
61531C71335N41j28k68L48J042J117P91O83P52L52q08k238l213l404k962k349
61515C61591k109k474k960k691j395J61R50P61K35m0m1mn8l55r79j559j352k27
61497C47454Q04O19n67j441j288p64p16q74l38J004K210K399J658P68L35L18J95
61480C51776m71j426j701n57J519L074L145K210J490J549J867J727J127P12R55
61465C66996J546J638P42o42j414j011QO42N53K77L85Q37J195J182Q70N03L60
61448C74667N35P10L73m50r04j60J527K984L372K849K065J453J239J581K258K608
61432C96707K273J769J810K262K356J912J628K003K594K702K301J831J426R22
$$ plain form
61418 424496 424884 425036 425336 425947 426940 428448 430396 432258 433475 434067 434517 435037 435282 434865 433836 432490 430975
61401 430975 429353 427860 426773 426050 425365 424532 423660 422803 421681 419992 417910 416091 415066 414770 414707 414585
61385 414585 414642 415293 416505 417670 418192 418130 418155 418825 420035 421162 421713 421771 421904 422694 424262 426152 427722 428742
61367 428742 429565 430694 432247 433961 435577 437018 438254 439309 440533 442650 446265 451306 457040 462591
61353 462591 467419 471494 475256 479449 484775 491527 499523 508350 517602 526963 536244 545443 554614 563554
61339 563554 571701 578477 583689 587507 590157 591811 592748 593370 593902 594205 594015 593202 591721 589501 586628 583498
61323 583498 580442 577279 573634 569752 566603 564956 564686 565269 566529 568487 570769 572852 574924 577931 582572
61308 582572 588669 595727 603648 612553 622183 631944 641447 650682 659660 668173 675934 682692 688147 691943
$$ packed form
61418D24496L88J52L00O11R93J508J948J862J217N92M50N20K45m17j029j346j515
61401D30975j622j493j087p23o85q33q72q57j122j689k082j819j025k96o3j22
61385D14585N7O51J212J165N22o2K5O70J210J127N51N8J33P90J568J890J570J020
61367D28742Q23J129J553J714J616J441J236J055J224K117L615N041N734N551
61353D62591M828M075L762M193N326O752P996Q827R252R361R281R199R171Q940
61339E63554Q147O776N212L818K650J654R37O22N32L03j90q13j481k220k873l130
61323E83498l056l163l645l882l149j647k70N83J260J958K282K083K072L007M641
61308E82572O097P058P921Q905R630R761R503R235Q978Q513P761O758N455L796
$$ plain form
61294 691943 693914 694252 693270 690973 686957 680930 673325 665200 657321 649509 641219 632603 624584 617863 612337
61279 612337 607666 603906 601270 599641 598779 598754 599704 601339 603120 604886 607007 610007 614316 620180 627320
61264 627320 634797 641680 647921 654230 661201 668916 677237 685889 694272 701875 709047 716731 725126 733123
61250 733123 739466 744036 747575 750507 752521 753073 751843 748821 744410 739433 734690 730449 726535 722800
61236 722800 719251 715803 712270 708729 705684 703731 703068 703379 704211 705423 707168 709418 711820 714292 717485
61221 717485 722095 727776 733330 738105 742519 747009 751166 754438 757077 759657 762094 763935 765386 767230
61207 767230 769719 772249 774279 775938 777652 779759 782688 786925 792440 798568 804838 811677 820009 830388
61193 830388 842722 856620 871654 887297 902834 917468 930742 943031 955425 968686 982237
$$ packed form
61294F91943J971L38r82k297m016o027p605q125p879p812q290q616q019o721n526
61279F12337m671l760k636j629q62k5R50J635J781J766K121L000M309N864P140
61264F27320P477O883O241O309O971P715Q321Q652Q383P603P172P684Q395P997
61250G33123O343M570L539K932K014N52j230l022m411m977m743m241l914l735
61236G22800l549l448l533l541l045j953o63L11Q32J212J745K250K402K472L193
61221G17485M610N681N554M775M414M490M157L272K639K580K437J841J451J844
61207G67230K489K530K030J659J714K107K929M237N515O128O270O839Q332J0379
61193H30388J2334J3898J5034J5643J5537J4634J3274J2289J2394J3261J3551
$$ plain form
61182 982237 994487 1004247 1011550 1017107 1021370 1024293 1025582 1024908 1022133 1017665 1012369 1006900 1001175 994615
61168 994615 986720 977298 966417 954357 941495 928030 913886 898954 883284 867005 850325 833690
61156 833690 817690 802674 788725 776073 765145 756040 748340 741745 736472 732649 729702 726879 724120
61143 724120 721812 719866 717726 715310 713239 711835 710418 708044 704658 701123 698266 696237 694801 693965
61129 693965 694184 696083 700057 706080 713840 723024 733546 745576 759395 775160 792702 811620 831631
61116 831631 852827 875475 899638 925105 951741 979685 1008982 1038985 1068380 1096031 1121788
61105 1121788 1146214 1169459 1190721 1208995 1224078 1236432 1246256 1253210 1257044 1257904 1255795 1250220 1240721
61092 1240721 1227487 1211129 1192087 1170585 1146888 1121237 1093760 1064856 1035526 1006856 979227
$$ packed form
61182I82237J2250R760P303N557M263K923J289o74k775m468n296n469n725o560
61168I94615p895r422j0881j2060j2862j3465j4144j4932j5670j6279j6680j6635
61156H33690j6000j5016j3949j2652j0928r105p700o595n273l823k947k823k759
61143G24120k308j946k140k416k071j404j417k374l386l535k857k029j436q36
61129F93965K19J899L974O023P760R184J0522J2030J3819J5765J7542J8918K0011
61116H31631K1196K2648K4163K5467K6636K7944K9297L0003K9395K7651K5757
61105A121788K4426K3245K1262J8274J5083J2354R824O954L834Q60k109n575r499
61092A240721j3234j6358j9042k1502k3697k5651k7477k8904k9330k8670k7629
$$ plain form
61081 979227 952442 926565 902172 879643 858662 838703 819783 802494 787323 774108 762183
61070 762183 751067 740975 732547 726098 721346 717887 715528 713952 712530 711033 710354 711925 716303 722694
61056 722694 729817 736912 743973 751504 760179 770368 781892 794516 808577 824642 842565 861533
61044 861533 881210 902273 925475 950681 977224 1004858 1033934 1064804 1097461 1131601 1166739
61033 1166739 1202394 1238388 1274935 1312375 1351028 1391324 1433712 1478252 1524632 1572743 1622867
61022 1622867 1675168 1729583 1786593 1847521 1913582 1985038 2061925 2145245 2236812 2338409 2452059
61011 2452059 2581064 2729884 2902933 3104347 3339179 3614110 3936653 4314278 4754533
61002 4754533 5265237 5854067 6528605 7297426 8170607 9158179 10267312 11499138 12844216
$$ packed form
61081I79227k6785k5877k4393k2529k0981j9959j8920j7289j5171j3215j1925
61070G62183j1116j0092q428o449m752l459k359j576j422j497o79J571M378O391
61056G22694P123P095P061P531Q675J0189J1524J2624J4061J6065J7923J8968
61044H61533J9677K1063K3202K5206K6543K7634K9076L0870L2657L4140L5138
61033A166739L5655L5994L6547L7440L8653M0296M2388M4540M6380M8111N0124
61022A622867N2301N4415N7010O0928O6061P1456P6887Q3320R1567J01597J13650
61011B452059J29005J48820J73049K01414K34832K74931L22543L77625M40255
61002D754533N10704N88830O74538P68821Q73181R87572J109133J231826J345078
$$ plain form
60993 12844216 14276735 15752523 17217353 18624834 19953483 21210787 22420329 23598070
60985 23598070 24728762 25753563 26577405 27097751 27244307 27009202 26450441 25668283 24769844
60976 24769844 23838019 22910884 21972848 20962927 19804992 18450445 16908744 15246155
60968 15246155 13556845 11929276 10427084 9086410 7920771 6926773 6089765 5389662
60960 5389662 4805642 4318494 3911251 3569293 3280440 3034859 2824678 2643415 2485535
60951 2485535 2346453 2222818 2112531 2014243 1926762 1848698 1778345 1713764 1653331 1596480 1543619
60940 1543619 1494936 1449479 1405801 1363392 1322933 1285158 1249972 1216850 1185532 1155991 1128137
60929 1128137 1102009 1077955 1056141 1036049 1017001 999175 983589 971074 961589 954604 949609 946070
$$ packed form
60993A2844216J432519J475788J464830J407481J328649J257304J209542J177741
60985B3598070J130692J024801Q23842N20346J46556k35105n58761p82158q98439
60976B4769844r31825r27135r38036j009921j157935j354547j541701j662589
60968A5246155j689310j627569j502192j340674j165639r93998q37008p00103
60960E389662n84020m87148m07243l41958k88853k45581k10181j81263j57880
60951B485535j39082j23635j10287r8288q7481p8064p0353o4581o0433n6851n2861
60940A543619m8683m5457m3678m2409m0459l7775l5186l3122l1318k9541k7854
60929A128137k6128k4054k1814k0092j9048j7826j5586j2515r485o985m995l539
$$ plain form
60917 946070 943369 941221 939979 940327 942821 947774 955183 964406 974352 984468 995348 1007959 1022466
60904 1022466 1038320 1055311 1073740 1093493 1113640 1133315 1152471 1171418 1190077 1208150 1225648
60893 1225648 1242640 1258621 1272667 1284262 1293586 1300951 1306324 1309463 1310192 1308397 1304029 1297309 1288721
60880 1288721 1278620 1266857 1252957 1236639 1218173 1198232 1177430 1155963 1133752 1110890 1087831
60869 1087831 1065105 1043086 1022144 1002675 984601 967080 949221 931101 913621 897379 882140
60858 882140 867540 853723 840978 829159 817865 806923 796320 785925 775703 765974 756973 748245
60846 748245 738946 728771 718213 707881 697907 688073 678174 668142 658068 648223 638791 629540 620010
60833 620010 610085 600115 590402 580935 571771 563324 555976 549639 544084 539514 536371 534537 533076 530974
$$ packed form
60917I46070k701k148j242L48K494M953P409R223R946J0116J0880J2611J4507
60904A022466J5854J6991J8429J9753K0147J9675J9156J8947J8659J8073J7498
60893A225648J6992J5981J4046J1595R324P365N373L139P29j795m368o720q588
60880A288721j0101j1763j3900j6318j8466j9941k0802k1467k2211k2862k3059
60869A087831k2726k2019k0942j9469j8074j7521j7859j8120j7480j6242j5239
60858H82140j4600j3817j2745j1819j1294j0942j0603j0395j0222r729r001q728
60846G48245r299j0175j0558j0332r974r834r899j0032j0074r845r432r251r530
60833F20010r925r970r713r467r164q447p348o337n555m570l143j834j461k102
$$ plain form
60819 530974 528065 525106 522983 521963 521724 521951 522648 523744 524706 524961 524701 524895 526315 528791 531508 533778
60803 533778 535321 536139 536448 536637 536969 537368 537622 537683 537563 537127 536255 535059 533648 531792 529154 525837 522362
60786 522362 519129 516192 513486 510891 508029 504424 500078 495588 491541 487984 484629 481301 477964 474525
60772 474525 470908 467242 463811 460844 458376 456209 453970 451428 448844 446789 445513 444744 444247 444283 445193
60757 445193 446791 448541 450240 452152 454462 456915 459083 460799 462275 463965 466281 469248 472427 475263
60743 475263 477454 478820 479063 478122 476739 476051 476330 476491 475280 472690 469758 467123 464359 460838 456698
60728 456698 452601 448861 445259 441615 438077 434733 431318 427569 423663 420021 416764 413634 410443 407325
60714 407325 404481 401850 399196 396438 393801 391658 390274 389578 389187 388703 388026 387283 386496 385500 384248 382991
$$ packed form
60819E30974k909k959k123j020k39K27O97J096R62K55k60J94J420K476K717K270
60803E33778J543Q18L09J89L32L99K54O1j20m36q72j196j411j856k638l317l475
60786E22362l233k937k706k595k862l605m346m490m047l557l355l328l337l439
60772D74525l617l666l431k967k468k167k239k542k584k055j276p69m97L6R10
60757D45193J598J750J699J912K310K453K168J716J476J690K316K967L179K836
60743D75263K191J366K43r41j383o88K79J61j211k590k932k635k764l521m140
60728D56698m097l740l602l644l538l344l415l749l906l642l257l130l191l118
60714D07325k844k631k654k758k637k143j384o96l91m84o77p43p87r96j252j257
$$ plain form
60698 382991 382023 381403 381101 381264 382098 383514 385078 386390 387435 388561 390168 392339 394787 397258 399974
60683 399974 403436 407670 411988 415765 419223 423103 427657 432359 436588 440266 443771 447576 451987 456930
60669 456930 461836 466039 469419 472453 475548 478588 481180 482995 483771 483417 482412 481727 481879 482249 481724 479911
60653 479911 477416 475053 473205 471862 470785 469509 467517 464707 461586 458894 457097 456180 455708 455056 453791
60638 453791 451893 449513 446630 443160 439325 435582 432125 428782 425496 422550 420174 418277 416861 416357
60624 416357 417128 418734 420115 420556 420244 419837 419725 419790 419712 419392 419059 418983 419063 418874 418241 417578 417463 417953 418592
60605 418592 418942 418793 417961 416423 414802 414197 415128 416920 418530 419690 420825 422063 422995 423486 424086 425316
60589 425316 426969 428540 429989 431627 433433 435058 436417 437739 438902 439286 438659 437860 438144 439932 442549
$$ packed form
60698C82991r68o20l02J63Q34J416J564J312J045J126J607K171K448K471K716
60683C99974L462M234M318L777L458L880M554M702M229L678L505L805M411M943
60669D56930M906M203L380L034L095L040K592J815P76l54j005o85J52L70n25j813
60653D79911k495k363j848j343j077j276j992k810l121k692j797r17m72o52j265
60638D53791j898k380k883l470l835l743l457l343l286k946k376j897j416n04
60624D16357P71J606J381M41l12m07j12O5p8l20l33p6Q0j89o33o63j15M90O39
60605D18592L50j49q32j538j621o05R31J792J610J160J135J238R32M91O00J230
60589D25316J653J571J449J638J806J625J359J322J163L84o27p99K84J788K617
$$ plain form
60574 442549 445113 447337 449484 451951 455110 459323 464833 471578 479196 487225 495394 503789 512722 522275
60560 522275 531963 540951 548583 554630 559174 562538 565279 567833 570036 571325 571578 571412 571360 571091 569935
60545 569935 567990 566257 565747 566856 569605 573908 579464 585873 593124 601654 611665 622730 634298 646142
60531 646142 657885 668547 677264 684351 690951 697517 703192 706895 708442 708234 706319 702333 696299 689006
60517 689006 681542 674699 668762 663651 659214 655592 653220 652306 652460 653151 654519 657322 662013 668287 675736
60502 675736 684570 695334 708209 723091 740311 760746 785029 812876 843361 875612 909066 943257
60490 943257 977604 1011411 1043955 1074569 1102705 1127871 1149409 1166395 1177787 1182700 1180553 1171145
60478 1171145 1154684 1131730 1103063 1069627 1032500 992710 951047 908330 865896 825512 788491
$$ packed form
60574D42549K564K224K147K467L159M213N510O745P618Q029Q169Q395Q933R553
60560E22275R688Q988P632O047M544L364K741K554K203J289K53j66n2k69j156
60545E69935j945j733n10J109K749M303N556O409P251Q530J0011J1065J1568J1844
60531F46142J1743J0662Q717P087O600O566N675L703J547k08j915l986o034p293
60517F89006p464o843n937n111m437l622k372r14J54O91J368K803M691O274P449
60502F75736Q834J0764J2875J4882J7220K0435K4283K7847L0485L2251L3454L4191
60490I43257L4347L3807L2544L0614K8136K5166K1538J6986J1392M913k147r408
60478A171145j6461k2954k8667l3436l7127l9790m1663m2717m2434m0384l7021
$$ plain form
60467 788491 755044 724679 697018 672004 649584 629712 612583 598338 586417 575634 565105
60456 565105 554807 545191 536628 529389 523660 519135 514893 510088 504648 499026 493581 488572 484489 481724
60442 481724 479921 478195 476137 474186 472833 471883 470779 469327 467754 466280 465018 464221 464200 464836 465389 465007
60426 465007 463436 461203 459115 457623 456683 456083 455775 455847 456307 457038 457894 458722 459358 459694 459752 459666 459680 460168 461429
60407 461429 463269 465035 466398 467870 470150 473083 475800 477885 479793 481903 483809 485015 485892 487349
60393 487349 489727 492537 495211 497598 499729 501673 503765 506533 510025 513473 516011 517707 519612 522735
60379 522735 527050 531571 535294 537958 539965 541802 543779 546189 549292 552889 556239 558764 560768 563121
60365 563121 566253 569831 573434 577098 580960 584723 587912 590519 592978 595477 597698 599482 601440 604513
$$ packed form
60467G88491l3447l0365k7661k5014k2420j9872j7129j4245j1921j0783j0529
60456E65105j0298r616q563p239n729m525m242m805n440n622n445n009m083k765
60442D81724j803j726k058j951j353r50j104j452j573j474j262p97k1O36N53l82
60426D65007j571k233k088j492r40o00l08P2M60P31Q56Q28O36L36N8q6J4M88J261
60407D61429J840J766J363J472K280K933K717K085J908K110J906J206Q77J457
60393D87349K378K810K674K387K131J944K092K768L492L448K538J696J905L123
60379E22735M315M521L723K664K007J837J977K410L103L597L350K525K004K353
60365E63121L132L578L603L664L862L763L189K607K459K499K221J784J958L073
$$ plain form
60351 604513 608934 613968 618750 623227 628056 633740 640118 646672 653055 659174 664908 669951 674002 677021
60337 677021 679211 680670 681069 679848 676866 672697 668032 662877 656750 649726 642834 637077 632354 627788
60323 627788 622992 618557 615148 612512 609675 605991 601769 597876 594964 593228 592753 593755 596318 600105
60309 600105 604705 610197 617061 625486 635160 645860 657815 671213 685692 700699 716043 731594
60297 731594 746622 760023 771230 780421 787719 792638 794494 792984 788097 779753 767888 752848 735541
60284 735541 717184 698969 681857 666542 653477 642741 633812 625755 617900 610232 602969 596051 589468
60271 589468 583719 579285 575762 572260 568714 565937 564173 562460 559994 557292 555253 553633 551479 548777
60257 548777 546637 545781 545681 545435 544788 543962 543060 542083 541166 540348 539346 537901 536253 534937 534136 533507 532658
$$ packed form
60351F04513M421N034M782M477M829N684O378O554O383O119N734N043M051L019
60337F77021K190J459L99j221k982m169m665n155o127p024o892n757m723m566
60323F27788m796m435l409k636k837l684m222l893k912j736m75J002K563L787
60309F00105M600N492O864Q425R674J0700J1955J3398J4479J5007J5344J5551
60297G31594J5028J3401J1207R191P298M919J856j510m887q344j1865j5040j7307
60284G35541j8357j8215j7112j5315j3065j0736q929q057p855p668p263o918o583
60271E89468n749m434l523l502l546k777j764j713k466k702k039j620k154k702
60257E48777k140q56j00k46o47q26r02r77r17q18j002j445j648j316q01o29q49
$$ plain form
60240 532658 531665 531006 531055 531727 532693 533848 535380 537325 539348 541147 542853 544738 546694 548434 550089 552145
60224 552145 554789 557759 560938 564640 569051 573768 578242 582407 586652 591364 596785 603037 609927 616852
60210 616852 623297 629381 635659 642466 649785 657702 666483 675946 685049 692512 697897 701962 705945 710597
60196 710597 715849 721135 725785 729165 730844 730916 730076 729108 728231 727128 725494 723267 720336 716471 711767
60181 711767 706798 701933 696796 690821 684239 678019 672808 668325 663952 659564 655511 652049 649066 646298
60167 646298 643560 640780 637999 635367 633046 631111 629631 628821 628953 629946 631155 631772 631616 631383 631962 633575
60151 633575 635804 638367 641448 645125 648973 652636 656482 661096 666216 670870 674687 678528 683403 689258
60137 689258 695294 701245 707685 715066 722981 730668 737933 745233 752871 760387 766908 772024 776140 779851
$$ packed form
60240E32658r93o59M9O72R66J155J532J945K023J799J706J885J956J740J655K056
60224E52145K644K970L179L702M411M717M474M165M245M712N421O252O890O925
60210F16852O445O084O278O807P319P917Q781R463R103P463N385M065L983M652
60196G10597N252N286M650L380J679P2q40r68q77j103j634k227k931l865m704
60181G11767m969m865n137n975o582o220n211m483m373m388m053l462k983k768
60167F46298k738k780k781k632k321j935j480q10J32R93J209O17j56k33N79J613
60151F33575K229K563L081L677L848L663L846M614N120M654L817L841M875N855
60137F89258O036N951O440P381P915P687P265P300P638P516O521N116M116L711
$$ plain form
60123 779851 783116 785285 785918 785314 784116 782702 781230 780100 779951 781077 783021 784817 785630 785261 784207
60108 784207 783180 782448 781645 780341 778609 776804 774905 772463 769249 765616 762059 758659 755135 751251 747012
60093 747012 742629 738487 735018 732420 730554 729286 728825 729485 731183 733347 735366 736950 738063 738697 738870
60078 738870 738724 738424 737900 736795 734787 731906 728406 724274 719075 712466 704755 696710 688805 680920 672891
60063 672891 665065 658054 652044 646599 641131 635446 629800 624583 620021 616137 612898 610337 608483 607238
60049 607238 606512 606494 607584 609888 612955 616201 619532 623319 627762 632544 637200 641641 646148 650873 655569
60034 655569 659832 663464 666503 668942 670588 671202 670605 668601 665033 660081 654325 648259 641838 634817 627390
60019 627390 620091 613030 605674 597599 589126 581017 573814 567678 562525 557977 553436 548652 544133 540622
$$ packed form
60123G79851L265K169O33o04j198j414j472j130j49J126J944J796Q13l69j054
60108G84207j027p32q03j304j732j805j899k442l214l633l557l400l524l884m239
60093G47012m383m142l469k598j866j268m61O60J698K164K019J584J113O34J73
60078G38870j46l00n24j105k008k881l500m132n199o609p711q045p905p885q029
60063F72891p826p011o010n445n468n685n646n217m562l884l239k561j854j245
60049F07238p26j8J090K304L067L246L331L787M443M782M656M441M507M725M696
60034F55569M263L632L039K439J646O14n97k004l568m952n756o066o421p021p427
60019F27390p299p061p356q075q473q109p203o136n153m548m541m784m519l511
$$ plain form
60005 540622 538241 536442 534707 532939 531225 529663 528535 528314 529270 531217 533781 536738 539952 543100 545686
59990 545686 547417 548551 549750 551509 553810 556416 559330 562645 566036 568886 570994 572678 574027 574571
59976 574571 574047 572921 571663 570049 567801 565496 563997 563242 562412 561192 560005 559074 558173 557409 557352 558131
59960 558131 559212 560370 562055 564414 566786 568686 570545 572834 575140 576868 578308 580168 582379 584213
59946 584213 585393 586361 587477 588612 589565 590374 591148 591949 592787 593455 593526 592912 592164 591803 591585 590931 589845 588766
59928 588766 587700 586261 584544 583253 582759 582674 582630 582959 584289 586807 590178 593965 597940 602222 607197 613063
59912 613063 619409 625504 631071 636447 641878 646967 650972 653460 654644 655215 655835 656553 656792 656137 655000
59897 655000 654160 653851 653835 654195 655314 657045 658688 660106 662146 665522 669828 674245 678714 683767 689428
$$ packed form
60005E40622k381j799j735j768j714j562j128k21R56J947K564K957L214L148K586
59990E45686J731J134J199J759K301K606K914L315L391K850K108J684J349N44
59976E74571n24j126j258j614k248k305j499p55q30j220j187r31r01p64n7P79
59960E58131J081J158J685K359K372J900J859K289K306J728J440J860K211J834
59946E84213J180R68J116J135R53Q09P74Q01Q38O68P1o14p48l61k18o54j086j079
59928E88766j066j439j717j291m94q5m4L29J330K518L371L787L975M282M975N866
59912F13063O346O095N567N376N431N089M005K488J184N71O20P18K39o55j137
59897F55000q40l09j6L60J119J731J643J418K040L376M306M417M469N053N661
$$ plain form
59882 689428 694951 699619 703390 706769 710359 714392 718279 720769 721046 719723 718305 717638 717254 716239 714253
59867 714253 711444 707856 703413 698347 693166 688136 683126 678033 673114 668686 664728 661015 657599 654857
59853 654857 653098 652383 652800 654611 657940 662533 668035 674318 681303 688660 696012 703297 710648 718003 725236
59838 725236 732532 740217 748114 755490 761776 766969 771194 774171 775333 774266 770970 766005 760481 755504
59824 755504 751267 746882 741284 734176 725959 717130 708063 699130 690598 682450 674602 667236 660629 654740
59810 654740 649307 644346 640189 636944 634260 631830 629869 628692 627875 626238 622935 618409 614027 610729
59796 610729 608288 605877 603074 600168 597731 596211 595770 596162 596732 596823 596200 594955 593084 590478 587366 584448
59780 584448 582428 581460 581033 580275 578573 576191 574203 573470 573678 573743 573087 572123 571432 570983 570441 569917 570008 571190
$$ packed form
59882F89428N523M668L771L379L590M033L887K490K77j323j418o67l84j015j986
59867G14253k809l588m443n066n181n030n010n093m919m428l958l713l416k742
59853F54857j759p15M17J811L329M593N502O283O985P357P352P285P351P355P233
59838G25236P296P685P897P376O286N193M225K977J162j067l296m965n524m977
59824G55504m237m385n598p108q217q829r067q933q532q148p848p366o607n889
59810F54740n433m961m157l245k684k430j961j177q17j637l303m526m382l298
59796F10729k441k411k803k906k437j520m41L92N70R1o23j245j871k606l112k918
59780E84448k020r68m27p58j702k382j988p33K08O5o56r64o91m49n42n24R1J182
$$ plain form
59762 571190 573336 575832 578143 580332 582932 586225 589850 593394 597060 601320 606115 610999 615939 621299
59748 621299 627093 633001 639126 645866 652889 659123 664109 668513 672848 676673 679615 682242 685001 687107
59734 687107 687625 687112 687067 687953 688888 689108 688715 687990 687025 686189 685990 686195 685924 684906 683934 683709 683929 683965 683884
59715 683884 684276 685396 686884 688115 688595 688271 687627 687281 687342 687457 687518 687937 689067 690732 692533 694246 695764
59698 695764 697024 698289 700154 702976 706451 709962 713171 716082 718776 721269 723545 725572 727337 728844
59684 728844 729948 730236 729378 727595 725485 723301 720704 717278 713008 708199 703248 698530 694166 689768 684737
59669 684737 678920 672728 666566 660530 654729 649478 644967 641117 637942 635660 634248 633269 632454 632090 632522
59654 632522 633535 634613 635598 636819 638657 641213 644264 647326 649880 651673 652697 652878 652140 650779 649359
$$ packed form
59762E71190K146K496K311K189K600L293L625L544L666M260M795M884M940N360
59748F21299N794N908O125O740P023O234M986M404M335L825K942K627K759K106
59734F87107N18n13m5Q86R35K20l93p25r65q36j99K05k71j018r72k25K20L6q1
59715F83884L92J120J488J231M80l24o44l46O1J15O1M19J130J665J801J713J518
59698F95764J260J265J865K822L475L511L209K911K694K493K276K027J765J507
59684G28844J104K88q58j783k110k184k597l426m270m809m951m718m364m398n031
59669F84737n817o192o162o036n801n251m511l850l175k282j412r79q15l64M32
59654F32522J013J078R85J221J838K556L051L062K554J793J024J81p38j361j420
$$ plain form
59639 649359 648004 646208 643619 640612 637700 634729 631205 627203 623464 620594 618553 616938 615461 614105
59625 614105 612959 611927 610566 608426 605637 602890 600660 598787 596993 595427 594262 593170 591766 590350
59611 590350 589585 589443 589138 588237 587365 587526 589029 591282 593420 594959 596010 597024 598298 599686 600829 601565
59595 601565 601914 601756 600871 599403 598081 597716 598459 599575 599982 599076 597139 594915 592818 590695 588324 585840
59579 585840 583507 581346 579276 577404 575865 574547 573243 571921 570519 568707 566303 563773 561736 560032
59565 560032 557931 555439 553676 553561 554649 555848 556956 558761 561682 564934 567307 568337 568438 568238 568217
59550 568217 568893 570838 574203 578447 582825 587131 591809 597369 603935 611381 619609 628511 637855 647429
59536 647429 657165 666928 676333 685017 693053 700858 708697 716551 724323 731770 738111 742158 743265 742054
$$ packed form
59639F49359j355j796k589l007k912k971l524m002l739k870k041j615j477j356
59625F14105j146j032j361k140k789k747k230j873j794j566j165j092j404j416
59611E90350p65j42l05r01q72J61J503K253K138J539J051J014J274J388J143P36
59595F01565L49j58q85j468j322l65P43J116M07r06j937k224k097k123k371k484
59579E85840k333k161k070j872j539j318j304j322j402j812k404k530k037j704
59565E60032k101k492j763j15J088J199J108J805K921L252K373J030J01k00k1
59550E68217O76J945L365M244M378M306M678N560O566P446Q228Q902R344R574
59536F47429R736R763R405Q684Q036P805P839P854P772P447O341M047J107j211
$$ plain form
59522 742054 739967 738140 736933 736327 736323 736765 737082 736566 734875 732145 728654 724563 719880 714447 707958 700228
59506 700228 691508 682316 672918 663258 653525 644345 636086 628379 620841 614021 608980 605922 603905 602048
59492 602048 600400 599338 598757 598370 598401 599405 601567 604596 608202 612281 616681 621139 625448 629543 633599
59477 633599 638187 644018 651176 658848 666198 673261 680566 688071 695098 701196 706515 711267 715401 718956
59463 718956 722231 725400 728307 730881 733464 736575 740632 745982 752802 760762 769182 777813 787165 797731
59449 797731 809142 820452 831083 841078 850383 858307 863934 866914 867674 866841 864592 860636 854720 846945
59435 846945 837525 826506 813971 800429 786754 773756 762019 752174 745007 741072 740175 741340 743436
59422 743436 746106 750162 756805 766304 777660 789785 802705 817242 833847 852257 872009 892457
$$ packed form
59522G42054k087j827j207o06mM42L17n16j691k730l491m091m683n433o489p730
59506G00228q720r192r398r660r733r180q259p707p538o820n041l058k017j857
59492F02048j648j062n81l87L1J004K162L029L606M079M400M458M309M095M056
59477F33599M588N831P158P672P350P063P305P505P027O098N319M752M134L555
59463G18956L275L169K907K574K583L111M057N350O820P960Q420Q631R352J0566
59449G97731J1411J1310J0631R995R305P924N627K980P60q33k249l956n916p775
59435H46945r420j1019j2535j3542j3675j2998j1737r845p167l935q97J165K096
59422G43436K670M056O643R499J1356J2125J2920J4537J6605J8410J9752K0448
$$ plain form
59410 892457 912236 929559 943461 954392 963317 970674 976346 980022 981170 979071 973430 964796 954096
59397 954096 942024 929144 916123 903391 890896 878707 867580 858195 849752 839871 826218 808223
59385 808223 787377 766170 746643 729550 714686 701942 691793 684586 679828 676628 674630 673969 674466
59372 674466 675604 677353 680343 684886 690355 695883 701294 706918 712803 718659 724458 730595 737329 744435
59358 744435 751552 758719 766398 775095 785065 796328 808794 822376 837038 852786 869565 887062
59346 887062 904669 921740 937954 953376 968174 982329 995594 1007553 1017572 1024905 1029130 1030541
59334 1030541 1029870 1027518 1023122 1016042 1006192 994277 981141 967060 951834 935504 918630 901710
59322 901710 884687 867426 850502 834987 821385 809331 798467 789071 781475 775408 770443 766656
$$ packed form
59410H92457J9779J7323J3902J0931Q925P357N672L676J148k099n641q634j0700
59397I54096j2072j2880j3021j2732j2495j2189j1127r385q443r881j3653j7995
59385H08223k0846k1207j9527j7093j4864j2744j0149p207m758l200j998o61M97
59372F74466J138J749K990M543N469N528N411N624N885N856N799O137O734P106
59358G44435P117P167P679Q697R970J1263J2466J3582J4662J5748J6779J7497
59346H87062J7607J7071J6214J5422J4798J4155J3265J1959J0019P333M225J411
59334A030541o71k352m396p080r850j1915j3136j4081j5226j6330j6874j6920
59322I01710j7023j7261j6924j5515j3602j2054j0864r396p596o067m965l787
$$ plain form
59310 766656 764190 762408 760274 757583 755114 753544 752907 753246 754999 758261 762244 766005 769447 773217 777956
59295 777956 783945 791084 798734 805875 811875 816840 820829 823221 823583 822765 822112 821589 819631 815048 808178
59280 808178 799904 790577 780737 772095 766647 764968 766156 769313 774207 780487 787316 794252 801891 810991
59266 810991 821285 831594 840864 848626 854650 858701 860738 860975 859528 856204 850793 843483 834848 825439
59252 825439 815488 805065 794459 784229 774763 765961 757620 750057 743971 739614 736534 734405 733656 734815
59238 734815 737469 740523 743496 747012 751788 757606 763542 768868 773376 777082 780026 782368 784278 785620
59224 785620 785901 784619 781607 777036 771233 764606 757651 750892 744628 738765 733065 727684 723337 720694
59210 720694 719619 719191 718557 717532 716383 715320 714361 713492 712704 711939 711160 710378 709557 708579 707431 706176 704632
$$ packed form
59310G66656k466j782k134k691k469j570o37L39J753L262L983L761L442L770M739
59295G77956N989P139P650P141O000M965L989K392L62q18o53n23j958m583o870
59280H08178q274r327r840q642n448j679J188L157M894O280O829O936P639R100
59266H10991J0294J0309R270P762O024M051K037K37j447l324n411p310q635r409
59252H25439r951j0423j0606j0230r466q802q341p563o086m357l080k129p49J159
59238G34815K654L054K973L516M776N818N936N326M508L706K944K342J910J342
59224G85620K81j282l012m571n803o627o955o759o264n863n700n381m347k643
59210G20694j075m28o34j025j149j063r59q69p88p65p79p82q21r78j148j255j544
$$ plain form
59193 704632 702358 699281 696135 693844 692532 691541 690449 689638 689713 690731 692276 694047 695992 698056 700138
59178 700138 702334 704960 708221 712019 716168 720686 725715 731186 736781 742325 748165 754956 763025 772047
59164 772047 781460 791035 800852 810708 819854 827490 833462 838311 842610 846314 848817 849546 848398 845506
59150 845506 840773 833963 825297 815626 805707 795520 784628 773092 761613 750724 740290 729982
59138 729982 719904 710495 702012 694340 687159 680140 673222 666886 661906 658580 656432 654959 654398 655343
59124 655343 657815 661248 665288 670061 675659 681910 688830 696723 705552 714684 723677 732974 743336 754765
59110 754765 766378 777253 787107 796179 804763 812878 820269 826784 832732 838607 844346 849285 853033 855869
59096 855869 857945 858677 857668 855806 854498 853958 853148 851410 849064 846217 842168 836707 830999 826229 821982
$$ packed form
59193G04632k274l077l146k291j312r91j092q11P5J018J545J771J945K064K082
59178G00138K196K626L261L798M149M518N029N471N595N544N840O791Q069R022
59164G72047R413R575R817R856R146P636N972M849M299L704K503P29j148k892
59150H45506m733o810q666r671r919j0187j0892j1536j1479j0889j0434j0308
59138G29982j0078r409q483p672p181p019o918o336m980l326k148j473n61R45
59124F55343K472L433M040M773N598O251O920P893Q829R132Q993R297J0362J1429
59110G54765J1613J0875R854R072Q584Q115P391O515N948N875N739M939L748K836
59096H55869K076P32j009j862j308n40q10j738k346k847m049n461n708m770m247
$$ plain form
59081 821982 817009 811138 805285 799677 793242 785068 775583 765832 756280 746868 737812 729692 722814 716841
59067 716841 711127 705304 699593 694557 690408 686668 682764 678856 675602 673081 670498 667257 663845 661212
59053 661212 659558 658201 656495 654444 652438 650798 649619 648808 648171 647642 647401 647571 647831 647635 646850 645940
59037 645940 645469 645618 646316 647569 649439 651874 654838 658548 663275 668937 675171 681985 689972 699547 710128
59022 710128 720504 730113 739580 749839 760981 772216 782691 791980 799941 806580 812159 817122 821668
59009 821668 825511 828118 829163 828797 827669 826631 826164 826102 826144 826616 828365 831827 836571 841928 847645 853604
58993 853604 859251 863900 867520 870723 873832 876335 877532 877460 876857 876256 875391 873565 870487 866594 862660
58978 862660 859245 856548 854585 853362 852935 853505 855463 859155 864563 871321 879138 888089 898358 909674
$$ packed form
59081H21982m973n871n853n608o435q174r485r751r552r412r056q120o878n973
59067G16841n714n823n711n036m149l740l904l908l254k521k583l241l412k633
59053F61212j654j357j706k051k006j640j179q11o37n29k41J70K60j96p85r10
59037F45940m71J49O98J253J870K435K964L710M727N662O234O814P987R575J0581
59022G10128J0376R609R467J0259J1142J1235J0475R289P961O639N579M963M546
59009H21668L843K607J045l66j128j038m67o2M2M72J749L462M744N357N717N959
58993H53604N647M649L620L203L109K503J197p2o03o01q65j826l078l893l934
58978H62660l415k697j963j223m27N70J958L692N408O758P817Q951J0269J1316
$$ plain form
58964 909674 921153 931835 941449 950536 959655 968447 975679 980267 982063 981577 979202 974977 968846 960795
58950 960795 950817 939046 925908 911844 896929 881124 864769 848496 832664 817388 803147 790865
58938 790865 781124 773633 767665 762635 758093 753618 749107 744909 741306 738042 734693 731332 728483 726462
58924 726462 725008 723531 721593 719208 716838 715002 713795 712898 712087 711523 711553 712457 714473 717652 721587 725649
58908 725649 729754 734611 740979 748980 758365 769020 780870 793609 806937 820898 835676 851325
58896 851325 867944 885715 904432 923407 942365 962045 983344 1006071 1029101 1051483 1072829
58885 1072829 1092979 1112139 1131176 1150862 1170585 1188470 1202934 1213540 1220314 1223098 1221893 1217185
58873 1217185 1209398 1198457 1184271 1167320 1148402 1128066 1106580 1084199 1061243 1038163 1015725
$$ packed form
58964I09674J1479J0682R614R087R119Q792P232M588J796m86k375m225o131q051
58950I60795r978j1771j3138j4064j4915j5805j6355j6273j5832j5276j4241j2282
58938G90865r741p491n968n030m542m475m511m198l603l264l349l361k849k021
58924G26462j454j477j938k385k370j836j207q97q11n64L0R04K016L179L935M062
58908G25649M105M857O368Q001R385J0655J1850J2739J3328J3961J4778J5649
58896H51325J6619J7771J8717J8975J8958J9680K1299K2727K3030K2382K1346
58885A072829K0150J9160J9037J9686J9723J7885J4464J0606O774K784j205m708
58873A217185p787j0941j4186j6951j8918k0336k1486k2381k2956k3080k2438
$$ plain form
58862 1015725 994826 975931 958872 943267 928727 914637 900357 886015 872610 860833 850056
58851 850056 838926 826767 814039 801678 790409 780532 771866 763842 755982 748314 741119 734380 727799
58838 727799 721300 715110 709281 703449 697272 690920 684879 679357 674135 669129 664908 662336 661551 661605 661337
58823 661337 660463 659545 659114 659297 660212 662056 664615 667203 669451 671772 674662 677846 680573 682582 684356
58808 684356 686507 689222 692217 694845 696315 696203 694874 693144 691469 689740 687871 686198 685027 684021
58794 684021 682416 679923 677131 674869 673320 672026 670690 669585 669034 668884 668939 669688 672018 676119 681177
58779 681177 686329 691548 697271 703458 709372 714107 717116 718429 718674 718706 718841 718510 716900 713843 709768
58764 709768 704909 699054 692239 685280 679282 674720 671292 668584 666568 665362 664810 664598 664674 665291 666632
$$ packed form
58862A015725k0899j8895j7059j5605j4540j4090j4280j4342j3405j1777j0777
58851H50056j1130j2159j2728j2361j1269r877q666q024p860p668p195o739o581
58838G27799o499o190n829n832o177o352o041n522n222n006m221k572p85N4k68
58823F61337q74r18m31J83R15J844K559K588K248K321K890L184K727K009J774
58808F84356K151K715K995K628J470j12j329j730j675j729j869j673j171j006
58794F84021j605k493k792k262j549j294j336j105n51j50N5P49K330M101N058
58779F81177N152N219N723O187N914M735L009J313K45L2J35l31j610l057m075
58764G09768m859n855o815o959n998m562l428k708k016j206n52k12P6O17J341
$$ plain form
58749 666632 668736 671775 675978 681061 686204 690909 695521 700460 705453 710195 715416 722275 730686 739285
58735 739285 747286 755433 764575 774162 782971 790729 798137 805608 812810 819371 825273 830561 835235 839547
58721 839547 843934 848554 853219 857722 861933 865730 869307 873380 878441 883808 888026 890388 891495 892117
58707 892117 892082 890667 887667 883541 878621 872542 864467 853659 839907 823641 805715 787048 768405
58694 768405 750359 733262 717198 702065 687744 674139 661177 648954 637817 628105 619825 612705
58682 612705 606464 600853 595609 590742 586764 584201 582813 581721 580428 579367 579347 580812 583838 588453 594613
58667 594613 602086 610635 620085 630024 639742 648846 657665 666629 675382 682929 688644 692705 695519 697068
58653 697068 696926 694661 690163 683874 676697 669335 661658 653086 643728 634746 627358 621865 617884 615089
$$ packed form
58749F66632K104L039M203N083N143M705M612M939M993M742N221O859Q411Q599
58735G39285Q001Q147R142R587Q809P758P408P471P202O561N902N288M674M312
58721H39547M387M620M665M503M211L797L577M073N061N367M218K362J107O22
58707H92117l5j415l000m126m920o079q075j0808j3752j6266j7926j8667j8643
58694G68405j8046j7097j6064j5133j4321j3605j2962j2223j1137r712q280p120
58682F12705o241n611n244m867l978k563j388j092j293j061k0J465L026M615O160
58667E94613P473Q549R450R939R718R104Q819Q964Q753P547N715M061K814J549
58653F97068j42k265m498o289p177p362p677q572r358q982p388n493l981k795
$$ plain form
58639 615089 613268 612050 611261 611330 612670 614659 615972 616123 616033 616819 618613 620942 623668 626924 630469 633747
58623 633747 636450 638562 640019 640859 641641 643115 645430 648109 650900 654247 658754 664493 670952 677441 683502
58608 683502 689159 694781 700514 705868 710088 712769 713882 713441 711584 708849 705836 702616 698938 695007
58594 695007 691587 689307 688285 688373 689308 690742 692670 695710 700280 705720 711123 716951 724700 734758 745744
58579 745744 756456 767295 779080 791449 803428 814781 825874 836850 847924 859899 873357
58568 873357 887756 902383 917789 935141 954433 974564 995065 1016500 1039008 1061657 1083578
58557 1083578 1104740 1125171 1144259 1161359 1176436 1189568 1200262 1207674 1211191 1210606 1206121 1198424
58545 1198424 1188391 1176571 1163239 1148853 1133890 1118206 1101253 1083055 1064311 1045300 1025454
$$ packed form
58639F15089j821j218p89O9J340J989J313J51r0P86J794K329K726L256L545L278
58623F33747K703K112J457Q40P82J474K315K679K791L347M507N739O459O489O061
58608F83502N657N622N733N354M220K681J113m41j857k735l013l220l678l931
58594F95007l420k280j022Q8R35J434J928L040M570N440N403N828P749J0058J0986
58579G45744J0712J0839J1785J2369J1979J1353J1093J0976J1074J1975J3458
58568H73357J4399J4627J5406J7352J9292K0131K0501K1435K2508K2649K1921
58557A083578K1162K0431J9088J7100J5077J3132J0694P412L517n85m485p697
58545A198424j0033j1820j3332j4386j4963j5684j6953j8198j8744j9011j9846
$$ plain form
58534 1025454 1004389 982763 961615 941394 922163 904271 888163 873749 860568 848507 838000
58523 838000 829486 822973 818101 814461 811846 810260 809618 809510 809477 809428 809452 809261 808346 806704 804911 803263 801344
58506 801344 798701 795483 792157 788996 786158 783826 781885 779846 777537 775515 774355 773810 773242 772630 772634 773665
58490 773665 775383 777199 778941 780954 783813 788017 793767 800984 809560 819461 830505 842253 854376
58477 854376 866934 880007 893203 905888 917832 929188 939778 948799 955443 959547 961333 960748 957515
58464 957515 951855 944816 937573 930609 923854 917528 912476 909566 909035 910538 913594 917730 922469 927446
58450 927446 932502 937462 941935 945534 948155 949880 950647 950153 947997 943854 937731 930185 922080 914050 906439
58435 906439 899747 894588 891019 888534 887114 887604 890518 895110 900381 906453 913988 922689 931486 939971
$$ packed form
58534A025454k1065k1626k1148k0221j9231j7892j6108j4414j3181j2061j0507
58523H38000q514o513m872l640k615j586o42j08l3m9K4j91r15j642j793j648j919
58506H01344k643l218l326l161k838k332j941k039k309k022j160n45n68o12MJ031
58490G73665J718J816J742K013K859M204N750P217Q576R901J1044J1748J2123
58477H54376J2558J3073J3196J2685J1944J1356J0590R021O644M104J786n85l233
58464I57515n660p039p243o964o755o326n052k910n31J503L056M136M739M977
58450I27446N056M960M473L599K621J725P67m94k156m143o123p546q105q030p611
58435I06439o692n159l569k485j420M90K914M592N271O072P535Q701Q797Q485
$$ plain form
58421 939971 948493 956843 964020 969558 974022 977829 980436 981114 979710 976278 970712 963214 954498 945116
58407 945116 935093 924561 914158 904540 896074 889170 884152 880484 876986 873234 870004 867977 866917
58394 866917 866604 867562 869964 872652 874268 874867 875516 876742 878270 879900 881616 883046 883696 883673 883435 882924
58378 882924 881685 879777 877922 876736 876435 877245 879515 883387 888814 895881 904615 914517 924842 935428
58364 935428 946830 959545 973429 987952 1002640 1017175 1031272 1044657 1057198 1069110 1080866
58353 1080866 1092540 1103246 1111817 1118221 1123801 1129712 1135614 1140440 1144017 1147315 1151227 1155743 1160387
58340 1160387 1165092 1170526 1177611 1186670 1197097 1208075 1219578 1232173 1245922 1260135 1274322 1288637
58328 1288637 1303064 1316930 1329706 1341610 1352945 1363501 1373168 1382422 1391477 1399540 1405662 1409943
$$ packed form
58421I39971Q522Q350P177N538M464L807K607O78j404l432n566p498q716r382
58407I45116j0023j0532j0403r618q466o904n018l668l498l752l230k027j060
58394H66917l13R58K402K688J616N99O49J226J528J630J716J430O50k3k38n11
58378H82924j239j908j855j186l01Q10K270L872N427P067Q734R902J0325J0586
58364I35428J1402J2715J3884J4523J4688J4535J4097J3385J2541J1912J1756
58353A080866J1674J0706Q571O404N580N911N902M826L577L298L912M516M644
58340A160387M705N434P085R059J0427J0978J1503J2595J3749J4213J4187J4315
58328A288637J4427J3866J2776J1904J1335J0556R667R254R055Q063O122M281
$$ plain form
58316 1409943 1413244 1416212 1419249 1422956 1427807 1433750 1440747 1449188 1459090 1469489 1479598 1490115 1502406
58303 1502406 1516693 1532019 1547740 1564035 1581036 1598419 1615937 1633618 1651428 1669395 1688038
58292 1688038 1707981 1729154 1750815 1772257 1793124 1813472 1834112 1856442 1881181 1907595 1934668
58281 1934668 1962550 1992011 2022939 2054462 2086367 2119379 2154192 2191084 2230361 2272213 2316186
58270 2316186 2361612 2408511 2457350 2508153 2560637 2614967 2671523 2730108 2790233 2851905 2915357
58259 2915357 2980385 3046886 3115523 3186746 3259534 3332465 3405763 3481025 3559093 3639606 3722602
58248 3722602 3809109 3899954 3995256 4095372 4201194 4313322 4431924 4557584 4691210 4833041
58238 4833041 4982843 5141249 5309844 5489781 5681387 5885285 6102886 6335598 6584638
$$ packed form
58316A409943L301K968L037L707M851N943O997Q441R902J0399J0109J0517J2291
58303A502406J4287J5326J5721J6295J7001J7383J7518J7681J7810J7967J8643
58292A688038J9943K1173K1661K1442K0867K0348K0640K2330K4739K6414K7073
58281A934668K7882K9461L0928L1523L1905L3012L4813L6892L9277M1852M3973
58270B316186M5426M6899M8839N0803N2484N4330N6556N8585O0125O1672O3452
58259B915357O5028O6501O8637P1223P2788P2931P3298P5262P8068Q0513Q2996
58248C722602Q6507R0845R5302J00116J05822J12128J18602J25660J33626J41831
58238D833041J49802J58406J68595J79937J91606K03898K17601K32712K49040
$$ plain form
58229 6584638 6851854 7139783 7450615 7785879 8147265 8537129 8958390 9414788 9911106
58220 9911106 10452367 11043180 11688766 12396303 13174576 14033310 14984299 16042869 17227513
58211 17227513 18559661 20066192 21782292 23751393 26024712 28664126 31745216 35354953
58203 35354953 39586586 44539536 50324673 57066665 64897402 73942979 84311916 96092606
58195 96092606 109362031 124194433 140650539 158737933 178347095 199168222 220604897
58188 220604897 241748411 261505908 278894090 293349567 304839964 313685065 320193723
58181 320193723 324312085 325449328 322589259 314705337 301317819 282870887 260679239
58174 260679239 236500019 212035388 188625742 167161930 148103016 131522722 117187877
$$ packed form
58229F584638K67216K87929L10832L35264L61386L89864M21261M56398M96318
58220I911106N41261N90813O45586P07537P78273Q58734R50989J058570J184644
58211A7227513J332148J506531J716100J969101K273319K639414L081090L609737
58203C5354953M231633M952950N785137O741992P830737R045577J0368937J1780690
58195I6092606J3269425J4832402J6456106J8087394J9609162K0821127K1436675
58188B20604897K1143514J9757497J7388182J4455477J1490397Q845101O508658
58181C20193723M118362J137243k860069p883922j3387518j8446932k2191648
58174B60679239k4179220k4464631k3409646k1463812j9058914j6580294j4334845
$$ plain form
58167 117187877 104682818 93558801 83464905 74215818 65773015 58164026 51404906
58160 51404906 45472980 40318233 35875394 32065747 28802824 26004453 23598379 21519386
58152 21519386 19709088 18120679 16719252 15476003 14365155 13366090 12463705 11644972
58144 11644972 10897687 10212577 9583230 9003076 8465148 7965212 7502343 7075612 6682360
58135 6682360 6319984 5986827 5680570 5397831 5136099 4894251 4670678 4462610 4267716
58126 4267716 4084761 3912346 3748588 3592493 3444245 3303924 3171229 3046510 2930510
58117 2930510 2822896 2722448 2628718 2541969 2461388 2385029 2311880 2242489 2177206 2115222 2055771
58106 2055771 1998936 1944797 1892920 1843109 1795637 1750462 1707218 1666177 1628063 1592722 1559084
$$ packed form
58167A17187877j2505059j1124017j0093896r249087q442803p608989o759120
58160E1404906n931926n154747m442839l809647l262923k798371k406074k078993
58152B1519386j810298j588409j401427j243249j110848r99065r02385q18733
58144A1644972p47285o85110o29347n80154n37928m99936m62869m26731l93252
58135F682360l62376l33157l06257k82739k61732k41848k23573k08068j94894
58126D267716j82955j72415j63758j56095j48248j40321j32695j24719j16000
58117B930510j07614j00448r3730q6749q0581p6359p3149o9391o5283o1984n9451
58106B055771n6835n4139n1877m9811m7472m5175m3244m1041l8114l5341l3638
$$ plain form
58095 1559084 1526683 1496000 1467101 1439162 1411804 1385723 1361499 1338759 1316950 1295974 1275561
58084 1275561 1254966 1233833 1212639 1191885 1171545 1151622 1132405 1113764 1094924 1075425 1055722
58073 1055722 1036494 1017833 999349 980629 961583 942886 925927 911514 898682 885663 872098
58062 872098 859277 848182 838363 828992 819879 810912 801531 791440 781183 771433 762284 753582 745325
58049 745325 737348 729269 721113 713404 706340 699517 692732 686347 680572 675123 669903 665203 660818 655854
58035 655854 649894 643561 637284 630334 621866 612306 602874 594192 586085 578277 570472 562113 552947 543737
58021 543737 535659 528964 522766 516150 509061 502144 496160 491619 488644 487016 486329 485987 485128 483058 479990
58006 479990 477019 475060 474061 473529 473420 474055 475410 476957 478176 478879 478997 478361 476869 474865 473243 472934
$$ packed form
58095A559084l2401l0683k8899k7939k7358k6081k4224k2740k1809k0976k0413
58084A275561k0595k1133k1194k0754k0340j9923j9217j8641j8840j9499j9703
58073A055722j9228j8661j8484j8720j9046j8697j6959j4413j2832j3019j3565
58062H72098j2821j1095r819r371r113q967r381j0091j0257r750r149q702q257
58049G45325p977q079q156p709p064o823o785o385n775n449n220m700m385m964
58035F55854n960o333o277o950q468r560r432q682q107p808p805q359r166r210
58021E43737q078o695o198o616p089o917n984m541k975j628o87l42q59k070l068
58006D79990k971j959r99n32j09O35J355J547J219P03J18o36j492k004j622l09
$$ plain form
57990 472934 474042 475668 476885 477706 478591 479248 478668 476442 473278 469907 466197 461789 456955 452227 447585
57975 447585 442730 437934 434030 431555 430274 429484 428517 427076 425401 424059 423377 423122 422849 422364 421699 420929
57959 420929 420220 419839 419889 420199 420593 421033 421379 421401 421214 421329 421996 422875 423675 424758 426741 429753 433514 437885
57941 437885 442909 448449 454284 460538 467653 475898 485143 495087 505466 516071 526743 537349 547661
57928 547661 557363 566267 574360 581544 587542 592150 595320 596827 596174 593107 588002 581450 573644 564472
57914 564472 554014 542674 530954 519423 508739 499324 490971 483022 474953 466724 458660 451202 444728
57901 444728 439394 435102 431659 428811 426164 423300 420208 417430 415584 414791 414669 414762 414891 415239 416204 418050
57885 418050 420639 423623 426823 430185 433446 436278 438784 441356 443873 445564 445933 445385 444597 443663 442324
$$ packed form
57990D72934J108J626J217Q21Q85O57n80k226l164l371l710m408m834m728m642
57975D47585m855m796l904k475j281p90r67j441j675j342o82k55k73m85o65p70
57959D20929p09l81N0L10L94M40L46K2j87J15O67Q79Q00J083J983L012L761M371
57941D37885N024N540N835O254P115Q245R245R944J0379J0605J0672J0606J0312
57928E47661R702Q904Q093P184N998M608L170J507o53l067n105o552p806r172
57914E64472j0458j1340j1720j1531j0684r415q353p949q069q229q064p458o474
57901D44728n334m292l443k848k647k864l092k778j846p93j22R3J29L48R65J846
57885D18050K589K984L200L362L261K832K506K572K517J691L69n48p88r34j339
$$ plain form
57870 442324 440629 438871 437033 434771 431855 428344 424524 420933 418163 416227 414354 411862 409059 406893
57856 406893 405913 406067 407311 409761 413183 416897 420393 423696 426949 429964 432325 433761 434313 434225 433633 432274
57840 432274 429612 425524 420698 416100 412127 408542 405043 401502 397758 393683 389529 385860 383025 380964
57826 380964 379546 378797 378773 379486 380985 383218 385776 388160 390357 392834 395850 399109 402212 405045 407510
57811 407510 409271 410118 410309 410135 409335 407445 404705 402099 400299 398921 397106 394542 391498 388041 383793
57796 383793 378700 373624 369776 367645 366768 366387 366080 365748 365404 365105 364934 365000 365478 366484 367734 368639 369137
57779 369137 370232 373042 377351 381798 385619 389422 393940 398785 403053 406587 409885 413119 416010 418458
57765 418458 420497 421659 421076 418443 414441 410120 406199 402884 399847 396374 392035 387384 383546 381014
$$ packed form
57870D42324j695j758j838k262k916l511l820l591k770j936j873k492k803k166
57856D06893r80J54J244K450L422L714L496L303L253L015K361J436N52q8n92j359
57840D32274k662m088m826m598l973l585l499l541l744m075m154l669k835k061
57826C80964j418p49k4P13J499K233K558K384K197K477L016L259L103K833K465
57811D07510J761Q47J91j74q00j890k740k606j800j378j815k564l044l457m248
57796C83793n093n076l848k131q77l81l07l32l44k99j71O6M78J006J250R05M98
57779C69137J095K810M309M447L821L803M518M845M268L534L298L234K891K448
57765D18458K039J162n83k633m002m321l921l315l037l473m339m651l838k532
$$ plain form
57751 381014 379246 377567 375958 374724 373835 373027 372252 371571 370766 369489 367845 366417 365488 364502 362649 359978
57735 359978 357515 356079 355240 353843 351455 348771 346602 345046 343842 342976 342426 341732 340389 338494 336553
57720 336553 334818 333264 332011 331250 330802 330214 329321 328313 327324 326340 325461 324867 324549 324422 324578 325021 325308
57703 325308 324969 324213 323701 323684 323942 324536 325869 327881 329857 331299 332426 333556 334527 335071 335194 334850 333718
57686 333718 331816 329994 329292 329951 331473 333544 336537 341174 347964 357008 368302 382296 400029 422335
57672 422335 448908 478572 510621 545234 582221 619811 655358 686981 714040 736271 753232
57661 753232 764707 770874 771460 764930 749084 722775 687134 645175 600401 555783 513578 475345
57649 475345 441703 412348 386753 364814 346613 331818 319815 310284 303099 297680 293037 288631
$$ packed form
57751C81014j768j679j609j234q89q08p75o81q05j277j644j428r29r86j853k671
57735C59978k463j436q39j397k388k684k169j556j204q66n50o94j343j895j941
57720C36553j735j554j253p61m48n88q93j008r89r84q79n94l18j27J56M43K87
57703C25308l39p56n12j7K58N94J333K012J976J442J127J130R71N44J23l44j132
57686C33718j902j822p02O59J522K071K993M637O790R044J1294J3994J7733K2306
57672D22335K6573K9664L2049L4613L6987L7590L5547L1623K7059K2231J6961
57661G53232J1475O167N86o530j5846k6309l5641m1959m4774m4618m2205l8233
57649D75345l3642k9355k5595k1939j8201j4795j2003r531p185n419m643m406
$$ plain form
57637 288631 284707 281563 278949 276411 273870 271591 269831 268622 267614 266153 263988 261895 260963 261167 261356
57622 261356 260865 260280 260086 259477 257365 254017 250732 248157 245825 243271 240716 238521 236630 234796 232964
57607 232964 231297 230111 229709 229972 230291 230249 230156 230431 230727 230313 229128 227726 226245 224291 221969 220161 219381
57590 219381 219005 218097 216493 214592 212507 210002 207081 204202 201895 200460 199867 199704 199287 198123 196278
57575 196278 194242 192502 191313 190613 190008 189007 187430 185501 183488 181453 179492 177921 176992 176554 176201
57560 176201 175690 175066 174558 174492 175166 176612 178569 180816 183351 186080 188505 190054 190690 190921 191252 191809 192493
57543 192493 193228 193917 194360 194441 194335 194377 194638 194725 194115 192754 191288 190567 190858 191577 191820 191159 189912 188760
57525 188760 188151 188064 188207 188333 188330 188118 187676 187221 187177 187773 188772 189764 190658 191697 192995 194375 195720 197188
$$ packed form
57637B88631l924l144k614k538k541k279j760j209j008j461k165k093r32K04J89
57622B61356m91n85j94o09k112l348l285k575k332k554k555k195j891j834j832
57607B32964j667j186m02K63L19m2r3K75K96m14j185j402j481j954k322j808p80
57590B19381l76r08j604j901k085k505k921k879k307j435n93j63m17j164j845
57575A96278k036j740j189p00o05j001j577j929k013k035j961j571r29m38l53
57560A76201n11o24n08o6O74J446J957K247K535K729K425J549O36K31L31N57O84
57543A92493P35O89M43Q1j06M2K61Q7o10j361j466p21K91P19K43o61j247j152
57525A88760o09q7J43J26lk12m42m55m4N96R99R92Q94J039J298J380J345J468
$$ plain form
57507 197188 198878 200494 201634 202264 202616 202680 202151 200989 199694 198773 198092 197039 195293 193128 190939 188797
57491 188797 186655 184714 183285 182341 181527 180563 179434 178178 176825 175614 174937 174868 174969 174769 174240 173560 172650
57474 172650 171321 169800 168711 168411 168541 168383 167538 166179 164691 163189 161491 159579 157969 157323 157674 158323
57458 158323 158705 159026 159718 160572 160934 160727 160729 161650 163341 165095 166395 167128 167347 167182 166928 166909 167243 167847 168606
57439 168606 169441 170294 171171 172134 173115 173793 173890 173615 173633 174415 175627 176370 176123 175355 175064 175724 176968 178229
57421 178229 179344 180273 180661 180165 179115 178335 178221 178407 178388 178076 177600 177040 176594 176626 177154 177606 177551 177432 178075
57402 178075 179506 180821 181301 181157 181012 181070 181214 181560 182426 183774 185163 186363 187699 189504 191488 193011
57386 193011 194023 195391 198028 201812 205575 208271 210011 211770 214127 216519 217887 217914 217315 216934 216904 216943
$$ packed form
57507A97188J690J616J140O30L52O4n29j162j295r21o81j053j746k165k189k142
57491A88797k142j941j429r44q14r64j129j256j353j211o77o9J01k00n29o80r10
57474A72650j329j521j089l00J30j58q45j359j488j502j698j912j610o46L51O49
57458A58323L82L21O92Q54L62k07KR21J691J754J300P33K19j65k54j9L34O04P59
57439A68606Q35Q53Q77R63R81O78R7k75J8P82J212P43k47p68k91O60J244J261
57421A78229J115R29L88m96j050p80j14J86j9l12m76n60m46L2N28M52n5j19O43
57402A78075J431J315M80j44j45N8J44L46Q66J348J389J200J336J805J984J523
57386A93011J012J368K637L784L763K696J740J759K357K392J368K7n99l81l0L9
$$ plain form
57370 216943 217087 217652 218520 219037 218829 218351 218345 218999 219859 220373 220241 219534 218810 218876 219971 221305 221901 221871 222331
57351 222331 223955 226170 228018 229297 230454 231776 233226 234866 236849 238966 240694 241833 242803 244117
57337 244117 245778 247366 248508 249172 249628 250302 251500 253080 254481 255289 255732 256410 257549 258815 259899 260964
57321 260964 262322 263926 265553 267344 269666 272407 274880 276614 277896 279252 280715 282011 283287 285133
57307 285133 287796 290756 293281 295176 296854 298798 301143 303804 306855 310648 315480 321215 327424 333886
57293 333886 340724 347929 355039 361516 367354 373124 379608 387467 396971 407681 418551 428658 437771
57280 437771 446043 453510 460236 466611 473012 479384 485682 492450 500217 508471 516112 522925 529668 536512
57266 536512 542456 546817 550391 554339 558616 562415 565715 569360 573768 578523 583393 588996 596182 605245
$$ packed form
57370B16943J44N65Q68N17k08m78oO54Q60N14j32p07p24O6J095J334N96l0M60
57351B22331J624K215J848J279J157J322J450J640J983K117J728J139R70J314
57337B44117J661J588J142O64M56O74J198J580J401Q08M43O78J139J266J084J065
57321B60964J358J604J627J791K322K741K473J734J282J356J463J296J276J846
57307B85133K663K960K525J895J678J944K345K661L051L793M832N735O209O462
57293C33886O838P205P110O477N838N770O484P859R504J0710J0870J0107R113
57280D37771Q272P467O726O375O401O372O298O768P767Q254P641O813O743O844
57266E36512N944M361L574L948M277L799L300L645M408M755M870N603P186R063
$$ plain form
57252 605245 615928 627768 640242 652874 665479 678162 691104 704468 718388 732700 746723
57241 746723 759687 771427 782423 793135 803690 814232 825231 837274 850776 865909 882552
57230 882552 900242 918495 937248 956778 977101 997788 1018484 1039237 1060136 1080956 1101522
57219 1101522 1122222 1143801 1166710 1190936 1216423 1243281 1271442 1300385 1329479 1358610 1388342
57208 1388342 1419409 1452131 1486386 1522006 1558916 1596763 1634713 1672126 1709582 1748800 1790900
57197 1790900 1834538 1876063 1911909 1940946 1964565 1984793 2002826 2019302 2035218 2051876 2070117
57186 2070117 2090112 2111906 2135574 2160790 2186825 2213329 2240777 2269821 2300438 2332012 2364027
57175 2364027 2396333 2428913 2461733 2494767 2527933 2560978 2593508 2625006 2654843 2682666 2708994
$$ packed form
57252F05245J0683J1840J2474J2632J2605J2683J2942J3364J3920J4312J4023
57241G46723J2964J1740J0996J0712J0555J0542J0999J2043J3502J5133J6643
57230H82552J7690J8253J8753J9530K0323K0687K0696K0753K0899K0820K0566
57219A101522K0700K1579K2909K4226K5487K6858K8161K8943K9094K9131K9732
57208A388342L1067L2722L4255L5620L6910L7847L7950L7413L7456L9218M2100
57197A790900M3638M1525L5846K9037K3619K0228J8033J6476J5916J6658J8241
57186B070117J9995K1794K3668K5216K6035K6504K7448K9044L0617L1574L2015
57175B364027L2306L2580L2820L3034L3166L3045L2530L1498K9837K7823K6328
$$ plain form
57164 2708994 2735143 2762237 2790484 2819547 2849160 2879007 2908523 2937415 2966142 2995286 3024694
57153 3024694 3053906 3083184 3113248 3143899 3173737 3201502 3227043 3250672 3272220 3291214 3307560
57142 3307560 3321527 3333268 3342656 3349412 3353221 3354082 3352782 3350689 3348746 3347025 3345613 3345614 3348686 3355683
57128 3355683 3366165 3379149 3393897 3409930 3426727 3443735 3460630 3477448 3494519 3512378 3531832
57117 3531832 3554217 3581498 3615782 3658442 3709745 3769443 3837804 3916241 4007435 4115286 4244717
57106 4244717 4401049 4589096 4812528 5073666 5373202 5709510 6078389 6474741 6896420
57097 6896420 7348154 7842943 8400556 9044935 9801578 10694300 11741222 12951351 14322407
57088 14322407 15838700 17469277 19170070 20893043 22599436 24269958 25905996 27519084
$$ packed form
57164B708994K6149K7094K8247K9063K9613K9847K9516K8892K8727K9144K9408
57153C024694K9212K9278L0064L0651K9838K7765K5541K3629K1548J8994J6346
57142C307560J3967J1741R388O756L809Q61j300k093j943j721j412JL072O997
57128C355683J0482J2984J4748J6033J6797J7008J6895J6818J7071J7859J9454
57117C531832K2385K7281L4284M2660N1303N9698O8361P8437R1194J07851J29431
57106D244717J56332J88047K23432K61138K99536L36308L68879L96352M21679
57097F896420M51734M94789N57613O44379P56643Q92722J046922J210129J371056
57088A4322407J516293J630577J700793J722973J706393J670522J636038J613088
$$ plain form
57080 27519084 29109750 30645660 32057869 33266515 34220337 34915343 35374415 35608105 35593587
57071 35593587 35285804 34642999 33643762 32291237 30612932 28660365 26505457 24231996
57063 24231996 21925398 19664064 17512997 15519804 13713883 12108462 10703653 9489383
57055 9489383 8448536 7560600 6804901 6162441 5616339 5151615 4754994 4414864 4121212
57046 4121212 3865398 3639946 3438527 3256021 3088375 2932478 2786231 2648374 2517509
57037 2517509 2391087 2265736 2138950 2010424 1881895 1756180 1636528 1526219 1427847 1342620
57027 1342620 1270364 1210233 1161415 1123465 1096189 1079060 1070552 1068157 1069265 1071946 1074878 1076931
57015 1076931 1077268 1075590 1071505 1063136 1046541 1016981 971412 910440 838426 761710 686130 615447
$$ packed form
57080B7519084J590666J535910J412209J208646R53822O95006M59072K33690j4518
57071C5593587l07783o42805r99237j352525j678305j952567k154908k273461
57063B4231996k306598k261334k151067j993193j805921j605421j404809j214270
57055I489383j040847q87936p55699o42460n46102m64724l96621l40130k93652
57046D121212k55814k25452k01419j82506j67646j55897j46247j37857j30865
57037B517509j26422j25351j26786j28526j28529j25715j19652j10309r8372q5227
57027A342620p2256o0131m8818l7950k7276j7129q508k395J108K681K932K053
57015A076931L37j678m085q369j6595k9560m5569o0972p2014p6716p5580p0683
$$ plain form
57003 615447 551454 495049 446901 407202 375280 349850 329754 314332 303180 295796 291634 290353
56991 290353 291777 295625 301470 308968 317901 327903 338397 348887 359068 368484 376420 382348 386229
56978 386229 388007 387176 383381 377223 369790 361393 351512 340165 328649 318533 310461 304339 300215 298330
56964 298330 298629 300823 304882 310950 318813 327836 337372 346862 355585 362798 368232 372142 374748 375822
56950 375822 374821 371128 364213 353987 341237 327488 314190 302097 291521 282953 277219 275030 276559
56937 276559 281458 289210 299394 311611 325248 339442 353248 365772 376206 384051 389409 392778
56925 392778 394287 393238 388534 379449 365989 348858 329396 309188 289221 269524 250033 231679
56913 231679 216047 203863 194259 185674 177162 168790 161197 155075 150810 148298 147118 146858 147212 147901
$$ packed form
57003F15447o3993n6405m8148l9699l1922k5430k0096j5422j1152p384m162j281
56991B90353J424L848N845P498Q933J0002J0494J0490J0181R416P936N928L881
56978C86229J778q31l795o158p433q397r881j1347j1516j0116q072o122m124j885
56964B98330K99K194M059O068P863R023R536R490Q723P213N434L910K606J074
56950C75822j001l693o915j0226j2750j3749j3298j2093j0576q568n734k189J529
56937B76559M899P752J0184J2217J3637J4194J3806J2524J0434P845N358L369
56925C92778J509j049m704r085j3460j7131j9462k0208j9967j9697j9491j8354
56913B31679j5632j2184r604q585q512q372p593o122m265k512j180k60L54O89
$$ plain form
56899 147901 148889 150653 153828 158492 164173 170665 178411 187883 198993 211362 224770 238955 253274
56886 253274 266980 279703 291400 302037 311608 320227 327840 333962 337974 339643 339150 336896 333590
56873 333590 330394 328603 329202 332875 340197 351438 366329 384363 405258 428829 454604 481829 509670
56860 509670 537046 562473 584695 603544 619819 634249 646759 656468 661924 661486 654273 641066
56848 641066 624095 605965 589076 575759 568081 567218 573405 586625 606897 633865 666718 704615
56836 704615 746531 790459 833476 873024 907708 936769 959682 976756 989149 997172 998925 991368
56824 991368 972597 942669 903081 856704 808019 762006 722152 689864 665650 650035 643196 644632
56812 644632 653635 669513 690975 715850 741819 767105 790258 809862 824994 835629 842045 843815
$$ packed form
56899A47901R88J764L175M664N681O492P746R472J1110J2369J3408J4185J4319
56886B53274J3706J2723J1697J0637R571Q619P613O122M012J669m93k254l306
56873C33590l196j791N99L673P322J1241J4891J8034K0895K3571K5775K7225K7841
56860E09670K7376K5427K2222J8849J6275J4430J2510R709N456m38p213j3207
56848F41066j6971j8130j6889j3317p678q63O187J3220K0272K6968L2853L7897
56836G04615M1916M3928M3017L9548L4684K9061K2913J7074J2393Q023J753p557
56824I91368j8771k9928l9588m6377m8685m6013l9854l2288k4214j5615o839J436
56812F44632R003J5878K1462K4875K5969K5286K3153J9604J5132J0635O416J770
$$ plain form
56800 843815 839581 827675 806955 777475 740803 699642 656891 615044 576272 542520 515189 494868
56788 494868 481480 474448 472712 475042 480617 489009 499445 510447 520460 528462 533800 536010 535199
56775 535199 531991 526395 517017 502177 481677 456887 429302 399893 369835 340824 314087 289657
56763 289657 267198 247126 230267 216601 205015 194401 184576 175975 168867 163134 158598 155085 152168
56750 152168 149221 145998 142976 140845 139627 138555 136885 134639 132437 130787 129697 128900 128240 127776 127534
56735 127534 127294 126775 126098 125780 126012 126133 125308 123715 122532 122571 123385 123971 123912 123427 122766 122162 122153 123333 125721
56716 125721 128788 132063 135293 138047 139739 140281 140366 140813 141848 143163 144457 145640 146603 147059 146787 146068
56700 146068 145744 146580 148484 150477 151542 151367 150297 148901 147812 147590 148316 149475 150509 151267 151693 151464
$$ packed form
56800H43815m234j1906k0720k9480l6672m1161m2751m1847l8772l3752k7331k0321
56788D94868j3388p032j736K330N575Q392J0436J1002J0013Q002N338K210q11
56775E35199l208n596r378j4840k0500k4790k7585k9409l0058k9011k6737k4430
56763B89657k2459k0072j6859j3666j1586j0614r825q601p108n733m536l513k917
56750A52168k947l223l022k131j218j072j670k246k202j650j090p97o60m64k42
56735A27534k40n19o77l18K32J21q25j593j183L9Q14N86n9m85o61o04rJ180K388
56716A25721L067L275L230K754J692N42Q5M47J035J315J294J183R63M56k72p19
56700A46068l24Q36J904J993J065j75j070j396j089k22P26J159J034P58M26k29
$$ plain form
56684 151464 150491 149434 149016 148955 148281 146717 145118 144429 144837 146027 147633 149178 150140 150385 150177 149639 148758
56667 148758 147973 148098 149333 150987 152474 154012 155942 158054 160063 162184 164646 167197 169689 172596 176173
56652 176173 179565 181645 182491 183192 184392 185918 187692 189947 192371 193973 194190 193492 192646 192022 191897 192696
56636 192696 194397 196141 196937 196468 194965 192739 190209 187936 186166 184596 182997 181695 180966 180233 178530
56621 178530 175736 172788 170599 169177 167946 166606 165430 164845 164853 164894 164354 163260 162316 162084 162279 162084 161092
56604 161092 159689 158545 157958 157723 157458 157000 156566 156527 156994 157754 158642 159720 160895 161639 161516 160846 160386 160409
56586 160409 160560 160655 161088 162201 163736 165263 166762 168363 169776 170586 170991 171748 173236 175001 176427 177556
56570 177556 179046 181515 185116 189584 194443 199321 204269 209683 215729 221963 227814 233399 239450 246315
$$ packed form
56684A51464r73j057m18o1o74j564j599o89M08J190J606J545R62K45k08n38q81
56667A48758p85J25J235J654J487J538J930K112K009K121K462K551K492K907L577
56652A76173L392K080Q46P01J200J526J774K255K424J602K17o98q46o24j25P99
56636A92696J701J744P96m69j503k226k530k273j770j570j599j302p29p33j703
56621A78530k794k948k189j422j231j340j176n85QM1n40j094r44k32J95j95r92
56604A61092j403j144n87k35k65m58m34l9M67P60Q88J078J175P44j23o70m60K3
56586A60409J51R5M33J113J535J527J499J601J413Q10M05P57J488J765J426J129
56570A77556J490K469L601M468M859M878M948N414O046O234N851N585O051O865
$$ plain form
56556 246315 253351 259621 264926 269764 274352 278179 280627 281603 281285 279698 276970 273815 271113 269029 266958
56541 266958 264430 261550 258464 255017 251285 247915 245391 243324 241060 238709 236885 235583 234065 231919
56527 231919 229532 227315 225156 222921 220948 219578 218673 217958 217430 217055 216498 215621 214824 214338 213602 212022
56511 212022 210061 208772 208361 207955 206896 205518 204470 203850 203250 202207 200441 198135 196127 195347 195820 196728
56495 196728 197586 198782 200604 202364 203068 202589 201595 200532 199260 197637 195977 194832 194527 194965 195685 196219
56479 196219 196509 196866 197415 197830 197842 197710 197946 198742 199950 201364 202751 203831 204603 205504 206811 208028 208319
56462 208319 207514 206319 205556 205567 206261 207341 208409 209224 209894 210581 211052 210909 210211 209490 209138 209192 209787 211240
56444 211240 213495 215897 217789 219022 219634 219479 218568 217545 217272 217954 218955 219569 219685 219669 219799 219990 220055
$$ packed form
56556B46315P036O270N305M838M588L827K448R76l18j587k728l155k702k084k071
56541B66958k528k880l086l447l732l370k524k067k264k351j824j302j518k146
56527B31919k387k217k159k235j973j370r05p15n28l75n57q77p97m86p36j580
56511B12022j961j289m11m06j059j378j048o20o00j043j766k306k008p80M73R08
56495A96728Q58J196J822J760P04m79r94j063j272j623j660j145l05M38P20N34
56479A96219K90L57N49M15J2j32K36P96J208J414J387J080P72R01J307J217K91
56462B08319q05j195p63J1O94J080J068Q15O70O87M71j43o98p21l52N4N95J453
56444B11240K255K402J892J233O12j55r11j023k73O82J001O14J16j6J30J91O5
$$ plain form
56427 220055 220095 220554 221780 223604 225431 226724 227391 227769 228411 229747 231637 233209 233446 232089 229841 227644
56411 227644 226033 225186 225249 226231 227752 229166 229961 229959 229363 228717 228624 229237 230113 230772 231205 231643 232049 232259 232470
56392 232470 233147 234424 236012 237758 239800 241952 243457 243772 243379 243297 243921 244721 245034 244728 244091 243559 243772
56375 243772 245353 248199 251212 253163 253789 253743 253612 253381 252871 252241 251832 251817 252200 252948 253907 254808 255649 256919
56357 256919 259114 262054 264944 267161 268770 270218 271743 273260 274710 276309 278299 280460 282001 282147
56343 282147 280986 279595 279115 279701 280577 281159 281857 283523 286318 289487 292252 294546 296672 298645 300364
56328 300364 302268 305159 309147 313258 316439 318648 320559 322535 324363 325862 327157 328356 329481 330733
56314 330733 332317 333918 334827 334785 334270 333777 333324 332873 332737 333200 334165 335607 338006 341825 346758 351927 356696
$$ packed form
56427B20055M0M59J226J824J827J293O67L78O42J336J890J572K37j357k248k197
56411B27644j611q47O3R82J521J414P95kn96o46r3O13Q76O59M33M38M06K10K11
56392B32470O77J277J588J746K042K152J505L15l93q2O24Q00L13l06o37n32K13
56375B43772J581K846L013J951O26m6j31k31n10o30m09j5L83P48R59R01Q41J270
56357B56919K195K940K890K217J609J448J525J517J450J599J990K161J541J46
56343B82147j161j391m80N86Q76N82O98J666K795L169K765K294K126J973J719
56328C00364J904K891L988M111L181K209J911J976J828J499J295J199J125J252
56314C30733J584J601R09m2n15m93m53m51j36M63R65J442K399L819M933N169M769
$$ plain form
56297 356696 361005 365078 369157 373371 377556 381360 384717 387923 391051 393717 395815 397996 400833 403900
56283 403900 406358 408263 410516 413644 417386 421548 426510 432656 439868 447856 456540 465833 475421 485011
56269 485011 494587 504330 514590 525952 539035 554073 570858 589036 608220 628095 648939 671976
56257 671976 698580 729059 762745 799342 839565 884259 933524 987054 1044854 1107176 1173965
56246 1173965 1244688 1318554 1394789 1472849 1552315 1632257 1710836 1786106 1857224 1924202 1986339
56235 1986339 2041628 2088033 2124681 2151342 2167430 2172241 2165771 2148549 2120882 2082999 2035992 1981973
56223 1981973 1923028 1860196 1793657 1723825 1652138 1580648 1510734 1442382 1375104 1309419 1246921
56212 1246921 1188739 1134554 1083416 1035091 990215 949488 913055 880394 850456 822143 794978
$$ packed form
56297C56696M309M073M079M214M185L804L357L206L128K666K098K181K837L067
56283D03900K458J905K253L128L742M162M962O146P212P988Q684R293R588R590
56269D85011R576R743J0260J1362J3083J5038J6785J8178J9184J9875K0844K3037
56257F71976K6604L0479L3686L6597M0223M4694M9265N3530N7800O2322O6789
56246A173965P0723P3866P6235P8060P9466P9942P8579P5270P1118O6978O2137
56235A986339N5289M6405L6648K6661J6088M811o470j7222k7667l7883m7007n4019
56223A981973n8945o2832o6539o9832p1687p1490o9914o8352o7278o5685o2498
56212A246921n8182n4185n1138m8325m4876m0727l6433l2661k9938k8313k7165
$$ plain form
56201 794978 769165 744935 722278 701478 683288 668074 655207 643786 633603 624890 617446 610664
56189 610664 604245 598374 593278 589074 585924 583868 582528 581379 580247 579240 578403 577853 578077 579516 581874
56174 581874 584261 586086 587460 588789 590355 592325 594790 597737 601277 605836 611789 618839 626079 632844
56160 632844 639359 646561 655448 666511 679531 693858 709072 725419 743601 764158 787201 812623
56148 812623 840503 871370 906118 945538 989938 1039394 1094308 1155351 1222778 1296201 1375227
56137 1375227 1459888 1550189 1645479 1744489 1845730 1947777 2049655 2151154 2252226 2351697
56127 2351697 2446933 2535055 2614029 2682344 2738506 2781725 2812805 2833685 2846125 2850954 2847824 2834909
56115 2834909 2809410 2769532 2716105 2651790 2578906 2498681 2412259 2321307 2227257 2130535 2030929
$$ packed form
56201G94978k5813k4230k2657k0800j8190j5214j2867j1421j0183q713p444o782
56189F10664o419n871n096m204l150k056j340j149j132j007q37n50K24J439K358
56174E81874K387J825J374J329J566J970K465K947L540M559N953P050P240O765
56160F32844O515P202Q887J1063J3020J4327J5214J6347J8182K0557K3043K5422
56148H12623K7880L0867L4748L9420M4400M9456N4914O1043O7427P3423P9026
56137A375227Q4661R0301R5290R9010J01241J02047J01878J01499J01072R9471
56127B351697R5236Q8122P8974O8315N6162M3219L1080K0880J2440M829l130j2915
56115B834909k5499l9878n3427o4315p2884q0225q6422r0952r4050r6722r9606
$$ plain form
56104 2030929 1928582 1824820 1722393 1624774 1534686 1453307 1380992 1318235 1265257 1221085 1184018
56093 1184018 1152980 1127702 1107644 1091619 1078642 1068451 1061008 1056033 1053194 1052240 1052768 1054315 1056721
56080 1056721 1060014 1063985 1068358 1073351 1079507 1086947 1095286 1104197 1113505 1122789 1131637 1140408 1150142 1161501
56066 1161501 1174229 1187675 1201343 1214933 1228482 1242597 1258020 1274763 1292034 1309063 1325520
56055 1325520 1341272 1356355 1371258 1386622 1402506 1418368 1433823 1448953 1464021 1479447 1496006
56044 1496006 1514242 1533679 1553303 1573012 1593866 1616834 1641956 1668953 1697894 1728957 1762072
56033 1762072 1797155 1834277 1873379 1914211 1956660 2000736 2046231 2092849 2140711 2190250 2241582
56022 2241582 2294450 2348703 2404294 2460968 2518578 2577630 2638859 2702454 2768406 2837336 2910028
$$ packed form
56104B030929j02347j03762j02427r7619r0088q1379p2315o2757n2978m4172l7067
56093A184018l1038k5278k0058j6025j2977j0191p443m975k839r54N28J547K406
56080A056721L293L971M373M993O156P440Q339Q911R308R284Q848Q771R734J1359
56066A161501J2728J3446J3668J3590J3549J4115J5423J6743J7271J7029J6457
56055A325520J5752J5083J4903J5364J5884J5862J5455J5130J5068J5426J6559
56044A496006J8236J9437J9624J9709K0854K2968K5122K6997K8941L1063L3115
56033A762072L5083L7122L9102M0832M2449M4076M5495M6618M7862M9539N1332
56022B241582N2868N4253N5591N6674N7610N9052O1229O3595O5952O8930P2692
$$ plain form
56011 2910028 2986256 3065212 3147122 3233366 3324794 3421000 3521615 3627273 3738806 3856315
56001 3856315 3979585 4108847 4244678 4387652 4538418 4697727 4866301 5045034 5235257
55992 5235257 5438273 5654790 5885404 6131462 6394892 6677732 6982521 7312540 7670516
55983 7670516 8057674 8475456 8927781 9420355 9958377 10546661 11191607 11901233 12683742
55974 12683742 13548502 14508907 15582733 16790167 18154425 19705558 21482577 23532677
55966 23532677 25911915 28688381 31942842 35764960 40250372 45502571 51635784 58772604
55958 58772604 67034985 76533082 87359190 99590618 113294025 128516170 145254576
55951 145254576 163412890 182739140 202744517 222646890 241437351 258120938 272024613
$$ packed form
56011B910028P6228P8956Q1910Q6244R1428R6206J00615J05658J11533J17509
56001C856315J23270J29262J35831J42974J50766J59309J68574J78733J90223
55992E235257K03016K16517K30614K46058K63430K82840L04789L30019L57976
55983G670516L87158M17782M52325M92574N38022N88284O44946P09626P82509
55974A2683742Q64760R60405J073826J207434J364258J551133J777019K050100
55966B3532677K379238K776466L254461L822118M485412N252199O133213P136820
55958E8772604Q262381R498097J0826108J2231428J3703407J5222145J6738406
55951A45254576J8158314J9326250K0005377J9902373J8790461J6683587J3903675
$$ plain form
55944 272024613 282959459 291111510 296732651 299812013 299882898 296068118 287412980 273410735
55936 273410735 254430335 231743964 207127065 182319162 158667031 137036346 117872885
55929 117872885 101294473 87186835 75304090 65350332 57025300 50048220 44175354
55922 44175354 39206936 34980269 31361284 28243039 25543650 23197804 21149376 19351226
55914 19351226 17766164 16363500 15115752 13999659 12997276 12093583 11274541 10528608
55906 10528608 9847721 9224998 8652931 8124863 7636358 7183795 6763205 6371561 6007685
55897 6007685 5670652 5358500 5069263 4801903 4555360 4327999 4118716 3927246 3752504
55888 3752504 3591884 3443010 3305119 3178038 3061011 2953264 2854540 2764207 2680874 2603661
$$ packed form
55944B72024613J0934846Q152051N621141L079362P0885l814780q655138j4002245
55936B73410735j8980400k2686371k4616899k4807903k3652131k1630685j9163461
55929A17872885j6578412j4107638j1882745r953758q325032o977080n872866
55922D4175354m968418m226667l618985l118245k699389k345846k048428j798150
55914A9351226j585062j402664j247748j116093j002383r03693q19042p45933
55906A0528608o80887o22723n72067n28068m88505m52563m20590l91644l63876
55897F007685l37033l12152k89237k67360k46543k27361k09283j91470j74742
55888C752504j60620j48874j37891j27081j17027j07747r8724r0333q3333p7213
$$ plain form
55878 2603661 2532870 2468521 2409036 2352136 2296395 2241317 2186698 2132601 2079341 2026773 1973991
55867 1973991 1920000 1864181 1806054 1745532 1683794 1623004 1564654 1508886 1455706 1405911 1360250
55856 1360250 1318514 1280066 1244623 1211931 1181307 1152135 1124358 1098023 1072802 1048330 1024546
55845 1024546 1001371 978499 955740 933091 910356 887390 864883 844119 825626 808747 792787
55834 792787 777754 763652 750031 736852 724985 715079 706532 698242 689818 681354 672559 662985 652855
55821 652855 642935 633668 624960 616657 608723 601019 593324 585613 578154 571426 565924 561720 558180 554496
55807 554496 550707 547756 546438 546799 548702 552276 557381 563183 568773 573832 578270 581678 583641 584330 584261
55792 584261 583665 582428 580370 577248 572722 566727 559683 552024 543718 534570 524847 515296 506656 499302
$$ packed form
55878B603661p0791o4349n9485n6900n5741n5078n4619n4097n3260n2568n2782
55867A973991n3991n5819n8127o0522o1738o0790n8350n5768n3180m9795m5661
55856A360250m1736l8448l5443l2692l0624k9172k7777k6335k5221k4472k3784
55845A024546k3175k2872k2759k2649k2735k2966k2507k0764j8493j6879j5960
55834G92787j5033j4102j3621j3179j1867r906q547q290q424q464q795r574j0130
55821F52855r920r267q708q303p934p704p695p711p459o728n502m204l540l684
55807E54496l789k951j318L61J903L574N105N802N590N059M438L408J963O89o9
55792E84261n96j237k058l122m526n995p044p659q306r148r723r551q640p354
$$ plain form
55778 499302 493190 488000 483485 479756 477016 475068 473456 472137 471493 471523 471484 470590 468725 466351 464112 462593
55762 462593 461874 461089 458933 454758 448707 440746 430493 418283 405501 393262 381498 369956 359237
55749 359237 349981 341743 333744 326258 320112 315104 310072 304543 299208 294668 290682 286927 283594 280781
55735 280781 278064 275176 272577 270795 269608 268351 266758 264980 263005 260527 257425 253991 250634 247608
55721 247608 245065 243157 241913 241123 240557 240293 240683 241854 243411 244838 246157 247945 250611 253851 256850
55706 256850 258872 259637 259414 258907 258780 259051 259078 258224 256371 253697 250273 246149 241600 236993 232505 228251
55690 228251 224566 221854 220154 219125 218457 218135 218280 218885 219800 220919 222397 224591 227648 231138 234248
55675 234248 236427 237743 238626 239398 240044 240259 239780 238843 238194 238255 238410 237686 236149 235033 235254 236439 237763
$$ packed form
55778D99302o112n190m515l729k740j948j612j319o44L0l9q94j865k374k239j519
55762D62593p19p85k156m175o051p961j0253j2210j2782j2239j1764j1542j0719
55749C59237r256q238p999p486o146n008n032n529n335m540l986l755l333k813
55735B80781k717k888k599j782j187j257j593j778j975k478l102l434l357l026
55721B47608k543j908j244p90n66k64L90J171J557J427J319J788K666L240K999
55706B56850K022P65k23n07j27K71K7q54j853k674l424m124m549m607m488m254
55690B28251l685k712j700j029o68l22J45O05R15J119J478K194L057L490L110
55675B34248K179J316Q83P72O46K15m79r37o49O1J55p24j537j116K21J185J324
$$ plain form
55658 237763 239097 240745 242608 244379 246279 248776 251616 253872 255051 255573 255942 255969 255132 253342 251000
55643 251000 248494 245885 243022 239728 235877 231443 226552 221431 216286 211152 205968 200814 196013 191808
55629 191808 188107 184768 182026 180223 179099 177827 175933 173798 172022 170740 169815 169241 168901 168311 167185
55614 167185 166096 165989 167024 168255 168505 167269 164903 162280 160250 159069 158238 157098 155563 154094 153072
55599 153072 152470 152092 151882 151919 152266 152783 153061 152681 151666 150523 149704 149231 149006 149143 149737 150590 151520 152722
55581 152722 154490 156828 159685 163351 168144 173849 179896 186010 192325 198959 205862 213010 220363 227693
55567 227693 234771 241637 248369 254774 260636 265971 270525 273295 273284 270702 266788 262384 257313 251251 244504
55552 244504 237550 230366 222617 214293 205881 198103 191609 186625 182712 179101 175347 171546 167968 164797
$$ packed form
55658B37763J334J648J863J771J900K497K840K256J179N22L69K7q37j790k342
55643B51000k506k609k863l294l851m434m891n121n145n134n184n154m801m205
55629A91808l701l339k742j803j124j272j894k135j776j282r25n74l40n90j126
55614A67185j089j07J035J231K50j236k366k623k030j181q31j140j535j469j022
55599A53072o02l78k10L7L47N17K78l80j015j143q19m73k25J37N94Q53R30J202
55581A52722J768K338K857L666M793N705O047O114O315O634O903P148P353P330
55567B27693P078O866O732O405N862N335M554K770j1k582l914m404n071o062o747
55552B44504o954p184p749q324q412p778o494m984l913l611l754l801l578l171
$$ plain form
55538 164797 162204 160266 158795 157588 156799 156674 156915 156880 156414 155911 155468 154648 153330 152094 151320 150490 148931
55521 148931 146770 144559 142295 139514 136253 133275 131282 130315 129955 129722 129168 127919 125880 123345 120866
55506 120866 119027 118195 118287 118808 119250 119420 119360 119079 118534 117776 116974 116328 116019 116120 116447 116568 116160 115329 114497
55487 114497 113995 113815 113747 113696 113854 114467 115364 115845 115230 113458 111056 108727 107188 107071 108409 110302 111672
55470 111672 112431 113335 114623 115547 115577 115334 115706 116562 117094 117106 117118 117288 117041 116038 114876 114452 114953 115759 116146
55451 116146 115822 115016 114299 114240 114990 116154 117138 117605 117579 117204 116589 115870 115274 114944 114718 114221 113247 111989 110873
55432 110873 110307 110615 111888 113661 114965 115159 114630 114283 114397 114457 114125 113775 113849 114261 114803 115607 116800 118056
55414 118056 119069 120168 121902 124143 126102 127166 127272 126573 125256 123687 122217 120836 119412 118246 117802
$$ packed form
55538A64797k593j938j471j207p89j25K41l5m66n03m43q20j318j236p74q30j559
55521A48931k161k211k264k781l261k978j993r67l60k33n54j249k039k535k479
55506A20866j839q32R2N21M42J70o0k81n45p58q02o46l09J01L27J21m08q31q32
55487A14497n02j80o8n1J58O13Q97M81o15j772k402k329j539j17J338J893J370
55470A11672P59R04J288R24L0k43L72Q56N32J2J2J70k47j003j162m24N01Q06L87
55451A16146l24q06p17n9P50J164R84M67k6l75o15p19n96l30k26m97r74j258j116
55432A10873n66L08J273J773J304J94n29l47J14O0l32l50P4M12N42Q04J193J256
55414A18056J013J099J734K241J959J064J06o99j317j569j470j381j424j166m44
$$ plain form
55399 117802 117841 117471 116364 115361 115335 115852 115547 113777 111392 109824 109766 110840 112256 113473 114294 114655 114604
55382 114604 114471 114789 115830 117289 118602 119474 119910 119853 119166 118020 116938 116271 115887 115530 115224 115048 114759
55365 114759 114001 112840 111752 111065 110662 110310 110041 110021 110223 110400 110401 110377 110628 111231 111876 112107 111817 111459 111646
55346 111646 112517 113579 114223 114306 114135 113993 113860 113597 113224 112911 112781 112844 113055 113307 113372 113040 112380 111784 111573
55327 111573 111583 111259 110249 108832 107712 107376 107733 108363 109008 109701 110480 111096 111128 110381 109164 108164 107972 108657
55309 108657 109778 110803 111497 111891 112067 112133 112302 112663 112866 112349 111079 109777 109242 109596 110418 111340 112250 113140
55291 113140 114146 115560 117408 119115 120053 120335 120560 120785 120425 119359 118463 118582 119423 120004 119865 119384 119098
55274 119098 119233 119704 120045 119476 117632 115274 113729 113510 113905 114009 113578 112724 111431 109913 108954 109238 110506
$$ packed form
55399A17802L9l70j107j003k6N17l05j770k385j568n8J074J416J217Q21L61n1
55382A14604j33L18J041J459J313Q72M36n7o87j146j082o67l84l57l06j76k89
55365A14759p58j161j088o87m03l52k69k0K02J77Jk4K51O03O45K31k90l58J87
55346A11646Q71J062O44Q3j71j42j33k63l73l13j30O3K11K52O5l32o60n96k11
55327A11573J0l24j010j417j120l36L57O30O45O93P79O16L2p47j217j000j92O85
55309A08657J121J025O94L94J76O6J69L61K03n17j270j302n35L54Q22R22R10Q90
55291A13140J006J414J848J707R38K82K25K25l60j066q96J19Q41N81j39m81k86
55274A19098J35M71L41n69j844k358j545k19L95J04m31q54j293j518r59K84J268
$$ plain form
55257 110506 111956 113345 115032 116925 118137 118089 117419 117254 117880 118665 119127 119424 119720 119688 119021 118041 117388 117268
55239 117268 117381 117442 117455 117539 117836 118529 119606 120550 120636 119676 118242 117030 116199 115430 114413 113093 111638 110358
55221 110358 109530 109194 109197 109493 110259 111574 113173 114624 115637 116118 116169 116139 116458 117213 118036 118630 119194 120101 121295
55202 121295 122286 122679 122470 121901 121283 120888 120756 120685 120581 120723 121348 122120 122418 122141 121824 121845 121941 121681 121064 120354
55182 120354 119654 118981 118563 118660 119147 119548 119478 118871 117849 116690 115874 115818 116439 117195 117681 118021 118540 119296 120142
55163 120142 121031 121997 122909 123552 123941 124283 124597 124631 124251 123683 123249 123054 123112 123487 124083 124542 124671 124817 125395
55144 125395 126152 126393 126017 125777 126242 126963 127085 126491 125792 125289 124562 123260 121835 121078 121163 121539 121766 122072
55126 122072 122890 124121 125183 125721 125987 126434 127187 127995 128499 128360 127392 125896 124707 124572 125457 126746 128055
$$ packed form
55257A10506J450J389J687J893J212m8o70j65O26P85M62K97K96l2o67r80o53j20
55239A17268J13O1J3Q4K97O93J077R44Q6r60j434j212q31p69j017j320j455j280
55221A10358q28l36LK96P66J315J599J451J013M81N1l0L19P55Q23N94N64R07J194
55202A21295R91L93k09n69o18l95j32p1j04J42O25P72K98k77l17K1R6k60o17p10
55182A20354p00o73m18R7M87M01p0o07j022j159q16n6O21P56M86L40N19P56Q46
55163A20142Q89R66R12O43L89L42L14L4l80n68m34j95N8L75N96M59J29J46N78
55144A25395P57K41l76k40M65P21J22n94o99n03p27j302j425p57Q5L76K27L06
55126A22072Q18J231J062N38K66M47P53Q08N04j39r68j496j189j35Q85J289J309
$$ plain form
55109 128055 129481 131010 132130 132316 131724 131103 131095 131732 132569 133207 133641 134104 134565 134648 134258 134071 134883 136509
55091 136509 137813 138022 137534 137185 137183 137112 136707 136084 135376 134542 133611 132843 132588 133042 134044 135038 135482 135435 135510 136089
55071 136089 136823 137147 136970 136544 135901 134871 133554 132342 131425 130589 129567 128411 127468 127101 127361 127904 128374
55054 128374 128905 129925 131348 132342 132207 131144 129832 128627 127614 127083 127296 127933 128355 128393 128350 128314 128049 127570
55036 127570 127265 127371 127828 128683 130070 131681 132803 133137 133067 132982 132797 132449 132313 132755 133595 134418 135164 136009
55018 136009 136884 137495 137750 137803 137670 137062 135719 133866 132252 131633 132091 132952 133488 133631 133774 134077 134351 134562
55000 134562 134997 135801 136726 137491 138148 138969 140155 141736 143549 145307 146889 148469 150107 151380 151827 151567
54984 151567 150953 149791 147636 144925 142940 142330 142380 142141 141630 141426 141682 142145 142742 143556 144483 145395 146351 147221
$$ packed form
55109A28055J426J529J120J86n92o21qO37Q37O38M34M63M61Q3l90j87Q12J626
55091A36509J304K09m88l49kp1m05o23p08q34r31p68k55M54J002R94M44m7P5N79
55071A36089P34L24j77m26o43j030j317j212r17q36j022j156r43l67K60N43M70
55054A28374N31J020J423R94j35j063j312j205j013n31K13O37M22L8m3l6k65m79
55036A27570l05J06M57Q55J387J611J122L34p0q5j85l48j36M42Q40Q23P46Q45
55018A36009Q75O11K55N3j33o08j343j853j614o19M58Q61N36J43J43L03K74K11
55000A34562M35Q04R25P65O57Q21J186J581J813J758J582J580J638J273M47k60
54984A51567o14j162k155k711j985o10N0k39n11k04K56M63N97Q14R27R12R56Q70
$$ plain form
54966 147221 147496 147043 146663 147249 148622 149822 150407 150778 151324 151888 152140 151936 151256 150290 149627 149817 150597 151022
54948 151022 150568 149758 149512 150130 151094 151576 151054 149678 148195 147351 147273 147456 147385 147027 146835 147424 149190 152016
54930 152016 155342 158582 161378 163473 164751 165648 167088 169567 172636 175761 179366 184259 190214 195927
54916 195927 200502 204202 207539 210383 212418 213886 215288 216600 217185 216322 213626 209299 204253 199682 196093
54901 196093 192894 189167 184584 179405 174041 169089 165432 163611 163099 162771 162133 161642 161770 162292 162771 163360
54885 163360 164658 166922 169779 172690 175471 178335 181580 185303 189301 193169 196520 199189 201293 203179
54871 203179 205329 208100 211368 214415 216386 216917 216257 214815 212805 210412 207921 205417 202463 198510 193573
54856 193573 188286 183326 179049 175638 173135 171192 169194 166854 164474 162514 161189 160508 160259 159725 158008
$$ packed form
54966A47221K75m53l80N86J373J200N85L71N46N64K52k04o80r66o63J90P80M25
54948A51022m54q10k46O18R64M82n22j376j483q44p8J83p1l58j92N89J766K826
54930A52016L326L240K796K095J278Q97J440K479L069L125L605M893N955N713
54916A95927M575L700L337K844K035J468J402J312N85q63k696m327n046m571l589
54901A96093l199l727m583n179n364m952l657j821n12l28o38m91J28N22M79N89
54885A63360J298K264K857K911K781K864L245L723L998L868L351K669K104J886
54871B03179K150K771L268L047J971N31o60j442k010k393k491k504k954l953m937
54856A93573n287m960m277l411k503j943j998k340k380j960j325o81k49n34j717
$$ plain form
54841 158008 155093 152169 150350 149427 148452 147185 146180 145624 144984 143959 143022 142692 142895 143298 143743 143993 143586
54824 143586 142430 141222 140847 141495 142669 143746 144250 143898 142864 141900 141770 142498 143395 143795 143686 143689 144497 146217
54806 146217 148195 149729 150916 152409 154232 155444 155336 154477 154002 154183 154337 153937 153188 152577 152484 153233 154864
54789 154864 156721 157837 157996 157920 158237 158726 158878 158667 158376 158015 157430 156819 156693 157423 159125 161841 165426
54772 165426 169372 173199 177102 181808 187614 193843 199490 204279 208891 214161 220173 226170 231280 235271
54758 235271 238570 241585 244153 245636 245414 243255 239462 234808 230078 225435 220355 214427 208058 202122
54744 202122 197074 192804 189239 186504 184374 182088 179129 175936 173538 172576 172797 173387 173642 173485 173445 174010
54728 174010 175051 176186 177619 180033 183517 187255 190660 194107 197977 201587 204008 205548 207372 209783
$$ packed form
54841A58008k915k924j819r23r75j267j005n56o40j025r37l30K03M03M45K50m07
54824A43586j156j208l75O48J174J077N04l52j034r64j30P28Q97M00j09LQ08J720
54806A46217J978J534J187J493J823J212j08q59m75J81J54m00p49o11r3P49J631
54789A54864J857J116J59p6L17M89J52k11k91l61n85o11j26P30J702K716L585
54772A65426L946L827L903M706N806O229N647M789M612N270O012N997N110L991
54758B35271L299L015K568J483k22k159l793m654m730m643n080n928o369n936
54744B02122n048m270l565k735k130k286k959l193k398r62K21N90K55j57m0N65
54728A74010J041J135J433K414L484L738L405L447L870L610K421J540J824K411
$$ plain form
54714 209783 211905 213161 213964 214613 214519 213117 210762 208018 204735 200544 195777 191066 186388 181358 176376
54699 176376 172598 170628 169803 168961 167549 165913 164838 164829 165550 165940 165130 163198 160841 158553 156479 154773
54683 154773 153587 152775 152165 152018 152670 153757 154382 154165 153582 153180 153101 153542 154990 157481 160043 161387 161040
54666 161040 159565 157920 156850 156584 156682 156331 155122 153491 152207 151604 151581 152115 153297 154845 155999 156163
54650 156163 155492 154706 154353 154383 154435 154399 154562 155232 156417 157931 159569 160978 161553 160852 159177 157460 156496 156401
54632 156401 156725 156894 156619 156195 156307 157201 158167 158359 158064 158452 159865 161076 160780 159286 158041 157809 158008
54615 158008 157777 157003 156130 155528 155344 155602 156154 156682 156966 157005 156699 155665 153681 151286 149570 149259 150112 151323
54597 151323 152308 152957 153341 153609 154168 155499 157537 159505 160581 160630 160073 159341 158718 158473 158656 158830 158404 157261
$$ packed form
54714B09783K122J256Q03O49r4j402k355k744l283m191m767m711m678n030m982
54699A76376l778j970q25q42j412j636j075rP21L90q10j932k357k288k074j706
54683A54773j186q12o10j47O52J087O25k17n83m02p9M41J448K491K562J344l47
54666A61040j475j645j070k66R8l51j209j631j284o03k3N34J182J548J154J64
54650A56163o71p86l53L0N2l6J63O70J185J514J638J409N75p01j675j717r64r5
54632A56401L24J69k75m24J12Q94R66J92k95L88J413J211k96j494j245k32J99
54615A58008k31p74q73o02j84K58N52N28K84L9l06j034j984k395j716l11Q53J211
54597A51323R85O49L84K68N59J331K038J968J076M9n57p32o23k45J83J74m26j143
$$ plain form
54579 157261 155836 154641 153989 154042 154709 155553 156188 156738 157561 158636 159650 160552 161500 162318 162626 162533 162525 162631 162368
54560 162368 161697 161314 161703 162523 163254 163831 164302 164506 164507 164733 165265 165606 165558 165607 165881 165543 164058 162423 162111
54541 162111 163221 164663 165872 167296 169242 171275 172897 174061 174836 175277 175683 176396 177183 177427 177003 176457
54525 176457 176254 176410 176828 177375 177593 177028 175927 175027 174553 174058 173341 172771 172476 171938 170775 169370 168383 168087
54507 168087 168477 169513 170902 172038 172493 172278 171495 170164 168578 167310 166640 166374 166380 166687 166897 166265 164800
54490 164800 163645 163846 165272 167198 169290 171359 172758 172969 172509 172403 172890 173376 173503 173481 173429 173220 173144 173978
54472 173978 175999 178464 180392 181559 182433 183389 184332 184960 185182 185250 185555 186228 187023 187624 187940 187977 187699 187260
54454 187260 187145 187634 188231 188103 187097 185910 185203 184990 185022 185280 185785 186286 186501 186484 186456 186364 185943 185057 183782
$$ packed form
54579A57261j425j195o52N3O67Q44O35N50Q23J075J014R02R48Q18L08r3qJ06k63
54560A62368o71l83L89Q20P31N77M71K04JK26N32L41m8M9K74l38j485j635l12
54541A62111J110J442J209J424J946K033J622J164P75M41M06P13P87K44m24n46
54525A76457k03J56M18N47K18n65j101r00m74m95p17n70k95n38j163j405r87k96
54507A68087L90J036J389J136M55k15p83j331j586j268o70k66OL07K10o32j465
54490A64800j155K01J426J926K092K069J399K11m60j06M87M86J27k2n2k09p6Q34
54472A73978K021K465J928J167Q74R56R43O28K22O8L05O73P95O01L16L7k78m39
54454A87260j15M89N97j28j006j187p07k13L2K58N05N01K15j7k8r2m21q86j275
$$ plain form
54435 183782 182178 180268 178295 176736 175955 175940 176481 177443 178743 180079 180882 180723 179817 179027 179198 180367 181703
54418 181703 182360 182350 182441 183183 184266 184936 184904 184586 184570 185082 185914 186599 186618 185806 184671 184058 184327 185121 186014 186978
54398 186978 187998 188668 188686 188495 188883 190103 191831 193792 195856 197603 198490 198569 198487 198655 198911 199089 199301 199434
54380 199434 198986 197766 196344 195440 195234 195506 196023 196501 196637 196532 196719 197466 198444 199323 200141 200750 200553 199403
54362 199403 198249 198204 199298 200802 202355 203972 205324 205975 206250 206944 208107 208911 208890 208586 208765 209570 210637
54345 210637 211484 211686 211202 210606 210425 210216 209058 207071 205537 205155 205059 204164 202682 201484 200587 199310 197628
54328 197628 196325 195735 195226 194243 193164 192651 192605 192301 191446 190692 190973 192492 194452 195717 195699 194668 193387
54311 193387 192554 192484 193081 194001 194941 195752 196216 195884 194457 192348 190486 189401 188817 188290 187871 187798 187866 187609
$$ packed form
54435A83782j604j910j973j559p81j5N41R62J300J336Q03j59r06p90J71J169J336
54418A81703O57j0R1P42J083O70l2l18j6N12Q32O85J9q12j135o13K69P94Q93R64
54398A86978J020O70J8j91L88J220J728J961K064J747Q87P9q2J68K56J78K12J33
54380A99434m48j220j422r04k06K72N17M78J36j05J87P47R78Q79Q18O09j97j150
54362A99403j154m5J094J504J553J617J352O51K75O94J163Q04k1l04J79Q05J067
54345B10637Q47K02m84n96j81k09j158j987j534l82r6q95j482j198q97j277j682
54328A97628j303n90n09r83j079n13m6l04q55p54K81J519J960J265j8j031j281
54311A93387q33p0N97R20R40Q11M64l32j427k109j862j085n84n27m19p3O8k57
$$ plain form
54293 187609 187036 186692 186864 187115 186810 185866 184766 184002 183761 184048 184765 185564 185913 185637 185322 185835 187318 188912
54275 188912 189702 189729 189806 190482 191543 192472 193060 193446 193862 194473 195264 196025 196579 197038 197591 198052 197985 197366 196774
54256 196774 196681 196816 196546 195703 194793 194479 195059 196352 197883 199261 200491 201775 202915 203177 202046 199948
54240 199948 197902 196536 195725 195122 194679 194508 194532 194463 194089 193433 192689 192074 191761 191912 192605 193605 194340 194362 193899
54221 193899 193642 193875 194117 193820 193121 192588 192440 192423 192360 192375 192530 192659 192668 192686 192729 192565 192143 191938 192489 193616 194380
54200 194380 193943 192330 190369 189036 188913 190056 192053 194181 195772 196642 197143 197672 198225 198534 198478 198150 197570
54183 197570 196667 195638 195014 195181 195887 196392 196064 194874 193439 192584 192666 193225 193453 193003 192222 191679 191783 192767
54165 192767 194489 196070 196323 194978 193124 191944 191362 190481 189055 187805 187270 187102 186764 186362 186384 186936 187592
$$ packed form
54293A87609n73l44J72K51l05r44j100p64k41K87P17P99L49k76l15N13J483J594
54275A88912P90K7P7O76J061R29N88L86M16O11P91P61N54M59N53M61o7o19n92
54256A96774r3J35k70q43r10l14N80J293J531J378J230J284J140K62j131k098
54240A99948k046j366q11o03m43j71K4o9l74o56p44o15l13J51O93J000P35K2m63
54221A93899k57K33K42k97o99n33j48j7o3J5J55J29RJ8M3j64m22k05N51J127P64
54200A94380m37j613j961j333j23J143J997K128J591Q70N01N29N53L09n6l28n80
54183A97570r03j029o24J67P06N05l28j190j435q55Q2N59K28m50p81n43J04R84
54165A92767J722J581K53j345j854j180n82q81j426j250n35j68l38m02K2N52O56
$$ plain form
54148 187592 187875 187630 187060 186597 186646 187285 188209 189047 189682 190240 190829 191360 191572 191235 190377 189323 188488 188202 188728
54129 188728 190190 192284 194228 195308 195488 195286 195162 195285 195725 196488 197315 197809 197827 197507 196931 196147 195531 195680
54111 195680 196683 197859 198461 198408 198116 197925 197956 198281 198830 199260 199265 199066 199345 200646 202859 205257 206972 207600
54093 207600 207469 207254 207238 207102 206530 205796 205548 206111 207226 208403 209348 210098 210899 211940 213103 214021 214514 214856
54075 214856 215542 216819 218503 220158 221444 222489 224008 226796 230918 235578 239932 243809 247493 251130
54061 251130 254733 258554 262936 267801 272666 277163 281210 284637 287073 288402 289050 289564 290022 290025 289170 287391
54045 287391 284881 281885 278679 275742 273778 273311 274177 275590 276828 277730 278482 279298 280623 283261 287705
54030 287705 293346 298844 303395 307262 311042 314925 318829 322742 326520 329650 331672 332748 333502 334357 335211
$$ packed form
54148A87592K83k45n70m63M9O39R24Q38O35N58N89N31K12l37q58j054q35k86N26
54129A88728J462K094J944J080J80k02j24J23M40P63Q27M94J8l20n76p84o16J49
54111A95680J003J176O02n3k92j91L1L25N49M30Nj99K79J301K213K398J715O28
54093B07600j31k15j6j36n72p34k48N63J115J177R45P50Q01J041J163R18M93L42
54075B14856O86J277J684J655J286J045J519K788M122M660M354L877L684L637
54061B51130L603L821M382M865M865M497M047L427K436J329O48N14M58Lq55j779
54045B87391k510k996l206k937j964m67Q66J413J238R02P52Q16J325K638M444
54030B87705N641N498M551L867L780L883L904L913L778L130K022J076P54Q55Q54
$$ plain form
54015 335211 335660 335328 334101 332273 330336 328498 326478 323959 321030 317948 314667 310970 306965 303049 299368
54000 299368 295666 291807 288080 284798 281849 278964 276260 274179 272828 271695 270208 268386 266632 264930
53986 264930 262666 259552 256428 254632 254586 255491 256499 257626 259137 260618 261309 261181 261023 261480 262646 264552
53970 264552 267280 270289 272384 273015 273202 274468 276969 279302 280160 279668 278903 278624 278778 278962 278932 278583 277776
53953 277776 276428 274859 273850 274098 275504 277146 278101 278204 277942 277855 278319 279701 282284 285931 290178 294704
53937 294704 299487 304422 309105 313229 316896 320308 323363 325840 327902 330131 332993 336426 339935 343054
53923 343054 345785 348665 352321 356882 361961 367272 373073 379817 387574 396094 405293 415316 426146 437461
53909 437461 448917 460321 471545 482565 493585 504696 515285 524200 530749 535224 538143 539368
$$ packed form
54015C35211M49l32j227j828j937j838k020k519k929l082l281l697m005l916l681
54000B99368l702l859l727l282k949k885k704k081j351j133j487j822j754j702
53986B64930k264l114l124j796m6R05J008J127J511J481O91j28j58M57J166J906
53970B64552K728L009K095O31J87J266K501K333Q58m92p65k79J54J84l0l49q07
53953B77776j348j569j009K48J406J642R55J03k62q7M64J382K583L647M247M526
53937B94704M783M935M683M124L667L412L055K477K062K229K862L433L509L119
53923C43054K731K880L656M561N079N311N801O744P757Q520R199J0023J0830J1315
53909D37461J1456J1404J1224J1020J1020J1111J0589Q915O549M475K919J225
$$ plain form
53897 539368 538480 535793 532182 527735 521192 511245 498094 483307 468340 453779 439944 427478 416811
53884 416811 407405 398179 388709 379570 371412 364186 357496 351286 345685 340422 334987 329435 324546 320944
53870 320944 318322 315770 312658 309010 305229 301759 298923 296726 294684 292009 288178 283421 278654 274859
53856 274859 272410 270892 269600 268160 266673 265358 264263 263259 262149 260723 258964 257245 256106 255664
53842 255664 255466 255025 254317 253586 252900 252205 251605 251195 250664 249464 247535 245593 244557 244760 245785 246944 247840
53825 247840 248568 249462 250664 251949 253057 254098 255505 257498 259691 261292 261727 261196 260642 261037 262557 264550
53809 264550 266355 267996 269941 272444 275374 278519 281718 284807 287786 290992 294741 298800 302608 306057
53795 306057 309648 313777 318269 322769 327169 331396 335195 338482 341597 344755 347508 349237 350096 350951 352327
$$ packed form
53897E39368q88k687l611m447o543r947j3151j4787j4967j4561j3835j2466j0667
53884D16811r406r226r470r139q158p226o690o210n601n263n435n552m889l602
53870C20944k622k552l112l648l781l470k836k197k042k675l831m757m767l795
53856B74859k449j518j292j440j487j315j095j004j110j426j759j719j139m42
53842B55664j98m41p08p31o86o95o00m10n31j200j929j942j036K03J025J159Q96
53825B47840P28Q94J202J285J108J041J407J993K193J601M35n31n54L95J520J993
53809B64550J805J641J945K503K930L145L199L089K979L206L749M059L808L449
53795C06057L591M129M492M500M400M227L799L287L115L158K753J729Q59Q55J376
$$ plain form
53780 352327 353810 354608 354323 353004 350832 348110 345428 343325 341619 339307 335454 330155 324423 319104 314181
53765 314181 309274 304478 300320 296965 293947 290756 287346 283965 280766 277797 275110 272716 270625 269001
53751 269001 267976 267241 266201 264725 263306 262213 260998 259343 257925 257712 258627 259664 260230 260617 261014 260936
53735 260936 260069 259080 258950 259797 260854 261489 261804 262198 262741 263181 263409 263774 264844 266870 269553 272369 274966
53718 274966 277166 278789 279779 280454 281334 282669 284327 286063 287713 289282 291149 293909 297488 300584 301743
53703 301743 301123 300483 301261 303363 306080 309291 313085 316956 320284 323249 326395 329540 331952 333508 334830
53688 334830 336232 337378 338135 339002 340342 341775 342696 342984 342893 342641 342372 342174 341810 340811 339103 337256 335789
53671 335789 334514 332901 330838 328694 326798 325224 323955 322944 322038 321088 320187 319665 319804 320515 321194 321006
$$ packed form
53780C52327J483P98k85j319k172k722k682k103j706k312l853n299n732n319m923
53765C14181m907m796m158l355l018l191l410l381l199k969k687k394k091j624
53751B69001j025p35j040j476j419j093j215j655j418k13R15J037N66L87L97p8
53735B60936q67r89j30Q47J057O35L15L94N43M40K28L65J070K026K683K816K597
53718B74966K200J623R90O75Q80J335J658J736J650J569J867K760L579L096J159
53703C01743o20o40P78K102K717L211L794L871L328K965L146L145K412J556J322
53688C34830J402J146P57Q67J340J433R21K88r1k52k69j98l64r99j708j847j467
53671C35789j275j613k063k144j896j574j269j011r06r50r01n22J39P11O79j88
$$ plain form
53655 321006 319634 317786 316597 316404 316448 315920 314869 313872 313303 313314 314058 315375 316513 316798 316502 316620 317821
53638 317821 319962 322462 324765 326607 328244 330243 332667 334698 335660 336134 337305 339395 341591 343515 345729
53623 345729 348554 351392 353765 356218 359462 363254 366859 370158 373539 377088 380637 384381 388700 393474
53609 393474 398223 402835 407474 411844 415265 417614 419600 421983 425025 428726 433004 437446 441379 444487
53595 444487 446966 448959 450246 450727 450767 450855 451272 452296 454185 456645 458692 459532 459312 458685 457928 456854 455313
53578 455313 453296 450728 447689 444775 442705 441422 439906 437079 432755 427656 422732 418576 415379 413217
53564 413217 412186 412168 412622 412922 412950 413116 413697 414469 415158 415947 417168 418724 420193 421456 422890 424912 427559
53547 427559 430487 433277 435738 438059 440587 443431 446450 449713 453607 458312 463495 468891 474819 481652
$$ packed form
53655C21006j372j848j189j93M4n28j051r97n69J1P44J317J138K85k96J18J201
53638C17821K141K500K303J842J637J999K424K031R62M74J171K090K196J924K214
53623C45729K825K838K373K453L244L792L605L299L381L549L549L744M319M774
53609C93474M749M612M639M370L421K349J986K383L042L701M278M442L933L108
53595D44487K479J993J287M81M0Q8M17J024J889K460K047Q40k20o27p57j074j541
53578D55313k017k568l039k914k070j283j516k827m324n099m924m156l197k162
53564D13217j031j8M54L00K8J66N81P72O89P89J221J556J469J263J434K022K647
53547D27559K928K790K461K321K528K844L019L263L894M705N183N396N928O833
$$ plain form
53533 481652 489068 496393 503566 511237 519941 529710 540411 551885 563707 575441 587341 600292 614898
53520 614898 631026 648237 666104 684036 701579 719241 738381 759752 782685 806124 829933
53509 829933 854519 879694 904794 929727 955091 981185 1007569 1033720 1059608 1085434 1111172
53498 1111172 1136514 1161054 1184498 1207004 1229233 1251764 1274440 1296635 1318050 1338804 1358862
53487 1358862 1377982 1396392 1414893 1434028 1453555 1472983 1492135 1510794 1528318 1544164 1558501
53476 1558501 1571741 1583633 1593454 1601094 1607331 1612793 1617083 1619208 1618483 1614760 1608127 1598903 1587832
53463 1587832 1575730 1562725 1548136 1531316 1512454 1492376 1471752 1450774 1429508 1408149 1386766
53452 1386766 1365141 1343123 1320978 1299053 1277230 1255084 1232657 1210716 1190052 1170805 1152723
$$ packed form
53533D81652P416P325P173P671Q704R769J0701J1474J1822J1734J1900J2951J4606
53520F14898J6128J7211J7867J7932J7543J7662J9140K1371K2933K3439K3809
53509H29933K4586K5175K5100K4933K5364K6094K6384K6151K5888K5826K5738
53498A111172K5342K4540K3444K2506K2229K2531K2676K2195K1415K0754K0058
53487A358862J9120J8410J8501J9135J9527J9428J9152J8659J7524J5846J4337
53476A558501J3240J1892R821P640O237N462M290K125p25l723o633r224j1071
53463A587832j2102j3005j4589j6820j8862k0078k0624k0978k1266k1359k1383
53452A386766k1625k2018k2145k1925k1823k2146k2427k1941k0664j9247j8082
$$ plain form
53441 1152723 1135843 1120505 1106750 1094141 1082358 1071719 1062908 1056348 1051988 1049544 1048713 1049251 1051087
53428 1051087 1054360 1059136 1065098 1071807 1079309 1088273 1099382 1112818 1128442 1146192 1165995 1187438
53416 1187438 1209917 1233180 1257575 1283765 1312303 1343391 1376796 1411944 1448272 1485552 1523888
53405 1523888 1563535 1604835 1648143 1693626 1741189 1790800 1842630 1896558 1951783 2007402 2063340
53394 2063340 2120209 2178290 2237196 2296570 2356376 2416241 2475168 2532435 2588323 2643447 2697751
53383 2697751 2750629 2801605 2850215 2895450 2936136 2971943 3003453 3031176 3054976 3074512 3089605
53372 3089605 3099960 3105001 3104347 3098109 3086440 3069088 3045737 3016657 2982608 2944111 2901126 2853585
53360 2853585 2802045 2747593 2691146 2633125 2573837 2513835 2453574 2393024 2332182 2271869 2213359
$$ packed form
53441A152723j6880j5338j3755j2609j1783j0639q811o560m360k444q31N38J836
53428A051087L273M776N962O709P502Q964J1109J3436J5624J7750J9803K1443
53416A187438K2479K3263K4395K6190K8538L1088L3405L5148L6328L7280L8336
53405A523888L9647M1300M3308M5483M7563M9611N1830N3928N5225N5619N5938
53394B063340N6869N8081N8906N9374N9806N9865N8927N7267N5888N5124N4304
53383B697751N2878N0976M8610M5235M0686L5807L1510K7723K3800J9536J5093
53372C089605J0355N041o54o238j1669j7352k3351k9080l4049l8497m2985m7541
53360B853585n1540n4452n6447n8021n9288o0002o0261o0550o0842o0313n8510
$$ plain form
53349 2213359 2157063 2102265 2048371 1995707 1944653 1894821 1845813 1798133 1752415 1708251 1664873
53338 1664873 1622700 1582996 1546074 1511059 1477641 1446779 1419237 1394485 1371653 1350635 1331525
53327 1331525 1313756 1296671 1280430 1265598 1252177 1239742 1228135 1217433 1207545 1198440 1190476 1183926
53315 1183926 1178534 1174104 1171133 1170185 1170927 1172537 1174821 1178209 1182882 1188751 1196236 1206212 1218993 1234025
53301 1234025 1250677 1268809 1288486 1309698 1332368 1356126 1380117 1403746 1427595 1452847 1479690
53290 1479690 1507127 1534523 1562363 1590968 1619342 1646114 1671105 1695036 1717957 1738815 1756616
53279 1756616 1771366 1783675 1793851 1801585 1806282 1807546 1805397 1800103 1791822 1780591 1766654 1750515
53267 1750515 1732472 1712348 1689942 1665562 1639800 1612854 1584419 1554291 1522851 1490833 1458693
$$ packed form
53349B213359n6296n4798n3894n2664n1054m9832m9008m7680m5718m4164m3378
53338A664873m2173l9704l6922l5015l3418l0862k7542k4752k2832k1018j9110
53327A331525j7769j7085j6241j4832j3421j2435j1607j0702r888r105p964o550
53315A183926n392m430k971r48P42J610K284L388M673N869P485R976J2781J5032
53301A234025J6652J8132J9677K1212K2670K3758K3991K3629K3849K5252K6843
53290A479690K7437K7396K7840K8605K8374K6772K4991K3931K2921K0858J7801
53279A756616J4750J2309J0176P734M697J264k149n294q281j1231j3937j6139
53267A750515j8043k0124k2406k4380k5762k6946k8435l0128l1440l2018l2140
$$ plain form
53256 1458693 1426267 1393067 1358943 1324352 1289883 1255654 1221512 1187755 1155198 1124321 1094735
53245 1094735 1065753 1037142 1008988 981208 953699 926771 900860 875879 851400 827477 804784
53234 804784 783781 764227 745721 728307 712210 697304 683253 669993 657651 646047 634653
53223 634653 623164 611868 601293 591607 582416 573072 563150 552707 542149 531819 521695 511510
53211 511510 501127 490716 480616 471195 462830 455758 449791 444253 438339 431561 423893 415759 407974
53198 407974 401396 396255 391907 387495 382770 377949 372989 367590 362005 357163 353609 350763 347669 344113
53184 344113 340546 337293 334494 332538 331700 331347 330312 328306 326248 324860 323628 321722 319379 317651 317035
53169 317035 317093 317298 317512 317564 317093 316136 315329 315083 314953 314256 313081 312138 311695 311223 310232 308931 307720 306387
$$ packed form
53256A458693l2426l3200l4124l4591l4469l4229l4142l3757l2557l0877k9586
53245A094735k8982k8611k8154k7780k7509k6928k5911k4981k4479k3923k2693
53234H04784k1003j9554j8506j7414j6097j4906j4051j3260j2342j1604j1394
53223F34653j1489j1296j0575r686r191r344r922j0443j0558j0330j0124j0185
53211E11510j0383j0411j0100r421q365p072n967n538n914o778p668q134p785
53198D07974o578n141m348m412m725m821m960n399n585m842l554k846l094l556
53184C44113l567l253k799j956q38l53j035k006k058j388j232j906k343j728o16
53169C17035N8K05K14N2m71r57q07k46j30o97j175r43m43m72r91j301j211j333
$$ plain form
53151 306387 304351 301632 299099 297580 297087 297057 297011 296685 295803 294264 292554 291519 291581 292387 293345 294207 294986
53134 294986 295576 295748 295476 295045 294863 295239 296268 297742 299244 300434 301299 302039 302788 303542 304283 305055 305930
53117 305930 307021 308473 310316 312256 313756 314452 314466 314262 314173 314147 313960 313565 313034 312192 310638 308337 306023
53100 306023 304623 304278 304173 303437 301972 300290 298761 297264 295456 293177 290574 288029 285995 284753 284209
53085 284209 283937 283516 282908 282474 282546 282972 283257 283224 283299 283916 284793 285127 284507 283317 282169 281231 280290 279264 278429
53066 278429 278208 278814 280061 281468 282655 283609 284408 284774 284242 282838 281257 280158 279519 278857 277886 276736
53050 276736 275750 275319 275743 276984 278571 279950 280867 281358 281555 281637 281757 281845 281635 281035 280236 279356 278311 277247
53032 277247 276606 276402 275932 274849 274105 274942 276963 278182 277296 275178 273699 273694 274654 275879 277143 278300 278966
$$ packed form
53151C06387k036k719k533j519m93l0m6l26q82j539j710j035O2Q06R58Q62P79
53134B94986N90J72k72m31j82L76J029J474J502J190Q65P40P49P54P41P72Q75
53117C05930J091J452J843J940J500O96J4k04q9k6j87l95n31q42j554k301k314
53100C06023j400l45j05p36j465j682j529j497j808k279k603k545k034j242n44
53085B84209k72m21o08m34P2M26K85l3P5O17Q77L34o20j190j148r38r41j026q35
53066B78429k21O06J247J407J187R54P99L66n32j404j581j099o39o62r71j150
53050B76736r86m31M24J241J587J379R17M91J97Q2J20Q8k10o00p99q80j045j064
53032B77247o41k04m70j083p44Q37K021J219q86k118j479nR60J225J264J157O66
$$ plain form
53015 278966 278817 277898 276575 275386 274934 275579 277061 278560 279252 278836 277650 276510 276309 277439 279449 281406
52999 281406 282703 283420 283956 284582 285419 286481 287516 288088 288181 288550 290039 292569 295194 297130 298337 299094
52983 299094 299585 300130 301212 302773 303913 303900 303155 302669 302721 302955 303531 305151 307740 310070 311236 311807 312839
52966 312839 314320 315298 315223 314432 313547 313076 313454 314738 316224 316933 316634 315916 315310 314862 314619 314861 315525 315912
52948 315912 315349 313857 311927 309920 308002 306399 305282 304440 303356 301702 299705 298011 297148 297001 296840
52933 296840 296022 294694 293598 293170 293034 292482 291245 289684 288364 287594 287242 286904 286304 285532 284871 284430 284091
52916 284091 283732 283294 282640 281642 280518 279812 279871 280461 281016 281237 281363 281863 282820 283602 283395 282235 281239 281426
52898 281426 282431 282884 282029 280483 279292 278822 278825 279146 279867 280938 282030 282715 282606 281526 279785 278168 277372
$$ packed form
53015B78966j49r19j323j189m52O45J482J499O92m16j186j140k01J130K010J957
52999B81406J297P17N36O26Q37J062J035N72R3L69J489K530K625J936J207P57
52983B99094M91N45J082J561J140j3p45m86N2K34N76J620K589K330J166N71J032
52966C12839J481R78p5p91q85m71L78J284J486P09k99p18o06m48k43K42O64L87
52948C15912n63j492j930k007j918j603j117q42j084j654j997j694q63j47j61
52933B96840q18j328j096m28j36n52j237j561j320p70l52l38o00p72o61m41l39
52916B84091l59m38o54r98j124p06N9N90N55K21J26N00R57P82k07j160r96J87
52898B81426J005M53q55j546j191m70LL21P21J071J092O85j09j080j741j617p96
$$ plain form
52881 277372 277452 277929 278369 278773 279494 280850 282725 284502 285583 286006 286373 287122 288123 289108 290198 291813 294187
52864 294187 297130 300104 302461 303810 304325 304585 305024 305650 306235 306494 306104 304950 303428 302170 301329 300510
52848 300510 299460 298351 297182 295496 292961 289791 286269 282469 278838 276391 275548 275263 274140 272159 270486
52833 270486 269772 269558 269368 269424 269943 270493 270484 269853 268916 267967 267315 267274 267751 268180 268201 268165 268622 269531 270320 270613 270599
52812 270599 270689 271034 271466 271831 272316 273308 274789 276042 276271 275561 274919 275244 276471 277773 278329 277761 276145
52795 276145 273839 271255 268623 266000 263497 261413 260124 259942 260908 262527 263866 264310 264217 264374 264840 264870
52779 264870 264135 263455 263870 265395 267099 268215 268736 269072 269513 270041 270401 270406 270288 270597 271500 272416 272661 272288
52761 272288 271924 271842 271627 270806 269422 267881 266558 265681 265375 265538 265885 266285 266955 268126 269638 271082 272338
$$ packed form
52881B77372Q0M77M40M04P21J356J875J777J081M23L67P49J001R85J090J615K374
52864B94187K943K974K357J349N15K60M39O26N85K59l90j154j522j258q41q19
52848C00510j050j109j169j686k535l170l522l800l631k447q43k85j123j981j673
52833B70486p14k14j90N6N19N50ro31r37r49o52m1M77M29K1l6M57R09P89K93j4
52812B70599R0L45M32L65M85R92J481J253K29p10o42L25J227J302N56n68j616
52795B76145k306k584k632k623k503k084j289j82R66J619J339M44r3J57M66L0
52779B64870p35o80M15J525J704J116N21L36M41N28L60Nj18L09R03R16K45l73
52761B72288l64q2k15q21j384j541j323q77l06J63L47M00O70J171J512J444J256
$$ plain form
52744 272338 273735 275614 277969 280594 283349 286015 288059 288992 289036 289046 289578 290376 291021 291688 292748 293899
52728 293899 294381 294051 293686 294020 294990 296069 296882 297194 296794 295812 294875 294567 294902 295523 296054 296007 294779 292291
52710 292291 289344 286852 284938 283268 281973 281498 281680 281793 281646 281876 282840 283853 283974 283147 282084 281350
52694 281350 281062 281279 282167 283663 285272 286310 286400 285824 285421 285889 287092 288199 288623 288561 288523 288696 289003 289469
52676 289469 290132 290789 291146 291140 290848 290270 289514 288966 288808 288511 287356 285479 283902 283425 283980 285168 286922 289254
52658 289254 291795 293969 295461 296219 296257 295825 295561 296061 297277 298616 299536 299868 299725 299448 299559 300403 301782
52641 301782 303137 304052 304363 303984 303044 302098 301724 301842 301848 301516 301301 301630 302366 303206 304152 305181 305844 305648 304638
52622 304638 303274 301942 300935 300626 301149 302029 302506 302200 301187 299688 298133 297238 297392 298013 298155 297747 297539
$$ packed form
52744B72338J397J879K355K625K755K666K044R33M4J0N32P98O45O67J060J151
52728B93899M82l30l65L34R70J079Q13L12m00r82r37l08L35O21N31m7j228k488
52710B92291k947k492j914j670j295m75J82J13j47K30R64J013J21q27j063p34
52694B81350k88K17Q88J496J609J038R0n76m03M68J203J107M24o2l8J73L07M66
52676B89469O63O57L57ok92n78p56n48j58k97j155j877j577m77N55J188J754K332
52658B89254K541K174J492P58L8m32k64N00J216J339R20L32j43k77J11Q44J379
52641C01782J355R15L11l79r40r46l74J18Ol32k15L29P36Q40R46J029O63j96j010
52622C04638j364j332j007l09N23Q80M77l06j013j499j555q95J54O21J42m08k08
$$ plain form
52605 297539 297822 297955 297452 296782 296640 297057 297702 298536 299489 299972 299431 298253 297474 297687 298772 300492 302723
52588 302723 305108 307126 308589 309634 310238 310317 310249 310645 311433 311871 311697 311574 312047 312687 312797 312455 312241 312342
52570 312342 312564 312905 313394 313595 313016 311944 311149 310681 309765 308049 306243 305133 304559 303847 302803 301764 300937
52553 300937 300216 299448 298458 296993 295111 293522 293067 293798 294921 295688 296068 296525 297402 298570 299507 299732 299322
52536 299322 298870 298742 298612 298080 297477 297514 298294 299328 300502 302217 304353 305947 306388 306354 306916 308147 309247
52519 309247 309716 309760 309745 309936 310686 312280 314523 316998 319685 322861 326402 329727 332451 334604 336151 336901
52503 336901 336975 336822 336585 335936 334700 333049 330921 327903 324084 320346 317299 314491 311343 308401 306888
52488 306888 307218 308697 310520 312321 313715 314166 313654 312971 312991 313917 315416 317099 318631 319727 320398 321105
$$ packed form
52605B97539K83J33n03o70j42M17O45Q34R53M83n41j178p79K13J085J720K231
52588C02723K385K018J463J045O04P9o8L96P88M38j74j23M73O40J10l42k14J01
52570C12342K22L41M89K01n79j072p95m68r16j716j806j110n74p12j044j039q27
52553C00937p21p68r90j465j882j589m55P31J123P67L80M57Q77J168R37K25m10
52536B99322m52j28j30n32o03L7P80J034J174J715K136J594M41l4N62J231J100
52519C09247M69M4j5J91P50J594K243K475K687L176L541L325K724K153J547P50
52503C36901P4j53k37o49j236j651k128l018l819l738l047k808l148k942j513
52488C06888L30J479J823J801J394M51n12o83K0R26J499J683J532J096O71P07
$$ plain form
52472 321105 322375 324333 326630 328727 330192 331009 331771 333396 336331 340086 343660 346341 347986 348736 348771
52457 348771 348355 347877 347589 347389 346906 345781 343829 341001 337399 333427 329709 326549 323508 319832 315445
52442 315445 311262 308328 306857 306300 306084 305955 305824 305762 306097 307063 308276 308961 308796 308205 307780 307823 308539 310086
52424 310086 312049 313356 313279 312341 311736 311998 312666 313181 313561 314098 314890 315933 317412 319670 322977 327388 332574
52407 332574 337812 342479 346771 351628 357657 364351 370657 376094 380877 385070 388236 390128 391249 392297
52393 392297 393203 393130 391415 388233 384248 379922 375356 370683 366278 362466 359166 356062 353162 351046 350338
52378 350338 350944 352040 352937 353771 355189 357484 360340 363397 366728 370597 374966 379460 383694 387413 390379
52363 390379 392390 393548 394334 395201 396089 396447 395869 394633 393456 392716 392083 391081 389830 388966 388883 389351 389959
$$ packed form
52472C21105J270J958K297K097J465Q17P62J625K935L755L574K681J645P50L5
52457C48771m16m78k88k00m83j125j952k828l602l972l718l160l041l676m387
52442C15445m183k934j471n57k16j29j31o2L35R66J213O85j65n91m25M3P16J547
52424C10086J963J307p7r38o05K62O68N15L80N37P92J043J479K258L307M411N186
52407C32574N238M667M292M857O029O694O306N437M783M193L166J892J121J048
52393C92297R06p3j715l182l985m326m566m673m405l812l300l104k900k116p08
52378C50338O06J096Q97Q34J418K295K856L057L331L869M369M494M234L719K966
52363C90379K011J158P86Q67Q88L58n78j236j177p40o33j002j251q64q3M68O08
$$ plain form
52346 389959 390678 391831 393688 396222 399134 401997 404544 406927 409542 412521 415647 418871 422584 427142
52332 427142 432396 438055 444290 451486 459585 468191 477281 487170 497624 507632 516492 524838 534119 545232
52318 545232 557983 571663 585674 599632 613317 626805 640401 654228 667941 681058 693529
52307 693529 705874 718731 732410 746878 761999 777557 793138 808288 822888 837087 850734
52296 850734 863113 873538 882065 889285 895507 900517 904110 906431 907688 907919 907220 905912 904213 902033
52282 902033 899339 896494 893904 891577 889322 887256 885663 884414 882992 881280 879999 880120 882008 885295
52268 885295 889462 894283 899711 905600 911773 918301 925568 933953 943494 953857 964545 975055 985090
52255 985090 994838 1004952 1015888 1027239 1038057 1047947 1057500 1067373 1077271 1086252 1093805 1100180 1105658
$$ packed form
52346C89959P19J153J857K534K912K863K547K383K615K979L126L224L713M558
52332D27142N254N659O235P196Q099Q606R090R889J0454J0008Q860Q346R281J1113
52318E45232J2751J3680J4011J3958J3685J3488J3596J3827J3713J3117J2471
52307F93529J2345J2857J3679J4468J5121J5558J5581J5150J4600J4199J3647
52296H50734J2379J0425Q527P220O222N010L593K321J257K31o99j308j699k180
52282I02033k694k845k590k327k255k066j593j249j422j712j281J21J888L287
52268H85295M167M821N428N889O173O528P267Q385R541J0363J0688J0510J0035
52255I85090R748J0114J0936J1351J0818R890R553R873R898Q981P553O375N478
$$ plain form
52242 1105658 1110038 1112977 1114445 1114543 1113222 1110537 1107072 1103640 1100521 1097267 1093427 1089181 1084993 1080858
52228 1080858 1076277 1071015 1065470 1060135 1055047 1050140 1045832 1042706 1040623 1038746 1036623 1034791 1033982 1034138
52214 1034138 1034583 1034910 1035263 1035962 1037344 1039847 1043713 1048526 1053483 1058246 1063143 1068455 1073983 1079557 1085520
52199 1085520 1092234 1099341 1106007 1111852 1117232 1122586 1127894 1132977 1138008 1143380 1149123 1154734 1159675 1163880
52185 1163880 1167654 1171109 1173818 1175088 1174517 1172297 1169013 1165167 1160822 1155667 1149446 1142364 1135027 1127953
52171 1127953 1121192 1114508 1107788 1101228 1095215 1090146 1086304 1083693 1081960 1080629 1079471 1078617 1078307 1078663 1079659
52156 1079659 1081154 1082856 1084404 1085620 1086671 1087897 1089456 1091099 1092394 1093182 1093792 1094589 1095288 1095012 1093293
52141 1093293 1090825 1088840 1087850 1087431 1087217 1087515 1088679 1090379 1092002 1093484 1095282 1097664 1100596 1104331 1109557
$$ packed form
52242A105658M380K939J468R8j321k685l465l432l119l254l840m246m188m135
52228A080858m581n262n545n335n088m907m308l126k083j877k123j832q09J56
52214A034138M45L27L53O99J382K503L866M813M957M763M897N312N528N574N963
52199A085520O714P107O666N845N380N354N308N083N031N372N743N611M941M205
52185A163880L774L455K709J270n71k220l284l846m345n155o221p082p337p074
52171A127953o761o684o720o560o013n069l842k611j733j331j158q54l10L56R96
52156A079659J495J702J548J216J051J226J559J643J295P88O10P97O99k76j719
52141A093293k468j985r90m19k14K98J164J700J623J482J798K382K932L735N226
$$ plain form
52126 1109557 1116738 1125712 1136187 1148287 1162167 1177340 1192917 1208628 1225188 1243374 1262941 1282734
52114 1282734 1301805 1320124 1338142 1355936 1373028 1388896 1403409 1416766 1429317 1441513 1453771
52103 1453771 1466128 1478073 1488941 1498498 1507074 1515212 1523308 1531484 1539544 1546961 1553029 1557161 1559114
52090 1559114 1559010 1557261 1554340 1550398 1545052 1537779 1528606 1518223 1507340 1496122 1484404 1472296 1460428
52077 1460428 1449668 1440692 1433669 1428210 1423806 1420524 1419087 1420044 1422970 1426794 1430781 1434792 1438704 1442246
52063 1442246 1445672 1450057 1456421 1464680 1473799 1482834 1491474 1499707 1507425 1514537 1521146 1527380 1533197 1538433
$$ packed form
52126A109557P181Q974J0475J2100J3880J5173J5577J5711J6560J8186J9567J9793
52114A282734J9071J8319J8018J7794J7092J5868J4513J3357J2551J2196J2258
52103A453771J2357J1945J0868R557Q576Q138Q096Q176Q060P417O068M132J953
52090A559114j04j749k921l942n346p273r173j0383j0883j1218j1718j2108j1868
52077A460428j0760q976p023n459m404l282j437R57K926L824L987M011L912L542
52063A442246L426M385O364Q259R119R035Q640Q233P718P112O609O234N817N236
$$ [...]
##END NTUPLES=NMR SPECTRUM
##END=
