##TITLE=AC1500_CRIANN13307_8125335_qdL5fto03a
##JCAMPDX= 6.0         $$ Bruker NMR JCAMP-DX V2.0
##DATA TYPE= NMR SPECTRUM
##DATA CLASS= NTUPLES
##ORIGIN= BRUKER
##OWNER= Administrator
$$ 1.72 TOPSPIN		Version 2.1
$$ 2013-08-16 16:31:51.984 -0700  Administrator@X
$$ Compression mode = diff/dup
##.OBSERVE FREQUENCY= 400.02188249412
##.OBSERVE NUCLEUS= ^1H
##.ACQUISITION MODE= SIMULTANEOUS (DQD)
##.ACQUISITION SCHEME= undefined
##.AVERAGES= 64
##.DIGITISER RES= 22
##SPECTROMETER/DATA SYSTEM= spect
##.PULSE SEQUENCE= noesygpps1d.comp
##.SOLVENT NAME= COFFEE_meoh
##.SHIFT REFERENCE= INTERNAL, COFFEE_meoh, 1, 14.96104
##AUDIT TRAIL= $$ (NUMBER, WHEN, WHO, WHERE, PROCESS, VERSION, WHAT)
$$ ##TITLE= Audit trail, TOPSPIN		Version 2.1
$$ ##JCAMPDX= 5.01
$$ ##ORIGIN= Bruker BioSpin GmbH
$$ ##OWNER= Administrator
$$ $$ E:\/data/COFFEE/nmr/AC1500_CRIANN13307_8125335_qdL5fto03a/22/pdata/1/auditp.txt
$$ ##AUDIT TRAIL=  $$ (NUMBER, WHEN, WHO, WHERE, PROCESS, VERSION, WHAT)
(   1,<2013-08-16 16:31:47.141 -0700>,<Administrator>,<X>,<go>,<TOPSPIN 2.1>,
      <created by zg
	started at 2013-08-16 16:20:17.829 -0700,
	POWCHK enabled, PULCHK disabled,
       configuration hash MD5:
       C8 4E 4E 5D D3 5C D8 9E 9F 52 82 E0 59 8A DE 15
       data hash MD5: 64K
       31 28 E2 71 78 DC 1B 42 C3 89 47 CC 5A 1B F9 AD>)
(   2,<2013-08-16 16:31:50.125 -0700>,<Administrator>,<X>,<proc1d>,<TOPSPIN 2.1>,
      <Start of raw data processing
       efp LB = 0.3 FT_mod = 6 PKNL = 1 PHC0 = 0 PHC1 = 0 SI = 128K 
       data hash MD5: 128K
       45 1F E0 38 E1 8B 71 93 A8 A4 68 AD 05 9D 72 5D>)
(   3,<2013-08-16 16:31:51.063 -0700>,<Administrator>,<X>,<proc1d>,<TOPSPIN 2.1>,
      <pk PHC0 = -77.50854 PHC1 = 0 
       data hash MD5: 128K
       36 20 C6 17 08 37 76 34 48 8D 6E 24 E8 1F C2 D6>)
(   4,<2013-08-16 16:31:51.469 -0700>,<Administrator>,<X>,<proc1d>,<TOPSPIN 2.1>,
      <abs ABSG = 1 
       data hash MD5: 128K
       A4 FA 18 B0 1A 7D 8D 3F 73 2C C2 9D CE 6B 8A 3E>)
(   5,<2013-08-16 16:31:51.578 -0700>,<Administrator>,<X>,<proc1d>,<TOPSPIN 2.1>,
      <abs ABSG = 2 
       data hash MD5: 128K
       BD 4A 7F 28 32 A4 8F 46 10 E2 0F 39 F3 9D 17 59>)
(   6,<2013-08-16 16:31:51.656 -0700>,<Administrator>,<X>,<proc1d>,<TOPSPIN 2.1>,
      <abs ABSG = 3 
       data hash MD5: 128K
       0F 03 D6 74 66 3A 97 6E 7F C3 FF B9 A1 D2 D3 0B>)
(   7,<2013-08-16 16:31:51.734 -0700>,<Administrator>,<X>,<proc1d>,<TOPSPIN 2.1>,
      <abs ABSG = 4 
       data hash MD5: 128K
       62 66 14 54 95 15 1B F9 E7 E2 EC 0E CA 34 79 E1>)
(   8,<2013-08-16 16:31:51.813 -0700>,<Administrator>,<X>,<proc1d>,<TOPSPIN 2.1>,
      <abs ABSG = 5 
       data hash MD5: 128K
       DC 4A 29 CA 5A F8 6A 91 00 04 81 B8 CC 39 DC 9A>)
$$ ##END=
$$ 
$$ $$ hash MD5
$$ $$ 63 17 50 0C 8D 26 10 19 EC 38 81 CA 68 9B 05 42
##$RELAX= 
##$RELAX= 
##$RELAX= 
##$RELAX= 
##$RELAX= 
##$RELAX= 
##$RELAX= 
##$RELAX= 
$$ Bruker specific parameters
$$ --------------------------
##$DU= <E:\>
##$EXPNO= 22
$$ [...]
##$TP07= 0
##$TPNAME0= <>
##$TPNAME1= <>
##$TPNAME2= <>
##$TPNAME3= <>
##$TPNAME4= <>
##$TPNAME5= <>
##$TPNAME6= <>
##$TPNAME7= <>
##$TPOAL= (0..7)
0.5 0.5 0.5 0.5 0.5 0.5 0.5 0.5
##$TPOFFS= (0..7)
0 0 0 0 0 0 0 0
##$TUNHIN= 0
##$TUNHOUT= 0
##$TUNXOUT= 0
##$USERA1= <user>
##$USERA2= <user>
##$USERA3= <user>
##$USERA4= <user>
##$USERA5= <user>
##$V9= 5
##$VALIST= <valist>
##$VCLIST= <CCCCCCCCCCCCCCC>
##$VD= 0
##$VDLIST= <DDDDDDDDDDDDDDD>
##$VPLIST= <PPPPPPPPPPPPPPP>
##$VTLIST= <TTTTTTTTTTTTTTT>
##$WBST= 2048
##$WBSW= 25
##$XGAIN= (0..3)
0 0 0 0
##$XL= 0
##$YL= 0
##$YMAX_a= 6608174
##$YMIN_a= -13512400
##$ZGOPTNS= <>
##$ZL1= 120
##$ZL2= 120
##$ZL3= 120
##$ZL4= 120
##$ABSF1= 14.96104
##$ABSF2= -5.597142
##$ABSG= 5
##$ABSL= 3
##$ALPHA= 0
##$AQORDER= 0
##$ASSFAC= 0
##$ASSFACI= 0
##$ASSFACX= 0
##$ASSWID= 0
##$AUNMP= <proc_prof1d_extract.lims>
##$AXLEFT= 0
##$AXNAME= <>
##$AXNUC= <1H>
##$AXRIGHT= 0
##$AXTYPE= 0
##$AXUNIT= <>
##$AZFE= 0.1
##$AZFW= 0.1
##$BCFW= 0
##$BC_mod= 0
##$BYTORDP= 0
##$COROFFS= 0
##$CY= 15
##$DATMOD= 1
##$DC= 0
##$DFILT= <>
##$DTYPP= 0
##$F1P= 0
##$F2P= 0
##$FCOR= 0.5
##$FTSIZE= 131072
##$FT_mod= 6
##$GAMMA= 0
##$GB= 0
##$INTBC= 1
##$INTSCL= 1
##$ISEN= 128
##$LB= 0.3
##$LEV0= 0
##$LPBIN= 0
##$MAXI= 10000
##$MC2= 0
##$MEAN= 0
##$ME_mod= 0
##$MI= 0
##$NCOEF= 0
##$NC_proc= -2
##$NLEV= 6
##$NOISF1= 0
##$NOISF2= 0
##$NSP= 0
##$NTH_PI= 0
##$NZP= 0
##$OFFSET= 14.96104
##$PC= 1
##$PHC0= -77.50854
##$PHC1= 0
##$PH_mod= 1
##$PKNL= yes
##$PPARMOD= 0
##$PPDIAG= 0
##$PPIPTYP= 0
##$PPMPNUM= 2147483647
##$PPRESOL= 1
##$PSCAL= 4
##$PSIGN= 0
##$PYNMP= <proc.py>
##$REVERSE= no
##$SF= 400.020009621539
##$SI= 131072
##$SIGF1= 0
##$SIGF2= 0
##$SINO= 400
##$SIOLD= 131072
##$SPECTYP= <>
##$SREGLST= <1H.CDCl3>
##$SSB= 0
##$STSI= 131072
##$STSR= 0
##$SW_p= 8223.68421052631
##$SYMM= 0
##$S_DEV= 0
##$TDeff= 65536
##$TDoff= 0
##$TI= <>
##$TILT= no
##$TM1= 0
##$TM2= 0
##$TOPLEV= 0
##$USERP1= <user>
##$USERP2= <user>
##$USERP3= <user>
##$USERP4= <user>
##$USERP5= <user>
##$WDW= 1
##$XDIM= 131072
##$YMAX_p= 337995130
##$YMIN_p= -12687
##$CURPLOT= <Network HP LaserJet P1505>
##$CURPRIN= <$Network HP LaserJet P1505>
##$DFORMAT= <normdp>
##$LAYOUT= <+/1D_H.xwp>
##$LFORMAT= <normlp>
##$PFORMAT= <normpl>
##$SURQMSG= 1
$$ End of Bruker specific parameters
$$ ---------------------------------
##NTUPLES= NMR SPECTRUM
##VAR_NAME=  FREQUENCY,     SPECTRUM/REAL,   SPECTRUM/IMAG
##SYMBOL=    X,             R,               I
##VAR_TYPE=  INDEPENDENT,   DEPENDENT,       DEPENDENT
##VAR_FORM=  AFFN,          ASDF,            ASDF
##VAR_DIM=   131072,        131072,          131072
##UNITS=     HZ,            ARBITRARY UNITS, ARBITRARY UNITS
##FACTOR=    0.0627417313425164, 1,          1
##FIRST=     8223.62146879497, -249,         -62831
##LAST=      0,             1109,            -63265
##MIN=       0,             -12687,          0
##MAX=       8223.62146879497, 337995130,    0
$$ Real data points
##PAGE= N=1
##DATA TABLE= (X++(R..R)), XYDATA
$$ [...]
63883G20342j2144j0450q910p509n905m257l212k844k247o11J853M513P231J0009
63869F85859J2256J3461J4321J6098J8776K0904K1622K1770K2462K3493K4000
63858H95022K3912K3693K3137K1591J9192J6788J4604J1966Q566N066K000j000
63846A064537m377p784j0665j3215j6017j9076k1885k4179k6068k7545k8478k9003
63834H36245k9420k9689k9537k9023k8536k8189k7695k6893k5925k4802k3261
63823E33275k1266j9276j7753j6676j5732j4728j3604j2347j1120j0258r796r294
63811C61425q371p285o592o373o136n536m826m429m279l889l004k001j503j700
63797B95501k212k582k727k826k933k914k694k398k275k498k945l116k506j367
$$ plain form
63883 720342 708198 697748 688838 681329 675424 671167 667955 665111 662864 662253 664106 668619 675850 685859
63869 685859 698115 711576 725897 741995 760771 781675 803297 825067 847529 871022 895022
63858 895022 918934 942627 965764 987355 1006547 1023335 1037939 1049905 1058471 1063537 1065537 1064537
63846 1064537 1060160 1052376 1041711 1028496 1012479 993403 971518 947339 921271 893726 865248 836245
63834 836245 806825 777136 747599 718576 690040 661851 634156 607263 581338 556536 533275
63823 533275 512009 492733 474980 458304 442572 427844 414240 401893 390773 380515 370719 361425
63811 361425 353054 345769 339177 332804 326668 321132 316306 311877 307598 303709 300705 298704 297201 295501
63797 295501 293289 290707 287980 285154 282221 279307 276613 274215 271940 269442 266497 263381 260875 259508
63783B59508p74j436k654k998k081r88p82j215j410j155q97q04n59j08O6l67j023
63766B40323j189o42O2J01p85j893k152j264o9M16J11k32m4N49J106J342J186
63749B36926P70M07L49N01O27P55J055J418J521J395J442J782J997J782J503J788
63733B56018K733L769M231L897L069K313K054K382L154M156N034N297M782M080
63719C06969M034M757N492N545M938M056L109K210J591J322J091N64j57p69j211
63704C43541j604j930k114k288k629k987k965k430j705j266j333j659j684j058
63690C15889q9N79Q57J380K536L728M037L414K617K137J790J345J037J146J514
63675C43917J736J625J324J138J351J973K562K510J707P63M17Q19J535K055K132
$$ plain form
63783 259508 258734 257298 254644 251646 249565 248577 247795 246580 245170 244015 243118 242314 241755 241647 241713 241346 240323
63766 240323 239134 238492 238554 238655 237870 235977 233825 232561 232492 232908 233019 232787 232743 233292 234398 235740 236926
63749 236926 237696 238103 238452 238953 239580 240335 241390 242808 244329 245724 247166 248948 250945 252727 254230 256018
63733 256018 258751 262520 266751 270648 273717 276030 278084 280466 283620 287776 292810 298107 302889 306969
63719 306969 311003 315760 321252 326797 331735 335791 338900 341110 342701 344023 345114 345678 345521 344752 343541
63704 343541 341937 340007 337893 335605 332976 329989 327024 324594 322889 321623 320290 318631 316947 315889
63690 315889 315800 316379 317236 318616 321152 324880 328917 332331 334948 337085 338875 340220 341257 342403 343917
63675 343917 345653 347278 348602 349740 351091 353064 355626 358136 359843 360606 361023 361842 363377 365432 367564
63660C67564J688P34m94j501j904j939k317l399m663n261n029m518m103l545k633
63645C28680j727j327j396j581j754j919j782r84L78J853L208M438N351N703N631
63630C42772N500N288M794M326M531N391O162O535P114Q266R261R246Q640Q687
63616D36513R835J1305J2306J3000J4096J5938J8304K0747K2935K4721K6036K6772
63604F52508K6909K6776K6935K7479K7631K6521K4245K1692J9248J6294J2286
63593I08524P772L810P22j973m494o481p841r196j0985j2689j3602j4055j5091
63580H24421j7062j9255k0954k2096k2598k2013k0358j8601j7519j6510j4461
63569F12994j1487q894p420o430n041l251j594k97P73J799K971M437N957P016
$$ plain form
63660 367564 369252 369986 369492 367991 366087 364148 361831 358432 353769 348508 343479 338961 334858 331313 328680
63645 328680 326953 325626 324230 322649 320895 318976 317194 316210 316588 318441 321649 326087 331438 337141 342772
63630 342772 348272 353560 358354 362680 367211 372602 378764 385299 392413 400679 409940 419186 427826 436513
63616 436513 446348 457653 469959 482959 497055 512993 531297 552044 574979 599700 625736 652508
63604 652508 679417 706193 733128 760607 788238 814759 839004 860696 879944 896238 908524
63593 908524 916296 920106 920828 918855 914361 907880 900039 890843 879858 867169 853567 839512 824421
63580 824421 807359 788104 767150 745054 722456 700443 680085 661484 643965 627455 612994
63569 612994 601507 592613 585193 578763 573722 570471 568877 568580 569353 571152 574123 578560 584517 591533
63555E91533P590Q408J0127J2516J4795J6514J7880J9411K1514K4137K6664K8492
63543G99581K9790L1294L3100L4309L4170L3072L1729K9786K6029J9914J2365
63532A115139N015r40n274q471j1051j2952j3776j3691j3710j4726j6692j9079
63520I89792k1671k4403k6871k8733l0212l1558l2323l2025l1101l0305k9405
63509F71185k7676k5473k3953k3111k1512j8525j5459j3625j2488j0851q976q151
63497D61385q612r143q674p242n444l849k965k873k875k239j339j188j810j992
63483D01140j026K69P57N18M39Q36J321J743K456L554M447M490L727K820K307
63468D29798K113J678O12q47k125k947l453l683l412k696k156k265k580k224j076
$$ plain form
63555 591533 599123 607531 617658 630174 644969 661483 679363 698774 720288 744425 771089 799581
63543 799581 829371 860665 893765 928074 962244 995316 1027045 1056831 1082860 1102774 1115139
63532 1115139 1120154 1119214 1113940 1105469 1094418 1081466 1067690 1053999 1040289 1025563 1008871 989792
63520 989792 968121 943718 916847 888114 857902 826344 794021 761996 730895 700590 671185
63509 671185 643509 618036 594083 570972 549460 530935 515476 501851 489363 478512 469536 461385
63497 461385 452773 443630 434956 427714 422270 418421 415456 412583 409708 407469 406130 404942 403132 401140
63483 401140 400114 400383 401140 401658 402097 402933 404254 405997 408453 412007 416454 420944 424671 427491 429798
63468 429798 431911 433589 434201 433354 431229 428282 424829 421146 417734 415038 412882 410617 408037 405813 404737
63453D04737j2J53m57j024q46J97J716L066L783L962M135M717N699O901Q258R757
63437D54742J1313J2844J4306J5627J6831J8252K0177K2250K3729K4626K5923
63426F60620K8113K9994K9678K6732K2575J8849J6160J4374J3406J3320J4160
63415H87981J5992J8622K1273K3055K4000K4903K5890K5991K4647K2699K1019
63404A136072J8842J4735Q927L388o15l824p437j1224j3996j5362j6228j7682
63392A095596j9984k2644k5026k6822k8155k9311l0393l1238l1645l1454l0436
63381G88488k8439k5791k3288k1500k0191j8550j5993j2651r255o548m656k983
63369E98643q96J560L869N858P848R935J1711J2954J4188J6116J8767K1567K4027
$$ plain form
63453 404737 404725 404878 404421 403397 402551 402748 404464 407530 411313 415275 419410 424127 429826 436727 444985 454742
63437 454742 466055 478899 493205 508832 525663 543915 564092 586342 610071 634697 660620
63426 660620 688733 718727 748405 775137 797712 816561 832721 847095 860501 873821 887981
63415 887981 903973 922595 943868 966923 990923 1015826 1041716 1067707 1092354 1115053 1136072
63404 1136072 1154914 1169649 1178576 1181964 1181349 1177525 1170088 1158864 1144868 1129506 1113278 1095596
63392 1095596 1075612 1052968 1027942 1001120 972965 943654 913261 882023 850378 818924 788488
63381 788488 760049 734258 710970 689470 669279 650729 634736 622085 612830 606282 601626 598643
63369 598643 597747 599307 603176 609034 616882 626817 638528 651482 665670 681786 700553 722120 746147
63356G46147K6041K7694K9128L0490L1660L2237L2013L1318L0561K9629K8129
63345A075047K5983K3334K0002J5579J0172M537n74m881q371j1034j2969j4397
63333A122428j5544j6740j8516k1140k4000k6047k7017k7608k8264k8490k7787
63322H61275k6581k5532k4422k2555k0012j7637j5792j4056j2212j0763j0156
63311F61557j0239j0877j2412j4892j7387j8786j9014j8773j8312j7197j5279
63300D88389j3217j1760j0970j0377r578q502p392o656o460o395n898n038m443
63287C81703m337m120l265k138j537j702k227k687k911k809k378j890j660j634
63273C46408j530j251q88m29J10M39K96l6m4K59L75J75Q4L19N31N06P06J589K778
$$ plain form
63356 746147 772188 799882 829010 859500 891160 923397 955410 986728 1017289 1046918 1075047
63345 1075047 1101030 1124364 1144366 1159945 1170117 1174654 1174080 1169199 1160828 1149794 1136825 1122428
63333 1122428 1106884 1090144 1071628 1050488 1026488 1000441 973424 945816 917552 889062 861275
63322 861275 834694 809162 784740 762185 742173 724536 708744 694688 682476 671713 661557
63311 661557 651318 640441 628029 613137 595750 576964 557950 539177 520865 503668 488389
63300 488389 475172 463412 452442 442065 432487 423985 416593 409937 403477 397082 391184 386146 381703
63287 381703 377366 373246 369981 367843 366306 364604 362377 359690 356779 353970 351592 349702 348042 346408
63273 346408 344878 343627 342739 342310 342420 342859 343155 343119 343075 343334 343709 343884 343968 344287 344818 345324 346030 347619 350397
63254C50397L385L053K358K173K848L966M797N053N168N640O308O625O575O744
63240D15090P385Q042Q367Q690R414J0427J1549J2926J4426J5254J4960J4382
63228E50912J4679J5750J6556J6760J6987J7440J7501J6953J6544J6749J6926
63217G33757J6418J5750J5815J6315J5979J4252J1964J0188R008P616N335K312
63205H74709o69l027n016p314r988j2253j3466j3992j4630j5406j5534j4433j2364
63192G36617r990p746n711l761j672O54L002N090O988R056J1330J3388J4900J6030
63178G88175J7114J8158J8933J9375J9650J9857J9926J9731J9182J8188J6647
63167I94936J4550J1986R055N840K502o73l446n895q479j1589j5026j8066k0246
$$ plain form
63254 350397 353782 356835 359193 361366 364214 368180 372977 378030 383198 388838 395146 401771 408346 415090
63240 415090 422475 430517 438884 447574 456988 467415 478964 491890 506316 521570 536530 550912
63228 550912 565591 581341 597897 614657 631644 649084 666585 683538 700082 716831 733757
63217 733757 750175 765925 781740 798055 814034 828286 840250 850438 859446 867062 872397 874709
63205 874709 874040 871013 865997 858683 848695 836442 822976 808984 794354 778948 763414 748981 736617
63192 736617 726627 718881 713170 709409 707737 708391 711393 716483 723471 732527 743857 757245 772145 788175
63178 788175 805289 823447 842380 861755 881405 901262 921188 940919 960101 978289 994936
63167 994936 1009486 1021472 1030527 1036367 1038869 1038196 1034750 1028855 1020376 1008787 993761 975695 955449
63154I55449k1921k3813k6062k8006k9004k9104k8746k8068k6836k4976k2862
63143F66051k0960j9391j7956j6481j5037j3793j2683j1330r434p258n535m732
63131E11461m516m160l386k589k192k129k031j649q69M14K051L431L922L616L263
63116E04637L301L340K896K302K342L081L659L405K716K416K656K921K941K982
63102E45595L205L287L008K735K940L415L442K686J614R34Q89J206J494J635J860
63087E79945K482L347L730L041J640M90q1p10j768k369j401P07K125J714L57k12
63071E93037O80K342L930N242O426P516Q443R199R817J0406J1244J2571J4242
63058F95095J5802J7042J8274J9957K2228K4869K7524K9892L1913L3852L5972
$$ plain form
63154 955449 933528 909715 883653 855647 826643 797539 768793 740725 713889 688913 666051
63143 666051 645091 625700 607744 591263 576226 562433 549750 538420 528986 521728 516193 511461
63131 511461 506945 502785 499399 496810 494618 492489 490458 488809 487940 488354 490405 493836 497758 501374 504637
63116 504637 507938 511278 514174 516476 518818 521899 525558 528963 531679 534095 536751 539672 542613 545595
63102 545595 548800 552087 555095 557830 560770 564185 567627 570313 571927 572861 573750 574956 576450 578085 579945
63087 579945 582427 585774 589504 592545 594185 594675 594594 593884 592116 589747 588346 589053 591178 592892 593249 593037
63071 593037 593717 596059 599989 605231 611657 619173 627616 636815 646632 657038 668282 680853 695095
63058 695095 710897 727939 746213 766170 788398 813267 840791 870683 902596 936448 972420
63047I72420L8083L9721M0832M1894M3165M4282M4899M5310M5888M6273M5773
63036A448540M4400M2809M1171L8993L6213L3720L2201L1030K8903K5291K0685
63025A823956J5605J0020L791k870r607j6265k2773k8740l3437l6347l7762l8658
63013A626913l9660m0206l9158l6301l2673k9087k5072j9796j3598p636k306K989
63001A344409Q501J3520J7443K0590K3481K6025K8019K9804L1728L3378L4066
62990A610964L3866L3386L2654L1008K8224K5132K2739K1086J9260J6312J1987
62979A886618O641O69n852j2981k0481k7824l4671m0942m6348n0262n2505n3828
62967A548234n5066n5996n5728n4101n2015n0241m8538m6300m3548m0807l8276
$$ plain form
63047 972420 1010503 1050224 1091056 1132950 1176115 1220397 1265296 1310606 1356494 1402767 1448540
63036 1448540 1492940 1535749 1576920 1615913 1652126 1685846 1718047 1749077 1777980 1803271 1823956
63025 1823956 1839561 1849581 1853372 1850502 1840895 1824630 1801857 1773117 1739680 1703333 1665571 1626913
63013 1626913 1587253 1547047 1507889 1471588 1438915 1409828 1384756 1364960 1351362 1343726 1341420 1344409
63001 1344409 1352910 1366430 1383873 1404463 1427944 1453969 1481988 1511792 1543520 1576898 1610964
62990 1610964 1644830 1678216 1710870 1741878 1770102 1795234 1817973 1839059 1858319 1874631 1886618
62979 1886618 1893259 1893928 1888076 1875095 1854614 1826790 1792119 1751177 1704829 1654567 1602062 1548234
62967 1548234 1493168 1437172 1381444 1327343 1275328 1225087 1176549 1130249 1086701 1045894 1007618
62956A007618l5651l2723k9822k7485k5797k4268k2509k0911k0249k0523k0638
62945G27042j9658j8006j6812j6354j5901j5028j4162j3589j2822j1474j0102
62934E63134r470r355q811p466n930m953m635m590m554m596m801m874m294l024
62920D81781j861j666k231k534k129j686j831k174k005j391r39q29q24q89j119
62905D57673j191o74J00K11o94j995k915l156k697j538L6J407K135K265J982J345
62889D52294M84l12q58j092q38J5R54J021n1j240j224J66J774K376J806Q79L64
62872D56518J59m33j601k522k268j027N4K37j69n21p11j007j505k032k337k197
62856D38638j587q25k74J73Q40J472J342M29k89j24L69M09K86P83J703K021J408
$$ plain form
62956 1007618 971967 939244 909422 881937 856140 831872 809363 788452 768203 747680 727042
62945 727042 707384 689378 672566 656212 640311 625283 611121 597532 584710 573236 563134
62934 563134 553664 544309 535498 528032 522102 517149 512514 507924 503370 498774 493973 489099 484805 481781
62920 481781 479920 478254 476023 473489 471360 469674 467843 465669 463664 462273 461334 460505 459681 458792 457673
62905 457673 456482 455808 455908 456119 455425 453430 450515 447359 444662 443124 443160 444567 446702 448967 450949 452294
62889 452294 452778 452466 451608 450516 449678 449693 450647 451668 451617 450377 449153 449319 451093 453469 455275 456154 456518
62872 456518 456677 456244 454643 452121 449853 448826 448880 449117 448948 448427 447716 446709 445204 443172 440835 438638
62856 438638 437051 436226 435952 436125 436965 438437 439779 440208 439919 439795 440164 440573 440859 441642 443345 445366 446774
62839D46774O14K69J29j58m12m39n34r72j407j337q03k30K48P76J329J679J777
62822D47303J748J597J276J053J346K088K616K468K005J965K532L147L292L110
62808D77546L102L398L658L648L582L737M020M207M505N411O926Q248Q576Q055
62794E48619P638Q082R362J1041J2821J4592J6239J7783J9527K1806K4566K7488
62782G39564L0456L3622L6952M0072M2788M5460M8537N1932N5061N7388N8665
62771A240497N8792N7822N6050N3762N0887M7035M1886L5349K7567J9094J0797
62760A699538L039m926j4028k3782l2351l8526m2933m6869n0624n3603n5540n6690
62748A282705n7028n6150n4115n1602m9150m6675m3913m0851l7628l4448l1731
$$ plain form
62839 446774 447388 447657 447786 447628 447216 446777 446243 445271 443864 442527 441724 441494 441742 442518 443847 445526 447303
62822 447303 449051 450648 451924 452977 454323 456411 459027 461495 463500 465465 467997 471144 474436 477546
62808 477546 480648 484046 487704 491352 494934 498671 502691 506898 511403 516814 523740 531988 540564 548619
62794 548619 556257 564339 573701 584742 597563 612155 628394 646177 665704 687510 712076 739564
62782 739564 770020 803642 840594 880666 923454 968914 1017451 1069383 1124444 1181832 1240497
62771 1240497 1299289 1357111 1413161 1466923 1517810 1564845 1606731 1642080 1669647 1688741 1699538
62760 1699538 1702577 1697651 1683623 1659841 1627490 1588964 1546031 1499162 1448538 1394935 1339395 1282705
62748 1282705 1225677 1169527 1115412 1063810 1014660 967985 924072 883221 845593 811145 779414
62737G79414k9815k8341k6398k3545k0335j7541j5288j3328j1762j0928j0702
62726E71431j0352r137o903m165j823n60k37J0R23K408L927N346O987Q934J0724
62711E77513J1924J2768J3997J6164J9096K2029K4341K6258K8674L2114L6048
62700H20926L9582M2672M6095N0166N4050N6714N8235N9651O1703O4028O5564
62689A419386O5445O3522O0236N6052N0952M4599L7017K8763K0167J0816L19j0669
62677A846605k0951l0164l8910m7291n4273n9040o2198o4798o6698o6912o5364
62666A270006o3169o1050n8495n4926n0912m7503m4876m2282l9167l5714l2437
62655G39475k9641k7308k5173k2901k0451j8129j6156j4369j2605j1137j0326
$$ plain form
62737 779414 749599 721258 694860 671315 650980 633439 618151 604823 593061 582133 571431
62726 571431 561079 551942 545039 540874 539051 538491 538254 538264 539187 541595 545522 550868 557855 566789 577513
62711 577513 589437 602205 616202 632366 651462 673491 697832 724090 752764 784878 820926
62700 820926 860508 903180 949275 999441 1053491 1110205 1168440 1228091 1289794 1353822 1419386
62689 1419386 1484831 1548353 1608589 1664641 1715593 1760192 1797209 1825972 1846139 1856955 1857274 1846605
62677 1846605 1825654 1795490 1756580 1709289 1655016 1595976 1533778 1468980 1402282 1335370 1270006
62666 1270006 1206837 1145787 1087292 1032366 981454 933951 889075 846793 807626 771912 739475
62655 739475 709834 682526 657353 634452 614001 595872 579716 565347 552742 541605 531279
62644E31279j0009r687r194q745q315p531o296n099m414m115l735l097k405j824
62630D46813j297p48k96j69m16q03j052j111j107j031p38l41k61o02p82k77N32
62613D36314Q07N39P06J963L787N212N988O503O987P346P665Q291R347J0493J1370
62598E23318J2019J2838J4176J6050J8126J9961K1340K2426K3527K4790K6094
62587G34665K7158K7638K7258K5974K4026K1741J9213J6182J2209P141J542l502
62575I41245p337j0403j3604j7052j9913k1577k2477k3408k4477k5241k5491k5351
62563G04914k4735k3332k1259j9268j8058j7610j7295j6438j4815j2715j0654
62552E08735q878p262n751m696m469m863n226n101m482l558k584j907j681j583
$$ plain form
62644 531279 521270 511583 502389 493644 485329 477798 471502 466403 461989 457874 454139 451042 448637 446813
62630 446813 445516 444768 444472 444303 443887 443084 442032 440921 439814 438783 438045 437704 437443 436841 436059 435782 436314
62613 436314 437121 437660 438366 440329 444116 449328 455316 461819 468806 476152 483817 492108 501455 511948 523318
62598 523318 535337 548175 562351 578401 596527 616488 637828 660254 683781 708571 734665
62587 734665 761823 789461 816719 842693 866719 888460 907673 923855 936064 943205 944747 941245
62575 941245 933908 923505 909901 892849 872936 851359 828882 805474 780997 755756 730265 704914
62563 704914 680179 656847 635588 616320 598262 580652 563357 546919 532104 519389 508735
62552 508735 499857 492595 486844 482148 477679 472816 467590 462489 458007 454449 451865 449958 448277 446694
62538D46694j201o50k99K4Q96K258L243L373L301L847M876N676O045O328O716
62523D91127P175Q003R673J2055J4380J6138J7633J9493K1923K4563K6891K8718
62511F97772L0469L2783L5553L7674L8273L7908L7782L7897L6985L4462L1395
62500A088953K8945K6701K3420J8846J3816Q987M371N2l639o684r313j1216j1563
62487A171676j0077p423m235m76L919Q425J2492J6182J9694K2710K4815K6193
62475A283895K7294K8036K7918K6712K4367K0511J4851Q055J371m845j1371j8674
62463A428120k5964l2223l7539m2665m7642n1559n3628n3885n2920n1350m9593
62452I29152m7686m5222m1838l7900l4299l1440k8723k5265k1037j7065j4441
$$ plain form
62538 446694 445493 444843 444544 444568 445464 447722 450965 454338 457639 461486 466362 472038 478083 484411 491127
62523 491127 498302 506305 515978 528033 542413 558551 576184 595677 617600 642163 669054 697772
62511 697772 728241 761024 796577 834251 872524 910432 948214 986111 1023096 1057558 1088953
62500 1088953 1117898 1144599 1168019 1186865 1200681 1209668 1214039 1214091 1210452 1203768 1194455 1183239 1171676
62487 1171676 1161599 1154176 1149941 1149465 1153384 1161809 1174301 1190483 1210177 1232887 1257702 1283895
62475 1283895 1311189 1339225 1367143 1393855 1418222 1438733 1453584 1461639 1463010 1458165 1446794 1428120
62463 1428120 1402156 1369933 1332394 1289729 1242087 1190528 1136900 1083015 1030095 978745 929152
62452 929152 881466 836244 794406 756506 722207 690767 662044 636779 615742 598677 584236
62441E84236j3214j2295j0547q004n792m826m769m508l451k004q95m61o08j084
62427E11778j654k235k919l697m231m250m093m366n040n433n270n107n385n672
62413D52426n355m588l876l143k054j003q45j588k245k236k062k279k564k414
62399D16174k089k123k324k042j206l02N43J643K872L530L341K952L031L414L575
62384D30989L477L432L419L180K850K962L757M877N889O672P274P710Q083Q646
62370E03217R543J0640J1700J2630J3475J4341J5459J7036J8958K0809K2504K4658
62358F94970K8007L2472L7062M0725M3128M4617M5769M7014M8498M9968N0793
62347A163023N0219M7717M3226L7235L0543K3779J7051J0149L071l817j0097j5590
$$ plain form
62441 584236 571022 558727 548180 540176 534384 529558 524789 520281 516830 514826 513931 513470 512862 511778
62427 511778 510124 507889 504970 501273 497042 492792 488699 484333 479293 473860 468590 463483 458098 452426
62413 452426 447071 442483 438607 435464 433410 432407 431562 429974 427729 425493 423431 421152 418588 416174
62399 416174 414085 411962 409638 407596 406390 406088 406631 408274 411146 414676 418017 420969 424000 427414 430989
62384 430989 434466 437898 441317 444497 447347 450309 454066 458943 464832 471504 478778 486488 494571 503217
62370 503217 512760 523400 535100 547730 561205 575546 591005 608041 626999 647808 670312 694970
62358 694970 722977 755449 792511 833236 876364 920981 966750 1013764 1062262 1112230 1163023
62347 1163023 1213242 1260959 1304185 1341420 1371963 1395742 1412793 1422942 1426013 1422196 1412099 1396509
62335A396509k0297k4301k7829l1175l4371l7089l8977l9979m0153l9418l7732
62324A025188l5396l2975l0944k9537k8703k7970k6597k4310k1798k0084j9443
62313G27431j9292j9085j8790j8438j7787j6672j5303j3951j2660j1464j0516
62302E53473r764q865p677o503n495m305k755j455j111j516j811j598j158p21
62288D98739k09L38P48J204K008K830K954K505K595L755M984N031M102L508L971
62273E39063N006N872O373O660O883P296Q239R750J1413J2822J4080J5747J8289
62260F67493K1618K5084K8099L0750L3626L6894L9925M2120M3805M5809M8295
62249A063518N0464N1420N0859M8871M5487M0681L4571K7414J9607J1698M144
$$ plain form
62335 1396509 1376212 1351911 1324082 1292907 1258536 1221447 1182470 1142491 1102338 1062920 1025188
62324 1025188 989792 956817 925873 896336 867633 839663 813066 788756 766958 746874 727431
62313 727431 708139 689054 670264 651826 634039 617367 602064 588113 575453 563989 553473
62302 553473 543709 534844 527167 520664 515169 510864 508109 506654 505543 504027 502216 500618 499460 498739
62288 498739 498530 498868 499616 500820 502828 505658 508612 511117 513712 517467 522451 527482 531584 535092 539063
62273 539063 544069 549941 556314 562974 569857 577153 585392 595142 606555 619377 633457 649204 667493
62260 667493 689111 714195 742294 773044 806670 843564 883489 925609 969414 1015223 1063518
62249 1063518 1113982 1165402 1216261 1265132 1310619 1351300 1385871 1413285 1432892 1444590 1448734
62238A448734l020j0063j7029k3552k9273l4188l8467m2105m4973m7023m8286
62227A110755m8697m8069m6314m3663m0689l7959l5564l3078l0131k6857k3667
62216F96067k0734j8005j5521j3412j1653j0203r242q783q258p005n188l607k520
62203E61936j370J33J467K215K901M215N959P365Q240R064J0142J1192J1798J1808
62189F47065J1378J0915J0836J1056J0958J0234R366Q848Q383P488O519O211O465
62176G65722O547O364O449O646O058M687L952M918O979R095J1456J4830J8900
62163H72603K2444K4959K6958K8780L0148L1044L1989L3060L3406L2112K9058
62152A196561K4615J9063J2786O528R45l959q585j3084j7244k0888k4077k6984
$$ plain form
62238 1448734 1445714 1435651 1418622 1395070 1365797 1331609 1293142 1251037 1206064 1159041 1110755
62227 1110755 1062058 1013989 967675 924012 883323 845364 809800 776722 746591 719734 696067
62216 696067 675333 657328 641807 628395 616742 606539 597297 588514 580256 573251 568063 564456 561936
62203 561936 560566 560699 562166 564381 567282 571497 577456 584821 593061 602125 612267 623459 635257 647065
62189 647065 658443 669358 680194 691250 702208 712442 721808 730656 739039 746527 753046 759257 765722
62176 765722 772269 778633 785082 791728 797786 802473 806425 811343 818322 827417 838873 853703 872603
62163 872603 895047 920006 946964 975744 1005892 1036936 1068925 1101985 1135391 1167503 1196561
62152 1196561 1221176 1240239 1253025 1259553 1260498 1256539 1247954 1234870 1217626 1196738 1172661 1145677
62140A145677k9643l1771l2805l2376l0875k9245k8047k6876k4929k1956j8494
62129H38660j5307j2794j0817q990p154n528m320l297k089q07J05O97J584K965
62115G72908M200M729M866N174N541N496N095M750M402L589K229O57r78k526l239
62100H16893k354n09M84k61j672k328k294k498k975k847j734j95J337L051M977
62085H07075O513P268P796Q913J0581J2045J2894J3556J4661J6330J8209J9892
62073I55733K1144K1968K2600K3339K4148K4607K4467K4148K4351K5139K5883
62062A217527K6105K5986K5843K5582K5069K4620K4538K4403K3417K1333J8491
62051A482914J4994J0605N508M45m161q619j3270j7903k2222k6318l0289l3885
$$ plain form
62140 1145677 1116034 1084263 1051458 1019082 988207 958962 930915 904039 879110 857154 838660
62129 838660 823353 810559 799742 790752 783598 778070 773750 770453 768364 767557 767662 768359 769943 772908
62115 772908 777108 781837 786703 791877 797418 802914 808009 812759 817161 820750 822979 823636 822658 820132 816893
62100 816893 814539 814030 814514 814253 812581 810253 807959 805461 802486 799639 797905 797710 799047 802098 807075
62085 807075 813588 820856 828652 837565 848146 860191 873085 886641 901302 917632 935841 955733
62073 955733 976877 998845 1021445 1044784 1068932 1093539 1118006 1142154 1166505 1191644 1217527
62062 1217527 1243632 1269618 1295461 1321043 1346112 1370732 1395270 1419673 1443090 1464423 1482914
62051 1482914 1497908 1508513 1514021 1514466 1510305 1501686 1488416 1470513 1448291 1421973 1391684 1357799
62039A357799l6924l9630m2069m3781m4431m4369m3924m2639m0005l6699l4147
62028I09181l2845l1876l0133k7484k4549k1908j9754j7951j6250j4677j3621
62017F58133j3314j3328j3043j2456j1995j1659j0966r781q552p538o399m832
62005E34270l139j858j122o12L6R18J787K271K287K202K286K309K023J750J836
61990E47244J765O09j571l589m597m968n414n920n992n490m786m477n031o362
61976D91421p556p601o547n395m739m254l671l273l043k317r99j37m40r96n62
61961D39891N38J056R19J289K533L519L330K610K569L399M290M631M587M687N185
61946D85033N888O454O833P381Q396R707J0867J1686J2358J3237J4577J6250J7536
$$ plain form
62039 1357799 1320875 1281245 1239176 1195395 1150964 1106595 1062671 1020032 980027 943328 909181
62028 909181 876336 844460 814327 786843 762294 740386 720632 702681 686431 671754 658133
62017 658133 644819 631491 618448 605992 593997 582338 571372 561591 553039 545501 539102 534270
62005 534270 531131 529273 528151 527539 527575 528493 530280 532551 534838 537040 539326 541635 543658 545408 547244
61990 547244 549009 549618 548047 544458 539861 534893 529479 523559 517567 512077 507291 502814 497783 491421
61976 491421 483865 476264 469717 464322 459583 455329 451658 448385 445342 443025 442026 441889 441449 440453 439891
61961 439891 440429 441485 442404 443693 446226 449745 453075 455685 458254 461653 465943 470574 475161 479848 485033
61946 485033 490921 497375 504208 511589 519985 529692 540559 552245 564603 577840 592417 608667 626203
61933F26203J7632J6670J5817J5873J6264J6021J5259J4749J4389J3151J0715
61922G92743Q083O201M816L208J454K58j57m26j283k730l955l988k569l71J707
61907H02991L363M820O181P328Q318R381J0375J0712R920Q011N287K195o51k836
61893H85395m618o620q971j1166j2828j4118j5246j6084j6413j6212j5511j4488
61881G33120j3716j3753j4244j4112j2945j1561j0821j0502r965r344r273r710
61869E93174r854r220q141p083n990m493k471j72K025L829N197O324P462Q769
61855E79356J0318J2161J4228J6278J8085J9619K1027K2458K3942K5333K6408
61844G89213K7097K7583K7906K7613K6086K3337K0184J7469J5276J3045J0287
$$ plain form
61933 626203 643835 660505 676322 692195 708459 724480 739739 754488 768877 782028 792743
61922 792743 800826 807027 811843 815051 816505 816763 816606 816180 814897 812167 808212 804224 801655 801284 802991
61907 802991 806354 811174 817355 824683 833001 842382 852757 863469 873389 881400 886687 888882 888231 885395
61893 885395 880777 874157 865186 854020 841192 827074 811828 795744 779331 763119 747608 733120
61881 733120 719404 705651 691407 677295 664350 652789 641968 631466 621501 612157 602884 593174
61869 593174 583320 574100 565959 558876 552886 548393 545922 545750 547775 551604 556801 563125 570587 579356
61855 579356 589674 601835 616063 632341 650426 670045 691072 713530 737472 762805 789213
61844 789213 816310 843893 871799 899412 925498 948835 969019 986488 1001764 1014809 1025096
61833A025096P144M242K021K43j592l202l456j771Q65K958M296N764P576Q753
61819A058937Q589P568O387M993L164J097j216m454q927j3737j7791k1107k4191
61806I99312k6696k7822k7779k7684k7987k8032k7328k6246k5194k3899k2010
61795G08635j9791j7808j6337j5356j4755j4240j3383j2044j0548r261q187p145
61783E49780o121n303m888m882m977m705l965l237l025l216l302l061k573j790
61769D94735o83K44K80n25j315j467j174q44m68J17Q71J702K538K987K462J067
61753E00527j76m35j6K40J43J59M40N42J41n04q55o28K5N49L34o51j603j652q92
61734D95688k74m05q86j033q27p13p18k87R08K433L543L956L879L495K843K104
$$ plain form
61833 1025096 1032240 1036482 1038503 1038746 1037154 1033952 1030496 1028725 1029590 1032548 1036844 1042608 1050184 1058937
61819 1058937 1067526 1075094 1081481 1086474 1089638 1090735 1089519 1085065 1076138 1062401 1044610 1023503 999312
61806 999312 972616 944794 917015 889331 861344 833312 805984 779738 754544 730645 708635
61795 708635 688844 671036 654699 639343 624588 610348 596965 584921 574373 565112 556925 549780
61783 549780 543659 538356 533468 528586 523609 518904 514939 511702 508677 505461 502159 499098 496525 494735
61769 494735 494052 494296 494576 494051 492736 491269 490095 489251 488783 488900 489771 491473 494011 496998 499460 500527
61753 500527 500351 499916 499900 500140 500283 500442 500882 501424 501565 501061 500206 499578 499603 500152 500486 499835 498232 496580 495688
61734 495688 495414 495009 494123 493090 492263 491550 490832 490545 491453 493886 497429 501385 505264 508759 511602 513706
61718E13706J655J613J745J950K492L360L799L078J576M29J00j22r62k131k870
61703E29418k992k884k774k616k504k656k970l158l279l697m352m587m004l074
61689D83871k571k589k538k010j362j276j976k929l341k925k144j669j570j301
61675D53670n45J90J46o37j336j429j304j529j879j615o83ml89j495k236k067
61659D36858j476j183j204r78k27O06Q94N63J32J02M70R16J224J430J604J723
61643D41454J744J713J742J921K246K585K707K422J753R55L88K70M33L49m14j688
61627D60580k785l124k680j779q15k23k89p34q26k99J95n0q17j477k095l148m324
61610D35310m559l526k258j896k518l507m402m925m824m298m120m723n566n846
$$ plain form
61718 513706 515361 516974 518719 520669 523161 526521 530320 533398 534974 535403 535503 535381 534419 532288 529418
61703 529418 526426 523542 520768 518152 515648 512992 510022 506864 503585 499888 495536 490949 486945 483871
61689 483871 481300 478711 476173 474163 472801 471525 469549 466620 463279 460354 458210 456541 454971 453670
61675 453670 453125 453315 453461 452824 451488 450059 448755 447226 445347 443732 443049 443045 442656 441161 438925 436858
61659 436858 435382 434199 432995 432017 431790 432396 433290 433853 433985 434087 434557 435473 436697 438127 439731 441454
61643 441454 443198 444911 446653 448574 450820 453405 456112 458534 460287 461242 461630 461900 462333 462682 462268 460580
61627 460580 457795 454671 451991 450212 449397 449174 448885 448151 447325 447026 447221 447171 446354 444877 442782 439634 435310
61610 435310 430751 427225 424967 423071 420553 417046 412644 407719 402895 398597 394477 389754 384188 378342
61596C78342n488m909m316l802l674m016m299m097l793l867l914l239k123j549
61582C25256j785k150k132j833j364p56n00j141k175k348j385m62n24j111j344
61567C04246j174r33n04K70R13Q64L17j87n71r54j045o13j82l77q20n55N01J423
61549C00619J620J437J314J171R72J113J643J819R96k58o89J68J512K306K313
61534C18056J991J820J984K430K867K765J783K73q67j088o98l61l28m21n32p32
61518C28942r60j075j164j432j760j790j533j361j290q64NO25M12k74o61n95m82
61501C14743m82l83j59m5j29l32q30j833k940l238k340q93K16P43R62J002P73
61484C04835L77J38K24N12Q44J181J440J462J222R60R48J205J584K010K414K557
$$ plain form
61596 378342 372854 367945 363629 359827 356153 352137 347838 343741 339948 336081 332167 328928 326805 325256
61582 325256 323471 321321 319189 317356 315992 315236 314736 313595 311420 309072 307687 307225 306701 305590 304246
61567 304246 303072 302139 301635 301905 302818 303682 303999 303812 303241 302287 301242 300629 300447 300070 299250 298695 299196 300619
61549 300619 302239 303676 304990 306161 307133 308246 309889 311708 312704 312446 311757 311925 313437 315743 318056
61534 318056 320047 321867 323851 326281 329148 331913 333696 333969 333102 332014 331316 330955 330627 330206 329674 328942
61518 328942 327982 326907 325743 324311 322551 320761 319228 317867 316577 315713 315718 316343 316755 316481 315820 315225 314743
61501 314743 314261 313878 313719 313674 313545 313213 312383 310550 307610 304372 302032 301139 301355 302098 303060 304062 304835
61484 304835 305212 305350 305574 306086 306930 308111 309551 311013 312235 313195 314143 315348 316932 318942 321356 323913
61468C23913K189J461Q51N88M10N8k99m50n91r23j052m32O45J177P20m5l24j74
61450C27722r8j06J89Q23J334J431J335J420J694J755J272N27L09R89J829J755
61434C44180Q72M54J200K240K523K484L343N081O187N545L719K054J223J031J127
61419C83263J301J315R20J76m29l16O58J914K551K168J220M49J27O6R0J44R0j85
61401C95522n44q40j251j950k586k591j998j425j174q69j71O16Q87M02o07j617
61385C79804k024j518m31N02Q89R14Q51P33N97N74N67K61k91n01j6P42J120J009
61367C83782P52N73M98N81Q47J153J422J820K449L061L425L661L897L885L465
61352D15271L140L600M725N708O184O588P243P751P636P137O856O899O848O463
$$ plain form
61468 323913 326102 327563 328414 329002 329412 329470 329171 328721 328130 327207 326155 325723 326368 327545 328265 328220 327896 327722
61450 327722 327624 327518 327707 328530 329864 331295 332630 334050 335744 337499 338771 339298 339607 340596 342425 344180
61434 344180 345052 345506 346706 348946 351469 353953 357296 362377 368564 374109 377828 379882 381105 382136 383263
61419 383263 384564 385879 386799 386975 386546 386230 386888 388802 391353 393521 394741 395190 395317 395383 395473 395617 395707 395522
61401 395522 394978 394138 392887 390937 388351 385760 383762 382337 381163 380294 380123 380739 381626 382028 381421 379804
61385 379804 377780 376262 375831 376333 377222 378136 378987 379720 380317 380891 381458 381719 381428 380927 380911 381653 382773 383782
61367 383782 384534 385107 385605 386186 387033 388186 389608 391428 393877 396938 400363 404024 407921 411806 415271
61352 415271 418411 422011 426736 432444 438628 445216 452459 460210 467846 474983 481839 488738 495586 502049
61338E02049N972N640N400N018M427L728L004K294J684J281J066Q40M15j67o49
61323E42002q48q69r91j340j734j870j613j047l26M89J336J997K246K243K626
61308E42301L871N608O827O939O398O076O318O844P338P683P666O987N746M442
61294F31044L303J942L7j992l429m175m726n355n817n933n883n775n415m785m287
61279E78754m123l906l319k786k863l249l059k008n63R82K799M701N821N598M579
61264E77358L761L537L729M208M906N495N609N321N080N233N869O861P716P717
61250F52400O680N321M472M137L787L261K719J999P72o75j576j757j911k590l487
61235F73552l931l653k897k131j792j916j969j439o09j27P7P23J953L020L486
$$ plain form
61338 502049 508021 513661 519061 524079 528506 532234 535238 537532 539216 540497 541563 542403 542818 542651 542002
61323 542002 541154 540285 539294 537954 536220 534350 532737 531690 531364 531853 533189 535186 537432 539675 542301
61308 542301 546172 551780 558607 565546 571944 578020 584338 591182 598520 606203 613869 620856 626602 631044
61294 631044 634347 636289 636326 634334 630905 626730 622004 616649 610832 604899 599016 593241 587826 583041 578754
61279 578754 574631 570725 567406 564620 561757 558508 555449 553441 552878 553860 556659 561360 567181 572779 577358
61264 577358 581119 584656 588385 592593 597499 602994 608603 613924 619004 624237 630106 636967 644683 652400
61250 652400 659080 664401 668873 673010 676797 680058 682777 684776 685548 684873 683297 681540 679629 677039 673552
61235 673552 669621 665968 663071 660940 659148 657232 655263 653824 653215 653088 653165 653888 655841 658861 662347
61220F62347L805M310M511M053L541L599L740L144K099J678K244L164L804L952
61206G09991L417K216J116J014J671J991J603J233J343J499J629K690N230Q157
61192G44800J0011J0881J1922J3333J4137J3926J3557J3662J3553J2337J0372
61181H82491Q713P562O205M402K849K129J868J413P38J87l26j245k631m030n106
61166I05219n977o829p604q209q730r301r997j0920j2126j3316j3924j3689j2868
61153G71729j1809j0662r644r075q839q229o814n160m187m000l889l343k609k304
61139F81165k887m342o051p057o967o398o051n617m368k592j447j189n95J353
61125F26957L999N909O672P050P804R185J1256J3897J6407J7902J8330J8615J9606
$$ plain form
61220 662347 666152 670462 674973 679026 682567 686166 689906 693050 695149 696827 699071 702235 706039 709991
61206 709991 713408 715624 716740 717754 719425 721416 723019 724252 725595 727094 728723 731413 736643 744800
61192 744800 754811 765692 777614 790947 805084 819010 832567 846229 859782 872119 882491
61181 882491 891204 898766 904971 909373 912222 914351 916219 917632 918370 918557 918231 916986 914355 910325 905219
61166 905219 899242 892413 884809 876600 867870 858569 848572 837652 825526 812210 798286 784597 771729
61153 771729 759920 749258 739614 730539 721700 713471 706657 701497 697310 693310 689421 686078 683469 681165
61139 681165 678278 673936 667885 660828 653861 647463 641412 635795 631427 628835 627388 626199 625604 626957
61125 626957 630956 636865 643537 650587 658391 667576 678832 692729 709136 727038 745368 763983 783589
61112G83589K1194K2717K3854K4842K5847K6477K6120K4763K3221K2279K1735
61101A046638K0724J8929J6901J4942J2487R100N493K645L13k621o407j0033j2707
61088A116404j4784j6842j8664j9808k0472k1150k1802k2032k1862k1696k1657
61077H95635k1510k1150k0608j9634j7897j5726j4041j3317j3014j2294j0967
61066G15477r409p905o474n190m211l409k374r64M38J405K085L057M593O242P302
61051G00663P600P684Q284R660J1455J3112J4385J5512J6901J8647K0417K1837
61039H66157K2948K4199K5960K8062K9883L0962L1608L2695L4668L6876L8349
61028A202367L9131M0316M2598M5372M7808N0114N3085N6737O0309O3445O6508
$$ plain form
61112 783589 804783 827500 851354 876196 902043 928520 954640 979403 1002624 1024903 1046638
61101 1046638 1067362 1086291 1103192 1118134 1130621 1139721 1145214 1147859 1148172 1145551 1139144 1129111 1116404
61088 1116404 1101620 1084778 1066114 1046306 1025834 1004684 982882 960850 938988 917292 895635
61077 895635 874125 852975 832367 812733 794836 779110 765069 751752 738738 726444 715477
61066 715477 706068 698163 691689 686499 682288 678879 676505 675541 675979 677384 679469 682526 687119 693361 700663
61051 700663 708263 715947 724231 733891 745346 758458 772843 788355 805256 823903 844320 866157
61039 866157 889105 913304 939264 967326 997209 1028171 1059779 1092474 1127142 1164018 1202367
61028 1202367 1241498 1281814 1324412 1369784 1417592 1467706 1520791 1577528 1637837 1701282 1767790
61017A767790O9842P3630P8616Q5913R5913J08246J23171J41914J65182J92511
61007B902728K23849K60899L05939L60188M24185M98785N84384O79429P80367
60998G020753Q82222R78815J065067J141884J217237J298679J385072J468591
60990A6458320J541817J592851J589386J479753J229132Q63009M67601J37346
60982B5359215q1299j97885k44290k49955k51407l05446m66920p42775j073946
60973B1745292j370891j569455j656022j650934j581139j469200j335232j196516
60965I915903j063317r39025q24952p22699o32591n53194m83452m23397l72300
60956C900976l28019k88843k54559k25132j99757j77846j59442j43848j29113
$$ plain form
61017 1767790 1837632 1911262 1989878 2075791 2171704 2279950 2403121 2545035 2710217 2902728
61007 2902728 3126577 3387476 3693415 4053603 4477788 4976573 5560957 6240386 7020753
60998 7020753 7902975 8881790 9946857 11088741 12305978 13604657 14989729 16458320
60990 16458320 18000137 19592988 21182374 22662127 23891259 24754268 25221869 25359215
60982 25359215 25277916 25080031 24835741 24585786 24334379 24028933 23562013 22819238 21745292
60973 21745292 20374401 18804946 17148924 15497990 13916851 12447651 11112419 9915903
60965 9915903 8852586 7913561 7088609 6365910 5733319 5180125 4696673 4273276 3900976
60956 3900976 3572957 3284114 3029555 2804423 2604666 2426820 2267378 2123530 1994417
60947A994417j13977r9419q7215p7692o9812o2884n7110n2712m9459m6921m4572
60936A232644m1790l8348l4821l2040l0180k8698k6995k4914k2757k0991j9743
60925I11367j8429j6361j3839j2088j1732j1915j1394j0008q494p312o391n671
60913G77733n149m503l396k126j334j017m26R24K676M217N419O525P604Q466Q964
60898H04577R297R913J1136J2754J4127J4839J5184J5708J6398J6701J6344J5844
60886I72822J5937J6631J7103J6635J5439J4403J4015J3764J2847J1145R242P579
60874A137562O056M449K748R01j334l981o568q536r804j0731j1707j2895j4172
60861A071988j5176j5620j5650j5691j5954j6342j6826j7402j7679j7171j6171
$$ plain form
60947 1994417 1880440 1781021 1693806 1616114 1546302 1483418 1426308 1373596 1324137 1277216 1232644
60936 1232644 1190854 1152506 1117685 1085645 1055465 1026767 999772 974858 952101 931110 911367
60925 911367 892938 876577 862738 850650 838918 827003 815609 805601 797107 789795 783404 777733
60913 777733 772584 768081 764685 762559 761225 760208 759782 760706 763382 767599 773018 779543 787147 795613 804577
60898 804577 813874 823787 834923 847677 861804 876643 891827 907535 923933 940634 956978 972822
60886 972822 988759 1005390 1022493 1039128 1054567 1068970 1082985 1096749 1109596 1120741 1129983 1137562
60874 1137562 1143618 1148067 1150815 1151716 1150382 1146401 1139833 1131297 1121493 1110762 1099055 1086160 1071988
60861 1071988 1056812 1041192 1025542 1009851 993897 977555 960729 943327 925648 908477 892306
60850H92306j5692j6172j6827j6770j6137j5590j5234j4783j4314j4122j4026
60839G22639j3675j3324j3573j4319j4716j4244j3266j2402j1889j1677j1643
60828E77911j1573j1296j0860j0297r266p444n230l523k744k537k458k484k639
60815D95560k662k347j868j551j470j429j205p23j76J54K76N17Q92Q35L6q20q35
60798D83184k17rm79p43j95N73P93O39P07Q86N48m34j468j989j923j525j183j329
60780D75836k125l108l512l081k406k311k973l782m046l795l641l868l998l530
60766D29660k721k220k087j874j547j575j910j659k33J670K776K511J268k22j242
60751D20595j259l77M79M39k91p26l65L92J036J561K085K383K169J587J065P69
$$ plain form
60850 892306 876614 860442 843615 826845 810708 795118 779884 765101 750787 736665 722639
60839 722639 708964 695640 682067 667748 653032 638788 625522 613120 601231 589554 577911
60828 577911 566338 555042 544182 533885 524619 517175 511945 508422 505678 503141 500683 498199 495560
60815 495560 492898 490551 488683 487132 485662 484233 483028 482305 482129 482283 482559 483076 483968 484803 484839 484019 483184
60798 483184 482967 482958 482479 481736 481541 482114 482907 483546 484253 485139 485687 485253 483785 481796 479873 478348 477165 475836
60780 475836 473711 470603 467091 464010 461604 459293 456320 452538 448492 444697 441056 437188 433190 429660
60766 429660 426939 424719 422632 420758 419211 417636 415726 414067 413834 415504 418280 420791 422059 421837 420595
60751 420595 419336 418959 419438 419877 419586 418860 418495 418887 419923 421484 423569 425952 428121 429708 430773 431542
60735D31542M49j92j136k116k853l178l017k428j725j378j597k078k412k608k951
60720D02322l352l336k861k673l373m445m774m031k992k444k340k227k001j847
60706C59626j736j509j320j486j862j847j215n18l38m46j91M55P78L74k52l77
60690C48136k0K61K45L12Q00J486J867J761J514J642K320L169L622L511L181L001
60674C76808K974K970L057L313L529L434L139L028L222L414L279K795K160J666
60660D18788J559J820K065J876J245N28O7LL78R98J387J180N81J29M5J15J13o1
60642D32816n53j441k414l005l217l478l919m115l732l043k607k671l010l208
60628C92403l004k558k266k135j626n72J70l25j552j955q89O44J460J514J398
$$ plain form
60735 431542 431991 431799 430663 428547 425694 422516 419499 417071 415346 413968 412371 410293 407881 405273 402322
60720 402322 398970 395634 392773 390100 386727 382282 377508 373477 370485 368041 365701 363474 361473 359626
60706 359626 357890 356381 355061 353575 351713 349866 348651 348133 347795 347349 347158 347613 348391 348765 348513 348136
60690 348136 348116 348377 348622 348934 349734 351220 353087 354848 356362 358004 360324 363493 367115 370626 373807 376808
60674 376808 379782 382752 385809 389122 392651 396085 399224 402252 405474 408888 412167 414962 417122 418788
60660 418788 420347 422167 424232 426108 427353 427881 427948 427951 428329 429327 430714 431894 432475 432604 432649 432764 432877 432816
60642 432816 432263 430822 428408 425403 422186 418708 414789 410674 406942 403899 401292 398621 395611 392403
60628 392403 389399 386841 384575 382440 380814 380242 380412 380087 378535 376580 375691 376335 377795 379309 380707
60613C80707J305J140R86Q34L74m02q54n79k03n84j579k220j993j260o07k67j23
60596C74675J54Q24J616J844J351Q52R11J049O30J62O75J960K578J834P32N67
60580C92414J317K049K293K356K573K857K998K967K881K897L183L811M691N640
60566D34927O505P212P729Q040Q103P934P699P614P645P463O812N784M540K992
60552E30999R94j225l093m141m280l701k734j738q95r4R39K411M306O280P686
60537E31714Q083P873Q026Q959J0129J0958J1610J2273J2196J0351O975L579J317
60524F44043K5j010k042k949l712m336m661m640m554m636m677m364l784l280k875
60509E92548k239j169J49J521L093N124P481R616J1223J2700J4699J7312K0022
$$ plain form
60613 380707 382012 383152 384138 384972 385346 384944 384090 383511 383308 382724 381145 378925 376932 375672 375065 374798 374675
60596 374675 374829 375653 377269 379113 380464 381316 382227 383276 383906 384068 384743 386703 389281 391115 391847 392414
60580 392414 393731 395780 398073 400429 403002 405859 408857 411824 414705 417602 420785 424596 429287 434927
60566 434927 441432 448644 456373 464413 472516 480450 488149 495763 503408 510871 517683 523467 528007 530999
60552 530999 531993 530768 527675 523534 519254 515553 512819 511081 510186 510092 511031 513442 517748 524028 531714
60537 531714 539797 547670 555696 564655 574784 585742 597352 609625 621821 632172 639147 642726 644043
60524 644043 644068 643058 641016 638067 634355 630019 625358 620718 616164 611528 606851 602487 598703 595423 592548
60509 592548 590309 589140 589289 590810 593903 599027 606508 616124 627347 640047 654746 672058 692080
60496F92080K2494K4970K7670L0282L2401L4107L5595L6397L5671L3204K9665
60485A034536K5748K1542J6846J1583N650j233r119j7358k4867l0868l5304l8513
60473I58643m0598m1207m0028l7450l4533l2095l0010k7625k4748k1918j9745
60462F08686j8278j7040j5519j3618j1784j0606j0093r557q454p134o382o340
60450D73881o366n972n416n191n292n218m569l447k381j917k099k421k342j846
60436D19404j317r99p79m66n6K93L49K4m66p39p45q64j254j490j167n74k66k54
60418D08634j56K6n4l38l24J27N62O34N44O21Q40J000J010R59J088J622K317K468
60400D21580J788J055J174J829J890J135N74R24J712K213K375K357K014J429J247
$$ plain form
60496 692080 714574 739544 767214 797496 829897 864004 899599 935996 971667 1004871 1034536
60485 1034536 1060284 1081826 1098672 1110255 1115905 1114672 1105553 1088195 1063328 1032460 997156 958643
60473 958643 918045 876838 836810 799360 764827 732732 702722 675097 650349 628431 608686
60462 608686 590408 573368 557849 544231 532447 521841 511748 502191 493737 486603 480221 473881
60450 473881 467515 461543 456127 450936 445644 440426 435857 432410 430029 428112 426013 423592 421250 419404
60436 419404 418087 417088 416309 415843 415787 416080 416429 416453 415987 415248 414503 413639 412385 410895 409728 409154 408888 408634
60418 408634 408478 408504 408450 408112 407788 407915 408477 409111 409655 410276 411116 412116 413126 414085 415173 416795 419112 421580
60400 421580 423368 424423 425597 427426 429316 430451 431025 431949 433661 435874 438249 440606 442620 444049 445296
60385D45296J799K464K544K220K059K059J935J844K058K242J910J357J334J857
60371D72978K177J948J746K148K932L405L200K485J619Q59L19J63P27K126L683
60356E02515M256L533K571K572L384L858L460K820K743L391M540N925P008P077
60342E59653O034M766M257M486M512L566J718m06k258l655m629n250n549n522
60328E61723n152m510l875l667m099m832n214m895m107l255k481j770j230j003
60314E11633r27n77L65J802L262M282M919N858P692R999J1592J1905J1777J2392
60300E95974J3797J5048J5581J5741J5796J5155J3050R602N764K214j296n332
60288G11094r769j3589j5773j6275j5965j5591j5048j3808j1855r892q606p960
$$ plain form
60385 445296 447095 449559 452103 454323 456382 458441 460376 462220 464278 466520 468430 469787 471121 472978
60371 472978 475155 477103 478849 480997 483929 487334 490534 493019 494638 495497 495816 495979 496706 498832 502515
60356 502515 506771 510304 512875 515447 518831 522689 526149 528969 531712 535103 539643 545568 552576 559653
60342 559653 565687 570453 574710 579196 583708 587274 588992 588586 586328 582673 578044 572794 567245 561723
60328 561723 556571 552061 548186 544519 540420 535588 530374 525479 521372 518117 515636 513866 512636 511633
60314 511633 510706 510129 510494 512296 515558 519840 524759 530617 538309 548308 559900 571805 583582 595974
60300 595974 609771 624819 640400 656141 671937 687092 700142 709744 715508 717722 716426 711094
60288 711094 701325 687736 671963 655688 639723 624132 609084 595276 583421 573529 564923 556963
60276E56963p361o364n121m134l686l586l533l508l716m116m367m286m107m076
60262D95002l980l446k589j993j941k012j681j091r07j435k237k689k638k217
60248D64146j374r0J090J348O20j63j62M98J196J628J751J399O65K11M76Q31L80
60231D74450n84r01k10P04J354K143L199L706L104K096J699J893K000J878J991
60216D98522K604L557M522N048M774M059L898M708N690O008O019O534P446P938
60202E71327P735P203O587N899N445N473N598N333M965N007N065M305K905J871
60188F44718J416P26n10j474j542j218j331k081l244m487n175m825m071m210n289
60173F07403n750m687l319l220l999m044l016k168k339k917l018k608k093j558
$$ plain form
60276 556963 549602 543238 538117 533983 530297 526711 523178 519670 515954 511838 507471 503185 499078 495002
60262 495002 491022 487576 484987 482994 481053 479041 477360 476269 475362 473927 471690 469001 466363 464146
60248 464146 462772 462682 463772 465120 465740 465577 465415 465913 467109 468737 470488 471887 472552 472763 473239 474070 474450
60231 474450 473866 472965 472755 473459 474813 476956 480155 483861 486965 489061 490760 492653 494653 496531 498522
60216 498522 501126 504683 509205 514253 519027 523086 526984 531692 537382 543390 549409 555943 563389 571327
60202 571327 579062 586265 592852 598751 604196 609669 615267 620600 625565 630572 635637 639942 642847 644718
60188 644718 646134 646860 646350 644876 643334 642116 640785 638704 635460 630973 625798 620973 616902 612692 607403
60173 607403 601653 596966 593647 590427 586428 582384 579368 577200 574861 571944 568926 566318 564225 562667
60159E62667r45m60l27l78k33J94N87O09L43L33J076K422L615L966L398K287J178
60142E80332O87J274K729M208N110N621O098O327N993N509N605O156O230N433
60128F47312M538M348M526M113K913J714J158R57M49l92r09o30J73Q95J273J483
60112F73921J728K065K470K761K566J774R65Q55J237J096K3j139j572j738k617
60097F84395m050m845m516l933l932m108l570k331j239p50m55J18P82J013P12
60082F53291L47M09Q51J143Q30J2p96j216j312j362j521j801k256k929l714m416
60066F35560n000n628o349o945p120o777o033n110m297l921m069m405m402l887
60052E61617l226k869k824k721k279j571q01n0P14J449K033K398K621K903L456
$$ plain form
60159 562667 561722 561262 560935 560557 560324 560518 561105 561714 562057 562390 563466 565888 569503 573469 576867 579154 580332
60142 580332 581019 582293 585022 589230 594340 599961 606059 612386 618379 623888 629493 635649 641879 647312
60128 647312 651850 656198 660724 664837 667750 669464 670622 671579 672028 671636 670727 670097 670270 671165 672438 673921
60112 673921 675649 677714 680184 682945 685511 687285 688250 689105 690342 691438 691461 690322 688750 687012 684395
60097 684395 680345 675500 670984 667051 663119 659011 655441 653110 651871 651121 650666 650784 651566 652579 653291
60082 653291 653638 654047 654898 656041 656871 656883 656087 654871 653559 652197 650676 648875 646619 643690 639976 635560
60066 635560 630560 624932 618583 611638 604518 597741 591708 586598 582301 578380 574311 569906 565504 561617
60052 561617 558391 555522 552698 549977 547698 546127 545326 545276 545990 547439 549472 551870 554491 557394 560850
60037E60850M321N187N538N144M374L837L629L237K282J108K75k58j047k268l470
60022E92739m334n132o129p020p418p514p647p532o637n245m338m301m499m343
60008E10650m127m327m667m497l728k854k209j751j452j392j506j545j327q41
59994D74427j46N98J138J329J296J255J364J789K576L293L254K381J451J141J281
59979D98427J469J866K705L441L204J969N44n18j274j762j830j686j843k301k442
59964D99969j898j031l22J04K84K79M30J114K047K449K145J884K198K635K527
59949E14814J954J407R79N03J45K04N90R56J238J546J736J502Q61J32m81r90j380
59932E25716j614j793k074k438k727k790k480j664n07M82Q83P71N59N85J028J877
$$ plain form
60037 560850 565171 570358 575896 581040 585414 589251 592880 596117 598399 599507 599782 599524 598477 596209 592739
60022 592739 588405 583273 577144 570124 562706 555192 547545 540013 533376 528131 523793 519492 514993 510650
60008 510650 506523 502196 497529 493032 489304 486450 484241 482490 481038 479646 478140 476595 475268 474427
59994 474427 474281 474879 476017 477346 478642 479897 481261 483050 485626 488919 492173 494554 496005 497146 498427
59979 498427 499896 501762 504467 507908 511112 513081 513625 513107 511833 510071 508241 506555 504712 502411 499969
59964 499969 498071 497040 496718 496822 497106 497385 497815 498929 500976 503425 505570 507454 509652 512287 514814
59949 514814 516768 518175 519154 519657 519802 520006 520596 521552 522790 524336 526072 527574 528435 528567 528086 527096 525716
59932 525716 524102 522309 520235 517797 515070 512280 509800 508136 507629 508111 508994 509765 510324 510909 511937 513814
59916E13814K833L443L592L674M037M528M825M940N009M908M444L743L031K215
59902E69036J184L85M77J355K051J824R87L64K62L42L08L11N71R38J161J368J941
59885E84865K866L609L847L949M363M834M749M076L463L349L562L754L655K894
59871F37835J231p90k096k331k244k525k917k996l170m044n228n681n109m243
59857E95692l696l217k369j308n82l13M2J066K690M188N017N449O125P095P800
59842F23679P996Q084Q329Q435Q162P650O728M736J810m89q41m4l4j295k480k592
59826F77834k287k625l625m684n592o497p306p788p955p919p663p286p104p175
59812E92328p007o122m711l365k424j912j834k129k487k583k456k376k377k230
$$ plain form
59916 513814 516647 520090 523682 527356 531393 535921 540746 545686 550695 555603 560047 563790 566821 569036
59902 569036 570220 570605 571082 572437 574488 576312 577299 577663 577925 578267 578575 578886 579457 580395 581556 582924 584865
59885 584865 587731 591340 595187 599136 603499 608333 613082 617158 620621 623970 627532 631286 634941 637835
59871 637835 639066 638276 636180 633849 631605 629080 626163 623167 619997 615953 610725 605044 599935 595692
59857 595692 591996 588779 586410 585102 584520 584207 584249 585315 588005 592193 597210 602659 608784 615879 623679
59842 623679 631675 639759 648088 656523 664685 672335 679063 683799 685609 685120 684279 684235 684201 682906 680426 677834
59826 677834 675547 672922 669297 664613 659021 652524 645218 637430 629475 621556 613893 606607 599503 592328
59812 592328 585321 579199 574488 571123 568699 566787 564953 562824 560337 557754 555298 552922 550545 548315
59798E48315j872j564j538j660j644j448j346j593k150k725k997k767k034j110
59784E21867n25n22p08n58k26m03j244k028k172j993k008j993j504q76q15j176
59768E03116j152o05k76m16k35Q13K030K468K268K256K552K540K013J545J621
59753E20538K051K523L123M016M868N165M933M777N075N487N433M854M194L767
59739E80804L486L219K986K672K006J111O37R30J410J295O87K95K78J09l92o86
59723F00847m07P3K66K29J89N8k51l92k3N67P49K97m33r69j005m39N13J334J631
59704F02834J560J540J665J627J169L83l49n84j40N97R15N44M3J53R06J691J973
59687F16527J624P60k34p31m46m1m58j560k064j237k0J26r06j885k019j871k305
$$ plain form
59798 548315 546443 544879 543341 541681 540037 538589 537243 535650 533500 530775 527778 525011 522977 521867
59784 521867 521342 520820 520112 519554 519328 518925 517681 515653 513481 511488 509480 507487 505983 505107 504292 503116
59768 503116 501964 501359 501083 500667 500432 501245 503275 505743 508011 510267 512819 515359 517372 518917 520538
59753 520538 522589 525112 528235 532251 537119 542284 547217 551994 557069 562556 567989 572843 577037 580804
59739 580804 584290 587509 590495 593167 595173 596284 596921 597851 599261 600556 601243 601538 601816 601925 601533 600847
59723 600847 600440 600513 600779 601008 601197 601255 601004 600612 600589 601156 601905 602202 601769 600800 599795 599356 599869 601203 602834
59704 602834 604394 605934 607599 609226 610395 610778 610429 609845 609705 610302 611217 611761 611804 611957 612863 614554 616527
59687 616527 618151 618911 618677 617946 617500 617459 617001 615441 613377 612140 612120 612246 611340 609455 607436 605565 603260
59670F03260l202l809l948m197m861n388n049l932k836k335k248k110j829j629
59656E55887j477r54J41J348K011K090K072K107J730P50j14m4P07J105P56K55
59640E68370N4k56j092j975k204j919j802j924j739j197j070j831k838l073k388
59625E43116j541j161j149j097j006j278k071k906l109k535j692j132r61r83j028
59610E19467r63o51j55K32M01O82J400K314K842K679J974R53j44r31j059o47k45
59593E28149k70o54r77q50k70K38O7o54j029n04K67K62n03j100j118j155j709
59576E18190k405k634k408k094j787j434j284j658k362k729k336j430o54m14o04
59561D91957q23q21o48l28K86J171J878J990J688J512J646J873K076K328K574
$$ plain form
59670 603260 600058 596249 592301 588104 583243 577855 572806 568874 566038 563703 561455 559345 557516 555887
59656 555887 554410 553456 553597 554945 556956 559046 561118 563225 564955 565705 565591 565547 566254 567359 568115 568370
59640 568370 568424 568168 567076 565101 562897 560978 559176 557252 555513 554316 553246 551415 548577 545504 543116
59625 543116 541575 540414 539265 538168 537162 535884 533813 530907 527798 525263 523571 522439 521478 520495 519467
59610 519467 518504 517853 517698 517930 518331 519013 520413 522727 525569 528248 530222 531175 531031 530100 529041 528394 528149
59593 528149 527879 527225 526248 525398 525128 525366 525433 524779 523750 523246 523513 523775 523272 522172 521054 519899 518190
59576 518190 515785 513151 510743 508649 506862 505428 504144 502486 500124 497395 495059 493629 492975 492561 491957
59561 491957 491134 490313 489665 489337 489623 490794 492672 494662 496350 497862 499508 501381 503457 505785 508359
59546E08359K731L054L812M617M710M087L655M085N136O367P780R308J0333J0436
59532E88470J0182J0450J1142J1188R768P122M166J734J69o40r72r76o72k03J72
59517F51100L96O16P78N73o5q38j671k872m458n772o311o450o868p547q032q315
59501E94264q699q945q399p099n922n401n064m385l726l695l964l569k365j398
59487E21633j522k215k260j219K71J519K398K917K897K406K004K080K338K413
59473E35660K574L253M145M531M354M207M293M161L604L072K926K939K843K799
59459E85361K993L252L403L601L951M275M534N040N915O761P141P030O567N788
59445F55612M921M369M149L791L106K414J663N4k754n696p380p693p585p572p321
$$ plain form
59546 508359 511090 514144 517956 522573 527283 531370 535025 539110 544246 550613 558393 567701 578034 588470
59532 588470 598652 609102 620244 631432 641200 648322 652488 654222 654391 653751 652779 651803 651131 650928 651100
59517 651100 651496 652112 652890 653463 653398 652560 650889 648017 643559 637787 631476 625026 618158 610611 602579 594264
59501 594264 585565 576620 568221 561122 555200 549799 544735 540350 536624 532929 528965 525396 523031 521633
59487 521633 520111 517896 515636 514417 514688 516207 518605 521522 524419 526825 528829 530909 533247 535660
59473 535660 538234 541487 545632 550163 554517 558724 563017 567178 570782 573854 576780 579719 582562 585361
59459 585361 588354 591606 595009 598610 602561 606836 611370 616410 622325 629086 636227 643257 649824 655612
59445 655612 660533 664902 669051 672842 675948 678362 680025 680079 677325 671629 664249 656556 648971 641399 634078
59430F34078o568n590m670l813k999k226j191M85K654M699O285P652R105J0592
59416F48493J1929J3144J4340J5417J6039J5918J5153J4291J3861J3828J3632
59405H06045J2750J0853P641L090j905n875q098r109r630r671r000p826o411m785
59391G68069l527m034p081j1452j5018j6838j7440j7383j6669j5314j3586j1627
59379F18100r584p956o949n784l647j103M94Q91J054J440J551J348J717K936L976
59364E98484M104M060M724N573N590N042N155O313P683Q520R032R767J0778J1595
59350F96420J1776J1370J1070J1739J3483J5381J6370J6304J5822J5364J4666
59339H49765J3349J1662J0414J0055R899Q561N414J409j931m146n953p887r623
$$ plain form
59430 634078 627510 621920 617250 613437 610438 608212 607021 607506 610160 614859 621144 628796 637901 648493
59416 648493 660422 673566 687906 703323 719362 735280 750433 764724 778585 792413 806045
59405 806045 818795 829648 837289 840379 838474 832599 824501 815392 805762 796091 787091 779265 772854 768069
59391 768069 764542 760508 753427 741975 726957 710119 692679 675296 658627 643313 629727 618100
59379 618100 608516 600560 593611 587827 584180 583077 583571 584462 585516 586956 588507 589855 591572 594508 598484
59364 598484 602588 606648 611372 616945 622535 627577 632732 639045 646728 655248 664280 674047 684825 696420
59350 696420 708196 719566 730636 742375 755858 771239 787609 803913 819735 835099 849765
59339 849765 863114 874776 885190 895245 905144 913705 919119 920528 918597 914451 908498 900611 890988
59326H90988j0777j1676j2837j4180j5195j5620j5527j5044j4287j3409j2442
59315G39994j1326j0190r306q528p298n446l605k429j827j298o58N3R77K256L638
59300F85007M802N783O661P158P117P115P796Q750Q856P800O441N440M288K117
59286G75131j088m645p987j0681j2052j1616r897q145p003n994m441k474p39M87
59272F88856J520K764M395O284P943Q671Q198P091O183N688N211M493L561K251
59258G63109K75k021l713m464n061o332p989r044r046q424p856p789q242q637
59244F74766q088o381m366k963k035q77N65J627J993K047K234K621L101L534L687
59229F71465L514L369L434L197K110N84n00j068j792k804l485l617l779m291m702
$$ plain form
59326 890988 880211 868535 855698 841518 826323 810703 795176 780132 765845 752436 739994
59315 739994 728668 718478 709172 700644 693346 687900 684295 681866 680039 678741 678083 678136 679113 681369 685007
59300 685007 689809 695592 702253 709411 716528 723643 731439 740189 749045 756845 763286 768726 773014 775131
59286 775131 774043 769398 761411 750730 738678 727062 717165 709020 702017 696023 691582 689108 688369 688856
59272 688856 690376 693140 697535 703819 711762 720433 728631 735722 741905 747593 752804 757297 760858 763109
59258 763109 763384 761363 757650 753186 748125 741793 733804 724760 715714 707290 699434 691645 683403 674766
59244 674766 666678 660297 655931 652968 650933 650056 650621 652248 654241 656288 658522 661143 664244 667778 671465
59229 671465 674979 678348 681782 684979 687089 687673 687173 686105 684313 681509 678024 674407 670628 666337 661635
59214F61635m666m462m275l756k810k030j817j679j055j87L29L76J12m66j183
59199F34066j432r08j75Q4k6o6j18m62p56m01M91J200J362J190Q76M82L04O12
59181F36323J067J079P87R00J568K105K084J917J990K000J661J561K468M127N529
59166F67166O329P185Q476R488R363Q368P507P202P023O608O056N298L901J887
59152G61857P1r30j505k302l296m218n342o931q326q635q107p737p686p250o455
59137F83208o233o708o663n441m181m187n014n272m642l910l457k884k028j244
59123F21344o17K28J399K468L147L668M403N501O936Q471R580R871R628R501R611
59108G05139R437Q696P870P563P712P791P534P107O586N701M315K910K232K390
$$ plain form
59214 661635 656969 652507 648232 644476 641666 639636 637819 636140 635085 634898 635227 635603 635715 635249 634066
59199 634066 632634 631726 631551 631635 631609 631543 631425 630963 630207 629806 630297 631497 632859 634049 634925 635407 635711 636323
59181 636323 637390 638469 639256 640156 641724 643829 645913 647830 649820 651820 653481 655042 657510 661637 667166
59166 667166 673495 680680 689156 698644 708007 716375 723882 731084 738107 744715 750771 756069 759970 761857
59152 761857 761928 760998 759493 757191 753895 749677 744335 737404 729078 720443 712336 704599 696913 689663 683208
59137 683208 676975 670267 663604 658163 653982 649795 644781 639509 634867 630957 627500 624616 622588 621344
59123 621344 620727 620955 622354 624822 627969 631637 636040 641541 648477 656948 666528 676399 686027 695528 705139
59108 705139 714576 723272 731142 738705 746417 754208 761742 768849 775435 781136 785451 788361 790593 792983
59094G92983K633K178J021k65j199j591j391q63o48j135j876k237k434l224m601
59079G77351n676o019o211o811p537q025q583r560j0485j0553r674q553p872p796
59065F63996p995p905p210o284n792n742n426m493l448k818k502k303k424k869
59051E96785k988k278j206o38p89j198j398j139m90j0l07j048j114j96N79L19
59035E82884k69k4Q71J324J096R94J592K739M189N803P208Q046Q477Q854R118
59020F42902R115R156R574J0068J0227J0324J0772J1188J0774R381P404N069K651
59007G58605Q71J39j76o80p25M71K118K748K536L028M561N687N478M776M584M655
58991G98676M356L740L007J941O07l37o81j192k428l866m800n293n567n296m282
$$ plain form
59094 792983 795616 797794 798815 798550 797351 795760 794369 793506 792858 791723 789847 787610 785176 781952 777351
59079 777351 771675 765656 759445 752634 745097 737072 728489 718929 708444 697891 688217 679664 671792 663996
59065 663996 656001 648096 640886 634602 628810 623068 617642 613149 609701 606883 604381 602078 599654 596785
59051 596785 593797 591519 590313 589675 588886 587688 586290 585151 584661 584651 584344 583296 582182 581986 582565 582884
59035 582884 582615 582591 583462 584786 585882 586876 588468 591207 595396 601199 608407 616453 624930 633784 642902
59020 642902 652017 661173 670747 680815 691042 701366 712138 723326 734100 743481 750885 755954 758605
59007 758605 759476 759615 759439 758759 758034 758505 760623 763371 765907 768935 773496 779183 784661 789437 794021 798676
58991 798676 803032 806772 809779 811720 812327 811990 811309 810117 807689 803823 799023 793730 788163 782867 778585
58976G78585l153k580k340j780p88M46K035M024N852O914P431Q078Q923R418R250
58961H30315Q712Q194P758P202O281M930L376J853J78k068m792p221q733r526
58947H46459j0285j1453j2964j4324j4815j4003j2272j0610r647r184q674p870
58935G10358o882n996n468n168m529l261k006j638k052k338k169k116k515k921
58921F61299l010l083l264l013j979p13P5M03O07O74M70K31K42N07J092K275L937
58904F56750N365O236P179Q735J0300J0953J0984J1660J3531J5668J6834J6847
58892G91042J6615J7059J8142J8987J8926J8289J7934J8165J8580J8896J9196
58881I91831J9318J8729J7282J5377J3082R888N775J716j535m393p497j0456j2474
$$ plain form
58976 778585 775432 772852 770512 768732 767944 768390 770425 774449 780301 787215 794646 802724 811647 821065 830315
58961 830315 839027 847221 854979 862181 868462 873392 876768 878621 878799 876731 871939 864718 855985 846459
58947 846459 836174 824721 811757 797433 782618 768615 756343 745733 736086 726902 718228 710358
58935 710358 703476 697480 692012 686844 682315 679054 677048 675410 673358 671020 668851 666735 664220 661299
58921 661299 658289 655206 651942 648929 646950 646237 646312 646715 647322 647996 648466 648697 648939 649446 650538 652813 656750
58904 656750 662115 668351 675530 684265 694565 705518 716502 728162 741693 757361 774195 791042
58892 791042 807657 824716 842858 861845 880771 899060 916994 935159 953739 972635 991831
58881 991831 1011149 1029878 1047160 1062537 1075619 1085507 1091282 1092998 1091463 1087070 1079573 1069117 1056643
58868A056643j3680j4917j6383j7484j7869j7849j7681j7235j6462j5635j4932
58857H76516j4219j3410j2734j2441j2506j2624j2418j1732j0787r977r454r120
58845G35094q953q946q739p893o670n938o023o318o335o400o739o714n812m708
58831F38906m421m788m796m161l494l036k341j322o39o61q55o48j85J81O40J538
58815F09918K628L244L095K514J997J846K164K844L491L573K910J894J123P90
58801F44031O05L07Pr6j89o63j556k475l081l343l378l269l170l197l144k613
58785F14776j525k78O63J117J175J146J491K377L311L557L059K465K271K310K151
58770F40066J471O0j997l931m772m395l614l108k751k267j821j639j572j422j215
$$ plain form
58868 1056643 1042963 1028046 1011663 994179 976310 958461 940780 923545 907083 891448 876516
58857 876516 862297 848887 836153 823712 811206 798582 786164 774432 763645 753668 744214 735094
58845 735094 726141 717195 708456 700563 693893 687955 681932 675614 669279 662879 656140 649426 643614 638906
58831 638906 634485 629697 624901 620740 617246 614210 611869 610547 609908 609247 608392 607744 607559 607740 608380 609918
58815 609918 612546 615790 618885 621399 623396 625242 627406 630250 633741 637314 640224 642118 643241 644031
58801 644031 644636 644943 644950 644854 644665 644002 642446 639971 636890 633547 630169 626900 623730 620533 617389 614776
58785 614776 613251 612973 613636 614753 615928 617074 618565 620942 624253 627810 630869 633334 635605 637915 640066
58770 640066 641537 641597 639600 635669 630897 626502 622888 619780 617029 614762 612941 611302 609730 608308 607093
58755F07093q99k87L95N46J22jR06K524L964M693M607L809K812K473L169M373
58739F40299N412O224P001P632P945Q069Q096P815P158O452N894N313M761M733
58725G32804N311N759N496M961M885N224N395N109M470L646K924K698L024L551
58711G95257M133M881N475N229M176L060J955K2k763m965n705o101p541r579j0900
58696G76634j1462j2207j3291j4099j4500j4747j4556j3625j2650j2461j2523
58685F30513j1640r847q188o993n834m939m985n526n207l772k411j908j798j579
58671E55886j420j259n45P33J909K879M349O420Q024Q334P742P029O403N835N466
58656F17785N164M400K940J142n88k016k798k884l065m090n193m853l153k013
$$ plain form
58755 607093 606194 605907 606302 606848 606970 606969 607875 610399 614363 619056 623663 627472 630284 632757 635926 640299
58739 640299 645711 651935 658936 666568 674513 682582 690678 698493 705651 712103 717997 723310 728071 732804
58725 732804 738115 743874 749370 754331 759216 764440 769835 774944 779414 783060 785984 788682 791706 795257
58711 795257 799390 804271 809746 814975 819151 822211 824166 824188 821425 816460 810755 804654 797113 787534 776634
58696 776634 765172 752965 739674 725575 711075 696328 681772 668147 655497 643036 630513
58685 630513 618873 609026 600838 593845 588011 583072 578087 572561 567354 563582 561171 559263 557465 555886
58671 555886 554466 553207 552662 553395 555304 558183 562532 568952 576976 585310 593052 600081 606484 612319 617785
58656 617785 622949 627349 630289 631431 630843 628827 626029 623145 620080 615990 610797 605944 602791 600778
58642F00778k516l434l188k055j414j647j954j706j061m23MK36N04J049J768K357
58626E87298K784L134L091K269J161Q06J423K207K652L070L565L612L216L313
58612F23601M357N470N781N688N877N954N085L458K014J069J96p55j432j671j718
58597F62974j646j244n37J8k7o79j480j791j244j45Q26J435K109L180M343N149
58581F71241N754O667P982R170R632R330Q837Q847R484J0173J0336J0103J0054
58568G87610J0515J1412J2650J4113J5442J6358J7128J8159J9268J9952K0258
58557I62865K0665K1104K0861J9525J7401J4956J2437J0080P972N689K769m31
58545A115893l119n199p257r412j1110j2169j3018j3698j3664j2961j2694j3774
$$ plain form
58642 600778 598262 594828 591640 589585 588171 586524 584570 582864 581803 581380 581384 581620 582124 583173 584941 587298
58626 587298 590082 593216 596307 598576 599737 600543 601966 604173 606825 609895 613460 617072 620288 623601
58612 623601 627958 633428 639209 644897 650774 656728 661813 665271 667285 668354 668550 667795 666363 664692 662974
58597 662974 661328 660084 659547 659565 659538 658859 657379 655588 654344 654199 655025 656460 658569 661749 666092 671241
58581 671241 676995 683662 691644 700814 710446 719776 728613 737460 746944 757117 767453 777556 787610
58568 787610 798125 809537 822187 836300 851742 868100 885228 903387 922655 942607 962865
58557 962865 983530 1004634 1025495 1045020 1062421 1077377 1089814 1099894 1107866 1113555 1116324 1115893
58545 1115893 1112774 1107575 1100318 1090906 1079796 1067627 1054609 1040911 1027247 1014286 1001592 987818
58533I87818j5897j8064j9480j9664j8529j6698j5077j3761j2069r867q004p062
58521H13646o504n541m072k440r69r6j83p97r80o26p23j820l040l247k446j478
58505G78684r84j180k032l075l588l376k899k497k082j800k033k458k077o76O57
58490G48584J013Q29R69J517K159K946L974M908N512O113P043Q167R364J0758
58476H13856J2085J2603J2202J1748J1768J1551J0263Q212O292M787L362J709
58464I20438l15k628m556n187m513l548k934k228r64M64J524K262K829L118L381
58449I07143M211N340N502M145K317J124L48p00j972l236m751o462p354o707n176
58434H93772l788k642j502p28n10k3J456L284M341M683N221O238P237P898Q255
$$ plain form
58533 987818 971921 953857 934377 914713 896184 879486 864409 850648 838579 828712 820708 813646
58521 813646 807142 801601 797529 795089 794120 794024 793841 793044 792064 791438 790715 788895 785855 782608 780162 778684
58505 778684 777700 776520 774488 771413 767825 764449 761550 759053 756971 755171 753138 750680 748603 747927 748584
58490 748584 749597 750426 751395 752912 755071 758017 761991 766899 772411 778524 785567 793734 803098 813856
58476 813856 825941 838544 850746 862494 874262 885813 896076 904288 910580 915367 918729 920438
58464 920438 920123 917495 912939 907752 903239 899691 896757 894529 893565 894029 895553 897815 900644 903762 907143
58449 907143 911354 916694 922196 926341 928658 929782 930130 929430 927458 924222 919471 913009 905655 898948 893772
58434 893772 889984 887342 885840 885112 884602 884579 886035 889319 893660 898343 903564 909802 917039 924937 933192
58419I33192Q231P763P062O213M937L184J360m38k505m545n592n543n578o419
58405I41322p291p387p134p020o469n015l528l016l090k773j903p50P52K334L001
58390H92033K485J990K407K920K604K052K032J802N20q32p52M01J159J295J660
58375I13776K398L035L784N032O119O238N996O509P491P924Q009Q749J0060J1015
58361A006135J1545J2254J2916J2860J2472J2711J3377J3402J2643J1906J1509
58350A143730J1109J0593R914Q560O482M900M798N383N431N355O304Q013R349
58337A239921J0239J1314J2292J2560J2676J3504J4523J4790J4837J5634J6392
58326A388682J5631J3779J2589J2373J1947J0913R919R025P871P051P316P846
$$ plain form
58419 933192 941423 949186 956248 962461 967398 970582 971942 971504 968999 964454 958862 953319 947741 941322
58405 941322 934031 926644 919510 912490 906021 901006 897478 894462 891372 888599 886696 885946 886698 889032 892033
58390 892033 894518 896508 898915 901835 904439 906491 908523 910325 910845 910013 909261 909662 910821 912116 913776
58375 913776 916174 919209 922993 928025 934144 940382 946378 952887 960378 968302 976311 985060 995120 1006135
58361 1006135 1017680 1029934 1042850 1055710 1068182 1080893 1094270 1107672 1120315 1132221 1143730
58350 1143730 1154839 1165432 1175346 1183906 1190388 1195288 1200086 1205469 1210900 1216255 1222559 1230572 1239921
58337 1239921 1250160 1261474 1273766 1286326 1299002 1312506 1327029 1341819 1356656 1372290 1388682
58326 1388682 1404313 1418092 1430681 1443054 1455001 1465914 1475833 1484858 1492729 1499780 1507096 1514942
58314A514942P362O414O455P295P671P799Q870J0532J1413J1707J2754J4332J5043
58301A642589J5110J6132J8058J9119J8881J8838J9765K0844K1590K2406K3136
58290A856468K3231K3315K4441K6003K6624K6694K7639K9149K9773K9787L0685
58279B153809L2138L2435L1710L1799L2986L3823L4039L4651L5463L5538L5937
58268B524328L8753M3429M7281M9641N2132N5078N7140N8607O1326O5170O8080
58257C120965O9804P2091P5046P7009P8128Q0243Q3061Q4485Q4913Q7134R1622
58246D004501R6068R9829J04601J10378J15273J19763J26516J35523J44048J51786
58236E208286J61240J72554J83076J92719K04517K19164K34275K49697K67999
$$ plain form
58314 1514942 1522304 1528718 1535173 1542468 1550139 1557938 1566808 1577340 1588753 1600460 1613214 1627546 1642589
58301 1642589 1657699 1673831 1691889 1711008 1729889 1748727 1768492 1789336 1810926 1833332 1856468
58290 1856468 1879699 1903014 1927455 1953458 1980082 2006776 2034415 2063564 2093337 2123124 2153809
58279 2153809 2185947 2218382 2250092 2281891 2314877 2348700 2382739 2417390 2452853 2488391 2524328
58268 2524328 2563081 2606510 2653791 2703432 2755564 2810642 2867782 2926389 2987715 3052885 3120965
58257 3120965 3190769 3262860 3337906 3414915 3493043 3573286 3656347 3740832 3825745 3912879 4004501
58246 4004501 4100569 4200398 4304999 4415377 4530650 4650413 4776929 4912452 5056500 5208286
58236 5208286 5369526 5542080 5725156 5917875 6122392 6341556 6575831 6825528 7093527
58227G093527K89030L09866L30795L55420L84139M13953M45260M82087N24997
58218A0629074N71119O21851O82589P54119Q33001R21472J027621J154559J299904
58209A8495309J467924J671091J917209K207152K548808K960665L457738M047653
58201C8773549M745415N576787O559481P694088Q977526J0404534J1941529J3510842
58193A08183751J5010632J6344313J7442991J8297901J8978085J9568548K0059750
58186B33885971K0324755K0201897J9497772J7830877J4593910R334092K325856
58179C37995130n294227j2090394j7093915k0097833k1388602k1373024k0454239
58172B20202896j9066737j7632435j6418103j5454648j4606547j3719411j2724923
$$ plain form
58227 7093527 7382557 7692423 8023218 8378638 8762777 9176730 9621990 10104077 10629074
58218 10629074 11200193 11822044 12504633 13258752 14091753 15013225 16040846 17195405 18495309
58209 18495309 19963233 21634324 23551533 25758685 28307493 31268158 34725896 38773549
58201 38773549 43518964 49095751 55655232 63349320 72326846 82731380 94672909 108183751
58193 108183751 123194383 139538696 156981687 175279588 194257673 213826221 233885971
58186 233885971 254210726 274412623 293910395 311741272 326335182 335669274 337995130
58179 337995130 332700903 320610509 303516594 283418761 262030159 240657135 220202896
58172 220202896 201136159 183503724 167085621 151630973 137024426 123305015 110580092
58165A10580092j1648293j0550469r476366q449657p491616o623088n850330n164679
58157D5325594m558109m028388l569071l166859k811749k500359k227485j983999
58149B0479575j765349j573347j407071j260024j128335j013606r15134q26877
58141A0589832p44977o71313o07056n49143m95658m48432m07791l70511l35354
58132E959597l05071k80787k59754k40588k25224k13604k01887j88261j75471
58123C868950j65386j55967j45688j36119j27932j19198j09742j02441r8029r3253
58113B615195q6405q0073p6112p2541o7912o4155o2349o0095n5989n2547n1642
58102A885375n0951m8167m5005m3771m3301m1705m0117m0361m1432m1475m0967
$$ plain form
58165 110580092 98931799 88381330 78904964 70455307 62963691 56340603 50490273 45325594
58157 45325594 40767485 36739097 33170026 30003167 27191418 24691059 22463574 20479575
58149 20479575 18714226 17140879 15733808 14473784 13345449 12331843 11416709 10589832
58141 10589832 9844855 9173542 8566486 8017343 7521685 7073253 6665462 6294951 5959597
58132 5959597 5654526 5373739 5113985 4873397 4648173 4434569 4232682 4044421 3868950
58123 3868950 3703564 3547597 3401909 3265790 3137858 3018660 2908918 2806477 2708448 2615195
58113 2615195 2528790 2448717 2372605 2300064 2232152 2167997 2105648 2045553 1989564 1937017 1885375
58102 1885375 1834424 1786257 1741252 1697481 1654180 1612475 1572358 1531997 1490565 1449090 1408123
58091A408123m1036m0863l9449l7815l6924l5499l2332k8717k6298k4588k2742
58080A041860k1533k1417k0870j9013j7570j7918j8481j7567j6420j6770j7434
58069H36867j6351j4310j3613j4361j4827j4436j3835j2992j1608j0533j0618
58058F89383j0944j0220q956q424q442q128p794q177q690q333p476p023o783o278
58044E73715o081o657o888n653l852l125l453l776m058m854n683n725n471n915
58030E02524o692o704o060n798o156o591o952p305p183o354n632n743o113n999
58016D13242n864o249o307n098l414k600k443j965j478j907k678k337j042m03
58002C69457r48j501j255p77o69o13j82M56R28J015N94j10m57j81M9l55q66o78
$$ plain form
58091 1408123 1367087 1326224 1286775 1248960 1212036 1176537 1144205 1115488 1089190 1064602 1041860
58080 1041860 1020327 998910 978040 959027 941457 923539 905058 887491 871071 854301 836867
58069 836867 820516 806206 792593 778232 763405 748969 735134 722142 710534 700001 689383
58058 689383 678439 668219 659263 650839 642397 634269 626475 618298 609608 601275 593799 586776 579993 573715
58044 573715 567634 560977 554089 548436 544584 541459 538006 534230 530172 525318 519635 513910 508439 502524
58030 502524 495832 489128 483068 477270 471114 464523 457571 450266 443083 436729 431097 425354 419241 413242
58016 413242 407378 401129 394822 389724 386310 383710 381267 379302 377824 375917 373239 370902 369860 369457
58002 369457 368509 367008 365753 364976 364307 363694 363512 363968 364896 365911 366505 366395 365938 365757 365806 365451 364585 363907
57984C63907k7K40k8m04q43j531k200k530k831l400l670l026j938j342j283j162
57968C37932q77p45o88n30o59j386k034j675m75O30J189J335J043K97m04o21o77
57951C31655r67j085n53J20J33l04l39K74J216K337L435L843L359L062M139O200
57935C56525P887Q662R032R347R533R655R745R375Q354P374P010O617N188K902
57921D67206P67p60j819k466l079m704p630j0264j0827r704q659q254p705o901
57907C85201o684p147p256o546n675n172m863m697m863m961m244k908j988j858
57893C16339j845j405n84N97K047L008K778J982J842K245K099J487J773L181M053
57878C39597L256J848J387J784J849J080j7q38j146j069j152j909l075l742l518
$$ plain form
57984 363907 363880 364120 364092 363688 362845 361314 359114 356584 353753 350353 346683 343657 341719 340377 339094 337932
57968 337932 337055 336310 335622 335092 334433 333047 331013 329338 328863 329493 330682 332017 333060 333357 332953 332332 331655
57951 331655 330688 329603 329050 329170 329303 328999 328660 328934 330150 332487 335922 339765 343124 346186 350325 356525
57935 356525 364412 373074 382106 391453 400986 410641 420386 429761 438115 445489 452499 459116 464304 467206
57921 467206 467973 467213 465394 462928 459849 455145 447515 437251 426424 416720 408061 399807 392102 385201
57907 385201 378517 371370 364114 357568 351893 346721 341858 337161 332298 327337 323093 320185 318197 316339
57893 316339 314494 313089 312505 313102 315149 318157 320935 322917 324759 327004 329103 330590 332363 335544 339597
57878 339597 342853 344701 346088 347872 349721 350801 350784 349946 348800 347731 346579 344670 341595 337853 334335
57863C34335k940k641k734l062l395l236k262j041m81n00r8J053K111K386K205
57848C19700K127K171K237K455K654K227R27p00j924k387k040j304j154k165l389
57833C19435l296j973j163j811k780k599j293J60J234J829J778J201P50Q21J053
57818C13346J186J645K631L395L221K564K328K491K261J350K88l19l45j51m44
57803C35447j756l688m977m851l883l063k569k053j692k045l000l710l624l042
57789B91494k474j981j355o22r3lj90j79L92J415K377K794K602K175K050K479
57773C00881L134L459L373L313L449L318K624J895J749J958J840J222L28q27k079
57758C29637k645k085j398j903l193l622k820k188k511k713j728k98J88l94j135
$$ plain form
57863 334335 331395 328754 326020 322958 319563 316327 314065 313024 312543 312043 311945 312998 315109 317495 319700
57848 319700 321827 323998 326235 328690 331344 333571 334498 333798 331874 329487 327447 326143 324989 322824 319435
57833 319435 316139 314166 313003 311192 308412 305813 304520 304680 305914 307743 309521 310722 311472 312293 313346
57818 313346 314532 316177 318808 322203 325424 327988 330316 332807 335068 336418 336706 336387 336042 335891 335447
57803 335447 333691 330003 325026 320175 316292 313229 310660 308607 306915 304870 301870 298160 294536 291494
57789 291494 289020 287039 285684 285062 284969 284966 284776 284597 284989 286404 288781 291575 294177 296352 298402 300881
57773 300881 304015 307474 310847 314160 317609 320927 323551 325446 327195 329153 330993 332215 332543 331716 329637
57758 329637 326992 324907 323509 321606 318413 314791 311971 309783 307272 304559 302831 302533 302721 302327 301192
57743C01192j448j260n31M30P19r4j187j590j618k173l059l151k186j244j252
57728B81548j822k017j623j231j264j416j118l70J70O0k76j71K08K8r29j908k233
57711B65636k054j731j154k20N55M89m70j796k913l327k784j674r69j171j680
57696B44737j587q10rL76M61N38P25R51J030Q45N73N08N93N70O44J456L152N084
57678B59837O694Q199J0075J2387J5003J7838K0499K2348K3423K4667K6665K8703
57666D76338K9865L0351L0915L1317L0242K6527J9736R874k335j4946k5493l2527
57654F09864l6097l6829l5319l2436k9285k6405k3498k0283j7153j4680j2848
57643C25031j1246r751q573p656o549n043l634k958k909k790k336k063k303k462
$$ plain form
57743 301192 299744 298484 297953 298383 299102 299008 297821 296231 294613 292440 289381 286230 284044 282800 281548
57728 281548 279726 277709 276086 274855 273591 272175 271057 270687 270857 270917 270641 270470 270678 270706 269777 267869 265636
57711 265636 263582 261851 260697 260477 261032 261521 261051 259255 256342 253015 250231 248557 247588 246417 244737
57696 244737 243150 242340 242331 242707 243168 243706 244431 245382 246412 247257 247830 248338 248931 249501 250145 251601 254753 259837
57678 259837 266531 274730 284805 297192 312195 330033 350532 372880 396303 420970 447635 476338
57666 476338 506203 536554 567469 598786 629028 655555 675291 685165 682830 667884 642391 609864
57654 609864 573767 536938 501619 469183 439898 413493 389995 369712 352559 337879 325031
57643 325031 313785 304034 295461 287805 281256 276213 272579 269621 266712 263922 261586 259523 257220 254758
57629B54758j797n78L08O38Q95J099O39n24j463j541j253j306j625j820j941k037
57613B42452j644n03O26O91l11j407j822j533q51q9M22M84J31n99j703k749k919
57596B28676j993q52m32o19p05n50o01j069j775k573l256l293k385j117m24n28
57580B06504r53j328j554j447r83p06j115j728j657r89p22j196j592j228n84n03
57564A88219j011j401j113j78Q81J328P57l24p73RJ410K312K265J709J305J362
57548A96757J747K085K020J517Q82M36J58j51m38l35L06J048J347J323J582K200
57532B12484K435J814R35N73M81m6p53o56L27J071Q43K06j1K56P74J547K306K376
57514B26962J690J187J489K028K133K115K373K329J400L06J58P16Q11J61m80o86
$$ plain form
57629 254758 252961 252383 252691 253329 254224 255323 255962 255438 253975 252434 251181 249875 248250 246430 244489 242452
57613 242452 240808 240305 240931 241622 241311 239904 238082 236549 235698 235609 236031 236515 236646 236047 234344 231595 228676
57596 228676 226683 225831 225399 224780 224075 223525 222924 221855 220080 217507 214251 210958 208573 207456 207032 206504
57580 206504 205551 204223 202669 201222 200239 199533 198418 196690 195033 194044 193322 192126 190534 189306 188722 188219
57564 188219 187208 185807 184694 184516 185397 186725 187482 187158 186385 186394 187804 190116 192381 194090 195395 196757
57548 196757 198504 200589 202609 204126 205008 205444 205602 205451 205013 204678 204984 206032 207379 208702 210284 212484
57532 212484 214919 216733 217668 218241 218722 218676 217923 217267 217594 218665 219508 219714 219703 219959 220733 222280 224586 226962
57514 226962 228652 229839 231328 233356 235489 237604 239977 242306 243706 244012 244170 244886 245697 245858 245378 244692
57498B44692o92n10J06Q14R25N21L39N43O05L77K70L42K64K22P35J441J287K51
57480B52532l35L62J525J970J675J359J299J318J366J442J259N80l16r58j199
57465B63879j161r02m52R6O09R46R83Q57J084J906K733K734J950J208R84J061
57449B78515J207J491J800J849J782K067K644K851K477K043J890J755J543J739
57435C05653K568L413L573L090K472K081K110K626L230L226K476J742J792K509
57421C42561L173L254K764K145J937K252K565K423K208K585L387L839L801L785
57407C82679L793L219K178J683K097K567K517K551L116L469K969K451L047M354
57393D22690N004M644M146M073M101L972M015M507N210N709N819N598N411N775
$$ plain form
57498 244692 244000 243490 243596 244410 245335 245856 246195 246738 247343 247720 247990 248332 248596 248818 249553 250994 252281 252532
57480 252532 252197 252559 254084 256054 257729 259088 260387 261705 263071 264513 265772 266352 266036 265078 263879
57465 263879 262718 261816 261364 261460 262069 263015 263998 264855 265939 267845 270578 273312 275262 276470 277454 278515
57449 278515 279722 281213 283013 284862 286644 288711 291355 294206 296683 298726 300616 302371 303914 305653
57435 305653 308221 311634 315207 318297 320769 322850 324960 327586 330816 334042 336518 338260 340052 342561
57421 342561 345734 348988 351752 353897 355834 358086 360651 363074 365282 367867 371254 375093 378894 382679
57407 382679 386472 389691 391869 393552 395649 398216 400733 403284 406400 409869 412838 415289 418336 422690
57393 422690 427694 432338 436484 440557 444658 448630 452645 457152 462362 468071 473890 479488 484899 490674
57379D90674O765P671P709O954O130N648N302M784M074L340K815K676K793K817
57365E60152K694K802L350L973M301M510M902N306N404N378N664O237O609O468
57351F27750N947N395N135N331N812O208O408O625O929P089P094P275P647P658
57337G18303O978O044N429N209N294N770O423O600O161N892O325O802O571O174
57323H03975O622P654Q024P396O729O730P043P236P577Q329R030R031Q409P916
57309I11701Q233R424J0829J1508J1054R992R177Q856Q738Q761R223J0148J1129
57296A038773J1859J2367J2602J2273J1399J0631J0634J1288J1748J1339J0310
57285A165223R600R876J0876J1865J2443J2610J2255J1259J0155R907J0694J1590
$$ plain form
57379 490674 497439 505110 512819 519773 525903 531551 536853 541637 545711 549051 551866 554542 557335 560152
57365 560152 562846 565648 568998 572971 577272 581782 586684 591990 597394 602772 608436 614673 621282 627750
57351 627750 633697 639092 644227 649558 655370 661578 667986 674611 681540 688629 695723 702998 710645 718303
57337 718303 725281 731325 736754 741963 747257 753027 759450 766050 772211 778103 784428 791230 797801 803975
57323 803975 810597 818251 826275 833671 840400 847130 854173 861409 868986 877315 886345 895376 903785 911701
57309 911701 919934 929358 940187 951695 962749 972741 981918 990774 999512 1008273 1017496 1027644 1038773
57296 1038773 1050632 1062999 1075601 1087874 1099273 1109904 1120538 1131826 1143574 1154913 1165223
57285 1165223 1174823 1184699 1195575 1207440 1219883 1232493 1244748 1256007 1266162 1276069 1286763 1298353
57273A298353J1911J2149J3055J4411J5470J6093J6644J7119J7199J6958J6774
57262A466136J6686J6573J6639J7089J7491J7303J6838J6919J7601J8062J7810
57251A655147J7251J6939J6914J6963J7040J7187J7430J7807J8231J8472J8541
57240A847922J8830J9490J9999J9820J9182J8627J8244J7943J8009J8633J9247
57229B055946J9252J9002J9176J9479J9061J7967J7024J6427J5701J4975J4962
57218B248972J5509J5491J4521J3553J3376J3643J3879J4330J5178J5901J6075
57207B410428J6033J6068J5884J5410J5365J6232J7346J7693J7077J5928J4577
57196B588041J3389J2941J3358J3856J3553J2408J0904R370Q084P484P598P765
$$ plain form
57273 1298353 1310264 1322413 1335468 1349879 1365349 1381442 1398086 1415205 1432404 1449362 1466136
57262 1466136 1482822 1499395 1516034 1533123 1550614 1567917 1584755 1601674 1619275 1637337 1655147
57251 1655147 1672398 1689337 1706251 1723214 1740254 1757441 1774871 1792678 1810909 1829381 1847922
57240 1847922 1866752 1886242 1906241 1926061 1945243 1963870 1982114 2000057 2018066 2036699 2055946
57229 2055946 2075198 2094200 2113376 2132855 2151916 2169883 2186907 2203334 2219035 2234010 2248972
57218 2248972 2264481 2279972 2294493 2308046 2321422 2335065 2348944 2363274 2378452 2394353 2410428
57207 2410428 2426461 2442529 2458413 2473823 2489188 2505420 2522766 2540459 2557536 2573464 2588041
57196 2588041 2601430 2614371 2627729 2641585 2655138 2667546 2678450 2687820 2695904 2703388 2710986 2718751
57184B718751P481P118P223P619P793P760P883Q184Q460Q745R153R490R508R235
57170B834403Q728P902O963O500O617O520N530M028K832K121J594J208J040P92
57156B896778J51o22j050j089q84l41M45Q20L36m62p76o59o86j003j509k536m297
57139B882616n956o406n860n645o409p559q513r416j0331j0671j0004q748p542
57126B779556o345m527j614K258O446J0264J3510J6393J8958K0991K2742K5085
57114B903717K8439L2138L5641L9742M5719N3805O3566P5410R0565J09816J33495
57103C612053J62577J98685K43103K96914L61873M39955N32151O38790P60579
57094G246680Q97663J047786J206642J369219J528765J675463J800040J900312
$$ plain form
57184 2718751 2726232 2733350 2740573 2748192 2755985 2763745 2771628 2779812 2788272 2797017 2806170 2815660 2825168 2834403
57170 2834403 2843131 2851033 2857996 2864496 2871113 2877633 2883163 2887191 2890023 2892144 2893738 2894946 2895986 2896778
57156 2896778 2896929 2896307 2895257 2894168 2893284 2892943 2893388 2894208 2894544 2894082 2893306 2892647 2891961 2890958 2889449 2886913 2882616
57139 2882616 2876660 2870254 2864394 2858749 2852340 2844781 2836268 2826852 2816521 2805850 2795846 2787098 2779556
57126 2779556 2773211 2768684 2767070 2769328 2775774 2786038 2799548 2815941 2834899 2855890 2878632 2903717
57114 2903717 2932156 2964294 2999935 3039677 3085396 3139201 3202767 3278177 3368742 3478558 3612053
57103 3612053 3774630 3973315 4216418 4513332 4875205 5315160 5847311 6486101 7246680
57094 7246680 8144343 9192129 10398771 11767990 13296755 14972218 16772258 18672570
57086A8672570J983107K060333K145102K248300K371113K498445K604806K666914
57078C7250690K659769K534668K217238J654432Q75717n53q31790j525346k057251
57069D2777574k439168k684921k805370k816791k741818k603796k423975k221743
57061B2039992k013457j810725j620935j448488j295007j159867j042126r41460
57053A0707927q56868p85701p24813o71869o25052n82544n42898n05076m67683
57044D945423m29268l89998l51953l16926k84728k54357k25888k00207j77539
57035B314559j57280j38907j22221j06903r2561p9093o6526n4704m3507l3036
57025A419821k3221j3617m100M591J1421J6037J9003K1239K3115K3436J9361Q395
$$ plain form
57086 18672570 20655677 22716010 24861112 27109412 29480525 31978970 34583776 37250690
57078 37250690 39910459 42445127 44662365 46316797 47192514 47191961 46360171 44834825 42777574
57069 42777574 40338406 37653485 34848115 32031324 29289506 26685710 24261735 22039992
57061 22039992 20026535 18215810 16594875 15146387 13851380 12691513 11649387 10707927
57053 10707927 9851059 9065358 8340545 7668676 7043624 6461080 5918182 5413106 4945423
57044 4945423 4516155 4126157 3774204 3457278 3172550 2918193 2692305 2492098 2314559
57035 2314559 2157279 2018372 1896151 1789248 1696687 1617594 1551068 1496364 1452857 1419821
57025 1419821 1396600 1382983 1378883 1383474 1394895 1410932 1429935 1451174 1474289 1497725 1517086 1525481
57013A525481q867k8572m6488o0427o9677p3647p2322o7250o0709n4061m7753
57002I35708m2391l8534l5666l2565k8939k5726k3675k2354k0837j8719j6278
56991F30024j4068j2520j1662j1186j0837j0508r868q469o508m853l835k810j547
56978E21353j201k897n987q809j0656j1831j2261j1547j0171r229q856q090o436
56965D13382m382k310o3K215L914M896N635O312O748P262Q340R378Q994O844L864
56950D81029N64l349p408j0075j0832j1000j1585j1718j0276p737n158k535M55
56937C90375L135M698N733P351R409J0971J2023J3262J4536J4879J3913J1819
56925E12104Q122K075n491j2048j5711j6893j7272j7903j8650j8849j8008j6283
$$ plain form
57013 1525481 1516614 1488042 1441554 1381127 1311450 1237803 1165481 1098231 1037522 983461 935708
57002 935708 893317 854783 819117 786552 757613 731887 708212 685858 665021 646302 630024
56991 630024 615956 603436 591774 580588 569751 559243 549375 540906 534398 529545 525710 522900 521353
56978 521353 520152 517255 511268 502459 491803 479972 467711 456164 445993 436764 427908 419818 413382
56965 413382 409000 406690 406627 408842 412756 417652 423287 429599 436347 443609 451949 461327 470321 477165 481029
56950 481029 481593 478244 470836 460761 449929 438929 427344 415626 405350 397613 392455 389920 390375
56937 390375 393510 398208 403941 411292 420701 431672 443695 456957 471493 486372 500285 512104
56925 512104 520226 522301 516810 504762 489051 472158 454886 436983 418333 399484 381476 365193
56913C65193j4375j2853j1592j0244q890p804o817n674m680m278m142l520k373
56900B67951j295l77Q99K497L518L503L222L715N077O677Q019R013R738J0408
56886C32565J1317J2430J3234J3258J2541J1289R305O191K142j763m383n521n889
56873D06716o005n463l644q64J746L639N496Q197J1691J5229J8283K0780K2818
56860D98619K4612K6390K7882K8153K6431K2831J7876J1666M136m112j1772j7459
56848F55253k0106j9223j5533j0924o942l330J245P157J3277J8486K2880K7187
56836F69427L1590L5535L8410M0107M0989M1322M0537L7140K9758J8341M254j0477
56824A016933k3841l4238m0954m4262m4672m2209l6904k9748k2489j6273j0889
$$ plain form
56913 365193 350818 337965 326373 316129 307239 299435 292618 286944 282264 277986 273844 270324 267951
56900 267951 266656 266279 267178 269675 273193 276696 279918 283633 288710 295387 303406 312419 322157 332565
56886 332565 343882 356312 369546 382804 395345 406634 415939 422130 424272 422509 418126 412605 406716
56873 406716 400711 395248 391604 390740 392486 396125 401621 409818 421509 436738 455021 475801 498619
56860 498619 523231 549621 577503 605656 632087 654918 672794 684460 688596 684484 672712 655253
56848 655253 635147 615924 600391 589467 582525 579195 580440 587597 600874 619360 642240 669427
56836 669427 701017 736552 774962 815069 856058 897380 937917 975057 1004815 1023156 1027410 1016933
56824 1016933 993092 958854 917900 873638 828966 786757 749853 720105 697616 681343 670454
56813F70454n484K83N940J0832J4886J8590K2049K4361K4529K2857K0376J6749
56801H46422J0046n13j2664k3088l0516l5631l8679l8958l6580l2975k9247k5197
56789E52420k0429j5331j0500o137k407L70K295M080O255Q624J0611J1542J0608
56776E52001P350K345l222q696j4019j8838k2497k4976k6732k7531k6574k4097
56764C64514k1598j9970j8516j6429j4211j2749j1873j0765r266p890o944o330
56752B07973n903n456m674l607k801k539k389j897j262q38n42k44k64q42j557
56737A73158j811j590j231q58m74k48j92M9N63P64K49l61j34Q59J582J321M33
56720A72079j76R7J053J845J729R30L64M15M75N5l57j42L38L49O3K99J083J474
$$ plain form
56813 670454 664970 665253 671193 682025 696911 715501 737550 761911 786440 809297 829673 846422
56801 846422 856468 855955 843291 820203 789687 754056 715377 676419 639839 606864 577617 552420
56789 552420 531991 516660 506160 500023 497616 497986 500281 504361 510616 519240 529851 541393 552001
56776 552001 559351 561696 558474 549778 535759 516921 494424 469448 442716 415185 388611 364514
56764 364514 342916 322946 304430 288001 273790 261041 249168 238403 229137 221247 214303 207973
56752 207973 202070 196614 191940 188333 185532 182993 180604 178707 177445 176607 176065 175821 175557 174715 173158
56737 173158 171347 169757 168526 167668 167194 166946 166754 166803 167366 168130 168379 168018 167884 168743 170325 171646 172079
56720 172079 171903 172000 173053 174898 176627 177557 177921 178336 178811 178866 178509 178367 178705 179054 179117 179416 180499 181973
56702A81973R99L29K22M19J62n91j109r32m68l69o55q54q13q96j268j467j086
56685A73596m63k07k63j18L06O29Q68J466K365K771K141Q13n22j461j811j523
56669A78587r01l95j4M69P92M93K7N05J981L048K693J581Q56O43N62P54J390J875
56651A94946J629J165J318J860J931J518J446J959K366K126J425P07K52L14R67
56636B15929J812K264K156J647Q54k0n45o14p60j382j984j899j362j097j271j600
56620B12128k117k843l097k231q97l77p50q77l09O4l91j034j142j029j303j713
56604A92082j573q33p1K91K49j1j89L3N52Q09M48j98n84o17n36m31k42l1O8Q1
56584A89297R8L5j88l66j46M47Q88P05R4k20K19J099J710J781J659J791K278L043
$$ plain form
56702 181973 182972 183301 183523 183942 184104 183513 182404 181472 181004 180635 179980 179126 178313 177417 176149 174682 173596
56685 173596 173133 172926 172663 172545 172851 173480 174348 175814 178179 180950 183091 183904 183382 181921 180110 178587
56669 178587 177686 177291 177277 177746 178538 179031 179058 179563 181544 184592 187285 188866 189722 190365 190927 191681 193071 194946
56651 194946 196575 197740 199058 200918 202849 204367 205813 207772 210138 212264 213689 214396 214648 214962 215929
56636 215929 217741 220005 222161 223808 224662 224642 224097 223483 222723 221341 219357 217458 216096 214999 213728 212128
56620 212128 210011 207168 204071 201840 200943 200566 199816 198939 198630 198694 198303 197269 196127 195098 193795 192082
56604 192082 190509 189676 189605 189896 190145 190134 189945 189978 190530 191339 191787 191589 191005 190388 189852 189421 189179 189148 189216 189297
56584 189297 189395 189430 189242 188876 188730 189177 190065 190770 190864 190644 190863 191962 193672 195453 197112 198903 201181 204224
56566B04224M021N050N855O341O662O855O763O523O675P432Q207Q350P950P421
56552B98329O641N131K983R50m00j148j636k089k646l297l718l525k833k262k254
56537B88226k623k888k844k735k883l232l355k952k283j871j862j999k137k318
56523B52244k314j716o74Rj87r29j637k093k197j752r20k62rJ22R4o04j831k465
56505B32879j922j109j002j230j072q93j300j621q65L77O44OJ4J119J838R74p67
56488B26070j941k037j430o69l29p18j201p38N86J431J048K77J95P04J127J316
56472B23691J364R55p8j074j231o60n9L40P37J041R51O95Q38J345J485Q30j56
56455B31014p77q92p12j89Q33J966K326J577N11J69N90R60Q52O43O37O02M18M44
$$ plain form
56566 204224 208245 213295 219150 225491 232153 239008 245771 252294 258969 266401 274608 282958 290908 298329
56552 298329 304970 310101 313084 314034 313634 312486 310850 308761 306115 302818 299100 295575 292742 290480 288226
56537 288226 285603 282715 279871 277136 274253 271021 267666 264714 262431 260560 258698 256699 254562 252244
56523 252244 249930 248214 247540 247549 247362 246433 244796 242703 240506 238754 237834 237572 237563 237685 237779 237175 235344 232879
56505 232879 230957 229848 228846 227616 226544 225651 224351 222730 221865 222242 222886 222892 222906 224025 225863 226837 226070
56488 226070 224129 222092 220662 219993 219664 218946 217745 217007 217593 219024 220072 220349 220544 221248 222375 223691
56472 223691 225055 226010 225932 224858 223627 222967 222908 223248 223985 225026 225977 226672 227510 228855 230340 231170 231014
56455 231014 230237 229345 228633 228444 229277 231243 233569 235146 235657 235826 236416 237376 238228 238871 239508 240110 240528 240972
56437B40972P63P81J81m21l70L8J83J78M23O49L22l59p42p23o07l19L37R89J207
56418B43482J296J638J680Q23j29J16J208J513O22j77j35q1o64j104n29O15J304
56401B51478J148K54j087j987j391L71J498J023J78M92J561J916J336R46J354
56386B59090J953K003J442N97j73m53l6P33J282J455J523J630J617J363J015Q50
56370B75891J014J416J807K026K065J858J211K40m39m21r5o1k27q7L48O31O10
56353B87787L92j30q54r36K56J880K479J938J375J247J038Q07J344K453K766J922
56337C05764J356K041K899K580J590J396K271L241L625L580L516L695M071M084
56323C45709L211J960J477J886K037J362P01O39M53l52p87L3J148J124K72J6O12
$$ plain form
56437 240972 241735 242516 242697 242276 241906 241944 242127 242305 242728 243377 243699 243340 242598 241875 241268 240949 241286 242275 243482
56418 243482 244778 246416 248096 248919 248790 248906 250114 251627 252249 252072 251937 251856 251192 250088 249559 250174 251478
56401 251478 252626 252880 251793 249806 248415 248786 250284 251307 251485 251977 253538 255454 256790 257736 259090
56386 259090 261043 263046 264488 265085 264912 264459 264423 265156 266438 267893 269416 271046 272663 274026 275041 275891
56370 275891 276905 278321 280128 282154 284219 286077 287288 287528 287089 286668 286573 286512 286285 286198 286546 287177 287787
56353 287787 288179 288049 287195 286259 286515 288395 290874 292812 294187 295434 296472 297279 298623 301076 303842 305764
56337 305764 307120 309161 312060 314640 316230 317626 319897 323138 326763 330343 333859 337554 341625 345709
56323 345709 348920 350880 352357 354243 356280 357642 358343 358982 359435 359083 358296 358329 359477 360601 360873 360889 361501
56306C61501R79N39j70n99p21n16J27R68J669K378L362M205M186L269K179J560
56290C84916J550J957K380K494K534L055L907M173L579L145L757M861N404N389
56276D33101N561O138O765P344P989Q579R047R755J0830J1605J1538J1203J1600
56263E51055J2825J4197J5394J6695J8359K0413K2839K5477K8119L0966L4513
56252G90852L8670M2766M6735N1341N6670O1542O5120O8131P1572P5195P8234
56241A446828Q0592Q2232Q2375Q0542P7545P4142O9483O2251N2782M2655L2649
56230B184076K2427J1829J106r780k0888l1515m0778m8685n5650o1389o5353o7865
56218A817535o9681p0826p0869o9909o8248o5652o2019n8318n5519n3175n0230
$$ plain form
56306 361501 362480 363019 362849 362250 361529 361013 361140 362108 363777 366155 369517 373722 377908 381177 383356 384916
56290 384916 386466 388423 390803 393297 395831 398886 402793 406966 410545 413690 417447 422308 427712 433101
56276 433101 438662 444800 451565 458909 466898 475477 484524 494279 505109 516714 528252 539455 551055
56263 551055 563880 578077 593471 610166 628525 648938 671777 697254 725373 756339 790852
56252 790852 829522 872288 919023 970364 1027034 1088576 1153696 1221827 1293399 1368594 1446828
56241 1446828 1527420 1609652 1692027 1772569 1850114 1924256 1993739 2055990 2108772 2151427 2184076
56230 2184076 2206503 2218332 2219438 2209658 2188770 2157255 2116477 2067792 2012142 1950753 1885400 1817535
56218 1817535 1747854 1677028 1606159 1536250 1468002 1402350 1340331 1282013 1226494 1173319 1123089
56207A123089m6836m4017m1913l9623l6644l3278k9862k6689k4348k3040k1887
56196G54952k0008j7780j6001j4383j2228r970q647q175p619o768o052n291m017
56183F18013k722k275k390k153j715j898k354j864m15P48J182J731K717L253K780
56168F12638J983J707K013K583L251L902M623N823P498Q755Q968Q939R800J1279
56154F93762J2305J2862J3900J5742J7928K0351K3276K6533K9916L3942L8986
56143I39503M4229M8816N3378N8895O4808O9978P4841Q0553Q6531R0906R3110
56132A705548R4058R3942R1932Q7880Q2418P5552O7128N8444N1286M5409L9043
56121B492640L1805K4768J7759R099j543j2316k1716k9985l7581m4315n0584n7465
$$ plain form
56207 1123089 1076253 1032236 990323 950700 914056 880778 850916 824227 799879 776839 754952
56196 754952 734944 717164 701163 686780 674552 664582 655935 647760 640141 633373 627321 622030 618013
56183 618013 615291 613016 610626 608473 606758 604860 602506 600642 600227 600975 602157 603888 606605 609858 612638
56168 612638 614621 616328 618341 620924 624175 628077 632700 638523 646021 654776 663744 672683 682483 693762
56154 693762 706067 718929 732829 748571 766499 786850 810126 836659 866575 900517 939503
56143 939503 983732 1032548 1085926 1144821 1209629 1279607 1354448 1435001 1521532 1612438 1705548
56132 1705548 1799606 1893548 1985480 2073360 2155778 2231330 2298458 2356902 2408188 2453597 2492640
56121 2492640 2524445 2549213 2566972 2576071 2574528 2562212 2540496 2510511 2472930 2428615 2378031 2320566
56109B320566o5031p2168p8302q3568q7167q7573q4702q0022p4383o7640o0517
56098A479493n4483m9473m3902l7465l1710k7389k3418j9103j5284j2559j0298
56087A154409q101o364m924k959p01O21R29J509K751L689M028M573N371N578N477
56072A165886O424Q420R969J0589J1288J2278J2670J2611J3301J4607J5189J5160
56060A308392J5910J7207J7405J6755J7308J9149K0053J9507J9567K0913K1624
56049A513790K0998K0987K2401K3197K2219K1433K2515K4176K4762K4770K5068
56038A766316K5105K4564K4442K5123K5709K6196K7706K9803L0542L0100L1079
56027B066685L4274L7526L9754M2508M6263M9023N0041N1319N3830N5901N6873
$$ plain form
56109 2320566 2255535 2183367 2105065 2021497 1934330 1846757 1762055 1682033 1607650 1540010 1479493
56098 1479493 1425010 1375537 1331635 1294170 1262460 1235071 1211653 1192550 1177266 1164707 1154409
56087 1154409 1146308 1139944 1135020 1132061 1131360 1131981 1132910 1134419 1137170 1140859 1144887 1149460 1154831 1160409 1165886
56072 1165886 1172310 1180730 1190699 1201288 1212576 1224854 1237524 1250135 1263436 1278043 1293232 1308392
56060 1308392 1324302 1341509 1358914 1375669 1392977 1412126 1432179 1451686 1471253 1492166 1513790
56049 1513790 1534788 1555775 1578176 1601373 1623592 1645025 1667540 1691716 1716478 1741248 1766316
56038 1766316 1791421 1815985 1840427 1865550 1891259 1917455 1945161 1974964 2005506 2035606 2066685
56027 2066685 2100959 2138485 2178239 2220747 2267010 2316033 2366074 2417393 2471223 2527124 2583997
56016B583997N8599O1874O5046O7589P1100P5495P8465Q0078Q3373Q8955R3787
56005C408358R6856J00893J06791J11824J15440J20981J29315J36688J41678J48122
55995D616946J58151J68525J77206J87232K00374K13531K25356K39942K59531
55986F446794K80183K99111L19665L44514L70919L97707M29616M69401N13074
55977I870984N58462O10834O74261P45720Q24037R16153J027902J157728J306799
55968A7692880J485817J704243J963222K267655K634249L078557L606365M228254
55960C8661242M968949N849201O870827Q030692R330198J0749304J2221458J3651352
55952A10333223J4950217J6053156J6937691J7647350J8256172J8765076J9054239
$$ plain form
56016 2583997 2642596 2704470 2769516 2837105 2908205 2983700 3062165 3142243 3225616 3314571 3408358
56005 3408358 3505214 3606107 3712898 3824722 3940162 4061143 4190458 4327146 4468824 4616946
55995 4616946 4775097 4943622 5120828 5308060 5508434 5721965 5947321 6187263 6446794
55986 6446794 6726977 7026088 7345753 7690267 8061186 8458893 8888509 9357910 9870984
55977 9870984 10429446 11040280 11714541 12460261 13284298 14200451 15228353 16386081 17692880
55968 17692880 19178697 20882940 22846162 25113817 27748066 30826623 34432988 38661242
55960 38661242 43630191 49479392 56350219 64380911 73711109 84460413 96681871 110333223
55952 110333223 125283440 141336596 158274287 175921637 194177809 212942885 231997124
55945B31997124J8956486J8293884J6743332J3750829Q835921K158090n267941
55938C05467725j2053050j7190003k0398248k1908082k2100764k1349769k0007792
55931A70460017j8371857j6636576j4912575j3275599j1775043j0421889r206312
55924G5860166q124572p174431o339490n598857m944287m373323l874768l434684
55916C1995754l048448k714370k422747k162331j930666j728046j548070j383641
55908A5057435j235720j107046r93212q88409p94094p13660o43882n79528n21480
55899G580404m72728m30913l91946l56653l27109l00682k74223k49994k31110
55890D545046k15008j97639j80339j66445j54741j42239j30138j21065j13467
$$ plain form
55945 231997124 250953610 269247494 285990826 299741655 308577576 310735666 305467725
55938 305467725 293414675 276224672 255826424 233918342 211817578 190467809 170460017
55931 170460017 152088160 135451584 120539009 107263410 95488367 85066478 75860166
55924 75860166 67735594 60561163 54221673 48622816 43678529 39305206 35430438 31995754
55916 31995754 28947306 26232936 23810189 21647858 19717192 17989146 16441076 15057435
55908 15057435 13821715 12714669 11721457 10833048 10038954 9325294 8681412 8101884 7580404
55899 7580404 7107676 6676763 6284817 5928164 5601055 5300373 5026150 4776156 4545046
55890 4545046 4330038 4132399 3952060 3785615 3630874 3488635 3358497 3237432 3123965
55881C123965j04413r5128q8277q2471p4913o6920o1605n8433n5150n2869n4057
55870B329729n7475n9908o1222o3167o4984o4725o3292o2758o2229n9531n5560
55859A654878n2921n1544m9597m7339m6302m5884m4483m2795m2447m2604m1285
55848A147677l8902l7156l5759l3490l1138l0086k9266k6853k3705k1860k0930
55837H18532j9214j7194j6397j6012j4062j1167r710r956j0210j0123j0646j1286
55825F62555j0590q991q296q642q706q442q887r781r999r876j0439j0897r635
55812E39374p257n969o172o224n339m252l246j928q26q61j377q71N50J502J797
55797D98901K460L434L510K481J431R76Q15Q65J154R95j88j698k671l581n043
$$ plain form
55881 3123965 3019552 2924424 2836147 2753676 2678763 2611843 2550238 2491805 2436655 2383786 2329729
55870 2329729 2272254 2212346 2151124 2087957 2022973 1958248 1894956 1832198 1769969 1710438 1654878
55859 1654878 1601957 1550413 1500816 1453477 1407175 1361291 1316808 1274013 1231566 1188962 1147677
55848 1147677 1108775 1071619 1035860 1002370 971232 941146 911880 885027 861322 839462 818532
55837 818532 799318 782124 765727 749715 735653 724486 714776 704820 694610 684487 673841 662555
55825 662555 651965 642974 634678 626036 617330 608888 600001 590220 580221 570345 559906 549009 539374
55812 539374 532117 526148 519976 513752 508413 504161 500915 498987 498161 497300 495923 495052 495602 497104 498901
55797 498901 501361 504795 508305 510786 512217 513193 514008 514873 516027 517022 516834 515136 512465 508884 503841
55782E03841o165n951n340n729o538o527o535q253j0927j1982j0740r002q031
55769D02121p366o569n871n012l475k009j938l014l680l386k808k123j091n49
55755C53230j713l991n460n504n157n031m835m780n433o206n909m800m250m462
55741B85699m450m087m208m711m602l878l458l290k508j417j252j914k002j175
55727B42747m90l45j93l57j864m144n173m287k921k136j550j110j652k996l497
55712B10032k366o87N11J481K418K722K292J937J843J315M98N41J416J461r2j967
55696B23355k978l524m042l848k696j754j820k018j462p48o61p05k91o4o86j349
55680A94709r04L94J477K049K421K478J979J295R05O43K09j44j71l00q49j288
$$ plain form
55782 503841 497676 491725 486385 480656 474118 467591 461056 452803 441876 429894 419154 410152 402121
55769 402121 394755 388186 382315 377303 373828 371819 369881 366867 363187 359801 356993 354870 353779 353230
55755 353230 351517 347526 342066 336562 331405 326374 321539 316759 311326 305120 299211 294411 290161 285699
55741 285699 281249 277162 272954 268243 263641 259763 256305 253015 250507 249090 247838 245924 243922 242747
55727 242747 242257 241912 241719 241362 239498 235354 230181 225894 222973 220837 219287 218177 216525 213529 210032
55712 210032 207666 206979 207490 208971 211389 214111 216403 218340 220183 221498 221996 222537 223953 225414 225322 223355
55696 223355 220377 216853 212811 208963 206267 204513 202693 200675 199213 198465 197804 197099 196808 196744 196058 194709
55680 194709 193805 194199 195676 197725 200146 202624 204603 205898 206803 207446 207655 207511 207340 207040 206191 204903
55664B04903r69j63M56P47R05Q11L53k2K10Q25J120Q39L97L15O66J056J088Q79
55646B14416Q40Q17L4j578k688k219j034q12j687k416k561k931l773m278m071
55631A86059l797l817l728l487l617l948l650k823k551k869k387o11R49R44j6
55616A50651n95n22j32N07R94L80j324k565k262j338j136j453j435j361j999k917
55600A33493k940j887n84M63J192J204J26j347j890j138l0L93n0p88j076n34M54
55583A25061J132J324J534J890J760Q79O3J88J068K006K751L312L400K902K404
55568A51674K535L148L732M139M326L950K911J792J097N44k66j044j424j839k846
55553A72429l972m195l397k559k474k907l068k562j808j634k331l116k988k066
$$ plain form
55664 204903 203934 203771 204227 204974 205879 206690 207043 207021 207231 208056 209176 210015 210412 210727 211393 212449 213537 214416
55646 214416 215256 216073 216107 214529 211841 209622 208588 207776 206089 203673 201112 198181 194408 190130 186059
55631 186059 182262 178445 174717 171230 167613 163665 160015 157192 154641 151772 149385 148774 149723 150667 150651
55616 150651 150056 149534 149402 149909 150903 151283 149959 147394 145132 143794 142658 141205 139770 138409 136410 133493
55600 133493 130553 128666 128082 128545 129737 130941 131067 129720 127830 126692 126662 127055 127005 126217 125141 124607 125061
55583 125061 126193 127517 129051 130941 132701 133580 133643 133831 134899 136905 139656 142968 146368 149270 151674
55568 151674 154209 157357 161089 165228 169554 173504 176415 178207 179304 179848 179582 178538 177114 175275 172429
55553 172429 168457 164262 160865 158306 155832 152925 149857 147295 145487 143853 141522 138406 135418 133352
55539A33352j455j605j742j205m25j1K41P31J157J061O67M62M04J83j90o33j324
55522A29668k143k399j769r90r01j334j602j556j418j127o64n82j274k110k123
55507A07676j371p91q82j227j310j105q96r07j070r63k64N70O29k01r28q05k76
55490I5879r2j90r7J89M45P88J288J506J100M62N9k50o54p65l33N7j86o39n08
55471I8059J53P25R94J004M96n14j104m78P09J097M36l25m67q0N20R87P76k26
55453A02762j128j059n00n84j283j471p15J73N13N59P55J061J284J293Q33j97
55437A02296j193j394r29n38l67lM20K95j66M6J063J644R28l00q24n69k40l9L36
55418A00466Q01Q56L81j43k92j59j26l21m18J9Q90J424J035K13M7Q03J468R96
$$ plain form
55539 133352 131897 130292 128550 127345 126920 126909 127150 127881 129038 130099 130766 131228 131632 131815 131625 130992 129668
55522 129668 127525 125126 123357 122367 121466 120132 118530 116974 115556 114429 113765 113183 111909 109799 107676
55507 107676 106305 105514 104632 103405 102095 100990 100094 99187 98117 97154 96890 97460 98089 97888 96960 96155 95879
55490 95879 95787 95597 95500 95689 96134 96922 98210 99716 100816 101278 101337 101087 100433 99668 99335 99392 99206 98567 98059
55471 98059 98212 98937 99931 100935 101431 100917 99813 99335 100044 101141 101577 101252 100785 100705 101225 102212 102988 102762
55453 102762 101634 100575 100075 99491 98208 96737 96022 96195 96708 97267 98022 99083 100367 101660 102493 102296
55437 102296 101103 99709 98780 98242 97875 97872 98292 98587 98421 98467 99530 101174 102102 101802 100978 100409 100169 100130 100466
55418 100466 101267 102123 102504 102361 102069 101910 101784 101463 101045 101064 101954 103378 104413 104626 104673 105476 106944 107940
55400A07940m25j721k190k002j547q60J71J239J664J108M1p75j075j106r91n73
55384I8898K8L38K13J36M67Q48P68K86j62l80l86j49K59M97L78J16r5m12q78j120
55364I9650r42o85n79k86L25O05L0q44j144q86o27l57J80N15m3j048j196o7J370
55345I3971K138K168J729Q78j72q88j036r22p58l25M48J068R95L40j74O5R04J446
55327A01875R74j35p82o22m29p30r34m57J28J03k2O19J536J439K54q25j171j243
55309I9578j184m12J032K022J771P49k51j011j494j482j058o65l33L12J039J060
55293I9673L65LM82J008Q27L75L00L69J69J49R08K008K475K107J532J168R01O22
55275A15441L86J16l78j132j916k305j838o04L88J30r63j392o26J48j16p55n87
$$ plain form
55400 107940 107515 105794 103604 101602 100055 99195 99366 100605 102269 103377 103418 102643 101568 100462 99471 98898
55384 98898 98926 99264 99477 99613 100080 100928 101696 101982 101820 101440 101054 100905 101164 101661 102039 102155 102060 101648 100770 99650
55364 99650 98708 98023 97444 97158 97483 98088 98118 97274 96130 95244 94617 94260 94440 94955 94912 93864 92668 92601 93971
55345 93971 96109 98277 100006 100884 100712 99824 98788 97866 97108 96783 97231 98299 99294 99634 99460 99525 100429 101875
55327 101875 102849 102714 101932 101310 100881 100151 99217 98760 98888 98991 98969 99588 101124 102563 102817 101992 100821 99578
55309 99578 98394 97982 99014 101036 102807 103556 103305 102294 100800 99318 98260 97595 97262 97574 98613 99673
55293 99673 100038 100041 100523 101531 102358 102733 103033 103402 103571 103720 104628 106636 109111 111218 112750 113918 114819 115441
55275 115441 115827 115943 115565 114433 112517 110212 108374 107770 108158 108288 107325 105933 105307 105455 105339 104584 103997
55258A03997K63P65O65N14M51J34k42n5N66P12R2n57o71o20p83p72j77N35O48
55239A05465L31L54P96Q46N8r09j184q22n44n80m31J11M41J2p24q43k38K59Q0
55220A02478l43k89K11M69J35l22k26L94P96M50k58n01r9L53L96K78L46M33K79
55201A04980J11K82N81N08M8l38l89j91J94P28J059Q04O2o76j094j070m61O18
55183A05756J488J539J011N20R0o19j270j085j29N69L81k55p46j064j302j225
55167A03659p70l20j51l2L18Q33J312J601J465Q51K81L38P42O25j58q42r36p47
55149A08069m75K12J282J918J589Q01K96J61K07N10R41Q71N1p46o33J54O05K03
55131A16016o07j061q05j37L24L67N24J228J896J599N60n0O6m9q33j336q35j25
$$ plain form
55258 103997 104260 105025 105690 106204 106655 106789 106547 106492 107058 107770 107862 107305 106634 106014 105231 104459 104282 104817 105465
55239 105465 105796 106150 106946 107792 107850 106941 105757 104935 104391 103811 103380 103491 103932 103944 103220 102377 102139 102398 102478
55220 102478 102135 101846 102057 102526 102661 102339 102113 102507 103303 103753 103495 102994 102895 103248 103644 103922 104268 104701 104980
55201 104980 105091 105373 105954 106462 106510 106172 105783 105592 105786 106514 107573 108377 108439 107763 106669 105599 105138 105756
55183 105756 107244 108783 109794 110314 110404 109785 108515 107430 107301 107870 108251 107996 107250 106186 104884 103659
55167 103659 102889 102569 102418 102386 102704 103537 104849 106450 107915 108766 109047 109385 110127 110752 110594 109752 108816 108069
55149 108069 107594 107806 109088 111006 112595 113396 113692 113853 114060 114570 115511 116382 116433 115687 115054 115208 115813 116016
55131 116016 115409 114348 113543 113406 113730 114097 114621 115849 117745 119344 119904 119854 119920 119871 119038 117702 116867 116742
55113A16742k38q20q53k96L6j61m86o05m10K51J195J676J216L81J1J47L48N75
55095A18709R78J258J026N12J31k58r38j592j707j384j020n85QL53J41j15J30
55078A15647M62K03l21k83K15M22L52P34J554J904J303K31p35j360j347n61L01
55061A18721K92l64n29R8N15L3p72j127j035p23n7Q05J081L82n66r09p53o39n23
55042A13930l9O13Q65O88N85P21P06L11j01m3M63R68J149J084R64P23J77m21m02
55023A22941M51J293J018l81j647j678p07J31J06m83q42o13j39P4k2p7O4K37L99
55004A20125P79J354J640J323P39L20l9n57q43k95Q76J715J637J024N59M08K00
54987A30965l79j097j280n72M33P41K42j17K66P58N35j45n00n17o98q68k99J000
$$ plain form
55113 116742 116504 115684 114831 114535 114571 114410 113924 113319 112909 113160 114355 116031 117247 117628 117639 117786 118134 118709
55095 118709 119687 120945 121971 122483 122614 122356 121418 119826 118119 116735 115715 115130 115138 115491 115632 115517 115647
55078 115647 116109 116312 115991 115708 115923 116345 116697 117431 118985 120889 122192 122423 121688 120328 118981 118420 118721
55061 118721 119013 118649 118120 118218 118733 118766 117994 116867 115832 115109 115052 115857 116938 117320 116754 115845 115092 114453 113930
55042 113930 113891 114504 115369 116057 116642 117363 118069 118380 118279 118236 118699 119667 120816 121900 122864 123587 123764 123343 122941
55023 122941 123392 124685 125703 125322 123675 121997 121290 121421 121527 121044 120202 119589 119450 119524 119502 119425 119489 119726 120125
55004 120125 120904 122258 123898 125221 125960 126280 126241 125684 124841 124546 125422 127137 128774 129798 130357 130765 130965
54987 130965 130586 129489 128209 127637 128070 128811 129053 128936 129202 129960 130495 130350 129850 129333 128635 127767 127468 128468
54969A28468K087K292J832J133L21m26p69o88m95k61K11P90J005P63M72L32J46
54952A37213j16j95r6j62m14n22m99p47j234j321o97J22N81O65M96lo74q88k96
54933A31213O65J375J675J656J305Q06O54J050J529J628J547J732K167K523K683
54918A54208K728K647K532K801L754N017N814N778N120M118K826J350J8q99j557
54903A96255k353l404m355m841m988n148n198m553l116j710j165j371j677j866
54889A50510k118k286j939j093k37L57P72J033J135J411K209L158L519L217K932
54874A62580L096L526M044M594M696L743K146J237J554K045J474p6j679k735l149
54859A87096k937k402k260k927l915m451m361l981l573l254l082k855k159j096
$$ plain form
54969 128468 130555 132847 134679 135812 136133 135707 134938 134250 133755 133494 133705 134495 135500 136263 136735 137067 137213
54952 137213 137097 136902 136806 136644 136230 135708 135209 134462 133228 131907 131210 131332 131913 132578 133074 133071 132397 131509 131213
54933 131213 131878 133253 134928 136584 137889 138695 139349 140399 141928 143556 145103 146835 149002 151525 154208
54918 154208 156936 159583 162115 164916 168670 173687 179501 185279 190399 194517 197343 198693 198711 197812 196255
54903 196255 193902 190498 186143 181302 176314 171166 165968 161415 158299 156589 155424 154053 152376 150510
54889 150510 148392 146106 144167 143074 142837 143194 143966 144999 146134 147545 149754 152912 156431 159648 162580
54874 162580 165676 169202 173246 177840 182536 186279 188425 189662 191216 193261 194735 194659 192980 190245 187096
54859 187096 184159 181757 179497 176570 172655 168204 163843 159862 156289 153035 149953 147098 144939 143843
54845A43843m75q07j523j740j385j002p62m07K2R8l26q75j105r12m86j00M6Lj
54826A32106Q2Ql70q33j071j000o99k66P6P8j49j96P2L21L17K64M41P69R95R58
54806A31903N41j82o92m15L88P59L36j38M9N88P93O43M93K78k65q23o87L00J473
54787A35342K033J718R39M08M30N04p0j063j436p90J7J21j46N1P92J531K046K538
54769A44965L108L723M409M908M558L257K084K185L296M200M351M202M104L832
54755A97182L269K638J923P53q59k278k937k932k743k747l068l501l601l139k454
54740A75506k078k150k451k742k708j959o54K52Q6n10l93M29Q81M65j19j45K32
54723A61942N97J007J620K183K361K287K370K855L666M436M571L658K038N84k09
$$ plain form
54845 143843 143368 142561 141038 139298 137913 136911 136149 135742 135764 135862 135536 134661 133556 132644 132158 132058 132104 132107 132106
54826 132106 132188 132196 131826 130993 129922 128922 128223 127957 128033 128111 127962 127766 127838 128159 128476 128740 129181 129950 130945 131903
54806 131903 132444 132262 131570 131155 131543 132302 132638 132500 132549 133137 133930 134573 135066 135344 135079 134256 133569 133869 135342
54787 135342 137375 139093 140032 140440 140870 141374 141304 140241 138805 138015 138032 138153 138007 138058 138850 140381 142427 144965
54769 144965 148073 151796 156205 161113 165671 168928 171012 173197 176493 180693 185044 189246 193350 197182
54755 197182 200451 203089 205012 205765 204906 202628 199691 196759 194016 191269 188201 184700 181099 177960 175506
54740 175506 173428 171278 168827 166085 163377 161418 160764 161016 161102 160592 160199 160628 161509 161974 161855 161710 161942
54723 161942 162539 163546 165166 167349 169710 171997 174367 177222 180888 185324 189895 193553 195591 196175 195966
54708A95966o66j288k114k904l557m056m201l761k828j894j509j840k453k652
54694A60243k172j430r56p63o10n12o86j091j514j921k259k117j147J64P79K91
54678A44299o32j075p07J52Q56P73j94j306j687j304q57p18o04l26j36n2M10J332
54660A38224J849J131l62j297j021k13J11k22n31k54L76P25N55J69j72m83n72
54643A38013K2J231K054J678O23qr7l83r01p72J79P85J65r11j141n17j25m78r53
54624A38464p97K6R93J532J329O09O0J05L05m5q79j347r06P0Q50J086Q73M35M9
54605A42812k7K38N69P43Q03Q17N86j9o14n70J51P48M71m29r81p18k36l33q92
54586A43119j008j97R49J490J229P39M33R7m76q39m13N39J060P65L21L71N63K45
$$ plain form
54708 195966 195300 194012 191898 188994 185437 181381 177180 173419 170591 168697 167188 165348 162895 160243
54694 160243 158071 156641 155685 154922 154312 153800 153114 152023 150509 148588 146329 144212 143065 143229 144008 144299
54678 144299 143667 142592 141885 142037 142893 143666 143472 142166 140479 139175 138318 137600 136996 136670 136534 136482 136892 138224
54660 138224 140073 141204 140842 139545 138524 138311 138422 138200 137669 137415 137791 138516 139071 139240 139068 138585 138013
54643 138013 138035 139266 141320 142998 143621 143613 143516 143133 142232 141460 141639 142424 142589 141678 140537 140020 139895 139417 138464
54624 138464 137667 137693 138686 140218 141547 142156 142216 142321 142626 142581 141702 140355 139449 139519 140369 141455 142328 142763 142812
54605 142812 142785 143023 143592 144335 145138 145955 146541 146522 145908 145338 145489 146237 146708 146279 145298 144580 144344 144011 143119
54586 143119 142111 141914 142863 144353 145582 146321 146754 146851 146375 145536 145123 145662 146722 147487 147808 148179 148742 148987
54568A48987l48m38n3q2q25j435j135l03J72P8r1N1M87R43J037N18k65n11M1P30
54548A47558Q73O62O50Q44Q28M64m5n19p01j90R75K042K394K347K506K734K455
54531A65877J639P05j90j013j325p47J86N47K26j79m31p52j016q85o96j114j858
54514A58974j830p42M37Q74P56N46K68j8l0N5l95j347j830j314n68n05r07q61
54496A51563j7J213K193K380J537J25q86r28l00L77O76L47n12j112n72Q09J778
54479A58671J746J361J207J002N56M03P61Q76K72l44k44J00m8l11J19J072J795
54462A68994K203K626K711J855M68l43l00j77n19j038j276j131p05k26m2j11J45
54445A73134R29J449R80J21j1O02J037R53P29L59n56j690k107j720j472j809k041
$$ plain form
54568 148987 148639 148201 148148 148066 147241 145806 144671 144368 144540 144618 144527 144578 145065 146008 147045 147563 147298 146787 146828 147558
54548 147558 148431 149093 149743 150587 151415 151879 151834 151315 150614 150424 151399 153441 155835 158182 160688 163422 165877
54531 165877 167516 168221 168031 167018 165693 164946 165132 165679 165905 165726 165295 164543 163527 162642 161946 160832 158974
54514 158974 157144 156402 156839 157713 158469 159015 159283 159265 159235 159290 158895 157548 155718 154404 153836 153331 152424 151563
54496 151563 151546 152759 154952 157332 158869 158994 158108 157180 156880 157257 157933 158280 157768 156656 156084 156893 158671
54479 158671 160417 161778 162985 163987 164543 164946 165707 166583 166855 166511 166267 166367 166319 166008 166127 167199 168994
54462 168994 171197 173823 176534 178389 178857 178514 178214 178037 177518 176480 175204 174073 173368 173142 173100 172989 173134
54445 173134 174063 175512 176492 176613 176602 177204 178241 179194 179923 180282 179726 178036 175929 174209 172737 170928 168887
54428A68887j580q14l00K2K97L09O2R2O32J144J122P94N70L73K1k75k84j78j26
54409A70768N2M52P37O81N96P78R36O70J29k11j26L29J047J645J504N31m43n29
54391A79546J12O17N58K80K39N38J074J621J796J355N47r6l06j83J57N79P06J82
54373A89322p13j191q92m03n24j241j725j360l81N14R36R38O34P8m31l70L83J224
54355A84798J481J207R76J033J146J208J416J679J433M10p82j236o97L39J262
54340A95673J706J521P98n6n95p48p86r42j227j550j839k034k146k191k013j355
54324A82216l80J22m62j594j919q47P20J477J172N25M9l53p58q83o53m78n54m31
54306A76969K09O98P8j524k815k779j573M1J496K413K406J437N1j097j722j736
$$ plain form
54428 168887 167307 166493 166193 166215 166512 166821 166883 166975 167607 168751 169873 170667 171237 171610 171631 171356 171072 170894 170768
54409 170768 170820 171272 172009 172690 173286 174064 175000 175670 175799 175588 175462 175791 176838 178483 179987 180518 180075 179546
54391 179546 179658 180275 180833 181113 181352 181890 182964 184585 186381 187736 188283 188187 187881 187698 187855 188434 189140 189322
54373 189322 188609 187418 186526 186123 185599 184358 182633 181273 180892 181406 182342 183280 183914 183992 183561 183191 183574 184798
54355 184798 186279 187486 188462 189495 190641 191849 193265 194944 196377 196787 196005 194769 194072 194411 195673
54340 195673 197379 198900 199698 199642 199047 198299 197513 196571 195344 193794 191955 189921 187775 185584 183571 182216
54324 182216 181836 181958 181496 179902 177983 177136 177856 179333 180505 181030 181079 180726 179968 179085 178432 177954 177400 176969
54306 176969 177178 177876 177954 176430 173615 170836 169263 169304 170800 173213 175619 177056 177107 176010 174288 172552
54290A72552j072o5M59M7p40j007o44j50L24J048J897K203J634O75Lk18k42k57
54272A76447k44o1M03R88J245Q85K06k01j21K57Q14J513J920J425J33r74j108
54255A83527n45j38k62n75o26l07J48M39M87M80N90O37L00l16o40l15K75M21j00
54236A83480p43p56RQ25P85j70j095j173o55l40m34m59j50K58N93Q83Q95K73o30
54217A81396q48p6P69P34k3o95q71o13m0N56O17L8m41j83L09J51m48m34M11R87
54197A81296M21p30j227o65K09M31k45j166j420p40K17O08L76J37K45M01K94M0
54179A78482j33k40k90j47R8k0p50j622j924j489p00R6Q21J406J748J871J831
54162A79038J495P34j63o71o74o35r00j190j017l89J98L95K87P3k65p74j260j387
$$ plain form
54290 172552 171480 171415 171874 171921 171181 170174 169530 169380 169704 170752 172649 174852 176486 177161 177164 176946 176704 176447
54272 176447 176203 176142 176545 177533 178778 179663 179869 179668 179547 179804 180618 182131 184051 185476 185609 184635 183527
54255 183527 182982 182844 182582 182007 181381 181074 181222 181661 182148 182628 183218 183855 184155 183839 183199 182884 183159 183580 183480
54236 183480 182737 181981 181990 182815 183600 183430 182335 181162 180507 180167 179733 179274 179124 179382 179975 180858 181753 182026 181396
54217 181396 180548 180472 181241 181975 181952 181257 180386 179773 179733 180289 180906 180944 180503 180320 180629 180780 180332 179898 180309 181296
54197 181296 181717 180987 179760 179095 179304 179735 179490 178324 176904 176164 176381 176989 177365 177502 177747 178148 178442 178482
54179 178482 178349 178109 177819 177672 177770 177750 177000 175378 173454 171965 171265 171361 172182 173588 175336 177207 179038
54162 179038 180533 181267 181104 180433 179759 179124 178224 177034 176017 175628 175826 176221 176508 176581 176316 175542 174282 172895
54144A72895j064n70k28n4J46M36O52O59N33M18L89N63J082J685J573K45j535
54127A77825k228j200N27J544J598J406J392J351J127Q98O58J36n42p05K1J145
54111A84953J877J907J388N29m18j113j342j148n57L99J260J301M87k13n0M98
54095A89758N07J8j42K36M05j73j089j580j342n69L58R90J029O25K19K6k3Q9M60
54076A89802R13J090J004J037J348J679J801J679J242N11k0K45J093J654J627
54061B06705J702K381L181L537L795M559N503N722N097M521M678N245N464N050
54047B67140M341L855L792L820L304J907L3j479k017j584o81L5J86J7J81R83K047
54030B85880K882L534M262M874M848M095L151K505K130J788J475J329J286J111
$$ plain form
54144 172895 171831 171261 171033 170979 171125 171561 172213 172872 173405 173823 174212 174775 175857 177542 179115 179360 177825
54127 177825 175597 174397 174924 176468 178066 179472 180864 182215 183342 184240 184898 185034 184492 183787 183808 184953
54111 184953 186830 188737 190125 190654 190236 189123 187781 186633 186076 186475 187735 189036 189523 189310 189260 189758
54095 189758 190265 190283 190141 190377 190782 190609 189520 187940 186598 186029 186387 187377 188406 189031 189250 189276 189253 189342 189802
54076 189802 190715 191805 192809 193846 195194 196873 198674 200353 201595 202106 202086 202331 203424 205078 206705
54061 206705 208407 210788 213969 217506 221301 225860 231363 237085 242182 246703 251381 256626 262090 267140
54047 267140 271481 275336 279128 282948 286252 288159 288192 286713 284696 283112 282431 282466 282652 282669 282850 283833 285880
54030 285880 288762 292296 296558 301432 306280 310375 313526 316031 318161 319949 321424 322753 324039 325150
54016C25150O89J40l92r02j431j868k059k123k432l054l414k932j942j512k247
54001B99671l627m725n113m863m113l090k289k077k249k402k567l043l643l677
53987B52193k819j602q25p63j086j355j388j327j453j882k284k080j066J76P43
53972B33182L42l85n30J30R63J228P41j67j018j423j126k46O74J125J067P95N53
53955B35905O29J442K977M347M624M120M081M947N767N650M960M496M242L717
53941B91904L033K759K947L067K848K547K360K164J844J455J046P40P98J250J602
53926C22364J401R66R94J582K247K784L435M156M531M573M907N829O771P117P030
53911C80687P065P348P669Q014Q539R148R536R569R274Q560P373O115N455N553
$$ plain form
54016 325150 325839 325979 325587 324685 323254 321386 319327 317204 314772 311718 308304 305372 303430 301918 299671
54001 299671 296044 291319 286206 281343 277230 274140 271851 269774 267525 265123 262556 259513 255870 252193
53987 252193 249374 247772 246947 246184 245098 243743 242355 241028 239575 237693 235409 233329 232263 232439 233182
53972 233182 233524 233139 232609 232739 233702 234930 235671 235504 234486 233063 231937 231691 232365 233490 234557 235352 235905
53955 235905 236534 237976 240953 245300 249924 254044 258125 263072 268839 274489 279449 283945 288187 291904
53941 291904 294937 297696 300643 303710 306558 309105 311465 313629 315473 316928 317974 318714 319512 320762 322364
53926 322364 323765 324731 325725 327307 329554 332338 335773 339929 344460 349033 353940 359769 366540 373657 380687
53911 380687 387752 395100 402769 410783 419322 428470 438006 447575 456849 465409 472782 478897 484352 489905
53897D89905N735N173L837K493J730J140l25l157o628r451j0961j1565j2043j2687
53883D43196j3070j2603j1286r865r168r202r161q440p379o782o864p052o728
53870C25596n898n057m712m998n532n689n129m132l234k732k650k923l291l291
53856B66328k759k169j977j832j097K1N37O1p04j034j070j220j282q45j04L27
53840B51181K70M6j51m61r01j207j185r45o81n55p01j106j406j164m45J85L48
53823B41122K85L54M34K04j18J19J053J859J664O94O7M46J328J819J717J546J716
53806B56309K092K344K430K623L119L734L998L711L394L871N224O399O239M772
53792C10259L162K457K716L327L723L709L402L089K960K887K508J634M28p94j790
$$ plain form
53897 489905 495640 500813 504650 507143 508873 510013 509688 506531 499903 490452 479491 467926 455883 443196
53883 443196 430126 417523 406237 396372 387204 378002 368841 360401 353022 346240 339376 332324 325596
53870 325596 319698 314641 309929 304931 299399 293710 288581 284449 281215 278483 275833 272910 269619 266328
53856 266328 263569 261400 259423 257591 256494 256515 257052 257113 256409 255375 254305 253085 251803 250958 250854 251181
53840 251181 251451 251497 251346 250885 249984 248777 247592 246647 245966 245411 244710 243604 242198 241034 240589 240774 241122
53823 241122 241407 241761 242195 242399 242281 242400 243453 245312 246976 247670 247737 248183 249511 251330 253047 254593 256309
53806 256309 258401 260745 263175 265798 268917 272651 276649 280360 283754 287625 292849 299248 305487 310259
53792 310259 313421 315878 318594 321921 325644 329353 332755 335844 338804 341691 344199 345833 346261 345467 343677
53777C43677k473k917l324l819m219m249l896l470l276l402l740m079m193m063
53763B92557l953m062m154l790k947k110j774k000k469k813k865k700k476k157
53749B52287j617r92o53o57o22l90m13r98j619j539q53k45L3K30L45J58n7K89
53731B42687J083J535J353J115J148J023M42j11j43J32L69O99J226J568J481J368
53715B56975J583J813J777J846K285K456J754Q04P20J497K185K443K822L441L546
53700B87947K705J563J026J293K041K881L315K868J711Q23J027K120L168L402
53686C17890K689J488N60M71J038J499J292N66j99p28j042j265j496j683j585
53671C19495j121o88p70j179j149l73N66J015J019R57P69J30q24j449j304n88
$$ plain form
53777 343677 341204 338287 334963 331144 326925 322676 318780 315310 312034 308632 304892 300813 296620 292557
53763 292557 288604 284542 280388 276598 273651 271541 269767 267767 265298 262485 259620 256920 254444 252287
53749 252287 250670 249678 249025 248368 247746 247356 246943 245945 244326 242787 241934 241689 241722 241952 242297 242455 242398 242687
53731 242687 243770 245305 246658 247773 248921 249944 250386 250275 250132 250264 250633 251332 252558 254126 255607 256975
53715 256975 258558 260371 262148 263994 266279 268735 270489 271293 272013 273510 275695 278138 280960 284401 287947
53700 287947 290652 292215 293241 294534 296575 299456 302771 305639 307350 308173 309200 311320 314488 317890
53686 317890 320579 322067 322627 323098 324136 325635 326927 327493 327294 326566 325524 324259 322763 321080 319495
53671 319495 318374 317686 316916 315737 314588 314215 314781 315796 316815 317772 318541 318671 317847 316398 315094 314506
53655C14506J40M52K30l95j165j804k091j952j547j154q13j83R33K028K306J717
53639C11208J090J082J429J528J290J008P84O15P42J336K014K214K027K004K197
53624C32568K012J264P42J310K771M067M447M051L505L262L400L724L949L933
53610C75005L788L775L975M130L869L143K378K054K197K484K882L688M767N211
53596D23346M400L042K448K780K857J968Q76N91Q67P97L26K09O84J129J048N59
53580D47927j79j206k231k691k615k760l483m169m229l969l901l796l160k217
53566D07321j590j337j053p25o96q62p23l06k19o13p96k29P39J431J671J651J449
53549D05113J119R36J156J693K321L020L839M596M960M775M207L748M002N125
$$ plain form
53655 314506 314646 315098 315328 314933 313768 311964 309873 307921 306374 305220 304407 304224 305157 307185 309491 311208
53639 311208 312298 313380 314809 316337 317627 318635 319419 320034 320776 322112 324126 326340 328367 330371 332568
53624 332568 334580 335844 336586 337896 340667 344734 349181 353232 356737 359999 363399 367123 371072 375005
53610 375005 378793 382568 386543 390673 394542 397685 400063 402117 404314 406798 409680 413368 418135 423346
53596 423346 427746 430788 433236 436016 438873 440841 441717 442308 443175 443972 444298 444507 445191 446320 447368 447927
53580 447927 447748 446542 444311 441620 439005 436245 432762 428593 424364 420395 416494 412698 409538 407321
53566 407321 405731 404394 403341 402616 401920 401058 400335 400029 399810 399197 398401 398172 398911 400342 402013 403664 405113
53549 405113 406232 407168 408324 410017 412338 415358 419197 423793 428753 433528 437735 441483 445485 450610
53535D50610O416O890O468O134O699P863Q869R509J0071J0664J1253J2041J3173
53522E66660J4272J4958J5597J6788J8126J8445J7504J6598J6976J8356J9649
53511G53929K0603K1879K3631K4989K5132K4412K3963K4497K5718K6745K6923
53500A022421K6256K5274K4539K4238K4226K4297K4291K4014K3385K2654K2221
53489A287816K2072K1753K1092K0556K0518K0501J9732J8326J7221J6810J6429
53478A502826J5425J4139J3248J2644J1650J0016Q007N709L053M70j274k220l420
53465A590273n633q351j0629j2406j4348j6566j8239j8673j8316j8318j9230k0505
53453A409059k1366k1811k2405k3185k3414k2660k1577k1034k0905k0404j9389
$$ plain form
53535 450610 457026 463916 470384 476518 483217 491080 499949 509458 519529 530193 541446 553487 566660
53522 566660 580932 595890 611487 628275 646401 664846 682350 698948 715924 734280 753929
53511 753929 774532 796411 820042 845031 870163 894575 918538 943035 968753 995498 1022421
53500 1022421 1048677 1073951 1098490 1122728 1146954 1171251 1195542 1219556 1242941 1265595 1287816
53489 1287816 1309888 1331641 1352733 1373289 1393807 1414308 1434040 1452366 1469587 1486397 1502826
53478 1502826 1518251 1532390 1545638 1558282 1569932 1579948 1587955 1593664 1596717 1597187 1595913 1593693 1590273
53465 1590273 1584640 1576289 1565660 1553254 1538906 1522340 1504101 1485428 1467112 1448794 1429564 1409059
53453 1409059 1387693 1365882 1343477 1320292 1296878 1274218 1252641 1231607 1210702 1190298 1170909
53442A170909j8453j7713j6501j4590j2719j1418j0090q095o037m974m660l702
53430A041957j530Q34K277L109M443O556Q553R573R847J0392J1928J4303J6864
53417A139106J9167K1207K3101K4781K6113K7177K8274K9704L1525L3511L5360
53406A439026L6994L8627M0421M2221M3811M5399M7446N0010N2527N4420N5614
53395A946516N6368N6857N7177N7553N8275N9434O0735O1552O1242N9602N7073
53384B592384N4281N1527M8866M6446M4282M1882L8728L5056L1530K8104K3953
53373C037039J8719J3005P405J843l701q730j3126j7773k3439k9575l5065l9739
53361B906863m4302m8983n3103n5963n7489n8083n8277n8397n8226n7318n5960
$$ plain form
53442 1170909 1152456 1134743 1118242 1103652 1090933 1079515 1069425 1061330 1055293 1050319 1045659 1041957
53430 1041957 1040427 1041261 1043538 1046647 1051090 1057646 1066199 1075772 1085619 1096011 1107939 1122242 1139106
53417 1139106 1158273 1179480 1202581 1227362 1253475 1280652 1308926 1338630 1370155 1403666 1439026
53406 1439026 1476020 1514647 1555068 1597289 1641100 1686499 1733945 1783955 1836482 1890902 1946516
53395 1946516 2002884 2059741 2116918 2174471 2232746 2292180 2352915 2414467 2475709 2535311 2592384
53384 2592384 2646665 2698192 2747058 2793504 2837786 2879668 2918396 2953452 2984982 3013086 3037039
53373 3037039 3055758 3068763 3076168 3078011 3074310 3065580 3052454 3034681 3011242 2981667 2946602 2906863
53361 2906863 2862561 2813578 2760475 2704512 2647023 2588940 2530663 2472266 2414040 2356722 2300762
53350B300762n5174n5211n4818n2943n0554m9437m9616m9345m7677m5574m4164
53339A746249m3169m1782m0021l8449l7105l5489l3315l0774k8222k5881k3705
53328A368337k1460j9175j7389j6522j6158j5494j4408j3416j2650j1675j0366
53317A199624r114q004o680n199m192l756l033j408O13K247L497M900O674Q734
53303A184903J1037J3407J5411J6824J7897J8846J9573K0161K1035K2314K3577
53292A384985K4671K6016K7648K8723K8689K8195K8026K7738K6342K3979K1801
53281A676813K0355J9031J7176J4882J2509J0051P225L830p5m051p435r929j1889
53268A748493j3770j5572j7248j9201k1734k4310k6083k7029k7890k9004k9947
$$ plain form
53350 2300762 2245588 2190377 2135559 2082616 2032062 1982625 1933009 1883664 1835987 1790413 1746249
53339 1746249 1703080 1661298 1621277 1582828 1545723 1510234 1476919 1446145 1417923 1392042 1368337
53328 1368337 1346877 1327702 1310313 1293791 1277633 1262139 1247731 1234315 1221665 1209990 1199624
53317 1199624 1190510 1182506 1175826 1170627 1166435 1162679 1159646 1158238 1158851 1161098 1164595 1169495 1176169 1184903
53303 1184903 1195940 1209347 1224758 1241582 1259479 1278325 1297898 1318059 1339094 1361408 1384985
53292 1384985 1409656 1435672 1463320 1492043 1520732 1548927 1576953 1604691 1631033 1655012 1676813
53281 1676813 1697168 1716199 1733375 1748257 1760766 1770817 1778042 1781872 1781797 1777746 1770311 1760382 1748493
53268 1748493 1734723 1719151 1701903 1682702 1660968 1636658 1610575 1583546 1555656 1526652 1496705
53257A496705l0364l0530l0954l1865l3112l4143l4164l2891l1193l0352l0624
53246A146513l1050l0755k9842k8849k8058k7551k7380k7255k6518k4915k3030
53235H41310k1569k0481j9227j7679j6324j5554j5231j4993j4700j4359j3826
53224F57367j2905j1796j1100j1154j1482j1360j0816j0658j1299j2147j2461
53213E30189j2297j2059j1580j0422q888p897p753p829p588p292p346p587p638
53200D14013p510p426p328o965o278n402m485l764l547l865m308m475m407m288
53186C39965m032l550l175l345l828l800k852j582r14j127j739k169k154j680
53172C04018r42m46o91j508k067j872j458j633k211k238j428o39n98q44n28K47
$$ plain form
53257 1496705 1466341 1435811 1404857 1372992 1339880 1305737 1271573 1238682 1207489 1177137 1146513
53246 1146513 1115463 1084708 1054866 1026017 997959 970408 943028 915773 889255 864340 841310
53235 841310 819741 799260 780033 762354 746030 730476 715245 700252 685552 671193 657367
53224 657367 644462 632666 621566 610412 598930 587570 576754 566096 554797 542650 530189
53213 530189 517892 505833 494253 483831 474943 467046 459293 451464 443876 436584 429238 421651 414013
53200 414013 406503 399077 391749 384784 378506 373104 368619 364855 361308 357443 353135 348660 344253 339965
53186 339965 335933 332383 329208 325863 322035 318235 315383 313801 312887 311760 310021 307852 305698 304018
53172 304018 303076 302630 301939 300431 298364 296492 295034 293401 291190 288952 287524 286885 286287 285443 284915 285162
53156B85162N88O0q93j686k067j910j210m00j16l85o01m14k16m53q88r39m85N0
53138B73197K38L5k78l39M2P06J287J541J402Q84J67k81j10L48M08K8n4N37J163
53119B80921J081N37L27O30Q77O71J81l12o66o70k01L52L31k89q12p88n77o08
53101B80985o31k49K11Pr17j769j893j414p95k87j3j52o71j095r69m52j48m15
53083B69333j000j366j186n69K2J80QM2N13R31P40J96N2L99M45l06j200j266n06
53064B65462J47P1l84n19j29M24O61L80k11o24m96K8L80K22j24n2N53J115J026
53045B67930M27O5L65Q86Q35Qj048j670j694j383j085r92j067j074q67o24o39
53028B58373q66r46o87j86N28J466K198J931N27j003j528j089o09n51m77M3P27
$$ plain form
53156 285162 285750 285810 284917 283231 281164 279254 278044 277644 277528 277143 276542 276128 275912 275459 274571 273632 273147 273197
53138 273197 273435 273470 273192 272853 272895 273601 274888 276429 277831 278715 278882 278601 278491 278839 279247 279275 279221 279758 280921
53119 280921 282002 282539 282866 283496 284373 285044 285225 284913 284247 283577 283376 283728 284059 283770 282958 282170 281593 280985
53101 280985 280354 280105 280316 280323 279406 277637 275744 274330 273535 273248 273235 273083 272412 271317 270348 269896 269748 269333
53083 269333 268333 266967 265781 265212 265234 265414 265422 265464 265977 266908 267648 267844 267896 268295 268740 268434 267234 265968 265462
53064 265462 265609 265680 265296 264777 264648 265072 265733 266113 265902 265278 264782 264810 265190 265412 265288 265236 265789 266904 267930
53045 267930 268357 268422 268787 269673 270508 270516 269468 267798 266104 264721 263636 262644 261577 260503 259636 259012 258373
53028 258373 257507 256561 255874 255688 256216 257682 259880 261811 262338 261335 259807 258718 258109 257558 257081 257124 257851
53011B57851J055J008R51R98Q18J12r10j669j759j265n10L00J002J238P86J45
52995B60151J61Q84J323P78j77n76m60n66r03o84K51R62P49J74J95Q49J497J953
52977B66561K571L296L447K634J463Q95J229J986K602K818K513J646O07J35N26
52962B94929J130J100N03J62M27P20M57j64o02o84n35k53j35o50j729k470k197
52945B90009j447j194j466j540j288j365j983k437k151j463j001q62p89p18p65
52930B69540r75j285j531j452j001o29p27q68k28J059J761J041m50j423j380q16
52914B60636m11m34o92o61M3J100J708J514Q88J97n74j245j217l82L80K99k43
52897B60906m29l06n02r86j048m54K36N91P94J045J099P25J09m16p11p18l49K55
$$ plain form
53011 257851 258906 259914 260865 261863 262681 262793 261883 260214 258455 257190 256680 256980 257982 259220 260006 260151
52995 260151 260312 261196 262519 263297 263120 262544 262084 261518 260615 259931 260182 261144 261893 262067 262262 263111 264608 266561
52977 266561 269132 272428 275875 278509 279972 280867 282096 284082 286684 289502 292015 293661 294268 294403 294929
52962 294929 296059 297159 297662 297824 298251 298971 299428 299264 298662 297978 297443 297190 297055 296405 294676 292206 290009
52945 290009 288562 287368 285902 284362 283074 281709 279726 277289 275138 273675 272674 271812 271023 270305 269540
52930 269540 268565 267280 265749 264297 263296 262667 261940 261072 260844 261903 263664 264705 264255 262832 261452 260636
52914 260636 260225 259791 259099 258438 258481 259581 261289 262803 263691 263888 263314 262069 260852 260470 260850 261149 260906
52897 260906 260477 260171 259669 258683 257635 257181 257417 258008 258802 259847 260946 261671 261780 261364 260653 259935 259586 259841
52879B59841O32M04l41j104j300o16O83J784K030J585J237J406J720J638J259
52864B70858J252K012L076L513K890J768J067J017J024O16lm83r39j544j932j614
52848B82578q12k73l53q82j776l057m235m466l618k527j867j436r44p59j227j767
52832B52579j520o40o8j78m55n38o81q69m34Q77K071K029J021K87L01L60j9l57
52814B53766j88Ql98j025r24O5J161J790K138K452K435J695M06q05j378j094k06
52797B59898N54M49n23j584k087k130k101k029j708j212p84m23j2K98K15j98n10
52780B46113m41j04K19L49K48O1O0L39N90M72J38J08N77J161J443J442J369J179
52762B55323O68j14p80j029r79r35r46p73l00J66K34p5l23j65L52R39J294J184
$$ plain form
52879 259841 260473 260877 260536 259432 258132 257516 258199 259983 262013 263598 264835 266241 267961 269599 270858
52864 270858 272110 274122 277198 280711 283601 285369 286436 287453 288477 289093 289090 288607 287668 286124 284192 282578
52848 282578 281766 281493 281140 280258 278482 275425 271190 266724 263106 260579 258712 257276 256332 255573 254346 252579
52832 252579 251059 250419 250351 250173 249718 249180 248499 247630 247196 248073 250144 252173 253194 253481 253782 254142 254123 253766
52814 253766 253578 253586 253188 252163 251239 251304 252465 254255 256393 258845 261280 262975 263381 262576 261198 260104 259898
52797 259898 260452 260901 260378 258794 256707 254577 252476 250447 248739 247527 246743 246320 246308 246606 246821 246623 246113
52780 246113 245672 245568 245787 246136 246384 246445 246505 246844 247434 247906 248044 248152 248729 249890 251333 252775 254144 255323
52762 255323 255991 255877 255097 254068 253089 252154 251208 250435 250135 250301 250535 250460 250137 249972 250324 251263 252557 253741
52744B53741O28P7J16P70J378J397J113J199J725K013J506N10j50K0P77J599K217
52727B70636K669K842K442J490N53J39Q0p9k94j82J13o5q34j463j430j139j156
52710B74322j314j162q61q88j204j303j010n88k18N7Rn28j124j098m10K95N48
52693B63523L87r8q45j365r53L61J588J901J438Q31M23L52Q14J663K123J542K69
52676B73954p15r35p47n74l93q7J62J20j39l64m71n63o52n81k25L63R61J274J106
52657B71494N97K78N65J171J294O52j1J35Q66J245J020R17J371J738J275K75m38
52640B84444o96r18j142j024p23q98j605j957j266M1J053J445J479J349J064P99
52624B81445P80Q71P17L52K50O20R29M52q10k047k474k066j352p29k72l6j85o04
$$ plain form
52744 253741 254369 254446 254562 255332 256710 258107 259220 260419 262144 264157 265663 266173 266023 266043 266820 268419 270636
52727 270636 273305 276147 278589 280079 280632 280771 280851 280772 280478 280296 280409 280344 279510 278047 276617 275478 274322
52710 274322 273008 271846 270985 270097 268893 267590 266580 265992 265774 265831 265840 265312 264188 263090 262680 262975 263523
52693 263523 263910 263812 262967 261602 260649 261010 262598 264499 265937 266768 267191 267543 268357 270020 272143 273685 273954
52676 273954 273239 272304 271557 270983 270590 270503 270665 270785 270646 270282 269811 269248 268596 268015 267790 268153 269114 270388 271494
52657 271494 272091 272369 272934 274105 275399 276051 276040 276175 277041 278286 279306 280223 281594 283332 284607 284882 284444
52640 284444 283748 282830 281688 280664 279941 279043 277438 275481 274215 274256 275309 276754 278233 279582 280646 281445
52624 281445 282225 283096 283813 284165 284415 285035 285964 286416 285606 283559 281085 279019 277667 276938 276666 276630 276445 275841
52606B75841q39n81o5K88M06M75N06L33k9l34l68o0N69J360K002K306K349K160
52588B86319J505L67o71r95p55o18p34n99L2P51J169J382J502J240M14n40j017
52571B88752r56p06l89J17O30O29J9n16k67N00P54K9q98r85k85K21J1m68p82j153
52551B84257j701j844j195m51m14o21k8J166J579P00l73n96l24l32m51o6O42Q90
52533B80838N15J20J06K14J20j2J56O11R62Q80M84K16K62L23J19k8M33J435K269
52514B90023K457K151J669J205J065J522K280K665K580K558K679K245R93k31o88
52499C15173q11j274j743j602j340j891k909k993j776n33l49p40o96k20q0n25
52483B95691j044j183r92p03m01l5M37R77J409J470J073M66P5J90P90J569K156
$$ plain form
52606 275841 275002 274421 274356 274644 275050 275525 276031 276364 276335 276001 275633 275573 276142 277502 279504 281810 284159 286319
52588 286319 287824 288191 287520 286525 285770 285152 284418 283819 283851 284602 285771 287153 288655 289895 290309 289769 288752
52571 288752 287796 287090 286701 286818 287448 288077 288096 287580 287313 287813 288567 288596 287698 286713 286428 286649 286660 286192 285410 284257
52551 284257 282556 280712 279517 279066 278652 278031 278003 279169 280748 281448 281075 280479 280155 279823 279372 279306 279948 280838
52533 280838 281353 281473 281579 281793 281913 281901 282057 282668 283630 284510 284994 285210 285472 285795 285914 285886 286319 287754 290023
52514 290023 292480 294631 296300 297505 298570 300092 302372 305037 307617 310175 312854 315099 316092 315861 315173
52499 315173 314362 313088 311345 309743 308403 306512 303603 300610 298834 298301 297952 297212 296516 296296 296216 295691
52483 295691 294647 293464 292472 291769 291368 291333 291770 292747 294156 295626 296699 297165 297240 297430 298220 299789 301945
52466C01945K408K464K474K424K330K402K703K851K423J575Q32K78n31j677k462
52451C22439k256j450j072j590k477k993k995k833k780k771k578k055j292o33
52437B92664n02r50j474j517j090o81m90j72M63J002J025Q07Q68J093R68N52M79
52420B93045R26J275J130R56J293J923K283K290K225K187K176K447L202M141M815
52405C26314N222N576N676N176M409M276N135O272O663N906M298K301K01j888
52391C85537l825n279n881n643n108m804m709m467l950l234k255r38L93J219J469
52376C38525J541J636J554J286J258J718K263K359K091K049K543L263L674L505
52362C69265K833J890R19J18m21p48r55j033q83n24k36k83n70o60j93Q18K019
$$ plain form
52466 301945 304353 306817 309291 311715 314045 316447 319150 322001 324424 325999 326831 327109 326578 324901 322439
52451 322439 320183 318733 317661 316071 313594 310601 307606 304773 301993 299222 296644 294589 293297 292664
52437 292664 292162 291212 289738 288221 287131 286450 285960 285788 286251 287253 288278 289085 289953 291046 292014 292566 293045
52420 293045 293971 295246 296376 297332 298625 300548 302831 305121 307346 309533 311709 314156 317358 321499 326314
52405 326314 331536 337112 342788 347964 352373 356649 361784 368056 374719 380625 384923 387224 387425 385537
52391 385537 381712 376433 370552 364909 359801 354997 350288 345821 341871 338637 336382 335444 335837 337056 338525
52376 338525 340066 341702 343256 344542 345800 347518 349781 352140 354231 356280 358823 362086 365760 369265
52362 369265 372098 373988 374907 375025 374604 373856 372901 371868 370985 370461 370225 369942 369372 368712 368519 369337 371356
52345C71356K865K877K075J191J039J669K504L316M454N930O923O712N680M864
52331D23455M816N346O183P269Q560R882J1010J1678J1744J1605J2006J3143J4333
52318E51030J4964J5286J5704J5834J5094J3884J3277J3617J4267J4656J4801
52307G12414J4794J4615J4504J4790J5208J5152J4621J4199J3993J3472J2471
52296H70233J1509J0815R922Q602P311O259M883K898J054O1n99j929l833n214
52282I21972n401m725l766k738j744j022p18o92p31p49p17m58L91K116M437O456
52266I11911P453P738Q218R140R849R919R831J0184J0856J1373J1647J1810J1782
52253A041711J1513J1255J1122J0764J0025R422R349R177P978N794L487J517k67
$$ plain form
52345 371356 374221 377098 379173 380364 381403 383072 385576 388892 393346 399276 406199 412911 418591 423455
52331 423455 428271 433617 439800 447069 455629 465511 476521 488199 499943 511548 523554 536697 551030
52318 551030 565994 581280 596984 612818 627912 641796 655073 668690 682957 697613 712414
52307 712414 727208 741823 756327 771117 786325 801477 816098 830297 844290 857762 870233
52296 870233 881742 892557 902479 911081 918392 924651 929534 932432 933486 933547 932948 931019 927186 921972
52282 921972 916571 911846 908080 905342 903598 902576 901858 901166 900435 899686 898969 898511 898902 901018 905455 911911
52266 911911 919364 927102 935320 944460 954309 964228 974059 984243 995099 1006472 1018119 1029929 1041711
52253 1041711 1053224 1064479 1075601 1086365 1096390 1105812 1115161 1124338 1132316 1138110 1141597 1143114 1142847
52240A142847j724k290j941j534j868k958m376n735o579o479n568m619m256m352
52226A088568m440m335m143l969l902m004m070l681k756j769j165q48m69L1N66
52211A049614J289K429L766M696M936M800M811N162N749O412O932P002O471N658
52197A119727N158N259N666N884N729N363M962M589M275M041L795L472L195L107
52183A184222K961K291J070p1o37r67j833l410n009n861n925n814o052o536o752
52168A141677o415n835n383m872l735k006o28m33j094j477q94L35J468K113K364
52153A115185K500K607K453J762P31j3j67k30q12j664j980j540j001q86r58p52
52137A115235l00R9L87O11O33M22M28J166K548M048N468O974Q480R546J0163J1113
$$ plain form
52240 1142847 1141123 1138833 1136892 1135358 1133490 1130532 1126156 1120421 1113842 1107363 1101795 1097176 1092920 1088568
52226 1088568 1084128 1079793 1075650 1071681 1067779 1063775 1059705 1056024 1053268 1051499 1050334 1049486 1049017 1049048 1049614
52211 1049614 1050903 1053332 1057098 1061794 1066730 1071530 1076341 1081503 1087252 1093664 1100596 1107598 1114069 1119727
52197 1119727 1124885 1130144 1135810 1141694 1147423 1152786 1157748 1162337 1166612 1170653 1174448 1177920 1181115 1184222
52183 1184222 1187183 1189474 1190544 1190473 1189836 1188869 1187036 1183626 1178617 1172756 1166831 1161017 1154965 1148429 1141677
52168 1141677 1135262 1129427 1124044 1119172 1115437 1113431 1112803 1112370 1111276 1109799 1108905 1109240 1110708 1112821 1115185
52153 1115185 1117685 1120292 1122745 1124507 1125238 1125225 1125058 1124828 1124016 1122352 1120372 1118832 1117831 1116945 1115987 1115235
52137 1115235 1114935 1115034 1115421 1116032 1116665 1117087 1117515 1118681 1121229 1125277 1130745 1137719 1146199 1155745 1165908 1177021
52121A177021J3126J5941J8586K0394K1405K1865K1909K1755K1725K1809K1521
52110A397057K0513J9072J7774J6738J5646J4366J3169J2270J1497J0556R391
52099A558049Q047O497M850L602L262L619L669K526M22j458k300k524l182m596
52085A580483o081p039p762q772r909j0584j0714j0691j0477r511p606n403l588
52072A472346k149p13Q47K383L768M823N349N519N989P164Q650R671R932R686
52058A543265R227Q657Q049P534P147O800O287N359M004K667J799J087k51k218
$$ plain form
52121 1177021 1190147 1206088 1224674 1245068 1266473 1288338 1310247 1332002 1353727 1375536 1397057
52110 1397057 1417570 1436642 1454416 1471154 1486800 1501166 1514335 1526605 1538102 1548658 1558049
52099 1558049 1566096 1572593 1577443 1581045 1584307 1587926 1591595 1594121 1594543 1593085 1590785 1588261 1585079 1580483
52085 1580483 1574402 1567363 1559601 1550829 1540920 1530336 1519622 1508931 1498454 1488943 1481337 1475934 1472346
52072 1472346 1470197 1469484 1470331 1472714 1476482 1481305 1486654 1492173 1498162 1505326 1513976 1523647 1533579 1543265
52058 1543265 1552492 1561149 1569198 1576732 1583879 1590679 1596966 1602325 1606329 1608996 1610795 1611882 1611631 1609413
$$ [...]
##END NTUPLES=NMR SPECTRUM
##END=
