##TITLE=AC1501_CRIANN13308_8125382_Exf7PWUoEY
##JCAMPDX= 6.0         $$ Bruker NMR JCAMP-DX V2.0
##DATA TYPE= NMR SPECTRUM
##DATA CLASS= NTUPLES
##ORIGIN= BRUKER
##OWNER= Administrator
$$ 1.72 TOPSPIN		Version 2.1
$$ 2013-08-15 19:44:21.652 -0700  Administrator@X
$$ Compression mode = diff/dup
##.OBSERVE FREQUENCY= 400.02188249412
##.OBSERVE NUCLEUS= ^1H
##.ACQUISITION MODE= SIMULTANEOUS (DQD)
##.ACQUISITION SCHEME= undefined
##.AVERAGES= 8
##.DIGITISER RES= 22
##SPECTROMETER/DATA SYSTEM= spect
##.PULSE SEQUENCE= zg30
##.SOLVENT NAME= COFFEE_meoh
##.SHIFT REFERENCE= INTERNAL, COFFEE_meoh, 1, 14.98509
##AUDIT TRAIL= $$ (NUMBER, WHEN, WHO, WHERE, PROCESS, VERSION, WHAT)
$$ ##TITLE= Audit trail, TOPSPIN		Version 2.1
$$ ##JCAMPDX= 5.01
$$ ##ORIGIN= Bruker BioSpin GmbH
$$ ##OWNER= Administrator
$$ $$ E:\/data/COFFEE/nmr/AC1501_CRIANN13308_8125382_Exf7PWUoEY/10/pdata/1/auditp.txt
$$ ##AUDIT TRAIL=  $$ (NUMBER, WHEN, WHO, WHERE, PROCESS, VERSION, WHAT)
(   1,<2013-08-15 19:44:14.870 -0700>,<Administrator>,<X>,<go>,<TOPSPIN 2.1>,
      <created by zg
	started at 2013-08-15 19:43:08.605 -0700,
	POWCHK enabled, PULCHK disabled,
       configuration hash MD5:
       C8 4E 4E 5D D3 5C D8 9E 9F 52 82 E0 59 8A DE 15
       data hash MD5: 64K
       11 7B 76 0D 61 18 0D 14 BF CC 9F 74 D1 78 43 EC>)
(   2,<2013-08-15 19:44:17.730 -0700>,<Administrator>,<X>,<proc1d>,<TOPSPIN 2.1>,
      <Start of raw data processing
       efp LB = 0 FT_mod = 6 PKNL = 1 PHC0 = 0 PHC1 = 0 SI = 32K 
       data hash MD5: 32K
       1A 97 BD 8C 4A 53 53 E4 FA 12 E4 55 A3 F0 63 AC>)
(   3,<2013-08-15 19:44:18.011 -0700>,<Administrator>,<X>,<proc1d>,<TOPSPIN 2.1>,
      <pk PHC0 = 98.56384 PHC1 = 0 
       data hash MD5: 32K
       01 D5 5D 2F 99 A8 D2 8F 5C 41 65 8D 82 60 EC 5F>)
(   4,<2013-08-15 19:44:18.120 -0700>,<Administrator>,<X>,<proc1d>,<TOPSPIN 2.1>,
      <abs ABSG = 1 
       data hash MD5: 32K
       03 50 2A 98 37 81 5B B3 B3 56 3A 06 02 F6 C4 B1>)
(   5,<2013-08-15 19:44:18.230 -0700>,<Administrator>,<X>,<proc1d>,<TOPSPIN 2.1>,
      <abs ABSG = 2 
       data hash MD5: 32K
       26 7D 3A 59 47 65 2E 7A DB F7 9D D7 79 07 36 41>)
(   6,<2013-08-15 19:44:18.386 -0700>,<Administrator>,<X>,<proc1d>,<TOPSPIN 2.1>,
      <abs ABSG = 3 
       data hash MD5: 32K
       0A C5 D9 12 73 8F A4 3F A5 A1 0F 5A 64 A1 FA CA>)
(   7,<2013-08-15 19:44:18.480 -0700>,<Administrator>,<X>,<proc1d>,<TOPSPIN 2.1>,
      <abs ABSG = 4 
       data hash MD5: 32K
       D3 1B CC 64 44 A8 1D B0 06 3D 16 CD E2 1B 8E 95>)
(   8,<2013-08-15 19:44:18.542 -0700>,<Administrator>,<X>,<proc1d>,<TOPSPIN 2.1>,
      <abs ABSG = 5 
       data hash MD5: 32K
       FD 01 0B 55 00 37 10 AA 4B 70 0A 36 61 51 10 C9>)
$$ ##END=
$$ 
$$ $$ hash MD5
$$ $$ 19 F2 DE 78 9E 35 D6 82 96 3F 40 04 84 CB 8C 07
##$RELAX= 
##$RELAX= 
##$RELAX= 
##$RELAX= 
##$RELAX= 
##$RELAX= 
##$RELAX= 
$$ Bruker specific parameters
$$ --------------------------
##$DU= <E:\>
##$EXPNO= 10
##$NAME= <AC1501_CRIANN13308_8125382_Exf7PWUoEY>
$$ [...]
150 150 150 150 150 150 150 150
##$TP07= 0
##$TPNAME0= <>
##$TPNAME1= <>
##$TPNAME2= <>
##$TPNAME3= <>
##$TPNAME4= <>
##$TPNAME5= <>
##$TPNAME6= <>
##$TPNAME7= <>
##$TPOAL= (0..7)
0.5 0.5 0.5 0.5 0.5 0.5 0.5 0.5
##$TPOFFS= (0..7)
0 0 0 0 0 0 0 0
##$TUNHIN= 0
##$TUNHOUT= 0
##$TUNXOUT= 0
##$USERA1= <user>
##$USERA2= <user>
##$USERA3= <user>
##$USERA4= <user>
##$USERA5= <user>
##$V9= 5
##$VALIST= <valist>
##$VCLIST= <CCCCCCCCCCCCCCC>
##$VD= 0
##$VDLIST= <DDDDDDDDDDDDDDD>
##$VPLIST= <PPPPPPPPPPPPPPP>
##$VTLIST= <TTTTTTTTTTTTTTT>
##$WBST= 1024
##$WBSW= 4
##$XGAIN= (0..3)
0 0 0 0
##$XL= 0
##$YL= 0
##$YMAX_a= 654580
##$YMIN_a= -557423
##$ZGOPTNS= <>
##$ZL1= 120
##$ZL2= 120
##$ZL3= 120
##$ZL4= 120
##$ABSF1= 14.98509
##$ABSF2= -5.573092
##$ABSG= 5
##$ABSL= 3
##$ALPHA= 0
##$AQORDER= 0
##$ASSFAC= 0
##$ASSFACI= 0
##$ASSFACX= 0
##$ASSWID= 0
##$AUNMP= <proc_prof1d_extract_pilot.lims>
##$AXLEFT= 0
##$AXNAME= <>
##$AXNUC= <1H>
##$AXRIGHT= 0
##$AXTYPE= 0
##$AXUNIT= <>
##$AZFE= 0.1
##$AZFW= 0.1
##$BCFW= 0
##$BC_mod= 0
##$BYTORDP= 0
##$COROFFS= 0
##$CY= 15
##$DATMOD= 1
##$DC= 0
##$DFILT= <>
##$DTYPP= 0
##$F1P= 0
##$F2P= 0
##$FCOR= 0.5
##$FTSIZE= 32768
##$FT_mod= 6
##$GAMMA= 0
##$GB= 0
##$INTBC= 1
##$INTSCL= 1
##$ISEN= 128
##$LB= 0
##$LEV0= 0
##$LPBIN= 0
##$MAXI= 10000
##$MC2= 0
##$MEAN= 0
##$ME_mod= 0
##$MI= 0
##$NCOEF= 0
##$NC_proc= -8
##$NLEV= 6
##$NOISF1= 0
##$NOISF2= 0
##$NSP= 0
##$NTH_PI= 0
##$NZP= 0
##$OFFSET= 14.98509
##$PC= 1
##$PHC0= 98.56384
##$PHC1= 0
##$PH_mod= 1
##$PKNL= yes
##$PPARMOD= 0
##$PPDIAG= 0
##$PPIPTYP= 0
##$PPMPNUM= 2147483647
##$PPRESOL= 1
##$PSCAL= 4
##$PSIGN= 0
##$PYNMP= <proc.py>
##$REVERSE= no
##$SF= 400.02
##$SI= 32768
##$SIGF1= 0
##$SIGF2= 0
##$SINO= 400
##$SIOLD= 32768
##$SPECTYP= <>
##$SREGLST= <1H.CDCl3>
##$SSB= 0
##$STSI= 32768
##$STSR= 0
##$SW_p= 8223.68421052631
##$SYMM= 0
##$S_DEV= 0
##$TDeff= 65536
##$TDoff= 0
##$TI= <>
##$TILT= no
##$TM1= 0
##$TM2= 0
##$TOPLEV= 0
##$USERP1= <user>
##$USERP2= <user>
##$USERP3= <user>
##$USERP4= <user>
##$USERP5= <user>
##$WDW= 1
##$XDIM= 32768
##$YMAX_p= 455471937
##$YMIN_p= -680225
##$CURPLOT= <Network HP LaserJet P1505>
##$CURPRIN= <$Network HP LaserJet P1505>
##$DFORMAT= <normdp>
##$LAYOUT= <+/1D_H.xwp>
##$LFORMAT= <normlp>
##$PFORMAT= <normpl>
##$SURQMSG= 1
$$ End of Bruker specific parameters
$$ ---------------------------------
##NTUPLES= NMR SPECTRUM
##VAR_NAME=  FREQUENCY,     SPECTRUM/REAL,   SPECTRUM/IMAG
##SYMBOL=    X,             R,               I
##VAR_TYPE=  INDEPENDENT,   DEPENDENT,       DEPENDENT
##VAR_FORM=  AFFN,          ASDF,            ASDF
##VAR_DIM=   32768,         32768,           32768
##UNITS=     HZ,            ARBITRARY UNITS, ARBITRARY UNITS
##FACTOR=    0.250966925370066, 1,           1
##FIRST=     8223.43324360094, -408,         -59336
##LAST=      0,             -27615,          -212732
##MIN=       0,             -680225,         0
##MAX=       8223.43324360094, 455471937,    0
$$ Real data points
##PAGE= N=1
##DATA TABLE= (X++(R..R)), XYDATA
$$ [...]
19548b23185B4498L09410b54470O1419b3412A81246g0277B98133a17992l6631
19538a54623b3833q98A12645J9747n9472i5588K0895n8813K4230k80839i0512
19526a58252C6584e4881j8774a6795j46189Q839D7776b30487R1796K4663B3168
19514A24083L43288i6622c4819A00873A0433J10800d05603e1510E6255M2870D6428
19502A44752F9358B0757K13809a21385A9468a59664M5980C41589a86142J7259
19492a68883H6488i1621h843k42530A1355a78942Q6521j50836J14998b105B4274
19480b43796n8458D4080Q7472b00473A27764e2312A4068K9207a3066m3121j77286
19469b33473e6830J1051o1820j4690j39683h6251l60032g7471j37000H4710a54235
$$ y = [-223185, 24498, 333908, -254470, -193051, -23412, 181246, -70277, 298133, -117992, -154623, -23833, -24731, 112645, 132392, 72920, -95588, -74693, -133506, -109276, -390115, -90512, -158252, 36584, -54881, -73655, -16795, -162984, -154145, 47776, -230487, -138691, -114028, 23168, 124083, 467371, -96622, -34819, 100873, 10433, 121233, -405603, -51510, 56255, 99125, 46428, 144752, 69358, 20757, 234566, -121385, 19468, -159664, -113684, 341589, -186142, -168883, 86488, -91621, -8843, -251373, 11355, -178942, -92421, -243257, -128259, -2105, 24274, -243796, -302254, 44080, 131552, -200473, 127764, -52312, 14068, 43275, -13066, -56187, -233473, -56830, -45779, -107599, -122289, -261972, -86251, -446283, -77471, -214471, 84710, -154235]
19457a36055j04041B90387A06407a22828B7150a00340R971k43850g0920j0007
19447h0927r1076b8961k38482C05722p6007D9441J08356e658D1389A9012c85364
19435e9371C4244b9138r9299E9275g8365A27977K57521a29183l7555M9882I0272
19423a15445j32636A70772c6530A93678b68694B12465c06328i1113j18185g7955
19412A49209a02745F0634B4459g4043l95414a28204q0123B26363H7553b46301
19401i8826G6463D720N3184b66789d8697k85618e8224j7014C9538c4826C6918
19389a8886B28897g9489c8713k11934A6826a30297k30894C35340D9393k3819c19242
19377c3196B03820c66139J68812j796A44593d8329A2876a09588j85171N6015G7619
$$ y = [-136055, -240096, 290387, 106407, -122828, 27150, -100340, -90369, -334219, -70920, -80927, -172003, -28961, -267443, 305722, 229715, 49441, 157797, -5658, 41389, 19012, -385364, -59371, 34244, -29138, -128437, 59275, -78365, 127977, 385498, -129183, -166738, -116856, 90272, -115445, -248081, 170772, -36530, 193678, -268694, 212465, -306328, -91113, -209298, -77955, 149209, -102745, 60634, 24459, -74043, -469457, -128204, -208327, 226363, 87553, -246301, -98826, 76463, 4720, 57904, -266789, -48697, -334315, -58224, -75238, 39538, -34826, 36918, -18886, 228897, -79489, -38713, -250647, 16826, -130297, -361191, 335340, 49393, 25574, -319242, -33196, 203820, -366139, -197327, -199123, 144593, -48329, 12876, -109588, -294759, -238744, 77619]
19365c40351I4780a23215A95813k3024c1832A24232a87801A24619M3592d24168
19354a09550o8355g286n8300J5389k19068O8336q2172O5170A96552B4318b14690
19342F1298b40858A19616a17851L3339A39847a95564f9971D2030a1436A34923
19331a94054G7932c73497B37203n4617l7583E7492b8333B30153c23478A5100e3855
19319I1192l1938J78812d0269a3880j10432D9643h4172r2376l52348a76563c6505
19307D03016a17315j44543C41920c62354h2349C6231b64028J08338e2090p7061
19297a29151n5660E0809a09231k0668j1809k28084f5774l99949C08535A8559J32490
19286A51049B673J32632a00768j280B38835g0112N931d923I0431l8613a51328
$$ y = [-340351, 94780, -123215, 195813, 172789, -31832, 124232, -187801, 124619, 168211, -424168, -109550, -177905, -7286, -65586, -50197, -269265, -200929, -283101, -217931, 196552, 24318, -214690, 61298, -240858, 119616, -117851, -84512, 139847, -195564, -69971, 42030, -11436, 134923, -194054, 77932, -373497, 237203, 182586, 145003, 57492, -28333, 230153, -323478, 15100, -53855, 91192, 59254, 238066, -40269, -13880, -124312, 49643, -84172, -176548, -528896, -176563, -36505, 403016, -117315, -261858, 341920, -362354, -82349, 36231, -264028, -155690, -52090, -129151, -184811, 50809, -109231, -129899, -141708, -369792, -65774, -465723, 308535, 18559, 151049, 2673, 135305, -100768, -102048, 238835, -70112, -64181, -4923, 90431, 51818, -151328]
19274b59460K3704p2253A16065i4979A9670J0797K6289R81c41071H7195N9079
19263A46274A2540c15565C9181i5833k12760O0945l9473c8357A24609a28323M0233
19252h8090I6001b18824A61716a43803p127Q263C70315j57965b62323L3959j25724
19241c54088J31988i9232A38752L4545F5322b6004C27488b14758A90005E7492
19230D5211K10260b18585F8687J71841J1526E1628g9980l2676F8662a82158e9301
19218B38069b09583O3618B8880a05992j12652e0952j89830H995c4194j86770O0400
19207a60564I1926a86796e1703B25442a73649A08721c19068E8158J51027a55333
19196a7497r1828l17272a41496j59099R9863g1201j58468B0063c6572A77237n7978
$$ y = [-259460, -235756, -308009, 116065, -94979, 19670, 30467, 56756, 57737, -341071, 87195, 146274, 12540, -315565, 39181, -95833, -308593, -247648, -287121, -38357, 124609, -128323, -88090, 96001, -218824, 161716, -143803, -150930, -142667, 370315, 212350, -262323, -228364, -354088, -222100, -99232, 138752, 173297, 65322, -26004, 327488, -214758, 190005, 57492, 45211, 255471, -218585, 68687, 240528, 252054, 51628, -79980, -112656, 68662, -182158, -59301, 238069, -209583, -145965, 28880, -105992, -218644, -50952, -240782, 8995, -34194, -220964, -160564, 91926, -186796, -51703, 225442, -173649, 108721, -319068, 58158, 209185, -155333, -17497, -109325, -426597, -141496, -300595, -200732, -71201, -229669, 20063, -36572, 177237, 119259]
19185A19259b907m05744a40979j59031A98819j9699k6988i3200k68647a5626A34869
19173A56759c8328j43179o1844q756e0323J1282j55251c5632l11053G1884b20203
19161a64519O5884A11123b02326F2891r92Q2374R9397j15656c31917J11875l8240
19150b58282C00408b04544A39719J5698n5411h4197p7265F9211a77381L5647B7703
19138b16166g4100k74741e4152a6565c971k8674q7333k0529o062j26839h0492
19126b76458a25627e386j90905B22933c26089r7354f4398j57368C3184a09591
19115D22072E0097c13636A24827e796q2411q7944k07120A79954B7603a27272L2406
19104i4866A13637h7694I4124b15470L9702f2781J0801C0301a18400r3106f2008
$$ y = [119259, -2907, -408651, -140979, -300010, 198819, 179120, 152132, -93200, -361847, -15626, 134869, 156759, -38328, -181507, -243351, -252107, -50323, -39041, -194292, -35632, -346685, 71884, -220203, -164519, -98635, 111123, -202326, 62891, 61899, 144273, 243670, 128014, -331917, -220042, -258282, 300408, -204544, 139719, 155417, 100006, -84197, -161462, 69211, -177381, -141734, 27703, -216166, -74100, -348841, -54152, -16565, -3971, -32645, -119978, -140507, -146569, -273408, -80492, -276458, -125627, -5386, -196291, 222933, -326089, -423443, -64398, -221766, 33184, -109591, 422072, 50097, -313636, 124827, -5796, -88207, -176151, -383271, 179954, 27603, -127272, -94866, 113637, -87694, 94124, -215470, -175768, -62781, -51980, 30301, -118400, -211506, -62008]
19092F2302b5509q4432A76989E5522d09076K00671G2961c76946K8954A0099J8146
19081B8245J50256c83491G9549a32245M5333c3127j99304l934l802f3361J7155
19070d6206B02362a0246A13595b63194l8413A566J86729g006j68748L162j26137
19059b98729c5400C1317a23063j37445J21243c3694A94680F7566b34837h9558
19048c66645M1964g5329k66717A10006J14435A01379e3839r4428O4299A34935
19037A6265L0255c00018f9720j19635A53351a22506r5966C2986K18419a74057
19026A41346J8325N3249c2802j92302B70813j12108a12073m6614l6045E944g7597
19014b532I3338M2856J62172m3979m9740q5625g1727A17328a11460A18234r800
$$ y = [62302, -25509, -109941, 176989, 55522, -409076, -208405, 72961, -376946, -347992, 10099, 28245, 178501, -383491, 79549, -132245, -86912, -33127, -232431, -236365, -240167, -63361, -46206, 202362, -10246, 113595, -263194, -301607, 1566, 188295, -7006, -175754, -172592, -298729, -35400, 31317, -123063, -260508, -139265, -33694, 194680, 67566, -234837, -89558, -366645, -324681, -75329, -342046, 110006, 224441, 101379, -53839, -148267, -83968, 134935, 16265, 46520, -300018, -69720, -189355, 153351, -122506, -218472, 32986, 251405, -174057, 141346, 159671, 212920, -32802, -225104, 270813, 158705, -112073, -158687, -194732, 5944, -77597, -2532, 93338, 136194, 298366, 254387, 204647, 119022, -71727, 117328, -111460, 118234, 108434]
19003A08434e7365n0527C70622b08227B08252i8086B38450H114J01838i070j25439
18992a34509B19400F7803M8511b74155K6014P0607A27600a62583B08756c80090
18981g6808A94325a76278o2552M2627B6115d65375K26280E1469l814F997a36877
18969A4892c4330A55789l2091b97999D7069b63786A8960Q7421d18027a78900K2153
18958a56747n3520k4752A37360a52648a7719k62787c1028l7288o9356A8918b60756
18946I8879a98046A03183K7551n5958B9572F579J19675a98412i5662j63574e6690
18934A11535C662a06248j35090B72366a46592N6823j0535A54547a82102D9582
18923d99249f3434n9451I2586c5838A27744b72800a11442l4673e370k90742b7094
$$ y = [108434, -57365, -107892, 370622, -208227, 208252, -98086, 238450, 8114, 109952, -9070, -134509, 219400, 67803, 116314, -274155, -248141, -177534, 127600, -162583, 208756, -380090, -76808, 194325, -176278, -238830, -196203, 26115, -465375, -239095, 51469, 47655, 6997, -136877, 14892, -34330, 155789, 123698, -297999, 47069, -263786, 18960, 106381, -418027, -178900, -156747, -210267, -235019, 137360, -152648, -17719, -280506, -31028, -68316, -137672, 18918, -260756, 98879, -198046, 103183, 130734, 74776, 29572, 6579, 126254, -198412, -95662, -259236, -56690, 111535, 3662, -106248, -241338, 272366, -146592, -89769, -100304, 154547, -182102, 49582, -499249, -63434, -122885, 92586, -35838, 127744, -272800, -111442, -146115, -5370, -296112, -27094]
18911c5117j35419n5327A26327b28461A88924c59116C1724d36338b15013d5503
18900A24329n9093m933a72419B23329a86332E6861a66232A39304b59552h4013
18889h2592k19298L6032e189l6147I661a08320E3405d1763j01257A12955K4449
18878A37404o4599i8397l52310A84992b60002A10314b10398j64625I4431e0584
18867f8703k27167a34057C18204G1176O4569b05554a4734A78712a2412j9033H9276
18855I648a7674j19754b7045K532k70294C32907e5649j56609b6311B35608L895
18844B39503i509A14430E222P5958a16518d2426A3989J81651a51107A85430b06372
18832i3387l1156A76880b72354C26261e1834l4701A42522P0106r0453b57068h5989
$$ y = [-35117, -170536, -225863, 126327, -228461, 188924, -359116, 31724, -436338, -215013, -45503, 124329, 65236, 60303, -172419, 223329, -186332, 56861, -166232, 139304, -259552, -84013, -82592, -301890, -265858, -5189, -41336, 9661, -108320, 53405, -41763, -143020, 112955, 137404, 72805, -98397, -450707, 184992, -260002, 110314, -210398, -375023, 94431, -50584, -68703, -295870, -134057, 318204, 71176, 135745, -205554, -14734, 178712, -12412, -31445, 89276, 9648, -17674, -137428, -27045, -24513, -294807, 332907, -55649, -212258, -26311, 235608, 239503, -9509, 114430, 5222, 81180, -116518, -42426, 13989, 195640, -151107, 185430, -206372, -93387, -124543, 176880, -272354, 326261, -51834, -86535, 142522, 212628, 122175, -257068, -85989]
18820a914F7501K5389B564R9478N9355J70212a34412A36587O4910H0710a34474
18808B27066I1812B6829N8188c06259a38585K7055a7366n9269H9782R141c3077
18796A03872R6029C3189J41058J15139G2172b1190j71034D04271c17152C32742
18785b56977J09581K6219j0762A1635J47543a3947k57963M0156K9656B77645b0428
18773d7252k44866j6534J45606C0203N6473a468j04214m5420G8167P7892b02945
18761b62243A04733D6184K3789d22116C58675f8794K7280A36245a23153j38513
18751b61666A81397e6121j25204B421K42120l9880q2636E0085a89653d3016A38304
18739d99202f3377j36857A7262f3438o553g408l03826B7522d01342G0886j8833
$$ y = [-1914, 67501, 92890, 2564, 102042, 161397, 331609, -134412, 136587, 201497, 80710, -134474, 227066, 91812, 26829, 85017, -306259, -138585, -111530, -17366, -76635, 89782, 98923, -33077, 103872, 199901, 33189, 174247, 289386, 72172, -21190, -192224, 404271, -317152, 332742, -256977, -147396, -121177, -131939, 11635, 159178, -13947, -271910, -231754, -202098, 277645, -20428, -47252, -292118, -308652, -163046, 30203, 86676, -1468, -105682, -151102, 78167, 156059, -202945, -262243, 104733, 46184, 69973, -422116, 358675, -68794, -41514, 136245, -123153, -261666, 181397, -56121, -181325, 2421, 244541, 204661, 122025, 50085, -189653, -43016, 138304, -499202, -63377, -200234, 17262, -63438, -69991, -7408, -311234, 27522, -401342, 70886, 52053]
18728E2053a79001f5440a4869k4804j45041B32319a3556j64614F4353d9107C0688
18716b39399a3035m5389j16993A37698E6633g2002j09795h6490k8072k20153A1717
18704b86361f6283j86347C2906b05874M2329f2547A25827a85880G146c78732J58261
18693b20471H325b97554d789H198a6232N176j88037A09897c49664H4427i6408
18681C24531C3289J71160h697j52609A47234J09181c72643a00769F1026K19210
18671B80236b13211r1418Q308e6454A33699f9959c1696l00389A38833a51218K6679
18660a24539r5136P2149d470o5822b203j93425h7783p6192A4715f5166k4195r8383
18648a87744M8212k8930A94126a85187A85081a49551f507j21416C10394n2692
$$ y = [52053, -179001, -65440, -14869, -39673, -184714, 232319, -13556, -178170, 64353, -49107, 30688, -239399, -13035, -58424, -175417, 137698, 56633, -72002, -181797, -86490, -114562, -334715, 11717, -286361, -66283, -252630, 32906, -205874, -163545, -62547, 125827, -185880, 7146, -378732, -220471, 8325, -297554, -4789, 8198, -16232, -11056, -199093, 109897, -349664, 84427, -96408, 324531, 33289, 204449, -8697, -161306, 147234, 256415, -372643, -100769, 61026, 280236, -213211, -304629, -296321, -56454, 133699, -69959, -31696, -332085, 138833, -151218, -124539, -219675, -147526, -4470, -70292, -2203, -195628, -87783, -163975, 14715, -65166, -89361, -187744, -139532, -168462, 194126, -185187, 185081, -149551, -6507, -127923, 310394, 257702]
18638B57702c69480h0750b11n8981D2095g517F8062a50117b1282B14041a96823
18626B33129e5038r4042K6832d5487E2035J36271g1995L2102B79837j160G9274
18614b21167c492j42110N4925j25336o2577b5274G5193a39532B41629a56975j2222
18603a69197J4642L8780N3149F7119L0137b04136o8052a24844l4434A81326P8079
18592B59405d3281l6851k95103a11437A2213b98159p3078i6203r9901A05297l8579
18581F6718a15322C08220D6558j6486a00655r1612C7156d7003n1535A54900d2652
18569b77707c723D3471B952b1902A66031e6882j38135A62551a26243N465I4067
18557b07753f3397B14607A02491D8830A9819L8228a33886K3373j98924i0174k2200
$$ y = [257702, -369480, -80750, -211, -59192, 42095, -7517, 68062, -150117, -21282, 214041, -196823, 233129, -55038, -149080, -122248, -45487, 52035, 188306, -71995, -39893, 279837, 278677, 79274, -221167, -3492, -145602, -90677, -216013, -278590, -25274, 75193, -139532, 241629, -156975, -169197, -154555, -115775, -62626, 67119, 97256, -204136, -272188, -124844, -159278, 181326, 259405, -43281, -80132, -375235, -111437, 12213, -298159, -371237, -96203, -196104, 105297, 66718, -115322, 308220, 46558, 30072, -100655, -192267, 37156, -47003, -98538, 154900, -42652, -277707, -3723, 43471, 2952, -21902, 166031, -56882, -195017, 162551, -126243, -120778, 94067, -207753, -63397, 214607, 102491, 48830, 19819, 58047, -133886, -110513, -309437, -90174, -112374]
18546a12374k69809a84659m2402l8860J23710A79396c12725C0915a20095C8591
18535a5329r3746j03970o4169A85780i3912j24353b29A46739J12866a97719A05282
18523A787Q8213a08115D5279O4565a65522P3769m7768C3660N1399L7260K11563
18512C33882b08285b3776A61259E6638d15225h1878k41029a35316A96808m4695
18502A52113p3663d86838C3759B387e2911j88980A3642d64511H6941a47944c5084
18490a4665k11805e7654a1868k15489k7263b4029H45h3802n49A61773j5001Q9318
18478B36090n529B8733J13776e0465A52947b23453c8977k31466G2545a58588n0725
18467b09313i8474A0437d00918f5893l385c0542j23882q1450J9428f3882j03315
$$ y = [-112374, -382183, -184659, -227061, -265921, -142211, 179396, -312725, 30915, -120095, 38591, -15329, -109075, -213045, -277214, 185780, -93912, -218265, -229, 146739, 259605, -197719, 105282, 1787, 90000, -108115, 45279, 109844, -165522, -91753, -139521, 33660, 85059, 122319, 333882, -208285, -23776, 161259, 56638, -415225, -81878, -322907, -135316, 196808, 152113, 78450, -486838, 33759, 2387, -52911, -241891, 13642, -464511, 86941, -147944, -35084, -14665, -226470, -57654, -11868, -227357, -254620, -24029, 845, -83802, -84351, 161773, 146772, 236090, 230561, 28733, 142509, -50465, 152947, -223453, -38977, -270443, 72545, -158588, -209313, -98474, 10437, -400918, -65893, -69278, -30542, -154424, -235874, -216446, -63882, -167197]
18456a67197G349M73854E4168a68886E2787J46398M8697f5908j26835A8068b8624
18444A77058n1553D6927a9032r2816m0600c8262j36469A49756L8448A5929M1686
18433E7615J63497G6956P6546E995b19270I5803d21087B25140A02843a34573B9506
18421a17506B5268K93665g3794D38687a2893j40463j01001f2824B64961d2557
18410B0874Q67a08749e438r6934d0680r1557E6680N5901h8585A33262L6670h3272
18397I077d34158C72501j49208b81886D12123i8560D05504c48408A54626b03131
18386E7069d5358j34327F4025a70419k79641b19329b938m3328A8965b20704M9997
18375a70707j40047C7290J92405O5736i8153c7844I9602f5622C2663P4622b355
$$ y = [-167197, 7349, 481203, 54168, -168886, 52787, 199185, 247882, -65908, -192743, 18068, -28624, 177058, 125505, 46927, -19032, -111848, -152448, -38262, -174731, 149756, 188204, 15929, 57615, 221112, 76956, 153502, 5995, -219270, 95803, -421087, 225140, 102843, -134573, 29506, -117506, 25268, 318933, -73794, 438687, -12893, -153356, -254357, -62824, 264961, -42557, 20874, 21741, -108749, -5438, -102372, -40680, -132237, 56680, 112581, -88585, 133262, 169932, -83272, 9077, -434158, 372501, 223293, -281886, 412123, -98560, 405504, -348408, 154626, -203131, 57069, -45358, -179685, 64025, -170419, -450060, -219329, -2938, -46266, 18965, -220704, -170707, -310754, 37290, 229695, 295431, -98153, -37844, 99602, -65622, 32663, 107285, -2355]
18363a68102j14198i9521C6913d69871F5436d5447G1372Q447A522b9238j23172
18352a52410d4068A31542D7214c05367a46871G5141b7601H9707d7594j97892A14550
18340B9931c11980B8413c39001Q4057d4837k11943B16011c16810C2350c3106l66364
18329c99470D5628a52921A2696g244q9731G2525a76576C7082c11469a49723p7086
18318b26809R0132G8120M1413b44160G4499f5764b2590F2153c9272j60913A43816
18306a32952j35334E0836J49207I7618g1684c0139j42038P0222M4388q6543A39574
18294B96561a09705B11890h6053B38352K12741d1803j44848G9393a82064J3988
18284a68076j17709J11638D3799b41066h7809q3313F7679b59220B9137a57753
$$ y = [-168102, -282300, -99521, 36913, -469871, 65436, -45447, 71372, 79819, 1522, -29238, -152410, -44068, 131542, 47214, -305367, -146871, 75141, -27601, 89707, -47594, -245486, 114550, 29931, -311980, 28413, -339001, -254944, -44837, -256780, 216011, -316810, 32350, -33106, -399470, 45628, -152921, 12696, -7244, -96975, 72525, -176576, 37082, -311469, -149723, -226809, -136677, 78120, 119533, -244160, 74499, -65764, -22590, 62153, -39272, -200185, 143816, -132952, -268286, 50836, 200043, 97618, -71684, -30139, -172177, -101955, -57567, -144110, 139574, 296561, -109705, 211890, -86053, 238352, 451093, -41803, -186651, 79393, -182064, -168076, -285785, -174147, 43799, -241066, -87809, -171122, 67679, -259220, 29137, -157753]
18273c8883C04978g6112A5182b52736j14537F13734b0635f495A10365b51030B30570
18261a08235n0312A1957K1741j6168a77269c0192A01273l2456A8689K13014a4797
18249c58555G4453a15722H2061a96019B30799f8587r5703K3805m9102j05366a4476
18237A11410J97900J216J2724a04292j47992A96445k8387C7035P6998b63587c952
18225B94549F0869j2700j1741J36895M1593a24927A37105c299k0013l44182D2877
18213c0605k20767M4035j682o100C4510N6404b51459Q8337A42824a45193h043
18201b35855a02011B23857a32068d2244A11948Q663J50305b40849r8393J23696
18191b15546g1820n8130A74752a09191K925j58514A1203g854m43865i5383c3481
$$ y = [-38883, 304978, -76112, 15182, -252736, -367273, 613734, -20635, -6495, 110365, -251030, 230570, -108235, -158547, 11957, 33698, 17530, -177269, -30192, 101273, 68817, 18689, 231703, -14797, -358555, 74453, -115722, 82061, -196019, 230799, -68587, -164290, -140485, -189587, -294953, -14476, 111410, 309310, 310526, 323250, -104292, -252284, 196445, 168058, 37035, 114033, -263587, -3952, 294549, 60869, 48169, 36428, 173323, 214916, -124927, 137105, -3299, -23312, -367494, 42877, -30605, -251372, -207337, -209019, -215119, 34510, 90914, -251459, -163122, 142824, -145193, -8043, -235855, -102011, 223857, -132068, -42244, 111948, 120611, 270916, -240849, -339242, -215546, -71820, -129950, 174752, -109191, -106266, -264780, 11203, -7854, -451719, -95383, -33481]
18179B12466a41959p3427A6325K68913r3952k6056J54416c1581k23534M6400C17492
18167A86400O4221a99667k06952J93096B82474a46641A34472b07769P6256B6765
18156I2586C181M4837B0431a39304L9584j82826d6033H6258a16759g702l1111
18145c8813o8448M3688A00549c0263H4741J94444e0517J8016q3069d192B61721
18133d0208m8561A52140d75153B22841H957d59761a66930B37055b9699E1146a4659
18121A73158J0101K8760K70172C4863d0620B35421g6073j92199A2014J08347b8782
18109a49154M9860k407F4507A6240R4907a64393A36214b31554N9715k13021H2686
18097A69095a55539k89800e4690B70810j10814a6590G0642a04384A25517D0603
$$ y = [212466, -141959, -215386, 16325, 285238, 191286, 165230, 319646, -31581, -255115, -208715, 317492, 186400, 250621, -199667, -406619, -213523, 282474, -146641, 134472, -207769, -131513, 26765, 92586, 3181, 48018, 20431, -139304, -99720, -282546, -46033, 86258, -116759, -7702, -38813, -107261, -63573, 100549, -30263, 84741, 279185, -50517, -32501, -115570, -4192, 261721, -40208, -88769, 152140, -475153, 222841, 8957, -459761, -166930, 237055, -29699, 51146, -14659, 173158, 183259, 212019, 482191, 34863, -40620, 235421, -76073, -268272, 12014, 120361, -28782, -149154, -99294, -101701, 64507, 16240, 111147, -164393, 136214, -231554, -171839, -384860, 82686, 169095, -155539, -445339, -54690, 270810, 159996, -16590, 70642, -104384, 125517, 40603]
18086a06286j3248b6191A0791a42580F0888d25574B46574o0883a68370J5671c2292
18074A05377b19893A13405E1440b12907P9791A98361d2149B62180b19951A68955
18063a36449j67124l1739F386d315E914J6073a14347B07540F9868J98195L64697
18052F32760b86988G0707a31285J9259d8688A29213k8300c96466a89436b8544
18041a34452O5490B00724B6009a6783a827A87545D6135N8083A4810b6344p0810
18030i7154A24599g0956j16242A5931b11310i8798a8979G9762J4288h3971j47025
18019b30996A0351J57521b14215B09359b79514h3005j51367a9457j28912m867
18009a53236e8215m5147L5442A37516c44902A98166H9006a96226R5647j98834
$$ y = [-106286, -119534, -26191, 10791, -142580, 60888, -425574, 246574, 185691, -168370, -152699, -32292, 105377, -219893, 113405, 51440, -212907, -133116, 198361, -42149, 262180, -219951, 168955, -136449, -303573, -335312, 6386, -4315, 5914, 21987, -114347, 207540, 69868, 268063, 632760, -286988, 70707, -131285, -112026, -48688, 129213, 100913, -396466, -189436, -28544, -134452, -68962, 200724, 26009, -16783, -1827, 187545, 46135, 104218, 14810, -26344, -97154, 124599, -70956, -187198, 15931, -211310, -98798, -18979, 79762, 94050, -83971, -230996, 10351, 167872, -214215, 209359, -279514, -83005, -234372, -19457, -148369, -153236, -58215, -103362, -67920, 137516, -344902, 198166, 89006, -196226, -100579, -299413]
17999b99413A40745P0014Q0562n9438b72530A14973b10462M6972O7339L3618B96397
17987f8481r2135B1534a0516A16832b1215j45623N8452M4830J3886H1391C6227
17975f7615H4030J4736M0587e6980r7170p1061J07384H4642c00441Q9493A20614
17963a42664A968b5997k4148k79124c42H6366b72723B7479j1166Q6755a27530
17951c11569H5907K7195d0879j81160R4391A96995N4666E0753b4874C11157a33712
17939a40201M5020B14821A05630a67889j21345P7331D8471a41870F3771a16418
17928i5566a8624G146c57423D4994a06131B17212q4259c90155I5989J80634a03249
17916C03447A48718J18298c93074C96125a09460A42808g1681j25484I2086K4491
$$ y = [-299413, 140745, 210759, 291321, 231883, -272530, 114973, -210462, -163490, -96151, -62533, 296397, -68481, -160616, 21534, -10516, 116832, -21215, -166838, -108386, -63556, -49670, 81391, 36227, -67615, 84030, 98766, 139353, -56980, -154150, -225211, -117827, 84642, -300441, -210948, 120614, -142664, 1968, -25997, -50145, -329269, -342, 86366, -272723, 27479, 16313, 103068, -127530, -311569, 85907, 113102, -40879, -222039, -127648, 196995, 251661, 50753, -24874, 311157, -133712, -140201, -95181, 214821, 105630, -167889, -289234, -211903, 48471, -141870, 63771, -116418, -95566, -18624, 7146, -357423, 44994, -106131, 217212, 132953, -390155, 95989, 276623, -103249, 303447, 148718, 267016, -393074, 396125, -109460, 142808, -71681, -197165, 92086, 116577]
17906A16577h9626d3559j37993A4117b0907k30698A95635e4155l2173a0486I9148
17894a24995A96380h2299A09876b16956k01333a02721A14193b40784g6234J8197
17884e8037A07249b89094O1473b1269l0348k4437j06911e2445M683D97895D8753
17872A1652b39704H204d731A02608L9275d1978J7728l40950a77031L1788A00945
17860A09969M290b23853A51557l9504b66420M9006A40452k2192J93905A44348
17849G5311K31365l3094A3127L970J43136J42176a34696J7006q571a4439E1925
17837a18160B1922N3749a60027A38502J61727g2453D31549h8645C39937n7112
17827B82825a75935B94872N1800c23268E2931f9883k1958B879O4629a33173H9304
$$ y = [116577, -89626, -43559, -181552, 14117, -20907, -251605, 195635, -54155, -86328, -10486, 99148, -124995, 196380, -82299, 109876, -216956, -418289, -102721, 114193, -240784, -76234, -58037, 107249, -289094, -227621, -21269, -51617, -76054, -182965, -52445, -47762, 497895, 48753, 11652, -239704, 8204, -4731, 102608, 141883, -41978, -24250, -365200, -177031, -145243, 100945, 109969, 114259, -223853, 151557, 112053, -266420, -217414, 140452, 118260, 312165, 144348, 75311, 306676, 273582, 13127, 17097, 160233, 302409, -134696, -117690, -126261, -14439, 51925, -118160, 21922, 75671, -160027, 138502, 300229, -72453, 431549, -88645, 339937, 282825, -175935, 294872, 346672, -323268, 52931, -69883, -91841, 2879, 67508, -133173, 89304]
17815G3755O5074a03682k9540A15451L47538g4111j4230j87706B12928C0433J25497
17804A55930k849b29223a5373o4457H1030a95222j795A6444J88654I12a058p5149
17792g6207A32516a27548e9010j46848o2520A78063c5202A99109i7572P336B263
17780b64356C637J00041a23738C1565L23760d7016j06521a1273k42171E794M4748
17769E0542a08523B21297c97183a38589h299H1466J80251H165J07118A2917a29116
17757c79455E8350J19824d40513A11075D4665a13360N5197f525E6612d4149F4795
17745E12479h2222K9472D69747a0737j8589A97894a43175p579A73273c28569e6471
17733A90375f5760j61691a4791C1169J52509d4536B30691d18745G2745J92831
$$ y = [73755, 138829, -103682, -133222, 115451, 462989, -74111, -88341, -276047, 212928, 30433, 155930, 153081, -229223, -15373, -79830, 81030, -195222, -197017, 16444, 205098, 912, -1058, -76207, 132516, -127548, -59010, -205858, -268378, 178063, -35202, 199109, -97572, -90236, 2263, -264356, 3637, 103678, -123738, 31565, 355325, -47016, -153537, -11273, -253444, 5794, 50542, -108523, 221297, -397183, -138589, -8299, 81466, 261717, 8165, 115283, 12917, -129116, -379455, 58350, 178174, -440513, 111075, 44665, -113360, -58163, -6525, 56612, -44149, 64795, 512479, -82222, -52750, 469747, -10737, -29326, 197894, -143175, -150754, 173273, -328569, -56471, 190375, -65760, -227451, -14791, 31169, 183678, -44536, 230691, -418745, 72745, 265576]
17723B65576b52831C05167b81039A60570Q5812H3208c4034B29252a91844A19295
17712C52929a180B05798l8883D0925b60525h3295A81055q3681A1527a32033r723
17701a41756B7683c83839A93466N1669o5603c5778k30486G3699J85781G8928J43937
17690B22865c3166a510I7021b24614F533i4975I0373e5410B79921K0910j05174
17679A95657h967l11809E75i727A56741a8217A18244k825a68370M9335L1580B97943
17666A47775L8767O7408o1394a80886j51222A44301F9944o960c1244C23834a115
17654a7333M254k09895i3063C30052h1604A15779b7146j11030j4660j18849A46996
17642B27175a94830B15714E7374K79192b01292j672A31144K06682a36868K2506
$$ y = [265576, -252831, 305167, -281039, 160570, 246382, 83208, -34034, 229252, -191844, 119295, 352929, -1180, 205798, 166915, 40925, -260525, -83295, 181055, 97374, 11527, -132033, -141756, 27683, -383839, 193466, 245135, 179532, -35778, -266264, 73699, 259480, 78928, 222865, -33166, -1510, 97021, -224614, 6533, -94975, 90373, -55410, 279921, 300831, 195657, -8967, -320776, 575, -9727, 156741, -18217, 118244, 115419, -168370, -119035, -87455, 297943, 147775, 186542, 253950, 192556, -180886, -332108, 144301, 69944, 62984, -31244, 323834, -1115, -17333, -13079, -222974, -93063, 330052, -81604, 115779, -27146, -138176, -152836, -271685, 146996, 227175, -194830, 215714, 57374, 336566, -201292, -202964, 131144, 337826, -136868, -114362]
17632a14362k9189B05140d87623a46026k10057a37563k69440i8027n2517k59503
17622d10047g4078C07015a19656a4117l88625A38094a30019D424h640A99682a95045
17610D9387a43216N5524A26537A0678e1704D6945P2801J67623o7326A2865R074
17599B1939e5476F6882J03044c34392A97280K53601a09226A9266K26038a23329
17588C2922J84437J8446H1934J33372C9490c60319J69292c153n6068b274D8106
17576d03658F6168J55908a80818A3730c5822k59169A278J28653d5294k41932C5445
17564a4554E8524N4535C2463J56745b86503J8228A68462J0725j9824J47334b1122
17552I2906J62393p6649b2355D28751a15614H7836k8990J9550d7937p2007b5811
$$ y = [-114362, -143551, 205140, -487623, -146026, -356083, -137563, -407003, -98027, -150544, -410047, -74078, 307015, -119656, -14117, -402742, 138094, -130019, 4424, -8640, 199682, -195045, 49387, -143216, -87692, 126537, 10678, -51704, 46945, 119746, 287369, 220043, 12865, 21939, -55476, 66882, 169926, -334392, 197280, 450881, -109226, 19266, 245304, -123329, 32922, 217359, 235805, 81934, 215306, 39490, -360319, -191027, -3153, -59221, -2274, 48106, -403658, 66168, 222076, -180818, 13730, -35822, -294991, 1278, 129931, -45294, -287226, 35445, -14554, 58524, 113059, 32463, 189208, -286503, -268275, 168462, 179187, 159363, 306697, -21122, 92906, 255299, 178650, -22355, 428751, -115614, 87836, 58846, 78396, -47937, -119944, -25811]
17540A40053d9561k72708I0590f958A88722b40728A11875k8507K62605A35113
17529A2961a18364C4923N9705m3135b42747A92514r0012b25288A20257D6581d3504
17517b12349C18357j58848J98141k6920p0919a51967E8945a80541H5427a11748
17506a1351j9116a1778G1071L13030A24541J99579p45I5692J78339l6478o1577
17495A75976H7333L55749b02980Q3818K8732j4527B37020P3166r5782K2345C1124
17483C12037A06375Q08b06914A22736a31570D33521A76571G9931J62234J07635
17473C49800j45586E2022a11422D04205C7373a15486n9335A13288J23927l4356
17463B02859c2922C52085l4912J12644A52542m165A0543J23090k3486L02244A44487
$$ y = [140053, -49561, -322269, 90590, -6958, 188722, -240728, 111875, 83368, 345973, 135113, 12961, -118364, 34923, 94628, 51493, -242747, 192514, 102502, -225288, 120257, 46581, -43504, -212349, 318357, 159509, 357650, 330730, 259811, -151967, 58945, -180541, 85427, -111748, -11351, -30467, -11778, 71071, 384101, 124541, 324120, 323375, 95692, 274031, 237553, 175976, 87333, 443082, -202980, -119162, -90430, -104957, 237020, 310186, 214404, 236749, 31124, 312037, 106375, 107183, -206914, 122736, -131570, 433521, 176571, 79931, 242165, 349800, 204214, 52022, -111422, 404205, 37373, -115486, -174821, 113288, 237215, 202859, -32922, 352085, 317173, 429817, 152542, 148377, 10543, 133633, 110147, 412391, 144487]
17451F35114A35679J72346L555G8293L31070B00492J58064k5121p933j4997b71647
17439a72470B22570a5811H1070J55745d662B69141i158B81666R7020R0500A84948
17427H863K92379j31133b9421C5647J39362J24913I6496K8100K57738H0095M9657
17416A29752J78948A53208L99130Q789k47551e0972A91772B8724K6777a4776B10551
17404A13092j2538C5938J80515J50193r2757I7246J84390a5267E37790k11545
17394C26245m8479J13718c4196E3082N494J31643l2341J0537J07414J61549A72636
17382a55907A20765K1759a04891E25397B17571C1609n64a3988E96084k79194r5508
17371B21382J73688j87622J41390A03607a7629A44095c11D92827A8354L42232
$$ y = [635114, 135679, 308025, 311580, 78293, 409363, 200492, 358556, 333435, 325502, 310505, -271647, -172470, 222570, -15811, 81070, 236815, -4662, 269141, -9158, 281666, 378686, 469186, 184948, 8863, 301242, 170109, -29421, 35647, 175009, 299922, 96496, 124596, 382334, 80095, 129752, 308700, 153208, 552338, 561127, 313576, -50972, 191772, 28724, 55501, -14776, 210551, 113092, 100554, 35938, 216453, 366646, 273889, 97246, 281636, -15267, 537790, 326245, 277766, 391484, -34196, 53082, 58576, 190219, 157878, 168415, 275829, 437378, 172636, -155907, 120765, 142524, -104891, 525397, 217571, 31609, 31045, -13988, 596084, 316890, 221382, 395070, 207448, 348838, 103607, -17629, 144095, -311, 492827, 18354, 360586]
17361C60586A48958P8657b7175C96179A11434J32202a21216A41085M0906L10377
17351D92368j36477A63510o9761e7262j58718B16221n325j0104J4487E6534K72263
17340C28797a06048A39786g1216D0202J7293K85165j10546I8171b9911B69925
17329B26105f28751C00750A31142d11244B43075K0753j5984D6465f6221B13179
17318A5126L54062A74007M1908h4828D35846H8304K01999F1631i811j45052g6474
17306B19934G4614J49552b63963A50482b4868B17797G7474E460L22323l2112G3874
17294D8060K22738b1648j67136A15084B3869J60027N4146m0901K01135n2657j6722
17283C28897D8003J93800P9627f4650B04212e3174A0807L40257j73219L20184
$$ y = [360586, 148958, 227615, -27175, 396179, 111434, 243636, -121216, 141085, 181991, 492368, 355891, 163510, 93749, -57262, -215980, 216221, 210896, 200792, 215279, 56534, 328797, -106048, 139786, -71216, 40202, 57495, 342660, 232114, 98171, -29911, 269925, 226105, -628751, 300750, 131142, -411244, 243075, 263828, 247844, 46465, -66221, 213179, 15126, 369188, 174007, 215915, -84828, 435846, 88304, 290303, 61631, -9811, -154863, -76474, 219934, 74614, 224166, -263963, 150482, -24868, 217797, 77474, 5460, 327783, 295671, 73874, 48060, 270798, -21648, -188784, 115084, 23869, 183896, 238042, 197141, 398276, 345619, 328897, 48003, 241803, 321430, -64650, 204212, -53174, 10807, 351064, 177845, 498029]
17273D98029A80285e6795C09628g160l98A70048O8131K7704P6685A36297L0410
17262A66707B2165K76990o2705D5330P0563m8836K09724a18379I7423N8445o1846
17251I4022N8209c91A16282b1611F5906Q1529J10647a00581N0042C14568r2078
17240B22490p4444b68657B56446A1961b6670C50573J78049B21198b5382C14257
17229A78954F1901R2264M65719L796A13361M2065K01382l086H7808J2192d3451
17217A45844K15497I2750K11943o0288l9536D7003K48906r5433J42290A29776
17206G0252L20390A23506D7070K3065L13118k3182A45624J9078N2087a85108C43883
17194D08969G1752J56417K06416f4399A53076a34734A77574J49108j50944p8829
$$ y = [498029, 180285, -56795, 309628, -7160, -7558, 170048, 238179, 265883, 342568, 136297, 166707, 22165, 299155, 236450, 45330, 115893, 67057, 276781, -118379, 97423, 155868, 94022, 152231, -391, 116282, -21611, 65906, 147435, 258082, -100581, -50539, 314568, 222490, 148046, -268657, 256446, 11961, -26670, 350573, 528622, 221198, -25382, 314257, 178954, 61901, 154165, 619884, 623680, 113361, 155426, 356808, 353722, 87808, 100000, -43451, 145844, 361341, 92750, 304693, 244405, 204869, 47003, 295909, 200476, 342766, 129776, 70252, 390642, 123506, 47070, 70135, 383253, 360071, 145624, 164702, 216789, -185108, 343883, 408969, 71752, 228169, 434585, -64399, 153076, -134734, 177574, 326682, 175738, 96909]
17184I6909A6281L41825A09688J13279L40541k47397a11243C67477M0594J03541
17174E11612r1415p7730j34717Q3963n8616p3133K57631m4197A36884L5724K04099
17163C76707J1482A54568L9534K05420L9838C34K49633J54695j09873J44615j19512
17152C19892j35558L97241B81087k5759Q4688o2113J23045C4002J70596I2256
17141B70757J97234k08789J48810n8615L9075j44965L0105K60870B21607n9337
17131A62270N46225j95281k42680H2145L63967n9584j29906p2239a2167C61101
17120D59390j52582P8219J36419J79539l49319J5960e6135C30240J80414B37904
17109G09071j51053o3758A93845K15893j51332n2908K47638L30088q4893B66719
$$ y = [96909, 16281, 358106, 109688, 222967, 563508, 316111, -111243, 367477, 408071, 511612, 420197, 342467, 207750, 291713, 233097, 159964, 417595, 373398, 136884, 172608, 376707, 388189, 154568, 194102, 399522, 439360, 334, 249967, 404662, 294789, 439404, 319892, 184334, 581575, 281087, 255328, 340016, 277903, 400948, 34002, 204598, 92256, 270757, 467991, 259202, 408012, 349397, 388472, 243507, 273612, 534482, 221607, 162270, 708495, 513214, 270534, 82145, 446112, 386528, 256622, 184383, -12167, 361101, 459390, 306808, 385027, 521446, 700985, 351666, 367626, -56135, 330240, 510654, 237904, 709071, 558018, 494260, 193845, 409738, 258406, 205498, 453136, 783224, 698331, 266719]
17098C20713m198J19470l9696M3389L7105M5182k30132O0281k243J81393k37308
17087B93956A42654J29687L10365A94791O4137J23127j33004K41108r5745J77892
17077E72306n0946j60208j77555N15984p8728J58383C54316k6478K0568K63542
17067F11948k51052K32692J659k28935J84089n6320A97900L32237O3088B05664
17056E72194j39465J93630R7069k19145j53137J22674J37269j84880j15915J23110
17046D33404J8119B22310K02437J87182j5768J4258j31462M4335L55416m30779
17036D47929N7613k3513L6368K54487C71559J35568K37235k24727R8686j22945
17026D95376Q6385j61519K65345O1312j56192L30276j74481k42867J30134k3687
$$ y = [320713, 316515, 435985, 396289, 439678, 476783, 521965, 291833, 352114, 349871, 531264, 293956, 142654, 272341, 582706, 194791, 258928, 382055, 249051, 490159, 394414, 572306, 521360, 361152, 183597, 699581, 620853, 779236, 354316, 327838, 348406, 611948, 360896, 593588, 595247, 366312, 550401, 494081, 197900, 530137, 593225, 205664, 572194, 432729, 626359, 723428, 504283, 351146, 473820, 611089, 426209, 310294, 433404, 451523, 222310, 424747, 611929, 596161, 610419, 478957, 523292, 878708, 447929, 505542, 482029, 518397, 772884, 371559, 507127, 744362, 519635, 618321, 495376, 581761, 420242, 685587, 746899, 590707, 920983, 746502, 503635, 633769, 610082]
17016F10082j25226J88831k72684K49160M663J54501j95641k20391j38007J26340
17006C81628K15353K31323J05405k49842j55278J82431j6784J42786n4806p1987
16996G10229j98737K78053Q0050l66403J54044J48997K1208k67808P2996n1149
16986E81480J66020R3246P6422m26632K37027L4518p7148K49272D29283L04287
16976G33570L39093l52363K35660m05326j9668L53145o4442J88106M6370O0154
16966A114299p9064j42796J10584j84384Q2173k7399J34177L95783n71365P5156
16956I07164M8591J76457l54097R2957J72164P0526M8076j79521J02399p7556
16946A007160j46029Q8845L1929K09069j0419M8806k89915P9678m2364P898l8436
$$ y = [610082, 484856, 673687, 401003, 650163, 654826, 809327, 613686, 393295, 255288, 381628, 596981, 828304, 933709, 683867, 528589, 711020, 694236, 837022, 782216, 710229, 511492, 789545, 869595, 503192, 657236, 806233, 827441, 559633, 632629, 581480, 747500, 840746, 917168, 490536, 727563, 762081, 684933, 934205, 429283, 733570, 1072663, 720300, 955960, 550634, 530966, 884111, 819669, 1007775, 1054145, 1114299, 1035235, 892439, 1003023, 818639, 900812, 873413, 1007590, 1403373, 832008, 907164, 955755, 1132212, 778115, 871072, 1043236, 1113762, 1161838, 982317, 1084716, 1007160, 861131, 949976, 981905, 1190974, 1180555, 1229361, 939446, 1019124, 976760, 984658, 946222]
16935I46222O55278O2809m49749K66015l33348q2504l3596K66859j64853k54595
16925H78538L34738K50582J62321j31662k61745L19540j35914K57350j21102j74708
16915A377938K17966K7774m36206L26910P65o4678K63220j49495k26130L93300
16905A731364k26505k938j8524K18135L6254r7444j11564P812J62596J74127k80974
16894A592339L09748j93854P8165j0581j49273K34901J68455q6409j37340J74028
16884A980179K14400j71566k63312L14442k66139N46094j82099j55634m530r2769
16874A919066L04809K55280k27798j11295m24382M52338j18852K79658K29897
16865B558721m0532J66100j01534q9677K35281r0273m466K18033J58653j85802
$$ y = [946222, 1601500, 1664309, 1214560, 1480575, 1147227, 1064723, 1031127, 1297986, 1133133, 878538, 1213276, 1463858, 1626179, 1494517, 1232772, 1552312, 1416398, 1673748, 1552646, 1377938, 1595904, 1623678, 1187472, 1514382, 1515147, 1450469, 1713689, 1564194, 1338064, 1731364, 1504859, 1501921, 1483397, 1701532, 1737786, 1640342, 1528778, 1536590, 1699186, 1873313, 1592339, 1902087, 1708233, 1786398, 1775817, 1626544, 1861445, 2029900, 1943491, 1806151, 1980179, 2194579, 2023013, 1759701, 2074143, 1808004, 2354098, 2171999, 2016365, 2011835, 1919066, 2223875, 2479155, 2251357, 2140062, 1715680, 2168018, 2049166, 2328824, 2558721, 2518189, 2684289, 2582755, 2493078, 2728359, 2638086, 2633620, 2851653, 3010306, 2824504]
16855B824504j26681j88893N96297j33899J09475k24367L27943n0172J92540j76751
16845C149996j11036J81126O2577J85825J27744P9441j69678K68042n4532j54880
16835C564625K65858j82642O10166m647r7888m25903L79731L34512J72995Q6641
16825D703448k1369k17865P1172M52271J00003J30550l22515J68818J99601J49128
16815E413242O5675K47581l41070K09089J48806J6164L77949K66654J7272J15266
16805F536628L49007L9144L91430N1720J32333L4580K76916j83657K83141J10131
16795H021373L47051J95272L62104J03882J97174M05113L414L79534L31417L51609
16785A0697943j62457N13298L91292K61175N19293J05459K99187N09908L27744
$$ y = [2824504, 2697823, 2508930, 3105227, 2971328, 3080803, 2856436, 3184379, 3134207, 3326747, 3149996, 3038960, 3220086, 3282663, 3468488, 3596232, 3675673, 3505995, 3774037, 3719505, 3564625, 3830483, 3647841, 4258007, 4253360, 4155472, 3729569, 4109300, 4443812, 4616807, 4703448, 4682079, 4464214, 4535386, 4987657, 5087660, 5218210, 4895695, 5064513, 5264114, 5413242, 5478917, 5726498, 5385428, 5594517, 5743323, 5759487, 6137436, 6404090, 6421362, 6536628, 6885635, 6924779, 7316209, 7367929, 7500262, 7534842, 7811758, 7628101, 7911242, 8021373, 8368424, 8563696, 8925800, 9029682, 9226856, 9631969, 9635383, 10014917, 10346334, 10697943, 10535486, 11048784, 11440076, 11701251, 12220544, 12326003, 12625190, 13135098, 13462842]
16776A3462842O32245O89962r5117O44817M17679O81033M45594Q97429K26534
16767A8003018O38101Q74587Q22698O32252N75327J095839P59116P80474J234549
16758B5415961Q55982J283112J086438J409642J178492J382276J533847J528512
16750C5674262J720083J854662J831899K278690K005397K430987K667314K662719
16742E3126013L082042L020757L453850L791859L639709M093777M662615M901889
16734H3772511N318479N109235O396012N880171O954781O951094P260326P735895
16726A35378504P891904P918400Q047110P796860P539243O836762O436522N439180
16718A93284485M240966L329268J250583M65647j372612j856386l999516n115674
$$ y = [13462842, 14095087, 14785049, 14689932, 15334749, 15752428, 16433461, 16879055, 17776484, 18003018, 18641119, 19515706, 20338404, 20970656, 21545983, 22641822, 23400938, 24181412, 25415961, 26271943, 27555055, 28641493, 30051135, 31229627, 32611903, 34145750, 35674262, 37394345, 39249007, 41080906, 43359596, 45364993, 47795980, 50463294, 53126013, 56208055, 59228812, 62682662, 66474521, 70114230, 74208007, 78870622, 83772511, 89090990, 94200225, 100596237, 106476408, 113431189, 120382283, 127642609, 135378504, 143270408, 151188808, 159235918, 167032778, 174572021, 181408783, 187845305, 193284485, 197525451, 200854719, 202105302, 202570949, 201198337, 199341951, 195342435, 190226761]
16710A90226761n833910o875728p360692p823235q253202q035819q101500q085410
16702A29857265p825162o934757p271187o765707o164192o037613n225345n142501
16694G8490801m874414m258911m234230l763265l438931l396285k539981l075623
16686D8909161k474849k576527k245049k218899k081427j603828j762486j640412
16678C2305684j120073j825422j245288r20119j597361r28789j248014j075728
16670B2344890l26535r63435p71621j125317o21291r57863p0819n99568p59751
16661A6148690p36737p68192l63907K25446o99336p00307n74446k25654n29907
16652A1775650q3693r22024m6377j94787k00341m74230k77362j49953k96876o58517
$$ y = [190226761, 184392851, 177517123, 170156431, 162333196, 154079994, 146044175, 137942675, 129857265, 122032103, 115097346, 107826159, 101060452, 94896260, 88858647, 83633302, 78490801, 73616387, 69357476, 65123246, 61359981, 57921050, 54524765, 51984784, 48909161, 46434312, 43857785, 41612736, 39393837, 37312410, 35708582, 33946096, 32305684, 31185611, 29360189, 28114901, 27194782, 25597421, 24668632, 23420618, 22344890, 22018355, 21054920, 20283299, 19157982, 18536691, 17578828, 17508009, 16908441, 16148690, 15411953, 14643761, 14279854, 14505300, 13805964, 13105657, 12531211, 12305557, 11775650, 11691957, 10769933, 10723556, 10528769, 10328428, 9854198, 9576836, 9426883, 9130007, 8471490]
16642H471490j28566r3183l06722l09309K04244n49363q8558j96107l7286Q0858
16632G047498j89225p35901K98197k51962j2233l78728n9992p2383n3092j27191
16622E464988k54653M2423j55480m06246R9621J5672k87341r0733j76222Q1832
16612D333861K22290k84489j61696k35554M18875m79940J915J64841l06299k59182
16602C414622J53666K8982j27140k99148J50464K4814j39492k49950K4141M901
16592B985860j64431K23505J23933m04327M5604O7074l68967J90402j39271K48003
16582B807385j73615K26437k67545l20647m17243O11639m7786l53721L34760m21767
16572A977897J58497m57359K21878L6041o8813L9237Q6295o9115j89649o3243
$$ y = [8471490, 8342924, 8249741, 7943019, 7633710, 7837954, 7288591, 7200033, 7003926, 6966640, 7047498, 6858273, 6122372, 6420569, 6168607, 6156374, 5777646, 5717654, 5645271, 5592179, 5464988, 5210335, 5252758, 5097278, 4691032, 4790653, 4806325, 4518984, 4428251, 4252029, 4333861, 4556151, 4271662, 4109966, 3874412, 4293287, 3813347, 3815262, 3980103, 3673804, 3414622, 3568288, 3597270, 3470130, 3170982, 3321446, 3346260, 3206768, 2956818, 2980959, 2985860, 2821429, 3044934, 3168867, 2764540, 2810144, 2877218, 2508251, 2698653, 2559382, 2807385, 2633770, 2860207, 2592662, 2272015, 1854772, 2466411, 2418625, 2064904, 2399664, 1977897, 2136394, 1679035, 1900913, 1936954, 1868141, 1907378, 1993673, 1924558, 1734909, 1671666]
16562A671666K65179m53495N46168j26334k68024J51917m17242K93675J19061
16553A782571j91306J0500J3294j41667J09545o5731j83417L45106l79797j01424
16543A197674P6081K81638J91845l87643J78482n24565K08954n7129R7845o8928
16533A194254K51871j1806j50342k6512k57188q2909K77085j56075J13222l651
16523A147949j75083L64395j77612k94507o1629K34353q9208K99935l53022n1134
16513H44437K45804M9650l55338J29423k38483L11217j78736K5108l8978R039
16503H03143R484j3370Q3287J71958j96599K79177k30491m47579K88708L7559
16493G85277K75199m66493K72025k3269j58844L05865D54370A06055N87139k66902
$$ y = [1671666, 1936845, 1483350, 2029518, 1903184, 1635160, 1787077, 1369835, 1663510, 1782571, 1591265, 1601765, 1615059, 1473392, 1582937, 1517206, 1333789, 1678895, 1299098, 1197674, 1273755, 1555393, 1747238, 1359595, 1538077, 1013512, 1222466, 1165337, 1263182, 1194254, 1446125, 1434319, 1283977, 1257465, 1000277, 917368, 1194453, 1038378, 1151600, 1147949, 972866, 1337261, 1159649, 865142, 803513, 1037866, 948658, 1248593, 895571, 844437, 1090241, 1139891, 784553, 913976, 675493, 986710, 807974, 833082, 794104, 803143, 812627, 799257, 882544, 1054502, 857903, 1137080, 906589, 459010, 747718, 785277, 1060476, 593983, 866008, 842739, 683895, 989760, 454370, 106055, 693194, 426292]
16483D26292M91522k02478k0664j940J26651k62703o9132K90867o1346k6058j30822
16472E60189K36562k01311L2008k86385M50048J08009k98032O7943M668k03518
16462D70181K64345B21908L62055n9744R3693j39212M6064j84803j41357J32203
16452C30807l2408J25619K27684k62650m1175R9288L14147r5970C28766R606R4744
16441D33116K85363B15823J696J07170m7341j3898M34809C05602K17443A39891
16430B07733J13255A41994J82905K49119O4470B30982J42443J59747o3541j47082
16420C22549q4434O6357O8487A68238L39000B17365M37043B57047Q2881M86320
16410H26248B78610L06652r3349j26585A03624K55662L5549M1778K46072B31083
$$ y = [426292, 917814, 715336, 694672, 692732, 819383, 556680, 487548, 778415, 717069, 691011, 560189, 796751, 595440, 627448, 341063, 791111, 899120, 601088, 669031, 673699, 470181, 734526, 221908, 583963, 524219, 617912, 478700, 524764, 339961, 198604, 330807, 298399, 424018, 651702, 389052, 347877, 447165, 761312, 665342, 328766, 338372, 433116, 718479, 215823, 217519, 324689, 277348, 263450, 698259, 305602, 523045, 139891, 207733, 320988, 141994, 324899, 574018, 638488, 230982, 373425, 533172, 469631, 322549, 238115, 304472, 372959, 168238, 507238, 217365, 654408, 257047, 339928, 826248, 278610, 585262, 491913, 365328, 103624, 359286, 394835, 436613, 682685, 231083]
16399E35897g4336C34517K71712q9999k24520K07030j24952l3561K81304k33006
16389C88525j86812m399q8797L02753o6115j36117a14126A35330R2337n8729p2837
16378I6101K89385A11937Q9273G8304M78018q6408l7801l0336d6568J0121A01865
16366a43075B64714d7392m0234D91593E5968J8188K65127j21690K71527k23818
16356B65302O3837A6862L21435n3641G8404E470M7569J49021K87764a47706B76162
16344A58999b4792l0244A61033N9536p1710K62796K7499A40552M03956k02909
16334C41599j02101L3009o4671o8838B228J44270a22674B3576O5134J6878J1816
16323A17404L8129l3147K04663L6284I3921j6033L33478j78812a13662D28543
$$ y = [535897, -74336, 334517, 606229, 516230, 291710, 498740, 373788, 340227, 621531, 388525, 201713, 197314, 108517, 411270, 345155, 209038, -114126, 135330, 227667, 168938, 96101, 385486, 111937, 201210, 78304, 556322, 469914, 432113, 401777, -46568, -36447, 101865, -143075, 264714, -47392, -87626, 491593, 55968, 74156, 339283, 217593, 489120, 265302, 329139, 16862, 338297, 284656, 78404, 5470, 53039, 202060, 489824, -147706, 276162, 158999, -24792, -55036, 161033, 220569, 148859, 411655, 439154, 140552, 544508, 341599, 239498, 272507, 207836, 138998, 2228, 146498, -122674, 23576, 88710, 105588, 117404, 155533, 122386, 327049, 363333, 93921, 77888, 411366, 232554, -113662, 428543]
16312a67607B4960b59990G0991J39796O3532j30125J2801J69001a76090B26049
16301B71104A2898R3118h6508F5994K4020i6890B81759D5694b0487D50783l078
16290D47705A97051J73811I8412K31320l8678o4942A12912C3105A0977b25397
16279A19536f9299A69334M0443l9383g1337G2863l221J1352a15353G5515N9276
16268A34791b2926p9084B65375e7164A07698m7481K73484J0589b73811O7906C24702
16256a51240B95351a6881A64437a21787c7018A33257a11203r4954B06763i8806
16245B8147K72975A03913b45916A8144J91483f7475F8927J5525R0103M0434F396
16233G5199a07845A27016f919A83745l2544L6422a64522C7718J82343o9769g3734
$$ y = [-167607, 24960, -259990, 70991, 210787, 274319, 144194, 156995, 325996, -176090, 226049, 271104, 12898, 106016, -86508, 65994, 90014, -96890, 281759, 45694, -20487, 450783, 447705, 197051, 370862, 98412, 329732, 291054, 226112, 112912, 33105, 10977, -225397, 119536, -69299, 169334, 209777, 170394, -71337, 72863, 69642, 80994, -115353, 75515, 134791, -22926, -102010, 265375, -57164, 107698, 60217, 333701, 344290, -273811, -205905, 324702, -151240, 295351, -16881, 164437, -121787, -37018, 133257, -111203, -206157, 206763, -98806, 28147, 301122, 103913, -245916, 18144, 209627, -67475, 68927, 84452, 174555, 214989, 6396, 75199, -107845, 127016, -6919, 183745, 151201, 187623, -164522, 37718, 220061, 150292, -73734]
16221a38041A6799a3340j05358e9275A51162J89370c31708B61224H0860a30878
16210e3366E772e3011E4723d55878a37053n7085h610A50528f7369C98966D686
16198A30939a2121l18422A3213K76825g2739p2719A37070B2267a84935H795M3356
16187E2151K15436b3176k26422R1242B17445e064A28406l2451c47566c3960A31390
16175H345b50415J20107E9301M7367L0848c6787d350B09800G1545C2631b0622
16163f8092B15778E5903J80766P7201d50653A53407b0258I9144K12239j05206
16153B06177i4512j25327A05887L44335k08314q1073h8152C05816c6717a3468
16142G3948J52502a94195h1932A79838P8569q8370h5222C60597D789a65230d1464
$$ y = [-138041, 16799, -13340, -118698, -59275, 151162, 340532, -331708, 261224, 80860, -130878, -53366, 5772, -53011, 54723, -455878, -137053, -194138, -8610, 150528, -67369, 398966, 4686, 130939, -12121, -330543, 13213, 290038, -72739, -145458, 137070, 22267, -184935, 8795, 52151, 267587, -23176, -249598, -158356, 217445, -5064, 128406, 95955, -347566, -33960, 131390, 8345, -250415, -130308, 59301, 106668, 137516, -36787, -4350, 209800, 71545, 32631, -20622, -68092, 215778, 55903, 236669, 313870, -450653, 153407, -20258, 99144, 311383, 206177, -94512, -219839, 105887, 450222, 241908, 160835, -88152, 305816, -36717, -13468, 73948, 226450, -194195, -81932, 179838, 258407, 170037, -85222, 360597, 4789, -165230, -41464]
16130a83667A56616p2081a92966Q2509j11813n720A01761C2466f3491q9332A09823
16118c3723j6587o9325E6032L54882j32786m8490e8353B9693K7806a31429j6913
16107a48342A23771E8839K1166b25874f0536B35500J0862a0730C87567I0197l0991
16096E9206a6886F1471h1750E209a13516j2614B63799h3920K8917j95620Q2018
16085a68605A47938n0658b09536A43502e2069B8286Q3865N3600b51279A44477
16074d4090F4331R908a82046b5497o1491G040J6394a31222b5762o2603A43257
16062i8169M2778K664o3338A75612A3242n351J52613c37078a65496f9215E1402
16050c62919J32928c6178A26064O7297c54701L6748F0479e866B1141b53433F438
$$ y = [-183667, 156616, 84535, -192966, -110457, -222270, -227990, 101761, 32466, -63491, -152823, 109823, -33723, -50310, -119635, 56032, 410914, 278128, 229638, -58353, 29693, 57499, -131429, -148342, 123771, 58839, 80005, -225874, -60536, 235500, 246362, -10730, 387567, 90197, 59206, -16886, 61471, -81750, 5209, -113516, -126130, 263799, -83920, -55003, -250623, -168605, 147938, 97280, -209536, 143502, -52069, 28286, 112151, 165751, -251279, 144477, -44090, 64331, 74239, -182046, -25497, -86988, 7040, 23434, -131222, -25762, -88365, 143257, -98169, -55391, -52727, -116065, 175612, 13242, 7891, 160504, -337078, -165496, -69215, 51402, -362919, -229991, -36178, 126064, 193361, -354701, -317953, 60479, -5866, 21141, -253433, 6438]
16038b79762N6368A3658K84933h3972A33712a99824P7659j81138R1878H2995i1170
16026D831a87187C0459h4410A42979h3749q5845K7050j06659N9172A2880P8706
16015I1586Q2499a29701a3822j1838j00171F5214J30051e5006B57203B3152a23912
16003E7523b36215i7138j98909c789j8443A05871m7064O6581F2422a06133C00285
15991a02825A34990a27681A73100b49367D7649f0237A54120o0514Q4485o4874
15981A13217N6311Q533J57112e8085l4325b2329r6043k8162r1596B1271N6303
15970G7574b56501A10965J50429H4491k7917b03937a01391A3853b19829j468d6553
15958e181j24811M7629I8512P739a18389C5372N5485d5724k678n1098j66979a13101
$$ y = [-279762, -223394, 13658, 298591, -83972, 133712, -199824, -122165, -303303, -211425, 82995, -91170, 4831, -187187, 30459, -84410, 142979, -83749, -169594, -142544, -249203, -190031, 12880, 91586, 174085, -129701, -13822, -25660, -125831, 65214, 195265, -55006, 257203, 23152, -123912, 57523, -236215, -97138, -296047, -3789, -22232, 105871, 58807, 125388, 62422, -106133, 300285, -102825, 134990, -127681, 173100, -249367, 47649, -60237, 154120, 93606, 178091, 113217, 169528, 178061, 335173, -58085, -92410, -22329, -118372, -146534, -238130, 21271, 77574, -256501, 110965, 261394, 84491, 56574, -203937, -101391, 13853, -219829, -221297, -46553, -5181, -129992, -82363, 98512, 106251, -118389, 35372, 90857, -45724, -48402, -99500, -266479, -113101]
15945G3701h1082j56925F7151b27027i5468J487A21548d66438a32195b801D38595
15933d088k01599P1830B8757a34293J6778B780g1054l39355f24j50270A52584
15921a28938I7328A0092b13967i6788A24991a01425J8139A1352J33105C723K504
15910F227a55305A08048j7997b14209Q9530C50859A29869q34b39791J18630k31663
15899c52824J09831J15540C8271K55826c86864C0746a05344j9304j56156A86916
15888G629Q2194g3340Q638C85842A01865c8750E3441e2106G0201b77402A8395
15876a77324j78062C4600Q6258b62073A45687n4756O8702d70480b0490A07092
15865b9341k05121h9938D2896J9361a60473a9354q9412B96450A41979a50139k21816
$$ y = [73701, -81082, -238007, 67151, -227027, -95468, -93981, 121548, -466438, -132195, -2801, 438595, -4088, -205687, -133857, 28757, -134293, -117515, 2780, -71054, -410409, -624, -150894, 152584, -128938, 97328, 10092, -213967, -96788, 124991, -101425, -83286, 11352, 144457, 3723, 6227, -155305, 108048, 90051, -214209, -124679, 350859, 129869, 129035, -239791, -121161, -352824, -242993, -127453, 38271, 294097, -386864, 30746, -105344, -124648, -280804, 186916, 7629, 89823, -73340, -64702, 385842, 101865, -38750, 53441, -52106, 70201, -277402, 18395, -177324, -355386, 34600, 120858, -262073, 145687, 90931, 159633, -470480, -20490, 107092, -29341, -234462, -89938, 42896, 62257, -160473, -19354, -108766, 296450, 141979, -150139, -371955]
15854c71955C57176a58267c1728A42026h9932A50070K1939p4412b13199J01584
15844a11615j55973i1767E1251a11304G5836J51820b40232j7563C4779b44724
15833e9438B46705Q1689A54376a28995j87648E5540J23579E6681d4314r1269o255
15822a41838b2059A93222b24901C11149a8417k97823L3531a07716r7377I6790
15811b6836l7943C0192i2148D2310a43111A13573r424a46476e0507E638a8952
15799b26573i0584n0795B8963h6646H7311i442J128C4495c4203j09978C07278
15787C21197b2638k52539a6127k014j75954r9497A55135a58173B01123j6735b31247
15775b0314F0029j9675a06481J5051j64288N9477h4897C5857J58928b60395P5399
$$ y = [-371955, 357176, -158267, -31728, 142026, -89932, 150070, 172009, 97597, -213199, -111615, -267588, -91767, 51251, -111304, 75836, 227656, -240232, -257795, 34779, -244724, -59438, 246705, 328394, 154376, -128995, -316643, 55540, 179119, 56681, -44314, -135583, -141838, -22059, 193222, -224901, 311149, -18417, -316240, -282709, -107716, -205093, 96790, -26836, -64779, 30192, -92148, 42310, -143111, 113573, 104149, -146476, -50507, 5638, -18952, -226573, -90584, -141379, 28963, -86646, 87311, -9442, -8314, 34495, -34203, -144181, 307278, 321197, -22638, -275177, -16127, -18141, -194095, -293592, 155135, -158173, 201123, 184388, -231247, -20314, 60029, 40354, -106481, -91430, -255718, -196241, -84897, 35857, 194785, -260395, -184996]
15764a84996b5562k33704Q4787D2696b45530i0353A67132N6694L3251a4874A14580
15752a16790E9359h9591j45932a05102j98569A13020K45277c0218A58501F5559
15741A3980M8993i6399m2272O3771q0214n010F7346b42677p8914b8746B77309
15729b5737B3546M1105b52319k5502N0970G84L0185M857a57082A64369e6645A71692
15716i8037A29d9591B39334E7751b4472A16294c30704A35525C8611a17572H1605
15704f5266j15093J8389j31835A08030a71710B63252A05436a2479G9255C7043
15693A58863o4541j0186K27340a9466E2935b02274C5168A7358b3759k24899a21802
15681G9580M2821J71266c09623d6301l13427D68702a72537P9884A50268g3326
$$ y = [-184996, -25562, -259266, -174479, 42696, -245530, -90353, 167132, 223826, 257077, -14874, 114580, -116790, 59359, -89591, -235523, -105102, -303671, 113020, 358297, -30218, 158501, 65559, 13980, 62973, -96399, -138671, -74900, -155114, -160124, 67346, -242677, -321591, -28746, 277309, -25737, 23546, 64651, -252319, -277821, -226851, 784, 30969, 35826, -157082, 164369, -56645, 171692, -98037, 129, -49591, 239334, 57751, -24472, 116294, -330704, 135525, 38611, -117572, 81605, -65266, -180359, -161970, -293805, 108030, -171710, 263252, 105436, -12479, 79255, 37043, 158863, 94322, 84136, 311476, -19466, 52935, -202274, 35168, 17358, -23759, -248658, -121802, 79580, 122401, 293667, -309623, -46301, -359728, 468702, -172537, -92653, 150268, -73326]
15670a63447B2020M9903J0091J01953b67128C27116b08878H7413N6945J1827b5986
15658A19001J27831i6868H7661a48996p5878B26999a08368E0548b15117R7390
15648a17727A16089c56318b3629A81106G2145a02768B1259C182b17427A39832
15637b11727K4364D4238d8310j91354A16321a73365d7974F733J33868a71843C6983
15625f2245B5288K76213K3268b57582b1495H9369a46856D7837L26913A20456M7872
15614A68328g302A36737a73265j1967a2976H4492a1963B89206p2782B9509K28580
15603B58089A17642O6259b3840A53863m3522b3800j08807B63925h5232E7090a94232
15591d2303A02904J16331J0736c585j94095A43924C3719K1138A5909J45490B4555
$$ y = [-163447, 22020, 71923, 82014, 183967, -267128, 327116, -208878, 87413, 144358, 156185, -25986, 119001, 246832, -96868, 87661, -148996, -224874, 226999, -108368, 50548, -215117, -117727, 116089, -356318, -23629, 181106, 72145, -102768, 21259, 3182, -217427, 139832, -211727, -187363, 44238, -48310, -239664, 116321, -173365, -47974, 6733, 140601, -171843, 36983, -62245, 25288, 301501, 324769, -257582, -21495, 89369, -146856, 47837, 374750, 120456, 168328, -7302, 136737, -173265, -185232, -12976, 84492, -11963, 289206, 216424, 29509, 258089, 117642, 183901, -23840, 153863, 110341, -23800, -132607, 263925, -85232, 57090, -194232, -42303, 102904, 219235, 229971, -3585, -197680, 143924, 33719, 54857, 15909, 161399, 24555]
15579F0026b57044D7798a05482j79445A69922e33576A43819b35366J02052N7149
15569g6165j88574B30485p0907L9435c51261A54299n7306Q1588R0460a8027A19633
15557A37846a25165L2915j16967I5222P1458a65646G167b9970M595o5866k65287
15546c56528G8669J67962R4982a01998F69a92772H836h4095D49966A30275a06219
15534c2379j2681M161l9506d762E0780g5421A80846o0932j6501a22423E7990J9438
15522G7428j4012b17007b5637I2137a66354F0379a4616A2465Q839K87799l3427
15511B75676o6049b22302R6903m2206r7261h4743a0692G8131E662O7124L2833
15500A05619a28671A5291a164F8311a7052B79370f0184m3768r584I2478J31936
$$ y = [60026, -257044, 47798, -105482, -284927, 169922, -533576, 143819, -235366, -133314, -76165, -264739, 230485, 159578, 199013, -351261, 154299, 96993, 178581, 269041, -18027, 119633, 137846, -125165, -92250, -209217, 95222, 166680, -165646, 7167, -29970, -25375, -91241, -356528, 78669, 246631, 341613, -101998, 669, -192772, 8836, -84095, 449966, 130275, -106219, -32379, -45060, -40899, -80405, -4762, 50780, -75421, 180846, 119914, 103413, -122423, 57990, 77428, 63416, -217007, -25637, 92137, -166354, 60379, -14616, 12465, 21304, 309103, 275676, 209627, -222302, -125399, -167605, -264866, -84743, -10692, 78131, 5662, 72786, 105619, -128671, 15291, -1164, 68311, -17052, 279370, -60184, -103952, -113536, 92478, 224414]
15489B24414F1874J7683J7928j5004j7704a94542R2324k70267R0190P9418p3668
15478b76545g5696A03201c9728o4814k68491i633j11042P762G2115N4204N936
15467A32255J57082e7258l21224J73099p317l8508f5756A57568K41825e5182B2561
15455a1985j41472H4707P13J34243b7252J2547D0821L99287A40223h5342H8365
15443I553O5032B8880a9934l09502d4180k53730p9433H5701j5559b45466J13074
15432a32392m8450D4324K07031j13941i6394A22738E3457K55886g5965a9498l1192
15421e0690j26592A8319a66140B75585a30632A5638Q4386J19052D5063f5273A5998
15409E1931K4802c98282A32597a81057e9233B90261K34696b60922B62935a21856
$$ y = [224414, 61874, 79557, 97485, 82481, 64777, -194542, -102218, -372485, -282295, -202877, -276545, -75696, 103201, -39728, -104542, -373033, -9633, -120675, -112913, 72115, 126319, 132255, 289337, -57258, -378482, -205383, -212700, -251208, -65756, 157568, 399393, -55182, 22561, -11985, -153457, 84707, 85420, 219663, -27252, -14705, 40821, 440108, 140223, -85342, 88365, 9553, 74585, 28880, -19934, -329436, -44180, -297910, -377343, 85701, 70142, -245466, -132392, -180842, 44324, 251355, 137414, -96394, 122738, 53457, 309343, -75965, -19498, -50690, -177282, 18319, -166140, 275585, -130632, 15638, 100024, 219076, 45063, -65273, 15998, 51931, 76733, -398282, 132597, -181057, -59233, 290261, 524957, -260922, 262935, -121856]
15398d0859j52142g0291D82887F2485c1784A0141a84071P2302j37555A29459b0532
15386b07066M2829b225n861j21942A69254k2789a60249m7686M0553A16475c6216
15374b04954C263b7169B11387A6486P8800b28030I9724b25894A66474k9473J54121
15363B91122a90600J9735G7267J00245n8556q636n2702b0057n7760l6478R344
15352a04951b9514G8987j2474b06966A39627e4352G7605g5264l1902K9094A98617
15340G6638P1932E3987J08256J9289h4762B74705c5405r9247B10933G9147e9719
15328A52110a09139B5408q95J49014f114B13512D8445J17295K03642j21501g8856
15316A50886a55489k14063c364G5880D441K60154D8798M4635b91G2813K34237
$$ y = [-40859, -193001, -70291, 482887, 62485, -31784, 10141, -184071, -111769, -249324, 129459, -20532, -207066, -164237, -2225, -8086, -130028, 169254, 146465, -160249, -207935, -167382, 116475, -36216, -204954, 3263, -27169, 211387, 16486, 95286, -228030, 99724, -225894, 166474, 137001, 291122, -190600, -170865, 77267, 177512, 118956, 110320, 57618, -20057, -77817, -114295, -104951, -29514, 78987, 66513, -206966, 139627, -54352, 77605, -75264, -107166, -78072, 198617, 76638, 148570, 53987, 162243, 181532, -84762, 274705, -35405, -134652, 210933, 79147, -59719, 152110, -109139, 25408, 24513, 173527, -6114, 213512, 48445, 165740, 369382, 247881, -78856, 150886, -155489, -369552, -3364, 75880, 4441, 264595, 48798, 93433, -291, 72813, 307050]
15305C07050C332J71323a3408j48981m7273d797j98509d4856C20917a22126C22682
15293H8588k0106J48353b76944D1137i6717A40711R0739c9365j6702j470n9185
15282a16722j4876d035B74051p4667r6709M2475d763j11734H1171K33316r672
15271C04815I686M8177J32288d8977A00004D1196f3052B65240a82178A28031a67281
15259A2668J20873I960K09951a2606m8534A02467m4816R6365N5789a1545F54295
15247G89841O99713k0443R4805m66014l23453B10925J56965j13154a2925l14963
15237c27888J61879h2693G153K96686A47335a65730b7396k55645R4816G3746K09820
15226B83566C6503J82363d5798r047m0957I8302l3466P6093J09473A19986A0179
$$ y = [307050, 3332, 174655, -13408, -162389, -209662, -4797, -203306, -44856, 320917, -122126, 322682, 88588, 68482, 216835, -276944, 41137, -96717, 140711, 231450, -39365, -56067, -57537, -116722, -131598, -4035, 274051, 199384, 102675, 145150, -4763, -116497, 81171, 314487, 304815, 9686, 57863, 190151, -48977, 100004, 41196, -63052, 265240, -182178, 128031, -167281, 12668, 133541, 9960, 219911, -12606, -61140, 102467, 57651, 154016, 209805, -11545, 654295, 789841, 1489554, 1469111, 1563916, 1097902, 774449, 210925, 367890, 254736, -12925, -327888, -166009, -82693, 7153, 303839, 147335, -165730, -27396, -283041, -188225, 73746, 283566, 36503, 218866, -45798, -54845, -95802, 98302, 64836, 140929, 250402, 119986, 10179]
15214b59532B53287a51341h657A80860g8679B16384g9308L4292a7546C09840c11544
15202a60206J9075B56467c71172a19474a1446B42792I0742J08977a2416k63508
15192b75924A9098J45454A084i4430G0936b68324A10534L92917b11103A00093
15181I2978m2766a11903A64557h2825B697L8497R6828J83105j46803A3882Q555
15170B2437a65898B00253c1316j93881A58640a59565f0459k6467A7956J97156
15160B15112e941A57306G7670J77586d398C49884F7900j3434b22629A77097c250
15148A24304J16632A11017i185A88220J12441j05800J94656j93739J2005J91827
15138C99610g1066k491A44930F1068a59607I1285K22559b9786P836C37480j21518
$$ y = [-259532, 253287, -151341, -8657, 180860, -78679, 216384, -79308, -45016, -17546, 309840, -311544, -160206, -141131, 256467, -371172, -119474, -11446, 242792, 90742, 199719, -12416, -275924, 19098, 164552, 1084, -94430, 70936, -268324, 110534, 503451, -211103, 100093, 92978, 50212, -111903, 164557, -82825, 2697, 41194, 138022, 321127, 174324, 13882, 22437, -165898, 200253, -31316, -225197, 158640, -159565, -60459, -86926, 17956, 215112, -5941, 157306, 77670, 255256, -4398, 349884, 67900, 54466, -222629, 177097, -3250, 124304, 240936, 111017, -9185, 188220, 300661, 194861, 389517, 195778, 207783, 399610, -71066, -73557, 144930, 61068, -159607, 91285, 313844, -29786, -21950, 337480, 215962]
15127B15962R654p4381G3668N7498F1764L70583o5222a34194e1424A43504R2353
15116B35857a99538L9606m583F7164J12230o9072e7355B33227o5936F8526f0907
15104C38150J05092k11607p4699K13167c5665A48579K18434e8280B56069N9448
15094C15517c3294D1745L58471r2147b34787A19809Q2085K7583R9961m0205A3935
15082A35784e0684C20210H8820l1161H442K35740r3400L9767J56366J99992B9802
15070A78453j6237E7926M70062B9833O1984C2239n774J90739J53045A45600F5338
15058G7020J24010j3223K4803j5121L0130J29328A07032f3427j63529A57881E3813
15046I1342R3153a14515E8774g9475E448c0802A06109a28670C13750m843j42844
$$ y = [215962, 225616, 151235, 73668, 131166, 61764, 432347, 367125, -134194, -51424, 143504, 235857, -199538, -159932, -164515, 67164, 179394, 110322, -57355, 233227, 167291, 68526, -60907, 338150, 443242, 231635, 156936, 370103, -35665, 148579, 367013, -58280, 256069, 315517, -33294, 41745, 400216, 308069, -234787, 119809, 201894, 229477, 329438, 289233, 13935, 135784, -50684, 320210, 88820, 57659, 8442, 244182, 150782, 190549, 346915, 546907, 29802, 178453, 162216, 57926, 527988, 29833, 91817, 32239, 26465, 217204, 370249, 145600, 65338, 77020, 201030, 187807, 212610, 197489, 227619, 356947, 107032, -63427, -226956, 157881, 53813, 91342, 184495, -114515, 58774, -79475, 5448, -30802, 106109, -128670, 313750, 308907, 166063]
15035A66063K02025a82288A01091a80377B18782K0895L20235k77897J6489L5652
15025C34156F3842R9097b8111G2735K93491a00793B73880B0420i1797A36239E7090
15013F8137a12386C47246K56326k73790I5238J28153M2069n0696L3146H295a03036
15001A89987G3544l0410J52942o772J50720D8705M2513f8050G8167R4751Q9755
14990B62673p3088J62433A25848J85825K05200E557L30820A52089K17412O848
14980C76349A1531a70019B37254C4172J49417J81361F5463J90222o2221N95A6242
14968A24414K8247J22772l0796p2177L6152J84402J34439j70150o1602j04880
14958A90821c5162B16039L35231A51766J14275m2426m7614q4448L19254A31666
$$ y = [166063, 368088, -182288, 101091, -180377, 218782, 239677, 559912, 282015, 298504, 334156, 63842, 162939, -28111, 72735, 366226, -100793, 273880, 20420, -91797, 136239, 57090, 68137, -112386, 347246, 603572, 329782, 95238, 223391, 265460, 214764, 247910, 8295, -103036, 189987, 73544, 43134, 196076, 189304, 340024, 48705, 91218, -68050, 78167, 172918, 262673, 189585, 352018, 125848, 311673, 516873, 5557, 336377, 152089, 369501, 376349, 11531, -170019, 237254, 34172, 183589, 364950, 65463, 255685, 193464, 194059, 16242, 124414, 152661, 275433, 244637, 172460, 208612, 393014, 527453, 357303, 295701, 190821, -35162, 216039, 551270, 151766, 266041, 223615, 176001, 91553, 410807, 131666]
14947B41117l2301R5406M8665Q3787p0186j74502D6785K27757m4415L30808C4507
14935D10112B01511P4454K81665j05178j17805A32269L04832j32885K62433q1033
14925D85616j73220N6529j654r1611L00378r0849A51279J40728L1459q3376K86796
14914E26886A85370q8683L04930K09846a45046C38783K3691c0620B83067A25175
14903C17924j58668J34636J21329A88378M25352k08780A89022K70762A63939K63154
14893D27093K76372B0116M33520A66664J52297J75963k37385J06847F4944K44489
14883C09433K5024n1425L34658j49847N7711k03946k0769j37333O0480M90541
14873G14527B92555J4808R701K19988j67482j34815P6103L6014R2968A19660K04250
$$ y = [241117, 208816, 304222, 352887, 436674, 366488, 191986, 46785, 274542, 230127, 560935, 34507, 410112, 201511, 275965, 557630, 452452, 334647, 132269, 437101, 304216, 566649, 485616, 312396, 368925, 367271, 275660, 576038, 485189, 151279, 292007, 323466, 240090, 526886, 185370, 96687, 401617, 611463, -145046, 338783, 362474, -30620, 283067, 125175, 317924, 159256, 293892, 415221, 188378, 613730, 404950, 189022, 459784, 163939, 427093, 703465, 20116, 453636, 166664, 318961, 494924, 257539, 364386, 64944, 309433, 334457, 283032, 617690, 467843, 525554, 321608, 300839, 163506, 223986, 714527, 292555, 307363, 317064, 537052, 369570, 234755, 310858, 346872, 439840, 119660, 323910]
14862C23910k3302J27592j01101K7687J78092J24102j00209l5062j47557l9154
14852C34998M08466k56341n1927K05790A65071N22926B30554J44945I9389M98130
14842E97519L1525A38402K41508K01250r3569A81681K32091K83619p1935B79339
14831D12195Q3702j49735J83512n640j7449m1629k534K84704Q091B97321J48583
14820D45904j63909r9371J70983L41591k30166B29497K51309j6687k6081j4807
14810D23231K84402p2016l0904j20625j57153K7288Q9957J8252M6395J34574k33913
14799D09488j55744L63834k2951P8050l9087j04342q0965J44565B52763L65446
14789F18209j97732l0517K67069N8244j77284J04363B98443N66243j97131k16973
$$ y = [323910, 300608, 428200, 327099, 354786, 532878, 656980, 556771, 521709, 374152, 334998, 743464, 487123, 435196, 640986, 165071, 687997, 230554, 375499, 99389, 597519, 629044, 138402, 379910, 581160, 487591, 181681, 413772, 697391, 625456, 279339, 412195, 495897, 346162, 529674, 524034, 506585, 464956, 462422, 747126, 755217, 297321, 445904, 281995, 182624, 353607, 695198, 465032, 229497, 480806, 464119, 438038, 423231, 707633, 635617, 604713, 484088, 326935, 354223, 444180, 462432, 508827, 643401, 409488, 253744, 617578, 594627, 672677, 633590, 529248, 448283, 592848, 252763, 618209, 420477, 389960, 657029, 715273, 537989, 642352, 298443, 864686, 667555, 450582]
14779D50582K77738M35l36481M00286C60491K40003B43944M39276J27162j40860
14769F69522o7335L2648K33460k41938J38653k18006p8482K61817k09227K50748
14759G71860J03254m29080K89304k72147j4991K93021k77155j05917J85233M53747
14749I97129k14375m8760j61012r9754J5186J73635J84779C09432K40822P2598
14739F22852K45379k92385K44319j33660r7141J53383k04874N17160j56799l27792
14729E70442J41642B75041N55111j8635l7109j35588J2468K95392K3918l15861
14719F54737K60421J53942l96973M51791k10005l37909J80199O7822R570Q1311
14709I14906C86287M13907j23771J94425J55410j91673n3767J56716N8730L534
$$ y = [450582, 728320, 728755, 392274, 792560, 360491, 600494, 243944, 683220, 810382, 669522, 602187, 634835, 868295, 626357, 765010, 547004, 468522, 730339, 521112, 771860, 875114, 446034, 735338, 463191, 448200, 741221, 464066, 358149, 543382, 997129, 782754, 733994, 572982, 473228, 488414, 662049, 846828, 309432, 550254, 622852, 868231, 575846, 820165, 686505, 589364, 742747, 537873, 1055033, 898234, 570442, 712084, 275041, 830152, 811517, 774408, 638820, 651288, 946680, 970598, 654737, 915158, 1069100, 672127, 1123918, 913913, 576004, 756203, 824025, 833595, 914906, 386287, 800194, 676423, 870848, 1026258, 834585, 780818, 937534, 996264, 999798]
14699I99798m13973N78793j41734k66248m9742L20910l49602K43393P13J60458
14689A082766k42471q2695K80030k08461J11269l09857L80825o9923N3396J51370
14679A146249k26231J55659P8670l3984P6925r0265K10787l01791l069L3716m3973
14668A002693J95677J5379q9575n4008j45393m1220j33205N32398k75132j67577
14658H40037K39488k06008K80820K02128k22711k0313Q1137K0237m43707N72057
14648A343165j55957p0712j12999J44055J52947k09672R7565m5401K0356J1375
14638A174722J07434J04830j65412k50821L19140K21280k31671J57954l11394
14629A126062K74002k46869l09734P26220j03126j93001o8519K91267l07644K31337
$$ y = [999798, 585825, 1164618, 1022884, 756636, 706894, 1027804, 678202, 921595, 922308, 1082766, 840295, 757600, 1037630, 829169, 940438, 630581, 1011406, 941483, 994879, 1146249, 920018, 1075677, 1154347, 1120363, 1197288, 1107023, 1317810, 1016019, 1012950, 1046666, 1002693, 1198370, 1213749, 1124174, 1070166, 924773, 883553, 750348, 1282746, 1007614, 840037, 1079525, 873517, 1154337, 1356465, 1133754, 1113441, 1194578, 1214815, 771108, 1343165, 1187208, 1116496, 1003497, 1147552, 1300499, 1090827, 1188392, 1142991, 1163347, 1174722, 1282156, 1386986, 1221574, 970753, 1289893, 1511173, 1279502, 1437456, 1126062, 1400064, 1153195, 843461, 1569681, 1466555, 1273554, 1205035, 1496302, 1188658, 1419995]
14619A419995j13772L52015l95274L83713n75743N82415N8864j63108k07553K82370
14609A623922m6800J1380K8316L10930l87280J81408L4654q0362J74141l28103
14599A522206J55350j21551N163O41740n60850L15506j31274q1809J32588j01134
14589A775935L68313q1022l12487L53450k46091O033p0890L8272L19984l82617
14579A768880L50481K74314J08548m39846P8331l08429K99541L51869k25997K13022
14569B470714j89764R4680l66248K05930L40147l53093N87021m56560L60979o0298
14559B633508K22438Q6722J54703n2416L69265o8346N13550J66686O84713J635376
14549F346199K433252M325927J1248978R839004L726758j4720466j0918637n491006
$$ y = [1419995, 1306223, 1658238, 1262964, 1646677, 1070934, 1653349, 1712213, 1549105, 1341552, 1623922, 1577122, 1588502, 1616818, 1927748, 1540468, 1721876, 1756530, 1676168, 1850309, 1522206, 1677556, 1556005, 1561168, 2202908, 1642058, 1957564, 1826290, 1744481, 1877069, 1775935, 2144248, 2063226, 1750739, 2104189, 1858098, 1864131, 1793241, 1831513, 2151497, 1768880, 2119361, 2393675, 2502223, 2062377, 2140708, 1832279, 2131820, 2483689, 2257692, 2470714, 2280950, 2375630, 2009382, 2215312, 2555459, 2202366, 2789387, 2332827, 2693806, 2633508, 2855946, 2942668, 3097371, 3044955, 3414220, 3345874, 3859424, 4026110, 4710823, 6346199, 8779451, 13105378, 24354356, 34193360, 37920118, 23199652, 12281015, 6790009]
14541F790009k488248j331547o54487K8812J2489k35036j40826J4378o4357j6687
14531A914500J32194K6939j48345L02640l77050J32203J94140L43016N5427k40658
14521B335006J37164K77904k26393L3161K02810r5827K3135J26743j11836r167
14511B692700J3510L33598k90264j30774N3055L42110L8233k01670J42928K30373
14501C223799K122o7217K79994k0202k76613L91727l07004Q962K43750r0788k6036
14490C362494J30715J16695l49571R56943j32281n83789M54135o7321p2356j5430
14480C800234P7186J1679M0625K40192J12867m07972L08603j7833J85128J78030
14470D528739j87074N3878K72433k02296j40142K44774j84106L82944l33358M84355
$$ y = [6790009, 4301761, 2970214, 2315727, 2344539, 2357028, 2121992, 1981166, 1995544, 1931187, 1914500, 2046694, 2073633, 1925288, 2227928, 1850878, 1983081, 2177221, 2520237, 2575664, 2335006, 2472170, 2750074, 2523681, 2556842, 2759652, 2663825, 2686960, 2813703, 2701867, 2692700, 2706210, 3039808, 2749544, 2618770, 2671825, 3013935, 3052168, 2850498, 2993426, 3223799, 3225921, 3158704, 3438698, 3418496, 3141883, 3533610, 3226606, 3235568, 3479318, 3388530, 3362494, 3493209, 3609904, 3260333, 4217276, 4084995, 3501206, 3955341, 3888020, 3815664, 3800234, 3877420, 3889099, 3929724, 4169916, 4282783, 3874811, 4183414, 4165581, 4350709, 4528739, 4341665, 4395543, 4667976, 4465680, 4325538, 4570312, 4386206, 4769150, 4435792, 4920147]
14460D920147m23593L53534Q0704l7612Q8632J3932n750K37669j37395L44696
14450E434964k03364K90692J11737J02509K67680k33187J62702L3990P2534K08295
14440F248552j06917p2217L32313k26853L63054L25219l72102J48673R4967K56343
14430F991032k80403Q5900N51440k04329K25612J05536K56308j37869O277p6489
14420G523015O55310J83748k16918J01229J71889M4392L51761k59542O08229k58580
14410H904533M60790l5382l48020P49853m8294P9345J2303j26115O76260R540
14400A0334813P4211O6242N32436k84599O63310n0617K76558J47183M98913L09333
14390A2567783j70944P2371L92371K31057L77041J44372m9761O01149k6157J73821
$$ y = [4920147, 4496554, 4850088, 4930792, 4893180, 4981812, 4995744, 4989994, 5227663, 5090268, 5434964, 5231600, 5522292, 5634029, 5736538, 6004218, 5771031, 5933733, 5967723, 6040257, 6248552, 6141635, 6069418, 6401731, 6174878, 6537932, 6863151, 6491049, 6639722, 6734689, 6991032, 6710629, 6796529, 7347969, 7143640, 7369252, 7474788, 7731096, 7593227, 7599504, 7523015, 8178325, 8362073, 8145155, 8246384, 8418273, 8462665, 8814426, 8554884, 9163113, 8904533, 9365323, 9329941, 8981921, 9731774, 9683480, 9762825, 9775128, 9649013, 10325273, 10334813, 10409024, 10475266, 11007702, 10723103, 11386413, 11335796, 11612354, 11759537, 12258450, 12567783, 12396839, 12469210, 12861581, 13092638, 13469679, 13614051, 13564290, 14165439, 14139282, 14313103]
14380A4313103O33521K65037J01279N27335J73048L90106J02361M30119M24649
14371A7360558J93358N91647J46385M32397K13647M77933K83815J053042n5337
14362B0697445J53371Q00716O39556M2431Q01653N09550K90621J088702J22767
14353B5146812O55339N79974Q54228K18707R67960O62269O38022Q45284R95915
14344C1564510N05752J163717P43794P01442Q25207J436230Q07980J032167J183572
14335C9964371O26683J836089J346863R85221J182575J557085J686757J236528
14327E0422172J819587J301400J787592K313240J802735J922324K310250K016357
14319F5695657K559191K546650K444470L011306K819385L121797L348959L187253
$$ y = [14313103, 14946624, 15211661, 15312940, 15840275, 16013323, 16403429, 16505790, 16935909, 17360558, 17553916, 18145563, 18291948, 18724345, 18937992, 19415925, 19699740, 20752782, 20697445, 20850816, 21651532, 22291088, 22333519, 23135172, 23644722, 23935343, 25024045, 25146812, 25802151, 26382125, 27236353, 27455060, 28423020, 29085289, 29723311, 30568595, 31564510, 32070262, 33233979, 33977773, 34679215, 35504422, 36940652, 37748632, 38780799, 39964371, 40591054, 42427143, 43774006, 44759227, 45941802, 47498887, 49185644, 50422172, 52241759, 53543159, 55330751, 57643991, 59446726, 61369050, 63679300, 65695657, 68254848, 70801498, 73245968, 76257274, 79076659, 82198456, 85547415, 88734668]
14311H8734668L660553M116071L667603M388025L903572M762148N111030N293743
14303A23637413N401386N923197O332286O632731P267071P296694Q018072Q178180
14295A78687030Q698081R441748J0045197J0285609J0855202J1419234J1977780
14288B51409881J2670110J2995205J3694932J4151724J4343820J4662981J5033950
14281C48962603J5064086J4467176J4649390J3822831J3566126J1984149J0850616
14274D43366977P619213L641910Q43837j705280k280284K550851j12206k849080
14266D51075938o168193p518386r192553j0479542j1572486j3423184j3929780
14259C78791814j4467255j5143940j5816424j5253559j5175149j4306166j3517345
$$ y = [88734668, 92395221, 96511292, 100178895, 104566920, 108470492, 113232640, 118343670, 123637413, 129038799, 134961996, 141294282, 147927013, 155194084, 162490778, 170508850, 178687030, 187385111, 196826859, 206872056, 217157665, 228012867, 239432101, 251409881, 264079991, 277075196, 290770128, 304921852, 319265672, 333928653, 348962603, 364026689, 378493865, 393143255, 406966086, 420532212, 432516361, 443366977, 450986190, 454628100, 455471937, 453766657, 451486373, 454037224, 453925018, 451075938, 444907745, 437389359, 428196806, 417717264, 406144778, 392721594, 378791814, 364324559, 349180619, 333364195, 318110636, 302935487, 288629321, 275111976]
14252B75111976j3644055j2756007j2616241j1456707j1163413j0314863j0196537
14245A92964153q827246q966970q353581q041844p272823o863890o782938n769462
14237A32085399n476066n444270n557924m595869n034629l948944m024310l796571
14229I4206816m041509l233189l131172l438550k985999k675973k967343k446136
14221F9286945k476204k246480j854341k285444j889064j932314j763543j271212
14213E3568343j848267j897795j638387j453168j112277j156267r36812j418449
14205D2106921r20723j299111j163148j276000j065241l24961j178414j174192
14197C3705131q96692o77321p18278j057408l97905j108457m83039p51612q70859
$$ y = [275111976, 261467921, 248711914, 236095673, 224638966, 213475553, 203160690, 192964153, 184136907, 175169937, 166816356, 158774512, 151501689, 144637799, 137854861, 132085399, 126609333, 121165063, 115607139, 111011270, 105976641, 102027697, 98003387, 94206816, 90165307, 86932118, 83800946, 80362396, 77376397, 74700424, 71733081, 69286945, 66810741, 64564261, 62709920, 60424476, 58535412, 56603098, 54839555, 53568343, 51720076, 49822281, 48183894, 46730726, 45618449, 44462182, 43525370, 42106921, 41186198, 39887087, 38723939, 37447939, 36382698, 36057737, 34879323, 33705131, 32808439, 32131118, 31412840, 30355432, 29957527, 28849070, 28366031, 27614419, 26743560]
14188B6743560m28744n24574q17139n48812n39080m97694m55790n82547m39743
14179B1909437J20151j097344j66051o26973l70244m70460m31210l43415p4632
14170A8449259l97264k46954n66027k62465l94356k31398l27603k61540k33274
14161A5528378k63913k90425o7005o08378m14497K28376m19430j10169m30166
14152A3152771j42780j55436n51824q8073L4755l78224j26115j97124R8562k48919
14142A1397593o1399j68847p89248J89188j22558k10343k42532n1744k44846N5190
14132I750454k87057k44181J73807j30005j00399n6461o5117k81886j98976p2468
14122H487711k80864J65258k88854l83662K14438j37188j37940m6468n0102J8018
$$ y = [26743560, 26314816, 25790242, 24973103, 24424291, 23885211, 23387517, 22931727, 22349180, 21909437, 22029588, 20932244, 20766193, 20139220, 19768976, 19298516, 18867306, 18523891, 18449259, 18051995, 17805041, 17239014, 16976549, 16582193, 16350795, 16023192, 15761652, 15528378, 15264465, 14974040, 14907035, 14298657, 13884160, 14112536, 13693106, 13582937, 13152771, 13009991, 12854555, 12302731, 12214658, 12249413, 11871189, 11745074, 11547950, 11646512, 11397593, 11336194, 11167347, 10378099, 10567287, 10444729, 10234386, 9991854, 9940110, 9695264, 9750454, 9463397, 9219216, 9393023, 9263018, 9162619, 9106158, 9041041, 8759155, 8560179, 8487711, 8206847, 8372105, 8083251, 7699589, 7914027, 7776839, 7638899, 7592431, 7542329, 7560347]
14112G560347j67521o8628k22815K57699m94653J3531l27197M95086n97760p4286
14102F373803J17500K97654n31423K0074J6867l69421L53229j18725k22262k18670
14092E718626M7921j79057m6921J78483K8849n11193J7897J15734K0281o07101
14082D783519L40336l56388J92812J34608k81442J59570N267k83609O971l06233
14072D395411M53956l38393J44746j23684J38506K9888l89151j09322N8762j54630
14062D106089K7922k74380L69318m2014j25522p6584L35233n98467L58739L5288
14052D115622l20228K23705l74979K30815m09166K12251j07586k29102K40503
14043C581835O7450j14693j99482j69345L13039k73890p7540J2658K69758k09699
$$ y = [7560347, 7392826, 7324198, 7101383, 7359082, 6864429, 6877960, 6550763, 7045849, 6448089, 6373803, 6491303, 6788957, 6257534, 6277608, 6294475, 5925054, 6278283, 6159558, 5937296, 5718626, 5766547, 5587490, 5540569, 5719052, 5747901, 5236708, 5254605, 5370339, 5390620, 4783519, 5123855, 4767467, 4960279, 5094887, 4813445, 4973015, 4978282, 4694673, 4701644, 4395411, 4849367, 4510974, 4655720, 4532036, 4670542, 4700430, 4311279, 4201957, 4260719, 4106089, 4134011, 3859631, 4228949, 4186935, 4061413, 3984829, 4320062, 3721595, 4080334, 4115622, 3795394, 4019099, 3644120, 3874935, 3465769, 3678020, 3570434, 3341332, 3581835, 3649285, 3534592, 3335110, 3165765, 3478804, 3204914, 3127374, 3140032, 3409790, 3200091]
14033C200091R46o3999L56073k84088o9108q9659M3469l50414j09353L02781q383
14022B928356N3924m17315K24348J78969l90075K98381K1732k63062M4826k01995
14012B478089j9498J57706k20074K39218r3217l96560J07074Q4463k359J21819
14002B456661M9031k51986j61704m9097O0372K8082R3025R5818l40788J79117
13992B158531K19657J23358N15946J663714L971397R440584J2371295P664212
13984C8128694j0716195j2685529n534243k245911j607763q26057k86895p85227
13976C440874k76248j42707J41747m27387M386k19527J65488j21864j63917n9313
13966B341532J8069p045j88061K29004j81719P4840p1060M3174J36023k87312
$$ y = [3200091, 3201037, 3137038, 3493111, 3209023, 3139915, 3050256, 3093725, 2743311, 2633958, 2936739, 2928356, 2982280, 2564965, 2789313, 2968282, 2578207, 2876588, 2898320, 2635258, 2680084, 2478089, 2458591, 2616297, 2396223, 2635441, 2542224, 2145664, 2252738, 2337201, 2334842, 2456661, 2505692, 2253706, 2092002, 2042905, 2103277, 2131359, 2224384, 2320202, 1979414, 2158531, 2378188, 2501546, 3017492, 4681206, 8652603, 18093187, 30464482, 38128694, 27412499, 14726970, 9192727, 6946816, 5339053, 4512996, 4226101, 3440874, 3164626, 3021919, 3163666, 2736279, 2740665, 2521138, 2686626, 2564762, 2400845, 2341532, 2359601, 2352556, 2164495, 2393499, 2211780, 2286620, 2215560, 2258734, 2394757, 2107445]
13956B107445L61265j92237l46534k33516K35672K84315k84543K10329n06723
13947A635473J41364J13718j46985K29504Q0510j81491L2808p1209j58434l1447
13937A643811J86601j7911k19585J19382M02341m5492o32161L27008j8986M4672
13927A789680j99343M5243K4843Q6504k87277K555p4369K94800j10812J86620
13917A758444l18726Q0758N0567r2769J20493j57829j540j80004N42672k82424
13907A519642n7970j6653m5946K45668j25565n61137M2273M70954J32874m19301
13897A184839O7950L81635n62801J98483K87354N4274k91399N9491L31253l72069
13887A339010j3716O3303r8111k1292M5024j12524J47652j4109k03425j1783J65945
$$ y = [2107445, 2468710, 2276473, 1929939, 1696423, 1932095, 2216410, 1931867, 2142196, 1635473, 1776837, 1890555, 1743570, 1973074, 2053584, 1872093, 1904901, 1833692, 1675258, 1643811, 1830412, 1812501, 1592916, 1712298, 2114639, 2069147, 1436986, 1763994, 1745008, 1789680, 1590337, 1635580, 1660423, 1746927, 1459650, 1462205, 1387836, 1682636, 1571824, 1758444, 1439718, 1520476, 1571043, 1478274, 1598767, 1440938, 1439398, 1259394, 1802066, 1519642, 1461672, 1445019, 1399073, 1644741, 1519176, 958039, 1000312, 1471266, 1604140, 1184839, 1252789, 1634424, 1071623, 1270106, 1557460, 1611734, 1320335, 1379826, 1711079, 1339010, 1325294, 1388597, 1290486, 1269194, 1314218, 1201694, 1349346, 1335237, 1131812, 1120029, 1285974]
13876A285974J07605l27413J78964k10206l39532J53617J53206O7971L62627j03266
13866A329547J74782m67037K64027n8015j938j10562Q4098q9390O8636J63583
13856A357731k45316J36136m60514L25441L6039M4043l10891K04718o1026O6843
13846A093204J66571j69323j84220J08790n3068K48097k24919k97813M67984k21736
13836I33567j11046J51894k49396K51049J37317L1545K17663r8396m84399J81007
13826I60805J12361q4683k47516J76001o0979J43630J80688m27219J25420N9376
13816I37884K06998m18132J80380J21396k44288l29184M39703j62455j00669J44204
13806G75837L99104l56482Q9366J00645k62821L07855k48052Q9459r0426j10209
$$ y = [1285974, 1393579, 1066166, 1245130, 1034924, 695392, 849009, 1002215, 1070186, 1432813, 1329547, 1504329, 1037292, 1301319, 1243304, 1241366, 1130804, 1214902, 1125512, 1194148, 1357731, 1112415, 1248551, 788037, 1113478, 1149517, 1193560, 882669, 1087387, 1026361, 1093204, 1259775, 1090452, 906232, 1015022, 961954, 1210051, 985132, 687319, 1155303, 933567, 822521, 974415, 725019, 976068, 1113385, 1144930, 1362593, 1264197, 779798, 960805, 1073166, 988483, 740967, 916968, 855989, 999619, 1180307, 753088, 878508, 937884, 1144882, 726750, 907130, 1028526, 784238, 455054, 894757, 732302, 631633, 775837, 1174941, 818459, 907825, 1008470, 745649, 1053504, 805452, 894911, 804485, 694276]
13796F94276j95727L31073j2664J82540j41205K17036k86969n123J57406m42194
13786D98449O6143J58316k40671J07537K52653p3657K62764k66097J39059j56157
13776G48339M7721o8021p6621J52566p2950L4376j47742q1005L20154k57317j9880
13765E79620R3288k62104K62731O003P7031J30936j17588n9163J08312J83060
13755A002126m16389q614R6924J03511j43471C15921L40240m5262K66096M108
13745H81103j06227K011j38106q6369M3183O1567N1652J15247l8854R5263k32880
13734F47590k16473K45264j15544M1244m1743k1702J78701j56749M899q2060n5318
13723D28109K27106J7760k82199J40484J44077k48271Q0059O9745L14053D45138
$$ y = [694276, 498549, 829622, 816958, 999498, 858293, 1075329, 788360, 783237, 940643, 498449, 564592, 722908, 482237, 589774, 842427, 768770, 1031534, 765437, 904496, 748339, 796060, 728039, 651418, 803984, 731034, 765410, 617668, 536663, 856817, 599500, 579620, 672908, 410804, 673535, 679538, 756569, 887505, 769917, 710754, 819066, 1002126, 585737, 577123, 674047, 777558, 634087, 315921, 656161, 610899, 876995, 881103, 774876, 776887, 638781, 552412, 595595, 657162, 708814, 824061, 785207, 880470, 647590, 431117, 676381, 560837, 602081, 560338, 538636, 717337, 560588, 565487, 483427, 428109, 655215, 672975, 390776, 531260, 675337, 427066, 507125, 576870, 890923, 445138]
13712F10655k17477J96103J40438k72530J81184j68465L54077j59459k4523j17758
13702E22245j64101n3269q5802L27849j70560K47413k43568K73465j51349K77164
13692G79487C73048M91669j96009l28947M73723l42009o106j20335K28976J92525
13682G66535l36423m7849K55302j25365n7183K1282A55330M12361P1062A64724
13671D25464J29551J4240p4478F5848L97209Q8473n8402K0899j76463K07384p009
13660E37939q2610J16458I3424M87191l1526p6414A74569J80778J11275j31215
13650C35407N4363j21287L30569j97599K17254p8051n9395K52580p9663k85311
13640C68867J90574r0628J86113l14228K09423j97927K07082J16621M9250C23337
$$ y = [610655, 393178, 589281, 729719, 457189, 638373, 469908, 823985, 664526, 640003, 522245, 358144, 304875, 219073, 546922, 376362, 623775, 380207, 653672, 502323, 779487, 373048, 864717, 668708, 339761, 813484, 471475, 465369, 345034, 574010, 766535, 430112, 382263, 637565, 512200, 455017, 476299, 155330, 567691, 638753, 164724, 425464, 555015, 569255, 494777, 65848, 463057, 551530, 493128, 514027, 337564, 544948, 537939, 455329, 571787, 93424, 580615, 549089, 472675, 174569, 355347, 466622, 335407, 389770, 268483, 599052, 401453, 618707, 540656, 481261, 733841, 654178, 368867, 559441, 468813, 654926, 340698, 550121, 352194, 559276, 675897, 725147, 323337]
13629B64131j30626K75081J7361j14023K22065j60158k730j25884L24849j84540
13619C85526L20796j56508I107N61444M3464B28274K60082A87122K61786F3470
13608D69180r7409p2003m6370A08059K37209O6670K19286C10416r5712M30090
13598F44794B07982L6773N4705N8446Q04p7035J29833M5268j25518N5540J76607
13587E63405p7040l5190J7801k32824K2813J94248q7642b4289A37372M52849J8029
13576F08250I3865K95435j9007A7320L32662O1115K34811A92769P3841J04972
13566C71582j8754j52729G5905J91271K55781k49884Q7279A61894a78707C73149
13555F18892I5282L03373L56062k02051j4008P1718A86440L00527C4138P38529
$$ y = [264131, 133505, 408586, 425947, 311924, 533989, 373831, 371101, 245217, 570066, 385526, 706322, 549814, 9107, 570551, 614015, 228274, 488356, 187122, 448908, 63470, 469180, 371771, 299768, 253398, 108059, 345268, 411938, 631224, 310416, 214704, 644794, 207982, 244755, 299460, 357906, 358710, 281675, 411508, 456776, 331258, 386798, 563405, 486365, 451175, 468976, 236152, 258965, 453213, 365571, -24289, 137372, 590221, 608250, 93865, 389300, 370293, 17320, 349982, 411097, 645908, 192769, 266610, 371582, 352828, 200099, 75905, 267176, 522957, 273073, 360352, 161894, -178707, 373149, 618892, 95282, 398655, 754717, 552666, 538658, 610376, 186440, 486967, 34138, 772667]
13545G72667j23058k07386A44497N7603K62037j22535N5747A45253N2134J67024
13535C64411A58068J98262j006J86343I4551j0129K49247N7452j59773N12550
13525G43898l30994o8442P6099j03398A35344o3523J91656Q496J97765J19009
13515E88747B28181r0858l5189K80936q2937I6223L33745j87784L8480b54955
13504C70310Q6874o141E4745K83983K56727B68279b19953B38239j9930L12852
13494E31161C1293L18278m4261N6494p6474M6102J08128j54664J20893j01812
13484C03977J33362j28503J81744k24800j04624o4437O14045B79808j9032A08160
13473I473P853M57039j18073G5243J30448F2894J56402K74024G4799O5891M208
$$ y = [772667, 649609, 442223, 144497, 202100, 464137, 341602, 397349, 145253, 197387, 364411, 158068, 356330, 355324, 541667, 94551, 84422, 333669, 391121, 231348, 743898, 412904, 344462, 420561, 317163, 135344, 71821, 263477, 271973, 469738, 588747, 228181, 137323, 102134, 383070, 300133, 96223, 429968, 242184, 280664, -254955, 370310, 457184, 451043, 54745, 338728, 595455, 268279, -219953, 238239, 218309, 531161, 31293, 349571, 305310, 361804, 285330, 331432, 439560, 284896, 405789, 303977, 437339, 308836, 490580, 265780, 161156, 96719, 710764, 279808, 260776, 108160, 9473, 17326, 474365, 356292, 75243, 205691, 62894, 219296, 493320, 74799, 140690, 144898]
13462A44898J41587A00338c5890D0900L37079A41238J49621C3981P0954a37933
13451c5172A96842o3794A9140K3352c284A61964J21258J19898A92084J13041K3987
13440C29112P4138j36812d5416C22969n693J5436b2399D02631d2756C04375D8326
13428C90757a1460j28038C46749L8243j54376a11021D26274r7860k2470K82423
13418E88367k65559D2759J90996o0457p6112L49839a21884C63931A32777Q0648
13408B13425L01188A67811J40907P858N2355o520A10516J36623J95179j75018
13398B67300j19487b71818A99311K7256d47564A31633D6587c2465B78214Q6366
13388C64580b0445A59330j5852O0551J17354Q3813r5031j8205L5212L4915a2373
$$ y = [144898, 286485, 100338, -35890, 40900, 377979, 141238, 290859, 33981, 104935, -137933, -35172, 196842, 133048, 19140, 42492, -3284, 161964, 283222, 403120, 192084, 305125, 329112, 403250, 266438, -45416, 322969, 317276, 332712, -22399, 402631, -42756, 304375, 48326, 390757, -11460, -139498, 346749, 384992, 230616, -111021, 426274, 328414, 305944, 588367, 322808, 42759, 233755, 173298, 97186, 447025, -121884, 363931, 132777, 213425, 514613, 167811, 308718, 316576, 368931, 362411, 110516, 247139, 442318, 267300, 147813, -271818, 199311, 226567, -447564, 131633, 46587, -32465, 278214, 364580, -20445, 159330, 143478, 204029, 321383, 405196, 310165, 291960, 327172, 362087, -12373]
13376B99429q9459K6045K5002A08243k501J84030j09221L78075a05022A02641
13365C93849j67266G9142a01607E62096k18063j8168A43666E5846h1379C10667
13354C55592K53478k97618q6662K39167f4813A73679K3448a09819C59248o6562
13344B92686K29251A02864M84826j97679A37578e9156A10479J38171L06575D7361
13333D49337r8801J01886b4388A19305J98097Q5536M8924I6765k6918J65655R7708
13322C33210J04679j46380A6017R1728k6088d3515C88885k3744H3925K51875m5619
13311B90181A07008i6942A54166J53553j25089a580B65412a19652C1049K57650
13301B88699n0401b32933F92362k38327R6315B488J65287k296q2469b7586B73997
$$ y = [299429, 209970, 236015, 261017, 108243, 105742, 289772, 180551, 558626, -105022, 102641, 393849, 226583, 79142, -101607, 562096, 344033, 325865, 143666, 55846, -81379, 310667, 355592, 609070, 311452, 224790, 463957, -64813, 173679, 197127, -109819, 359248, 292686, 521937, 102864, 587690, 390011, 137578, -59156, 110479, 248650, 555225, 47361, 449337, 350536, 452422, -24388, 119305, 317402, 402938, 451862, 96765, 69847, 235502, 333210, 437889, 291509, 16017, 107745, 81657, -43515, 388885, 365141, 83925, 335800, 290181, 107008, -96942, 154166, 307719, 182630, -1580, 265412, -119652, 31049, 288699, 238298, -232933, 692362, 454035, 550350, 2488, 167775, 165479, 83010, -27586, 273997]
13289A51652J64563j54335J46581A40350a7960H4636a93671B67544j17349L4321
13279A84516I343K2783L43645G5569L00722A64415L2456k6829K16388F8161M4704
13268A12865b11423A41808E621Q2119e5097R556A37172a9095A97934c76477h0433
13256C40661A18739N6805a26102D4373c6697B53066P3662b67972E4450c34687
13245B91864D17e1263B24439A4161e7406C37112E8330a15790H9847Q7080H7639
13233C6162J26193k1818A0839R6190K55718N6883N3067A78456J64457c9177C25324
13221B90355p1947l513b11720C9331a21884A51755b31682C85045j31755I9118
13210f1208O670A94792i3902b8046o449A42833A1822K56728b170p9345j15442
$$ y = [151652, 316215, 161880, 308461, 140350, -17960, 84636, -193671, 267544, 150195, 184516, 9343, 32126, 375771, 75569, 376291, 164415, 196871, 170042, 386430, 68161, 112865, -211423, 141808, 5621, 87740, -55097, -45541, 137172, -19095, 197934, -376477, -80433, 340661, 118739, 175544, -126102, 44373, -36697, 253066, 326728, -267972, 54450, -334687, 291864, 417, -51263, 224439, 14161, -57406, 337112, 58330, -115790, 89847, 176927, 87639, 36162, 162355, 140537, 10839, 107029, 362747, 419630, 472697, 178456, 342913, -39177, 325324, 290355, 218408, 214895, -211720, 39331, -121884, 151755, -231682, 385045, 253290, 99118, -61208, -54538, 194792, -93902, -28046, -34495, 142833, 11822, 268550, -2170, -81515, -196957]
13199a96957j11856C46521j61584p6418K87533e8811D1887a37735C33292A2891
13188C2886J19291J13331m4685a63639B03993g5361J9798B98701e5294B75300
13177g6201C921L22204K8619j03887c16309d8324G1573L6602L40143A27875D1394
13165e6895A80362a12906E9303Q8721n8271k0649O1984B4199L67389A77040E1831
13153a0294B29830I2218k9650K16694a40916E7840J23598d1557Q305B41406g1129
13141A94279g5859A09800J11843j10141J859Q2323d3171B57504a62043n9898D38367
13129a2084C92311J6861a54749B12076a05152A40572a0961o9263E1211h5865A79160
13117b0931G8864j3503a33076A76624i3868A60492R7870E4540K30576p7296K14862
$$ y = [-196957, -308813, 346521, 184937, 108519, 396052, -58811, 41887, -137735, 333292, 12891, 32886, 152177, 265508, 220823, -163639, 203993, -75361, -55563, 298701, -55294, 275300, -76201, 3921, 326125, 354744, 250857, -316309, -48324, 71573, 108175, 448318, 127875, 41394, -56895, 180362, -112906, 59303, 148024, 89753, 69104, 131088, 24199, 391588, 177040, 51831, -10294, 229830, 92218, 62568, 279262, -140916, 57840, 181438, -41557, -33252, 241406, -71129, 194279, -75859, 109800, 221643, 111502, 113361, 195684, -43171, 257504, -162043, -221941, 438367, -12084, 392311, 409172, -154749, 212076, -105152, 140572, -10961, -80224, 51211, -85865, 179160, -20931, 78864, 65361, -133076, 176624, -93868, 160492, 258362, 54540, 285116, 207820, 422682]
13106D22682j59704J08957c7337B34392O9236a66401e745F9357k2839d8187D3667
13094a78558r58A34561K46518E5664b44624A31774k6394h1922j88920A00738L02375
13083D03113k01121q2253a09393A75038f8939B73952E036J81475r236m2401R564
13072A44438G0819k4442Q435K32299J36749A59512J64045F8474g5364B1691J13721
13061A35412E173e1051l195A66151J50338m3517h7396o8014j98422C1524K3528
13050E5052J23111F5688K8750a01142A59543J38748I4043a60197I4270J55655
13040B49925j02168C359J12386J13494a23952N8327B80101N9365C6829L2487N5672
13029A24988P003M6743A884J45522J7452e1280k9850C16115a42949A36574o5305
$$ y = [422682, 262978, 371935, -37337, 234392, 303628, -166401, -5745, 69357, 46518, -48187, 43667, -178558, -179516, 134561, 381079, 55664, -244624, 131774, 105380, -81922, -270842, 100738, 403113, 201992, 119739, -109393, 175038, -68939, 273952, 5036, 186511, 177275, 134874, 144438, 70819, 46377, 54812, 287111, 423860, 159512, 323557, 68474, -75364, 21691, 135412, 5173, -51051, -54246, 166151, 316489, 272972, -87396, -155410, -353832, 31524, 55052, 178163, 65688, 94438, -101142, 159543, 298291, 94043, -160197, 94270, 249925, 147757, 3359, 115745, 229239, -123952, -65625, 280101, 339466, 36829, 69316, 124988, 131991, 178734, 1884, 147406, 164858, -51280, -81130, 316115, -142949, 136574, 71269]
13018G1269j6921J70480a5360q8348A87231D7080p788M38527B9169J46454f2381
13006c783E8687J40632p8226j1872a07135B6066b4948A77093q5226j5615C0085
12994B33421J3530I9150Q9946b0370j52293B38577A19228K38410a34908C9554
12983D28926A31213J21065A01394i1694B52660A5495a64447A14613J6076l9157
12973I1532a1148A07167c3362D09903A72469l5129a873G5765J5434c7721e878
12961a00838c7746l18121A6038P8796k6344K324K42481A42393A1975d5498k2980
12950f8478E3876J80607H8372R0629b3661B62955a82276G5766a55805e505E16345
12938A65059M4549n8432a17556k202F2122f8189q7994d3351J2088q5260O551B6079
$$ y = [71269, 54348, 224828, -15360, -103708, 187231, 47080, 39292, 477819, 29169, 175623, -62381, -3783, 58687, 199319, 121093, 109221, -107135, 26066, -24948, 177093, 91867, 76252, 30085, 233421, 246951, 99150, 189096, -20370, -172663, 238577, 119228, 357638, -134908, 39554, 428926, 131213, 252278, 101394, -91694, 252660, 15495, -164447, 114613, 130689, 91532, -11148, 107167, -33362, 409903, 172469, 137340, -1873, 75765, 91199, -37721, -5878, -100838, -37746, -355867, 16038, 94834, 68490, 70814, 313295, 142393, 11975, -45498, -68478, 53876, 234483, 88372, 179001, -23661, 262955, -182276, 75766, -155805, -5505, 516345, 165059, 209608, 151176, -117556, -119758, 62122, -68189, -156183, -43351, -31263, -116523, -109972, 26079]
12925h5755b2077I7384K71066A73986b8050A60931P742A1803J88842D9128f1989
12913F3007K43580L8305e5321j32924E9348a46969K3952B39881h9931k49636B24634
12901a29450j4623K3492D362R0476L22207A92445a31890j33566I0167K8540J2633
12890A31340a03217A5609J15603N0656d1700A18322a51792C66393a48340M3900
12880a04440j10744N5951A16891a24510a8804o1438C30314A2194N8014J26119
12870A96327b38585L3169A63661G5580a74771A33702J84657b6328B63431o4843
12860A98588I8668m3323i5383B64381A01889J7422b41283i2539A09870P7504a67948
12848A6900a60443k33067A70350k076f6320k123A54353a58432a5597B83268A41201
$$ y = [-85755, -22077, 97384, 368450, 173986, -28050, 160931, 168673, 11803, 200645, 49128, -61989, 63007, 306587, 344892, -55321, -188245, 59348, -146969, -123017, 239881, -89931, -339567, 224634, -129450, -144073, -120581, 4362, 94838, 417045, 192445, -131890, -265456, 90167, 118707, 131340, -103217, 15609, 131212, 181868, -41700, 118322, -151792, 366393, -148340, -104440, -215184, -159233, 116891, -124510, -18804, -80242, 330314, 12194, 70208, 196327, -238585, -205416, 163661, 75580, -174771, 133702, 318359, -26328, 263431, 198588, 98668, 55345, -95383, 264381, 101889, 119311, -241283, -92539, 109870, 187374, -167948, 16900, -160443, -393510, 170350, 168274, -66320, -68443, 154353, -158432, -15597, 283268, 141201]
12836A5700b84134D25658c11852c0183A31056J27465J05194i4344J3246A57336
12825B08252B8433J56784B5131a34375A17480C6137L23789F746O6271J1040a91700
12813B02813j2437o1760n6144b18542G5842b72606F8683L2067a53582A40827h4196
12801e7139G1340a34145A23420b72188H3118C3927a42370K6507e0549n0841A01906
12789a49666F1795c4353C3386R2754b38329d0836A39789c08665g8710A12715c1726
12777g601A15416a05980A14737R1079p5166n7636b08394b9179j57154A29907E2511
12765A55749o4265a4885B85593B7164N3259g2415k79015J38613g1151B24950J62460
12754C87410b32546B64435a00939D172N0011B2116b05417f0342o9816q897d9488
$$ y = [15700, -284134, 425658, -311852, -30183, 131056, 258521, 363715, -94344, -81098, 157336, 208252, 28433, 185217, 25131, -134375, 117480, 36137, 359926, 6746, 73017, 84057, -191700, 202813, 190376, 128616, 72472, -218542, 75842, -272606, 68683, 100750, -153582, 140827, -84196, -57139, 71340, -134145, 123420, -272188, 83118, 33927, -142370, -115863, -50549, -101390, 101906, -149666, 61795, -34353, 33386, 126140, -238329, -40836, 139789, -308665, -78710, 112715, -31726, -7601, 115416, -105980, 114737, 205816, 130650, 73014, -208394, -29179, -186333, 129907, 52511, 155749, 91484, -14885, 285593, 27164, 80423, -72415, -351430, -212817, -71151, 224950, 387410, -232546, 264435, -100939, 4172, 54183, 22116, -205417, -60342, -130158, -139055, -49488]
12742A94515K5234f8301B26472j4068a81211D07176j78302F5736J60178E2806
12731B89223A17154P8040o3065b58377a18181G0361L3100c72329e1688C8032a11818
12719b21258f6969E15822b16846G9294a63914c545E8880M25652a1409A91404e0724
12707C65781A35754O0169J35001o3774l778n308q0392m3132b5972r695r9542j29663
12695b64872R2259A99970c78037G7817b3638A47086c114A4989e0439E8148K20354
12684B78502A36666a15472B03128J69586H1088R2630K40192j71844E9924K78702
12674C38626h9770G1791a9134E04410A21132k1663k424b2503k37444A60662a2185
12662a53330D16786j83751R2399e3016l8017o4087A14619J36570j14218h2484
$$ y = [194515, 219749, -68301, 226472, 212404, -181211, 407176, 228874, 65736, 225914, 52806, 289223, 117154, 195194, 132129, -258377, -118181, 70361, 103461, -372329, -51688, 38032, -111818, -221258, -66969, 515822, -216846, 79294, -163914, -3545, 58880, 484532, -11409, 191404, -50724, 365781, 135754, 195923, 330924, 267150, 263372, 258064, 177672, 134540, -25972, -35667, -135209, -264872, -172613, 199970, -378037, 77817, -23638, 147086, -3114, 14989, -50439, 58148, 278502, 136666, -115472, 203128, 372714, 81088, 173718, 413910, 242066, 59924, 338626, -89770, 71791, -19134, 504410, 121132, 99469, 97045, -22503, -259947, 160662, -12185, -153330, 416786, 233035, 325434, -53016, -91033, -155120, 114619, 251189, 136971, -82484]
12651e6533A41708J00579K7757e3336j40542C09140I3677f7178k979G562e9815
12639b13078D37829A93847J5974H8761f0074K1419o0612B34721D5286L33448j48086
12628B30648H7769L19263j3393j68932B0913c0339B61399K005j11676C3537J50768
12617A84305a4756A19854J523a00309B09229a34032c6508j39895B85234f8754
12606A6266J09763D7084K2604e4388k97395A53543a57505d531j56677A07389l1311
12595G6078B6903P6282K62682r6410r3702k3222a8845r7012a2515k7392k41804
12584b81711J04385A5946b63697d3127A31597e3180I644J93233O5389b1031A25232
12572b02967D95849B03509K10140a69514C5432c2540C44248G6806f1217B57178
$$ y = [-56533, 141708, 242287, 270044, -53336, -193878, 309140, 93677, -67178, -70157, 7562, -59815, -213078, 437829, 193847, 209821, 88761, -60074, -38655, -99267, 234721, 45286, 378734, 230648, 87769, 407032, 393639, 224707, 20913, -30339, 261399, 263404, 151728, 33537, 184305, -14756, 119854, 121377, -100309, 209229, -134032, -36508, -176403, 285234, -68754, 16266, 126029, 47084, 69688, -54388, -351783, 153543, -157505, -4531, -161208, 107389, 76078, 26903, 103185, 365867, 269457, 175755, 152533, -18845, -115857, -12515, -39907, -281711, -177326, 15946, -263697, -43127, 131597, -53180, 9644, 202877, 268266, -21031, 125232, -202967, 495849, 203509, 413649, -169514, 35432, -32540, 344248, 76806, -61217, 257178]
12561C0246J0338N8154N5270A6040K37471a70697j19994B03358E7824E62g3573
12549h1566H7875N8230a53412j6969e2607A22685b58936B36572F7013d0820B6236
12537B9905L11417a63947A05087A9056d537B15283a99509C37a54550A40913K51501
12526C92414A06127b37412O9280A55360D03a76993I3986j0160h4388G3868d0017
12514B69687c12238E3591L06452C500a4855C53411K2130a22272B8210R8777J42500
12503B69487k8994a05546B78839k1482e5206o3267A17876g5117I714K6126a20562
12491D1404K6774e9821B3015O1850P9330a04804D0733h2252B41282I3641k2162
12480G1479K34124b07908c0194B05495i7875B64965J1467a27388A41453p0177
$$ y = [30246, 40584, 98738, 154008, 16040, 253511, -170697, -290691, 203358, 57824, 562, -73573, -81566, 87875, 146105, -153412, -170381, -52607, 122685, -258936, 236572, 67013, -40820, 26236, 29905, 341322, -163947, 105087, 19056, -4537, 215283, -199509, 337, -154550, 140913, 392414, 106127, -237412, -168132, 155360, 403, -176993, 93986, 83826, -84388, 73868, -40017, 269687, -312238, 53591, 360043, 3500, -14855, 353411, 375541, -122272, 28210, 126987, 269487, 240493, -105546, 278839, 257357, -55206, -118473, 117876, -75117, 9714, 35840, -120562, 41404, 68178, -59821, 23015, 84865, 164195, -104804, 40733, -82252, 241282, 93641, 71479, 305603, -207908, -30194, 205495, -97875, 264965, 276432, -127388, 141453, 71276]
12470G1276J7232M9141a32562B86309D501f8328E6495K58312C9427J7684K09081
12459B66192j22863d3549J8961j22343q189A37262a94097A58513a25963J5913
12449a10050A11215m7964L7596r611i9185B07472l3338a18968o6141N1558I5065
12437B9883j1895a83877c743k90686D0557e8031j18354I4950c8439A36705R0951
12426B27656a82469g5052C62287I836K02264a29800K6646j80255A66636n7422
12416A09214a24155A07681k2918k4409a4311r3626C03124g5995k9767B49141B2205
12404B55019a55286A65349j2543f6029A68636A1578J11743a98244j9189B57425
12393a45398B89557J803b3282C0922a45378E5668b09191A00157L25785a06237
$$ y = [71276, 88508, 137649, -132562, 286309, 4501, -68328, 56495, 314807, 39427, 57111, 266192, 143329, -43549, -24588, -146931, -155120, 137262, -194097, 158513, -125963, -110050, 111215, 63251, 100847, 91236, -99185, 207472, 174134, -118968, -185109, -133551, 95065, 29883, 17988, -183877, -3743, -294429, 40557, -58031, -176385, 94950, -38439, 136705, 227656, -182469, -75052, 362287, 9836, 212100, -129800, -103154, -283409, 166636, 109214, -124155, 107681, 84763, 60354, -14311, -107937, 303124, -75995, -105762, 249141, 22205, 255019, -155286, 165349, 152806, -66029, 168636, 11578, 123321, -198244, -217433, 257425, -145398, 289557, 291360, -23282, 30922, -145378, 55668, -209191, 100157, 425942, -106237]
12382a45501E9722a18001L3477A25856a22305H6619a20251d8855j08774M6679
12372a10950j07121A92164b70706a23260o08L0013k15870i2246B89218c08114
12361b33404A50459c4155A79909q2219b65860B81152j20645a14176A87741m0935
12351A46806i736B8298h5765A88521E7008c13126E1974J58561A4462K04795E1015
12339a08055M8953B5722r913K2304f5499A07249C8084c3698k669k3535C2932a69028
12326B56424d747j12250A63931a29278L7570E5705a14546B03478c8143j03990
12316a42133B3268K2954J75422a05406F2993Q3769b58658A7829b24613A0471L8909
12305D9380b07007R4302b4422A03729i8283d0632B42951e3713A34911B9667d6962
$$ y = [-145501, 59722, -118001, -84524, 125856, -122305, 86619, -120251, -48855, -157629, -110950, -218071, 192164, -270706, -123260, -123868, -93855, -309725, -92246, 289218, -308114, -233404, 150459, -34155, 179909, 97690, -265860, 281152, 160507, -114176, 187741, 146806, -9736, 28298, -85765, 188521, 57008, -313126, 51974, 210535, 14462, 219257, 51015, -108055, -59102, 25722, 15809, 38113, -65499, 107249, 38084, -33698, -36367, -59902, 32932, -169028, 256424, -4747, -116997, 163931, -129278, -91708, 55705, -114546, 203478, -38143, -142133, 23268, 46222, 221644, -105406, 62993, 146762, -258658, 17829, -224613, 10471, 49380, -207007, -112705, -24422, 103729, -98283, -40632, 242951, -53713, 134911, 29667, -46962]
12293B24690F9315b5219B51009C0567M284a5169j29037k4644A05334L57153A40977
12281D749a75241B54893A15135j1710N6356p0313J23918a18717D05874A15679
12270G058O139K97272C2647O9809l3130A9760J17952e1824B43586J38651a22485
12258A03242J96684K69936B8644d0674C24194C3222J85913a06659H3631N6049
12248A39680m9466h9919B58135m7856I1938e1279B23089c8506j14670A3K9338
12237B9351Q5804c63529B45294A07248B9366J29143N6087a50292A21594J85289
12227C06883B5363l028L67113A56588K28672K25884B68727J17550M2228H1349
12216f3500I655L23786q9353n3465a2064C95708a72650B12852f7293D47376A78850
$$ y = [224690, 69315, -25219, 251009, 30567, 34851, -15169, -144206, -168850, 105334, 462487, 140977, 4749, -175241, 254893, 115135, 103425, 159781, 89468, 213386, -118717, 405874, 115679, 7058, 13197, 310469, 32647, 102456, 69326, 19760, 137712, -51824, 243586, 382237, -122485, 103242, 299926, 569862, 28644, -40674, 324194, 33222, 219135, -106659, 83631, 139680, 90214, -89919, 258135, 210279, 91938, -51279, 223089, -38506, -153176, 13, 29351, 115155, -363529, 245294, 107248, 29366, 158509, 214596, -150292, 121594, 306883, 25363, 22335, 389448, 156588, 385260, 611144, 268727, 386277, 428505, 81349, -63500, 9655, 333441, 244088, 190623, -12064, 395708, -172650, 212852, -67293, 447376, 178850]
12204a63758A4067J66106J59344A31492K49725G5172j3450J60748o7646L27474
12194D82298a69140B94172Q3662N5638c4231I5337a77899B07867c8678B0109J0653
12183C0762b34728A99041a00810A33324K8075j9533M1268f5462B36163b1080G4971
12171B15645c3935A92214J11567I6055L1154K64435E1061a1286r1752B34914j05177
12160A29737b8357A85427a05034j79872a34930c2383B00158a04687A49716a2779
12149a50261A93081R6187i3578c1424A94997j5767C2852J40109l4449h4200B57474
12137A03478L88955A6519P4072J87745P034c91907A11394J53928j27757N134a90889
12125A2393O3747Q9758c7563G8347K03153I9045a55222A42675e370B83319i4334
$$ y = [-163758, 14067, 180173, 339517, 131492, 381217, 75172, 61722, 222470, 154824, 482298, -169140, 294172, 377834, 433472, -34231, 95337, -177899, 207867, -38678, 20109, 30762, -234728, 199041, -100810, 133324, 161399, 141866, 183134, -65462, 236163, -21080, 74971, 215645, -33935, 192214, 303781, 96055, 127209, 391644, 51061, -11286, -103038, 234914, 129737, -28357, 185427, -105034, -284906, -134930, -32383, 200158, -104687, 149716, -12779, -150261, 193081, 289268, -93578, -31424, 194997, 179230, 32852, 172961, 138512, -84200, 257474, 103478, 492433, 16519, 90591, 278336, 285370, -391907, 111394, 265322, 137565, 142699, -190889, 12393, 76140, 165898, -37563, 78347, 281500, 99045, -155222, 142675, -5370, 283319, -94334]
12113A32564d5527A4208c554G4883b7408E4769P5100D9705a04223D9135k770J78331
12101B24696d7444l64450a31535k28702B766K87595j20091h3083r6108j13213
12091b92404D616R3842J37409J09575g8259B3268K27090F0089a1247q0396q1910
12080a73553B70166o4199E2217K7492J258L16035L61691R57196n89814l94419
12070G31656f132k25855A52392p3580J50739a72752f7641a5888B0122J72100a24423
12058G8218c2018k7993l20877b090j86720C8556K09128o0955a1313A7380b98505
12046C0885a2089N125B09054A5536L4654A8746J40800l4513g669m4465A19577
12034g7273l4965o8354E6038b0542j73597A94515g612j28186G1063c47815d6336
$$ y = [132564, -45527, 14208, -3554, 74883, -27408, 54769, 129869, 49705, -104223, 49135, 46365, 224696, -47444, -411894, -131535, -360237, 2766, 290361, 170270, -83083, -179191, -292404, 4616, 98458, 235867, 345442, -78259, 23268, 250358, 60089, -11247, -91643, -173553, 270166, 205967, 52217, 79709, 80967, 397002, 758693, 1715889, 1126075, 731656, -6132, -231987, 152392, 78812, 229551, -172752, -67641, -15888, 20122, 192222, -124423, 78218, -32018, -60011, -380888, -2090, -188810, 38556, 247684, 186729, -11313, 17380, -298505, 30885, -12089, -6964, 209054, 15536, 50190, 18746, 159546, 125033, -7669, -52134, 119577, -77273, -112238, -180592, 56038, -20542, -194139, 194515, -7612, -135798, 71063, -347815, -46336]
12022C2039c53184A0024m099b1706B89540m9246F1287a51352O2283H7454a48001
12010A51995h5482G3002a7943B65250b45398E1244M393a3300A76057L8449q5083
11999A29423a02033D5756J35392c1525k26175R2937b6326C5583i6313m3516j81601
11988c21430D9047M5192a01953H0380a3653j71940k07415a542n9845a2151B33936
11976A15553b2589l5505C4821e331o1063r3875H9693c29372D6243b00375A07107
11964D86183C5355d9445B41282q4883c2263n5547j87357j65309a9428B87354B1730
11952I0665c36028F380e114B82930h3709A90990b77005L7759H0360e1229l4463
11941h5692k0047A48315a4427G8407B2437g9445a1316G2923A7955c4774k65994
$$ y = [32039, -353184, 10024, 5925, -21706, 289540, 240294, 61287, -151352, -89069, 87454, -148001, 151995, -85482, 73002, -17943, 265250, -245398, 51244, 55637, -13300, 176057, 214506, 129423, -102033, 45756, 181148, -31525, -257700, -164763, -26326, 35583, -96313, -139829, -321430, 49047, 94239, -101953, 80380, -13653, -185593, -393008, -1542, -61387, -12151, 233936, 115553, -22589, -58094, 34821, -5331, -66394, -160269, 89693, -329372, 46243, -200375, 107107, 486183, 35355, -49445, 241282, 156399, -32263, -87810, -275167, -440476, -19428, 287354, 21730, 90665, -336028, 6380, -5114, 282930, -83709, 190990, -277005, -239246, 80360, -51229, -85692, -105739, 148315, -14427, 78407, 22437, -79445, -11316, 72923, 17955, -34774, -300768]
11930c00768h9699B10098D548L3347K30496g5038D17589H1082L6600l8990d1710
11918a53258A50186n8046e7844C09453c02634A84812F782i0238j19528B63829
11907A54471c55276c5159l18759E4755f9275r1821A17984Q1184a17753A35212
11896A9826H054K53282B8073e0808j48817r6982C0157a17945A3116N4712g3939
11884a41242A85885a07805A7875M32343e2632n29905A08161K11666c93291A73350
11873B99202F741b00373A29589c10459L2561H6778a41266L5393j46100A27004
11862b17691k3000A48984B2298a31336c8606B61653A15587m3316f4112j02307
11852a66419m5554E44b74956i9741B75633j33212D6136J51034q9068b42037P2548
$$ y = [-300768, -89699, 210098, 4548, 37895, 268391, -75038, 417589, 81082, 117682, 78692, -41710, -153258, 150186, 92140, -57844, 309453, -302634, 184812, 6782, -90238, -209766, 263829, 154471, -355276, -35159, -353918, 54755, -69275, -161096, 117984, 199168, -117753, 135212, 19826, 8054, 261336, 28073, -50808, -199625, -296607, 30157, -117945, 13116, 67828, -73939, -141242, 185885, -107805, 17875, 450218, -52632, -582537, 108161, 319827, -393291, 173350, 299202, 6741, -200373, 129589, -310459, -277898, 86778, -141266, -105873, -251973, 127004, -217691, -240691, 148984, 22298, -131336, -38606, 261653, 115587, 72271, -64112, -166419, -211973, 544, -274956, -99741, 275633, 142421, 46136, 197170, 108102, -242037, -169489]
11841a69489M255E6708J31457b68118B44992p9114a82524j2643f595j85009A11058
11829E252R3681N8637d53711I3329K92242j57746j06627b98990K7580E1174f1762
11817a08360j11546a05018D638a6913A44523d9963b2526H6182b77966a1737B23234
11805G5263P2249f8814b8975m412j26161B28041a75054D0397b06675B3114a75360
11793B90119G7106f8963j29568i7498n9439E6804K07012a9464n5015c916j29672
11782a33588N2708B0236a32576j9986M6515A24216J0525E9210J4373a38450H9507
11770a67917m89841I2312a12344c9256B21846f9939K9226A0036Q6066b9123j92577
11759b21700K0992B8519M717a17641B39198j08140a10615A28842a19618j67659
$$ y = [-169489, -165234, 56708, 188165, -268118, 244992, 165878, -182524, -195167, -6595, -191604, 111058, 5252, 98933, 157570, -453711, 93329, 385571, 227825, 121198, -298990, -271410, 51174, -61762, -108360, -219906, -105018, 4638, -16913, 144523, -49963, -22526, 86182, -277966, -11737, 223234, 75263, 147512, -68814, -28975, -33387, -159548, 228041, -175054, 40397, -206675, 23114, -175360, 290119, 77106, -68963, -198531, -97498, -156937, 56804, 263816, -19464, -74479, -3916, -133588, -80880, 20236, -132576, -152562, -106047, 124216, 134741, 59210, 73583, -138450, 89507, -167917, -657758, 92312, -112344, -39256, 221846, -69939, -40713, 10036, 96102, -29123, -221700, -200708, 28519, 33236, -117641, 239198, 131058, -110615, 128842, -119618, -287277]
11749b87277m625O2201b8942q4482F4347g4088K7333q3798r724L2287A3821a21612
11736A64661d56363R6698A67334b92532B08746L7174a60756A6879h0888k3877
11726a04765A61516l4491g0439R418A15408a07575F2620J46978d7124C9049b60838
11714A9734J91275D8491J53932D1242O7599J7967l2816a52545M3531A96152O4667
11703B60819E7589J11073o7119M6127o5357f084B79762m6487g2644C8854j6119
11692B2735J52675d2183g958r7431A05920a7716k424G2030a12021j18824J11874
11681a18971A28652m7851J69973M474c420E6889b9561B08592A00373J34181a45654
11669f2396D2201K33036f1885D79776B20764a16129B24816b82378B9241J33831
$$ y = [-287277, -291902, -229701, -28942, -113424, 64347, -74088, -46755, -130553, -140277, -107990, 13821, -121612, 164661, -456363, -359665, 167334, -292532, 208746, 245920, -160756, 16879, -80888, -104765, 161516, 127025, -70439, -61021, 115408, -107575, 62620, 209598, -47124, 39049, -260838, 19734, 211009, 48491, 202423, 41242, 108841, 126808, 93992, -152545, -109014, 196152, 260819, 57589, 168662, 101543, 147670, 82313, -6084, 279762, 233275, -72644, 38854, 22735, 175410, -42183, -7958, -105389, 105920, -17716, -20140, 72030, -112021, -230845, -118971, 128652, 80801, 250774, 255248, -3420, 56889, -29561, 208592, 100373, 234554, -145654, -62396, 42201, 275237, -61885, 479776, 220764, -116129, 224816, -282378, 29241, 163072]
11659A63072c7106C59800j56734h9872B23495f2150B25692r7288E6838a97420
11648a19615B70624h1840j04890G1266J9810M7414k204l3757c28438C09139r6107
11637B13032a27282l5926e2787m7A30988n1732e097B18356J41873j05922i6789
11625A95760a7367L076F9695P9035B3556D024N86955a99582g6117R325A64054
11613E8921N4612l2316g3843D0705j8739P8115J00477r2123J1957e1414B08740
11601G197a27187H2671K22598I8096b75079A41048E7206J70359B9784I469L9373
11590D8842J7626b10804B35339C5242J62755G382M45117A92562P6033j21864L3926
11579A80657a39713E3834K62907a00660C8691A4432L5645K27584o0121H7451M3997
$$ y = [163072, -37106, 359800, 203066, -89872, 223495, -62150, 225692, 128404, 56838, -197420, -119615, 270624, -81840, -186730, 71266, 91076, 138490, 136286, 102529, -328438, 309139, 213032, -127282, -163208, -52787, -52834, 130988, 79256, -5097, 218356, 360229, 254307, -96789, 195760, -17367, -14291, 69695, 148730, 23556, 4024, 590979, -199582, -76117, -66792, 164054, 58921, 113533, 81217, -73843, 40705, 21966, 100081, 200558, 108435, 120392, -51414, 208740, 7197, -127187, 82671, 305269, 98096, -275079, 141048, 57206, 227565, 29784, 9469, 48842, 66468, -210804, 235339, 35242, 197997, 7382, 452499, 192562, 268595, 146731, 180657, -139713, 53834, 316741, -100660, 38691, 14432, 50077, 277661, 217540, 87451, 131448]
11568A31448J39665k6485A1922b9877A65603D1233b5477C95831j40726A26529
11557C1365J50140O9641a98076A11914K05539M1538a16836A55093p684c9018j9652
11546e8670n2781D34840A12507A4163K41265E1407K55133j13246f8758A23153
11535C1195J93727P9227H9515J08734a76448I3281J33900h958G2087J59764D5098
11523A28127l855G127f8702C7859d2281j1420B41525o4047n0521J9472K81185
11512D27614b06713H1115J14245G7797K6451k3315b8514B13258G967c12018h5710
11500C52417a47901B43856M0101a98672A56679k2704L36892A57166B2831L61237
11490C84068a0049I2270L4409L0386a0814A79951C7608J59209J48538p9266p8241
$$ y = [131448, 271113, 244628, 11922, -29877, 165603, 41233, -25477, 395831, 255105, 126529, 31365, 181505, 251146, -198076, 111914, 317453, 358991, -116836, 155093, 147409, -39018, -58670, -111451, 434840, 112507, 14163, 255428, 51407, 306540, 193294, -68758, 123153, 31195, 224922, 304149, 89515, 198249, -176448, 93281, 227181, -8958, 72087, 231851, 45098, 128127, 124272, 7127, -68702, 37859, -42281, -53701, 241525, 177478, 126957, 146429, 427614, -206713, 81115, 195360, 77797, 104248, 80933, -28514, 213258, 7967, -312018, -85710, 352417, -147901, 243856, 283957, -198672, 156679, 133975, 470867, 157166, 22831, 384068, -10049, 92270, 126679, 157065, -10814, 179951, 37608, 196817, 345355, 266089, 187848]
11479A87848c7429d096F63930F4277j219E188L08051F5783J19815f7771j68226
11468b35997A70934M1278L2490b7205D8989J69292J86752c2619H6362r71a63753
11456a52557A88730e595I8934d1439C80432e443B85766l4661o8702o101n5295
11445A21007E6583K81351A49624o9287k6525P6206L43873E2413e9913a7598q5015
11434a02613j00440C9260g1548B36090r0594c02963E7259j7549N6318J18782b49792
11422D01606e7026r660A82192G773Q6503L31943j86739d12025f3276l73520g6715
11410c3910C32181a09348C3092K0438h3812B06200r4982l0711c59840B66135G5027
11398a99499A32763K53427A14771h8856j92673a9564A39680B9702q379a38780
$$ y = [187848, -37429, -4096, 663930, 64277, 63058, 5188, 313239, 65783, 185598, -67771, -235997, 170934, 212212, 244702, -27205, 48989, 218281, 405033, -32619, 86362, 85391, -163753, -152557, 188730, -5595, 98934, -41439, 380432, -5443, 285766, 251105, 182403, 176302, 121007, 56583, 337934, 149624, 80337, 53812, 130018, 473891, 52413, -59913, -17598, -102613, -203053, 39260, -71548, 236090, 145496, -302963, 57259, 39710, 96028, 214810, -249792, 401606, -57026, -66686, 182192, 7773, 94276, 426219, 239480, -412025, -63276, -436796, -76715, -33910, 332181, -109348, 33092, 53530, -83812, 206200, 111218, 80507, -359840, 266135, 75027, -199499, 132763, 386190, 114771, -88856, -281529, -19564, 139680, 29702, 21323, -138780]
11387a81006Q1971m24297A36138d289C9382b1901p1056k02583G7111b14501A00180
11375A72993M0489d1468C77261b8609A72745C3638L8926d6099A86227f1949j20227
11364a82176D8825a72823A01758a94291A00358Q4111m3348a15262g511m0056B1521
11352a11908J723j22242B19979H3924f7826K8235A71107C0920K74020a69940G6624
11340B11168f398j57053k7064d2719j66084R2579H6683d6042n4388D5205a65787
11328b23841B02978a75303l9815E1702L0370Q9855D2743p92a99447B20716a30901
11316I0105f280D39083a66688F757a53067A60801a70104e4979j17677e3261j16839
11305a70100F5385a72428D0621b02958H7582K9642b736j33735D7090L8487J28814
$$ y = [-181006, -99035, -523332, 136138, -4289, 39382, -21901, -92957, -295540, 77111, -214501, 100180, 172993, 213482, -41468, 377261, -28609, 172745, 33638, 72564, -46099, 186227, -61949, -182176, 48825, -172823, 101758, -194291, 100358, 184469, 141121, -115262, -7511, -47567, 21521, -111908, -110185, -232427, 219979, 83924, -67826, -39591, 171107, 30920, 304940, -169940, 76624, 211168, -6398, -163451, -190515, -42719, -208803, -116224, 86683, -46042, -100430, 45205, -165787, -223841, 202978, -175303, -215118, 51702, 82072, 171927, 42743, 41951, -199447, 220716, -130901, 90105, -6280, 439083, -166688, 6757, -153067, 160801, -170104, -54979, -172656, -53261, -170100, 65385, -172428, 40621, -202958, 87582, 117224, -2736, -136471, 47090, 85577, 214391]
11294B14391b62684F3032J51244D9113b4515n45815a28169j65135J11476B9702
11283e5370k05880A48569d2053k04412D938c01301J05965G1048B3880b45456A622
11271a82506p2067A5603e6078D399a33215B25558h6279E1599g6099B9889g3512
11259A91350F333K7446J29812B5101b84374C599a06386j57473A94823a73626h458
11247g4878q0032k3736k64916a08817l6171o4181C63376a65034o5070A92600a30489
11235c6825l7600c768k46707f0634F8251J08020E431J17195g2157D6418J45085
11224A91503I116b38023o78C30549A25725e6579J8325k55490D5314a95530d5895
11212b39651C9014J8281i1210j67170l0689a6514p7343l1956B67203E3802a76381
$$ y = [214391, -262684, 63032, 214276, 49113, -24515, -570330, -128169, -293304, -181828, 29702, -55370, -261250, 148569, -42053, -246465, 4938, -301301, -195336, 71048, 23880, -245456, 1622, -182506, -254573, 15603, -56078, 4399, -133215, 225558, -86279, 51599, -76099, 29889, -73512, 191350, 6333, 33779, 163591, 25101, -284374, 3599, -106386, -263859, 194823, -173626, -8458, -74878, -154910, -178646, -443562, -108817, -144988, -209169, 363376, -165034, -230104, 192600, -130489, -36825, -74425, -3768, -250475, -60634, 68251, 176271, 5431, 122626, -72157, 46418, 191503, 9116, -238023, -238701, 330549, 125725, -56579, -38254, -293744, 45314, -195530, -45895, -239651, 39014, 57295, -91210, -258380, -289069, -16514, -93857, -125813, 267203, 53802, -176381]
11200a79614e5184B00055a79270j63919J37208A25066J31000a06119B9738a74231
11189b69032J16333m7090M548l7953E8098a31837M4966C75313G8344F461K2395
11178B8856R4263c13122R1510A12292b23070f8438m9684B6274R1047R7018a06778
11166C3067c92305A71327j0743i3420k02521A8881K49327l4631a04205B80244
11155b33506A95271B0508b35937A84721E2390J90820d5077m0907b4164A7689b2278
11143I4310K43004m3123a80155f5542F0280n629O991J17922c2320A24734l0493
11132I4241a47228E8310K5464p721a0865C6245a02923j56959G5684J70508a52728
11120E2481J70278J39741j42292a46064C8313b55304D001N7517P8631J11911b41198
$$ y = [-179614, -55184, 200055, -179270, -343189, -205981, 125066, 256066, -106119, 29738, -174231, -269032, -152699, -199789, -195241, -233194, 58098, -131837, -86871, 375313, 78344, 6461, 28856, 123119, -313122, -221612, 112292, -223070, -68438, -118122, 26274, 117321, 214339, -106778, 33067, -392305, 171327, 160584, -93420, -295941, 18881, 268208, 233577, -104205, 280244, -233506, 195271, 20508, -235937, 184721, 52390, 243210, -45077, -85984, -24164, 17689, -22278, 94310, 337314, 294191, -180155, -65542, 60280, 54651, 61642, 179564, -32320, 124734, 94241, -147228, 58310, 83774, 76053, -10865, 36245, -102923, -259882, 75684, 246192, -152728, 52481, 222759, 362500, 220208, -146064, 38313, -255304, 4001, 61518, 140149, 252060, -241198]
11108A8961Q2381J27499L2220r2740J9186q1525a7611B99056d9777A77559D643
11096B01419J40239m4447k4279J54764A36545J3778d0179B58545r8586f7582B07950
11084D91253b5635b698D52959A1755L33286j20298J69873r905j69166K1266J7262
11073B54073A17790K65815A13184M97179k83514k0571j051J13172J48368L4573
11063F01340k42216j45958M80258j25238B48202M80239C03252K78269R4488Q7429
11053G63438R3649l13405J18031J14274o2812l7859j76053J89191j95137M27168
11043I20485m14349p2267K73239Q9164k2004j51183K06027J22064j55293k13788
11033E82095J48557k0347l4208R9206j76027M18549m4969j64549Q0699j98157
$$ y = [18961, 101342, 228841, 261061, 168321, 187507, 105982, -17611, 299056, -49777, 177559, 4643, 201419, 341658, 297211, 272932, 427696, 136545, 150323, -40179, 258545, 159959, -67582, 207950, 491253, -25635, -2698, 452959, 11755, 345041, 224743, 394616, 384711, 215545, 236811, 254073, 117790, 383605, 113184, 610363, 326849, 306278, 305227, 418399, 566767, 601340, 359124, 213166, 693424, 568186, 248202, 728441, 303252, 581521, 676009, 763438, 857087, 543682, 661713, 775987, 713175, 675316, 499263, 688454, 493317, 920485, 506136, 433869, 707108, 796272, 774268, 623085, 829112, 951176, 795883, 582095, 730652, 710305, 676097, 775303, 599276, 1017825, 972856, 808307, 889006, 690849]
11023F90849J22165j16413o7384k77796L39712l40369J96804k14737J34244N2544
11013E19619K08441M0180k11283k4830r5783J51750Q3875L6793K36752o7201j08008
11002G70305o3966O0641J6212l62984L66053L91594n24970K25417J20788B89180
10991H62133C97644M48627m6826l525j43468L10408K26368k86383J25577L07741
10981A336163O6927k61505K67897K26358k67535N56185M7187P42226o844M05747
10971C112806j90150k3829R3755n49066k14281P7905l31317j07484P6847k46411
10961A698775l48744M13277J39998l47189M84692k73721q0780p7508n01153J73499
10951A281146j00794k41449j11938j1270j86850R1116B45681Q7648o6880D0165
$$ y = [690849, 813014, 696601, 629217, 351421, 691133, 350764, 547568, 332831, 467075, 519619, 728060, 768240, 556957, 532127, 436344, 588094, 671969, 708762, 945514, 878313, 770305, 706339, 766980, 783192, 420208, 786261, 1177855, 652885, 878302, 999090, 289180, 862133, 397644, 846271, 799445, 795920, 652452, 962860, 1189228, 902845, 1028422, 1336163, 1403090, 1141585, 1409482, 1635840, 1368305, 1924490, 1971677, 2713903, 2707059, 3112806, 2922656, 2898827, 2992582, 2443516, 2229235, 2307140, 1975823, 1868339, 1945186, 1698775, 1350031, 1763308, 1903306, 1556117, 2040809, 1767088, 1686308, 1608800, 1107647, 1281146, 1180352, 938903, 826965, 815695, 628845, 719961, 245681, 333329, 266449, 40165]
10940A26011J92022k8511R8891r3348R930A30020a18454a0185E9385d278j89848
10929a94126c8476E03530A98467a86817b9196F428Q8650J36496N161a17584B64605
10917d1862A86627C2151j5417a76815p6244A87924g1756k27425J11024E5479a70732
10905B75027A17245b77852A14756c79243J69210B2364g4135A92146C6576d28946
10894A47344b4726A09238k9952a17910H2881a06483k56351D37087e8809J671A17288
10882A746a35470n3031C50309b1259j05018B25028c84203B87408a00368j24850
10872b25218C88998I963J22455b2804r0706N5712J0160A63524k7925b0219A54748
10860A61299j2728C3310J15811a2885k16851J04719e8399D8757i0078g912B03117
$$ y = [126011, 318033, 289522, 388413, 295065, 304995, 130020, -118454, -10185, 59385, -4278, -194126, -38476, 503530, 198467, -186817, -29196, 6428, 95078, 231574, 236735, -117584, 264605, -41862, 186627, 32151, 16734, -176815, -253059, 187924, -71756, -299181, -188157, 55479, -170732, 275027, 117245, -277852, 114756, -379243, -210033, 22364, -74135, 192146, 36576, -428946, 147344, -24726, 109238, 79286, -117910, 82881, -106483, -362834, 437087, -58809, -57138, 117288, 1746, -135470, -188501, 350309, -21259, -126277, 225028, -384203, 287408, -100368, -225218, 388998, 9963, 132418, -22804, -113510, -57798, -47638, 163524, 135599, -20219, 154748, 161299, 148571, 33310, 149121, -12885, -229736, -125017, -58399, 48757, -90078, -7912, 203117]
10848b4955H9214K22040M9534A8209e7441A38883Q3580b2487p804b608C184J88599
10836A91783b18218A64006i7971E6906o580d56610B28985E2158b27115c1284H2867
10824F5116f0589F8736J42844g9988B10190F0214O0266J04242b51984A71618n9722
10813A11896J86872C5221E317b28277G4010A4046b1630B38570d875k795k44493
10802b52163g9175L9162j90811A68036B351J1311a5134H9852K0091a94931E7960
10790E6723b22118A22118N4853a9977j46827g5234p8446n3163h9560B86767b66837
10778b33545a5661j80981A12971j3876B8308c2142n5493A08867a5546j08800A61619
10766c65470N7256A90910a10292E9965b46608c7794k75327J23740k8865A55450
$$ y = [-24955, 89214, 311254, 360788, 18209, -57441, 138883, 222463, -22487, -30291, -2608, 3184, 191783, -218218, 164006, -97971, 56906, 50326, -456610, 228985, 52158, -227115, -31284, 82867, 65116, -60589, 68736, 211580, -79988, 210190, 60214, 120480, 224722, -251984, 171618, 111896, 298768, 35221, 5317, -228277, 74010, 14046, -21630, 238570, -4875, -7670, -252163, -79175, -40013, -230824, 168036, 2351, 13662, -15134, 89852, 109943, -194931, 57960, 56723, -222118, 122118, 176971, -19977, -166804, -75234, -153680, -206843, -89560, 286767, -266837, -233545, -15661, -196642, 112971, 99095, 28308, -32142, -87635, 108867, -15546, -124346, 161619, -365470, -308214, 190910, -110292, 59965, -246608, -37794, -313121, -189381, -218246, 155450]
10755a07730j19720K5201j03739a00844k6965m8605I813J89499K23606a39015
10744B26645L2601b8192j3314J4260p5722B69088a56781k28782e46j14108l8272
10733a52926j01473C10072b3365F4248L8763H254b50626E7584a74906N6517L6044
10722h2345A61461a48578j73787D7974Q6210a93382i407j29503K0880l7029B07127
10710a54930L4821G2633c82440B4506d5550A38322C9143J62013K3544a29631L1658
10699i7973A48696a14166B4419c0375J1401C7958a04848A35478a92531K8536A25036
10687c68608R7078C4174d2269j13665q7791K7554e2907I9239b16698A12265f7387
10675G4638d1440p8364r1953C03240c2674I0397c32114g5450A55686a99116j35954
$$ y = [-107730, -227450, -202249, -305988, -100844, -127809, -176414, 9813, 199312, 422918, -139015, 226645, 259246, -28192, -41506, -27246, -102968, 269088, -156781, -385563, -546, -114654, -152926, -254399, 310072, -23365, 64248, 103011, 8254, -250626, 57584, -174906, -118389, -82345, 161461, -148578, -322365, 47974, 134184, -193382, -9407, -138910, -118030, -155059, 207127, -154930, -120109, 72633, -382440, 24506, -45550, 138322, 39143, 201156, 224700, -129631, -97973, 148696, -114166, 24419, -30375, -18974, 37958, -104848, 135478, -192531, -163995, 125036, -368608, -271530, 34174, -42269, -155934, -243725, -216171, -52907, 99239, -216698, 112265, -67387, 74638, -41440, -119804, -211757, 303240, -32674, 90397, -332114, -75450, 155686, -199116, -335070]
10664c35070a10654d4579n7365o4292A15707l122a9581l5150B35959c16757A70499
10652B62327b23820H6519N2189b8424r9129j66335J02356M1042k8347O0668b8131
10640A91273a81515O8702H2110d05334J9375A20955n8443a2521A47350b92972
10629B0656q912b72603J12605A81248K3296k1477j5743A9407a47833D6085b11839
10617A5912C806a11423o4210N0355B68666I1040a38200a0747l03373B9628g7420
10605C7949b93815B1711b5847L973j26051r4188h8504B4408Q5258c18258B392
10593A2779J39961f5793r7840B43260b35709A93560a81964b794k55649B0224J64608
10582A84832E3835J01294a16952d3966j11610F6764a39392m6539l16293B31146
$$ y = [-335070, -110654, -44579, -101944, -166236, 115707, 112585, -19581, -54731, 235959, -316757, 170499, 262327, -223820, 86519, 138708, -28424, -127553, -293888, -191532, -150490, -178837, -118169, -28131, 191273, -181515, -112813, 82110, -405334, -385959, 120955, 62512, -12521, 147350, -292972, 20656, 11744, -272603, -159998, 181248, 204544, 183067, 167324, 19407, -147833, 46085, -211839, 15912, 3806, -111423, -175633, -125278, 268666, 91040, -138200, -10747, -314120, 29628, -77420, 37949, -293815, 21711, -25847, -21874, -147925, -242113, -88504, 24408, 109666, -318258, 2392, 12779, 152740, -65793, -163633, 243260, -235709, 193560, -181964, -2794, -258443, 20224, 184832, 53835, 155129, -116952, -43966, -155576, 66764, -139392, -185931, -502224, 231146]
10571a14051G6219a60125P8141A11646b20898h5462J9761j56591R9921F1211e3404
10559a48784k06815J09560a16789F4769a09485j7660a9322C02728E0900P1907
10549A22807d1809j31866k27205c4440j60278a8120H1075R3909G1199j4315c82450
10537E9729J11207n1276Q4653b84359e1959E4523A3848J17613I749h1475k53823
10526c35298B0220e8530A61797a3770B62773a51322A28339b26293b6884o0574
10516h7458b1169j86153F2099d622B1964L30175c61336F0901i7376A20983E5307
10504a606k0513q4334B06905D0169a85545f3980j32616G7002d36284a9654l7377
10493e7031E1959a01937o7764B90664b22896D819b73235N4953A19204f5140A82999
$$ y = [-114051, 76219, -160125, -81984, 111646, -220898, -85462, -65701, -222292, -122371, 61211, -53404, -148784, -355599, -246039, -116789, 64769, -109485, -127145, -19322, 302728, 50900, 122807, -41809, -173675, -400880, -34440, -194718, -18120, 81075, 174984, 71199, 56884, -382450, 59729, 170936, 119660, 204313, -284359, -51959, 54523, 13848, 131461, 9749, -81475, -335298, 20220, -58530, 161797, -13770, 262773, -151322, 128339, -226293, -26884, -87458, -21169, -207322, 62099, -4622, 21964, 352139, -361336, 60901, -97376, 120983, 55307, -1606, -22119, -106453, 206905, 40169, -185545, -63980, -196596, 77002, -436284, -19654, -57031, 51959, -101937, -169701, 290664, -222896, 4819, -273235, -218282, 119204, -65140, 182999]
10481D11217A47797R3772K79305l7206a07927G2544a5045P163k6908j43827H7651
10469i2993C54757A75517J40109e7819A74141D2939i404j23093L3728B37903c10625
10457a11294M8617C366O2490h8837E0992d8442A20408a27945j34374J25731A09452
10445A02214a55697L2576l2884A54244b0586B2617N5878g4223D4165P9061b76494
10433i116F8262O1396d08274f8167B12419g1245D0180c1965j26094D8084a05066
10421I9811O1810b1508j25580L6094a8806E2554J19561b8382A26978f1142j67676
10410b28818I6460L6509k6547c94127B52853a8151C05759b06097N0770B35601
10399D7526P6083a51553L4422k174E7541i812C25188J0494o3650j11718o0613
$$ y = [411217, 147797, 241569, 520874, 483668, -107927, 72544, -15045, -7882, -34790, -178617, 87651, -92993, 354757, 175517, 315626, -57819, 174141, 42939, -9404, -132497, -98769, 237903, -310625, -111294, -62677, 3366, 65856, -88837, 50992, -48442, 120408, -127945, -262319, -136588, 109452, 102214, -155697, -123121, -156005, 154244, -20586, 22617, 78495, -74223, 44165, 123226, -276494, -9116, 68262, 129658, -408274, -68167, 212419, -71245, 40180, -31965, -158059, 48084, -105066, 99811, 161621, -21508, -147088, -110994, -18806, 52554, 172115, -28382, 126978, -61142, -228818, 96460, 132969, 106422, -394127, 252853, -18151, 305759, -206097, -155327, 235601, 47526, 123609, -151553, -117131, -119305, 57541, -9812, 325188, 335682, 272032, 160314, 99701]
10388I9701a8660B82756A22492l9010J47220L73718D4979P5944I420h4412A28886
10376E5958a29738C75030P1633E0976M80855A18778L59551n6890A73362K65014
10366D38376L13112A83703L89772H7724J29357J31708I6789k8534K21069m9245
10356B40079l8451j4418K2407K894J05723Q4133L49119k40887j4412k8739j32434
10345C35014O536j52592r3134J89477i7135a375D65888A95124E491K63396H2502
10333I8863i1411l2735A73659b3422B37818b26125B21131p2103k3002Q4497K42257
10322D52780C0735L45414j40494P4625i227C5368d5577A17892J28693i350G5942
10310c40734I0835j7138D385a9371A71787C3976b52405O7092M3863k35455a30460
$$ y = [99701, -18660, 282756, 122492, 83482, 230702, 604420, 44979, 120923, 9420, -84412, 128886, 55958, -129738, 375030, 446663, 50976, 531831, 118778, 478329, 421439, 173362, 438376, 751488, 183703, 573475, 87724, 217081, 348789, 96789, 68255, 289324, 240079, 201628, 187210, 209617, 212511, 318234, 402367, 751486, 510599, 496187, 467448, 335014, 341550, 188958, 95824, 285301, -97135, -1375, 465888, 195124, 5491, 268887, 82502, 98863, -91411, -124146, 173659, -23422, 237818, -226125, 221131, 149028, 126026, 210523, 452780, 30735, 376149, 235655, 310280, -9227, 35368, -45577, 117892, 246585, -9350, 75942, -340734, 90835, 73697, 4385, -19371, 171787, 33976, -252405, -185313, -141450, -376905, -130460]
10298H6088a9838A30616J7942a57201c5445J4459j64667o8591A18786h169E4202
10286c2364H6857l8411J24371c51266F2955a7766E572g5642D882e6866F3128d49349
10273a00675G6078b53510B33656k8460G2719i8405A75165a95494C61094a59885
10262I6226B6993K63138q5442K13629j29852J39913J66420A71773n422J27704
10252B94055H8215i9274D5176K51652n8755a29612N7894C0747a45515j1328j60448
10241c17291D2016a46131r1489A87190L56763A62530o8675l3951a69087A95449
10230C25a9329E286J66691b50460N6613j19428a3241A8676K77875j3586N4283
10219C37248A20077b46354H9483a778l13021a32467j35387h8999j57227a07956
$$ y = [86088, -19838, 130616, 148558, -157201, -35445, -20986, -185653, -254244, 118786, -8169, 54202, -32364, 86857, 48446, 172817, -351266, 62955, -17766, 5572, -75642, 4882, -56866, 63128, -449349, -100675, 76078, -253510, 233656, 205196, 72719, -98405, 175165, -195494, 361094, -159885, 96226, 26993, 290131, 204689, 418318, 288466, 428379, 594799, 171773, 166351, 294055, 88215, -99274, 45176, 296828, 238073, -129612, -71718, 30747, -145515, -156843, -317291, 42016, -146131, -237620, 187190, 543953, 162530, 93855, 59904, -169087, 195449, 325, -19329, 5286, 171977, -250460, -193847, -313275, -13241, 18676, 296551, 282965, 337248, 120077, -246354, 89483, -1778, -314799, -132467, -267854, -88999, -246226, -107956]
10208a77776k9553l03932H6978a00451m435j59680O5032b8469j7301j10067L9122
10197a16715j94738D0341a94135L0826M7648G7211h7333n9642r2815H1877R7668
10186A79545p095b2090r5700L7747A03294c03486I2417c06112H4035b1624j25921
10175a47545l5745j55829a22508I0036L2612i3005d0438j89299P2904I7886j5316
10164H2570A9682J31958B5592a09164j7295B12451B6753a49856A7355K47550C1059
10152a32433j46005P4769B07808b48054A08881a54536r2432f5362q2561A70906
10141A448d13825A19179c44490h4190j42013A19099l1254B1546e7388B06432b11468
10129E8032M5869L7603a36390A03899b86235c6623j19897E8259B5429h2139j6198
$$ y = [-177776, -207329, -511261, 86978, -100451, -104886, -264566, -199534, -28469, -45770, -155837, -116715, -311453, 40341, -194135, -163309, -115661, 77211, -87333, -146975, -239790, 81877, 179545, 172450, -22090, -117790, -80043, 103294, -303486, 92417, -306112, 84035, -21624, -147545, -183290, -339119, -122508, 90036, 122648, -93005, -40438, -229737, -156833, 97886, 82570, 19682, 151640, 25592, -109164, -126459, 212451, 26753, -149856, 17355, 264905, 31059, -132433, -278438, -203669, 207808, -248054, 108881, -154536, -246968, -65362, -147923, 170906, 1448, -413825, 119179, -344490, -84190, -226203, 119099, 87845, 21546, -57388, 206432, -211468, 58032, 103901, 141504, -136390, 103899, -286235, -36623, -156520, 58259, 25429, -82139, -98337]
10118i8337C7545a94572j99899e7997l269I046Q9859l2502c8701J320l11349a59191
10105h29j25144M758j97118I1048f4105A62240g5972k7750C8304b5166j36272
10094a61438j94413e1354B10778N026b50431k1031B01753q7940D8957a92065j09575
10083c01640J25435N8807K7458j27858A39873i9987c1636C1495c42904R1180A38187
10071E2654a23433j26084l8365a19129j81051I8793a05740C26160b03294F7000
10060f2208A0920a67411L3553M8648b5262C82597a37265A69481b13842O5556A84706
10048c33336d0172l61189d8275C0868L9530c93055B21460a16242I3692D1295o505
10037C4790b33185E7264O4098e4603E7593L5600b1254A13542J7985B7123a49782
$$ y = [-98337, 37545, -194572, -394471, -57997, -61266, 9046, 98905, 66403, -38701, -37381, -348730, -159191, -829, -125973, -121215, -318333, 91048, -64105, 162240, -75972, -103722, 38304, -25166, -161438, -355851, -51354, 210778, 215804, -250431, -271462, 201753, 113813, 48957, -192065, -301640, -176205, -117398, -89940, -217798, 139873, -99987, -31636, 31495, -342904, -251724, 138187, 52654, -123433, -249517, -287882, -119129, -300180, 98793, -105740, 326160, -203294, 67000, -62208, 10920, -167411, -133858, -85210, -25262, 382597, -137265, 169481, -213842, -148286, 184706, -333336, -40172, -401361, -48275, 30868, 70398, -393055, 221460, -116242, 93692, 41295, 34790, -233185, 57264, 121362, -54603, 57593, 93193, -21254, 113542, 131527, 27123, -149782]
10025d9974R896j9599A31146b19986f7056q4039H5480K7454E4304a1303G9884
10013a82448E0731J55793D0741b22077R2704d534J689j21514A19362c7163A45005
10001c21075c3912k44133G3567f9322A24606a41531e0893H0276f1928j51082B2717
9989b52390b0641k87836A20598h1847B20247C4375N1209d1312F7397P9946A7436
9977C3818b89715h4003b7373l06382h9005F2805a64466A75720F2443a4614n3619
9966f8233j62256f6344k53602J58935r7633B39274g7000j31801a03299a2086r5540
9955a07626n0619K6437e8926j651A0335L40752a05914a9698E4692J02118a63399
9943c9412G4304k6820a30526j3271B59600g4969p5082K6754J1090B34163a78979
$$ y = [-49974, -40078, -59677, 131146, -219986, -67056, -151095, 85480, 112934, 54304, -11303, 79884, -182448, 50731, 206524, 40741, -222077, -129373, -4534, -2845, -124359, 119362, -37163, 145005, -321075, -33912, -278045, 73567, -69322, 124606, -141531, -50893, 80276, -61928, -213010, 22717, -252390, -20641, -308477, 120598, -81847, 220247, 34375, 85584, -41312, 67397, 147343, 17436, 33818, -289715, -84003, -27373, -333755, -89005, 62805, -164466, 175720, 62443, -14614, -68233, -230489, -66344, -319946, -161011, -258644, 239274, -77000, -208801, -103299, -12086, -107626, -158245, -131808, -58926, -60577, 10335, 351087, -105914, -19698, 54692, 156810, -163399, -39412, 74304, 47484, -130526, -143797, 259600, -74969, -150051, -123297, -112207, 234163, -178979]
9931E1451h0912j16339G2660n546b38125h7758p322A2881c7221F5326b42870B9237
9918D7785J13394o5695K06125i6128B12046a01604A96597m0393a0132B18924a88719
9906B36043K06728b32388a4775L598o8518O245A55042a34055e0283K2562A01120
9894a4748m6558k08844j64208M6419J86455D7361L5384h8686a8080k33781A35718
9882E8936b5040B1238a85066n9710G2114a86248a2925k03863j4576J2553N0841
9871a67970C4450e2521k7695j90923b5337j49409C00481c92157J05462I7327b17659
9859a25077j4140j10999B2993b04559A75679b57973L7005a9609H2906a07941k06167
9848c14108h5424k19957f7832j08298e7442I6977f5496p1945O1288j75445A83181
$$ y = [51451, -80912, -197251, 72660, 67114, -238125, -87758, -95080, 12881, -37221, 65326, -242870, 29237, 47785, 161179, 95484, 301609, -96128, 212046, -101604, 196597, 156204, -10132, 218924, -188719, 236043, 442771, -232388, -14775, -11177, -79695, -73450, 155042, -134055, -50283, -27721, 101120, -14748, -61306, -270150, -434358, -387939, -201484, 47361, 82745, -88686, -18080, -251861, 135718, 58936, -25040, 21238, -185066, -244776, 72114, -186248, -12925, -216788, -231364, -218811, -167970, 34450, -52521, -80216, -271139, -25337, -174746, 300481, -392157, -286695, 97327, -217659, -125077, -139217, -250216, 22993, -204559, 175679, -257973, -220968, -19609, 82906, -107941, -314108, -85424, -305381, -67832, -176130, -57442, 96977, -65496, -137441, -76153, -251598, 183181]
9836f2022o8741N7673j97984C994M9014K31648A9739c4768A77075G7802b1023
9824b36899a2220k69041a27287j07959P5533A9502b30917j0677B07519P1338b19676
9812c8006j97515N6955B5971l558j0079J73964b17263g4534q9101F3948g6762
9800b82947K4822k22080b34282k25845b9631k63414a2221n04881c7901A38930
9789b40097E8194b46887a07638K7417E1402N6988f6516P096k954C0656c00876
9777e2843k43131G2627J2550J39784E4975b455l4390m224A45259a81630A99372
9765B67375a3059k68749C7140N5273b13514J4695j99970a94344A60673c00000
9754d5015o1500a371j68742l04634c9704K802D8945O7826J0971c9459j64914N1944
$$ y = [-62022, -130763, -73090, -271074, 3994, 53008, 284656, 19739, -34768, 177075, 77802, -21023, -236899, -12220, -281261, -127287, -235246, -159713, 19502, -230917, -241594, 207519, 278857, -219676, -38006, -235521, -178566, 25971, 22413, 12334, 186298, -217263, -74534, -163635, 63948, -76762, -282947, -258125, -480205, -234282, -460127, -29631, -293045, -12221, -517102, -37901, 138930, -240097, 58194, -246887, -107638, -80221, 51402, 108390, -66516, -59420, -62374, 30656, -300876, -52843, -295974, 72627, 85177, 224961, 54975, -2455, -36845, -41069, 145259, -181630, 199372, 267375, -13059, -281808, 37140, 92413, -213514, -198819, -398789, -194344, 160673, -300000, -45015, -106515, -1371, -170113, -474747, -39704, -36902, 48945, 116771, 127742, -39459, -204373, -152429]
9742a52429l98138B61267c5481J6136k1240k42645B47537A17068a75381A18588
9731B6107a58519P8366k98361a89111O4428m33906b6239A10355a62799d5643j00279
9720a45922C8729d3610I6683J5615h0998c0853l71837J20216B17380d6994k48866
9709b95860a28616a2928l81533J29969d5664m6133G4500a78561e8635k78782N3073
9698b84344k80422A79813c12635P4743Q7463G4196b66821I6941a97563C7912c97434
9686a02235A68260f6040H3O4644h2231j56653I7057d4270n7549A81532b20241
9674E6330b12417N5514a0614j71946A5857c40272B05260D4847b28102B7636c62135
9662i3212l12293c2162C8386j0248b89318Q5058A24437J04133i5566A33344i226
$$ y = [-152429, -550567, 261267, -35481, -19345, -40585, -283230, 247537, 117068, -175381, 118588, 26107, -158519, -80153, -378514, -189111, -124683, -558589, -26239, 110355, -162799, -45643, -145922, 38729, -43610, 96683, 112298, -80998, -30853, -402690, -282474, 217380, -46994, -295860, -128616, -12928, -394461, -264492, -45664, -91797, 74500, -178561, -58635, -337417, -284344, -564766, 179813, -312635, -237892, -150429, 74196, -266821, 96941, -197563, 37912, -397434, -102235, 168260, -66040, 83, 64727, -82231, -238884, 97057, -44270, -101819, 181532, -220241, 56330, -212417, -156903, -10614, -182560, 15857, -340272, 205260, 44847, -228102, 27636, -362135, -93212, -405505, -32162, 38386, 28138, -289318, -204260, 124437, 228570, -95566, 133344, -9226]
9650b4077j02443I9457N769D3480j9576J66773d3654k53464D2339K78112a93728
9638A31851c15037A18809c6169B31680m8011e326A42236m2435a13228A9659M10301
9627D29960a82785B29752a24407l24350A39545B4269a78344a327j08470I0563
9616I2071a95116e3894j25530g574j25588a9175A39224e6045A7176a18944n9477
9605a78421h3968B16916E6917c52978h220j70370N4409l4951F1485d5815k61368
9594c07183j3712m165a9783r5351M1965a6596n9327J7972D3555R929M7076J1770
9582A12330A2559M8242h2805M0299k16914H8518l2253f4173o4589k0391l5033
9571a84186j19865g1885C577L45404e196k51848h6089A4070J82632h5672g042
$$ y = [-24077, -126520, 99457, 105226, 43480, 23904, 190677, -43654, -297118, 42339, 320451, -193728, 131851, -315037, 118809, -36169, 231680, 183669, -5326, 142236, 99801, -113228, 19659, 429960, -182785, 229752, -124407, -448757, 139545, 24269, -178344, -1327, -109797, 90563, 92071, -195116, -53894, -179424, -7574, -133162, -19175, 139224, -56045, 17176, -118944, -178421, -83968, 216916, 56917, -352978, -8220, -178590, -124181, -159132, 61485, -45815, -307183, -320895, -325060, -19783, -115134, -73169, -16596, -75923, -57951, 43555, 53484, 100560, 112330, 12559, 60801, -82805, -42506, -259420, 88518, 56265, -64173, -128762, -149153, -184186, -304051, -71885, 3577, 348981, -5196, -257044, -86089, 14070, 196702, -85672, -7042]
9559a37888o9751P9141n9631n556j83330P0196j9261g6080q6231p9922c6787D5130
9546a73316g5669a2143m5434j67898i9600j31236P0425G9737b22062f3363l2295
9535i5658r5024k6868b5757B85570h4308F020f4249q4290k2170f461B8215c49994
9522b9412j04101o6638A6850b00927p991A46835a59474J9048O1665A13296c46229
9510a95438H2502f3285m52632a3533A2161a93727c8165C1332c34406d6205m3506
9499h9711A59544C3332b02161A8695c4625o6582k79991I8729F025a45209B73687
9487G6355a52030N2991D7719a55591g4228k93210a47149j25031L1582i6651j97674
9476b94325A43267g7524n4286e341C9996b11403b6769G1927g7095G5129h0032
$$ y = [-137888, -207639, -128498, -188129, -193685, -377015, -306819, -326080, -76080, -162311, -242233, -36787, 45130, -173316, -75669, -12143, -57577, -225475, -99600, -230836, -160411, 79737, -222062, -63363, -95658, -190682, -217550, -25757, 285570, -84308, 6020, -64249, -148539, -170709, -6461, 28215, -349994, -29412, -133513, -200151, 16850, -200927, -208918, 146835, -159474, -140426, -78761, 113296, -346229, -195438, 82502, -63285, -515917, -13533, 12161, -193727, -38165, 31332, -334406, -46205, -89711, 159544, 33332, -202161, 18695, -34625, -101207, -381198, 98729, 6025, -145209, 273687, 76355, -152030, -99039, 47719, -155591, -74228, -367438, -147149, -272180, -240598, -96651, -294325, 143267, -77524, -131810, -5341, 39996, -211403, -26769, 71927, -77095, 75129, -80032]
9464C82189d5430j18953j29020a1116I7247Q1407m273k0743E7859G327e4115l8619
9452i2734k67676a19020D1979J52328A3989a06843L6984f850H6083B9915d9024
9440B26727b0697A66025D5049K32074b21785q4482a17054f103A64940F9492J55738
9429B25230K2673e3873j22788j67740D5048b40501k2816g4831A20936a84857f8082
9417A05533C7128J99998d6073A78903a94469L8179D4011g6486A22072f949r0663
9406i7612m099k69779D06280b16915N7328L1134j6406J9359m936G7926b1269A18466
9393b89909j04739b0513r4711E297e8482J924j4414k41579Q8089C49322D1986
9381b86638Q7890j40690D68a09187k21051A03282b41467A91110G6372f7330A18078
$$ y = [382189, -45430, -164383, -293403, -11116, 97247, 178654, 174381, 153638, 57859, 7327, -54115, -92734, -360410, -119020, 41979, 194307, 13989, -106843, -69859, -6850, 86083, 29915, -49024, 226727, -20697, 166025, 45049, 277123, -221785, -306267, -117054, -6103, 164940, 69492, 225230, 247903, -53873, -176661, -344401, 45048, -240501, -263317, -74831, 120936, -184857, -68082, 105533, 37128, 237126, -46073, 178903, -194469, -156290, 44011, -76486, 122072, -6949, -97612, -101711, -371490, 406280, -216915, -159587, -128453, -144859, -125500, -130436, 77926, -21269, 118466, -289909, -394648, -20513, -115224, 5297, -58482, -56558, -70972, -312551, -224462, 349322, 41986, -286638, -198748, -339438, 468, -109187, -330238, 103282, -241467, 191110, 76372, -67330, 118078]
9369b68229i6799B3861Q4620A2573c52985l7776B74669H2173B3204c70509M8363
9358c22146C29002b70633j58312J30955c5132l105B6663a05006E3791e8294q0242
9347a38536k1208k73531a1704l08370A41848a84828M6148A81692b15102C3808
9336a17636l09729K4134g3233j38860b9366k8503F1266a31935F648J43377Q8983
9325B39008b81594E6392b30562C13379g83j08110o3869B11780e388l76815a28623
9313a76031p401p113A30916d05484F1676c56563B80a34711j04405q5513L6708
9302b87921a9277j67066e4893B85594E0342b24094A64636g0800I4975J58496q3082
9291A70389l7806m1703f8376A65061N2715N7823q4486b37532j05122e53k45443
$$ y = [-268229, -96799, 23861, 108481, 12573, -352985, -390761, 274669, 82173, 23204, -370509, -322146, 329002, -270633, -428945, -297990, -35132, -38237, 26663, -105006, 53791, -58294, -138536, -159744, -433275, -11704, -320074, 141848, -184828, -138680, 181692, -215102, 33808, -117636, -427365, -403231, -73233, -212093, -29366, -57869, 61266, -131935, 6648, 150025, 239008, -281594, 56392, -230562, 313379, -783, -108893, -172762, 211780, -5388, -382203, -128623, -176031, -183432, -190545, 130916, -405484, 61676, -356563, 280, -134711, -239116, -324629, -287921, -19277, -186343, -54893, 285594, 50342, -224094, 164636, -70800, 94975, 253471, 170389, 132583, 90880, -68376, 165061, 217776, 275599, 191113, -237532, -342654, -553, -245996]
9280b45996a3316C45e9075n5542j24599o5902d6487o5112k2517E16828a22064
9268a36751o9448j08293J41499d4029A24R6861h9902l972j62535h4464B13246
9256A72739D147c15247A776K27270b41971G6267l5556a95946E9271b97431a39351
9244h0427A13305i5665G4383C1546i0670p1767d2985A4140b35278Q0326E1455
9232a40179h501A90850G346J80986p6584j1186a61706b0427l6140k89978C43268
9220a46681G5623a40377A38065b6312A25537K2317c59724J62429j51780J42846
9210b06229i5773n8210C171c92085J62813A48242c17100a46404A65830J03252
9200B69082j28144k8535e12782J45094a0882k80510E9454I993a31958m4391a4172
$$ y = [-245996, -13316, 345, -59075, -114617, -239216, -305118, -46487, -111599, -134116, 516828, -122064, -136751, -206199, -314492, -172993, -44029, 124, 96985, -89902, -93874, -256409, -84464, 213246, 172739, 4147, -315247, 1776, 229046, -241971, 76267, 40711, -195946, 59271, -297431, -139351, -80427, 113305, -95665, 74383, 31546, -90670, -162437, -42985, 14140, -235278, -154952, 51455, -140179, -8501, 190850, 7346, 188332, 111748, 100562, -161706, -20427, -56567, -346545, 343268, -146681, 75623, -140377, 138065, -26312, 125537, 147854, -359724, -197295, -349075, -206229, -95773, -153983, 3171, -392085, -229272, 148242, -317100, -146404, 165830, 269082, 140938, 112403, -512782, -367688, -10882, -291392, 59454, 9993, -131958, -176349, -14172]
9188b62740C7197O1342C8935c39387a03720F2273K3438a66822A35625C6828b02277
9176a25217a2307j06350j97868D16834c5169j36964b7509j92562A3744h6912B68411
9164a52113f9690j03104O1163k68944J50351A27396b88334C9387a2371j042A58801
9152A15955a83804M8192G8813d08085a4106j23894D2132c14461a08086b200l28917
9141c31117Q8972Q9643A37155c07032l10465L03208A71691a13676b7739j5655
9131d3394p5688K6590j11555e5189m8625A71957j5349b0241m2837l88708A15107
9119A68760l9932c1155D32673E903J97551a06340l4513B37707K1546q5144a97941
9107B15167M5446f9873j09414L6382A3425c09911J22946G5398e8044F2285g7381
$$ y = [-262740, 37197, 98539, 38935, -339387, -103720, 62273, 85711, -166822, 135625, 36828, -202277, -125217, -12307, -118657, -316525, 416834, -35169, -172133, -27509, -220071, 13744, -86912, 268411, -152113, -69690, -172794, -111631, -380575, -230224, 127396, -288334, 39387, -12371, -13413, 158801, 115955, -183804, -135612, 78813, -408085, -14106, -138000, 42132, -314461, -108086, -2200, -331117, -242145, -152502, 137155, -307032, -617497, -314289, 171691, -113676, -27739, -43394, -119082, -92492, -204047, -55189, -103814, 171957, 156608, -20241, -63078, -451786, 115107, 168760, 128828, -31155, 432673, 5903, 203454, -106340, -140853, 237707, 259253, 174109, -197941, 215167, 260613, -69873, -179287, -142905, 13425, -309911, -186965, 75398, -58044, 62285, -77381]
9095a62381l5687m0694M4325r5792f6812k05070M8346B74208A08187c8196B5719
9083a476k25390J02581b3712c104j32659R491k8666H1704g2753b5067K046D10
9070d2594m2932o8882q7215D9323k2866J36259J79746A00751a88950j77123A53255
9058b8843B02995c66485a6457k36189R9069O9009A1586c18060A56956a55152A53878
9046A45912g1518l4479B72082a69930d6172F431a47218e4691r4015M8828j62287
9035b62165a11015I1572a888j11083M6127A99829J3717r7811a90737f8035A08617
9023a80644e5863D7503a02210A28398o1446g8532j77517D0551d1537A43047h8165
9011D8159a40761N2505A5198e1601p9483o1972j76068a42306k38270J08136e8322
$$ y = [-162381, -198068, -238762, -194437, -290229, -66812, -271882, -223536, 274208, 108187, -38196, 25719, -1476, -226866, -124285, -23712, -3104, -135763, -126272, -154938, 81704, -72753, -25067, -23021, 410, -42594, -85526, -154408, -241623, 49323, 26457, 162716, 342462, 100751, -188950, -366073, 153255, -28843, 202995, -366485, -16457, -252646, -153577, -84568, 11586, -318060, 156956, -155152, 153878, 145912, -71518, -105997, 272082, -169930, -46172, 6431, -147218, -54691, -148706, -99878, -262165, -111015, 91572, -1888, -112971, -66844, 199829, 213546, 115735, -190737, -68035, 108617, -180644, -55863, 47503, -102210, 128398, 66952, -78532, -256049, 40551, -41537, 143047, -88165, 48159, -140761, -88256, 15198, -51601, -131084, -193056, -369124, -142306, -380576, -272440, -58322]
8999h1502A58248B3706a85439M6858q0222c5037H2960M1026M1749b08468l54760
8988e63228A6883J17251b56041J13626K0583a548j05938k64831A37843l6827L5645
8977A36661C9976a87501G5523d4061j51807I9059L9516e9537C1901K23857a14472
8965c74990a75168D9750a32512G8839J68388G8127h0922C1421J28815a76948h4223
8953b80439D3948L5084a75339L7211F7844J02496f6141A20530a90727A79636a75069
8941a35643b0631l8853l1402A41205E6203J60827L5317Q037I8119j0882k63e0916
8928b5484C30269P8418K93953L48452J223437M487122M844664K506160E626452
8918A530829m32736l74306C14919R9736o1821G5598a46942b0471H862a75334D97706
$$ y = [-81502, 158248, 23706, -185439, -138581, -218803, -35037, 82960, 123986, 165735, -208468, -563228, 16883, 134134, -256041, -142415, -121832, -1548, -107486, -372317, 137843, 101016, 136661, 39976, -187501, 75523, -44061, -195868, 99059, 138575, -59537, 31901, 255758, -114472, -374990, -175168, 49750, -132512, 78839, 247227, 78127, -80922, 31421, 160236, -176948, -84223, -280439, 43948, 79032, -175339, -138128, 67844, 170340, -66141, 120530, -190727, 179636, -175069, -135643, -20631, -59484, -90886, 141205, 56203, 217030, 252347, 260384, 98119, 87237, 86974, -50916, -25484, 330269, 408687, 702640, 1051092, 2274529, 6761651, 11606315, 14112475, 5626452, 1530829, 1098093, 723787, 314919, 414655, 352834, 75598, -146942, -20471, 8862, -175334, 497706]
8906b4555k08195G8283c66045A01314C3368J25023G5562C4573a49637C2466P8121
8895A10587J50b96493i2153F0891k6590b34307b1035A1134g9435k38407b0161
8883a61330n5458j0374Q8782j5212b8296A49719B9365a95808G6737d5384k71493
8872c16877I5807a79835A11108e1222A39023h6319j13439k89981b30063j86509
8862d16572F7213a28312q8668f8817k28727R5032B7415K8192d12542J43643B02887
$$ y = [-24555, -232750, 78283, -366045, 101314, 33368, 158391, 75562, 34573, -149637, 32466, 110587, 110737, -296493, -92153, 60891, 34301, -234307, -21035, 11134, -79435, -317842, -20161, -161330, -216788, -227162, -138380, -153592, -28296, 149719, 29365, -195808, 76737, -45384, -316877, 95807, -179835, 111108, -51222, 139023, -86319, -199758, -489739, -230063, -416572, 67213, -128312, -216980, -68817, -297544, -202512, 27415, 55607, -412542, -268899, 202887]
$$ [...]
##END NTUPLES=NMR SPECTRUM
##END=
