##TITLE=AC1501_CRIANN13308_8125382_Exf7PWUoEY
##JCAMPDX= 6.0         $$ Bruker NMR JCAMP-DX V2.0
##DATA TYPE= NMR SPECTRUM
##DATA CLASS= NTUPLES
##ORIGIN= BRUKER
##OWNER= Administrator
$$ 1.72 TOPSPIN		Version 2.1
$$ 2013-08-16 16:52:16.974 -0700  Administrator@X
$$ Compression mode = diff/dup
##.OBSERVE FREQUENCY= 400.02188249412
##.OBSERVE NUCLEUS= ^1H
##.ACQUISITION MODE= SIMULTANEOUS (DQD)
##.ACQUISITION SCHEME= undefined
##.AVERAGES= 8
##.DIGITISER RES= 22
##SPECTROMETER/DATA SYSTEM= spect
##.PULSE SEQUENCE= zg30
##.SOLVENT NAME= COFFEE_meoh
##.SHIFT REFERENCE= INTERNAL, COFFEE_meoh, 1, 14.98509
##AUDIT TRAIL= $$ (NUMBER, WHEN, WHO, WHERE, PROCESS, VERSION, WHAT)
$$ ##TITLE= Audit trail, TOPSPIN		Version 2.1
$$ ##JCAMPDX= 5.01
$$ ##ORIGIN= Bruker BioSpin GmbH
$$ ##OWNER= Administrator
$$ $$ E:\/data/COFFEE/nmr/AC1501_CRIANN13308_8125382_Exf7PWUoEY/20/pdata/1/auditp.txt
$$ ##AUDIT TRAIL=  $$ (NUMBER, WHEN, WHO, WHERE, PROCESS, VERSION, WHAT)
(   1,<2013-08-16 16:52:10.552 -0700>,<Administrator>,<X>,<go>,<TOPSPIN 2.1>,
      <created by zg
	started at 2013-08-16 16:51:05.021 -0700,
	POWCHK enabled, PULCHK disabled,
       configuration hash MD5:
       C8 4E 4E 5D D3 5C D8 9E 9F 52 82 E0 59 8A DE 15
       data hash MD5: 64K
       1C 27 2A 45 43 9E C2 B4 DF E0 6D 94 25 06 20 5C>)
(   2,<2013-08-16 16:52:13.380 -0700>,<Administrator>,<X>,<proc1d>,<TOPSPIN 2.1>,
      <Start of raw data processing
       efp LB = 0 FT_mod = 6 PKNL = 1 PHC0 = 0 PHC1 = 0 SI = 32K 
       data hash MD5: 32K
       29 3E CE CE FA A5 CA C8 6E 9C 6A 81 84 72 5B 61>)
(   3,<2013-08-16 16:52:13.693 -0700>,<Administrator>,<X>,<proc1d>,<TOPSPIN 2.1>,
      <pk PHC0 = 98.80554 PHC1 = 0 
       data hash MD5: 32K
       4C B8 D8 3F 07 70 FD AB 09 0B C3 4B 17 E9 EA E1>)
(   4,<2013-08-16 16:52:13.787 -0700>,<Administrator>,<X>,<proc1d>,<TOPSPIN 2.1>,
      <abs ABSG = 1 
       data hash MD5: 32K
       37 88 A8 D8 70 B9 24 76 0F 4E A4 D0 49 AF 0D 5A>)
(   5,<2013-08-16 16:52:13.896 -0700>,<Administrator>,<X>,<proc1d>,<TOPSPIN 2.1>,
      <abs ABSG = 2 
       data hash MD5: 32K
       68 39 FE 2F AD ED 2D F5 46 C1 D6 5D 43 18 77 04>)
(   6,<2013-08-16 16:52:13.958 -0700>,<Administrator>,<X>,<proc1d>,<TOPSPIN 2.1>,
      <abs ABSG = 3 
       data hash MD5: 32K
       38 EC 0C 3A 53 6D 46 E9 6A 23 92 41 61 15 C0 8E>)
(   7,<2013-08-16 16:52:14.005 -0700>,<Administrator>,<X>,<proc1d>,<TOPSPIN 2.1>,
      <abs ABSG = 4 
       data hash MD5: 32K
       9F 9A F4 30 AE 4D 66 90 A3 5C 74 BA 0C 99 90 67>)
(   8,<2013-08-16 16:52:14.068 -0700>,<Administrator>,<X>,<proc1d>,<TOPSPIN 2.1>,
      <abs ABSG = 5 
       data hash MD5: 32K
       01 28 9A 43 22 76 C8 0B 51 0D 2E ED 04 95 5B 57>)
$$ ##END=
$$ 
$$ $$ hash MD5
$$ $$ 9D 03 12 73 77 6B 0E 91 CA E0 1C 18 64 48 6F B4
##$RELAX= 
##$RELAX= 
##$RELAX= 
##$RELAX= 
##$RELAX= 
##$RELAX= 
##$RELAX= 
$$ Bruker specific parameters
$$ --------------------------
##$DU= <E:\>
##$EXPNO= 20
##$NAME= <AC1501_CRIANN13308_8125382_Exf7PWUoEY>
$$ [...]
150 150 150 150 150 150 150 150
##$TP07= 0
##$TPNAME0= <>
##$TPNAME1= <>
##$TPNAME2= <>
##$TPNAME3= <>
##$TPNAME4= <>
##$TPNAME5= <>
##$TPNAME6= <>
##$TPNAME7= <>
##$TPOAL= (0..7)
0.5 0.5 0.5 0.5 0.5 0.5 0.5 0.5
##$TPOFFS= (0..7)
0 0 0 0 0 0 0 0
##$TUNHIN= 0
##$TUNHOUT= 0
##$TUNXOUT= 0
##$USERA1= <user>
##$USERA2= <user>
##$USERA3= <user>
##$USERA4= <user>
##$USERA5= <user>
##$V9= 5
##$VALIST= <valist>
##$VCLIST= <CCCCCCCCCCCCCCC>
##$VD= 0
##$VDLIST= <DDDDDDDDDDDDDDD>
##$VPLIST= <PPPPPPPPPPPPPPP>
##$VTLIST= <TTTTTTTTTTTTTTT>
##$WBST= 2048
##$WBSW= 25
##$XGAIN= (0..3)
0 0 0 0
##$XL= 0
##$YL= 0
##$YMAX_a= 603683
##$YMIN_a= -516439
##$ZGOPTNS= <>
##$ZL1= 120
##$ZL2= 120
##$ZL3= 120
##$ZL4= 120
##$ABSF1= 14.98509
##$ABSF2= -5.573092
##$ABSG= 5
##$ABSL= 3
##$ALPHA= 0
##$AQORDER= 0
##$ASSFAC= 0
##$ASSFACI= 0
##$ASSFACX= 0
##$ASSWID= 0
##$AUNMP= <proc_prof1d_extract_pilot.lims>
##$AXLEFT= 0
##$AXNAME= <>
##$AXNUC= <1H>
##$AXRIGHT= 0
##$AXTYPE= 0
##$AXUNIT= <>
##$AZFE= 0.1
##$AZFW= 0.1
##$BCFW= 0
##$BC_mod= 0
##$BYTORDP= 0
##$COROFFS= 0
##$CY= 15
##$DATMOD= 1
##$DC= 0
##$DFILT= <>
##$DTYPP= 0
##$F1P= 0
##$F2P= 0
##$FCOR= 0.5
##$FTSIZE= 32768
##$FT_mod= 6
##$GAMMA= 0
##$GB= 0
##$INTBC= 1
##$INTSCL= 1
##$ISEN= 128
##$LB= 0
##$LEV0= 0
##$LPBIN= 0
##$MAXI= 10000
##$MC2= 0
##$MEAN= 0
##$ME_mod= 0
##$MI= 0
##$NCOEF= 0
##$NC_proc= -8
##$NLEV= 6
##$NOISF1= 0
##$NOISF2= 0
##$NSP= 0
##$NTH_PI= 0
##$NZP= 0
##$OFFSET= 14.98509
##$PC= 1
##$PHC0= 98.80554
##$PHC1= 0
##$PH_mod= 1
##$PKNL= yes
##$PPARMOD= 0
##$PPDIAG= 0
##$PPIPTYP= 0
##$PPMPNUM= 2147483647
##$PPRESOL= 1
##$PSCAL= 4
##$PSIGN= 0
##$PYNMP= <proc.py>
##$REVERSE= no
##$SF= 400.02
##$SI= 32768
##$SIGF1= 0
##$SIGF2= 0
##$SINO= 400
##$SIOLD= 32768
##$SPECTYP= <>
##$SREGLST= <1H.CDCl3>
##$SSB= 0
##$STSI= 32768
##$STSR= 0
##$SW_p= 8223.68421052631
##$SYMM= 0
##$S_DEV= 0
##$TDeff= 65536
##$TDoff= 0
##$TI= <>
##$TILT= no
##$TM1= 0
##$TM2= 0
##$TOPLEV= 0
##$USERP1= <user>
##$USERP2= <user>
##$USERP3= <user>
##$USERP4= <user>
##$USERP5= <user>
##$WDW= 1
##$XDIM= 32768
##$YMAX_p= 455136526
##$YMIN_p= -767814
##$CURPLOT= <Network HP LaserJet P1505>
##$CURPRIN= <$Network HP LaserJet P1505>
##$DFORMAT= <normdp>
##$LAYOUT= <+/1D_H.xwp>
##$LFORMAT= <normlp>
##$PFORMAT= <normpl>
##$SURQMSG= 1
$$ End of Bruker specific parameters
$$ ---------------------------------
##NTUPLES= NMR SPECTRUM
##VAR_NAME=  FREQUENCY,     SPECTRUM/REAL,   SPECTRUM/IMAG
##SYMBOL=    X,             R,               I
##VAR_TYPE=  INDEPENDENT,   DEPENDENT,       DEPENDENT
##VAR_FORM=  AFFN,          ASDF,            ASDF
##VAR_DIM=   32768,         32768,           32768
##UNITS=     HZ,            ARBITRARY UNITS, ARBITRARY UNITS
##FACTOR=    0.250966925370066, 1,           1
##FIRST=     8223.43324360094, -75290,       215310
##LAST=      0,             -233734,         -160458
##MIN=       0,             -767814,         0
##MAX=       8223.43324360094, 455136526,    0
$$ Real data points
##PAGE= N=1
##DATA TABLE= (X++(R..R)), XYDATA
$$ [...]
19574d0139a3810l59k38331f9699C4324a10139B646b63457J123f7460D4679J8260
19562F2939h7767B22167c06651h9660A52324A4295g5009q8806B2479f5099F8366
19550g6569l09433A61650l6668a9037m3888K2B777J25482d30204e3154A23441
19538f2348k49993G2374f4398A05481J3194K4110o9650a16838B94463a9925j96524
19527b16449h4948d663A2474J78198J40470c0315K391k79319A83441d4797B02526
19515b5063j87826K2387q8169L6355n0873l4107J53815c9254A78119a21464N9812
19504f1652K9551I5032a59366j5484A25900J3388a0934C53275j48043q1172d67491
19492b03723A92682a1269A54091i9023L9030C06880c5704k9480k75511A41825
$$ plain form
19574 -40139 -13810 -14169 -252500 -69699 34324 -110139 2646 -263457 -262334 -67460 44679 62939
19562 62939 -87767 222167 -306651 -89660 152324 14295 -75009 -163815 22479 -65099 68366
19550 -76569 -386002 161650 124982 -19037 -62925 -62903 2777 128259 -430204 -53154 123441
19538 -62348 -312341 72374 -64398 105481 118675 142785 73135 -116838 294463 -19925 -216449
19527 -216449 -84948 -4663 12474 190672 331142 -30315 -27924 -307243 183441 -44797 202526
19515 -25063 -212889 -190502 -278671 -242316 -293189 -327296 -173481 -39254 178119 -121464 -61652
19504 -61652 -32101 95032 -159366 -174850 125900 139288 -10934 353275 205232 124060 -467491
19492 -203723 192682 -11269 154091 -99023 -59993 306880 -35704 -65184 -340695 141825
19481b98823a01730c3012m27204A42611l3566b33155P1559g0711Q272j16353j67745
19470c46537a21647I2317a22419C62709a89840A33041d7088o6311G0238P784J4332
19459I2354a12531D7154R0297k673m2864b20445n3499G3771b88343J03339A69239
19447D6021b82460c1414j57412B05192J18612H5020a37057m8571F5518r934e9851
19435B28406C8331J44564p0648a56428e0971J0489k31906f3840r8451N8742b4712
19423D0029b28599h0621G5866a98987e3173P515j69416J7142O8506m9099a3377
19411a09119G0020b18296g6150o2985E0561B2745J4043b61239I378J65663a7363
19399A74285a77520B0472i9819B9931J04200h1196L5881k7640j28935P4361E1019
$$ plain form
19481 -298823 -101730 -33012 -460216 142611 109045 -233155 -161596 -70711 -62439 -178792 -346537
19470 -346537 -121647 92317 -122419 362709 -189840 133041 -47088 -113399 70238 78022 92354
19459 92354 -112531 47154 137451 134778 91914 -220445 -273944 73771 -288343 -185004 169239
19447 46021 -282460 -31414 -188826 205192 323804 85020 -137057 -185628 65518 55584 -59851
19435 228406 38331 182895 112247 -156428 -50971 -40482 -272388 -63840 -162291 -103549 -24712
19423 40029 -228599 -80621 75866 -198987 -53173 -45658 -215074 -197932 -129426 -178525 -13377
19411 -109119 70020 -218296 -76150 -139135 50561 22745 36788 -261239 9378 175041 -17363
19399 174285 -177520 20472 -99819 29931 134131 -81196 -45315 -72955 -201890 -127529 51019
19387c28505f0655B95635a84627D8257J0161b4325G3542C1301M3836c84624D867
19375a20787A8925b05832a02725J3990B42764a04199j0219r5600Q1580B4372c62267
19363a3031H9222c46901e7672k05019K3647g0376o9013m046e5001F8411a83704
19351E8166a4959l27375I6521K4940c8855A4498e2013A04532d9404a591A7242
19339b0060A58309k0125B0775b61764J8892R7501M3208C7590a24913A65884a55160
19327a31145B65583D4022N2043g8030A24145d9792a0124C38591a1082p5003M1877
19316d4208k53433A38363b26338j01439B36491b0840K34j5232A97060a9486k79212
19305b98698j7846F3627b21591A51696b02015O1376j41519e797L71j55022O8682
$$ plain form
19387 -328505 -60655 295635 -184627 48257 58418 -24325 73542 31301 75137 -384624 4867
19375 -120787 18925 -205832 -102725 -88735 242764 -104199 -114418 -210018 -128438 24372 -362267
19363 -13031 89222 -346901 -57672 -262691 -239044 -70376 -139389 -143435 -55001 68411 -183704
19351 58166 -14959 -342334 96521 121461 -38855 14498 -52013 104532 -49404 -1591 17242
19339 -20060 158309 138184 20775 -261764 -242872 -145371 -102163 37590 -124913 165884 -155160
19327 -131145 265583 44022 96065 -78030 124145 -49792 -10124 338591 -11082 -86085 -44208
19316 -44208 -297641 138363 -226338 -327777 236491 -20840 -20606 -35838 197060 -19486 -298698
19305 -298698 -316544 63627 -221591 151696 -202015 -140639 -282158 -5797 -5426 -160448 -91766
19294i1766C8777b15494A26043K15832i3953l38868A55864c349f01m27731c5771
19282a7092q8003A10647m9028B8894c69432a81185c5089j14116A00801b24015
19271b04232i2189d3548k71066H8497b27680Q9597a4428k61957A05206b04152
19260b23692F9754a94177Q6014b1540G8105J01231a71842e4987B06738p7684a31922
19248a38739D2492Q060Q7200b0282G8255b81182J8702A6009a41654H0277a15886
19236A14168Q7828e8015j34961C4455K6765n026J27881b38243N9957O4603N1708
19225f1975k71345A63876J23402F5167f283E512d0966L587C8108i1948C58884
19213e1026A4234e7949C52782f1205B53434c2942q4550J5321c7538A3488a63322
$$ plain form
19294 -91766 38777 -215494 126043 341875 -93953 -432821 155864 -3349 -601 -428332 -35771
19282 -17092 -105095 110647 61619 28894 -369432 -181185 -35089 -149205 100801 -224015
19271 -204232 -92189 -43548 -314614 88497 -227680 -138083 -14428 -276385 105206 -204152
19260 -223692 69754 -194177 -108163 -21540 78105 179336 -171842 -54987 206738 129054 -131922
19248 -138739 42492 50552 137752 -20282 78255 -281182 -262480 16009 -141654 80277 -115886
19236 114168 201996 -58015 -192976 34455 61220 56194 184075 -238243 -178286 -113683 -61975
19225 -61975 -333320 163876 287278 65167 -6283 5512 -40966 -37379 38108 -91948 358884
19213 -51026 14234 -57949 352782 -61205 253434 -32942 -117492 -102171 -37538 13488 -163322
19201b18646j8045m758h5518C5840O8698d80356A44807o2617a03272p4328M5142
19190a32458A43386D997M9956b40836c5832k9943B8070b21926M1873N1336A23370
19178F5351M6411a25310H6880a72490r5520i559j69590F8736a07987B2658a09111
19166H4922c68241D6342J69965b7482o5950j90818F7950a5050A0942b48699e8565
19154B19407a00465A34078b26067d9665I5213a23505B49631a85309Q9077l0819
19144a27051C7776a59324L0468K0881c7167j8463q1194k15436I981a67452g6690
19132a63195G112Q1408l7698a14831A5168a96364A42306D0621j4559a8668j51740
19121a70408B10822a71589P6979r8548B01007C2304c46904c8187B3584a04835
$$ plain form
19201 -218646 -236691 -241449 -85518 35840 104538 -480356 144807 82190 -103272 -177600 -132458
19190 -132458 143386 4997 54953 -240836 -35832 -65775 28070 -221926 -180053 -128717 123370
19178 65351 111762 -125310 86880 -172490 -268010 -9559 -179149 68736 -107987 22658 -109111
19166 84922 -368241 46342 216307 -27482 -93432 -284250 67950 -15050 10942 -248699 -58565
19154 219407 -100465 134078 -226067 -49665 95213 -123505 249631 -185309 -96232 -127051
19144 -127051 37776 -159324 -128856 -107975 -37167 -55630 -136824 -352260 9981 -167452 -76690
19132 -163195 7112 88520 50822 -114831 15168 -196364 142306 40621 26062 -18668 -170408
19121 -170408 210822 -171589 -94610 -193158 201007 32304 -346904 -38187 23584 -104835
19110B18662a23838Q30r935C9800d25176B2761f5459n3925c7347j77212b7087
19098A05953J1774b61599D1359m522J21967a95874g3258j16644e3373j23217m5677
19087b22267C6467g4062M135k39298g7855j31081P348D0352L0945d4602A18268
19075A65132a90392q6551B2462a34291A18064J18949a41022c1356J692j77864
19065b07528A68809m8726k3844b42661l3662J16605M6925A603J41968m5592a75360
19053b24515O6941b6659B17034B5537J55913G7543b60078L643A65383J11770a45947
19041c670j14227d077G9531A9380i1982l74411K16897F3246J935A7476b2496E5156
19028d383D42347a9312j05959C7371a72985A94964b35147g7152o9488A23037e1070
$$ plain form
19110 218662 -123838 -123008 -132943 39800 -425176 22761 -65459 -119384 -37347 -214559 -27087
19098 105953 117727 -261599 41359 36837 158804 -195874 -73258 -189902 -53373 -176590 -222267
19087 -222267 36467 -74062 -69927 -309225 -77855 -208936 -201588 40352 71297 -44602 118268
19075 165132 -190392 -276943 22462 -134291 118064 237013 -141022 -31356 -29664 -207528
19065 -207528 168809 120083 96239 -242661 -276323 -159718 -112793 1603 143571 97979 -175360
19053 -224515 -157574 -26659 217034 25537 181450 77543 -260078 -256435 165383 277153 -145947
19041 -3670 -117897 -4077 79531 19380 -91982 -466393 -249496 63246 65181 17476 -22496 55156
19028 -4383 442347 -19312 -125271 37371 -172985 194964 -235147 -77152 -146640 123037 -51070
19016a3858j98710M1815i201C4084a42969f7843C1516O436P324a22219l3416A28430
19003a21064N787e0691k42386J06835i0578j40616A34975a00782b4570C89069
18992A68170h6923j42966A66273m780b09498G770a52274B23724I5357i2895A64846
18980D7852c63308B3091J3055J52055P2476d29288F4496l215J8894L8353l0796
18969H7732e1406r3991C06a19685n1533Q15I1518K838a28628j27424H283c23462
18956e0994q4167f3387k94082N0449i2981D3487a0087o0421C52309c2393k07114
18945b39507a2138B2517J35186D3248J49954a82266e5816P823l382j70999f3994
18933d2707E9654J31141D4708c8601j73412c2300I2528F600Q725d1122k09296
$$ plain form
19016 -13858 -212568 -170753 -9201 34084 -142969 -67843 31516 37952 45276 -122219 -155635 128430
19003 -121064 -115277 -50691 -293077 -186242 -90578 -231194 134975 -100782 -24570 389069
18992 168170 -86923 -229889 166273 161493 -209498 7770 -152274 223724 95357 -92895 164846
18980 47852 -363308 23091 36146 188201 260677 -429288 64496 61281 80175 118528 87732
18969 87732 -51406 -145397 306 -119685 -171218 -170403 91518 94356 -128628 -256052 8283 -323462
18956 -50994 -135161 -63387 -357469 -307020 -92981 43487 -10087 -70508 352309 -32393 -239507
18945 -239507 -12138 22517 157703 43248 193202 -182266 -55816 -47993 -51375 -222374 -63994
18933 -42707 59654 190795 44708 -38601 -212013 -32300 92528 6600 15325 -41122 -250418
18922b50418J10024k7070F6207e0156k15460A35737a19850F8274b9923j29079
18912a59002A25671E3021f8345H8983g7940a6061B5932R1249n6103e940r1393
18901i7333B29508g6369I9178m6358p011c9452B36071a93640M3047j05071A09446
18889A91611d48364a59339A60379B0623K26819b39176f8557F4866a8794r7154
18879a15948o3796B12206c769p803I4807N5954C5725N5835c07080J22437A58458
18867c11861b9765C49300a76211a6590j23382j46768a38415m8161c0624g645a424
18855a25784A18372M7092a81541P4713A95800R958D8236J76075e9768A9617h6094
18843a37664H6244c16195C6584a87644k2248L4563a301A3467a49211A59624L1648
$$ plain form
18922 -250418 -140394 -167464 66207 -50156 -265616 135737 -119850 68274 -29923 -159002
18912 -159002 125671 53021 -68345 88983 -77940 -16061 25932 117181 61078 -5940 -97333
18901 -97333 229508 -76369 99178 52820 45809 -39452 236071 -193640 -150593 -255664 109446
18889 191611 -448364 -159339 160379 20623 247442 -239176 -68557 64866 -18794 -115948
18879 -115948 -179744 212206 -3769 -11572 94807 150761 35725 91560 -307080 -184643 158458
18867 -311861 -29765 349300 -176211 -16590 -139972 -286740 -138415 -186576 -30624 -7645 -1424
18855 -125784 118372 165464 -181541 -106828 195800 205758 48236 224311 -59768 19617 -86094
18843 -137664 86244 -316195 36584 -187644 -209892 -175329 -1301 13467 -149211 159624 191272
18832A91272C9472a29025A16176g6512j2896k70345c8749a4444j98148G7206J713
18821G8919b30011K6762Q7301A33072K9568F645J00589D7787a08841r049m0112
18810a58002B09458q421J03634A48366F5245f7433A3687O1152c16311A5611J21007
18799A36618P8258F1715k8539I227d09632a02555A00917e53241a33330p9435C4572
18787i2754b7133A13031a10705M7140a0185j08167j35k11594B35566p204c27713
18775i8028k0390k09288d9532j1214A05144m7774J43889b29399A19496a74172
18764c12970A56533G1794h3862G1755b61048C6099h5816a0855j72253A01416j9100
18753H2316J5399h0980j58602B4641i8391j98278B28840b21690g2785n0053A18828
$$ plain form
18832 191272 39472 -129025 116176 -76512 -89408 -359753 -38749 -14444 -212592 77206 78919
18821 78919 -230011 -203249 -115948 133072 162640 6645 107234 47787 -108841 -117890 -158002
18810 -158002 209458 201037 304671 148366 65245 -67433 13687 74839 -316311 15611 136618
18799 136618 214876 61715 33176 9227 -409632 -102555 100917 -553241 -133330 -212765 34572
18787 -92754 -27133 113031 -110705 -63565 -10185 -118352 -118487 -330081 235566 228362 -327713
18775 -98028 -118418 -327706 -49532 -60746 105144 57370 201259 -229399 119496 -174172
18764 -312970 156533 71794 -83862 71755 -261048 36099 -85816 -10855 -183108 101416 82316
18753 82316 97715 -80980 -239582 24641 -98391 -296669 228840 -221690 -72785 -122838 118828
18741c18034C7849c32588A80997d4056l198k56038C14848r1544A11474a4669j54969
18730a69638A43833m7934N4891o2548b03754F1645a87662F4837a58395j03388
18720b61783R6518g981j33651k69514E9449g9099B7396b11057D6813b07224M2480
18709a64744d2149r8147p2685I1428K90264E6691N5290c16914i985o111k5937
18698d2033r5885A47909a56761e5839M262A1716c8861A76010a60103p6970j356
18687b38429C28099a23214M9782A01739A9702b5366B01677J05662a76160l2807
18677b08967N0182M7946A35614K442a09146m5451d8502j83500C32061Q3227G1966
18665B6214b89283J26694p3291F3459k6740P7846d9080E11277a76329c7073H5715
$$ plain form
18741 -318034 37849 -332588 180997 -44056 -47254 -303292 314848 223304 111474 -14669 -169638
18730 -169638 143833 95899 150790 88242 -203754 61645 -187662 64837 -158395 -261783
18720 -261783 -165265 -7981 -141632 -411146 59449 -79099 27396 -211057 46813 -207224 -164744
18709 -164744 -42149 -140296 -212981 91428 381692 56691 111981 -316914 -9985 -16096 -42033
18698 -42033 -137918 147909 -156761 -55839 -51577 11716 -38861 176010 -160103 -237073 -238429
18687 -238429 328099 -123214 -73432 101739 19702 -25366 201677 307339 -176160 -208967
18677 -208967 -158785 -110839 135614 138056 -109146 -154597 -48502 -232002 332061 415288 71966
18665 26214 -289283 -162589 -235880 63459 36719 114565 -49080 511277 -176329 -37073 85715
18653a27709H613b51984k44011J73643Q9364b5122m1829p7070d7665k21289k7178
18642b96132b336j84614M4720E8426N3723n529K74279r740g9267K6037k96048
18631c49278c6210A44332k7480a57301n3945f8765E710b05268B25935J3362d4528
18619A14385a45433N3786j7981j9832C8332a56524J934A5937K8387c21264J6667
18608c04597a00729B15908C5468b600E2050a56736A34794g8670m9266E2152e8124
18596a24422k53513I9255a0655j36814L7392j0196p1641i5003k3446a5718C6534
18584a58212g6809K140b8511B86595a84900j5817d585k43370A4444L7494c8907
18572b56409I7664e8864j17228L8528j51294d6725j64943a313l48474a00833o4084
$$ plain form
18653 -127709 8613 -251984 -495995 -322352 -232988 -25122 -66951 -144021 -47665 -268954 -296132
18642 -296132 -2336 -186950 -142230 58426 112149 106620 380899 371159 -79267 -53230 -349278
18631 -349278 -36210 144332 116852 -157301 -211246 -68765 5710 -205268 225935 239297 -44528
18619 114385 -145433 -91647 -109628 -129460 38332 -156524 -154590 15937 44324 -321264 -304597
18608 -304597 -100729 215908 35468 -2600 52050 -156736 134794 -78670 -127936 52152 -58124
18596 -124422 -377935 99255 -10655 -147469 -110077 -120273 -191914 -95003 -118449 -15718 36534
18584 -158212 -76809 -74669 -28511 286595 -184900 -200717 -4585 -247955 14444 51938 -38907
18572 -256409 97664 -58864 -176092 -137564 -288858 -46725 -211668 -1313 -349787 -100833 -164917
18561a64917m6120A24310P8864g5984j695B3394e8002N41j98940A94181d02045
18549h2898l35279H1111j8132c9607o3477A94715i5333L0909H9441j8006L7649
18538A09084c65316a60260B2248J2430b85134b4496A6487f8142B17948c0856A54151
18526a4479j0551A87402C1259a16606C8069J5164d6777A29239D5662f9198D4375
18514g0203k61617B3796f0644A3168J0528b22942O4207g4635B29240a25733j57184
18503b82917k5897A17396k3661a11402C7926L21784q1949G7909c71857A3754a43567
18491C3470D792h1631A39070c05485a20211B08034b3678k9455j61146j84071h3477
18479a06723A42856a56101N8342A32084b85799J42219B8372A009J1186R6002J49742
$$ plain form
18561 -164917 -211037 124310 203174 -75984 -77679 23394 -58002 -57461 -256401 194181 -402045
18549 -82898 -418177 81111 62979 -39607 -103084 194715 -95333 -64424 89441 71435 109084
18538 109084 -365316 -160260 22248 34678 -285134 -24496 16487 -68142 217948 -30856 154151
18526 -14479 -25030 187402 31259 -116606 38069 53233 -46777 129239 45662 -69198 44375
18514 -70203 -331820 23796 -60644 13168 23696 -222942 -158735 -74635 229240 -125733 -282917
18503 -282917 -308814 117396 93735 -111402 37926 359710 277761 77909 -371857 13754 -143567
18491 33470 4792 -81631 139070 -305485 -120211 208034 -23678 -53133 -214279 -398350 -83477
18479 -106723 142856 -156101 -97759 132084 -285799 -143580 28372 1009 12195 108197 257939
18468B57939d28233F6748a82657j59992A58226G3293a08391A92393e9480j95581
18458b55061b5866k23518B11666a90029D4077a21524B23924f65k44946C69087
18447a15033e3635A39913f0077m014F4675k6514K08127a96341B12890D2077a05426
18435a40342d1891R514f511A04611d3565C44157b8353A90960G9418K0572J38933
18424B38923G1532b70236J03961A5173J21637C2086a03262J2474A98291b80259
18413C72571a75301r7228A08286P2761b60862A78691k4390a59367A97516a25579
18402C01277I0798a18721A76075c58198i2099A66692K78483b72689a7094A78096
18391A4314f8792m0507A59778h1856n449A37408o4343b93330a04038b1104r1344
$$ plain form
18468 257939 -428233 66748 -182657 -342649 158226 73293 -108391 192393 -59480 -255061
18458 -255061 -25866 -249384 211666 -190029 44077 -121524 223924 -665 -245611 369087
18447 -115033 -53635 139913 -60077 -64091 64675 38161 246288 -196341 212890 42077 -105426
18435 -140342 -41891 -32377 -6511 104611 -43565 344157 -28353 190960 79418 99990 238923
18424 238923 71532 -270236 -166275 15173 136810 32086 -103262 -90788 198291 -280259
18413 372571 -175301 -272529 108286 181047 -260862 178691 154301 -159367 197516 -125579
18402 301277 90798 -118721 176075 -358198 -92099 166692 445175 -272689 -17094 178096
18391 14314 -68792 -109299 159778 -81856 -87305 137408 73065 -293330 -104038 -21104 -112448
18380a12448D00441I8774j2673c5036o1939d279m6593A98335b70246J8532c8631
18368A25602D7047K7232B2491e16322A11615k529m8859a66682a0671j3893l55853
18357c80417F9877a84388f486j04069A24240a60531A66101b15553R9230k72443
18347c88766h7347k34711a3759r7992C5358a03957j00072j74140e5322H4501b6060
18335B90214f0479A78660f5196A44479c4952j38098G9407a74016d100k43999A58670
18323c9181j14487d1639a3649j48240L4252l04319a72509f2017J3047c836D7734
18311a68694B30810a48288C2966e5527B28034o9478a16003n6162A81148b36256
18300b22757r4468J28305D0783c3980E30624b89864J23137A023J59463D621M363
$$ plain form
18380 -112448 400441 98774 86101 -35036 -96975 -4279 -50872 198335 -270246 -251714 -38631
18368 125602 47047 74279 22491 -516322 111615 109086 60227 -166682 -10671 -24564 -380417
18357 -380417 69877 -184388 -6486 -110555 124240 -160531 166101 -215553 -116323 -388766
18347 -388766 -87347 -322058 -13759 -111751 35358 -103957 -204029 -378169 -55322 84501 -26060
18335 290214 -60479 178660 -65196 144479 -34952 -173050 79407 -174016 -4100 -248099 158670
18323 -39181 -153668 -41639 -13649 -161889 -127637 -431956 -172509 -62017 -48970 -3836 47734
18311 -168694 230810 -148288 32966 -55527 228034 158556 -116003 -172165 181148 -236256
18300 -222757 -317225 -188920 40783 -33980 530624 -289864 -166727 1023 160486 4621 8984
18289H984P695M0051D006f8277A84233e0623p4207A23275a29747F3713a02581
18277H3651O3693N5184a14928C62176d3820A72799a00126j57650a14900A49215
18266h220m9995J2504a1425C7432L3469i468j34077n7481b2733j76916A84507
18254C447K76286a04515A63079b27666J10912n5594B19626a83426A81354o9491
18244A11863c49465f0577k01576b9084j12179M4337r4638B4306a01593D3084b70930
18232A02190D8232g036B5310b60843f6168j51925k798J6447A360R8561b37112
18220i9191F5833P5027a93823O7354K6466k43676h1952a548C89056c7522j88273
18209b25795O8327o3696A2789R0190m5076J07K9446a89397I3520g8007l88014
$$ plain form
18289 8984 16679 56730 4006 -68277 184233 -50623 -124830 123275 -129747 63713 -102581
18277 83651 147344 202528 -114928 362176 -43820 172799 -100126 -257776 -114900 149215
18266 -8220 -58215 -45711 -11425 37432 70901 -9468 -143545 -201026 -22733 -199649 184507
18254 3447 279733 -104515 163079 -227666 -116754 -172348 219626 -183426 181354 111863
18244 111863 -349465 -60577 -262153 -29084 -141263 -96926 -191564 24306 -101593 43084 -270930
18232 102190 48232 -7036 25310 -260843 -66168 -218093 -220891 -204444 1360 99921 -237112
18220 -99191 65833 140860 -193823 -126469 -100003 -343679 -81952 -1548 389056 -37522 -225795
18209 -225795 -157468 -221164 12789 102979 57903 58010 87456 -189397 93520 -78007 -466021
18198d66021c985q3504I351J71461e61666a04747a8761B28816j3590E5326b99454
18186B7023M8026e8637k1242E2973d9588k72701G2233b90240l8715F9520B3743
18174b61164C5332d4525B42617e6797G5701a8188A60516b12819m9386A96661c04004
18162h2685J7508K6085I0858d19738F5627B3542d9824A86031F940d9013i794B25214
18149a12709F3224J6054K28255j16655E2953c30195J50094j19764R5729M5731
18139a58405p6629a9486D7118J06101a20627k21301a8682A56851c3708A86053
18128a93213A85821A6395e7591l94127a81912g641G6547J18060b2082A53852d5
18116A67571b62182a08103F5746B4834b35968E5086J81689E4938J5769c65147
$$ plain form
18198 -466021 -3985 -87489 9351 180812 -561666 -104747 -18761 228816 215226 55326 -299454
18186 27023 75049 -58637 -79879 52973 -49588 -322289 72233 -290240 -328955 69520 23743
18174 -261164 35332 -44525 242617 -56797 75701 -18188 160516 -212819 -262205 196661 -304004
18162 -82685 -65177 -39092 90858 -419738 65627 23542 -49824 186031 6940 -49013 -9794 225214
18149 -112709 63224 79278 307533 190878 52953 -330195 -180101 -299865 -204136 -158405
18139 -158405 -235034 -19486 47118 153219 -120627 -341928 -18682 156851 -33708 186053
18128 -193213 185821 16395 -57591 -451718 -181912 -7641 76547 194607 -22082 153852 -45
18116 167571 -262182 -108103 65746 24834 -235968 55086 236775 54938 70707 -365147
18105a05163D6921a82321B65560j07053b42094h5651j09724A242R0852g2666D9302
18093f4200D5728a24424e992A4125Q3510Q5776p4145B0786b15802j56872M5326
18082c27348A15224b07468A97998n9487c81332b9621m98661a28760M5140F8093
18071a57231B9863a25649N1023D21690a45681A54904c95961J34156l8085E4446
18060B69556b14849G1617k4256a93298E8362k0554d24242J24564C55101D0301
18049a19993m56146K59070n9825a37999L1148q1540e6960A14243g7320A10219
18038a31576J8656j3851d2580j08152k61835H4301J58186K37549A13669h9491
18027C0690a90993h9143K9068K2248a6722p0823o8168P6234A55134a58770B64434
$$ plain form
18105 -105163 46921 -182321 265560 158507 -242094 -85651 -195375 1242 92094 -72666 49302
18093 -64200 45728 -124424 -5992 14125 97635 183411 109266 20786 -215802 -372674 -327348
18082 -327348 115224 -207468 197998 138511 -381332 -29621 -528282 -128760 -83620 68093
18071 -157231 29863 -125649 -74626 421690 -145681 154904 -395961 -261805 -299890 54446
18060 269556 -214849 71617 47361 -193298 58362 37808 -424242 -299678 355101 40301
18049 -119993 -576139 -317069 -376894 -137999 -106851 -188391 -56960 114243 -77320 110219
18038 -131576 -112920 -126771 -42580 -150732 -412567 84301 242487 480036 113669 -89491
18027 30690 -190993 -89143 -60075 -37827 -16722 -87545 -155713 -79479 155134 -158770 264434
18015A02514O5586g5441j54141J08888k2254A12952C2855g5951L2140G7272a41890
18003g0798a6845M960B43096A14296f02496e075p7348K8133A1352J63158d08065
17991A27040b15514F0439a23314m0058c5752j151f321m0416J7929q0898a2355
17979i622B63727j17233N5778a03722A40633a94193B9073d2116k80451h1227C76311
17967a26244r6969I7826b9834f017E2752c2508A03862C2158a8277l8275A41288
17955a3547l07761E6130B1206a06386k14193Q6692N8575l9848M9726B69519A10190
17943h8791k6163C5334d00043c4546k52944b8966N153A6770P982a02599A43295
17931e5796A2266b0766k67922d5668b764r939A38730g9865j41635b8665D7906
$$ plain form
18015 102514 168100 -75441 -229582 -120694 -142948 112952 32855 -75951 -43811 77272 -141890
18003 -70798 -16845 -11885 243096 114296 -602496 -5075 -82423 -54290 11352 174510 -408065
17991 127040 -215514 60439 -123314 -163372 -35752 -36903 -6321 -46737 -28808 -109706 -12355
17979 -9622 263727 146494 202272 -103722 140633 -194193 29073 -42116 -322567 -81227 376311
17967 -126244 -223213 97826 -29834 -6017 52752 -32508 103862 32158 -18277 -56552 141288
17955 -13547 -321308 56130 21206 -106386 -320579 -233887 -175312 -215160 -165434 269519 110190
17943 -88791 -114954 35334 -400043 -34546 -287490 -28966 -23813 16770 24752 -102599 143295
17931 -55796 12266 -20766 -288688 -45668 -2764 -12703 138730 -79865 -221500 -28665 47906
17919b4131a1914B84664A27773d0254a8271m8873B2394f3983a0186k95002B0474
17907b37502D854J3913J21340D9153d2070k1254i929k59950A61930L9122B0708
17895a46827A62728L5761c8018A47613h2292J0374A83845o5821O3290a52635d9363
17883g379k56736H511c1297D3136K90171d08972C36439A2783c10984B0970a63730
17871b9411l32975B49779a06070D7377a60123A4867K35736I3881f2023b9547G6519
17859A57521b05516a1990q7552H8652K73414D1077e3068o7869j43053E820J49727
17848A55547l6649b88299e1009p3156I714L60774E7499g1586C16031a67509L3482
17837a34027b5522l68636B53525P8975p5434F6191h6841B3261i94j93061K856
$$ plain form
17919 -24131 -11914 284664 127773 -40254 -18271 -67144 22394 -63983 -10186 -305188 20474
17907 -237502 4854 18767 140107 49153 -42070 -63324 -9929 -269879 161930 201052 20708
17895 -146827 162728 198489 -38018 147613 -82292 -71918 183845 118024 181314 -152635 -49363
17883 -7379 -264115 8511 -31297 43136 333307 -408972 336439 12783 -310984 20970 -163730
17871 -29411 -362386 249779 -106070 47377 -160123 14867 250603 93881 -62023 -29547 76519
17859 157521 -205516 -11990 -99542 88652 362066 41077 -53068 -120937 -263990 5820 155547
17848 155547 118898 -288299 -51009 -124165 9714 370488 57499 -71586 316031 -167509 -134027
17837 -134027 -25522 -394158 253525 332500 257066 66191 -86841 23261 -994 -194055 -191199
17826a91199j03076A6444d32344p3801b37768H869A583a58803k695A26778d1369
17814a12895B45569d7471r7955B83439e7106a1049D5418c6115A56689a9224r3690
17803a12914B00959a99521e7444q2153A03844l6562a11669G8366b35583b1718
17792a77316j48710f0656E6322d24822A61976p1176J0843a10696C63435b32532
17781d9851k262e060B07408i0891k4287m25883a44301B1976a36246E11505A54879
17769b18657A17556e6785j27652L3582B76691a7214B0457c4517L515A95858b23711
17757A05412C0193M9263J48911c53062H6652k0330h9374L7584D3481J12791n0871
17746A05401J0566f1562D8399b31329j7911B12730b50702Q2689A31456a52546
$$ plain form
17826 -191199 -294275 16444 -432344 -506145 -237768 8869 1583 -158803 -161498 126778 -41369
17814 -112895 245569 -47471 -145426 283439 -57106 -11049 45418 -36115 156689 -19224 -112914
17803 -112914 200959 -199521 -57444 -139597 103844 67282 -111669 78366 -235583 -21718
17792 -177316 -326026 -60656 56322 -424822 161976 90800 101643 -110696 363435 -232532
17781 -49851 -52113 -5060 207408 -90891 -115178 -541061 -144301 21976 -136246 511505 154879
17769 -218657 117556 -56785 -184437 -150855 276691 -17214 20457 -34517 -31002 195858 -223711
17757 105412 30193 79456 228367 -353062 86652 66322 -89374 -51790 43481 156272 105401
17746 105401 115967 -61562 48399 -231329 -249240 212730 -250702 -168013 131456 -152546
17735d7313j93049L1993B19665A02785J74540j31407a08710j32937C19157I2936
17724i5276b0812A98423p9286a2703A9806J31446a40542A06147J30905a14678
17713A03484J58409i3912r8093f0563I3978f7038j40568f8687A85201a15172B3906
17701A78288q6784i7050K0791A70335a84507B79967A39112c33430a41201G6356
17690i7446B21731d6531K1929k31166d8941A54812l1426Q2279c90749d0346j09996
17679a50342A2775c26225a39018C14491f5824k41880O7472d6300k14992B23386
17668h6891a5298j56482a6338l2106I5098c2253J5205l29504h9090L1900A76794
17656A26598b04344I8713L7688c9362B4418d6351B72842j11479B4844g1715l3205
$$ plain form
17735 -47313 -240362 -208369 219665 102785 277325 145918 -108710 -241647 319157 92936
17724 -95276 -20812 198423 119137 -12703 19806 151252 -140542 106147 237052 -114678
17713 103484 261893 -93912 -192005 -60563 93978 -67038 -207606 -68687 185201 -115172 23906
17701 178288 91504 -97050 -76259 170335 -184507 279967 139112 -333430 -141201 76356
17690 -97446 221731 -46531 -24602 -255768 -48941 154812 123386 205665 -390749 -40346 -150342
17679 -150342 12775 -326225 -139018 314491 -65824 -307704 -240232 -46300 -261292 223386
17668 -86891 -15298 -171780 -16338 -48444 95098 -32253 -17048 -346552 -89090 -57190 176794
17656 126598 -204344 98713 136401 -39362 24418 -46351 272842 161363 24844 -71715 -104920
17645a04920G8373a19896B6876e1116e940A20493a40005N387D7181f0733I1683
17633A08901E104f5913B11285I8363e0170B65012a057C4444K40513C5470J38869
17622A74339d0256E1170b2473j69802B88070g6156G8613b14875A17742k8287k6382
17611F3073N8382n9862R972J34795c5785G8676L20681A92713D9181g4163H7364
17599H5016c9474o9169E4578A3160M08115A6964f8572B91570b56807A01299O9972
17588A71271k9402e525F4013a84093m5420c5018A45750A6204O3661a8212p2729
17577i0941A30508E4716a93227k23445B88910C0555R2275K9517N7831C321J67063
17566A70384e0440D0705a17717B32218b4633D6987J25749H28J24363K12179a52207
$$ plain form
17645 -104920 78373 -119896 26876 -51116 -5940 120493 -140005 -134618 47181 -60733 91683
17633 108901 5104 -65913 211285 98363 -50170 265012 -1057 34444 274957 35470 174339
17622 174339 -40256 51170 -22473 -192275 288070 -76156 78613 -214875 117742 89455 63073
17611 63073 121455 61593 71565 206360 -35785 78676 399357 192713 49181 -74163 87364
17599 85016 -39474 -108643 54578 13160 421275 16964 -68572 291570 -256807 101299 171271
17588 171271 141869 -5525 64013 -184093 -229513 -35018 145750 16204 79865 -18212 -90941
17577 -90941 130508 54716 -193227 -416672 288910 30555 122830 152347 210178 3321 170384
17566 170384 -50440 40705 -117717 232218 -24633 46987 172736 828 125191 337370 -152207
17554B51467k8308N5942f9021A06873g1342A90958K32242I157d36276A53245f0890
17542C13465h976D8642e1346I6620J00072E8740A8206N282a61604B36920A17232
17530b7777C29130A26268J97293j26445N3039o0477K9027i5882k3194B41549q3007
17519A58542A9004f1811B80910e8191C11051a07505k78385E711L47964q199g7953
17507C11294b97246R2858A96257k8032a69207a7604A60186M5747J42140P4103
17497D22176h7851J3681A15654b02889C0747K26383b3339A74107d08B89056M5297
17486C34353A9806c9902J1827D4724K48403a9860B8443E619R3353m745l9338L75214
17474D30103k03421b74404A32599R4589J67261A7444K12908j6829F4878J61362
$$ plain form
17554 251467 223159 279101 -69021 106873 -71342 190958 423200 9157 -436276 153245 -60890
17542 313465 -8976 48642 -51346 96620 196692 58740 18206 23488 -161604 236920 117232
17530 -27777 329130 126268 323561 197116 250155 189678 218705 -95882 -119076 241549 158542
17519 158542 19004 -61811 280910 -58191 311051 -107505 -385890 5711 353675 345476 -77953
17507 311294 -297246 -204388 196257 168225 -169207 -17604 160186 205933 348073 422176
17497 422176 -87851 -74170 115654 -202889 30747 257130 -23339 174107 -408 289056 334353
17486 334353 19806 -39902 -28075 44724 293127 -19860 28443 5619 98972 94227 54889 430103
17474 430103 226682 -274404 132599 227188 394449 17444 230352 213523 64878 226240
17464B26240D2526J59050O9776I8634K82967E6466M14180G5357c103C07630P5857
17453C83487I0574j2807a20832D21122j28540O9788k7612j41741e7699B18938
17442A89333N6502c5970G8618K919J29532l6971q1800J06392b2270C4382J62818
17431A97200L19343A94102C0392J93727J03334d36425A8029J81882J28973p4223
17421B54661A15668K00902p1675n4846J44950k5660n9678H598L65427a1087A64573
17409B81643g205l9877B8082J26359K9162C5091K1541a49482F4323a03000A74076
17397I35J82992O7755J9648j21074L00049d8811H9802i2398n2281M7085a5A99677
17384b04867B06548R0767a57342A3593a05373A60725a19036D33138b14312B13923
$$ plain form
17464 226240 42526 201576 271352 98634 381601 56466 470646 75357 -3103 307630 383487
17453 383487 90574 77767 -120832 421122 292582 362370 334758 193017 -57699 218938
17442 189333 245835 -35970 78618 81537 211069 174098 92298 198690 -22270 34382 197200
17431 197200 516543 194102 30392 224119 327453 -436425 18029 199911 328884 254661
17421 254661 115668 316570 244895 190049 334999 309339 249661 8598 374025 -11087 164573
17409 281643 -7205 -47082 28082 154441 183603 35091 56632 -149482 64323 -103000 174076
17397 935 183927 251682 271330 150256 450305 -48811 89802 -92398 -144679 -97594 -15 199677
17384 -204867 206548 297315 -157342 13593 -105373 160725 -119036 433138 -214312 213923
17373A66320l1351j9304P7510a67719F251K18339P6615c13568C48377j33941B9095
17361a22272D51661I9755J81903J38597a04314A88568q0947k9788J30185G6773
17350F3704K46529E2012b158F4497g2652B18542r2660B7409e488A78574N0536
17339B29110d4589p0443m2647k709A3951P8941l4999K1509A9247J03315h0237
17327A82373o2787B8691K35671j17751l7416a99239B40678p5502N6367j05451
17317A16092Q4381N59878A19767J11950o626e7514j55280B84473p4730b51257
17306g9610K050C73577a15156A76104E8930P373J95584a09101E6382a16834G1818
17294A17070J28517j08591Q0654h4898C28108m0018a5166G2225J5100J5406K04055
$$ plain form
17373 166320 134969 115665 193175 -167719 6251 224590 301205 -313568 348377 214436 29095
17361 -122272 451661 99755 281658 420255 -104314 188568 107621 77833 208018 76773
17350 63704 310233 52012 -2158 64497 -72652 218542 125882 27409 -5488 178574 229110
17339 229110 -44589 -115032 -157679 -160388 13951 92892 57893 79402 19247 122562 -80237
17327 182373 119586 28691 264362 146611 109195 -199239 240678 165176 221543 116092
17317 116092 200473 760351 119767 231717 225091 -57514 -212794 284473 209743 -251257
17306 -79610 -77560 373577 -115156 176104 58930 66303 261887 -109101 56382 -116834 71818
17294 117070 245587 136996 217650 -84898 328108 288090 -15166 72225 87325 102731 306786
17283C06786E7320a88238A27774N7346j4670J46456j16908H1943K47393G4658
17272E37734H7613O9796f9696I4181i8744d8706C30897b30143A02470b2381B40682
17260a07490D1579K54952n565m9850b1014A31762i2157d0430D84992B41461j7369
17249B24092i1036I9941M0240J2258K65722j77387a71520A92722J57983c2140
17238C66257q7282C1835a3103q1627I3355c7537C2927K83982j43184O2739D8532
17226A32477J03044G9463L45968A62123O3730j06474Q7475J2560E7786J78003
17216B35789J0712j06541L699a5246H6887f6459B8894L1181M01541B23437A03055
17204C58766C6848f6889B25231i051M278j1479F5616L2042A3668M59241A24425
$$ plain form
17283 306786 57320 -188238 127774 185120 170450 316906 199998 81943 329336 74658
17272 537734 87613 157409 -69696 94181 -98744 -48706 330897 -230143 102470 -22381 240682
17260 -107490 41579 296531 290966 241116 -21014 131762 -92157 -40430 484992 241461 224092
17249 224092 -91036 99941 140181 152439 418161 240774 -171520 192722 350705 -32140
17238 366257 278975 31835 -13103 -94730 93355 -37537 32927 316909 173725 236464 48532
17226 132477 235521 79463 425431 162123 225853 119379 206854 219414 57786 235789
17216 235789 246501 139960 143659 -15246 86887 -66459 28894 60075 461616 223437 103055
17204 358766 36848 -66889 225231 -9051 -4773 -16252 65616 97658 13668 472909 124425
17192C35230I7278J89090O41j22076K06685j74471P9795a21993C14810J38532
17182D53342j93882I1876J02911a6166A80427K04266c10481C14972m4536r7224
17172A73212R316J74796p9143J57711q6586A39391M81148A95405J00689r1238
17162B04856I8851J36340a8799A08917K99704a55966I0593K40417K09410j89906
17152C50514J90462k56038f3207B59282J55116I6333M33969Q1213A67964Q4270
17142B52234r3482F6656K94685o3055n0274R643N506k5164j18488K48422L8124
17131D06055H4958J56189p6896J0666M5810K65491j31884C3451K53140J96489
17121D83080J78855l00771A46492M98164j88024R9727j22124j67201L78443j73899
$$ plain form
17192 335230 97278 286368 287009 164933 371618 197147 276942 -121993 314810 453342
17182 453342 259460 91876 194787 -16166 180427 384693 -310481 314972 270436 173212
17172 173212 182528 357324 278181 435892 349306 139391 620539 195405 296094 204856
17162 204856 98851 235191 -18799 108917 408621 -155966 90593 331010 540420 350514
17152 350514 540976 284938 -63207 259282 414398 96333 530302 611515 167964 252234
17142 252234 158752 66656 361341 298286 248012 257655 263161 237997 119509 367931 406055
17131 406055 84958 241147 164251 174917 220727 486218 354334 33451 286591 483080
17121 483080 661935 361164 146492 644656 456632 556359 434235 267034 645477 471578
17111D71578f3085C73603A78587K48362B06758l3746K66037Q8534A29930L34429
17101D64359E7747J57325K03197J9407e2944F7242K24236n6357M68011A23804
17090C80516L52377l24415A68100J15855N6579J9847F6945K41238J00999k9670
17080C79512H1792K42755R4293l3739K22412J17163B22510L81861k94475K0960
17070C30856L41105B36409K59856E0189K78906j09855K01916L6940J31906j73344
17060D16658A63598J04035J46009L9879j09284P3367J03729j59650L3525p7563
17050C17645j30830J76694P8004P564J33209L3029k15664N7619j49623K12033
17040E19680k25490M41555B45110j9550N32192C59055Q6749j41013K82542m3490
$$ plain form
17111 471578 -63085 373603 178587 426949 206758 173012 439049 527583 129930 464359
17101 464359 57747 215072 418269 437676 -52944 67242 291478 235121 703132 123804
17090 380516 732893 408478 168100 283955 340534 360381 66945 308183 409182 379512
17080 379512 81792 324547 418840 385101 607513 724676 222510 604371 309896 330856
17070 330856 671961 236409 496265 50189 329095 219240 421156 458096 590002 416658
17060 416658 163598 267633 413642 453521 344237 417604 521333 361683 395208 317645
17050 317645 186815 363509 441513 449077 582286 615315 399651 457270 307647 519680
17040 519680 294190 735745 245110 225560 757752 359055 445804 304791 587333 543843
17030E43843L6145k4398J07170C17754R7543J84366N1128q8098A44427O81027
17020H25454m03034k794J09493k9379L50014k21661K08105l12663Q5002m6841
17010E61696m9726N1437N9471p0715M3410K37289l47094J05300J2720J58822k87689
16999D74921J80156Q4202j18763j73954L23667J4383k84905p9394L34233k34209
16989E20337M6017K30194R6922k23204M1624J82171k56963J82318m04639O19518
16979A034295j32330o4676j09846J54858l10213N90348k09362D08253K15095J80308
16969H03656j68192K19981p2570J78852k38019J32083n9563L20907j71840k19399
16959G25896Q9641j5463J14563j43693K84418N9240m84782L22290p4248K1989
$$ plain form
17030 543843 579988 555590 662760 317754 415297 599663 650791 562693 144427 825454
17020 825454 422420 419626 529119 499740 849754 628093 836198 523535 608537 561696
17010 561696 511970 563407 622878 552163 595573 832862 485768 591068 603788 762610 474921
16999 474921 655077 739279 620516 446562 770229 784612 499707 420313 754546 520337
16989 520337 566354 796548 893470 670266 711890 894061 637098 819416 414777 1034295
16979 1034295 901965 837289 727443 882301 572088 1162436 953074 408253 623348 803656
16969 803656 635464 855445 782875 961727 723708 855791 796228 1117135 945295 725896
16959 725896 815537 800074 914637 770944 1055362 1114602 629820 952110 877862 899851
16949H99851L3502k09613J61073k69111K92753J45370j63774p911L70259M5112
16939A297511k22601M8679j6050K06658P7744n12346l1636R0728K39273J0917
16929A188877j29993N7959O2308J1389l43502L85054k46550Q5097k6636K89396
16919A333399j77029l5956J90696L8372K71208n34678k7203j321M14127m701j16431
16908A350483k01377l5411K04736n6147J07292j19239P8158J41680k73915J00436
16898A296696L1176R8782J29873P1014p5911J54276m40215M48480m218J63968
16888A873921j37097J11726J36455j71918l49381L20462p7727Q7792J88689l97870
16878A585052L45728L3015J29616K19699l79434r6016J22940J82089j8669m4460
$$ plain form
16949 899851 933353 723740 884813 615702 908455 1053825 890051 882140 1252399 1297511
16939 1297511 1074910 1123589 1107539 1314197 1391941 879595 847959 938687 1177960 1188877
16929 1188877 1058884 1116843 1179151 1190540 847038 1232092 985542 1070639 1044003 1333399
16919 1333399 1156370 1120414 1311110 1349482 1620690 1086012 1058809 1057488 1471615 1466914 1350483
16908 1350483 1149106 1113695 1318431 1262284 1369576 1250337 1328495 1470175 1196260 1296696
16898 1296696 1327872 1426654 1556527 1627541 1551630 1705906 1265691 1714171 1709953 1873921
16888 1873921 1736824 1848550 1985005 1813087 1463706 1784168 1706441 1794233 1982922 1585052
16878 1585052 1930780 1963795 2093411 2313110 1933676 1837660 1960600 2142689 2124020 2079560
16868B079560J07836j85676L86220J01098m19571J67928j08820l2610L64035o2102
16858B397898K98502k1240l43596J69979J07410J69809j36863n1155L69930l46560
16848B614114J5200K26772M6333M7295m7502M70250j89979k71912K51972j67J04147
16837C266523L25543j22683J39685P9790K90532j99302N4850K0154q2508K4652
16827C797236M25853k72914L87383n0247P0794r5915J55755J93300r7929K13169
16817D726485N195J79658J42046N9163m9533J66942K96500J17547L88748l52249
16807E680502J5650M68539l26129O56912Q0517J6402n615L25940J67887l27497
16797F753108P78313k81733L95063J35570K90072J39619K16978N25373K82334
$$ plain form
16868 2079560 2187396 2001720 2387940 2489038 2069467 2237395 2128575 2095965 2460000 2397898
16858 2397898 2696400 2675160 2331564 2501543 2608953 2778762 2641899 2590744 2960674 2614114
16848 2614114 2629314 2856086 2902419 2949714 2902212 3372462 3182483 2910571 3162543 3162376 3266523
16837 3266523 3592066 3469383 3609068 3688858 3979390 3780088 3834938 3855092 3772584 3797236
16827 3797236 4223089 3950175 4337558 4287311 4358105 4262190 4417945 4611245 4513316 4726485
16817 4726485 4731680 4911338 5053384 5112547 5063014 5229956 5526456 5644003 6032751 5680502
16807 5680502 5696152 6164691 5838562 6495474 6575991 6592393 6586778 6912718 7080605 6753108
16797 6753108 7531421 7249688 7644751 7780321 8070393 8210012 8426990 8952363 9234697
16788I234697R5570n0568M30058l9999N77918K15014Q8151O21327J48537M71143
16778A1791848M30664N10928K62242M96491M13967J35934O10652K05510P67285
16769A5625521M19826M82633Q30393M82161P77941O97273L55226J245510O92902
16760B1609386Q03038J311802O32624J273723J193988J198763J159044J115498
16752C0297866J718338J473275J822556J693817J936647J906426K551820K451342
16744D5852087K349180L169291K466929L236898L359265L825107M212126M110326
16736G2581209M488624N208001N370838N900107N827643O770392O749847P588185
16728A20484846P405072Q051835P952889Q390435Q116930P524835P216317O229615
$$ plain form
16788 9234697 9330267 9279699 9709757 9669758 10247676 10462690 10550841 11172168 11320705 11791848
16778 11791848 12222512 12733440 12995682 13492173 13906140 14042074 14652726 14858236 15625521
16769 15625521 16045347 16527980 17358373 17840534 18618475 19315748 19670974 20916484 21609386
16760 21609386 22412424 23724226 24356850 25630573 26824561 28023324 29182368 30297866
16752 30297866 32016204 33489479 35312035 37005852 38942499 40848925 43400745 45852087
16744 45852087 48201267 51370558 53837487 57074385 60433650 64258757 68470883 72581209
16736 72581209 77069833 82277834 87648672 93548779 99376422 106146814 112896661 120484846
16728 120484846 127889918 135941753 143894642 152285077 160402007 167926842 175143159 181372774
16720A81372774N227621M309523K858805J183766l6353j271850l753583m204191
16712A85686512n678653o736662p405093p879065p807041q370653q323200q035037
16704A25451108p413197p406778p167442o418589n943509n976076n584177m598799
16696G4942541m783340m474871l998734l592004l151905l086373l123459k531518
16688D6200337k645805k439253k370483j286985k202974j739067j746764j472339
16680C0296667j430625j478034j089412j103675j040278j114382j117488q45468
16672B1077305p94540j019553j014637l07813p16207m31651n78144n58195p02303
16663A4954262r10865j95455l84170o07601p7334p23962p6893p07335l99787k91015
$$ plain form
16720 181372774 186600395 190909918 193768723 194952489 194916136 193644286 189890703 185686512
16712 185686512 180007859 173271197 165866104 157987039 150179998 141809345 133486145 125451108
16704 125451108 118037911 110631133 103463691 97045102 91101593 85125517 79541340 74942541
16696 74942541 70159201 65684330 61685596 58093592 54941687 51855314 48731855 46200337
16688 46200337 43554532 41115279 38744796 37457811 35254837 33515770 31769006 30296667
16680 30296667 28866042 27388008 26298596 25194921 24154643 23040261 21922773 21077305
16672 21077305 20282765 19263212 18248575 17940762 17224555 16792904 16214760 15656565 14954262
16663 14954262 14043397 13847942 13463772 12856171 12778837 12054875 11977982 11270647 10870860 10579845
16653A0579845l66844j55520l89635k04977m20276l17297j98737j34153l34335
16644H058071l95882j59705L2951l21639k79495Q8766m25192L0309K5561m80761
16634F172984J02942o58646J78203j37560m78592L95217m44865k42632L148Q5145
16624D975344q6384j23618l88234L21194P9138l46616k59908J62687n2961m75290
16614C805352K19560n1652j19687J22671o77677K40366J7988j63315q1272N6514
16604C368848l31254J5954m3008j12511K77937j44412j90067j49344L40079p26840
16594B305382N28567l14390J06741K37840k65385m91683L72481l06653j26222
16585B046678K25531m5332J35074m6737k25745J3124J01477j31798m90038K73057
$$ plain form
16653 10579845 10213001 10057481 9667846 9462869 9042593 8725296 8526559 8392406 8058071
16644 8058071 7662189 7502484 7535435 7213796 6934301 7023067 6597875 6628184 6653745 6172984
16634 6172984 6275926 5617280 5795483 5657923 5179331 5574548 5129683 4887051 4890199 4975344
16624 4975344 4888960 4765342 4377108 4698302 4777440 4430824 4170916 4333603 4280642 3805352
16614 3805352 4024912 3973260 3853573 3976244 3298567 3538933 3556921 3393606 3312334 3368848
16604 3368848 3037594 3053548 3010540 2898029 3175966 3031554 2841487 2692143 3032222 2305382
16594 2305382 2833949 2519559 2626300 2864140 2598755 2107072 2479553 2172900 2046678
16585 2046678 2272209 2226877 2361951 2315214 2089469 2102593 2204070 2072272 1582234 1855291
16575A855291j21886O956L23059k86503K6076l0550l78853O11899j82335j33966
16565A689188K65433j96581j81608L23173m72439M21678l14072n995M5626Q6186
16555A660589P3994m52223J97108j54282o7175j01671R3537j53116J7843L99148
16545A513752k08798O9600j24132l5893M18117m49078O2091j13238k17890Q3786
16535I98317L07218k17145l3357l0278K71200n02322L37709K08623k56757M3955
16525A127163k97094k48277K87477q4366M98592j98244k44410K87804n25583J64303
16515G67365J16486j96552K57775p1100n2010K30194j62593j19937P0793r9748
16505G40673L19290k30614l27365M01973m50527K34258K36795O3855k78621l05592
$$ plain form
16575 1855291 1733405 1740361 2063420 1776917 1802993 1772443 1393590 2005489 1823154 1689188
16565 1689188 1954621 1758040 1576432 1899605 1427166 1848844 1534772 1528777 1574403 1660589
16555 1660589 1734583 1282360 1479468 1325186 1258011 1156340 1249877 1096761 1114604 1513752
16545 1513752 1304954 1374554 1250422 1214529 1632646 1183568 1245659 1132421 914531 998317
16535 998317 1305535 1088390 1055033 1024755 1295955 793633 1131342 1339965 1083208 1127163
16525 1127163 830069 581792 869269 784903 1283495 1085251 840841 1128645 603062 767365
16515 767365 883851 687299 945074 873974 821964 1052158 889565 769628 840421 740673
16505 740673 1059963 829349 501984 903957 453430 687688 924483 988338 709717 404125
16495D04125K37544J05625L8066j35836r2916K50876H2350N48294R3752M428Q0448
16484H09272C77195P2804m4331J47376Q3170r9726J90595K8520l16167J70285
16474F09721k94478M87605Q7549k95344B43338K99205A98221N98912C13953K49018
16464E62971l3106j23935K14213K6166j61415K3869j4266K02176j35516q8944
16454D72213J98941B50747J23136P3308J28481m9823j19181J49449A53121M52066
16444F05187k77489j18017K36347J40766B51564K41296A2173L36432J66238M6249
16434E61092r3255p1594K8813P4751O6120k31229J87421q4201n5119O4799j94540
16423B53058Q0113J21048q8239j44473R1158K41365k21124K90038A21418K08019
$$ plain form
16495 404125 641669 747294 785360 649524 556608 807484 82350 630644 724396 728824 809272
16484 809272 377195 449999 405668 553044 636214 536488 727083 755603 439436 609721
16474 609721 315243 802848 890397 595053 243338 542543 198221 797133 313953 562971
16464 562971 529865 405930 620143 646309 484894 508763 494497 696673 561157 472213
16454 472213 671154 250747 373883 447191 575672 525849 406668 556117 153121 605187
16444 605187 327698 209681 446028 586794 251564 492860 12173 348605 514843 561092
16434 561092 467837 396243 425056 499807 565927 334698 522119 437918 382799 447598 253058
16423 253058 333171 454219 365980 221507 312665 554030 332906 622944 121418 329437
16413C29437L27538k47080A02925d2724A48704J44016K82173k43769q3816o2135
16403A85173J6030L78302A96438J09528A51419o0291l0074N15969A88683J35592
16393C24275H7056K66153k187L37822k15700A81214K95572P1848j06579A04215
16382E11974j12136r8666c6305A82012J04464P8097J45268k30199O4315J89406
16372E33363B34195K8887L2319b434o2883G2379P044J43442e9310C30265m3646
16361B86619A08977L20806I7183O0353m5952K80897p0654N2911b3478E05935b99
16349B81915j12011K48352j72793O8173b0693B12741D4341P7588b66549f7506
16338C85941j38268K75693G4442L5631P2717B5582L1491Q1459a02470A84372J28252
$$ plain form
16413 329437 656975 409895 102925 -42724 148704 292720 574893 331124 247308 185173
16403 185173 201203 579505 196438 305966 151419 91128 61054 577023 188683 324275
16393 324275 87056 353209 351022 688844 473144 181214 476786 548634 442055 104215
16382 511974 399838 301172 -36305 182012 286476 364573 509841 279642 343957 533363
16372 533363 234195 263082 295401 -2434 -65317 72379 79423 222865 -59310 330265 286619
16361 286619 108977 429783 97183 157536 111584 392481 321827 374738 -23478 505935 -299
16349 281915 169904 418256 245463 313636 -20693 212741 44341 121929 -266549 -67506
16338 385941 247673 523366 74442 110073 182790 25582 57073 138532 -102470 184372 312624
16327C12624b1349I9893L49472I6081K19045j36091l3058C4378J77087K34751
16317D46216A10981g9290a4769C03369M4455N149A30304a04774F9620J49719a0586
16305A40000B3618J33104O0412k4919p3434M8771K03669K33142B35133a44601
16294d1404l505h133B81774j06088b30085A08828C3916J50582c14493B19738I8064
16282C17864b75525E3917c578k9687D19501a23156D0623i2963A37797K4542J09140
16271B71479J40441D7115R1379K4341a15295B11182G4824J823L1142c3772A71519
16259G6345J56253K00502j48928h0874A98371N8439q7289a72006d0724B71517
16248A80334c2112l41679d9851A50173D3104J77274d9463H9523a94366k7187A63132
$$ plain form
16327 312624 -21349 99893 449365 96081 315126 179035 145977 34378 211465 446216
16317 446216 110981 -79290 -14769 303369 347824 352973 130304 -104774 69620 219339 -10586
16305 140000 23618 156722 217134 192215 118781 167552 371221 604363 235133 -144601
16294 -41404 -44909 -8133 281774 175686 -230085 108828 33916 184498 -314493 219738 98064
16282 317864 -275525 53917 -3578 -33265 419501 -123156 40623 -92963 137797 162339 271479
16271 271479 411920 47115 138494 162835 -115295 211182 74824 76647 107789 -33772 171519
16259 76345 232598 433100 284172 -80874 198371 256810 169521 -172006 -40724 271517
16248 180334 -32112 -373791 -49851 150173 43104 220378 -49463 89523 -194366 -221553 163132
16236F1115J72467A12211J72285b8105G0802h8475F7704a88744A97804d9295q3319
16225a32614C02683C2340J48814J00373m7324l0824n0486R4674E7257J94900b72312
16213B66331p1796J01613h8994c730G6014Q6014B3723j1566J85775n5415R7138
16202B39655B3258K19408m6220H7562G529K45460c1608G3664K6345f3454j20171
16191a83625E65592b55488d1674C26811A04447m1541a04469j43177R6694j10869
16181b61821j8437P2134h1744A04088A9253N3544c551C09130j7838j43852J15783
16170B63223A2772e9504D7136J5339J97010b5318j8816B70470c05594A39315b66043
16158D6984A2082J42469Q4670d09796J62993e4066j37505A73349g8644n1563D9353
$$ plain form
16236 61115 233582 112211 284496 -28105 70802 -88475 67704 -188744 197804 -49295 -132614
16225 -132614 302683 32340 181154 281527 234203 203379 152893 247567 57257 252157 -272312
16213 266331 194535 296148 -88994 -3730 76014 162028 23723 12157 197932 142517 239655
16202 239655 23258 242666 196446 87562 7529 252989 -31608 73664 100009 -63454 -183625
16191 -183625 565592 -255488 -41674 326811 104447 62906 -104469 -247646 -150952 -261821
16181 -261821 -280258 -208124 -81744 104088 19253 72797 -3551 309130 291292 147440 263223
16170 263223 12772 -59504 47136 62475 259485 -25318 -44134 270470 -305594 139315 -266043
16158 46984 12082 154551 239221 -409796 -246803 -54066 -191571 173349 -78644 -130207 49353
16146a69906e7346k44165e22A98411c9871A60069d975p4776B8223a36362C4410
16134A20652f5006o2335A52271c6716k68983a4758j55661d1998J2073j02123B59179
16122b42634c9283F1239e1713j26423I2516a9141I8330b0697E9877J76258L1437
16111B67572a73585l9273C8454Q015b35823C09666b84271N6200H5360j7878a1208
16099A9516M4384C0720c39616G1093Q188A3905h01p9533j32322a4633p1088o2020
16087a47741G6149a52306M8017E0999a5154G4698N2799J02212a05256N0063A22550
16075A6559f7838j34338P251B8042K2180A0958J56083c30939A20132a41764B04045
16063i8336c72k1277A3842h8647a4652m6443j59646k6968J15177f656l88381I4121
$$ plain form
16146 -169906 -57346 -301511 -522 198411 -39871 160069 -4975 -79751 28223 -136362 34410
16134 120652 -65006 -127341 152271 -36716 -305699 -14758 -170419 -41998 -29925 -132048 259179
16122 -242634 -39283 61239 -51713 -178136 92516 -19141 98330 -20697 59877 236135 267572
16111 267572 -173585 -212858 38454 46469 -235823 309666 -284271 -228071 85360 67482 -11208
16099 19516 63900 30720 -339616 71093 79281 13905 -801 -80334 -212656 -14633 -85721 -147741
16087 -147741 76149 -152306 -104289 50999 -15154 74698 127497 229709 -105256 -55193 122550
16075 16559 -67838 -202176 -194925 28042 50222 10958 167041 -330939 120132 -141764 204045
16063 -98336 -372 -21649 13842 -88647 -14652 -61095 -220741 -247709 -132532 -6656 -395037 94121
16050C27136A28342b02676M2783L4893j42937J25510j61373d2566l9039a1611
16039A15351h4294j55865h982l5962F1305j6912c09090J04984f4306m9737A39517
16027a93965i1527c805k49789H3878a21660A00146b40410C5375h9128A33724a20381
16015A78983J42289b01982C06742b2444A40446d41238a28347N0145K2467d688
16004e8717A19264r292Q3308i1366A16658g2090B51655j00767G631a75782c4113
15992a3439l6806C26569g8109A9574g5602C0144J43829F9375J94787q8817N3612
15981B28957b2632B81725e8305F4627K38625h5039C01965b5343j0763j1349a6645
15969A53056a53694l6847j61933C31056c8123A37136m5415J37767e4027A74012
$$ plain form
16050 327136 128342 -202676 -159893 -125000 -267937 -142427 -303800 -42566 -81605 -11611
16039 115351 -84294 -240159 -8982 -44944 61305 44393 -309090 -204106 -64306 -114043 139517
16027 -193965 -91527 -3805 -253594 83878 -121660 100146 -240410 35375 -89128 133724 -120381
16015 178983 321272 -201982 306742 -22444 140446 -441238 -128347 -78202 -55735 -4688
16004 -58717 119264 109972 193280 -91366 116658 -72090 251655 150888 7631 -175782 -34113
15992 -13439 -50245 326569 -78109 19574 -75602 30144 173973 69375 264162 175345 228957
15981 228957 -22632 281725 -58305 64627 303252 -85039 301965 -25343 -36106 -47455 -16645
15969 153056 -153694 -190541 -352474 331056 -38123 137136 91721 229488 -54027 174012
15958d84045A30440B1729a58263p1437B30771c4141j99003d9440Q84j67251A84795
15946c13962m503a52214j57092B14887a73831H0880J47195B6458a10816J7347
15936i3469m6390B47514a2615j79714i1942a1085j7721A2098c22144H0761K1469
15925A02230i3264k6878l0900j02496P5792f9147B40994g0177n2745B54724I8800
15913d53777j9887E0494K9300O9899I259b28431J11130L2128J0903A2507a13683
15901b60363A07065c79512J23321a06605A10052a9373A67218g9080o1686A74704
15890A06974a73452D9118b44921J18575A5761J05302a22708c2560A81667K17597
15880C99264l9012a68486f0498j77664C4611J13543n4790C8448a00902D3472e9642
$$ plain form
15958 -484045 130440 21729 -158263 -229700 230771 -34141 -233144 -49440 -48556 -215807 184795
15946 -313962 -318465 -152214 -309306 214887 -173831 80880 228075 26458 -110816 -93469
15936 -93469 -139859 247514 -12615 -192329 -91942 -11085 -28806 12098 -322144 80761 102230
15925 102230 -93264 -120142 -151042 -253538 -177746 -69147 240994 -70177 -122922 254724 98800
15913 -453777 -473664 50494 79794 149693 9259 -228431 -117301 -85173 -74270 12507 -113683
15901 -260363 107065 -379512 -256191 -106605 110052 -19373 167218 -79080 -140766 174704
15890 106974 -173452 49118 -244921 -126346 15761 121063 -122708 -32560 181667 399264
15880 399264 360252 -168486 -60498 -238162 34611 148154 93364 38448 -100902 43472 -59642
15868c7834P709j36959E4731a8313C0551a44187k21040J72001N6475e2990A51778
15856C4955a78207E4914a76087L1168O819p1930i2782B83425A36745f8832a411
15844b92048J10205A45552f5608h73m45327E09877b80424a9797j44491A53273
15833C8436R8554c82231K6242D7446f5524K4236k76708b1398p5505B47087d6166
15821b69539d4147A93293c0985k92858A9610K69802a23647o9040A87336Q0327
15811B67663b6025G10a17518j26329k191B01030K26261q9886h0310n369D5550
15799b03485f6614j70243l3352G7146h3913k3846B35417o3857a9827l51194J59954
15788b11067B14740a66655J3679B13714c98405c8928n2682k61402H5300g0786
$$ plain form
15868 -37834 -30125 -167084 54731 -18313 30551 -144187 -365227 -193226 -136751 -52990 151778
15856 34955 -178207 54914 -176087 -144919 -138100 -210030 -92782 283425 136745 -68832 -1411
15844 -292048 -181843 145552 -65608 -873 -446200 509877 -280424 -19797 -164288 153273
15833 38436 136990 -382231 -355989 47446 -65524 -41288 -317996 -21398 -96903 247087 -46166
15821 -269539 -44147 193293 -30985 -323843 19610 289412 -123647 -192687 187336 267663
15811 267663 -26025 710 -117518 -243847 -246038 201030 427291 337405 -80310 -85679 45550
15799 -203485 -66614 -236857 -270209 77146 -83913 -107759 235417 171560 -19827 -371021 -211067
15788 -211067 214740 -166655 -152976 213714 -398405 -38928 -91610 -353012 85300 -70786
15777i7454B84549I855a54922p5073r5497E4272e2696r7482J5151O6766E0868
15765b03560Q6368E4893b19936B39349C4792J05993c6831k24915A86602F6391
15754a2188l01B50337a70921E747K39366g5905B61457C2917g2215k7859q0197
15743a80271H4830a79566j00974a22683C28878a93852h3588A95710c54746F1379
15732H218b83067E4952a10468B9634c609j72581A41442c9298j186J5626A76873
15720c00937a36848f1349B15164a6884G2255A9807M2566b7505r1644K3565J6342
15709g9242B09304j1660a4595j48290B4209h9069r4856J3710a6633r304B03775
15697a21197C9544J71447j02237C5828J10013E6997B545Q3588L59719b39663d225
$$ plain form
15777 -97454 284549 9855 -154922 -229995 -325492 54272 -52696 -150178 -135027 -68261 50868
15765 -203560 -117192 54893 -219936 239349 34792 140785 -36831 -261746 186602 66391
15754 -12188 -12489 250337 -170921 5747 245113 -75905 261457 32917 -72215 -100074 -180271
15743 -180271 84830 -179566 -280540 -122683 328878 -193852 -83588 195710 -354746 61379
15732 8218 -283067 54952 -110468 29634 -3609 -176190 141442 -39298 -40484 -24858 176873
15720 -300937 -136848 -61349 215164 -16884 72255 19807 62373 -27505 -119149 -95584 -79242
15709 -79242 209304 197644 -14595 -162885 24209 -89069 -183925 -170215 -16633 -25937 203775
15697 -121197 39544 210991 108754 35828 145841 56997 2545 86133 445852 -239663 -4225
15685a46373B28967A02024h1881D5283J96381p0976h1866A22915C0240K6680b90042
15673e8509j0457C01160p8972J44453h6185G5235E198J9262a86600B5894c52167
15661a37646Q854A39195B8766d7776j29120l2233k5951Q52F9165J9952c49828
15649A86201b82637D1788A3649J56683M1054b09357A01298a27520j09947A57363
15638a74918L494n2980a5301A95295b42536R1905o455E4305b72827B91965e1823
15626C07935a08317H8533h1943b2415C9100L62010j82654c8635q1595k4079n0083
15615a94392A11931b11891a2697j00392B24346c10475B2846c8275j71692h3076
15604a51550k43788B32203a5290j03481j33903C89274d23551H1681b28827l1342
$$ plain form
15685 -146373 228967 102024 -81881 45283 241664 170688 -81866 122915 30240 56920 -290042
15673 -58509 -68966 301160 222188 366641 -86185 75235 5198 24460 -186600 25894 -352167
15661 -137646 -128792 139195 28766 -47776 -176896 -209129 -235080 -234228 69165 89117 -349828
15649 186201 -282637 41788 13649 170332 211386 -209357 101298 -127520 -237467 157363
15638 -174918 -171424 -224404 -15301 195295 -242536 -150631 -157086 54305 -272827 291965 -51823
15626 307935 -108317 88533 -81943 -22415 39100 401110 218456 -38635 -120230 -144309 -194392
15615 -194392 111931 -211891 -12697 -113089 224346 -310475 22846 -38275 -209967 -83076
15604 -151550 -395338 232203 -15290 -118771 -252674 389274 -423551 81681 -228827 -260169
15594b60169A22508d50682a62268N8641o7388j34358N2378K0964e0864B87453
15583F2283L8206P0861i3606j75595A26012n7466A3163K31254c22169E9965A1182
15571c42056a40318F825L5441g7876L8597o0728b9329I409a75807L1110e0567
15559h6366E8997d6609G8953b00224N8834A02401c5493A13245a8665l16665f3926
15547a7936B32686E393a84302K7710A11712C6882P4958C666L4246P4441i7799
15535a88013E5868Q2346O1581B0532J2546L5813L9332a72993h4170c0265m6582
15524g6847J8845A96858b46095A95637A1169B343b03157B63279l79j23984A0143
15512B69768A16634b03129A04107J56365N3964k8108b72620B18080o3293C0426
$$ plain form
15594 -260169 122508 -450682 -162268 -103627 -171015 -305373 -252995 -232031 -50864 287453
15583 62283 100489 171350 -93606 -269201 126012 68546 13163 244417 -322169 59965 11182
15571 -342056 -140318 6825 42266 -77876 -39279 -100007 -29329 9409 -175807 -144697 -50567
15559 -86366 58997 -46609 78953 -200224 -141390 102401 -35493 113245 -18665 -335330 -63926
15547 -17936 232686 5393 -184302 -156592 111712 36882 111840 3666 37912 112353 -97799
15535 -188013 55868 138214 199795 20532 33078 68891 108223 -172993 -84170 -30265 -76847
15524 -76847 -58002 196858 -246095 195637 11169 2343 -203157 263279 262900 138916 10143
15512 269768 116634 -203129 104107 260472 314436 286328 -272620 218080 154787 30426
15501D0717L8673b5482B7246a78324B29179E5479J94a89633A41805a09540j05998
15490b15538A29037g2303k47511C39738G652a30760k35015A75359J14119a06477
15479c24719B26545b9344k9811B24382G7653b34308a12354r6662a03929C92103
15468a96903i6151e499n1669n0099A31757P9881a86797f8113A86213B4262a07057
15456a93882A66533a0384j30437b4054A52672k5175h9563B21161l2428h9844B78025
15444b52174h7341j09723j27239a40473D1457O272A7509g2684C22455M450p9051
15433B47854a54388k8644c1041o9659A8159R6560b26701k2262M9484A34039c3885
15421a70489q3639N9449h9721o2903f6462b1382j09367C9854J91570a51182m9529
$$ plain form
15501 40717 79390 -25482 27246 -178324 229179 55479 55673 -189633 141805 -109540 -215538
15490 -215538 129037 -72303 -319814 339738 7652 -130760 -365775 175359 289478 -106477
15479 -324719 226545 -29344 -59155 224382 77653 -234308 -112354 -209016 -103929 392103
15468 -196903 -96151 -5499 -57168 -107267 131757 211638 -186797 -68113 186213 24262 -107057
15456 -193882 166533 -10384 -140821 -24054 152672 127497 -89563 221161 188733 -89844 278025
15444 -252174 -87341 -197064 -324303 -140473 41457 47729 17509 -72684 322455 326905 247854
15433 247854 -154388 -183032 -31041 -100700 18159 114719 -226701 -248963 -199479 134039 -33885
15421 -170489 -254128 -194679 -89721 -152624 -66462 -21382 -130749 39854 231424 -151182 -200711
15410b00711A81757K03046e2375e675j08429C2667J53002a01080L8323A76593
15399b32596a05024b9568A94134o6947m211c89374N0941J64878B38935c57880
15388A94696c6379B46236l2374b12612A46400C9843K00713b2226j5887A11984
15377h153C66413c97195C1904b08743l2401A1403e40590B59788b06536m2892a8270
15365D4211B1402g2007J2158J0161n9701j36229B5232N5636b0265C6623L8549
15354G5172b1294q2681I1307l4941b57789B6525l106J0184b53390A22507b81581
15342B566J97225a41453B39263J542b6687j46873E08340E3650D631a24187l3378
15331a57565A83717l4801i0019B49712A1419d0905r7453A01990l3905l3099a66228
$$ plain form
15410 -200711 181757 384803 -52375 -5675 -114104 32667 185669 -101080 -62757 176593
15399 -232596 -105024 -29568 194134 127187 122976 -389374 -338433 -173555 238935 -357880
15388 194696 -36379 246236 213862 -212612 146400 39843 240556 -22226 -38113 111984
15377 -8153 366413 -397195 31904 -208743 -241144 11403 -540590 259788 -206536 -249428 -18270
15365 44211 21402 -72007 -59849 -49688 -109389 -245618 25232 80868 -20265 36623 75172
15354 75172 -21294 -103975 91307 56366 -257789 26525 23419 33603 -253390 122507 -281581
15342 2566 199791 -141453 239263 240805 -26687 -173560 508340 53650 4631 -124187 -157565
15331 -157565 183717 148916 -90019 249712 11419 -40905 -138358 101990 68085 34986 -166228
15319b60287A74217K134n2570b30746i9949M5080B10414b76184j497g8033A36880
15307A6316d4407i335j7005C5054j1127K38007d5325j18958I6476i5594A85360
15295c4572E56b70868g5628H1654B3213e4601A61900b9512o6954k860B4390g9782
15282i9968L875A54480c42011A6810h66G1909B69K44862K74062a33018l7208B66254
15269b52822A17542g7537D6306L0704k0990N5032a48795B45821a51030D54101
15258D8844K22833a6619A36543i6752K550K135o8624b9147o6833C78276R67989
15247A346265L72146p32592O64794p02899D36344B00600a28978N048Q776d7978
15236A13024N5040o8431K8120A0589K84088d3742H4170o679k1364J53493c36439
$$ plain form
15319 -260287 174217 176351 123781 -230746 -99949 -54869 210414 -276184 -277681 -78033 136880
15307 16316 -44407 -9335 -26340 35054 23927 261934 -45325 -164283 96476 -95594 185360
15295 -34572 556 -270868 -75628 81654 23213 -54601 161900 -29512 -96466 -99326 24390 -79782
15282 -99968 -96093 154480 -342011 16810 -866 71909 269 245131 519193 -133018 -170226 266254
15269 -252822 117542 -77537 46306 77010 56020 111052 -148795 245821 -151030 454101
15258 48844 271677 -16619 136543 -96752 -94202 -92067 -160691 -29147 -95980 378276 1346265
15247 1346265 1718411 985819 1650613 947714 436344 200600 -128978 -123930 -115154 -47978
15236 113024 168064 99633 127753 10589 294677 -43742 84170 77491 56127 209620 -336439
15224B73062C0509J29799g0949B5066L76095A59588L2256n6700o4442l5043a20243
15212a26775B49397P5598M7412i4943E5606K31345d205D6300a79000D5512j113
15201D4399g6741l1533k2384j598B53814b13339B5155K10594i1175H0004R9415
15190A79419i9529B65865d34274A84895k2707b452B40671g6436A67069p1219b26335
15178B0207p342a15973F9680J56857L4550J03718C8779a6406O726D23759A84193
15166C45259A44596l8014h3412I1246c63793i4017E1622M6287L26621A27573J05758
15155B33331L823o0414F1472a35007A03402M2427M3320B3750a20170j40752I6818
15143a18264A49436M225F1541a91313m2970D1642a660A49115c55680D77633D1544
$$ plain form
15224 273062 30509 160308 -70949 25066 401161 159588 191844 135144 70702 35659 -120243
15212 -126775 249397 324995 372407 -94943 55606 286951 -4205 46300 -179000 45512 44399
15201 44399 -76741 -108274 -130658 -132256 253814 -213339 25155 235749 -91175 80004 179419
15190 179419 -99529 265865 -434274 184895 162188 -2452 240671 -76436 167069 95850 -226335
15178 20207 12865 -115973 69680 226537 261087 364805 38779 -16406 -9680 423759 184193
15166 345259 144596 106582 -83412 91246 -363793 -94017 51622 97909 424530 127573 233331
15155 233331 237154 176740 61472 -135007 103402 145829 189149 23750 -120170 -260922 96818
15143 -118264 149436 153661 61541 -191313 -234283 41642 -1660 149115 -355680 477633 41544
15131A06144b2479o2309H633h0823G4751g1012A84861J2815a42592J0421A06629
15119d0332C38192D4689J8979l1053a14302A42166Q6447c2089k37799I2555Q9894
15108A82449a7386C7344b36338A01913R8639G8944l3716J44010o8489h9171a7309
15096B35384b23813B23582o3031F056L7269L0387B2813L6091J74831D3380K68552
15085C11932A41394a11235k5387C56112b35395E00546k49589q6950K9473k1740
15075A71740j7296a07729j23523J12115A77860n3613J05209J11555r4504c1984
15064A20463L0348N8021J3864f2472B11738B5157K80857c6869B5082J11032b9703
15052C07379q6977N0513n0790J29157m1867m7997a5860A66873b88834A72989L7185
$$ plain form
15131 106144 -22479 -84788 8633 -80823 74751 -71012 184861 197676 -142592 -132171 106629
15119 -40332 338192 44689 63668 32615 -114302 142166 228613 -32089 -269888 92555 182449
15108 182449 -17386 37344 -236338 101913 200552 78944 45228 189238 120749 -89171 -17309
15096 235384 -223813 223582 160551 6056 43325 73712 22813 58904 233735 43380 311932
15085 311932 141394 -111235 -136622 356112 -235395 500546 250957 164007 193480 171740
15075 171740 154444 -107729 -231252 -119137 177860 124247 229456 341011 246507 -31984
15064 120463 150811 208832 222696 -62472 211738 25157 306014 -36869 25082 136114 -29703
15052 307379 220402 270915 220125 349282 307415 259418 -15860 166873 -288834 172989 210174
15041B10174K5901p6922o7789C1722J8531a43729B34166m7176K07808A41502f4102
15029C3954K26840a15314B43315a07007B28209l3625C9808Q8723J07232J26305
15019C62068G5293K74012a40033A33887b6673B13856g612A29217L8843J25702
15009B93762r8366J90629j49398o655J87347D9269J9307a51511A12515J55332
14999B67847c1648A26537N0600J83697A71844j4989R400N4919j1791R4287q807
14988B94863K63691k78318p4812E2118k0588L92730E611K74724p7321g2188A55869
14976A31535D0362M53016B34898j09470a8445C55023n0549k3699j39766M08437
14966E49446A8601K59214F0111K24948A3853c6155A54475K47465m2037A14021
$$ plain form
15041 210174 236075 159153 91364 31722 50253 -143729 234166 186990 394798 141502 -64102
15029 33954 260794 -115314 243315 -107007 228209 194584 39808 128531 235763 362068
15019 362068 75293 349305 -140033 133887 -26673 213856 -7612 129217 168060 293762
15009 293762 195396 386025 236627 229972 417319 49269 68576 -151511 112515 267847
14999 267847 -31648 126537 177137 360834 171844 156855 166255 221174 209383 303670 294863
14988 294863 558554 280236 205424 52118 31530 424260 5611 280335 203014 -72188 155869
14976 131535 40362 493378 234898 125428 -18445 355023 304474 280775 141009 549446
14966 549446 18601 277815 60111 285059 13853 -36155 154475 401940 359903 114021
14955C56460A46277K33053g6852D89125a13138A00615K50311P4327K5983Q8783
14945E40019F8175N9428c7574A73642J7871J91702K7976j95305I2762i6170D30605
14933D36677A92568O299b18087A05131M77725k17793K33394a96196H1824K27607
14923C09431O477K06830F3692Q3060k365L78287H7527j257K81686h0607D9324
14911F18785k86931r1485N6136M7936O8308j49776J28462l5444l5733j54213K83048
14900D49093A64048J88936L7454j06049K94591o1188A33951K21984M34J30774
14890D87143A04906K03034j28322K12143j01950R8425J9971K01455B89056j41523
14880A47533k7876L75557B15532L81667B58804l7154C3892J91529J48276m2607
$$ plain form
14955 356460 146277 379330 -76852 489125 -113138 100615 350926 425253 451236 540019
14945 540019 68175 127603 -37574 173642 191513 383215 411191 215886 92762 -96170 430605
14933 436677 192568 198867 -218087 105131 582856 365063 598457 -196196 81824 309431
14923 309431 315908 522738 63692 146752 144387 522674 87527 86270 367956 -80607 49324
14911 618785 331854 240369 296505 344441 412749 262973 391435 355991 320258 166045 449093
14900 449093 164048 352984 390438 284389 578980 517792 133951 355935 356369 487143
14890 487143 104906 307940 179618 391761 289811 388236 408207 609662 289056 147533
14880 147533 119657 495214 215532 597199 258804 221650 33892 225421 373697 331090
14870C31090f865C63753m1216G1134M39579A87444E7856L53830D0771L03586m3634
14859C00723A38013L43074I7214M9398J87978j57417l1654K83146J63122r2525
14849D99262j67592L77080B68071J68702A15715L23372k9840N9598o5670r0989
14839C12186K48995j3379j50127k2454q3506g4800C25213j27703K53605j909L09951
14828G59157k83255E2633O64490j29560j5562j53009j457A41729J59605K48973
14818E50307p4078j91055J43774j97771L48725l5467O739k12986L3680M5866R4023
14807E11757K5273k57675L78034j00474j97637A28436O24860k80896L3306k49751
14797B55955q1176M35343j38236L59547k56842k36832j68396N56800k18503k17385
$$ plain form
14870 331090 -6865 363753 322537 71134 510713 187444 57856 411686 40771 344357 300723
14859 300723 138013 481087 97214 146612 334590 177173 145519 428665 591787 499262
14849 499262 331670 708750 268071 436773 115715 439087 409247 468845 403175 312186
14839 312186 561181 547802 397675 375221 291715 -74800 325213 197510 451115 449206 759157
14828 759157 475902 52633 717123 587563 572001 418992 417535 141729 301334 550307
14818 550307 476229 285174 428948 231177 579902 544435 551174 338188 371868 417734 511757
14807 511757 537030 279355 657389 556915 359278 128436 753296 472400 505706 255955
14797 255955 174779 610122 471886 831433 574591 337759 169363 726163 507660 290275
14787B90275J37202j65319j30917O17034N3652q1074j80933j71284J39840o5638
14777D42838K84594j82967Q0129A11781N80007k67387J32183j48560L35081j63592
14767E79513O132J67249k67599J57707j01122L4254J27821O3378k31091K13804
14757G50046K5754C43199L20674j78943j30055L72787k34715J42153L6202R5016
14747G66318l28306R2413j6111R2593o1310K9923N0624q8126N41216E21500J55279
14736F76779K50048l81929j55078M56956j25588l44971K39147K36403m03909J10738
14726E58596K92411l84955K1780J17838K8947k0771K26704k20166K5264j43978
14716E01670J68546J00528M1057q2766p2391K56228j36882l9204K1687m7515J18429
$$ plain form
14787 290275 427477 262158 131241 748275 801927 720853 539920 368636 508476 442838
14777 442838 727432 544465 624594 111781 691788 424401 556584 408024 743105 579513
14767 579513 585645 752894 485295 643002 541880 576134 703955 767333 536242 750046
14757 750046 775800 343199 663873 484930 354875 727662 492947 635100 671302 766318
14747 766318 438012 530425 514314 606907 545597 575520 626144 538018 1079234 521500 676779
14736 676779 926827 544898 389820 846776 721188 376217 615364 851767 447858 558596
14726 558596 851007 466052 487832 605670 634617 613846 840550 620384 645648 501670
14716 501670 670216 770744 811801 729035 656644 912872 775990 736786 758473 710958 829387
14705H29387j27092o6275M83399l32439P7307j90493k04186K51975J16546l30447
14695E07682J46855L69622k65490r5925O6619j51749M46184k93132J90823k14569
14685G06920K03788J7617j47207p3468M4820K67490n5003K32154l03978m4417
14675H48716L4882J42286n0937m0450K10743j95103j17712J32035k05030j75879
14665E83551L92275j63563J89616J32543l6110m50409l3332M31701k12591k8539
14655H05142l012L42202k82488L71392j50227N9150j19918m6511J09386j25676
14645I59440J33268K44481k24878j16021J65873k04463L0476K49161k68178m0322
14635I28837M61650k58942l61413J83593L27487K359j72581J60406j98723J95193
$$ plain form
14705 829387 702295 636020 1119419 786980 864287 673794 469608 721583 838129 507682
14695 507682 654537 1024159 758669 662744 729363 577614 1023798 730666 921489 706920
14685 706920 910708 928325 781118 707650 752470 1019960 964957 1197111 893133 848716
14675 848716 883598 1025884 974947 934497 1145240 950137 832425 964460 759430 583551
14665 583551 975826 812263 1001879 1134422 1098312 647903 614571 1046272 833681 805142
14655 805142 802130 1144332 861844 1233236 1083009 1142159 1022241 975730 1085116 959440
14645 959440 1092708 1337189 1112311 996290 1162163 957700 988176 1237337 969159 928837
14635 928837 1390487 1131545 770132 953725 1281212 1283571 1110990 1271396 1072673 1267866
14625A267866j99022J21445p1283J35111O8849j17452M2034J4136Q5872J6316
14615A363872j23677n7945k21809K43200N89622l01391j7936o5178k26964J45330
14605A327124J96239k86778N8269J52847p5343J12100j96258r4080M68328p4552
14595A587896k25851L71324o36179L11716K4043L13567k7774n2048l69627L25875
14585A622942n5857K26221n11165L07637p5859L7616M36309m05504J62696Q8134
14575A833170j92861K22279o944n9523J85421J06653J893q5188M6100J57710l40117
14564A868593K45726n8796J88046P6072M29111l63480K10391o2586R218J51414
14554B693709l9632O61874P1011P15925M32464K352843L515264Q499462J8874560
$$ plain form
14625 1267866 1068844 1190289 1119006 1254117 1322966 1205514 1247548 1261684 1347556 1363872
14615 1363872 1240195 1182250 960441 1203641 1793263 1491872 1473936 1408758 1181794 1327124
14605 1327124 1523363 1236585 1294854 1447701 1372358 1484458 1288200 1194120 1662448 1587896
14595 1587896 1362045 1733369 1097190 1408906 1432949 1746516 1718742 1666694 1297067 1622942
14585 1622942 1567085 1793306 1282141 1589778 1513919 1551535 1987844 1582340 1745036 1833170
14575 1833170 1640309 1862588 1855644 1796121 1981542 2088195 2090088 2004900 2051000 2208710 1868593
14564 1868593 2114319 2055523 2243569 2319641 2748752 2385272 2595663 2533077 2542295 2693709
14554 2693709 2654077 3315951 3386962 4102887 4535351 6888194 10403458 18902920 37777480
14545C7777480Q240662B0160651H474278C515439j084585k42595m80053j36083
14537A572123j50884L13821n7076j06425K19061J37339k73409L47762j93976K30481
14527B038817j34911L60915l93533J76051K15314l01549L72835m46884L97649
14518B284704R2760m96043J69655J45008N8694K50067j27687K61228j61329M7379
14508B524436k90683O06453l99320J76722L08108m82624K01208j15733K79767
14499B808334l44062L27681L9437R7493k06135M21163m99362M48469L20735j87783
14489C225970k5978l87050J69811M22480j99650j60342L12749J68527j54675J63450
14479C535292k22039L16143j17149J99304k20491K72243l11273J71268O2727k96193
$$ plain form
14545 37777480 46018142 20160651 8474278 3515439 2430854 2188259 1708206 1572123
14537 1572123 1421239 1735060 1677984 1571559 1790620 1927959 1654550 2002312 1808336 2038817
14527 2038817 1903906 2264821 1871288 2047339 2262653 1961104 2333939 1887055 2284704
14518 2284704 2377464 1881421 2051076 2196084 2254778 2504845 2377158 2638386 2477057 2524436
14508 2524436 2233753 2840206 2440886 2617608 2925716 2443092 2644300 2528567 2808334
14499 2808334 2464272 2791953 2831390 2928883 2722748 3143911 2644549 3093018 3413753 3225970
14489 3225970 3199992 2812942 2982753 3405233 3205583 3045241 3357990 3526517 3371842 3535292
14479 3535292 3313253 3629396 3512247 3711551 3491060 3763303 3452030 3623298 3686025 3389832
14469C389832N56320l54324L45767J13235O9908j02o5702J79165o4888k26276
14459C942935M46597j42785P1807K2087J9673K30682o646J64406n3178K62831
14449D958409k04783l22665O41912p8643J33520k39119K42947o2941M64278r1822
14439E441093R4523j01768j64764N40037J21898j03007L54494k57797j05581j30383
14429E688745L59458k66221M05726K34102j58985J93068J50614M12726n22783
14420F496450N3150N85872m4491R9712M48617j79551j9978K71241l41322N23837
14410G893537K95609J27256k12019L45224J36089k74014L1341L89159J29220m8750
14400H812652L71892K04829J93768j1564L64714J3623L43144k4228K52776n4833
$$ plain form
14469 3389832 3946152 3591828 3937595 4050830 4120738 4120636 4054934 4234099 4169211 3942935
14459 3942935 4389532 4246747 4318554 4340641 4360314 4590996 4584350 4748756 4695578 4958409
14449 4958409 4753626 4430961 5072873 4994230 5127750 4888631 5131578 5068637 5532915 5441093
14439 5441093 5535616 5433848 5269084 5809121 5931019 5828012 6182506 5924709 5819128 5688745
14429 5688745 6048203 5781982 6187708 6421810 6262825 6455893 6606507 7019233 6496450
14420 6496450 6549600 7135472 7090981 7190693 7639310 7459759 7439781 7711022 7369700 7893537
14410 7893537 8189146 8316402 8104383 8449607 8585696 8311682 8343023 8732182 8861402 8812652
14400 8812652 9184544 9389373 9583141 9571577 9936291 9949914 10293058 10268830 10521606 10466773
14390A0466773N89540K22112k61511K32594J5959K68623N37438J76251N51562
14381A2799341J7156N2166J13253L23183J86124M44672R2956P63538J42106L23956
14371A5258451N5794K71596N05426K83265j04176M76950L82994N64570N53370
14362A8248240P3381M73899M69892N61187L97011Q2545M19623P64421K996R16665
14352B2409860K85001P82236O22070M55377O43993O19449P00475M98567R58418
14343B7975446P68757P14246R33394N68209L71172J309308O89650J226959R23136
14334C5480277R85764J371399P31399J378964J244811J199406J217472J383468
14326D4992960J473428J981885J284412J830100J821931J796158J925406J951824
$$ plain form
14390 10466773 11056313 11278425 11016914 11249508 11265467 11534090 12071528 12247779 12799341
14381 12799341 12816497 12868663 12981916 13305099 13491223 13935895 14028851 14792389 14934495 15258451
14371 15258451 15314245 15585841 16091267 16374532 16270356 16747306 17130300 17694870 18248240
14362 18248240 18321621 18795520 19265412 19826599 20223610 20306155 20725778 21490199 21493195 22409860
14352 22409860 22694861 23477097 24099167 24554544 25198537 25817986 26518461 27017028 27975446
14343 27975446 28744203 29458449 30391843 30960052 31331224 32640532 33330182 34557141 35480277
14334 35480277 36466041 37837440 38568839 39947803 41192614 42392020 43609492 44992960
14326 44992960 46466388 48448273 49732685 51562785 53384716 55180874 57106280 59058104
14318E9058104K668799K001051K315590K648389K764527K548151L225182K836537
14310H0066330L449028L878375L598939L787626M411677M568906M320733N344296
14302A13425910N189319N975103N643434O882755O901283P213483Q110540Q236572
14294A67578399R244126R102782J0215474J0840204J0957059J2191357J2627140
14287B42756541J3427968J3811317J4378021J4875174J5690372J6043360J5779547
14280C46762300J5964055J6007926J5623010J4308379J3434311J1871150J0027562
14273D43998693O450034K535947R53917J034428J63507j870183l609906o108741
14265D43547696r661841j1541166j2711825j4624483j5275051j6063639j5965075
$$ plain form
14318 59058104 61726903 63727954 66043544 68691933 71456460 74004611 77229793 80066330
14310 80066330 83515358 87393733 90992672 94780298 99191975 103760881 108081614 113425910
14302 113425910 118615229 124590332 130233766 137116521 144017804 151231287 159341827 167578399
14294 167578399 176822525 185925307 196140781 206980985 217938044 230129401 242756541
14287 242756541 256184509 269995826 284373847 299249021 314939393 330982753 346762300
14280 346762300 362726355 378734281 394357291 408665670 422099981 433971131 443998693
14273 443998693 450448727 452984674 453938591 454973019 455136526 453266343 449656437 443547696
14265 443547696 433885855 422344689 409632864 395008381 379733330 363669691 347704616
14258C47704616j6557516j5853030j6100289j4899009j3612688j3867122j3794790
14251B43020172j2828900j2074298j1317908j0894610r985269r479227q651680
14244A67788280q169408p935698p298771p240764o512997o141030n344914n316506
14236A13828192n513427m834611m168334m544721l697029l003937m054711l445858
14228H0565564l190650l074555k777527k947164k606820k157613k336036k315660
14220E9159539j907613j820545j965401j905254j745201j567602j194265j381651
14212D5672007j641660j319420j561139j354814j296727k11992j075385j132483
14204C6078387j500281p61561j136833m86492r03077r38885j073132o85017o19730
$$ plain form
14258 347704616 331147100 315294070 299193781 284294772 270682084 256814962 243020172
14251 243020172 230191272 218116974 206799066 195904456 185919187 176439960 167788280
14244 167788280 159618872 151683174 144384403 137143639 130630642 124489612 119144698 113828192
14236 113828192 108314765 103480154 99311820 94767099 91070070 88066133 84011422 80565564
14228 80565564 77374914 74300359 71522832 68575668 65968848 63811235 61475199 59159539
14220 59159539 57251926 55431381 53465980 51560726 49815525 48247923 47053658 45672007
14212 45672007 44030347 42710927 41149788 39794974 38498247 38286255 37210870 36078387
14204 36078387 34578106 33816545 32679712 32193220 31290143 30351258 29278126 28593109 27973379
14195B7973379p33526m67197p70017q63204k75254m03523j241973m17723l35229
14186B2465733p10576j59427p77954m49385l46613p63418l52652j75540n25003
14177A8205165j33637l45451k37292q57148k72930k8450n66514k50436l26281
14168A5187026m22917k55110j14888j43317m21787j97117j97519k54982R9741
14159A3279130n35438o19161K27277n59621K42310o75782J655l04033j03872k28872
14149A0723593P9724l20517l71420j1819L27024m93705n46198l49270K06579J26400
14139I370391l81224J21776j56595k78302j77174j54347k60919O4014K89258j38022
14129H298856p57142N87519p09426K32795k85668M4427l34046J89710m7261m69949
$$ plain form
14195 27973379 27239853 26772656 26002639 25139435 24864181 24460658 23218685 22800962 22465733
14186 22465733 21755157 21595730 20817776 20368391 20021778 19258360 18905708 18730168 18205165
14177 18205165 18071528 17726077 17488785 16631637 16358707 16330257 15763743 15513307 15187026
14168 15187026 14764109 14508999 14394111 14250794 13829007 13631890 13434371 13179389 13279130
14159 13279130 12743692 12124531 12351808 11792187 12034497 11358715 11360370 11056337 10952465 10723593
14149 10723593 10803317 10482800 10111380 10099561 10426585 9932880 9386682 9037412 9243991 9370391
14139 9370391 8989167 9110943 8954348 8676046 8498872 8344525 8083606 8147620 8436878 8298856
14129 8298856 7541714 8129233 7419807 7652602 7366934 7411361 7077315 7267025 7219764 6749815
14119F749815l6044K10488l82026R2404k86361L67262n02647P9737J7583k36760
14109F073451j85566K17972l53617k10843J15270Q8417j21901O0825K55j46485
14099E537778l76617M3011R2025P9572j98991K39282n03073K67446j87977m88870
14089D503586J54601J50871k87184m3127k21192K62981j9532Q3821j41522k34308
14079D208995k35785J8802L06640r2110N314j28623m9620k56498R372j42306q871
14068C635310K19650L7548k84441K79690J47484m86485J35921o0398J08207j27209
14058C605277k02924M36609j23756l77528O1770n9412K5519Q0222P9104k15310
14048C309571J17318m71018J59102l45453j12242J2385K55052p7716l8791J41311
$$ plain form
14119 6749815 6713771 6924259 6542233 6634637 6348276 6715538 6212891 6292628 6310211 6073451
14109 6073451 5887885 6105857 5752240 5541397 5656667 5745084 5623183 5684008 5684263 5537778
14099 5537778 5161161 5204172 5296197 5375769 5176778 5416060 4912987 5180433 4992456 4503586
14089 4503586 4658187 4809058 4521874 4478747 4257555 4520536 4501004 4584825 4443303 4208995
14079 4208995 3973210 3992012 4298652 4206542 4211856 4083233 4033613 3777115 3786487 3644181 3635310
14068 3635310 3854960 3892508 3608067 3887757 4035241 3548756 3684677 3624279 3732486 3605277
14058 3605277 3402353 3838962 3715206 3337678 3399448 3340036 3365555 3445777 3524881 3309571
14048 3309571 3426889 2955871 3114973 2769520 2657278 2669663 2924715 2846999 2808208 2949519
14038B949519j22862k7895j06001j8338J3135Q6541j90115K32708K6249K8370
14028B871311k54383k7656R3365j42046k76940K80600l80362M12323j13680n8453
14018B404079L2883J76230m43578m568n5685J58440P803P1819l82933J71426j08553
14007B027363K56267k84146J94877K2281j66756r6099j6929K75862k08269j30172
13997A874279k45354n6337K72875l0013l97588O46682k90188Q24943N07190K771106
13987E877595O905246J7931369J7037434B3836121A1303381m198145k151573p71051
13979D182612l57184o28150k19327j99662k51232J94079j72140m69697L41064
13970B420363k79394j39582j31007J56987q4474P7837K21040k65668P2037j32608
$$ plain form
14038 2949519 2826657 2798762 2692761 2674423 2687558 2774099 2583984 2816692 2842941 2871311
14028 2871311 2616928 2589272 2682637 2540591 2263651 2544251 2163889 2576212 2462532 2404079
14018 2404079 2436962 2613192 2169614 2165046 2109361 2267801 2275604 2347423 1964490 2135916 2027363
14007 2027363 2283630 1999484 2194361 2216642 2049886 1953787 1936858 2212720 2004451 1874279
13997 1874279 1628925 1572588 1845463 1815450 1417862 2064544 1774356 2599299 3106489 5877595
13987 5877595 12782841 30714210 47751644 23836121 11303381 7105236 4953663 4182612
13979 4182612 3825428 3197278 2977951 2778289 2527057 2721136 2548996 2079299 2420363
13970 2420363 2140969 2001387 1870380 2027367 1942893 2020730 2241770 1976102 2048139 1915531
13960A915531K29161k20879J19557p14003K20631J59926R8735L04819n12153L05460
13950A906785l6402l85516j19473K65533L34392j9956k81450j16890M70198j28516
13940A888705m78481j57560L21010j59295K62981M9144l80971l22905M45281l0497
13930A437412l87978K79214K78824K62287o7149o81016K67929k18177j30225L70973
13920A412094k26919K14549M8304p916l61780J85341k0065k20030L29806k87414
13910A065970L24905l40679Q8412k8208J47407J84171k77761j43257L92812k77950
13900A135822j912K12732n48219M30426j69303n1849l4683K76800j75743n7481
13890A016590K06292k68802J49577J47465l38926J14821m85237P50123j92651
$$ plain form
13960 1915531 2144692 1923813 2043370 1329367 1549998 1709924 1808659 2113478 1601325 1906785
13950 1906785 1870383 1484867 1365394 1630927 1965319 1945363 1663913 1547023 2017221 1888705
13940 1888705 1410224 1252664 1573674 1414379 1677360 1726504 1345533 1022628 1467909 1437412
13930 1437412 1049434 1328648 1607472 1869759 1802610 1121594 1389523 1171346 1041121 1412094
13920 1412094 1185175 1399724 1448028 1440112 1078332 1263673 1243608 1023578 1353384 1065970
13910 1065970 1390875 1050196 1138608 1110400 1257807 1441978 1164217 1020960 1413772 1135822
13900 1135822 1133910 1346642 798423 1228849 1059546 1007697 973014 1249814 1074071 1016590
13890 1016590 1222882 954080 1103657 1251122 912196 1027017 541780 1291903 1099252
13881A099252j34012L10486j62763p5311P8618Q5552n70200K02957K55227J05836
13871A195642R1299k98970r5301j26856Q5704K49265k19605J51663l15650M26540
13861A143731l33762Q7369O4699K44698E26044N44942m2356j73192m7223m3431
13851G64784j65855J58977m8228K12784k4915M02976m17135K90431l85143K48675
13841A037351m29725Q2800K20487j44103J04735L30568l71579J94715J94047E13666
13830H24611k87347L78791l52425M6766L1009J87155K42703k05122k5580K32667
13820A073228m60757P3297j7615K72979l29881M17734k38727K18266k94197K51615
13810I65942l08150l944J70518J8264o0549m2674k23711M02173k47258j07427
$$ plain form
13881 1099252 965240 1275726 1112963 1037652 1116270 1201822 631622 834579 1089806 1195642
13871 1195642 1286941 987971 892670 765814 851518 1100783 881178 1032841 717191 1143731
13861 1143731 809969 897338 962037 1206735 526044 1070986 1028630 855438 808215 764784
13851 764784 598929 757906 709678 922462 897547 1300523 883388 1173819 788676 1037351
13841 1037351 607626 690426 910913 766810 871545 1202113 830534 1025249 1219296 513666
13830 824611 537264 916055 563630 610396 641405 828560 1071263 866141 840561 1073228
13820 1073228 612471 685768 668153 941132 611251 1028985 790258 1008524 714327 965942
13810 965942 657792 653848 824366 842630 782081 739407 515696 917869 670611 563184
13800E63184k36K43775j66743M13722k45963j9082l1012l6208Q5187Q4581D41726
13788E42276K6006j78978N12181J26110l00359k44500Q3414L3192k31768M55987
13778H23561l15759N42886m40717j6792L20096D49990k00415M07703K13126N1072
13768I21476C84998N30121l06774j17949M2272L15620l66082L26141j75249j21151
13758E11947K0655j12478K83058K4466l2342p3235J33707q1261j39781j80962
13748C53774J75307j37453J73830j08594K60765q8617N5449B79537M52293k09499
13738E22331A25385N40697B97329K76942k9797k12995K75155K9253m3239B90162
13727H37914l28103j676P7292J10923j87962J64827k04517j5892Q6192r4726O8587
$$ plain form
13800 563184 562948 806723 639980 1053702 807739 788657 757645 721437 806624 891205 441726
13788 542276 568282 389304 901485 1027595 727236 482736 566150 599342 367574 823561
13778 823561 507802 1050688 609971 593179 913275 449990 249575 657278 870404 921476
13768 921476 384998 915119 608345 490396 532668 848288 482206 808347 633098 511947
13758 511947 532602 420124 703182 727648 695306 622071 755778 674517 534736 353774
13748 353774 529081 391628 565458 456864 717629 629012 684461 279537 731830 522331
13738 522331 125385 666082 297329 574271 544474 331479 606634 635887 592648 290162
13727 837914 509811 508135 585427 696350 508388 673215 468698 452806 538998 444272 512859
13716E12859m3931K278B08196K56754j0703J88588r8887j10307p6835M32744C65382
13704F49156k02336J1351K41879k84749D7992O82810k61856P7069j56684j53066
13694B36265C5N14760j96633L38338A26709N09239l04697K05231K1952O724j01754
13683D63404k07418J53410J16674j33073J44887j38569R6639O726j38654j5493
13673C48533K27141Q1628q8090A12704K37411K08007q5506L809O0598k07562O7596
13662C97057P386J33091A28255L27843j48952J58413L529B08064K62944o4807
13652D06201K01025A83803L88836B14035J6528M52981l04980P6239L3965K3527
13642E12295j66960q4577L33935j76214A80259J73964p2353K19510B23472L18792
$$ plain form
13716 512859 468928 471206 208196 464950 454247 642835 543948 433641 356806 789550 365382
13704 649156 446820 458171 700050 415301 47992 730802 468946 546015 389331 236265
13694 236265 35 514795 318162 656500 126709 635948 331251 536482 558434 565158 463404
13683 463404 255986 409396 526070 392997 537884 399315 495954 502680 364026 348533
13673 348533 575674 657302 569212 112704 350115 558122 472616 476425 537023 329461 397057
13662 397057 404443 537534 128255 456098 307146 465559 469088 208064 471008 406201
13652 406201 607226 183803 572639 214035 230563 683544 378564 454803 488768 512295
13642 512295 345335 260758 594693 418479 180259 354223 281870 501380 223472 542264
13632E42264j10703n7576R623J21998A57622K76373f615B38292o942A04003K41296
13621C45299m0859n9996J45864K27926A29873K20101J28504Q494G4780L19180
13611C93960J11034F2562L09817J3822r2477A09298M56559A71747K49616B01265
13600H6947N20572I5852N92785G5453K79811J58684J02606J01583A41933L6361
13590A78294m1879J19012a16075D2180K35876o2340l3013J34498J74792A996K13478
13579B15474n5781L17674o9118K2158E2567L87068O0072m1807A39308J15831C212
13567C18183c8941A98441K62333A55307K68902k03892C9903a02999B64083m6350
13557B17733J19900N809J08460j40203J57873A65036E0338L53041J7560j66664
$$ plain form
13632 542264 431561 373985 383608 505606 157622 433995 -6615 238292 231350 104003 345299
13621 345299 304440 244444 390308 618234 129873 349974 478478 486972 74780 393960
13611 393960 504994 62562 372379 386201 293724 109298 565857 171747 421363 201265
13600 86947 607519 95852 688637 75453 355264 513948 616554 718137 141933 178294
13590 178294 136415 255427 -116075 42180 278056 215716 182703 317201 491993 1996 215474
13579 215474 159693 477367 408249 430407 52567 439635 499707 457900 139308 255139 3212
13567 318183 -38941 198441 460774 155307 424209 220317 39903 -102999 264083 217733
13557 217733 337633 343442 451902 311699 469572 165036 50338 403379 420939 254275
13547B54275J2779F9366M4650c8542B23507N3669J00123j32638O2828M0452C2362
13535C21900n1057J66417A41684b10420E7015K37096J2040j6061C9489L70207
13525D09696n3853k4405K02363k03361A16377L15617F4120K79261j01122a71338
13514B48893b9022C68205b63451B61433A19475k7762a07994C77711A35738J69728
13504C05466l602j4944j06689R2681K0011K46908B57966C0245J4557b32352I147
13492B63797q256q5404J83556L5283K25762r5425H1968K39779n3283L01259B5688
13480B73863J52450j73463g6291B40762n940K6278C5560O3119m352g6175A02634
13468A60140C4423L12594q6745B2189K70064K12612j81192K3039A37538O1681
$$ plain form
13547 254275 267054 69366 114016 -38542 223507 277176 377299 244661 307489 347941 32362
13535 321900 270843 437260 141684 -210420 57015 294111 306151 290090 39489 409696
13525 409696 355843 331438 533801 330440 116377 431994 64120 343381 242259 -171338
13514 248893 -29022 368205 -263451 261433 119475 91713 -107994 377711 135738 305466
13504 305466 301864 286920 180231 272912 292923 539831 257966 30245 44802 -232352 9147
13492 263797 255541 170137 353693 388976 614738 519313 81968 321747 268464 569723 25688
13480 273863 426313 252850 -76291 240762 234822 261100 35560 98679 94327 -76175 102634
13468 160140 34423 347017 260272 22189 292253 504865 323673 346712 137538 199219
13458A99219a13648H2497L96524L3532j76508a63769C83101N9838A20480J93112
13448C13592A33055K01257j39838J98111j40346G8286L21398j16929m1289e8639
13437A10425K08055G9033a09879H6989j9831K4103B8200K48867m3625L5026P2721
13426C41189n990j6739n93J43413C455L03549A37543J70842A45856h6026A40198
13414A56393E6579K27787J09096B8206P7313D0153J72884D9719J98714a3793A14775
13402D61499j79525r5432B9556K69075j10372J13255k6610C4096Q0475a26614
13391A36320p870L69816B31984q1605n4437K76178A03185c5455A77483J18418
13381B95901j16700L2605J08023j21051a32052B13063R4262d1077B7366M34010
$$ plain form
13458 199219 -113648 82497 479021 512553 336045 -163769 383101 442939 120480 313592
13448 313592 133055 334312 194474 392585 252239 78286 399684 282755 241466 -58639
13437 110425 318480 79033 -109879 86989 67158 91261 28200 277067 233442 268468 341189
13426 341189 335199 318460 317867 461280 3455 307004 137543 308385 145856 -86026 140198
13414 156393 56579 284366 393462 28206 105519 40153 213037 49719 248433 -13793 114775
13402 461499 281974 186542 29556 298631 188259 301514 274904 34096 114571 -126614
13391 136320 128450 498266 231984 150379 95942 372120 103185 -35455 177483 295901
13381 295901 179201 211806 319829 198778 -132052 213063 307325 -41077 27366 461376
13371D61376B22443K93708p6046G5133M21502k21845J85403I1729k2037J60530
13361B30222L443J28655j59961J89568A31161Q6894j03627B5163K50872b12385
13350G532K73296m6929K08770A77599M2064N9239o7235I3010D5114M98239B55438
13338C28869j33409K28957j10085J21163F7967L4182K7569P6486F2023J19743
13328A81766J33957a42868B46376G0021J36881c3737C31734d7855H2597h7720
13317A25025d88C44453n8239n1901l728F0561J42538A0165J04051A8499L71260
13306C89759k7183b3479n4354A06747N5844J58551K8354I3250K5662M3953F235
13294d4743I1320r045Q3437N0499A9747M13439a15524C6329L15666A07836M2679
$$ plain form
13371 461376 222443 516151 440105 75133 496635 274790 460193 91729 69692 230222
13361 230222 233665 362320 202359 391927 131161 218055 114428 25163 276035 -212385
13350 7532 280828 233899 442669 177599 219663 278902 211667 93010 45114 543353 255438
13338 328869 195460 424417 314332 435495 67967 102149 129718 206204 62023 181766
13328 181766 315723 -142868 246376 70021 206902 -33737 331734 -47855 82597 -87720
13317 125025 -488 344453 286214 234313 230585 60561 203099 10165 114216 18499 389759
13306 389759 362576 -23479 -77833 106747 162591 321142 349496 93250 118912 162865 6235
13294 -44743 91320 82275 165712 216211 19747 433186 -115524 36329 351995 107836 150515
13283A50515Q5912a5136H1892L3752C5405K64445D2663J16700J18929p872K9525
13272B99945D6275b2674A35175K6121B9177K87156O676j54209J04816C849J63988
13261A67837J50721E3183M5734h8568B05428m1I385J01663J87917d3172D13005
13249B7415L63041j00002b83610d0455D83944e604A89882d9535A30069J72341
13239C02410A50K70007i5402F41115a10858B57543E4751j2728b58921B99612C7680
13227d8091m9043d2537p7707H153J33011J16690a69489b4249C01987n3484q6789
13216A61714b98792F7949R3085m5312J98606o2995b4757D64059a16968f42A5946
13204A7637L39862d1952F6098a38106b0667I4060A9504a89979C8453K47393b87577
$$ plain form
13283 150515 236427 -15136 81892 115644 35405 299850 42663 159363 278292 270420 299945
13272 299945 46275 -22674 135175 161296 29177 316333 323009 168800 273616 3849 167837
13261 167837 318558 53183 98917 -88568 205428 205387 9385 111048 298965 -43172 413005
13249 27415 390456 290454 -283610 -40455 483944 -5604 189882 -49535 130069 302410
13239 302410 150 270157 -95402 641115 -110858 257543 54751 42023 -258921 299612 37680
13227 -48091 -97134 -42537 -120244 8153 141164 257854 -169489 -24249 301987 248503 161714
13216 161714 -298792 67949 161034 115722 314328 251333 -24757 464059 -116968 -642 15946
13204 17637 357499 -41952 66098 -138106 -20667 94060 19504 -189979 38453 285846 -287577
13192b28977B84966j05518p9313g9029N6k32491A74600a58184B15784D3752a07258
13180a5650A04737a00367K0002j37876A08241h986k05173M260b2117A66881L08540
13169D75421A82800L5133I4864k7198L18165f1686C73738A27758b11390B60650
13158A16769A794L31190a87207F3982J31657m5037B7847L90475j80651P7747i7693
13146H9522K6750K82931j69768J49015A07229h7372A13791a6016F7258O1909k6976
13135A02191a91234A71294D2864L08319c26887D5739J97200h399o7595D64879
13124e8185n9948B46926G3031k7488c00185C17293G4467a51476K1612I3139b92954
13112C59458G2452K120Q686R9574b059j18082A04450a91320K7590B89972c11878
$$ plain form
13192 -228977 284966 179448 100135 -79029 -78973 -311464 174600 -158184 215784 43752 -107258
13180 -15650 104737 -100367 -80365 -218241 108241 -8986 -214159 -209899 -22117 166881 475421
13169 475421 182800 217933 94864 67666 385831 -61686 373738 127758 -211390 260650
13158 116769 1794 332984 -187207 63982 195639 150602 27847 418322 237671 315418 -97693
13146 89522 116272 399203 229435 378450 107229 -87372 113791 -16016 67258 129167 102191
13135 102191 -191234 171294 42864 351183 -326887 45739 242939 -8399 -75994 464879
13124 -58185 -118133 246926 73031 45543 -300185 317293 74467 -151476 -129864 93139 -292954
13112 359458 72452 74572 83258 182832 -2059 -120141 104450 -191320 -163730 289972 -311878
13100A60801R1973I508L7311M0428b22817A36461F3271a68426B43781c29994D26770
13088A35861a63537A81283b1568C68298E9875J21589D6488J74144F1166j3279
13078D7887L4602o434K8363b29854A91413K6026l8547J27574Q4042A93495b3834
13066f0041A58625f674F8225O480K84000F8076n719J84527a1620C7889P3078j1252
13054I9715J73232a95432H809a35343j9422j66312b077E3099J993L816K58242
13043C17150A01511R4983a78012a958I3855J00217J0204h8257A50193g1233A41449
13031I8696J38788J14212n7815H8281J19L7496a99452c4004j96133C5723J00217
13020A35940j2169K4354L8467d9319C01338a35898C32611q9377h7583A70351k6772
$$ plain form
13100 160801 252774 9508 46819 87247 -222817 136461 63271 -168426 243781 -329994 426770
13088 135861 -163537 181283 -21568 368298 59875 181464 46488 220632 61166 47887
13078 47887 82489 76055 104418 -229854 191413 217439 178892 306466 390508 193495 -23834
13066 -60041 158625 -6674 68225 74705 358705 68076 62357 246884 -11620 37889 110967 99715
13054 99715 272947 -195432 8809 -135343 -154765 -321077 -2077 53099 55092 58908 317150
13043 317150 101511 196494 -178012 -1958 93855 194072 204276 -88257 150193 -71233 141449
13031 98696 237484 351696 293881 88281 88400 125896 -199452 -34004 -230137 35723 135940
13020 135940 123771 148125 186592 -49319 301338 -135898 332611 243234 -87583 170351 143579
13009A43579M2512K60939i7145C68968a55115A06150N1952h1263j42276e3809
12998D53544o8125g8512A67442d2308j06807D0992J94060a95711B3299a35733
12987B04473K07588a40922F1661g58j4590r4887A31096a22484I9508c8654r7045
12976a35699A84530D9102N15562A35851m2084H516J52430p1683d2397C9856J19884
12965A59740j7003m7532a36871B68527b84464G0017P1202a58748E81J37216e7515
12953B17520b4991B41535b65919A23752M07557c9121A89722q6122a39991B59867
12942A49861a20693A81755b25591A88498L1544A00076a28702l6144B0700g8221
12931B78905o1954d4837C19095E5692R5826E6304a12184o1447k1654A7247P7060
$$ plain form
13009 143579 186091 447030 -97145 368968 -155115 106150 158102 -81263 -223539 -53809
12998 453544 385419 -78512 167442 -42308 -149115 40992 235052 -195711 23299 -135733
12987 204473 412061 -140922 61661 -758 -15348 -110235 131096 -122484 99508 -38654 -135699
12976 -135699 184530 49102 564664 135851 93767 8516 160946 89263 -42397 39856 159740
12965 159740 142737 95205 -136871 268527 -284464 70017 141219 -158748 581 137797 -57515
12953 217520 -24991 241535 -265919 123752 531309 -39121 189722 103600 -139991 259867
12942 149861 -120693 181755 -225591 188498 220042 100076 -128702 -164846 20700 -78221
12931 278905 216951 -44837 319095 55692 151518 56304 -112184 -173631 -195285 17247 94307
12920I4307M84g7520A10987a33830A43606b44579f9019B2509K02548e223k58621
12909b63844C21246J35746D8426H791c9933B3814K31838J600E3610A3486O3796
12898G7282h0465D10859j28207c62896d6614B90243A1373J21354N6891J90179
12888C79797R7267c71305A0024a55460A98966i114A218J79137D7148h6846G8997
12876a01173A96981p4751i1574B6780J81903l8907J5646q9459J54474i6603m7163
12865a43766H9371J76851a9616G9793C9558j9094J46022J68093C2754J42102A7227
12853D96559a17248D3652b6609k45642A27609J3500D5230a88835J834A31138K57967
12842C89105a5397j43034C7815L9412J04718G7156d0874A32319b05420I0292J85573
$$ plain form
12920 94307 94791 -77520 110987 -133830 143606 -244579 -69019 22509 225057 -5223 -263844
12909 -263844 321246 456992 48426 8791 -39933 23814 255652 257252 53610 13486 77282
12898 77282 -80465 410859 282652 -362896 -46614 290243 11373 132727 189618 379797
12888 379797 477064 -371305 10024 -155460 198966 -9114 1218 180355 47148 -86846 78997
12876 -101173 196981 122230 -91574 26780 208683 169776 185422 95963 250437 -96603 -143766
12865 -143766 89371 266222 -19616 79793 39558 20464 166486 334579 32754 174856 17227
12853 496559 -117248 43652 -26609 -272251 127609 141109 45230 -188835 -187001 131138 389105
12842 389105 -15397 -158431 37815 77227 181945 77156 -40874 132319 -205420 90292 275865
12831B75865B5804L5903a32933N8522L6630G4330b33213A06748Q8774Q0287C0245
12819B2860b77768A70683a44723A59769J46661a06084n3039d2372E7006b23761
12808F781b60135p483E93084b07056Q0393F5293b17963B88175J32971B9413P9276
12797A08689b23358q3478b0344j4848A97120a00268A24897a86604H7211c48056
12786C01927j315b3519A72965B3756R8499i0939K6996B64676H6632d8965P088
12775d1877O97D59704j10839g4805J655b8621j27569O8248C40122h558q4944A00193
12762B86555a82330e055I9879J6443a47203I9173J83414b2814m10169J41224j03013
12751c94772I8410l7430d311j58543C27881a33885j15020c6692o1562C3269R6668
$$ plain form
12831 275865 25804 61707 -132933 -74411 -37781 74330 -233213 106748 195522 275809 30245
12819 22860 -277768 170683 -144723 159769 306430 -106084 -159123 -42372 57006 -223761
12808 6781 -260135 -267618 593084 -207056 -126663 65293 -217963 288175 421146 29413 108689
12797 108689 -223358 -306836 -20344 -35192 197120 -100268 124897 -186604 87211 -348056
12786 301927 300612 -23519 172965 23756 122255 -90939 -63943 264676 86632 -48965 -41877
12775 -41877 -41180 459704 348865 -74805 -73150 -28621 -156190 -87942 340122 -8558 -93502 100193
12762 286555 -182330 -5055 99879 116322 -147203 99173 282587 -22814 -432983 -291759 -394772
12751 -394772 98410 60980 -4311 -162854 327881 -133885 -248905 -36692 -98254 33269 129937
12740A29937D4463j8006M939q124M4304k9841L85230D0426b14642b3109D41571
12728A39837g3051J0687G3182i7086J7067K076c2496A31210N3946B1527h0417
12716A75683b47220A90301o4445b24086a11784A46214K21137J05722I9792b9304
12705H0511K75095M0187l5865j08018a97081E23586B1806J17254m2095d0258D347
12693A69009C6362a60329A03709k833b9446I4915A7474J34978N4744L0046a55409
12681A2400a9251A95611f1870m4458E5531Q665K15941B6759J32881K30541c93922
12669H918J20112a77895a5008C59676A17189M2839b38332a2536D2266j3339M87879
12658E16806A52662C3693h4516B02213F5249J03149R6748H5742J5125a6415A70587
$$ plain form
12740 129937 44463 26457 31396 23272 67576 37735 422965 40426 -214642 -23109 441571
12728 139837 -73051 -62364 73182 -97086 -80019 -77943 -32496 131210 185156 21527 -80417
12716 175683 -247220 190301 125856 -224086 -111784 146214 367351 473073 99792 -29304
12705 80511 355606 395793 359928 251910 -197081 523586 21806 139060 96965 -40258 4347
12693 169009 36362 -160329 103709 100876 -29446 94915 17474 152452 207196 237242 -155409
12681 12400 -19251 195611 -61870 -106328 55531 64196 280137 26759 159640 390181 -393922
12669 8918 129030 -177895 -15008 359676 117189 160028 -238332 -12536 42266 28927 516806
12658 516806 152662 33693 -84516 202213 65249 168398 265146 85742 100867 -16415 170587
12646c8334H1206k0774c653C67380j16990O9106b02983A75130o6146B5691h1043
12634C29672j49746R4479A27316D2572K5706K49471P3338f0059E4216a8575D30070
12622B37699j05227a40309O3221B03671K6593E0170J6570O369O1905A2380d6806
12610A31681c03574B55778J34498A93455C0680K82710A30302f8574A97102b968
12599I6801j9111K6238N529n792b6399H8186J85212e6876D9452h405E4539j395
12587E3144a30253E9074K6404k9345b2101j50590r3371H5883P7875C2655l042
12576B9613b57335B09164a15618b4571A61790J50929a36026B98007r2505b2562
12565a08157A19558a24607K3477K9458G5915K53842n9410L7575I7877Q4717n5636
$$ plain form
12646 -38334 81206 60432 -3653 367380 250390 319496 -202983 175130 108984 25691 -81043
12634 329672 179926 274405 127316 42572 68278 317749 391087 -60059 54216 -18575 430070
12622 237699 132472 -140309 -77088 203671 230264 50170 66740 73109 135014 12380 -46806
12610 131681 -303574 255778 390276 193455 30680 313390 130302 -68574 197102 -2968
12599 96801 77690 103928 109457 103665 -26399 88186 273398 -56876 49452 -8405 54539 53144
12587 53144 -130253 59074 85478 56133 -22101 -172691 -266062 85883 163758 32655 29613
12576 29613 -257335 209164 -115618 -24571 161790 312719 -136026 298007 205502 -22562
12565 -108157 119558 -124607 -101130 -71672 75915 329757 270347 307922 97877 182594 126958
12554A26958g4708j0819B177a27331A64303b17106I7083b67655D74898e1637B35176
12542e6206p436l5366p4008M5722A43248m2762g6498p726p3305n6670C13548g7541
12529a03758B28586G1152J98956c4176a1655j58471f0191B95774g624D1684c29657
12517i7892A58349E3145a8174j24157n8892C780J07219J23249j04543K39269f7871
12505C71342j68214n7569J731R2511J37831r1096b25600j19305B05232j1534g5862
12493c04808d730B00202K62777h9205A21185l1421b56954d9591H4025J2332D7057
12481d6225j59034a4694H1629J76219j25880C9008J04263h0866j43325A7934b5959
12469a96500B4369N8826h2837H4914b30250G8639A4701M77945i464l84839a42027
$$ plain form
12554 126958 -74708 -85527 2177 -127331 164303 -217106 97083 -267655 474898 -51637 235176
12542 -56206 -63642 -99008 -173016 -127294 143248 100486 -76498 -84224 -157529 -214199 313548 -77541
12529 -103758 228586 71152 270108 -34176 -11655 -170126 -60191 295774 -7624 41684 -329657
12517 -97892 158349 53145 -18174 -142331 -201223 3780 110999 234248 129705 368974 -67871
12505 371342 203128 145559 147290 239801 377632 286536 -225600 -344905 205232 193698 -75862
12493 -304808 -4730 200202 462979 -89205 121185 89764 -256954 -49591 84025 96357 47057
12481 -46225 -205259 -14694 81629 257848 131968 39008 143271 -80866 -224191 17934 -25959
12469 -196500 24369 83195 -82837 84914 -230250 78639 14701 492646 -9464 -394303 -142027
12457A9147b55054G5285f7487C212g7911A29536b89176O462h9628B23345F9507
12445C0905K49705G4235a36508A76723b20012R8392G2134c6413A50750M1881d2394
12433i455k81896A252a45122F3146A7317L60028A22685b19145O4018r2539F687
12421b3844q2168A10398J47315b85690f9325k7515Q520j95211e9696F7360h3113
12409A79950a27828F6023a77138D01798g5251n1021o300I0770a32643a3035D1539
12397D28030A6037c6081E5322a02427j22396B91284d2929j73219F1053c73582
12386A65143b00708C2567i300j68524B43216a53588A9484J86763m2240a12621
12375B3295a47016p9348A82630b4560m4577j94561J16400B13458C3987b58024
$$ plain form
12457 19147 -255054 75285 -67487 3212 -77911 129536 -289176 -282714 -89628 223345 69507
12445 30905 280610 74235 -136508 176723 -220012 -121620 72134 -36413 150750 192631 -42394
12433 -9455 -291351 1252 -145122 63146 17317 377345 122685 -219145 -155127 -247666 6687
12421 -23844 -106012 110398 257713 -285690 -69325 -96840 -88320 -283531 -59696 67360 -83113
12409 179950 -127828 66023 -177138 401798 -75251 -126272 -132572 90770 -132643 -13035 41539
12397 428030 16037 -36081 55322 -102427 -224823 291284 -42929 -216148 61053 -373582
12386 165143 -200708 32567 -9300 -177824 243216 -153588 19484 206247 164007 -112621
12375 23295 -147016 -226364 182630 -24560 -69137 -263698 -147298 213458 33987 -258024
12364D4131b2378H5299R9837b94752a09459i033m795I3580c16688A9742R9832
12353A19574b40731B3874J37171N9904j07659M9884A0045a38051M7530K9894b2648
12341C54593d21962e4174A8219K41216g1845k19898J05501e5040e417q7639L5366
12330e7690q0431k4795D42575g8682j94392a4058j17790A03463R037b27038E2366
12318A30782R3275b4993k09800A37998A3876O1312A2533a97357B51805E3807a17913
12306h2883B51989h8600K9157a4925E6742J8567a23165A9911M498a85610b1092
12294I5351a96269A36565b71672A52249c49533B93509F0219K59346a44380n0155
12284a94535k05271A9530J59143l0359d5752q6507B44756F0917N3444p894P7758
$$ plain form
12364 44131 -22378 85299 185136 -294752 -109459 -9033 -13828 93580 -316688 19742 119574
12353 119574 -240731 23874 161045 220949 113290 163174 10045 -138051 -90521 -60627 -22648
12341 354593 -421962 -54174 18219 259435 -71845 -291743 -186242 -55040 -5417 -93056 -57690
12330 -57690 -138121 -162916 442575 -78682 -273074 -14058 -131848 103463 112500 -227038 52366
12318 130782 224057 -24993 -234793 137998 13876 75188 12533 -197357 251805 53807 -117913
12306 -82883 251989 -88600 -59443 -14925 56742 75309 -123165 19911 24409 -185610 -21092
12294 95351 -196269 136565 -271672 152249 -349533 293509 60219 319565 -144380 -194535
12284 -194535 -399806 19530 178673 148314 -45752 -132259 244756 60917 114361 106467 184225
12273A84225L67444k63605j25923J9889n0534b66391I3174J96285J03240j27670
12263B65029c27114A39923O4358c58152A91056b1909m9291p177k64083M6835H8227
12251C34967A1275Q1032b19822d4021A19359B1643a84207i36j70213B01847a95413
12239g7721A98766J85953d5677f419j931j2031B51478j04975k7421K28112a8797
12227D99596j65292J4089A22528J32048n3827E7790P2973Q7416K0175J03645A36139
12215I9236J93379n8324o9651a40883A67324O7246J3932d4857D19436A32756K63319
12204C96075a28471A77181a98616I844J90009O5032K4037A6083K84276m9684o0274
12193A90401K01036D3280J09265F0353K28229e008l9363E611K61718b20559D80717
$$ plain form
12273 184225 551669 288064 162141 182030 131496 -266391 93174 289459 392699 265029
12263 265029 -327114 139923 204281 -358152 191056 -21909 -71200 -78377 -342460 -295625 88227
12251 334967 11275 92307 -219822 -44021 119359 21643 -184207 -936 -171149 201847 -195413
12239 -77721 198766 384719 -45677 -6419 -8350 -20381 251478 146503 119082 347194 -18797
12227 499596 334304 348393 122528 254576 200749 57790 130763 218179 238354 341999 136139
12215 99236 292615 234291 164640 -140883 167324 234570 248502 -44857 419436 132756 396075
12204 396075 -128471 177181 -198616 9844 199853 264885 288922 16083 300359 250675 190401
12193 190401 391437 43280 152545 60353 288582 -5008 -44371 5611 267329 -220559 480717
12181G6616C6634J78355a36996p927G3530J0608M57606A62772G8352J40705j5475
12170B03582M9269a68145A36343K05510A41114c7242B5155J60058P4043A12980
12159a4199H2596K0142L4006l215i2826J4506c4598C0660K52483a21712A23261
12147D3318K74482n4577a21535A1813a27080C0115a8214q4081B67732b48277C55950
12135A26887j9803a77512A05255M6848c2073j96063J06080B10457A03473Q1586
12125A85059a41960o0208A07649O5897g8837I1061m1664J61118J88497A10750
12114F7076L47953e5672k13791h077E9146c24969A83681i1675a2311l22945A66733
12102i6321B69949a9701c223k85979h3274A26068J03246E2340c82157a83063G0168
$$ plain form
12181 76616 36634 214989 -136996 -144923 73530 84138 541744 162772 78352 219057 203582
12170 203582 252851 -168145 136343 341853 141114 -37242 25155 185213 259256 112980
12159 -14199 82596 102738 136744 133529 -92826 -78320 -34598 30660 283143 -121712 123261
12147 43318 317800 263223 -121535 11813 -127080 30115 -18214 -102295 267732 -248277 355950
12135 126887 107084 -177512 105255 152103 -32073 -228136 -122056 210457 103473 185059
12125 185059 -141960 -202168 107649 173546 -78837 91061 49397 210515 399012 110750
12114 67076 415029 -55672 -269463 -8077 59146 -324969 183681 -91675 -12311 -335256 166733
12102 -96321 269949 -19701 -3223 -289202 -83274 126068 229314 52340 -382157 -183063 70168
12090b29234E2258N2972a77119j17668a21030B2250J50538F8009a33912a0156
12079B23743f9264A60588o7880J97036K13201J31102J178280H30598k08554a00150
12068D5323e658o1897B10022J54587k0642c76530R3430j8096a28305N4906l66701
12057d40100a38331G198L3493O3297J84635b81541A73508E6015a5124A44568B5938
12045a19412A35991N7555a13227J4467B11020f9134j27161O7076G8643K67338
12035C45981A23460j470b42884a01374c374j97362B01000E6799B0460b4154q838
12024c2992p970n2800A2995a15724c7489j02211c6981o2958C5244J52751J12047
12013C00042d305B44874e7799A21263a11758B03832c50374P5905B95901j19137
$$ plain form
12090 -229234 52258 105230 -177119 -294787 -121030 22250 172788 68009 -133912 -10156
12079 223743 -69264 160588 92708 289744 502945 634047 1812327 830598 622044 -100150
12068 45323 -5658 -67555 210022 364609 343967 -376530 -283100 -301196 -128305 -73399 -440100
12057 -440100 -138331 7198 40691 103988 288623 -281541 173508 56015 -15124 144568 25938
12045 -119412 135991 193546 -113227 -98760 211020 -69134 -196295 -129219 78643 345981
12035 345981 123460 121990 -242884 -101374 -3374 -200736 201000 56799 20460 -24154 -32992
12024 -32992 -40962 -93762 12995 -115724 -37489 -139700 -36981 -99939 35244 187995 300042
12013 300042 -4305 244874 -57799 121263 -111758 203832 -350374 -274469 295901 176764
12003A76764b73290b231j48254D1465K04217a12592F4592k4067a25145A36801
11992A18984j3307g6724A12569K05224A36797J15166A3516K88500D7840e8955
11981A38130D4006R3058b17092I8823J37315b89295j13536B409L2559b8899A33979
11969A13709i1812B50176c02802J4549J25102j387O6496j41080j10565F2788d5232
11957b22943j5868B18956d39605i7068I4297d67143B9107b12369D5070a22408
11946B18798a9887l64313H4723g5631E2135A5388J72281l9146p1588L32995E5082
11934d04572B94263a79035d6299A36268c0975j27987A10825a94370b1141A08047
11923A17306a5985A92471f4449C03857e6594j38008l9757Q2330b6418j16325p7557
$$ plain form
12003 176764 -273290 -2231 -150485 41465 245682 -112592 64592 40525 -125145 136801
11992 118984 105677 -76724 112569 317793 136797 251963 13516 302016 47840 -58955
11981 138130 44006 137064 -217092 98823 236138 -289295 -402831 2409 34968 -28899 133979
11969 113709 -91812 250176 -302802 -288253 -163151 -164538 -98042 -239122 -349687 62788 -45232
11957 -222943 -238811 218956 -439605 -97068 94297 -467143 29107 -212369 45070 -122408
11946 218798 -19887 -384200 84723 -75631 52135 15388 187669 148523 76935 409930 55082
11934 -404572 294263 -179035 -46299 136268 -30975 -158962 110825 -194370 -21141 108047
11923 117306 -15985 192471 -64449 303857 -56594 -194602 -234359 -152029 -26418 -142743 -220300
11912b20300R1164r3202B46548b57716A31917C5530c01616J13138A94000i4875
11901a88144A30673a80537D8016L9939B1677e8208n29350B20062J32242G3736
11890f787j66049D4139b42041i3449J0529B80502G595f3426B08501D8941a1669
11878B5860e0018F4199j5824b68605f1569j15390P9425j58970A63299G9346l6166
11867D3180j5409J35827a35794l52202a11276c8379B65450j22083e4024A2618
11856i5284A54336J16968b05915B77905i2404F200a31404E8446c13408h3626D19147
11844d9745j10216q2038C0018J71052a90418D3904e5624j2846B30130h4065A6731
11832a55595B83553e6661o800a7007I2344j5390J46802a03257G7843b37208d7701
$$ plain form
11912 -220300 -129136 -222338 246548 -257716 131917 35530 -301616 -188478 194000 -94875
11901 -188144 130673 -180537 48016 87955 21677 -58208 -587558 220062 352304 73736
11890 -6787 -172836 44139 -242041 -93449 -82920 280502 7595 -63426 208501 48941 -11669
11878 25860 -50018 64199 48375 -268605 -61569 -176959 -97534 -256504 163299 79346 43180
11867 43180 27771 163598 -135794 -487996 -111276 -38379 265450 143367 -54024 12618
11856 -95284 154336 271304 -205915 277905 -92404 6200 -131404 58446 -313408 -83626 419147
11844 -49745 -159961 -241999 30018 201070 -190418 43904 -55624 -68470 230130 -84065 16731
11832 -155595 283553 -56661 -63461 -17007 92344 76954 223756 -103257 77843 -237208 -47701
11820a43433o8992J4521N6531C5262O9005m2775a99709D6994J12857J23963c6096
11808A39370a30501m3151A5942e0979J0121B82680C2374g9508k43723J61270O9098
11797i2863c3964B505J6221b11726m589a4531j03655j0288d1867B46442g8796
11785B77251j8940a03866D3629j7325e8821m3287j03941A36942E9847h4537k41515
11774c26052A7319e04686B29757I804K58740B0399d8989J9743A70836a61441m9722
11763b11163M9062j1218Q1658j24939b116H4248l0186c3798b046B75948l6883
11752B39065p473I5392J40770a77042B5988J31541p8309r274O5932c49753a8557
11740D8378a39241k67052a42514b3509C91641b38072J11017C00290h4223A20748
$$ plain form
11820 -143433 -212425 -197904 -141373 35262 104267 61492 -199709 46994 159851 283814 -36096
11808 139370 -130501 -173652 15942 -50979 -40858 282680 32374 -79508 -323231 -161961 -92863
11797 -92863 -33964 2505 18726 -211726 -216315 -14531 -118186 -128474 -41867 246442 -78796
11785 277251 258311 -103866 43629 26304 -58821 -102108 -206049 136942 59847 -84537 -326052
11774 -326052 17319 -504686 229757 9804 268544 20399 -48989 -29246 170836 -161441 -211163
11763 -211163 -162101 -173319 -91661 -216600 -2116 84248 54062 -33798 -2046 275948 239065
11752 239065 231592 95392 236162 -177042 25988 157529 79220 69946 135878 -349753 -18557
11740 48378 -139241 -406293 -142514 -23509 391641 -238072 -127055 300290 -84223 120748
11729a93486B0414a17807m7628K2945p5197n1850a1695C2753a13935F3001a93422
11717a02637r9630f0367j18303l91088A56401O5421r6436k547D3987K84212g2624
11705b87681a28050B06406J68397G6100N9339b1557C612J11766D9384N0256a05888
11693h2597C3862a23709A64150h5848B3734L5601L5995k5300a5671A55520J25410
11682B80930A14236L0277n2287J8252c0452D8080a94181c7491F0163L4711c42754
11670c6495Q256A23566j4847f8979B94158N073a15334C08705h6035p2162r1688
11659b49885E721d557l20003I1225M7226P3807D4523J97605F9724P0053J65094
11648C04871A7365J40710E6120g4392B9724d5660A71549J2916a4847j23794b2666
$$ plain form
11729 -193486 20414 -117807 -165435 -142490 -217687 -269537 -11695 32753 -113935 63001 -193422
11717 -102637 -202267 -60367 -178670 -569758 156401 221822 125386 122839 43987 328199 -72624
11705 -287681 -128050 206406 374803 76100 135439 -21557 3612 115378 49384 99640 -105888
11693 -82597 33862 -123709 164150 -85848 23734 59335 95330 70030 -15671 155520 280930
11682 280930 114236 144513 92226 110478 -30452 48080 -194181 -37491 60163 94874 -342754
11670 -36495 -28239 123566 108719 -68979 294158 299231 -115334 308705 -86035 -158197 -249885
11659 -249885 5721 -4557 -324560 91225 138451 212258 44523 242128 69724 139777 304871
11648 304871 17365 158075 56120 -74392 29724 -45660 171549 184465 -14847 -138641 -22666
11636b9826B7185J70364b0898l3382B37736E8672L74391I921J45558B0060K51621
11625B71681g2904A39408d8116j14380L2115a4935A11095a14533A91009a38472
11614b26744A57888b16929A25931D4553J44542c7401C77759e3572k45485C37385
11603a04044j9516A01942f6554A1832L15828H0813L0332J60381f5967j35893A58958
11591B8797a12493B5216a91105B15377D9788Q4610O9753E060K98156a58415A45404
11579A41523c40612J18873J026H3927c4720k23569D0956N373a57772A50948L6408
11568A87356G417R9630e8332B3907K9135c6087H3710a12338C45133H2325R4347
11557A76672p0136A6178d5953C03456A17374A820K58466I5424l1810d0655B33235
$$ plain form
11636 -29826 27185 197549 -20898 -54280 237736 58672 433063 9921 155479 20060 271681
11625 271681 -72904 139408 -48116 -162496 -130381 -14935 111095 -114533 191009 -138472
11614 -226744 157888 -216929 125931 44553 189095 -37401 377759 -53572 -299057 337385
11603 -104044 -123560 101942 -66554 11832 327660 80813 111145 271526 -65967 -201860 158958
11591 28797 -112493 25216 -191105 215377 49788 134398 204151 5060 303216 -158415 145404
11579 141523 -340612 -221739 -220713 83927 -34720 -258289 40956 46329 -157772 150948 187356
11568 187356 7417 107047 -58332 23907 53042 -36087 83710 -112338 345133 82325 176672
11557 176672 106536 16178 -45953 303456 117374 1820 260286 95424 63614 -40655 233235
11545d065I7114J90721a04495A03547J34935b54840Q6005i331A69480i0408C08255
11533d2744A19582g2884m8147D39197A60393K88357A29188J08509b56686A25989
11522g7057E07459h3273J2336B12297D5938O2161E3504A7510c9752j82022d906
11510C8253b99161A8838b30145B22084q862D2695b5042j27205k106C24237n2579
11499B71658J75232A1694a96483A29790M402E9282d876A87452b10415A48448k4873
11488A23575d1392o7931j01343A98195d6138E835g053D27370E2505c37781B52601
11476A31324J05661b19392J06898j18614A73029N1299L05907A20915L74744B23532
11465A12918a71534D56971D3709O4457L59209B04656H2397R7871a04383k9931
$$ plain form
11545 -4065 97114 287835 -104495 103547 238482 -254840 -168835 -9331 169480 -90408 308255
11533 -42744 119582 -72884 -121031 439197 160393 448750 129188 237697 -256686 125989
11522 -77057 507459 -83273 -70937 212297 45938 108099 53504 17510 -39752 -221774 -4906
11510 38253 -299161 18838 -230145 222084 213222 42695 -25042 -152247 -154353 324237 271658
11499 271658 446890 11694 -196483 129790 134192 59282 -4876 187452 -210415 148448 123575
11488 123575 -41392 -109323 -210666 198195 -46138 5835 -7053 427370 52505 -337781 252601
11476 131324 236985 -219392 -112494 -231108 173029 224328 530235 120915 495659 223532
11465 112918 -171534 456971 43709 108166 467375 204656 82397 180268 -104383 -134314
11455a34314A96132J6342l1678B8761J52654q2971a75882g6E9069k2974e331B3554
11442h9483K6511G285K02329o5196j1813g0321D91902a10472m6398m9513B13746
11430A48632a75001j5892A5872J19952J78181A22454Q89B7678c3114r864G1550
11418A12829J66673a32355p7827e1870A5513K09018B7568h9207A86336F3199L53065
11407D16264F8684J90265o9245k1337R3823b82658O2522a03974B51722a79014
11396B7839Q1584O5534b8250F3685a33402j57374M7625k748J4165k4715C7343
11384c2768r819A05839K61107G6177C1511K09961m8987a59853c0376E0499a45489
11372B3191a52922F8474b63666A79441F1606a9185k04651E7838b66966A12058
$$ plain form
11455 -134314 196132 212474 180796 28761 181415 98444 -175882 -76 59069 36095 -5331 23554
11442 -89483 -62972 7285 209614 144418 132605 -70321 491902 -110472 -156870 -206383 213746
11430 148632 -175001 -190893 15872 135824 314005 122454 123343 27678 -33114 -42978 71550
11418 112829 279502 -132355 -210182 -51870 15513 224531 27568 -89207 186336 63199 416264
11407 416264 68684 258949 189704 168367 262190 -282658 -220136 -103974 251722 -179014
11396 27839 109423 174957 -28250 63685 -133402 -290776 -243151 -245899 -231734 -256449 37343
11384 -32768 -42587 105839 366946 76177 31511 241472 192485 -159853 -30376 50499 -145489
11372 23191 -152922 68474 -263666 179441 61606 -19185 -223836 57838 -266966 112058
11361A72774a99338B67478c4649j95822b4024j3770m4968k00143d4651H523b9805
11349d2808A55766o7712b37673g1188l45889B12633E1309J52810g270j89612Q4669
11338a12213b3311j50272j172K8643N6271l5806j892J9941a2806M299A36568c5909
11325a0649j80757K3650h2554A81660i2100j19712A74220L7124h2163I3817O6990
11314A60807b66765D8613J27132i7471A47593P1169c873o4115j34038R6187G838
11302B3733a3146j87438A22420a51037A5762N7339K89722j74141n4013a5045A69211
11290b32578H2647c62983c9637H0587g7808j51442q2777a14616J428B20829N8595
11279B79424A36960J52409a47955e3311j93774A61626c2707n5058E2139c39778
$$ plain form
11361 172774 -199338 267478 -34649 -230471 -24024 -37794 -82762 -282905 -44651 8523 -29805
11349 -42808 155766 88054 -237673 -71188 -417077 212633 51309 204119 -7270 -196882 -112213
11338 -112213 -23311 -173583 -174755 -146112 -89841 -125647 -127539 -107598 -12806 -8507 136568 -35909
11325 -10649 -191406 -167756 -82554 181660 -92100 -211812 174220 211344 -82163 93817 160807
11314 160807 -266765 48613 175745 -97471 147593 218762 -3873 -67988 -202026 -105839 7838
11302 23733 -13146 -200584 122420 -151037 15762 73101 362823 188682 134669 -15045 169211
11290 -232578 82647 -362983 -39637 80587 -77808 -229250 -312027 -114616 -113188 220829 279424
11279 279424 136960 289369 -147955 -53311 -247085 161626 -32707 -87765 52139 -339778
11268d23013a13386F4247a96247C47237a89996A5028d17971B82801A2821a70588
11257F9752J69101D8055R6981n3380j2803a55494A82875a67865j02425H2582f3804
11245c67158A11706a29931A9070P8025o145e7672j47384H0863a7682D55411B6495
11233h7423H403K9340c56620F7110b50977i5813J2921j51109J09598C04284f4248
11221d37062J79219b3755k08962o1046C3167h8306j40914A33130i9062B43475
11210A08838K662c8672j61094A5927b28346J7372i9135j81683f2661A76532a17246
11198a00865P806c140k72751A48623a34520k36898c0362l41888B23512j11388
11188A12124b26081c481A81254a13713B8817F061e5415n4061C4960L822a4127
$$ plain form
11268 -423013 -113386 64247 -196247 347237 -189996 15028 -417971 282801 12821 -170588
11257 69752 238853 48055 145036 91656 78853 -155494 182875 -167865 -270290 82582 -63804
11245 -367158 111706 -129931 19070 97095 90950 -57672 -205056 80863 -17682 455411 26495
11233 -87423 8403 37743 -356620 67110 -250977 -95813 -82892 -234001 -124403 304284 -64248
11221 -437062 -257843 -23755 -232717 -293763 33167 -88306 -229220 133130 -99062 243475
11210 108838 111500 -38672 -199766 15927 -228346 -210974 -99135 -280818 -62661 176532 -117246
11198 -100865 -93059 -3140 -275891 148623 -134520 -371418 -30362 -372250 223512 112124
11188 112124 -226081 -3481 181254 -113713 28817 6061 -55415 -109476 34960 38782 -14127
11176a69147A70366b6802j42436A82474b75867j55694h078j70365j00501E1328
11165a35206d4661G6350l2514a67604A44335r742a3858j84137O4562d3108r9113
11154a42221K7001n4821j15891a09267B39614q4295B376e4401B44606K5645a56397
11142A07926B817b6569k3220b1789j43072k6120d1570A30673A4128L64033f5750
11130b62995A12640a29413A51480k0498J1328b07177C5957J01267a99403c4093
11119B03112c74186C87320d6969j40983h0211A61368G1900K8331J14919D0172
11108E0824e0599J5065P612D72291b71624C37087p0144J48930h6161A18845L9368
11097A58213a09433B56413p8614e0348B39326J55233o3226b1796B26781J39104
$$ plain form
11176 -169147 170366 -26802 -169238 182474 -275867 -431561 -8078 -178443 -278944 51328
11165 -135206 -44661 76350 43836 -167604 144335 134593 -13858 -197995 -133433 -43108 -142221
11154 -142221 -115220 -170041 -285932 -109267 239614 155319 2376 -54401 244606 270251 -156397
11142 107926 2817 -26569 -49789 -21789 -164861 -190981 -41570 130673 14128 378161 -65750
11130 -262995 112640 -129413 151480 130982 142310 -207177 35957 137224 -199403 -34093
11119 203112 -374186 387320 -46969 -187952 -80211 161368 71900 100231 215150 40172
11108 50824 -50599 -35534 -27922 472291 -271624 337087 266943 415873 -86161 118845 158213
11097 158213 -109433 256413 177799 -50348 239326 394559 331333 -21796 226781 365885
11087C65885j749M2657A85706J21184A43074R0642n2639K15099G008K04826J00439
11076C12273K6985Q1954J57541j8015B27287M07894D5054L96339j29905l7508
11066B73980J25315A18078M95486B78305n471J17342M29535l85276m7167j18098
11056B69170L75136J5754j0324j84089J57050J5435K34551j04032l2101C66727
11045F10515K5603N8515K4078l08170O9795L74758j43257j87351M16231C01797
11034F87804p6576J3013B35365L0947L53484r1994K41688o3639k80499Q0080N2630
11023E58062J65724j54137q5363L63632M6212j08584l62516Q6767B54304M77794
11013G32098B89299L96924K1386p6809m1718k39803L53753k38556L07768k06865
$$ plain form
11087 365885 364136 406793 185706 306890 143074 233716 181077 396176 7008 211834 312273
11076 312273 339258 421212 578753 560738 227287 635181 45054 441393 311488 273980
11066 273980 399295 118078 613564 278305 272834 390176 819711 434435 387268 269170
11056 269170 644306 660060 649736 465647 622697 638132 872683 768651 736550 366727
11045 610515 636118 694633 718711 410541 480336 855094 711837 524486 940717 301797
11034 687804 611228 624241 235365 266312 619796 527802 769490 705851 425352 505432 558062
11023 558062 723786 569649 484286 847918 894130 785546 423030 509797 254304 732098
11013 732098 289299 686223 707609 630800 589082 349279 703032 464476 772244 565379
11003E65379p2277j02747N21168q5751j57935j67575K52164C18644J94302k4647
10993D88299j12705K44831j73274M67671l82145m180J50581L45322Q7885j6606
10983A095679j78573L0815M9905K81692N3416j04462J83166L72845P9694K97515
10973B161692L75788K55585k20922J28659l69273J95730k58559n46443j7933L95307
10963B099631l32419k31386L39578k24841J68095m3272O2655l12229M02607n84724
10953A343695J09563G22903K72568j34619M9261B91423L29781n0931J24852k58050
10943D37075O3567k33433m2479L5443F1278N5017d3682j05160F9349K05246f4636
10931b55182B51490a26327A56963C0162O196a3225j23207E8340Q3042i973A4831
$$ plain form
11003 565379 493102 390355 911523 825772 667837 500262 752426 318644 512946 488299
10993 488299 375594 620425 447151 914822 532677 528497 679078 1024400 1112285 1095679
10983 1095679 917106 947921 997826 1279518 1332934 1228472 1411638 1784483 1864177 2161692
10973 2161692 2537480 2793065 2572143 2700802 2331529 2527259 2268700 1722257 1704324 2099631
10963 2099631 1767212 1535826 1875404 1650563 1818658 1775386 1838041 1525812 1928419 1343695
10953 1343695 1453258 722903 995471 860852 910113 291423 621204 570273 695125 437075
10943 437075 500642 267209 224730 260173 61278 116295 -43682 -148842 69349 274595 -64636
10931 -255182 251490 -126327 156963 30162 36358 -13225 -136432 58340 141382 -9973 14831
10919E4658d434E28510A02425C6077N6690Q0703g4665A43269a85780D16861b07865
10907h7218k49530B13723b38377c5634n7876a140C29628j61966k8880d0222m9048
10896h9270K2044j07038q6439A6935L15693e8204B70193n2123A8034a6031j26652
10885a42683c2697N186j5479k03556c2861j92425d2107j96647i6126j13357f5574
10873f8222j10692A84535B2151a69901E3159b49922E3880j9975a80698a8836G238
10861a83611A35309c4128q2741j59160m3349d4632n324F6205a81689E091g4345
10849G6548n702a38056L9355E18709n5829H1973O2385a11482B57736d639k1962
10838b6601j44578M8955k81418a17432A4262L07488b14533P3414B71672A0424
$$ plain form
10919 54658 -4434 528510 102425 36077 92767 173470 -74665 143269 -185780 416861 -207865
10907 -87218 -336748 213723 -238377 -35634 -93510 -1140 329628 167662 138782 -40222 -89270
10896 -89270 -67226 -174264 -260703 16935 332628 -58204 270193 218070 18034 -16031 -142683
10885 -142683 -32697 -27511 -42990 -246546 -32861 -225286 -42107 -238754 -96126 -209483 -65574
10873 -68222 -178914 184535 22151 -169901 53159 -249922 53880 33905 -180698 -18836 7238
10861 -183611 135309 -34128 -116869 -276029 -319378 -44632 -49956 66205 -181689 5091 -74345
10849 76548 70846 -138056 -98701 518709 462880 81973 144358 -111482 257736 -4639 -26601
10838 -26601 -171179 -122224 -403642 -117432 14262 321750 -214533 -141119 271672 10424
10827F2817C0478J87403a82546I3628J55090b12800b76B7299a38658p2089b178
10815a04201j44606O9252P2109g30m1150B8039K3246a57238E3805b7077j33296
10804a60373k8935H4676K486A4632Q0315l044l6596C051O2624b2353j77102N3725
10792a45730M6401q9257Q2136B71251q5043L1725p9034d8691B38040k2847K16803
10781D31996A44665l3408f6202j77093c4282j85961A79581f2281o3747j31197
10771b57225G0290b13839B6112a38396j86604a0812r9277M0373j28227o8076Q3975
10760a82044c3826C3299b24293B69488A32863a41818d9683b3378I7406Q6458a31137
10748b20685G8271J19380A0368Q3582b21471L0976j8190j20918C8184h0651m724
$$ plain form
10827 62817 30478 217881 -182546 93628 248718 -212800 -276 27299 -138658 -210747 -2178
10815 -104201 -248807 -179555 -107446 -730 -41880 28039 51285 -157238 53805 -27077 -160373
10804 -160373 -189308 84676 87162 14632 94947 91903 55307 3051 65675 -22353 -199455 -145730
10792 -145730 -99329 -188586 -106450 271251 186208 217933 138899 -48691 238040 215193 431996
10781 431996 144665 111257 -66202 -243295 -34282 -220243 179581 -62281 -126028 -257225
10771 -257225 70290 -213839 26112 -138396 -325000 -10812 -110089 -69716 -197943 -266019 -182044
10760 -182044 -33826 33299 -224293 269488 132863 -141818 -49683 -23378 97406 183864 -131137
10748 -220685 78271 197651 10368 93950 -221471 -190495 -208685 -329603 38184 -80651 -85375
10737h5375A56292b81606A94210a58790H0051c27793A5549a97560I0304L9366
10727A29670g2219C4588a35573B00079f794A67874a13954B15789q4394e8090l32477
10716c90567a51582g4770p973B0854d45479c4456q1041M8816B14316K01881H6012
10704a234k0911J0004C0487i7699l7525p5109j69L4712L2753k05157J48152j59502
10692c59544J33077O9662M4337F3082J8760c88850d2765F4809b8338I3721a60275
10680H01a12967i806A4591J59574i7623D8848a00656B11860C8996K7479A0974
10668A0134K86299j21117a98444c696A33942h1977A47849a94699G8024b13677
10657i2354a0989F8343d09306J37074i8480K2311j84754A05603J87227L1138C6784
$$ plain form
10737 -85375 156292 -281606 194210 -158790 80051 -327793 15549 -197560 90304 129670
10727 129670 -72219 34588 -135573 200079 -6794 167874 -113954 215789 131395 -58090 -390567
10716 -390567 -151582 -74770 -82743 20854 -445479 -34456 -115497 -66681 214316 416197 86012
10704 -1234 -22145 -12141 30487 -97699 -135224 -210333 -210502 -175790 -143037 -348194 -200042 -359544
10692 -359544 -226467 -156805 -112468 63082 81842 -388850 -42765 64809 -28338 93721 -160275
10680 801 -112967 -9806 14591 174165 -97623 48848 -100656 211860 38996 66475 10974
10668 10134 296433 175316 -198444 -3696 133942 -81977 147849 -194699 78024 -213677
10657 -92354 -10989 68343 -409306 -272232 -98480 -76169 -260923 105603 292830 323968 36784
10645b548m7091j71022K516A14307k0937K13831c01864J30690I8968a98203Q3799
10634a14404M6452J2734A5882J5668K114a74801C39914A25461o1608c12004C1731
10622A00575e1312l61117a88460A47929c91553G6797a03818K0674J8783k64498
10612c28859c955j76520J301F0010J85155d0473A07500A2248a30762B01150i5934
10600c0296m0403B50673a93046E519b50188a3430n8533A12525C2562D994h563
10588A45347a1012k11523O2853B7892P1466c6496A27705a01873A31745a28742
10577c8493j57868A4977a20191j07810R7491J566E3289B5124N0456L5354J35912
10566B46846a59018b4723A66202a21818Q161l2447A22417a78573O2113D6358j8760
$$ plain form
10645 -2548 -49639 -220661 -218145 114307 93370 307201 -301864 -171174 98968 -198203 -114404
10634 -114404 -67952 -55218 15882 31550 33664 -174801 339914 125461 63853 -312004 31731
10622 100575 -51312 -412429 -188460 147929 -391553 76797 -103818 -83144 -64361 -328859
10612 -328859 -3955 -180475 -179174 60010 245165 -40473 107500 12248 -130762 201150 -95934
10600 -30296 -70699 250673 -193046 5519 -250188 -13430 -71963 112525 32562 4994 -8563
10588 145347 -11012 -222535 -159682 27892 99358 -36496 127705 -101873 131745 -128742
10577 -38493 -196361 14977 -120191 -228001 -130510 -128944 53289 25124 75580 110934 246846
10566 246846 -159018 -24723 166202 -121818 -113657 -146104 122417 -178573 -116460 46358 27598
10555B7598h9274A44137J12729C444Q487a61589L7822H9694l2276a70606D3251
10543A17152A1494b43207M796j16081Q6472C45653b52159g5180k04471J30046
10533a49605k75898a86772h4777B1362a78898B13538D4932a18834a2019C0590
10522a51661B42011J10102f4912l8865B12782M3454b25102B9405m814i6324M6751
10511d9573B5612b16403B2579a28309c5768o214m65536B13284a74891m4906J59
10500b19638D7443d0029I2191C9549L35165a62111j69243h9843O434Q236j23903
10489a99076I0652K493c2653o3375j78416h885A31334P989m9953M55565k30635
10478C14300J24238G1731K08788H89J5293J564K34107b6902A23201i5407o6706
$$ plain form
10555 27598 -89274 144137 256866 3444 11931 -161589 -123767 89694 57418 -170606 43251
10543 117152 11494 -243207 -238411 -354492 -268020 345653 -252159 -75180 -279651 -149605
10533 -149605 -425503 -186772 -84777 21362 -178898 213538 44932 -118834 -12019 30590
10522 -151661 242011 352113 -64912 -103777 212782 256236 -225102 29405 24591 -96324 -49573
10511 -49573 25612 -216403 22579 -128309 -35768 -41982 -507518 213284 -174891 -219797 -219638
10500 -219638 47443 -40029 92191 39549 374714 -162111 -331354 -89843 -83409 -75173 -199076
10489 -199076 90652 93145 -32653 -96028 -274444 -8885 131334 139323 89370 544935 314300
10478 314300 438538 71731 280519 889 16182 17746 251853 -26902 123201 -95407 -162113
10467a62113C37531M33e4307Q338A05463n0651a43706K7046D6585g666A68108
10455a0597B2806h8686A53559e49552a4785J762A28531b02792n4600C6237b57989
10443c204j3558j81596A69945q1096b38978O0093f3303k37130j3338B43298O5377
10432C08675G5121K66663m6370a96287A07075O8526D631Q5827a46596l257h159
10420B99531g2141K528B18893R7033i3757J1287p9428b2994E6530O912k669a26578
10407a74316r2225j07098A57483G8263R821f631a787A06353C3395a33489A22335
10395a67589j3778C10895e7796C18423A40698K9851Q4585K5012A14128e3110k13948
10384b67058c4265B21078J18832D9854J16717G2247J84113K9652C619J71562R0271
$$ plain form
10467 -162113 337531 337964 -54307 -45969 105463 54812 -143706 -116660 46585 -7666 168108
10455 -10597 22806 -88686 153559 -549552 -14785 -13023 128531 -202792 -257392 36237 -257989
10443 -3204 -16762 -198358 169945 88849 -238978 -178885 -63303 -300433 -313771 243298 308675
10432 308675 75121 341784 295414 -196287 107075 175601 4631 90458 -146596 -149853 -8159
10420 299531 -72141 -69613 218893 315926 -93757 -82470 -161898 -22994 56530 63442 60773 -126578
10407 -174316 -266541 -373639 157483 78263 88084 -6631 -1787 106353 33395 -133489 122335
10395 -167589 -181367 310895 -57796 318423 140698 170549 255134 280146 114128 -53110 -267058
10384 -267058 -34265 221078 339910 49854 166571 72247 256360 286012 3619 175181 265452
10373B65452j16948K57021j26960j7265O6654K02536j14321p9591L037L19740
10363F59355B40127J33983a22351D74556i2148E45134A81943d3647H6609Q3027
10353A69636O6440J76692L31747j62388m8694k61888K30346j38786n9177J7732
10343C21660J46090B23323b8288m6022B90957j03285g0622C64878A43670M2824
10333A86494J79145a88215A0132J0685L9704e3272A07619b75414B66432E4966
10322B36677j06651D6989a5019H4145L4814Q4007p919C5356N2565K5704a87536
10310b90570f9216J3612p179A41436D0302m186a19170q8870E0298g380F5389b54563
10297i5761d1078j27720C9998Q8808b71338b0989o9156B27968G714a25915A94329
$$ plain form
10373 265452 148504 405525 278565 261300 327954 530490 416169 336578 339615 659355
10363 659355 240127 374110 -122351 474556 -92148 545134 181943 -43647 86609 169636
10353 169636 236076 412768 744515 582127 533433 271545 501891 363105 303928 321660
10343 321660 467750 223323 -28288 -74310 290957 187672 -70622 364878 143670 186494
10333 186494 365639 -188215 10132 20817 60521 -53272 107619 -275414 266432 54966
10322 236677 130026 46989 -15019 84145 118959 202966 195047 35356 87921 113625 -187536
10310 -290570 -69216 -55604 -62783 141436 40302 36116 -119170 -208040 50298 -7380 65389 -254563
10297 -95761 -41078 -168798 39998 128806 -271338 -20989 -90145 227968 7714 -125915 194329
10285b72908Q259C6718a85072B39473R229A01403a48206A42407b06176K2570N9638
10274a23968H4224A6721L574a54491j21256f7499B88230i6064H9242C5097J1941
10263D7038L60498j99111q245K5086M3703L89088B14876M5491R528n6652H1234
10251g3804B306K03179a85457L73j74361C22730g1735A96157b63488G6462K2688
10240I9150a16418D5308A2887K6075a50138k66257J44459a21995o3749C9810o931
10229C2879b5031A38976c38425a68558f6589r8004P9210k33642D21777c27232
10218G0016a51908A92062a51878r6578a07883C2952f39688c7005D4842K2376b1152
10206A82990d13584d1311A14650a45321M0327k39214g5370A88562a58018D4496
$$ plain form
10285 -272908 -264649 36718 -185072 239473 248702 101403 -148206 142407 -206176 -183606 -123968
10274 -123968 84224 16721 20295 -154491 -275747 -67499 288230 -96064 89242 35097 47038
10263 47038 407536 208425 200180 225266 268969 658057 214876 260367 269895 213243 81234
10251 -73804 2306 205485 -185457 -185084 -359445 322730 -71735 196157 -263488 76462 99150
10240 99150 -116418 45308 12887 38962 -150138 -416395 -271936 -121995 -185744 39810 32879
10229 32879 -25031 138976 -338425 -168558 -66589 -164593 -85383 -319025 421777 -327232
10218 70016 -151908 192062 -151878 -248456 -107883 32952 -639688 -37005 44842 67218 -21152
10206 182990 -413584 -41311 114650 -145321 -104994 -344208 -75370 188562 -158018 44496
10195C34924a72998A7058P102a62738o3799c3563K209j45473c2214l5559j03076
10184a70849O1944e1905k28531a0489H6724K41148c19565F4184a81934B2449L890
10173B6339J0708b7581E2841O6312c5881A46587a0327G0842b14650P2335K3402
10162a18913L5977E466b14032r296e0850r0106f7925l65732G1185a73503n2739
10151b26242k43088a43305A30186h3111A79325N122F8412a95886I7376C314c7004
10139b98213R9354J2677A06709b87605J2069l6170C4230g5656H7573a27758d7467
10127a84793j74866m3472A49688a33845R88l35278b14262A50613a73858K9542
10117a44316l21923a41506A19053D3248a03831F6064b65724J14868c8268G3169
$$ plain form
10195 334924 -172998 17058 24160 -162738 -226537 -33563 -31354 -176827 -32214 -67773 -170849
10184 -170849 -108905 -51905 -280436 -10489 86724 327872 -319565 64184 -181934 22449 26339
10173 26339 37047 -27581 52841 119153 -35881 146587 -10327 70842 -214650 -142315 -118913
10162 -118913 -82936 5466 -214032 -223328 -50850 -140956 -67925 -433657 71185 -173503 -226242
10151 -226242 -469330 -143305 130186 -83111 179325 184447 68412 -195886 97376 3314 -37004
10139 -298213 -198859 -186182 106709 -287605 -275536 -311706 34230 -75656 87573 -127758 -47467
10127 -184793 -359659 -403131 149688 -133845 -132857 -468135 -214262 150613 -173858 -144316
10117 -144316 -466239 -141506 119053 43248 -103831 66064 -265724 -150856 -38268 73169
10106a62387C9313c05366P7713d0957B9480f9295A3568b52245A15443e5533B68089
10094b14601O4447e076o2207a5902k31725m2936F0784A3854J55819d3450n4816
10083i8266j01418j616a2451F7494a00540A81256a21747i732j07118L5234j58836
10072b40452C35114G7926a16675B89748A41570a83897A25043a81059k8942D6089
10061a47512M9182J2746j80744A88331f6356H4625J6490c43573A90106j2484c58891
10049b520q4995A80504o3719c26989A59252L3577b61816A15933a29297j69812
10039b99109d7783o7703A44742a70300j78753F6629h0433C1455a71885k5883P0499
10028a27269B77208c4973a5237A30232g5091b396k19802A5994J42653H080c25422
$$ plain form
10106 -162387 39313 -305366 -227653 -40957 29480 -69295 13568 -252245 115443 -55533 268089
10094 -214601 -150154 -5076 -67283 -15902 -247627 -290563 60784 13854 169673 -43450 -98266
10083 -98266 -199684 -201300 -12451 67494 -100540 181256 -121747 -9732 -116850 -81616 -240452
10072 -240452 335114 77926 -116675 289748 141570 -183897 125043 -181059 -210001 46089
10061 -147512 -98330 -85584 -266328 188331 -66356 84625 101115 -343573 190106 177622 -358891
10049 -2520 -87515 180504 116785 -326989 159252 192829 -261816 115933 -129297 -299109
10039 -299109 -47783 -115486 144742 -170300 -349053 66629 -80433 31455 -171885 -197768 -127269
10028 -127269 277208 -34973 -15237 130232 -75091 -2396 -222198 15994 158647 8080 -325422
10016I968J91836F1525a71951g1528n0185B32578B8905a99083j24442A06596b8992
10004E3735O5994J06455a86146A31656i3674j29887r9206C71025a08269D7784
9993a0678B54516a60861A61624a76787k8338a7894k92668a21230L1713j9443L7932
9982g1028B25828A3403i0686k9922k94888j04862K39019k7840B13561q1232d1249
9970a59967B77442a36411b2240j03824j5511J6949c7603C8102a21772N2256C52482
9958a06940A31264j164h410n41064a1589A98264a47954B18553b79009k9995c9917
9946f4770m020j40126D52369j96396c09112e2638q6458I8141d1996J6748G0713
9934g5931D1597K02790G9829c43303A33980C8235a33992M614A90989b91403a36972
$$ plain form
10016 9968 201804 61525 -171951 -71528 -121713 232578 28905 -199083 -323525 106596 -28992
10004 53735 119729 226184 -186146 131656 -93674 -223561 -322767 371025 -108269 47784
9993 -10678 254516 -160861 161624 -176787 -205125 -17894 -310562 -121230 -89517 -108960 -71028
9982 -71028 225828 13403 -90686 -120608 -415496 -520358 -281339 -309179 213561 132329 -41249
9970 -159967 277442 -136411 -22240 -126064 -141575 -124626 -37603 38102 -121772 -69516 352482
9958 -106940 131264 130100 -8410 -549474 -11589 198264 -147954 218553 -279009 -309004 -39917
9946 -64770 -68790 -208916 452369 255973 -309112 -52638 -139096 98141 -41996 -25248 70713
9934 -75931 41597 244387 79829 -343303 133980 38235 -133992 -129378 190989 -291403 -136972
9922a20528A13455b06708Q9841G3552a30869B07015a82154k17020a16594c2311
9911H7314g9603D4384e8293a9701C12802g646o8515L6955F5655B5290b45458d5737
9898a78688e1073j14999a8943E43915d367C66527d4618j05451b6761j25319j14116
9887b66196a12745j44089A45931c97375i1474L7151I3424J97289e71450K35153
9877c36297B08574h107k53911g2980k15134P2157C04540d5359J8060j91146O0921
9866a57524r8664C66240A54214h2508L4219j46597c1102j54010k7497A57211P1313
9855B28524o759i9574A32709A8461b58621A03133g6603B66283R5390j28237H5025
9843c53325D2963h7238B5663J77060n7527o9677j6884J06600C4212N6624b64442
$$ plain form
9922 -120528 113455 -206708 -116867 73552 -130869 207015 -182154 -399174 -116594 -32311
9911 87314 -79603 44384 -58293 -19701 312802 -7646 -76161 -39206 65655 25290 -245458 -45737
9898 -178688 -51073 -166072 -18943 543915 -4367 366527 -44618 -150069 -26761 -152080 -266196
9887 -266196 -112745 -256834 145931 -397375 -91474 -54323 93424 290713 -571450 -336297
9877 -336297 208574 -8107 -262018 -72980 -288114 -215957 304540 -45359 -27299 -218445 -157524
9866 -157524 -256188 366240 154214 -82508 -48289 -194886 -31102 -185112 -212609 157211 228524
9855 228524 221765 -99574 132709 18461 -258621 103133 -76603 266283 361673 233436 85025
9843 -353325 42963 -87238 25663 202723 145196 75519 58635 165235 34212 90836 -264442
9831b50261n5970J43589k3309g4201m2357D3735a64693n4125B68240E5253M4232
9820I9485a31500A75017m4635M4272e8441o3585M604H8370Q9664a16789c7081
9808D6650a38555j84162A27774E3269a79116A12038f094H9503b1012k46773L6107
9797b31678Q4368O3738Q320l88066G4348a34448A52380a07444c6824j2196j07170
9786a56190l95103D9137K32665c57988J68431A49901E0111c1639q6261l45231
9776d63131f878k39173C09028a48775M7227H5396J22329I3074m0734j4117f8997
9764A40816b47962O0552B68022I111a382G7178b81375e9451K2828j30702B19997
9752A32170E3971a33615B02029a89441P0543d3301k2113A24595A357c25771a50092
$$ plain form
9831 -250261 -306231 -162642 -185951 -74201 -116558 43735 -164693 -218818 268240 55253 99485
9820 99485 -131500 175017 130382 174654 -58441 -122026 -117422 88370 178034 -116789 -37081
9808 46650 -138555 -322717 127774 53269 -179116 112038 -6094 89503 -21012 -267785 -231678
9797 -231678 -147310 -83572 -75252 -463318 74348 -134448 152380 -107444 -36824 -49020 -156190
9786 -156190 -551293 49137 281802 -357988 -189557 149901 50111 -31639 -117900 -463131
9776 -463131 -6878 -246051 309028 -148775 -101548 85396 207725 93074 52340 38223 -68997
9764 140816 -247962 -187410 268022 9111 -1382 77178 -281375 -59451 -36623 -167325 219997
9752 132170 53971 -133615 202029 -189441 -118898 -43301 -65414 124595 1357 -325771 -150092
9740b82233H4712c0025A46846b685j53988N3621p6721L4946j67262b5588B86150
9728A77188G3132a0965k05467e5613C5780A5965b68942a33653A18339A13K37591
9717B37704d4689j24440R36Q1266o2975e4800F7546K57631B7484L1845J59945
9706B19274c18118c7388l70019J28587M772A16707D3978a44217J7227q2561P6985
9695a32566k19628e320j32390j4639a4042k2993D8348h1279l1621l9331a7094
9683B12571I9277A2217a19947m9765K3671j01723B3952i4233j4431k77201J06050
9672b79815b8698j39150b0560k67134a25716c4977k32266e052n7014D2522J3326
9661E5848a32252o0700B3608a18180a9682B21491L3455k7924d81222a96391L8002
$$ plain form
9740 -282233 84712 -30025 146846 -2685 -156673 -103052 -179773 -144827 -312089 -25588 286150
9728 177188 73132 -10965 -216432 -55613 35780 15965 -268942 -133653 118339 113 237704
9717 237704 -44689 -169129 -168193 -86927 -149902 -54800 67546 325177 27484 59329 219274
9706 219274 -318118 -37388 -407407 -278820 -274048 116707 43978 -144217 -126990 -209551 -132566
9695 -132566 -352194 -5320 -137710 -152349 -14042 -37035 48348 -81279 -112900 -152231 -17094
9683 212571 99277 12217 -119947 -169712 -146041 -247764 23952 -94233 -108664 -385865 -279815
9672 -279815 -28698 -167848 -20560 -287694 -125716 -34977 -267243 -5052 -62066 42522 55848
9661 55848 -132252 -192952 23608 -118180 -19682 221491 254946 227022 -481222 -196391 -158389
9650a58389G083J39058F5826P8561a70429P9523p3185f2314k13044P6197B2208
9638b8680l5538j6546i134j38585B46566F9505h9843c7719I1503a32969c0879
9626f0865a5709j59862L7871j86718G1029a03986A26571a62734H1882J15871j6175
9615A81578F7540i1290C6629e5724F0256d3580j18817k7154e1736h955E489c0504
9602A5034a37143A23851a71236l31241g9557n0255d22j05133B77619b80280J09945
9591a70335A27954b73425O3367j22350M4430A13068P2534g3066k22548h7456k135
9580h9591M3772D7748R163c16944J18350A94874h4805k00659l522c4638n6313
9569i0951H7476K2054N6203c917l09511K8539A25391b10399h0331B8133f8646
$$ plain form
9650 -158389 7083 146141 65826 144387 -170429 -90906 -164091 -62314 -275358 -199161 22208
9638 -28680 -64218 -80764 -9134 -147719 246566 69505 -89843 -37719 91503 -132969 -30879
9626 -60865 -15709 -175571 -137700 -324418 71029 -103986 126571 -162734 81882 197753 181578
9615 181578 67540 -91290 36629 -55724 60256 -43580 -162397 -189551 -51736 -8955 5489 -30504
9602 15034 -137143 123851 -171236 -502477 -79557 -129812 -422 -105555 277619 -280280 -170335
9591 -170335 127954 -273425 -210058 -332408 -287978 113068 185602 -73066 -295614 -87456 -89591
9580 -89591 -45819 47748 56911 -316944 -198594 194874 -84805 -285464 -288986 -34638 -90951
9569 -90951 87476 109530 165733 -3917 -313428 -284889 125391 -210399 -80331 28133 -68646
9557b73954b5868k15819R1939A86292e7882E310a51972I2084c7536E135a909D5735
9544C4954R0348a56334j25662J21083G1705L843f6698A921K1293a8068D6283M3433
9532H9716k6529c75010A52433l7932c02073l3391j47650B0233f8309a4504C9125
9520f730p537r6678B67383b51210M9346I1686a65942A20154l2333a81085G2768
9508b06286O9977E9165c66258B525e79632H04M20935b48551d3710j7921A3326
9496b76281A97459a35842j35377D5142a12314p5671r705A28099b22769A80087
9485E0414a27592k97353B47029j00251H827d6899k29164A10205h8448G3612a34152
9473a16923F6045O0063b19136P736N4522B6061a8280F4566j9212K1031c28366
$$ plain form
9557 -273954 -25868 -241687 -149748 186292 -57882 5310 -151972 92084 -37536 5135 -1909 45735
9544 34954 125302 -156334 -281996 -160913 71705 75548 -66698 1921 23214 -18068 46283 89716
9532 89716 63187 -375010 152433 114501 -302073 -335464 -483114 20233 -68309 -14504 39125
9520 -6730 -14267 -110945 267383 -251210 -201864 91686 -165942 120154 87821 -181085 72768
9508 -206286 -136309 59165 -366258 2525 -579632 804 421739 -248551 -43710 -61631 13326
9496 -276281 197459 -135842 -271219 45142 -112314 -187985 -197690 128099 -222769 180087
9485 50414 -127592 -424945 247029 146778 8827 -46899 -276063 110205 -88448 73612 -134152
9473 -116923 66045 126108 -219136 -211400 -156878 26061 -18280 64566 45354 66385 -328366
9461a19046A43580b3985p6790A9618d4443J1065C8699K60249A46421L9228b41763
9449E1765b38782g2271l2314j21184D777O5448b03397N12G7161b10874B15350
9437e01087a85458e4562A80971d164k01297A79691E3404c27335F6299d44423A98852
9425d9412k75458E6078K75498b15620O1446f0969I5379a14476K6510j50787F5413
9413B80718G3697a17711P627l9836B2198c19446J24004J766A11508d29870G0645
9401H9657B1015N131b90069j2993h7714j93522I1135c17030j26107C51764c19570
9389B39376k070d69617J40851b6084D1297M7883g4114B09848c8307n8763I203
9377a94483R3578l7297N8702L0967B7610b4726C02818a23292k2018N2086o5498
$$ plain form
9461 -119046 143580 -23985 -100775 19618 -44443 -33378 38699 298948 146421 185649 -241763
9449 51765 -238782 -72271 -104585 -225769 4777 70225 -203397 -202885 77161 -210874 215350
9437 -501087 -185458 -54562 180971 -4164 -205461 179691 53404 -327335 66299 -444423 198852
9425 -49412 -324870 56078 331576 -215620 -154174 -60969 95379 -114476 -87966 -238753 65413
9413 280718 73697 -117711 -110084 -149920 22198 -319446 -195442 -193676 111508 -429870 70645
9401 89657 21015 26146 -290069 -303062 -87714 -281236 91135 -317030 -443137 351764 -319570
9389 239376 237306 -469617 -328766 -26084 41297 89180 -74114 209848 -38307 -97070 9203
9377 -194483 -100905 -138202 -79500 -48533 27610 -24726 302818 -123292 -145310 -93224 -158722
9366a58722B17276f0308m6757o8554e3488p7244B30634A03986c74795i5560l7562
9355a33122j11754H3734c00143a38907A71218K39244F9243N342J98097a04237
9344B118a86682J8280B26313c3398j89368E813e4971A04379f0458j97348j9586
9333b77392c0633k94578H6956A8236K66334E6549a468B00449F704J72171m8065
9322A30810b52503J05813j2252C04204b19293E2313B4536f2531D0377a21057E0910
9310e5815j24770a6458n3574C01704a48096A59972J18736m5606F5440a28899j81615
9299c10514D4241j0363a35115m6711C9031g8540F1722B9752b7949C721a35045
9287e5375k36785D22579e8002A66298a28608H989K78885o6862r5811A9794K60659
$$ plain form
9366 -158722 217276 -60308 -107065 -175619 -53488 -130732 230634 103986 -374795 -95560 -133122
9355 -133122 -244876 83734 -300143 -138907 171218 410462 69243 74585 272682 -104237
9344 2118 -186682 -168402 226313 -33398 -222766 5813 -54971 104379 -60458 -257806 -277392
9333 -277392 -30633 -325211 86956 18236 284570 56549 -1468 200449 6704 178875 130810
9322 130810 -252503 -146690 -158942 304204 -219293 52313 24536 -62531 40377 -121057 50910
9310 -55815 -180585 -16458 -70032 301704 -148096 159972 278708 233102 65440 -128899 -310514
9299 -310514 44241 33878 -135115 -181826 39031 -78540 61722 29752 -27949 3721 -135045
9287 -55375 -292160 422579 -58002 166298 -128608 8989 287874 221012 125201 19794 280453
9276B80453i7547B57618a21510B11144h4275G5418c37107J53596C1241f9554b3061
9264b25864M2813k0741Q8283A81294a29366J4862A14287b23591c7001j84877g7929
9252b08972K7704k36061G6319b00641M7896N0359j08302i539B43477a08055p9349
9241a87404Q4996A86178d05887i0461q1277F8625r077b55520A39964b16557M0177
9230a76380I9683m2773d88033J54084J21100J02239A87615o3390b44496h9292
9219A0280Q0070b33859F9688R3133a10742M5179j25225i1120m2244j01262B37728
9207C20461a54736I9526b15160J7044j46388j34601b04511m601e8106j97305E3091
9195f9643m7904c7685C11078B7501a14806N2538A53333a90616o9624F4104f11825
$$ plain form
9276 280453 -97547 257618 -121510 211144 -84275 75418 -337107 -183511 31241 -69554 -23061
9264 -225864 -183051 -203792 -115509 181294 -129366 -114504 114287 -223591 -37001 -221878 -77929
9252 -208972 -181268 -417329 76319 -200641 -152745 -102386 -210688 -9539 243477 -108055 -187404
9241 -187404 -102408 186178 -405887 -90461 -171738 68625 59548 -255520 139964 -216557 -176380
9230 -176380 99683 56910 -488033 -333949 -212849 -110610 187615 124225 -244496 -89292
9219 10280 90350 -233859 69688 162821 -110742 -65563 -190788 -91120 -133364 -234626 237728
9207 320461 -154736 99526 -215160 -198116 -344504 -479105 -204511 -209112 -58106 -255411 53091
9195 -69643 -117547 -37685 311078 27501 -114806 -62268 153333 -190616 -260240 64104 -611825
9183a8532A84599J5848q4783c6082j74708n2228Q9105A47568b61960P9685j2167
9172a94442k28247a39534j31064B81h0211L3082k94357A11378D8492a59090m7653
9161b06743G0343K54548r8903b00877A8566J13620g833C091R2151a61259a8637
9149B41109a75564h007j16956N2300j63116B1110N9535C2332h903A30904a59594
9137d44644B34139L3802b00087A0712J99435a67063I5218L0413a60490G7185c7554
9125h3682j70208A50707E1911a71062I8858a5358B74700b17072B06165a54565
9114i1733a4653k30028M7147R5041n3080o8989j21967D7138i0127n5964C7051
9102B71478H6011d00206A77567a64833D8662b71080b2112C4715J31877G1125a69571
$$ plain form
9183 -18532 184599 200447 115664 -36082 -210790 -263018 -173913 147568 -261960 -182275 -194442
9172 -194442 -422689 -139534 -270598 281 -80211 -47129 -341486 111378 48492 -159090 -206743
9161 -206743 70343 324891 225988 -200877 18566 132186 -7833 3091 95242 -161259 -18637
9149 241109 -175564 -8007 -124963 -72663 -235779 21110 80645 32332 -8903 130904 -159594
9137 -444644 234139 267941 -200087 10712 210147 -167063 95218 125631 -160490 77185 -37554
9125 -83682 -253890 150707 51911 -171062 98858 -15358 274700 -217072 206165 -154565
9114 -91733 -14653 -244681 -197534 -102493 -155573 -224562 -346529 47138 -90127 -146091 37051
9102 271478 86011 -400206 177567 -164833 48662 -271080 -22112 34715 166592 71125 -169571
9090F9739b5124k02798D41182a8870g148k03946A49462J3772D2455a54261I7807
9078c34444a02375j42784J8954h7002K8532j40131P1309L5498B39608B0349N0065
9067G0414d6698A30492a47983D9893b21356b2537A66304E1502E764a45614C42001
9055a24239L8499p4140q8949J17000j51632G8002L8660b33827j78737d0139G7829
9043C9967J89609J02670j38430F3890a29108A04938a22478A3536b68637J17878
9033a50759N4922F5130a3358C9803O1717b09067A45587b2499j1182j46629G2537
9021c08521O6044M6300a5023A1790b9222k5894K3585k42704A28627C0788J22186
9010A52974b40581A86193e1571A32212J02383a91461g5818m61536b221k70752
$$ plain form
9090 69739 -25124 -227922 441182 -18870 -7148 -211094 149462 163234 42455 -154261 97807
9078 -334444 -102375 -245159 -226205 -87002 -58470 -198601 -127292 -91794 239608 20349 70414
9067 70414 -46698 130492 -147983 49893 -221356 -22537 166304 51502 5764 -145614 342001
9055 -124239 -85740 -159880 -248829 -131829 -283461 78002 116662 -233827 -412564 -40139 77829
9043 39967 229576 332246 193816 63890 -129108 104938 -122478 13536 -268637 -150759
9033 -150759 -95837 65130 -13358 39803 101520 -209067 145587 -22499 -33681 -180310 72537
9021 -308521 -242477 -196177 -15023 11790 -29222 -55116 -31531 -274235 128627 30788 152974
9010 152974 -240581 186193 -51571 132212 234595 -191461 -75818 -537354 -2221 -272973
9000b72973A26443J03439b00469b1890m13209b1411C63329A18064L422c1873j3736
8989d5609B31250i0115M2779o2008A22330c44366G6221a92516K7695E8039a2106
8977B13770b3637j63636N2421A13421a82361i0290A42412d6915A03728D0975c90723
8965a17129C55807E3709a93969D7593e9862m4789q641B0197b7742j89769d1978
8953b2447n789m72411F4846g0536G6253d70583A8560L46718c06509J20444a8669
8941f5532B85789j38664d3756C13570A17043j6286J10784J05179c7607A87034
8930A93306I065b53003b8373m24906B89439M17495O82535L253408J2791540m772670
8920A2661747B517918H44342k07466m3543e2222k28472d713j24874Q675B62730
$$ plain form
9000 -272973 126443 229882 -200469 -21890 -435099 -21411 363329 118064 121486 -31873 -45609
8989 -45609 231250 -90115 -47336 -109344 122330 -344366 76221 -192516 -164821 58039 -12106
8977 213770 -23637 -187273 -134852 113421 -182361 -90290 142412 -46915 103728 40975 -390723
8965 -117129 355807 53709 -193969 47593 -59862 -104651 -113292 20197 -27742 -217511 -41978
8953 -22447 -28236 -500647 64846 -70536 76253 -470583 18560 365278 -306509 -186065 -18669
8941 -65532 285789 147125 -43756 313570 117043 100757 211541 316720 -37607 187034
8930 193306 9065 -253003 -28373 -453279 289439 706934 1389469 4642877 17434417 12661747
8920 12661747 2517918 844342 636876 593333 -52222 -280694 -4713 -129587 -120912 262730
8909B06656n1597K36569G9073f9140j94634A20769L9175a37571B3493c6714h472
8897a28255k00033H8042k0694N5291K48460r3520j34619B4959a44528m7269j05803
8886b97600B78892h0936D3320h1629k2297m9729a0325r5971l2091j47279L1375
8875b54291i3265r0540G212Q0859D0271A2473b48103B93012H2516P500j4528O4685
8863A40173J55929n1338b44181h5849A45504i1218A28666f9251B25390j8347a67714
8851A9075F734h0227B28098D0647N4576a19108K1381a8840j78734L4834j29327
$$ plain form
8909 206656 155059 391628 79073 -69140 -263774 120769 159944 -137571 23493 -36714 -8472
8897 -128255 -328288 88042 67348 122639 371099 277579 142960 24959 -144528 -191797 -297600
8886 -297600 278892 -80936 43320 -81629 -103926 -153655 -10325 -106296 -138387 -285666 -254291
8875 -254291 -93265 -183805 7212 88071 40271 12473 -248103 293012 82516 90016 75488 140173
8863 140173 296102 244764 -244181 -85849 145504 -91218 128666 -69251 225390 207043 -167714
8851 19075 6734 -80227 228098 40647 95223 -119108 -97727 -18840 -197574 -162740 -292067
$$ [...]
##END NTUPLES=NMR SPECTRUM
##END=
