##TITLE=AC1501_CRIANN13308_8125382_Exf7PWUoEY
##JCAMPDX= 6.0         $$ Bruker NMR JCAMP-DX V2.0
##DATA TYPE= NMR SPECTRUM
##DATA CLASS= NTUPLES
##ORIGIN= BRUKER
##OWNER= Administrator
$$ 1.72 TOPSPIN		Version 2.1
$$ 2013-08-16 17:05:15.337 -0700  Administrator@X
$$ Compression mode = diff/dup
##.OBSERVE FREQUENCY= 400.02188249412
##.OBSERVE NUCLEUS= ^1H
##.ACQUISITION MODE= SIMULTANEOUS (DQD)
##.ACQUISITION SCHEME= undefined
##.AVERAGES= 64
##.DIGITISER RES= 22
##SPECTROMETER/DATA SYSTEM= spect
##.PULSE SEQUENCE= noesygpps1d.comp
##.SOLVENT NAME= COFFEE_meoh
##.SHIFT REFERENCE= INTERNAL, COFFEE_meoh, 1, 14.96079
##AUDIT TRAIL= $$ (NUMBER, WHEN, WHO, WHERE, PROCESS, VERSION, WHAT)
$$ ##TITLE= Audit trail, TOPSPIN		Version 2.1
$$ ##JCAMPDX= 5.01
$$ ##ORIGIN= Bruker BioSpin GmbH
$$ ##OWNER= Administrator
$$ $$ E:\/data/COFFEE/nmr/AC1501_CRIANN13308_8125382_Exf7PWUoEY/22/pdata/1/auditp.txt
$$ ##AUDIT TRAIL=  $$ (NUMBER, WHEN, WHO, WHERE, PROCESS, VERSION, WHAT)
(   1,<2013-08-16 17:05:10.524 -0700>,<Administrator>,<X>,<go>,<TOPSPIN 2.1>,
      <created by zg
	started at 2013-08-16 16:53:40.938 -0700,
	POWCHK enabled, PULCHK disabled,
       configuration hash MD5:
       C8 4E 4E 5D D3 5C D8 9E 9F 52 82 E0 59 8A DE 15
       data hash MD5: 64K
       B8 31 FE 5C 9F 45 5E C3 E7 E5 A1 B4 2D 13 1B 7C>)
(   2,<2013-08-16 17:05:13.399 -0700>,<Administrator>,<X>,<proc1d>,<TOPSPIN 2.1>,
      <Start of raw data processing
       efp LB = 0.3 FT_mod = 6 PKNL = 1 PHC0 = 0 PHC1 = 0 SI = 128K 
       data hash MD5: 128K
       96 71 D5 6B 7B 7D 98 02 AA 5E 5A DA 51 33 04 1D>)
(   3,<2013-08-16 17:05:14.368 -0700>,<Administrator>,<X>,<proc1d>,<TOPSPIN 2.1>,
      <pk PHC0 = -78.8324 PHC1 = 0 
       data hash MD5: 128K
       9F A9 E1 18 1E 24 A4 F5 32 99 EE 40 39 E6 15 68>)
(   4,<2013-08-16 17:05:14.774 -0700>,<Administrator>,<X>,<proc1d>,<TOPSPIN 2.1>,
      <abs ABSG = 1 
       data hash MD5: 128K
       73 04 9F F8 79 72 64 F0 95 35 E3 A3 10 D2 44 F2>)
(   5,<2013-08-16 17:05:14.868 -0700>,<Administrator>,<X>,<proc1d>,<TOPSPIN 2.1>,
      <abs ABSG = 2 
       data hash MD5: 128K
       ED 04 6F CB B5 ED F2 8B 63 91 93 95 A8 22 59 76>)
(   6,<2013-08-16 17:05:14.962 -0700>,<Administrator>,<X>,<proc1d>,<TOPSPIN 2.1>,
      <abs ABSG = 3 
       data hash MD5: 128K
       C9 2C 74 0C AC E0 88 FE C7 01 51 B6 6C EA 2B E7>)
(   7,<2013-08-16 17:05:15.056 -0700>,<Administrator>,<X>,<proc1d>,<TOPSPIN 2.1>,
      <abs ABSG = 4 
       data hash MD5: 128K
       7B 94 97 87 11 96 2D E5 BE 82 CA C8 F8 04 C8 C7>)
(   8,<2013-08-16 17:05:15.149 -0700>,<Administrator>,<X>,<proc1d>,<TOPSPIN 2.1>,
      <abs ABSG = 5 
       data hash MD5: 128K
       80 0B 4E 53 30 04 5B 41 40 24 11 61 6D D2 1F 5D>)
$$ ##END=
$$ 
$$ $$ hash MD5
$$ $$ 96 3B 03 A1 E4 C7 A0 22 04 C8 1D 1B A8 17 D9 7D
##$RELAX= 
##$RELAX= 
##$RELAX= 
##$RELAX= 
##$RELAX= 
##$RELAX= 
##$RELAX= 
##$RELAX= 
$$ Bruker specific parameters
$$ --------------------------
##$DU= <E:\>
##$EXPNO= 22
$$ [...]
##$TP07= 0
##$TPNAME0= <>
##$TPNAME1= <>
##$TPNAME2= <>
##$TPNAME3= <>
##$TPNAME4= <>
##$TPNAME5= <>
##$TPNAME6= <>
##$TPNAME7= <>
##$TPOAL= (0..7)
0.5 0.5 0.5 0.5 0.5 0.5 0.5 0.5
##$TPOFFS= (0..7)
0 0 0 0 0 0 0 0
##$TUNHIN= 0
##$TUNHOUT= 0
##$TUNXOUT= 0
##$USERA1= <user>
##$USERA2= <user>
##$USERA3= <user>
##$USERA4= <user>
##$USERA5= <user>
##$V9= 5
##$VALIST= <valist>
##$VCLIST= <CCCCCCCCCCCCCCC>
##$VD= 0
##$VDLIST= <DDDDDDDDDDDDDDD>
##$VPLIST= <PPPPPPPPPPPPPPP>
##$VTLIST= <TTTTTTTTTTTTTTT>
##$WBST= 2048
##$WBSW= 25
##$XGAIN= (0..3)
0 0 0 0
##$XL= 0
##$YL= 0
##$YMAX_a= 6119198
##$YMIN_a= -12351957
##$ZGOPTNS= <>
##$ZL1= 120
##$ZL2= 120
##$ZL3= 120
##$ZL4= 120
##$ABSF1= 14.96079
##$ABSF2= -5.597392
##$ABSG= 5
##$ABSL= 3
##$ALPHA= 0
##$AQORDER= 0
##$ASSFAC= 0
##$ASSFACI= 0
##$ASSFACX= 0
##$ASSWID= 0
##$AUNMP= <proc_prof1d_extract.lims>
##$AXLEFT= 0
##$AXNAME= <>
##$AXNUC= <1H>
##$AXRIGHT= 0
##$AXTYPE= 0
##$AXUNIT= <>
##$AZFE= 0.1
##$AZFW= 0.1
##$BCFW= 0
##$BC_mod= 0
##$BYTORDP= 0
##$COROFFS= 0
##$CY= 15
##$DATMOD= 1
##$DC= 0
##$DFILT= <>
##$DTYPP= 0
##$F1P= 0
##$F2P= 0
##$FCOR= 0.5
##$FTSIZE= 131072
##$FT_mod= 6
##$GAMMA= 0
##$GB= 0
##$INTBC= 1
##$INTSCL= 1
##$ISEN= 128
##$LB= 0.3
##$LEV0= 0
##$LPBIN= 0
##$MAXI= 10000
##$MC2= 0
##$MEAN= 0
##$ME_mod= 0
##$MI= 0
##$NCOEF= 0
##$NC_proc= -2
##$NLEV= 6
##$NOISF1= 0
##$NOISF2= 0
##$NSP= 0
##$NTH_PI= 0
##$NZP= 0
##$OFFSET= 14.96079
##$PC= 1
##$PHC0= -78.8324
##$PHC1= 0
##$PH_mod= 1
##$PKNL= yes
##$PPARMOD= 0
##$PPDIAG= 0
##$PPIPTYP= 0
##$PPMPNUM= 2147483647
##$PPRESOL= 1
##$PSCAL= 4
##$PSIGN= 0
##$PYNMP= <proc.py>
##$REVERSE= no
##$SF= 400.020009720063
##$SI= 131072
##$SIGF1= 0
##$SIGF2= 0
##$SINO= 400
##$SIOLD= 131072
##$SPECTYP= <>
##$SREGLST= <1H.CDCl3>
##$SSB= 0
##$STSI= 131072
##$STSR= 0
##$SW_p= 8223.68421052631
##$SYMM= 0
##$S_DEV= 0
##$TDeff= 65536
##$TDoff= 0
##$TI= <>
##$TILT= no
##$TM1= 0
##$TM2= 0
##$TOPLEV= 0
##$USERP1= <user>
##$USERP2= <user>
##$USERP3= <user>
##$USERP4= <user>
##$USERP5= <user>
##$WDW= 1
##$XDIM= 131072
##$YMAX_p= 437350753
##$YMIN_p= -12236
##$CURPLOT= <Network HP LaserJet P1505>
##$CURPRIN= <$Network HP LaserJet P1505>
##$DFORMAT= <normdp>
##$LAYOUT= <+/1D_H.xwp>
##$LFORMAT= <normlp>
##$PFORMAT= <normpl>
##$SURQMSG= 1
$$ End of Bruker specific parameters
$$ ---------------------------------
##NTUPLES= NMR SPECTRUM
##VAR_NAME=  FREQUENCY,     SPECTRUM/REAL,   SPECTRUM/IMAG
##SYMBOL=    X,             R,               I
##VAR_TYPE=  INDEPENDENT,   DEPENDENT,       DEPENDENT
##VAR_FORM=  AFFN,          ASDF,            ASDF
##VAR_DIM=   131072,        131072,          131072
##UNITS=     HZ,            ARBITRARY UNITS, ARBITRARY UNITS
##FACTOR=    0.0627417313425164, 1,          1
##FIRST=     8223.62146879497, 3701,         -63316
##LAST=      0,             5440,            -63009
##MIN=       0,             -12236,          0
##MAX=       8223.62146879497, 437350753,    0
$$ Real data points
##PAGE= N=1
##DATA TABLE= (X++(R..R)), XYDATA
$$ [...]
61747D87444J122N40k77j358k534l682m630n068m915m532m173l586k700k207k654
$$ 487444 488566 489106 488829 487471 484937 481255 476625 471557 466642 462110 457937 454351 451651 449444 446790
61732D46790l297k806j114L81O79K95K13N98J038J448K009K625L004L146L276
$$ 446790 443493 440687 439573 439954 440633 440928 441141 441739 442777 444225 446234 448859 451863 455009 458285
61717D58285L429L481L473L566L721L675L234K462J604Q91L17m27j628l083m147
$$ 458285 461714 465195 468668 472234 475955 479630 482864 485326 486930 487821 488138 487711 486083 483000 478853
61702D78853m428m196l978l933l819l479l056k827l018l700m587n036m549l389
$$ 478853 474425 470229 466251 462318 458499 455020 451964 449137 446119 442419 437832 432796 428247 424858
61688D24858k454k322k632k620k121j666j670j936k100k198k485k967l442l802
$$ 424858 422404 420082 417450 414830 412709 411043 409373 407437 405337 403139 400654 397687 394245 390443
61674C90443l970l731l032k309j991j887j550j116j048j129o13M24Q62J75o44
$$ 390443 386473 382742 379710 377401 375410 373523 371973 370857 369809 368680 368067 368491 369353 369528 368884
61659C68884n33K8j49j012j256q9J901L620M334L764K200O91L02R20J451J367
$$ 368884 368351 368379 368230 367218 365962 365873 367774 371394 375728 379492 381692 382383 382685 383605 385056 386423
61643C86423J279J761K414K667K749L178L713L586K625J480O78%j036k357l233
$$ 386423 387702 389463 391877 394544 397293 400471 404184 407770 410395 411875 412553 412553 411517 409160 405927
61628D05927k962j650k70J51n26j506k007k007j993k220k441k310j804j218q37
$$ 405927 402965 401315 401045 401196 400670 399164 397157 395150 393157 390937 388496 386186 384382 383164 382327
61613C82327o65n40m70p45j570k728l780m536n141n723o210o516o677o739o635
$$ 382327 381662 381122 380652 379907 378337 375609 371829 367293 362152 356429 350219 343703 337026 330287 323652
61598C23652o208n271l815k230j224j201j806k341k540k623k696k501j896j216
$$ 323652 317444 312173 308358 306128 304904 303703 301897 299556 297016 294393 291697 289196 287300 286084
61584B86084r34j177j604j775j578j367j594k233k751k755k419k022j508q52m76
$$ 286084 285150 283973 282369 280594 279016 277649 276055 273822 271071 268316 265897 263875 262367 261515 261039
61569B61039o44p41P5J586K609K479J686R27L32r5m4N93J283J485J327J231J239
$$ 261039 260395 259654 259729 261315 263924 266403 268089 269016 269348 269253 269209 269802 271085 272570 273897 275128 276367
61552B76367J199J232J574K099K452K473K226J734J035L24k30o56r78j037p51
$$ 276367 277566 278798 280372 282471 284923 287396 289622 291356 292391 292715 292485 291829 290851 289814 289063
61537B89063k84K12Q20J537K070K220K218K349K450K134J316K54p67j526j869
$$ 289063 288779 288991 289811 291348 293418 295638 297856 300205 302655 304789 306105 306359 305592 304066 302197
61522C02197j826j625j428j283j406k026k717k512j122L95Q24K92j26k6m8o46
$$ 302197 300371 298746 297318 296035 294629 292603 289886 287374 286252 286647 287471 287763 287637 287611 287563 286917
61506B86917j262j099j65P25Q12M1r28j278p56J27P21Q90Q89Q84R13J100J407
$$ 286917 285655 284556 284391 285116 285928 285969 285041 283763 283007 283134 283855 284745 285634 286518 287431 288531 289938
61489B89938J367O24l17n15J69Q57Q02J92l61n73m07K08J121J820K015K101K593
$$ 289938 291305 291929 291612 291097 291266 292123 292925 293117 292756 292183 291776 291984 293105 294925 296940 299041 301634
61472C01634L303L538K977J970J051M78K29L1n24j451k029j490j86M55m31k012
$$ 301634 304937 308475 311452 313422 314473 314951 315180 315211 314687 313236 311207 309717 309531 309986 309555 307543
61456C07543k666j831l46P82J342J508J266O84K79N41J214J504J046L00K4O38
$$ 307543 304877 303046 302700 303482 304824 306332 307598 308282 308561 309102 310316 311820 312866 313166 313190 313828
61440C13828J975L409M232M270M040M051M110L706K916K332K143J943J509J115
$$ 313828 315803 319212 323444 327714 331754 335805 339915 343621 346537 348869 351012 352955 354464 355579
61426C55579Q75M40k87p89p16n14o62q38m52L07P35O85O75R35J078P94L46J41
$$ 355579 356454 356894 356607 355818 355102 354588 353926 353088 352636 352943 353678 354363 355038 355973 357051 357845 358191 358332
61408C58332K15K68n2r26k178l213l541l344l252l540l790l457k509j447q40p89
$$ 358332 358547 358815 358763 357837 355659 352446 348905 345561 342309 338769 334979 331522 329013 327566 326726 325937
61392C25937p41j5J339K378K253J134q5p81q49l28O27J517J873J877K074K446
$$ 325937 325196 325181 326520 328898 331151 332285 332200 331419 330570 330242 330869 332386 334259 336136 338210 340656
61376C40656K451K010J785K184K721K747K325J971J851J754J575J413J269J029
$$ 340656 343107 345117 346902 349086 351807 354554 356879 358850 360701 362455 364030 365443 366712 367741
61362C67741P10M97N59R33J537K119K384K301K252K666L542M440N007N419O176
$$ 367741 368451 368948 369507 370440 371977 374096 376480 378781 381033 383699 387241 391681 396688 402107 408283
61347D08283P368Q255P925O391M667L568K915K251J789K058K900L678M293N119
$$ 408283 415651 423906 431831 438222 442889 446457 449372 451623 453412 455470 458370 462048 466341 471460
61333D71460N900N679M138K233J030N34N0q30k044l364m332m400l613k813k662
$$ 471460 477360 483039 487177 489410 490440 490974 491024 490194 488150 484786 480454 476054 472441 469628 466966
61318D66966k819k601k032j664j580j239k13J434L386N230O449O865P113Q145
$$ 466966 464147 461546 459514 457850 456270 455031 454818 456252 459638 464868 471317 478182 485295 493440
61304D93440J0158J2333J3714J3968J3200J1462Q748N366J993p51k737m292n663
$$ 493440 503598 515931 529645 543613 556813 568275 577023 582389 584382 583631 580894 576602 570939
61291E70939o728p327p695q119q376q067p474p341p640p391o117m705m114l904
$$ 570939 564211 556884 549189 541070 532694 524627 517153 509812 502172 494781 488664 483959 479845 475941
61277D75941k963j248K35R68J465K217L058L739M386N030N299M910M116L412L139
$$ 475941 472978 471730 471965 472933 474398 476615 479673 483412 487798 492828 498127 503037 507153 510565 513704
61262E13704L406M084M875N706O934Q640R867R348P043M291K298J247R07J250
$$ 513704 517110 521194 526069 531775 538709 547349 557216 566564 573607 577898 580196 581443 582350 583600
61248E83600J985K340J936J323J072R04K49q32j944l062m202m803m318l254k795
$$ 583600 585585 587925 589861 591184 592256 593160 593409 592577 590633 587571 583369 578566 574248 570994 568199
61233E68199l317m077m335m105l553k437o24J340K650L099L103L025K851K497
$$ 568199 564882 560805 556470 552365 548812 546375 545751 547091 549741 552840 555943 558968 561819 564316
61219E64316K132J971J968J968K135K936M447N917O414N822M779L637K066l3j844
$$ 564316 566448 568419 570387 572355 574490 577426 581873 587790 594204 600026 604805 608442 610508 610475 608631
61204F08631k448j903r61O7J426L053M376N253O362Q266J0611J2682J4379J6032
$$ 608631 606183 604280 603319 603386 604812 607865 612241 617494 623856 632122 642733 655415 669794 685826
61190F85826J7391J7456J5455J1713P410L749J426N31N80Q47Q89Q38R37R72M75
$$ 685826 703217 720673 736128 747841 755251 759000 760426 760957 761537 762384 763273 764111 765048 766020 766495
61175G66495n57j585k260k827l547m179m403m475m901n628o175o470o940p740
$$ 766495 765938 764353 762093 759266 755719 751540 747137 742662 737761 732133 725958 719488 712548 704808
61161G04808q503r114j0000j1316j2360j2299j1186r821q783p964o914n290l186
$$ 704808 696305 687191 677191 665875 653515 641216 630030 620209 611426 603462 596548 591258 588072
61148E88072j209j17r8o56j423k696m826p430r623j0878j1160j0519r056p228
$$ 588072 586863 586746 586648 585992 584569 581873 577047 569617 559994 549116 537956 527437 518381 511153
61134E11153n622m369l199k058j219p03J8J490L543N357O250O427O837Q168J0124
$$ 511153 505531 501162 497963 495905 494686 493983 494001 495491 499034 504391 510641 517068 523905 532073 542197
61119E42197J1978J3625J5544J7702J9309J9967K0384K1389K2821K3936K4450
$$ 542197 554175 567800 583344 601046 620355 640322 660706 682095 704916 728852 753302
61108G53302K4547K4316K3822K3289K2643K1319J9185J7079J5541J3619R986M936
$$ 753302 777849 802165 825987 849276 871919 893238 912423 929502 945043 958662 968648 973584
61096I73584J03l557o345q638j0427j2157j4635j7714k0153k1139k1100k0706
$$ 973584 973687 970130 963785 955147 944720 932563 917928 900214 880061 858922 837822 817116
61084H17116k0127j9606j9664k0197k0254j9252j7656j5990j4112j2002j0368
$$ 817116 796989 777383 757719 737522 717268 698016 680360 664370 650258 638256 627888
61073F27888r686r310q340o841n549m797m261l501k311q24M28R50R50J153J848
$$ 627888 618202 608892 600552 593711 588162 583365 579104 575603 573292 572468 572896 573846 574796 575949 577797
61058E77797K654L323M064M967N858O889Q381J0034J1157J1829J2851J4349J5566
$$ 577797 580451 583774 587838 592805 598663 605552 613933 623967 635124 646953 659804 674153 689719
61045F89719J6284J7229J8761K0407K2033K4156K6586K8290K9135L0254L2004
$$ 689719 706003 723232 741993 762400 784433 808589 835175 863465 892600 922854 954858
61034I54858L3223L3333L3515L4751L6431L8020M0280M3531M6394M7744M8174
$$ 954858 988081 1021414 1054929 1089680 1126111 1164131 1204411 1247942 1294336 1342080 1390254
61023A390254M8090M6516M3654M2511M5591N1745N8633O6450P6430Q7502R7563
$$ 1390254 1438344 1484860 1528514 1571025 1616616 1668361 1726994 1793444 1869874 1957376 2054939
61012B054939J06753J16686J28347J43951J68670K06317K55181L12549L81048
$$ 2054939 2161692 2278378 2406725 2550676 2719346 2925663 3180844 3493393 3874441
61003C874441M65333N65846O83800Q29899J018250J254363J542662J898470K313001
$$ 3874441 4339774 4905620 5589420 6419319 7437569 8691932 10234594 12133064 14446065
60994A4446065K677543K771768K397500J569065N59994k69148o99920p25474m44796
$$ 14446065 17123608 19895376 22292876 23861941 24421935 24152787 23452867 22727393 22282597
60985B2282597L7091N80653R51042Q89567L02544o30437j563485k209999k480045
$$ 22282597 22319688 22900341 23851383 24740950 25043494 24413057 22849572 20639573 18159528
60976A8159528k446530k232950j941240j639836j368313j138599r44543p78898
$$ 18159528 15712998 13480048 11538808 9898972 8530659 7392060 6447517 5668619
60968E668619o40166n26705m33336l55868k93714k46405k11404j86136j68564
$$ 5668619 5028453 4501748 4068412 3712544 3418830 3172425 2961021 2774885 2606321
60959B606321j55259j42448j29601j18769j09951j00436q9215p8550p0072o2623
$$ 2606321 2451062 2308614 2179013 2060244 1950293 1849857 1760642 1682092 1612020 1549397
60949A549397n5293m9744m7711m8339m9501n0003m9295m6873m3272m0110l8041
$$ 1549397 1494104 1444360 1396649 1348310 1298809 1248806 1199511 1152638 1109366 1069256 1031215
60938A031215l5986l3156l0321k8250k6623k5290k4961k5601k5650k4060k1750
$$ 1031215 995229 962073 931752 903502 876879 851589 826628 801027 775377 751317 729567
60927G29567k0006j8668j6980j5080j3499j2185j1017j0419j0507j0485r706q575
$$ 729567 709561 690893 673913 658833 645334 633149 622132 611713 601206 590721 581015 572440
60915E72440p651o724n422m059l128k638k360k087j395k7J295J555J080J263K374
$$ 572440 564789 558065 552643 548584 545456 542818 540458 538371 536976 536949 538244 539799 540879 542142 544516
60900E44516L073K535J569J022N91K5l0O85J212Q47K00j45o74j711k441k416k698
$$ 544516 547589 550124 551693 552715 553306 553331 553301 553986 555198 556045 556245 556100 555426 553715 551274 548858 546160
60883E46160m181n942o665o664o978p449p266o715o745p224p134o238n270m704
$$ 546160 541979 536037 529372 522708 515730 508281 501015 494300 487555 480331 473197 466959 461689 456985
60869D56985m416m304m277l964l301k887k962k720j532j12O54J185K225L117K658
$$ 456985 452569 448265 443988 440024 436723 433836 430874 428154 426622 426510 427164 428349 430574 433691 436349
60854D36349J115q3m40o14q45n57M19J540K466L134L079J897K73o65r14j326j969
$$ 436349 437464 437381 436941 436327 435482 434925 435344 436884 439350 442484 445563 447460 447733 447068 446154 444828 442859
60837D42859k187k095k526l267l060j666n26p07j504j733j278o41J4O58R94R84
$$ 442859 440672 438577 436051 432784 429724 428058 427532 426825 425321 423588 422310 421669 421683 422341 423335 424319
60821D24319J054J251R35r5r48q55l62m99j321k023k215k252k463k744k943l078
$$ 424319 425373 426624 427559 427464 426516 425661 425299 424800 423479 421456 419241 416989 414526 411782 408839 405761
60805D05761l091k819k370k243k837l922m776m943m713m627m629m142l114k390
$$ 405761 402670 399851 397481 395238 392401 388479 383703 378760 374047 369420 364791 360649 357535 355145
60791C55145k637l385l700l476l327l440l340k790k217j978j828j268j27J279
$$ 355145 352508 349123 345423 341947 338620 335180 331840 329050 326833 324855 323027 321759 321632 322911
60777C22911K292K313J448O50P23J358J671J473J365J665K079K480L248M552N899
$$ 322911 325203 327516 328964 329614 330337 331695 333366 334839 336204 337869 339948 342428 345676 350228 356127
60762C56127O599O318N076L267J701J058J142J262J271J528J801J201m11j863
$$ 356127 362726 369044 374120 377387 379088 380146 381288 382550 383821 385349 387150 388351 387940 386077
60748C86077k120j619j403j556j351o30j12l23r34j459k018l082m695o288p260
$$ 386077 383957 382338 380935 379379 378028 377398 377286 376963 376029 374570 372552 369470 364775 358487 351227
60733C51227p463p137o471n520m429l477k764k080j331p78o81q98j114j244j250
$$ 351227 343764 336627 330156 324636 320207 316730 313966 311886 310555 309777 309096 308198 307084 305840 304590
60718C04590q81r0N32L63l20o38l83k18n18o52M5J191J791J521J014R02J051R43
$$ 304590 303709 303619 304151 304514 304194 303556 303173 302955 302437 301785 301830 303021 304812 306333 307347 308249 309300 310243
60700C10243N95O72J578K688K927K103J203J142J684K041K078K310K926L547L871
$$ 310243 310838 311510 313088 315776 318703 320806 322009 323151 324835 326876 328954 331264 334190 337737 341608
60685C41608L958L776L155K289J824K142K893L428L384K768J818R62N72N54M34
$$ 341608 345566 349342 352497 354786 356610 358752 361645 365073 368457 371225 373043 374005 374577 375131 375565
60670C75565p9q14j471j945k227k332k430k831l622m468m880m636l925l117k415
$$ 375565 375486 374672 373201 371256 369029 366697 364267 361436 357814 353346 348466 343830 339905 336788 334373
60655C34373j672o87L28Q38O57K38R7L31Q36J642K628L302L269K588J395l01k035
$$ 334373 332701 332014 332342 333180 333837 334075 334172 334503 335339 336981 339609 342911 346180 348768 350163 349862 347827
60638C47827k834k474k250l408n230n800m528k691j476p05Q6N43J73n85q08k36
$$ 347827 344993 342519 340269 336861 331631 325831 321303 318612 317136 316431 316517 317060 317233 316648 315840 315604
60622C15604O03J174J389J438J397J091L11p19j339j219q44p89q23l58M74R97
$$ 315604 316207 317381 318770 320208 321605 322696 323007 322288 320949 319730 318886 318097 317274 316916 317390 318387
60606C18387J087J222J490J418R32N28L84J24k51j72M19P22L14k9N39J671K308
$$ 318387 319474 320696 322186 323604 324536 325064 325448 325572 325321 325149 325568 326290 326604 326575 327114 328785 331093
60589C31093J964J021J01l80l85l54p67j365j292k60R48J507J465J277J053P78
$$ 331093 333057 334078 334179 333799 333414 333060 332293 330928 329636 329376 330324 331831 333296 334573 335626 336404
60573C36404Q32J650L077M488N391N742N890O476P980J0176J2270J3644J4017
$$ 336404 337236 338886 341963 346451 351842 357584 363474 369950 377930 388106 400376 414020 428037
60560D28037J3015J0364O700L328P72j689m567p083q138p759o878o095n249l917
$$ 428037 441052 451416 458116 461444 462216 460527 455960 448877 440739 432980 426102 420007 414758 410841
60546D10841j857P25L046M279M599N135O603Q564J0373J2125J4064J5839J7023
$$ 410841 408984 409709 412755 417034 421633 426768 433371 441935 452308 464433 478497 494336 511359
60533E11359J7766J8152J7459J5010J1357P726M534J213k643o626r911j1757j1865
$$ 511359 529125 547277 564736 579746 591103 598829 603363 604576 601933 595307 585396 573639 561774
60520E61774j0784r644r086q702p979p165o612n884m408k560j214m92J60R10J507
$$ 561774 550990 541346 532260 523558 515579 508414 501802 495918 491510 488950 487736 487244 487404 488314 489821
60505D89821K110L191M790O692R135J2447J6094J9229K2143K6067L1264L6450
$$ 489821 491931 495122 499912 506604 515739 528186 544280 563509 585652 611719 642983 679433
60493F79433M0411M3240M5409M6589M6066M3720L9821L4304K6867J7609P085m108
$$ 679433 719844 763084 808493 855082 901148 944868 984689 1018993 1045860 1063469 1070554 1066446
60481A066446j5367k5930l5016m2133m7012m9436m9420m7487m4512m1201l7783
$$ 1066446 1051079 1025149 990133 948000 900988 851552 802132 754645 710133 668932 631149
60470F31149l4183l0414k6725k3403k0491j7863j5535j3619j1991j0329q640p332
$$ 631149 596966 566552 539827 516424 495933 478070 462535 448916 436925 426596 417956 410624
60458D10624o503n653m493l591l633m272m455l799k939k505k378k162j858j705
$$ 410624 404121 398468 393975 390384 386751 382479 378024 374225 371286 368781 366403 364241 362383 360678
60444C60678j763j916k056k067j817j362r38o57l42J33N37N39K21R5M67R70R46
$$ 360678 358915 356999 354943 352876 351059 349697 348759 348102 347760 347893 348430 348969 349190 349285 349752 350722 351668
60427C51668L16k96m77o70j365k037j657k72P90O41p3k07M00J110J549J756J685
$$ 351668 351984 351688 351211 350541 349176 347139 345482 345210 346000 346641 346568 346361 346761 347871 349420 351176 352861
60410C52861J319J038J207J569J604J306J031Q48O84Q45J625K478K461J540P48
$$ 352861 354180 355218 356425 357994 359598 360904 361935 362783 363467 364312 365937 368415 370876 372416 373164
60395C73164Q44J491J974K114K199K417K768L170L374L048K207J431J386K132
$$ 373164 374008 375499 377473 379587 381786 384203 386971 390141 393515 396563 398770 400201 401587 403719
60381D03719L053L447L157K599K219K033J875J852K151K520K471K042J769J732
$$ 403719 406772 410219 413376 415975 418194 420227 422102 423954 426105 428625 431096 433138 434907 436639
60367D36639J379O30K97Q74J650J770J491J516J633J164L95M09J517K928M011
$$ 436639 438018 438648 438945 439819 441469 443239 444730 446246 447879 449043 449438 449847 451364 454292 458303
60352D58303M887N660O082O308P094Q671J0051J0024Q413O049L770J835j0k131
$$ 458303 463190 468850 474932 481240 488334 497005 507056 517080 525493 531542 535312 537147 537137 535006
60338E35006m557o775q081q179p378o327n685n749o054n659m256k803k549l588
$$ 535006 530449 523674 515593 507414 500036 493709 488024 482275 476221 470562 466306 463503 460954 457366
60324D57366m822n178m431l075j918j596j982k214j750r95m79M5R65J904K458
$$ 457366 452544 447366 442935 439860 437942 436346 434364 432150 430400 429405 428926 428971 429936 431840 434298
60309D34298L355N617Q790J1338J2837J4424J6847J9380K1022K1557K0834J8233
$$ 434298 437653 443270 452060 463398 476235 490659 507506 526886 547908 569465 590299 608532
60297F08532J3696Q405L575q87n811j1312j6549k0469k2308k1819j9569j6634
$$ 608532 622228 630633 634208 633321 627510 616198 599649 579180 556872 535053 515484 498850
60285D98850j3588j0195o470l360j806j576j705j687j663j743j844k082k654l345
$$ 498850 485262 475067 468597 465237 463431 461855 460150 458463 456800 455057 453213 451131 448477 445132
60271D45132l599l211k578k202k189k361k625k988l220k792j526k20r0j332k763
$$ 445132 441533 438322 435744 433542 431353 428992 426367 423379 420159 417367 415841 415621 415531 414199 411436
60256D11436l247k940k598k244j394k12N49O27L88ln49p23O2J238J479O03j21
$$ 411436 408189 405249 402651 400407 399013 398801 399350 399977 400365 400362 399813 399090 399152 400390 401869 402472 402351
60239D02351J50P21P38M71N13O74N07L02O36J441K184K576K595K264J918K161
$$ 402351 402501 403222 403960 404431 404944 405618 406125 406427 407063 408504 410688 413264 415859 418123 420041 422202
60223D22202L060L848L933L591L215K630J765J279J743K725L497M144N120O138
$$ 422202 425262 429110 433043 436634 439849 442479 444244 445523 447266 449991 453488 457632 462752 468890
60209D68890O509O340O528P496Q636R055Q434P170O090N871O347O570N920M871
$$ 468890 475399 481739 488267 495763 504399 513454 521888 529058 535148 541019 547366 553936 559856 564727
60195E64727M280M288M353M071L444K530J402K87o12j300j749j808j649j856k667
$$ 564727 569007 573295 577648 581719 585163 587693 589095 589382 588770 587470 585721 583913 582264 580408 577741
60180E77741l559m036m379n038n760n956n616n231m985m670m167l510k654j740
$$ 577741 574182 570146 565767 560729 554969 549013 543397 538166 533181 528511 524344 520834 518180 516440
60166E16440j306j674k378k787k962l266l386k611r99N01J127R67M34j82o18o78
$$ 516440 515134 513460 511082 508295 505333 502067 498681 496070 495071 495572 496699 497666 498100 497918 497300 496622
60150D96622n21m78m48J7Q95J475J240N43J33K88P13J124J596K301L199M057M743
$$ 496622 496101 495623 495175 495192 496087 497562 498802 499345 499478 499766 500479 501603 503199 505500 508699 512756 517499
60133E17499N280N596N531N154M887M920M757L790K233J003P22J243K108K921
$$ 517499 522779 528375 533906 539060 543947 548867 553624 557414 559647 560650 561372 562615 564723 567644
60119E67644L248K873K269K253L003L892M360M350L906L124K481K411K412J586
$$ 567644 570892 573765 576034 578287 581290 585182 589542 593892 597798 600922 603403 605814 608226 609812
60105F09812J11r35j423k441m255n470n123m200l941l923l227k409k671l734m251
$$ 609812 609923 608988 607565 605124 600869 595399 590276 586076 582135 578212 574985 572576 569905 566171 561920
60090E61920l793k982j989n55P30Q75J63p9M58O90K7p89j154j521k277k878k773
$$ 561920 558127 555145 553156 552601 553331 554206 554369 554290 554748 555438 555465 554676 553522 552001 549724 546846 544073
60073E44073k349k287k678l295m076m866n258n184n119n360n529n198m583m232
$$ 544073 541724 539437 536759 533464 529388 524522 519264 514080 508961 503601 498072 492874 488291 484059
60059D84059m290m361l964l058k290k470l510m151l321j521j92R7K7K85Q54J619
$$ 484059 479769 475408 471444 468386 466096 463626 460116 455965 452644 451123 450931 451028 451055 451340 452194 453813
60043D53813K698L956M927N605O519P802Q735Q557P175N059K956J807K062K846
$$ 453813 456511 460467 465394 470999 477518 485320 494055 502612 509787 514846 517802 519609 521671 524517
60029E24517K610R48r62k003k433l095m070m814n133n300n516n791o150o566o849
$$ 524517 527127 528075 527113 525110 522677 519582 515512 510698 505565 500265 494749 488958 482808 476242 469393
60014D69393o933p098p532p898p678o824n804n064m615m162l524k855k346j852
$$ 469393 462460 455362 447830 439932 432254 425430 419626 414562 409947 405785 402261 399406 397060 395208
60000C95208j051j24K60j15n24k72L16N50N81J090K013K572K593K772L429L916
$$ 395208 394157 394033 394293 394178 393654 393382 393698 394248 394829 395919 397932 400504 403097 405869 409298 413214
59984D13214L636K962K596K654K759K629K185J458O87K08L0k20q15j619k303k592
$$ 413214 416850 419812 422408 425062 427821 430450 432635 434093 434780 434988 435018 434798 433983 432364 430061 427469
59968D27469k414k093k217k871l278k803j940j521j268k30J444K343J710M10l94
$$ 427469 425055 422962 420745 417874 414596 411793 409853 408332 407064 406834 408278 410621 412331 412741 412347
59953D12347n71n46m82m61p69j289j261k13J290K307K474K018J390J175J675K256
$$ 412347 411776 411230 410748 410287 409518 408229 406968 406755 408045 410352 412826 414844 416234 417409 419084 421340
59937D21340J794K04j255j630j411j455j615j283n97q2L87J307K546L533M304
$$ 421340 423134 423338 422083 420453 419042 417587 415972 414689 414092 414010 414397 415704 418250 421783 426087
59922D26087N397O829P985Q623R153R711R632Q235N748L101J044k67r63j084o44
$$ 426087 431484 438313 446298 454921 464074 473785 483417 491652 497400 500501 501545 501278 500315 499231 498587
59907D98587Q9O43P21M40N0l49o11l84M16J169J145M53q6MM78R93J492J875J966
$$ 498587 498676 499319 500040 500480 500530 500181 499570 499186 499602 500771 501916 502369 502283 502287 502765 503758 505250 507125 509091
59888E09091J982K462L517M622N247N252M545L119J593J050J923L512M858N494
$$ 509091 511073 513535 517052 521674 526921 532173 536718 539837 541430 542480 544403 547915 552773 558267
59874E58267N258M092K401R74J35n57j478k382k969l413l976m602n192n669n617
$$ 558267 563525 567617 570018 570992 571127 570570 569092 566710 563741 560328 556352 551750 546558 540889 535272
59859E35272m562k899j724j350q16O17K374L605M509N716P009P705P913Q526R978
$$ 535272 530710 527811 526087 524737 523921 524538 526912 530517 535026 540742 547751 555456 563369 571895 581873
59844E81873J1618J2202J0654O774J716k541m736n095m415k994j025N94O41j331
$$ 581873 593491 605693 616347 623121 624837 622296 617560 612465 608050 605056 604031 604625 605266 603935
59830F03935m666q028r999r849q291o925o484o206n328m315l898l754l130k192
$$ 603935 599269 591241 581242 571393 563102 556177 549693 543487 538159 533844 529946 526192 523062 520870
59816E20870j684j665j657j730k398l538m287m110l270k355j861k076k710k850
$$ 520870 519186 517521 515864 514134 511736 508198 503911 499801 496531 494176 492315 490239 487529 484679
59802D84679j866j84J308K222K572K209J173J71j96l32r48j796k018j474q24n18
$$ 484679 482813 482629 483937 486159 488731 490940 492113 492284 492088 491756 490808 489012 486994 485520 484696 484178
59786D84178o12j270k412l113k520j339j157k278l341l334k727k286j917j331
$$ 484178 483566 482296 479884 476771 474251 472912 471755 469477 466136 462802 460075 457789 455872 454541
59772D54541q70r29j165r27r2J018K062K666K524J935J786K493L415L819L991
$$ 454541 453671 452742 451577 450650 450558 451576 453638 456304 458828 460763 462549 465042 468457 472276 476267
59757D76267M742O035O853O511N603N282N943O964P672Q132Q710R186Q856P499
$$ 476267 481009 487044 493897 500408 506011 511293 517236 524200 531872 540004 548714 557900 566756 574255
59743E74255N810M587L921L420K863K300J751J200O28o1r36j619j540q09l91r41
$$ 574255 580065 584652 588573 591993 594856 597156 598907 600107 600735 600674 599738 598119 596579 595770 595379 594438
59727E94438j976k639k762k623k262j733j567k091k608k186j082m71q20j389j450
$$ 594438 592462 589823 587061 584438 582176 580443 578876 576785 574177 571991 570909 570438 569618 568229 566779
59712E66779j203j183j400j449j087m87o4q7k93q2P67J762K381K684L006L401
$$ 566779 565576 564393 562993 561544 560457 559970 559906 559819 559526 559444 560211 561973 564354 567038 570044 573445
59696E73445L801M255M593M351L511K805K736K838K484J809J121J37j305k438
$$ 573445 577246 581501 586094 590445 593956 596761 599497 602335 604819 606628 607749 607886 606581 604143
59682F04143k505j932j501j067l25j77j671l957n125m948n052o142o924o352n234
$$ 604143 601638 599706 598205 597138 596813 596636 594965 591008 585883 580935 575883 569741 562817 556465 551231
59667E51231m770m888m889m668m332l589k353j261p63m43J95R36J509K213L229
$$ 551231 546461 541573 536684 532016 527684 524095 521742 520481 519718 519275 519470 520406 521915 524128 527357
59652E27357M025M196M287M940N787N959N340M480L532K044k43k899n116o206
$$ 527357 531382 535578 539865 544805 550592 556551 561891 566371 569903 571947 571704 568805 563689 557483
59638E57483o036n257m896n447o414o884o384n120l703k732k369k306k342k781
$$ 557483 551447 546190 541294 535847 529433 522549 516165 511045 507342 504610 502241 499935 497593 494812
59624D94812l807m762m791m058l519l516l523l340l485m107m514m239l682l249
$$ 494812 491005 486243 481452 477394 473875 470359 466836 463496 460011 455904 451390 447151 443469 440220
59610D40220k635j521l02N32J102J693K130K173K007J887J713J358R69N75q1r18
$$ 440220 437585 436064 435762 436294 437396 439089 441219 443392 445399 447286 448999 450357 451326 451901 451820 450902
59594D50902j324r70l15J10L94P98J182J328J340J323J102O43K55K9l69j036j563
$$ 450902 449578 448608 448293 448403 448797 449595 450777 452105 453445 454768 455870 456513 456768 456797 456428 455392 453829
59577D53829j777k098k787l442l692l727l712l343k483j607j165j063j182j600
$$ 453829 452052 449954 447167 443725 440033 436306 432594 429251 426768 425161 423996 422933 421751 420151
59563D20151j933j371K7J013Q27K88L64O62L59j71k8O05Q36O62Q87J580J986J939
$$ 420151 418218 416847 416874 417887 418714 419002 419366 420028 420387 420216 420188 420793 421629 422291 423178 424758 426744 428683
59545D28683K175L055L983M392M537N054O215P837R533J1250J3878J8621K4751
$$ 428683 430858 433913 437896 442288 446825 451879 458094 465931 475464 486714 500592 519213 543964
59532E43964K8465K5481J5350K390p936j2979j3419j1247q118n035k443l71J280
$$ 543964 572429 597910 613260 615650 607714 594735 581316 570069 561951 556916 554473 554102 555382
59519E55382K445K962K785K070J072r3j601l628n820p362p931q158q777r564r706
$$ 555382 557827 560789 563574 565644 566716 566623 565022 561394 555574 548212 540281 532123 523346 513782 504076
59504E04076r016q154p619p162o381n411m656m162l592k858k345k398k659k322
$$ 504076 495060 486906 479287 472125 465744 460333 455677 451515 447923 445065 442720 440322 437663 435341
59490D35341j215k02j03n41n01K36R76J437K129L149L671L210K525K551L113L539
$$ 435341 434126 433924 433821 433280 432779 433015 433991 435428 437557 440706 444377 447587 450112 452663 455776 459315
59474D59315L817M267M533L985K839J979J704J559J239R54Q93R24Q85O71J81l07
$$ 459315 463132 467399 471932 475917 478756 480735 482439 483998 485237 486191 487084 488008 488893 489564 489745 489438
59458D89438oJ521L571N030N706O259O986P515P621P592P625P499O986O150N182
$$ 489438 489432 490953 494524 499554 505260 511519 518505 526020 533641 541233 548858 556357 563343 569493 574675
59443E74675M264L445K299j2l656p356r424r525q727p946p111n888m459l301k713
$$ 574675 578939 582384 584683 584671 581015 573659 564235 554710 545983 538037 530926 525038 520579 517278 514565
59428E14565k656k726k266j024M11J345K011L259N356P750R910J1755J3288J4617
$$ 514565 511909 509183 506917 505893 506304 507649 509660 512919 518275 526025 535935 547690 560978 575595
59414E75595J6166J8040J9445J9922K1046K5054L0943L3447K7506J3445l209j6479
$$ 575595 591761 609801 629246 649168 670214 695268 726211 759658 787164 800609 797400 780921
59402G80921k3577k4741k1566j6108j0040l555M277J2909J8496J6249N255r729
$$ 780921 757344 732603 711037 694929 684889 681334 685611 698520 717016 733265 738520 728791
59390G28791k1998k8025k8640k6271k2466j8033j3855j0499p683m976k610j057
$$ 728791 706793 678768 650128 623857 601391 583358 569503 559004 551321 546345 543735 542678
59378E42678j99M27R36J337K022L295M641N276N301N532O228O724O407N372M098
$$ 542678 542479 542906 543842 545179 547201 550496 555137 560413 565714 571246 577474 584198 590605 595977 600075
59363F00075L028K553K728K971K632J996K072L192M482N062N201N757O835P653
$$ 600075 603103 605656 608384 611355 613987 615983 618055 621247 625729 630791 635992 641749 648584 656237
59349F56237P687P436P839R185J0915J2461J3822J5037J5494J4531J2619J1156
$$ 656237 663924 671360 679199 688384 699299 711760 725582 740619 756113 770644 783263 794419
59337G94419J0760J0453R027O537L809J168j631m541p179r326j0827j1367j1096
$$ 794419 805179 815632 824659 831196 835005 836173 834542 830001 822822 813496 802669 791302 780206
59324G80206j1069j2125j3492j3531j1854r761q514q026p537o741n894n343n235
$$ 780206 769137 757012 743520 729989 718135 708374 699860 691834 684297 677556 671662 666319 661084
59311F61084n304m941l885k790k517k965l299l183l008k764j689O22L570O497
$$ 661084 655780 650839 646954 644164 641647 638682 635383 632200 629192 626428 624739 625361 628931 635428
59297F35428R610J3192J6194J6297J1677K757p681j6181k0782k1817k0827j8997
$$ 635428 645038 658230 674424 690721 702398 705155 697474 681293 660511 638694 617867 598870
59285E98870j6670j3825j0509p089m383l150l058k660j008J285L164M673O356
$$ 598870 582200 568375 557866 550777 546394 543244 540186 537526 536518 537803 540967 545640 551996
59272E51996P830Q318Q315R276J1450J3400J3908J3244J2166J0797R062P228N364
$$ 551996 559826 568144 576459 585735 597185 610585 624493 637737 649903 660700 669762 676990 682354
59259F82354L054J58k693m850o333p418q169q701r276r797r796r158q285p344
$$ 682354 685408 685566 682873 678023 671690 664272 656103 647402 638126 628329 618533 609375 601090 593746
59245E93746o027m345k869j870r22K76J421K256L051L942M585M862N262O036O670
$$ 593746 587719 583374 580505 578635 577713 577989 579410 581666 584717 588659 593244 598106 603368 609404 616074
59230F16074O693O346N844M771K927J182N49P19L09j453l921n882o775o984p190
$$ 616074 622767 629113 634957 639728 642655 643837 644386 645105 645414 643961 640040 634158 627383 620399 613209
59215F13209p443p057n551l578k358k343k911l363l487l196k500j947k235l060
$$ 613209 605766 598709 593158 589580 587222 584879 581968 578605 575118 571922 569422 567475 565240 562180
59201E62180l292k585j917k058k496k499k276k318k371j983j395r39k13J220K731
$$ 562180 558888 556303 554386 552328 549832 547333 545057 542739 540368 538385 536990 536051 535838 537058 539789
59186E39789L366L380L927N253O233N936M852M151M275M670M659M222L881L949
$$ 539789 543155 546535 550462 555715 561948 567884 572736 576887 581162 585832 590491 594713 598594 602543
59172F02543M073L740L113K979L806N230O554P426P851P906P700P322O756N996
$$ 602543 606616 610356 613469 616448 620254 625484 632038 639464 647315 655221 662921 670243 676999 682995
59158F82995N156M153K562K56k034l560m720o464q703j0344j0974j1239j1432
$$ 682995 688151 692304 694866 695122 693088 689528 684808 678344 669641 659297 648323 637084 625652
59145F25652j1035j0079r532r665r477q513p927q558r207q320o404n217n165n123
$$ 625652 614617 604538 595006 585341 575864 567351 559424 550866 541659 533339 526935 521718 516553 511430
59131E11430m459l690l181k629j894j203m30Q13K265L243L860M979O768Q253Q680
$$ 511430 506971 503281 500100 497471 495577 494374 493944 494757 497022 500265 504125 509104 515872 524125 532805
59116E32805Q519Q657R220R690R772R728R978J0530J0805J0123Q533O922O054
$$ 532805 541324 549981 559201 568891 578663 588391 598369 608899 619704 629827 638360 645282 651336
59103F51336N786N576N277M981M494L635K727K071J242l30k217l345l399l060
$$ 651336 657122 662698 667975 672956 677450 681085 683812 685883 687125 686795 684578 681233 677834 674774
59089F74774k786k227j064K96J198J403R79l9j571l420n405p325q735r158q715
$$ 674774 671988 669761 668697 668993 670191 671594 672573 672534 670963 667543 662138 654813 646078 636920 628205
59074F28205q145q042q300q436q198p720p242o851o464o006n600n451n473n256
$$ 628205 620060 612018 603718 595282 587084 579364 572122 565271 558807 552801 547201 541750 536277 531021
59060E31021m519l422k318j470j188j786k990l775l321k053j175j211j599j688
$$ 531021 526502 523080 520762 519292 518104 516318 513328 509553 506232 504179 503004 501793 500194 498506
59046D98506j599j679j638q17P04J839J670N90k25k90j66k64j50N46J244J259
$$ 498506 496907 495228 493590 492773 493477 495316 496986 497576 497351 497061 496895 496631 496481 497027 498271 499530
59030D99530R75J269K095K753L303M562O556Q218Q955R464J0486J1740J2567J2870
$$ 499530 500505 501774 503869 506622 509925 514487 521043 529261 538216 547680 558166 569906 582473 595343
59016E95343J2881J2638J2172J1489J0121P433L705J46k497m471n912o334n634
$$ 595343 608224 620862 633034 644523 654644 662077 665782 665928 663431 658960 653048 646714 641080
59003F41080m510l252j290J390L612M629N233O257P074O732N573M516L510K009
$$ 641080 636570 633318 632028 633418 637030 641659 646892 653149 660223 666955 672528 677044 680554 682563
58989F82563L11q70j620k499l492m309n153o152o667o188n306m715m041k752j373
$$ 682563 682874 682004 680384 677885 674393 670084 664931 658779 652112 645924 640618 635903 631862 629110 627737
58974F27737m27R19L534O407P886Q245R163J0954J2349J2811J3095J3345J2675
$$ 627737 627310 628229 631763 638170 646056 654301 663464 674418 686767 699578 712673 726018 738693
58961G38693J1088R881R546Q854O847M225J974j53k843n961q950j1695j4155j5791
$$ 738693 749781 759662 769208 778062 784909 789134 791108 790955 788112 782151 773201 761506 747351 731560
58947G31560j6159j5629j4966j4515j4109j3400j2111j0340q713p804p404o776
$$ 731560 715401 699772 684806 670291 656182 642782 630671 620331 611618 603814 596410 589634
58935E89634n646m371l300k536k140j947j423l87L80J18o80q60k08N24Q61Q12
$$ 589634 583988 579617 576317 573781 571641 569694 568271 567884 568264 568382 567702 566842 566634 567158 568019 568831
58919E68831J58j230k472k402j255l93l35l17J34N45O80J019J664J983J898K350
$$ 568831 568989 567759 565287 562885 561630 561237 560902 560585 560719 561264 561944 562963 564627 566610 568508 570858
58903E70858L942O028P731Q991J0139J1211J2173J3150J4039J4482J4373J3896
$$ 570858 574800 580828 588559 597550 607689 618900 631073 644223 658262 672744 687117 701013
58891G01013J3026J1809J1049J1772J3896J6301J8252J9767K0628K0208J8565
$$ 701013 714039 725848 736897 748669 762565 778866 797118 816885 837513 857721 876286
58880H76286J6519J4382J1713Q492N386K553o90m528q112j0801j2906j4720j5837
$$ 876286 892805 907187 918900 927392 932778 935331 934641 930113 922001 911200 898294 883574 867737
58867H67737j5899j5239j4281j3066j1650j0204q636o967o054o776q474r501r486
$$ 867737 851838 836599 822318 809252 797602 787398 778762 771795 765741 758965 750491 740990 731504
58854G31504r563j0166j0270r456q962r690j0615j0303q903p510o507n648n039
$$ 731504 721941 711775 701505 692049 683087 673397 662782 652479 643576 636066 629559 623911 618872
58841F18872m942n189n532o033o515o384n596n084n530o392o687o082m730k899
$$ 618872 613930 608741 603209 597176 590661 584277 578681 573597 568067 561675 554988 548906 544176 541277
58827E41277j195l34k03J9N11N89K50N47J881L110L267K978L244L944M460M811
$$ 541277 540082 539748 539545 539564 540075 540664 540914 541461 543342 546452 549719 552697 555941 559885 564345 569156
58811E69156N104M812L645K352J685J376R99R36J419J517K99j624k922l319l512
$$ 569156 574260 579072 582717 585069 586754 588130 589129 590065 591484 593001 593300 591676 588754 585435 581923
58796E81923l822m001l996l979l951m041m676n691n940m680k729j385p12J27J337
$$ 581923 578101 574100 570104 566125 562174 558133 553457 547766 541826 537146 534417 533032 532320 532447 533784
58781E33784K405L180M106N369O585P279P282O813O354O006M921K199j516m344
$$ 533784 536189 539369 543475 548844 555429 562708 569990 576803 583157 589163 594084 596283 594767 590423
58767E90423n495o154p370q402q078o771n776n528n558n556n438m862l627k190
$$ 590423 584928 578774 571404 563002 554924 548153 542377 536849 531291 525735 520297 515435 511808 509618
58753E09618r62K79J614K387K178J650J576J675J351Q07N87P61J382K898N169
$$ 509618 508656 508935 510549 512936 515114 516764 518340 520015 521366 522173 522760 523521 524903 527801 532970
58738E32970O913P183O684O547O665O316N695N474N525N322N100N343N624N125
$$ 532970 539883 547066 553750 560297 566962 573278 578973 584447 589972 595294 600394 605737 611361 616486
58724F16486L909K565J123m82j485j086J54J041J429K074L089L880M384N130O133
$$ 616486 620395 622960 624083 623601 622116 621030 621184 622225 623654 625728 628817 632697 637081 642211 648344
58709F48344O797O854O427N372L449J058j125l049n166p535r849j1976j3845j5121
$$ 648344 655141 661995 668422 673794 677243 678301 677176 674127 668961 661426 651577 639601 625756 610635
58695F10635j5626j5656j5368j4432j2889j1550j0817r912q134o018m366l138
$$ 610635 595009 579353 563985 549553 536664 525114 514297 504385 496251 490233 485867 482729
58683D82729k228k279l434m327l785k640k377k793k641j886j424j166k92Q48R99
$$ 482729 480501 478222 474788 470461 466676 464036 461659 458866 456225 454339 452915 451749 451457 452305 453304
58668D53304J85k9J354L800O479R097J1316J2616J2936J2489J0964P930L936K17
$$ 453304 453489 453460 454814 458614 465093 474190 485506 498122 511058 523547 534511 542441 546377 546594
58654E46594k652m817o206o546o154n716n418n214n477o360o944o228m626l337
$$ 546594 543942 539125 532919 526373 520219 514503 509085 503871 498394 492034 485090 478862 474236 470899
58640D70899k613j837r61n02l77k9N20Q59J241K161L256L699L458L050K400J199
$$ 470899 468286 466449 465488 464986 464609 464580 465100 465959 467200 469361 472617 476316 479774 482824 485224 486423
58624D86423n8o27p02r55j265j160q76p03N1J970M061N022N354O358P608P464
$$ 486423 486365 485738 485036 484081 482816 481656 480780 480077 480128 482098 486159 491181 496535 502893 510501 517965
58608E17965N844M368L706K890J452L55K93O80P87O07K26m14r56r75q41j208j730
$$ 517965 523809 528177 531883 534773 536225 536580 536873 537553 538340 538947 539173 538759 537803 536828 535987 534779 533049
58591E33049j628j116r34p84K16J828L120M285O211Q406R297Q671Q040Q334Q934
$$ 533049 531421 530305 529371 528587 528803 530631 533751 538036 544247 552653 561950 570621 578661 586995 595929
58576E95929R207R269R051Q153O897O061N532M748M332N552Q146J0499J2114J4045
$$ 595929 605136 614405 623456 631609 638506 644567 650099 654847 659179 664731 672877 683376 695490 709535
58562G09535J6767J9496K1869K4404K6813K7722K6635K4539K2053J8547J3628
$$ 709535 726302 745798 767667 792071 818884 846606 873241 897780 919833 938380 952008
58551I52008Q126L065j097m035n644o662p850q593p805o050n071n396o293p950
$$ 952008 960134 963199 962102 958067 952423 945761 937911 929318 921513 915463 910392 904996 898703 890753
58537H90753j1480j6510k0894k3319k4306k4319k2889k0140j7293j5022j2879
$$ 890753 879273 862763 841869 818550 794244 769925 747036 726896 709603 694581 681702
58526F81702j0763r192p945o198m262l342l329k858j762j390k095k617k400k430
$$ 681702 670939 661747 653802 647604 643342 640000 636671 633813 632051 630661 628566 625949 623549 621119
58512F21119l125l526l169k755k439j551m40m56j426j473k9J207J064M32J82j69
$$ 621119 617994 614468 611299 608544 606105 604554 604114 603658 602232 600759 600730 601937 603001 603433 603615 603446
58496F03446p66o74J40K19q35j310m2J811K825L278L928M598N112O028P472Q718
$$ 603446 602680 602006 602146 602365 601530 600220 600178 601989 604814 608092 612020 616618 621730 627758 635230 643948
58480F43948R599J0799J2319J3472J4628J6768J9050J9245J7097J4542J2035P735
$$ 643948 653547 664346 676665 690137 704765 721533 740583 759828 776925 791467 803502 811237
58468H11237J330m362p250q594j0223j1592j1525j0482r226p244m206j131J409
$$ 811237 812567 808205 800955 792361 782138 770546 759021 748539 739313 732069 727863 726732 728141
58455G28141M319P841J0407J1105J1247J2067J2793J2376J1111R178N659L93n024
$$ 728141 732460 740301 750708 761813 773060 785127 797920 810296 821407 830585 836244 836637 831613
58442H31613r278j2392j4015j3172j0755r436r779r212o281k949j071L23K336
$$ 831613 822335 809943 795928 782756 772001 762565 752786 743574 737293 734344 733273 733596 735932
58429G35932L721L483L175M279N786O616P900J0503J2731J2953J2232J1939J0986
$$ 735932 739653 743136 746311 750590 756376 762992 770892 781395 794126 807079 819311 831250 842236
58416H42236P858L337j042n157q859j0743j0526j0317j1400j2128j1138r868r569
$$ 842236 850094 853431 852389 847232 838373 827630 817104 806787 795387 783259 772121 762253 752684
58403G52684q713o098l705l454l757k380k59P37J435L402N555O075N801O447P247
$$ 752684 743971 737873 734168 730714 726957 724577 724318 725055 726490 729892 735447 741522 747323 753770 761017
58388G61017O534M935L970L263J962J078J496J643J02j488j106J23J50l35M37
$$ 761017 767551 772486 776456 779719 781681 782759 784255 785898 786000 784512 783406 783529 783679 783344 783781
58373G83781J989L072M372O656Q291P827O905P454Q251P598O995Q534J0942J1881
$$ 783781 785770 788842 793214 799870 808161 815988 822893 830347 838598 846196 853191 861725 872667 884548
58359H84548J2036J3141J4195J3508J2386J2807J3421J1854Q989O980N109J789
$$ 884548 896584 909725 923920 937428 949814 962621 976042 987896 996885 1003865 1008974 1010763
58347A010763j360j791n44k10j81J709M591O000O336P594R263R683R850J1565
$$ 1010763 1009403 1007612 1007068 1006858 1006677 1008386 1012977 1018977 1025313 1032907 1042170 1051853 1061703 1073268
58333A073268J3575J3844J3775J5727J8172J8080J6273J5686J5958J4571J1807
$$ 1073268 1086843 1100687 1114462 1130189 1148361 1166441 1182714 1198400 1214358 1228929 1240736
58322A240736R748P933M808J866J518K476K022J102K238M288M422L503M270O046
$$ 1240736 1250484 1258417 1263225 1265091 1266609 1269085 1271107 1272209 1274447 1278735 1283157 1286660 1290930 1296976
58308A296976O541O941R667J2976J3530J2478J3249J5228J5515J4977J6305J8030
$$ 1296976 1303517 1310458 1320125 1333101 1346631 1359109 1372358 1387586 1403101 1418078 1434383 1452413
58296A452413J6920J4496J4635J6457J6289J4844J5502J7229J6477J4540J5572
$$ 1452413 1469333 1483829 1498464 1514921 1531210 1546054 1561556 1578785 1595262 1609802 1625374
58285A625374J8667J9490J8474J9685K2737K3663K2829K4106K7153K8432K8883
$$ 1625374 1644041 1663531 1682005 1701690 1724427 1748090 1770919 1795025 1822178 1850610 1879493
58274A879493L2422L7837M0467M0962M3808M8209M9345M7884M8980N2446N3329
$$ 1879493 1911915 1949752 1990219 2031181 2074989 2123198 2172543 2220427 2269407 2321853 2375182
58263B375182N1859N3200N7448N9548N9190O1097O5416O7524O7321O8918P1323
$$ 2375182 2427041 2480241 2537689 2597237 2656427 2717524 2782940 2850464 2917785 2986703 3058026
58252C058026O9642O5330O4800O8128O9844P0329P4936Q2308Q5810Q6467R1855
$$ 3058026 3127668 3192998 3257798 3325926 3395770 3466099 3541035 3623343 3709153 3795620 3887475
58241C887475J01988J09335J13165J20319J31209J38997J43633J52350J65171
$$ 3887475 3989463 4098798 4211963 4332282 4463491 4602488 4746121 4898471 5063642
58232E063642J74711J81397J93574K11243K25713K36721K53203K75576K94892
$$ 5063642 5238353 5419750 5613324 5824567 6050280 6287001 6540204 6815780 7110672
58223G110672L11300L34822L65741L93725M18846M53023M97807N42291N86090
$$ 7110672 7421972 7756794 8122535 8516260 8935106 9388129 9885936 10428227 11014317
58214A1014317O41749P10982P82666Q58141R52783J068599J193090J329782J500231
$$ 11014317 11656066 12367048 13149714 14007855 14960638 16029237 17222327 18552109 20052340
58205B0052340J711483J954816K241991K606531L063414L608448M264344N081403
$$ 20052340 21763823 23718639 25960630 28567161 31630575 35239023 39503367 44584770
58197D4584770O084954P275815Q694514J0427505J2542812J5093162J8190484
$$ 44584770 50669724 57945539 66640053 77067558 89610370 104703532 122894016
58190A22894016K1981626K6536560L1854746L7858915M3900253M7939426M6650031
$$ 122894016 144875642 171412202 203266948 241125863 285026116 332965542 379615573
58183C79615573L7327624K0398595Q961j8271727l0705373l6846641l8499792
$$ 379615573 416943197 437341792 437350753 419079026 388373653 351527012 313027220
58176C13027220l7755559l5859386l3245410l0039974k6417550k2670984j9108240
$$ 313027220 275271661 239412275 206166865 176126891 149709341 127038357 107930117
58169A07930117j5930060j3202388j0916774r040499p517534o275333n258615
$$ 107930117 92000057 78797669 67880895 58840396 51322862 45047529 39788914
58162C9788914m437854l779819l238056k780507k399640k086704j820715j590351
$$ 39788914 35351060 31571241 28333185 25552678 23153038 21066334 19245619 17655268
58154A7655268j401091j250957j121546j002040r00387q21269p52928o85263o22581
$$ 17655268 16254177 15003220 13881674 12879634 11979247 11157978 10405050 9719787 9097206
58145I097206n69080n18607m67688m22954l87301l53078l16399k84369k61467
$$ 9097206 8528126 8009519 7541831 7118877 6731576 6378498 6062099 5777730 5516263
58136E516263k42495k25106k15302k13834k10725k00172j88340j80045j70386
$$ 5516263 5273768 5048662 4833360 4619526 4408801 4208629 4020289 3840244 3669858
58127C669858j56235j43640j36604j29833j19587j10880j07111j02963r4529q6675
$$ 3669858 3513623 3369983 3233379 3103546 2983959 2873079 2765968 2663005 2568476 2481801
58117B481801q3576q1210p5760p0627o8733o6371o0871n6311n5687n5174n1747
$$ 2481801 2398225 2317015 2241255 2170628 2101895 2035524 1974653 1918342 1862655 1807481 1755734
58106A755734m8835m8957m8393m4557m1256m1224m0764l7032l3495l2814l1259
$$ 1755734 1706899 1657942 1609549 1564992 1523736 1482512 1441748 1404716 1371221 1338407 1307148
58095A307148k5694j9430j5920j3101r196p607j0609j4216j4621j4149j5807j7608
$$ 1307148 1281454 1262024 1246104 1233003 1223807 1216200 1205591 1191375 1176754 1162605 1146798 1129190
58083A129190j7288j7106j9009k0299j8929j7880j9579k1122j9769j8071j8851
$$ 1129190 1111902 1094796 1075787 1055488 1036559 1018679 999100 977978 958209 940138 921287
58072I21287j9972j8823j7246j7365j7213j4982j3113j3679j4226j2498j0791
$$ 921287 901315 882492 865246 847881 830668 815686 802573 788894 774668 762170 751379
58061G51379j1264j1445q895o040n857o968p301q335j1256j3199j1879j0038j0697
$$ 751379 740115 728670 719775 713735 707878 700910 693609 685274 674018 660819 648940 638902 628205
58048F28205j1890j0653q404p681p222m992k691k656l422k856k432m037n690m931
$$ 628205 616315 605662 597258 589577 582355 577363 574672 572016 568594 565738 563306 559269 553579 548648
58034E48648l431l869n125m995m762o617r153r822r406r876j0256q806o919o775
$$ 548648 545217 541348 536223 531228 526466 519849 510696 500874 491468 481592 471336 462530 455611 448836
58020D48836p336o560n275n102m953l388k062k851m007l077j345j346k309k113
$$ 448836 441500 434940 429665 424563 419610 416222 414160 411309 407302 404225 402880 401534 399225 397112
58006C97112j572k627m201m009k699k318k398j313J53L90L40J624L096K899K057
$$ 397112 395540 392913 388712 384703 382004 379686 377288 375975 376128 376518 376858 378482 381578 384477 386534
57991C86534K332K457M32k299k999k330k754l852l431k008j985l255l717l252
$$ 386534 388866 391323 391755 389456 386457 384127 381373 377521 374090 372082 370097 366842 363125 359873
57977C59873l430m003l446k249k108k503j665j69r5j158j214m4O29N05Q99J890
$$ 359873 356443 352440 348994 346745 344637 342134 340469 340300 340205 339047 337833 337789 338418 338923 339822 341712
57961C41712K285J980J726J198q8q82l0Q82l21k696l695l356l603m381l951k404
$$ 341712 343997 345977 347703 348901 348813 347931 347901 348783 348462 345766 342071 338715 335112 330731 326780 324376
57945C24376j447j079J64J986K645K253K600L856M493M368M909O325P482Q410
$$ 324376 322929 321850 322014 324000 326645 328898 331498 335354 339847 344215 349124 355449 362931 371341
57931C71341J0033J1517J0772P739M496K095j39k315l580m184n328o936p781p862
$$ 371341 381374 392891 403663 411402 415898 417993 417854 415539 411959 407775 402447 395511 387730 379868
57917C79868q298r018q829p688o669n868m530k969k080j358K74K100K535J970
$$ 379868 371570 362552 353723 346035 339366 333498 328968 325999 323919 322561 322835 324935 327470 329440
57903C29440K175L195L439K675K214K245J658N60L85J278J837J636J648K056J930
$$ 329440 331615 334810 338249 340924 343138 345383 347041 347601 347986 349264 351101 352737 354385 356441 358371
57888C58371J278J083J219N48p51j259q60j009k152l084l170l198l672m172m535
$$ 358371 359649 360732 361951 362499 361748 360489 359629 358620 356468 353384 350214 347016 343344 339172 334637
57873C34637m949m871l650k134j701j894j153L72R33R8p36q03o77m61N65K203
$$ 334637 329688 324817 321167 319033 317332 315438 314285 314657 315590 315688 314952 314149 313472 313011 313576 315779
57857C15779L390M190N674P603Q420P821P251P383P137N701L763K177R92K01k4
$$ 315779 319169 323359 329033 336636 345056 352877 360128 367511 374648 380349 384112 386289 387281 387482 387458
57842C87458p1n88j397j954k524l543m392m487m819o391p839p078m753l478l825
$$ 387458 387387 386799 385402 383448 380924 377381 372989 368502 363683 357292 349453 342375 337622 334144 330319
57827C30319l843k560j272r54r05n39k66j40L26P40K23o14k83Q89J141L94L61
$$ 330319 326476 323916 322644 321690 320785 320246 319980 319840 320166 320906 321129 320515 320232 321121 322262 322656 323017
57810C23017J112L39l034p034r465j0316j0324r354p461n759m891m179l096k194
$$ 323017 324129 324468 321434 314400 304935 294619 284295 274941 267480 261721 256830 252651 249555 247361
57796B47361j790j308o28n42j178j447o98M98J625K790L701L696L220L560M760
$$ 247361 245571 244263 243635 243093 241915 240468 239770 240268 241893 244683 248384 252080 255300 258860 263620
57781B63620N556N676O338P935R206R319R016Q965Q708P949P191O465N035K953
$$ 263620 269176 274852 281190 289125 298331 307650 316666 325631 334339 342288 349479 355944 360979 363932
57767C63932J278K54j080k990m534n346o152o977o811n674n061n542n883n275
$$ 363932 365210 365464 364384 361394 356860 351514 345362 338385 331574 325900 320839 315297 309414 304139
57753C04139m591m484m118k850j471p45j95O62J325J382J246J093N33j69j07M92
$$ 304139 299548 295064 290946 288096 286625 285880 285685 286347 287672 289054 290300 291393 291926 291757 291650 292142
57737B92142L20o10n39J225K972L095K237J832K114K636L306L830L539K687K539
$$ 292142 292462 291852 291313 292538 295510 298605 300842 302674 304788 307424 310730 314560 318099 320786 323325
57722C23325L386L916L338K551K322K014J063J56j21l64j089j757k001k425l367
$$ 323325 326711 330627 333965 336516 338838 340852 341915 342071 341950 341586 340497 338740 336739 334314 330947
57707C30947m220m719n414o160n888m609l832m096l972k586j151p56n29N41J617
$$ 330947 326727 322008 316594 310434 304546 299937 296105 292009 288037 285451 284300 283544 283015 283556 285173
57692B85173J415J45j385l125m894n583m760l737l631l632k645j249n22j00J005
$$ 285173 286588 286733 285348 282223 277329 271746 266986 263249 259618 255986 253341 252092 251570 251470 252475
57677B52475K760M667O947R827J2741J5548J9406K5021L1337L7470M4812N5143
$$ 252475 255235 259902 266849 276676 289417 304965 324371 349392 380729 418199 463011 518154
57665E18154O6964P5009P3215N7999L0416l217l3755n4402o3953o5094o0938n3923
$$ 518154 585118 660127 733342 791341 821757 818540 784785 730383 666430 601336 540398 486475
57653D86475m6242l9203l2696k6427k1045j7115j3975j0792p898n966m731l576
$$ 486475 440233 401030 368334 341907 320862 303747 289772 278980 271082 265116 260385 256809
57641B56809k559j872j190m61l39q94j037j57Q22J004Q82J073R94J36o58n60k67
$$ 256809 254250 252378 251188 250727 250388 249494 248457 248300 249122 250126 251008 252081 253075 253211 252553 251993 251726
57624B51726p45j545j686j281r40n87j62m14j670k768k647k011k052k532k499
$$ 251726 250981 249436 247750 246469 245529 244942 244780 244366 242696 239928 237281 235270 233218 230686 228187
57609B28187j949j416q16p0Q7o63j205n52N22Q18N83N87M32n23j532j534j065
$$ 228187 226238 224822 224006 223936 224023 223360 222155 221603 222125 222943 223526 224113 224545 224022 222490 220956 219891
57592B19891j412k499l243l399l455l315k644j980k036k369k074j248m90K58J078
$$ 219891 218479 215980 212737 209338 205883 202568 199924 197944 195908 193539 191465 190217 189727 189985 191063
57577A91063J209K11q43q96p26j608k992l371k705k152j953j491j016j361k162
$$ 191063 192272 192483 191640 190744 190018 188410 185418 182047 179342 177190 175237 173746 172730 171369 169207
57562A69207k121j012J02N75P09P54P15R74J861K806L044K799K733K734K385J985
$$ 169207 167086 166074 166176 166751 167460 168214 168929 169903 171764 174570 177614 180413 183146 185880 188265 190250
57546A90250J864J369j16j733k213j753j459j414q77J44R65J454J788J497K09
$$ 190250 192114 193483 193367 191634 189421 187668 186209 184795 183918 184062 185027 186481 188269 189766 189975
57531A89975j146j346o86l80o41p90p51r82j254r61k74K79Q35J582J816J036K35
$$ 189975 188829 187483 186797 186417 185776 184986 184235 183253 181999 181038 180764 181043 181878 183460 185276 186312 186547
57514A86547N95J573J887J606J630J781J282N22N19J031J012M70J68m2q14j731
$$ 186547 187142 188715 190602 192208 193838 195619 196901 197423 197942 198973 199985 200455 200623 200581 199767 198036
57498A98036j945j887k486l191k775j624j207j594j596j054q85j080p69j35j76
$$ 198036 196091 194204 191718 188527 185752 184128 182921 181327 179731 178677 177792 176712 175943 175808 175632
57483A75632o25k56P40Q75m5n04K56J323J926K223K101J059m36j242j381j879
$$ 175632 175007 174751 175491 176366 176321 175817 176073 177396 179322 181545 183646 184705 184269 183027 181646 179767
57467A79767k711k776k017j618j893j877j275q88q50l49O07R93P13Q44J567J739
$$ 179767 177056 174280 172263 170645 168752 166875 165600 164712 163862 163513 164120 165113 165826 166670 168237 169976
57451A69976R69L07L41L39k18q24j140j415j452p44K04L21q9K85J422J924J440
$$ 169976 170945 171252 171593 171932 171714 170890 169750 168335 166883 166139 166343 166664 166575 166860 168282 170206 171646
57434A71646J048R63J93j114j316K1J272J412J368J860K018J146j2p94j547k157
$$ 171646 172694 173657 173850 172736 171420 171441 172713 174125 175493 177353 179371 180517 180505 179711 178164 176007
57418A76007j588P4J090O70J72O19R48J44p73n20K93M46J97M49R44Q47L31J50
$$ 176007 174419 174493 175583 176253 176425 177044 177992 178136 177363 176843 177136 177582 177779 178228 179172 180019 180350 180500
57400A80500L39L67K2o96j699k338j770l30N51M18M18J291K148K069J527J344
$$ 180500 180839 181206 181228 180532 178833 176495 174725 174395 174946 175364 175782 177073 179221 181290 182817 184161
57384A84161J570K224L779N939P210O681N086L350J463m60j442j136o27p45q68
$$ 184161 185731 187955 191734 197673 204883 211564 216650 220000 221463 221003 219561 218425 217798 217053 216185
57369B16185l92m3n49j316j581j605j651j074K90J103L17j110j568r33r1O53J387
$$ 216185 215793 215750 215201 213885 212304 210699 209048 207974 208264 209367 209684 208574 207006 206073 205982 206635 208022
57352B08022J716J377J010J196J506J445J445J836J881R33k91p10l84N6N98J351
$$ 208022 209738 211115 212125 213321 214827 216272 217717 219553 221434 222367 222076 221366 220982 221038 221636 222987
57336B22987J720J201L42m9l8l6K6J09l58j485k245j779n61M73J099J326Q92Q3
$$ 222987 224707 225908 226250 226201 226163 226127 226153 226262 225904 224419 222174 220395 219834 220307 221406 222732 223624 223707
57318B23707o2O52R17j56j547j889j372r07m47M57J340J421Q69L59J4k24%O97
$$ 223707 223645 224297 225214 225058 223511 221622 220250 219343 218896 219353 220693 222114 222983 223342 223356 223132 223132 223829
57300B23829J060P48P02J615K551K291J185M41M02N96Q28J072J056Q79J213K070
$$ 223829 224889 225637 226339 227954 230505 232796 233981 234422 234824 235420 236248 237320 238376 239255 240468 242538
57284B42538K338J563R44J472K291K247J805J944K263J844J107J135J828K294
$$ 242538 244876 246439 247383 248855 251146 253393 255198 257142 259405 261249 262356 263491 265319 267613
57270B67613K438K654K596J734O49L51P99J320J891K692L086K427J349R07R85
$$ 267613 270051 272705 275301 277035 277684 278035 278834 280154 282045 284737 287823 290250 291599 292506 293491
57255B93491Q13N05O60J056J058Q33R43J281J551K098L030L295K088M26j58K40
$$ 293491 294304 294809 295469 296525 297583 298416 299359 300640 302191 304289 307319 310614 312702 313128 312970 313210
57239C13210N11O08J257K221K548K218J957J757J146N69Q85J744K045J833K179
$$ 313210 313721 314329 315586 317807 320355 322573 324530 326287 327433 328002 328887 330631 332676 334509 336688
57224C36688L255L994L745K972K345K206K781L861M517M181L677M071M951N054
$$ 336688 339943 343937 347682 350654 352999 355205 357986 361847 366364 370545 374222 378293 383244 388298
57210C88298M196L320L022L185L715M387M395L322K129K031K846L659M420N547
$$ 388298 392494 395814 398836 402021 405736 410123 414518 417840 419969 422000 424846 428505 432925 438472
57196D38472O566O765O713P544R179J0740J2213J4010J5409J5308J4363J4480
$$ 438472 445038 451803 458516 466060 475239 485979 498192 512202 527611 542919 557282 571762
57184E71762J6171J8070J9137J9705K0291K0888K1563K2401K2788K2084K0944
$$ 571762 587933 606003 625140 644845 665136 686024 707587 729988 752776 774860 795804
57173G95804K0595K1036K1379K1744K3042K5010K6217K6301K6488K7550K8803
$$ 795804 816399 837435 858814 880558 903600 928610 954827 981128 1007616 1035166 1063969
57162A063969K9492K9743K9666K8892K7472K6194K5547K5296K5246K5464K5623
$$ 1063969 1093461 1123204 1152870 1181762 1209234 1235428 1260975 1286271 1311517 1336981 1362604
57151A362604K5213K4494K4240K4527K4769K4910K5420K6211K6764K7326K8777
$$ 1362604 1387817 1412311 1436551 1461078 1485847 1510757 1536177 1562388 1589152 1616478 1645255
57140A645255L1092L3141L4205L4709L5332L6301L7689L9499M1383M3104M5091
$$ 1645255 1676347 1709488 1743693 1778402 1813734 1850035 1887724 1927223 1968606 2011710 2056801
57129B056801M7798N0818N3626N6800O1394O7329P3798Q1122R0896J03876J18575
$$ 2056801 2104599 2155417 2209043 2265843 2327237 2394566 2468364 2549486 2640382 2744258 2862833
57118B862833J32275J43023J50837J57308J63599J68692J70567J69798J70615
$$ 2862833 2995108 3138131 3288968 3446276 3609875 3778567 3949134 4118932 4289547
57109D289547J77356J90959K10012K33881K63082K97740L37910L85117M42114
$$ 4289547 4466903 4657862 4867874 5101755 5364837 5662577 6000487 6385604 6827718
57100F827718N11541N96193P00035Q27870R84778J176848J410913J691396K017413
$$ 6827718 7339259 7935452 8635487 9463357 10448135 11624983 13035896 14727292 16744705
57091A6744705K383286K780361L197857L624141M048078M456339M828377N136456
$$ 16744705 19127991 21908352 25106209 28730350 32778428 37234767 42063144 47199600
57083D7199600N347540N413440N254749M773049L908781K702465J295250j37482
$$ 47199600 52547140 57960580 63215329 67988378 71897159 74599624 75894874 75757392
57075G5757392j457896k589088l498326m178510m641556m912191n017975m983763
$$ 75757392 74299496 71710408 68212082 64033572 59392016 54479825 49461850 44478087
57067D4478087m832583m586635m267021l895523l496267l092615k702275k336921
$$ 44478087 39645504 35058869 30791848 26896325 23400058 20307443 17605168 15268247
57059A5268247k005011j712145j459413j244255j063144r12111p85971o79585
$$ 15268247 13263236 11551091 10091678 8847423 7784279 6872168 6086197 5406612
57051E406612n89798n14533m50799l95401l46859l04799k68076k35230k06142
$$ 5406612 4816814 4302281 3851482 3456081 3109222 2804423 2536347 2301117 2094975
57042B094975j81381j60396j41945j25774j12138j00206q8645p7462o7574n8831
$$ 2094975 1913594 1753198 1611253 1485479 1373341 1273135 1184490 1107028 1039454 980623
57032I80623n0053m0817l1670k2589j2660j295J1733K7488M7083O7911Q1184P5456
$$ 980623 930570 889753 858083 835494 822834 821539 833272 860760 907843 975754 1056938 1132394
57020A132394M5170k991n2868q9415j07420j10641j04788r3600q0228o8143n8870
$$ 1132394 1177564 1174573 1121705 1032290 924870 814229 709441 615841 535613 467470 408600
57009D08600n1054m3239l6092l0756k6879k3599k0887j8579j5632j1776q508o979
$$ 408600 357546 314307 278215 247459 220580 196981 176094 157515 141883 130107 121599 114620
56997A14620o243m907l089j271J268N040Q689J0623J1362J2487J4176J5553J6586
$$ 114620 108377 103470 100381 99110 100378 105418 114107 124730 136092 148579 162755 178308 194894
56984A94894J7785J8659J8182J6259J3108P965J87q679j5699j9323k0176j9420
$$ 194894 212679 231338 249520 265779 278887 286852 287039 278360 262661 243338 223162 203742
56972B03742j7714j5508j3090j0337p350m886l370k018N3K500M588O644R471J2910
$$ 203742 186028 170520 157430 147093 139743 134857 131487 129469 129522 132022 136610 143254 152725 165635
56958A65635J6178J9123K1766K3042K1245J5691P122k973j2609j9564k2652k2630
$$ 165635 181813 200936 222702 245744 266989 282680 289802 286829 274220 254656 232004 209374
56946B09374k1047j8633j5462j1959q685n633k683k16J530L165N437Q338J1658
$$ 209374 188327 169694 154232 142273 133588 127955 125272 125056 126586 129751 135188 143526 155184
56933A55184J5711K0698K5995L0610L3422L2442K5295J1848m408j8695k8162l2403
$$ 155184 170895 191593 217588 248198 281620 314062 339357 351205 346797 328102 299940 267537
56921B67537l2293k9596k6511k4030k1297j7528j3633j0894r184p754o664o147
$$ 267537 235244 205648 179137 155107 133810 116282 102649 91755 82571 74817 68153 62006
56909F2006n490m109k767k351k350j910j454j688j881r53N44J231J222J851L476
$$ 62006 56516 52407 49640 47289 44939 43029 41575 39887 38006 37053 37597 38828 40050 41901 45377
56894D5377N135O232P124Q211R637J1667J4454J7642K0960K4405K7101K6898K2349
$$ 45377 50512 56744 63868 72079 81716 93383 107837 125479 146439 170844 197945 224843 247192
56881B47192J4353M982m275j2132j6845j7643j5923j3575j0916p602m322j849
$$ 247192 261545 266527 262252 250120 233275 215632 199709 186134 175218 167616 163294 161445
56869A61445N65M042Q088J1549J4751J8912K4110K9621L5670M2939N0582N6001
$$ 161445 162010 166052 174140 185689 200440 219352 243462 273083 308753 351692 402274 458275
56857D58275N6253M8892L2973J0998j1121k7974l8099m2651m2413l8117l2000
$$ 458275 514528 563420 596393 607391 596270 568296 530197 487546 445133 407016 375016
56846C75016k6224k0467j3407n716Q59O525J2978K0501K8074L5910M5307N6421
$$ 375016 348792 328325 314918 309202 310061 316586 329564 350065 378139 414049 459356 515777
56834E15777O8462Q1184R2997R7991Q8536O2266K4737j4820m8482p1289q1878
$$ 515777 584239 665423 758420 856411 944947 1007213 1031950 1017130 968648 897359 815481
56823H15481q2837p8352p0684o0240m8513l8122k9729k1576j2757m424K759R930
$$ 815481 732644 654292 583608 523368 474855 436733 407004 385428 372671 368247 371006 380936
56811C80936J7957K6341L4972M4806N5697O5152O9754O6242N1672K5592o882l6695
$$ 380936 398893 425234 460206 505012 560709 625861 695615 761857 813529 839121 832239 795544
56799G95544n7123o7180o8991o4700n6888m8873m2167l5379k7247j9216j3380
$$ 795544 738421 671241 602250 537550 480662 431789 389622 354243 326996 307780 294400
56788B94400r461n558p99M353R528J4738J9927K5212L0723L5224L5660K9252J5962
$$ 294400 284939 279381 278582 282935 292463 307201 327128 352340 383063 418287 453947 483199 499161
56775D99161j363j8566l1868l9351m1621m0591l7578l3201k8611k5114k2494j9365
$$ 499161 497798 479232 447364 408013 366392 325801 288223 255022 226411 201297 178803 159438
56763A59438j5515j2372j0751r762q409o868n617m652m002l813l603k731j708
$$ 159438 143923 131551 120800 111038 102629 95761 90144 85492 81490 77677 74074 71343 69635
56750F9635j635k244k206j475j388k144k280j184j70k53p03o50m08l23P3Q23J014
$$ 69635 68000 65756 63550 62075 60687 58543 56263 55079 54909 54656 53953 53303 52895 52572 52645 53468 54482
56733E4482K84n28q66j121j277n80Q29J652J479J351J748J806J295J364K394L042
$$ 54482 54766 54238 53372 52251 50974 50394 51223 52875 54354 55705 57453 59259 60554 61918 64312 67354
56717F7354K439J508J094O74l4o6Q60J382P20J44P40J534J312P10P59R87N88J43
$$ 67354 69793 71301 72395 73069 73035 72969 73829 75211 75931 76075 76815 78349 79661 80371 81130 82117 82705 82848
56699H2848L82N89p3p62k46R32J308P56K94L20L60R9m71j364k085j648J7J570
$$ 82848 83230 83819 83746 82984 82738 83670 84978 85734 86028 86348 86708 86807 86336 84972 82887 81239 81256 82826
56681H2826J959J726J726J809J651J684K127K189J361M30J73J80l8J2O42J039
$$ 82826 84785 86511 88237 90046 91697 93381 95508 97697 99058 99488 99661 99841 99803 99815 100457 101496
56665A01496O34K03M14M92l50j324j329o74k38M6N47P98M56L50J186K151K196
$$ 101496 102130 102333 102747 103239 102889 101565 100236 99562 99324 99370 99917 100715 101171 101521 102707 104858 107054
56648A07054J763J788J885J114j40o65l61k44p98j522j898j821j365q28o22p25
$$ 107054 108817 110605 112490 113604 113464 112799 112438 112194 111396 109874 107976 106155 104790 103962 103340 102615
56632A02615p47q05j332j725p09J445K601J601j06p37m78l27j82L73P11J86n34
$$ 102615 101868 101063 99731 98006 97297 98742 101343 102944 102838 102101 101623 101296 101114 101487 102198 102384 101850
56615A01850o24n60j042j470j005j84n0m48o07n23n57m31J53P15R12J270J929
$$ 101850 101226 100666 99624 98154 97149 96965 96915 96467 95860 95337 94780 94349 94502 95217 96129 97399 99328
56598I9328J871N84p01p69k43k46m94k60l4n50j159q84k04j54m50r9Q16J494J803
$$ 99328 101199 101783 101082 100313 100070 99824 99330 99070 99036 98486 97327 96443 96239 96085 95635 95536 96352 97846 99649
56579I9649J981J751J050P45J331J855J461Q86J034J254O94J44P83K049K665K893
$$ 99649 101630 103381 104431 105176 106507 108362 109823 110709 111743 112997 113691 113835 114618 116667 119332 122225
56563A22225L922N728P360Q738J0500J2583J4417J5818J6330J4497R446K568l697
$$ 122225 126147 131875 139235 147973 158473 171056 185473 201291 217621 232118 241564 244132 240435
56550B40435p948r677q521n350k801k637l594l605k998l377m471m560l353k114
$$ 240435 232487 222810 214289 208939 206138 203501 199907 196302 193304 189927 185456 180896 177543 175429
56536A75429j432r02o48j167k000k352k517l022l084j818k58j31j178j694j225
$$ 175429 173997 173095 172447 171280 169280 166928 164411 161389 158305 156487 156229 156098 154920 153226 152001
56521A52001p17m88n6M09L17LN6o0j018j958j759j179j632k593k449j289n37l40
$$ 152001 151284 150796 150740 151149 151466 151469 151525 151465 150447 148489 146730 145551 143919 141326 138877 137588 137051 136711
56503A36711L18J230J173L05L2N37O48Q3l51o10j374k178j775l53N89N75M25L96
$$ 136711 137029 138259 139432 139737 139769 140306 140954 141037 140686 140076 138702 136524 134749 134396 134985 135560 135985 136381
56485A36381L1k91K59J118R06j84o30j12K05j32l80k56j24K78J385K275J711M39
$$ 136381 136412 136121 136380 137498 138404 138220 137590 137478 137683 137551 137171 136915 136791 137069 138454 140729 142440 142879
56467A42879K67J125J312N45K75Q96J094L01m70o21o83p15n7J018J311O73J71
$$ 142879 143146 144271 145583 146128 146403 147299 148393 148694 148224 147603 146920 146205 146148 147166 148477 149150 149321
56450A49321J09j70n83k38P55J370J497J817K088J538P41Q25J155K43j293j407
$$ 149321 149430 149260 148677 148439 149194 150564 152061 153878 155966 157504 158245 159070 160225 160468 159175 157768
56434A57768k30n7j414k131j029L15M69J93M23N26j44p94o39j61KM6J59P4r8J16
$$ 157768 157538 157481 156067 153936 152907 153222 153691 153884 154307 154833 154689 153895 153256 153095 153097 153143 153302 153376 153278 153394
56414A53394M78M24M59J456K671K451R38JK81N12o4o72p03l98L88K003L444L103
$$ 153394 153872 154296 154755 156211 158882 161333 162271 162272 162553 163065 163001 162329 161626 161228 161616 163619 167063 170166
56396A70166J340J19Kk27r14r33n9N40N20P45J147O75k88r3J208J668P57K18R66
$$ 170166 171506 171625 171627 171400 170486 169553 169494 170034 170554 171299 172446 173121 172833 172740 173948 175616 176373 176591 177557
56377A77557J744J618J284J151N63l13k68O01P47j9j25P51R88J05k83N20J047
$$ 177557 179301 180919 182203 183354 183917 183604 183336 183937 184684 184665 184540 185291 186279 186384 186101 186621 187668
56360A87668N15J71O64P65n6l04Q85K143K234J808J622J247O43P47J475J383K90
$$ 187668 188183 188354 189018 189783 189727 189423 190308 192451 194685 196493 198115 199362 200005 200752 202227 203610 203900
56343B03900q3R22J771J546J346J853K082J646J754K805L472L301L587M588M586
$$ 203900 203817 204739 206510 208056 209402 211255 213337 214983 216737 219542 223014 226315 229902 234490 239076
56328B39076L027J865K387L347L562L740M321M143K742J471R66P3j447j968j087
$$ 239076 242103 243968 246355 249702 253264 257004 261325 265468 268210 269681 270647 270720 269273 267305 266218
56313B66218p46j800k375j371m57q50j071P5J227J243J450K857L877L139J993
$$ 266218 265472 263672 261297 259926 259469 258619 257548 257623 258850 260093 261543 264400 268277 271416 273409
56298B73409J992K302J944K069L606N000M679L658L439L461K807K375L092L972
$$ 273409 275401 277703 279647 281716 285322 290322 295001 298659 302098 305559 308366 310741 313833 317805
56284C17805M028M128N070N889N842N922O705P010O393O515Q205R738R823R662
$$ 317805 321833 325961 331031 336920 342762 348684 355389 362399 368792 375307 383512 393250 403073 412735
56270D12735J0300J0733J0517J1233J3304J4454J3610J3156J4963J7323J8513
$$ 412735 423035 433768 444285 455518 468822 483276 496886 510042 525005 542328 560841
56259E60841K0108K3797K7976L0633L2897L6646M1285M5914N1961O0442O9258
$$ 560841 580949 604746 632722 663355 696252 732898 774183 820097 872058 932500 1001758
56248A001758P6354Q3070R1272R9848J07077J13735J20480J24977J25127J22582
$$ 1001758 1078112 1161182 1252454 1352302 1459379 1573114 1693594 1818571 1943698 2066280
56238B066280J19466J14214J04251R0346P4577N6468L5067J2561q126k7218m5892
$$ 2066280 2185746 2299960 2404211 2494557 2569134 2625602 2660669 2673230 2665104 2637886 2591994
56227B591994o2519p4981q4479r3038r9401j01507j00989j00855j00592r7865
$$ 2591994 2529475 2454494 2370015 2276977 2177576 2076069 1975080 1874225 1773633 1675768
56217A675768r3303q9285q5525q0249p4288o9811o6228o1491n6218n2401m9259
$$ 1675768 1582465 1493180 1407655 1327406 1253118 1183307 1117079 1055588 999370 946969 897710
56206H97710m4520l8745l4398l1667k8954k6325k4780k3258k0207j6899j5459
$$ 897710 853190 814445 780047 748380 719426 693101 668321 645063 624856 607957 592498
56195E92498j4994j3315j1049j0192j0122q991p543p475p571n666l000k333l036
$$ 592498 577504 564189 553140 542948 532826 523835 516292 508817 501246 495580 492580 490247 487211
56182D87211k437p48k41o69RJ368J340L48L66Q65j5j297n26J704K811K785L471
$$ 487211 484774 484026 483785 483116 483125 484493 485833 486181 486547 487412 487397 486100 485574 487278 490089 492874 496345
56165D96345M401L775K582L233N074N618N248O292Q409R373R433J0485J1952J2140
$$ 496345 500746 504521 507103 510336 515410 521028 526276 532568 540977 550350 559783 570268 582220 594360
56151E94360J2491J5704K0601K3680K4917K7322L1668L6535M2594N1824O3166
$$ 594360 606851 622555 643156 666836 691753 719075 750743 787278 829872 881696 944862
56140I44862P3755Q3651R4366J03740J07421J04819R8556Q9021P4959N8952M6762
$$ 944862 1018617 1102268 1196634 1300374 1407795 1512614 1611170 1700191 1775150 1834102 1880864
56129A880864M1018M0000M1830M4849M4845L7650K4575J0800q47j0165j5649j6377
$$ 1880864 1921882 1961882 2003712 2048561 2093406 2131056 2155631 2166431 2165584 2155419 2139770 2123393
56117B123393j6736k3179l6548n2790o9747q7263j01918j08689j07698j03191
$$ 2123393 2106657 2083478 2046930 1994140 1924393 1837130 1735212 1626523 1518825 1415634
56107A415634r6376q5528p2426o1701n3836m5369l6050k9213k5103k0468j4995
$$ 1415634 1319258 1233730 1161304 1099603 1045767 1000398 964348 935135 910032 889564 874569
56096H74569j1613j0251p809m422l251l928k901j91Q41M36K128N532O599N231
$$ 874569 862956 852705 844896 840474 837223 833295 830394 830203 831044 831480 833608 839140 845739 850970
56082H50970N415P539P917O297O404Q465Q718O904O863R025R783Q830R561J1770
$$ 850970 856385 863924 871841 878138 884542 893007 901725 908629 915492 924517 934300 943130 952691 964461
56068I64461J1718R823J0397J3289J3945J2201J2559J5248J5727J3801J4227J7378
$$ 964461 976179 986002 996399 1009688 1023633 1035834 1048393 1063641 1079368 1093169 1107396 1124774
56056A124774J8417J6705J6789J8919J8165J4264J2715J4524J4615J2054J1807
$$ 1124774 1143191 1159896 1176685 1195604 1213769 1228033 1240748 1255272 1269887 1281941 1293748
56045A293748J4563J5008J2273J1838J4903J6226J4748J5742K0031K1990K0873
$$ 1293748 1308311 1323319 1335592 1347430 1362333 1378559 1393307 1409049 1429080 1451070 1471943
56034A471943K2976K9716L4665L5512L7645M2734M5271M3819M4027M7006M6617
$$ 1471943 1494919 1524635 1559300 1594812 1632457 1675191 1720462 1764281 1808308 1855314 1901931
56023A901931M1835L9668M2203M3184M1126M2829M9817N4545N4446N6276O2082
$$ 1901931 1943766 1983434 2025637 2068821 2109947 2152776 2202593 2257138 2311584 2367860 2429942
56012B429942O4833O2776O3795P0355P4681P4188P6597Q4184Q8621Q7476Q9736
$$ 2429942 2494775 2557551 2621346 2691701 2766382 2840570 2917167 3001351 3089972 3177448 3267184
56001C267184R8565J05073J05949J10164J20972J29015J31001J36951J50611J61563
$$ 3267184 3365749 3470822 3576771 3686935 3807907 3936922 4067923 4204874 4355485 4517048
55991D517048J65705J73965J91146K06307K14394K26647K48532K68679K81468
$$ 4517048 4682753 4856718 5047864 5254171 5468565 5695212 5943744 6212423 6493891
55982F493891K98694L26582L53950L75924M05581M48558M91035N27205N72494
$$ 6493891 6792585 7119167 7473117 7849041 8254622 8703180 9194215 9721420 10293914
55973A0293914O34673O99786P62755Q42012R46582J060524J178886J325005J512554
$$ 10293914 10928587 11628373 12391128 13233140 14179722 15240246 16419132 17744137 19256691
55964A9256691J728133J973924K287362K694674L189696L784464M529481N453815
$$ 19256691 20984824 22958748 25246110 27940784 31130480 34914944 39444425 44898240
55956D4898240O543751P817725R360796J1250545J3528885J6288698J9686214
$$ 44898240 51441991 59259716 68620512 79871057 93399942 109688640 129374854
55949A29374854K3813112K8667761L4214736M0019055M4391180M4197655L6475806
$$ 129374854 153187966 181855727 216070463 256089518 300480698 344678353 381154159
55942C81154159K0979292J155906j7693665l1451352l8801009m0678879l8867506
$$ 381154159 402133451 403289357 385595692 354144340 315343331 274664452 235796946
55935B35796946l5062368l0547655k6098884k2029830j8415025j5291182j2671664
$$ 235796946 200734578 170186923 144088039 122058209 103643184 88352002 75680338
55928G5680338j0499812q695325p216922o033367n079464m290413l644364l131264
$$ 75680338 65180526 56485201 49268279 43234912 38155448 33865035 30220671 27089407
55920B7089407k713475k353005k046184j797547j587259j394281j225128j090509
$$ 27089407 24375932 22022927 19976743 18179196 16591937 15197656 13972528 12882019
55912A2882019r76869q67261p68177o90869o26359n62111n04478m62716m28354
$$ 12882019 11905150 11037889 10269712 9578843 8952484 8390373 7885895 7423179 6994825
55903F994825l90702l56207l33316l14109k89012k64405k48486k34477k14433
$$ 6994825 6604123 6247916 5914600 5600491 5311479 5047074 4798588 4564111 4349678
55894D349678j95368j85508j78144j64699j50638j43431j37441j25578j13631
$$ 4349678 4154310 3968802 3790658 3625959 3475321 3331890 3194449 3068871 2955240
55885B955240j08547j04229r3079q0435p3838o9120o0792n5367o0278o9334p2709
$$ 2955240 2846693 2742464 2649385 2568950 2495112 2425992 2365200 2309833 2249555 2180221 2107512
55874B107512p2237p3934p4570o8976o2259o1684o3751o1511n7301n6483n5814
$$ 2107512 2035275 1961341 1886771 1817795 1755536 1693852 1630101 1568590 1511289 1454806 1398992
55863A398992m9916m2562l9959l9183l4363k8212k6446k6580k2975j7541j5133
$$ 1398992 1349076 1306514 1266555 1227372 1193009 1164797 1138351 1111771 1088796 1071255 1056122
55852A056122j3686r101m753o166j0992j3685j5284j9356k3238k2681k0591k1918
$$ 1056122 1042436 1033335 1028582 1022416 1011424 997739 982455 963099 939861 917180 896589 874671
55840H74671k4311k2792j9333j8862j9905j8050j4779j4231j4947j3218j0858
$$ 874671 850360 827568 808235 789373 769468 751418 736639 722408 707461 694243 683385
55829F83385j1466j2620j0125o339o155q128p781o333p929j1260j2068j1203j2275
$$ 683385 671919 659299 649174 642835 636680 628552 620771 614438 606509 595249 583181 571978 559703
55816E59703j3984j2594r589r224j0707j0128p924p277p346n182k197j761k514
$$ 559703 545719 533125 523536 514312 503605 493477 485553 478276 470930 465748 463551 461790 459276
55803D59276q47K124K842K311L979O684O654M661M374N212L648K21j340q75j421
$$ 459276 458429 460553 463395 465706 469685 476369 483023 487684 492058 497270 500918 501139 499799 498924 497503
55788D97503l219m023m156n507o756n218k202j193k306l704o398j1899j7120j7723
$$ 497503 494284 490261 486105 480598 473842 468624 466422 465229 462923 459219 452821 440922 423802 406079
55774D06079j4878j2856j1743q652m379k207j385J569N808O790L594k79k989n548
$$ 406079 391201 378345 366602 357950 353571 351364 349979 351548 357356 364146 367740 367461 364472 358924
55760C58924p408o603m196l253l634k778j130j528l790n117n432p060r555j0113
$$ 358924 351516 344913 340717 337464 333830 331052 329922 328394 324604 319487 314055 306995 297440 287327
55746B87327q845q452q888p533m608l258m139m743m166l897l886k526m85q3q97
$$ 287327 278482 270030 261142 253609 249001 245743 241604 236861 232695 228798 224912 222386 221901 221818 220921
55731B20921m57J027J132j4j25M43p77l253l884k618k625m571n664m812l983l814
$$ 220921 220464 221491 222623 222609 222484 222927 222150 218897 215013 212395 209770 205199 199535 194723 190740 186926
55715A86926k577k82O18l94r97j66P37J477L422N960O567N076L903L513J720j788
$$ 186926 184349 184067 184685 184291 183294 183128 183865 185342 188764 194724 201291 206367 210270 213783 215503 213715
55699B13715m398m929n158o078o394n607n063n004m023k210j437j886j674m67
$$ 213715 209317 204388 199230 193152 186758 181151 176088 171084 167061 164851 163414 161528 159854 159387
55685A59387l8o67m54J120K400K877L881N347N440M065L347L817L510J617j79
$$ 159387 159349 158682 158228 159348 161748 164625 168506 173853 179293 183358 186705 190522 194032 195649 195470
55670A95470p94j061j353r44k80p97k028k021r29q59j901j749J96J863K218K446
$$ 195470 194676 193615 192262 191318 191038 190241 188213 186192 185263 184404 182503 180754 180950 182813 185031 187477
55654A87477K889K297P85J69O00K71j012j462r60j343k463j926K92J013j071l349
$$ 187477 190366 192663 193448 193617 194217 194488 193476 192014 191054 189711 187248 185322 185614 186627 185556 182207
55638A82207l783l753m711n589n414n304n955o040m848l738l431k627q02L96J20
$$ 182207 178424 174671 169960 164371 158957 153653 147698 141658 136810 133072 129641 127014 126212 126608 126728
55623A26728j21O32J040J80o58m69k57p63r53k71j2r69k028k318k493k727j984
$$ 126728 126607 127239 128279 128459 127801 127332 127075 126312 125359 125088 125076 124107 122079 119761 117268 114541 112557
55606A12557m45j9j214k125j760j618k608l208k288j142r91r58k17K23l60p76
$$ 112557 112112 112093 110879 108754 106994 105376 102768 99560 97272 96130 95139 94181 93964 94187 93827 93051
55590I3051q6O51M33qM0j02o58m37R17J782J170L63N88J157J324J819L074M068
$$ 93051 92965 93616 94049 94041 94081 93979 93321 92884 93801 95583 96753 97116 97704 98861 100185 102004 105078 109146
55572A09146M308M951O600Q092Q677R216R916R223O446L262J105p65l119n011
$$ 109146 113454 118405 125005 133097 141774 150990 160906 170129 176575 179837 180942 180177 177058 172047
55558A72047n627n779o064n715m708m629n936o662n539m023l581l345k307j474
$$ 172047 166420 160641 154577 148862 144154 139525 133589 126927 121388 117365 113784 110439 108132 106658
55544A06658j789k079j199j09J87O65K179L303K566J027M15M48J17o6O25J153
$$ 106658 104869 102790 101591 101482 101669 102334 104513 107816 110382 111409 111824 112272 112389 112323 112948 114101
55528A14101K97j081j493j247j471j972k025j981k321k369j659j280k053k841
$$ 114101 114398 113317 111824 110577 109106 107134 105109 103128 100807 98438 96779 95499 93446 90605
55514I0605k367j385j200j421j058n53q36j499j628j366j139n43N45J106O49K80
$$ 90605 88238 86853 85653 84232 83174 82621 81785 80286 78658 77292 76153 75610 76155 77261 77910 78190
55498G8190O51O06n39j271l78O45j20j842k349j418m12J71O20N05n47j426q26
$$ 78190 78841 79447 78908 77637 77259 77904 77784 75942 73593 72175 71763 71934 72554 73059 72512 71086 70260
55481G0260O97J639J646J208L84o16p73J92Q03Oj031q83k23l21p33n06k92j033
$$ 70260 70957 72596 74242 75450 75834 75218 74445 74637 75440 75446 74415 73532 73309 72988 72255 71749 71457 70424
55463G0424j847j446n35n83j222j184p73j164k016k034j222n23Q0J100J958J778
$$ 70424 68577 67131 66596 66013 64791 63607 62834 61670 59654 57620 56398 55875 55955 57055 59013 60791
55447F0791J059P27M44k74m46Q10K171J876N79J13L17k96j502j643n53L27N23
$$ 60791 61850 62577 63021 62747 62301 63111 65282 67158 67737 67850 68167 67871 66369 64726 64173 64500 65023
55430F5023P90J067N60k40JR58Q06q59k264k002n72Q14J503J337O83M89J115J564
$$ 65023 65813 66880 67440 67200 67201 68159 68965 68106 65842 63840 63268 64082 65585 66922 67605 68094 69209 70773
55412G0773R97L18P10J449J012l20r77p40p69j314j473j094j024j444j676j493
$$ 70773 71770 72088 72798 74247 75259 74939 73962 73222 72453 71139 69666 68572 67548 66104 64428 62935
55396F2935j113k75J116J920J166m2N9J081J242L54j69l4l18j038r41K0L32m68
$$ 62935 61822 61547 62663 64583 65749 65707 65766 66847 68089 68443 68274 68240 67922 66884 65943 65963 66295 65827
55378F5827r89l51N67Q72Q64Q84O13Q4n1J58j64j088j541j069n40n59n56k4N30
$$ 65827 64838 64487 65054 65926 66790 67674 68287 68371 68320 68478 68314 67226 65685 64616 64076 63517 62961 62937 63467
55359F3467M74K2k82k47M4L55K88k24o05m59k62m43l89N15J499J391M12l74q14
$$ 63467 63941 63963 63681 63434 63478 63833 64121 63897 63292 62833 62571 62128 61739 62254 63753 65144 65556 65182 64368
55340F4368j330j447m44R30J210N28L24R05J101M14l41o51r30j256j113n83l69
$$ 64368 63038 61591 61147 62077 63287 63815 64139 65044 66145 66559 66218 65567 64637 63381 62268 61685 61316
55323F1316m68j94M07N35J45K9M51R68J503K181K315J161m50r48l19Q7p9P1O17
$$ 61316 60848 60654 61061 61596 61741 61770 62221 63189 64692 66873 69188 70349 69899 68951 68632 68719 68640 68711 69328
55304F9328N56j93m65R3M85K11q9k08p37j445j134K43J061L58q92j432j192n16
$$ 69328 69884 69691 69226 69319 69804 70015 69926 69718 68981 67536 66402 66645 67706 68064 67172 65740 64548 64032
55286F4032N50J500J360J90o97n71r7J37M04P22M36l71n62K24P80J95p17p55O7
$$ 64032 64582 66082 67442 67632 66935 66364 66267 66404 66808 67530 67966 67595 67033 67257 68037 68232 67515 66760 66827
55267F6827R90J604J700J053K8m08Q5O83N54j95r99j488j404p55j14L7J91J021
$$ 66827 67817 69421 71121 72174 72202 71794 71879 72562 73116 72921 71922 70434 69030 68275 68161 68198 68389 69410
55249F9410J938J764P01P3J49j21r72j267n09K66K59j5o9l74j095j368o45L50
$$ 69410 71348 73112 73813 73886 74035 73914 72942 71675 71166 71432 71691 71676 71607 71233 70138 68770 68125 68475
55231F8475P76P30N47J64k25p8L97K14p32j193m59N25O18K9l56k59J1J41j47q19
$$ 68475 69251 69981 70528 70692 70467 70389 70786 71000 70268 69075 68616 69141 69759 69788 69432 69173 69184 69325 69178 68359
55211F8359j126l30R76J421Q45M63Q32J089O22O4O4K65J66j60o16j300j777j325
$$ 68359 67233 66903 67879 69300 70145 70608 71440 72529 73151 73215 73279 73544 73710 73550 72934 71634 69857 68532
55193F8532k22M54M97P47J404J659J309J141J293R00j63q18o19m26o69o27r4M1
$$ 68532 68310 68764 69261 70008 71412 73071 74380 75521 76814 77714 77551 76733 76114 75688 75019 74392 74298 74339
55175G4339l70j50J019J638P22o19j024p93p25n59J71R96J442J821K158J681L87
$$ 74339 73969 73819 74838 76476 77198 76579 75555 74762 74037 73478 73649 74645 76087 77908 80066 81747 82134
55158H2134l72JK38o01j373p95L62O52K33J13J86k59r49j086p47m71j63L86O76
$$ 82134 81762 81763 82001 81400 80027 79232 79594 80246 80479 80592 80778 80519 79570 78484 77737 77266 77103 77489 78165
55139G8165L40k1Q0O8m60o99k7O27K91k82J46J153J370N92l00r41j540j826j364
$$ 78165 78505 78484 78564 78632 78172 77473 77446 78073 78364 78082 78228 79381 80751 81343 81043 80102 78562 76736 75372
55120G5372n23k8Q7J45L2k98k27N39J161Q62J89LR2j37m63n09o83j237j224J61
$$ 75372 74849 74821 74908 75053 75085 74787 74560 75099 76260 77122 77311 77314 77406 77269 76806 76297 75614 74377 73153 73314
55100G3314K016K782K235J195R6q46q89K45J334J083J0m68j66J11K58O83J033
$$ 73314 75330 78112 80347 81542 81638 80792 79903 80148 81482 82565 82575 82107 81941 82052 82310 82993 84026
55083H4026O11j89m23j73j97l71M2Q50J114P05L71L64K77N5nm6m13q35q17m77
$$ 84026 84637 84448 84025 83852 83655 83284 83326 84176 85290 85995 86366 86730 87007 87062 87057 87011 86598 85763 84946 84469
55063H4469r6N70J513J751O50p74j188q68q55r09m4J369J864J044j04r53j610
$$ 84469 84373 84943 86456 88207 88857 88083 86895 86027 85172 84263 84219 85588 87452 88496 88392 87439 85829
55046H5829j797r82K89P19P6n99o95o17o66o24n73r01j385j357q07k61K94J233
$$ 85829 84032 83050 83339 84058 84134 83535 82840 82223 81557 80933 80360 79459 78074 76717 75910 75649 75943 77176
55028G7176K208K403J764R27R1q11j215n21O02R14M67L10N11R5r54j312k86J196
$$ 77176 79384 81787 83551 84478 84569 83758 82543 82022 82624 83538 84005 84315 84826 84921 83967 82655 82369 83565
55010H3565J987J918J289L21n49q10o21n30m58L8O05M20l07m48L13J086J232J040
$$ 83565 85552 87470 88759 89080 88531 87721 87100 86570 86112 86150 86755 87175 86868 86420 86733 87819 89051 90091
54992I0091P28R1o35p46k71n3l68n30j27L76O11P30O88J45n73n32L89J123R11
$$ 90091 90819 90910 90275 89529 89258 89205 88837 88307 88180 88556 89167 89897 90585 90730 90157 89625 90014 91137 92048
54973I2048K52k7J88O00J017J198Q44M1q05j497j961j829q73K72P85Q11R85J134
$$ 92048 92300 92273 92461 93061 94078 95276 96120 96161 95356 93859 91898 90069 89196 89468 90253 91064 92049 93183
54955I3183O12k23l51J95L65l5o8N16P19J17k58L80J238J153J51r47j688j983
$$ 93183 93795 93572 93221 93416 93781 93746 93678 94194 94913 95030 94772 95152 96390 97543 97694 96747 95059 93076
54937I3076j650p15L00Q47P87K71l10l19M84J281J089J95k00K73Q83J255J852
$$ 93076 91426 90711 91011 91858 92645 92916 92606 92287 92771 94052 95141 95336 95136 95409 96292 97547 99399
54920I9399K820L620M145M990O211P005O987O739O568N912M434K621P74j512m187
$$ 99399 102219 105839 109984 114974 121185 128190 135177 141916 148484 154396 158830 161451 162225 160713 156526
54905A56526o191o726o259n607m909m132l634l556l384k801k277k224k295k041
$$ 156526 150335 143609 137350 131743 126834 122702 119068 115512 112128 109327 107050 104826 102531 100490
54891A00490j569j089m89J78M91M67P56J559K151J963J445J289J499J740J934
$$ 100490 98921 97832 97343 97521 98012 98479 99235 100794 102945 104908 106353 107642 109141 110881 112815
54876A12815K057K039K226L228M883O162O437O076N427M208K403P67k33j179k604
$$ 112815 114872 116911 119137 122365 127248 133410 139847 145923 151350 155558 157961 158728 158495 157316 154712
54861A54712l978m510m352m217m309m324m122l834l567l428l445l288k574j598
$$ 154712 150734 146224 141872 137655 133346 129022 124900 121066 117499 114071 110626 107338 104764 103166
54847A03166j119j217j132m58K99O52P34O44J19p26j182r80o80o94p69q22j248
$$ 103166 102047 100830 99698 99240 99539 100191 100925 101569 101688 100962 99780 98800 98120 97426 96657 95835 94587
54830I4587j933k005j187l53j34j7M65P57M18J13M12N72k90j510j682o55M12P32
$$ 94587 92654 90649 89462 89109 88975 88958 89423 90180 90598 90711 91123 91695 91405 89895 88213 87558 87970 88702
54812H8702N50L45K85M01O14O10K18k42l34O3Q64J810K262J666N23L4L80M03m86
$$ 88702 89252 89597 89882 90283 90897 91507 91725 91483 91149 91212 92076 93886 96148 97814 98337 98371 98751 99154 98668
54793I8668j205p20K34L14l61o13r6M75O49O21M61K1m35m48j23R7L03R23J759
$$ 98668 97463 96743 96977 97291 96930 96317 96221 96696 97345 97966 98427 98448 98013 97565 97442 97539 97842 98765 100524
54774A00524K045J478N93N0J08P18J633K435K856L094L516M214N016N666N889
$$ 100524 102569 104047 104640 104690 104798 105516 107149 109584 112440 115534 119050 123264 128280 133946 139835
54759A39835N645N452N852O306N440K811k92k433l684m951o339p101o908o244
$$ 139835 145480 150932 156784 163090 168530 171341 171049 168616 164932 159981 153642 146541 139633 133389
54745A33389n644n154m509l460k063q86n48q10p29J7O32M43o8q1M17Q96J145J230
$$ 133389 127745 122591 118082 114622 112559 111673 111125 110315 109586 109603 110235 110678 110610 110529 110946 111842 112987 114217
54727A14217J117R57J162J629J574P49J35P15K136L373M115M681N179N493N626
$$ 114217 115334 116291 117453 119082 120656 121405 121540 122255 124391 127764 131879 136560 141739 147232 152858
54712A52858N295L867J386j019k580l879n466o434n679l898k840k977l326l242
$$ 152858 158153 162020 163406 162387 159807 155928 150462 144028 138349 134451 131611 128634 125308 122066
54698A22066k935k459j635j009j434k524k796j665j57O42P34M85r1q54j228j007
$$ 122066 119131 116672 115037 114028 112594 110070 107274 105609 105452 106094 106828 107313 107222 106368 105140 104133
54682A04133p88j050j408j265o48k2L69N05L58rk71j93O7J61Oj28L3L63M11l0
$$ 104133 103345 102295 100887 99622 98974 98952 99321 99826 100184 100175 99904 99711 99778 99939 99945 99817 99850 100213 100624 100594
54662A00594m94l25M62J134J209R65P79N39j6p80j472j901j814r63L08J181J365
$$ 100594 100100 99775 100237 101371 102580 103545 104324 104863 104847 104067 102595 100694 98880 97917 98225 99406 100771
54645A00771J396J569J354L83p34j247j213r29k09R68J822J683R88M49j08j065
$$ 100771 102167 103736 105090 105473 104739 103492 102279 101350 101141 102109 103931 105614 106602 107051 106943 105878
54629A05878j855j626p25k53m35n41k14J90M95Q15Q97L27o55j339j514j427j037
$$ 105878 104023 102397 101672 101419 100984 100443 100229 100419 100914 101729 102626 102953 102298 100959 99445 98018 96981
54612I6981k68L73L60J56N47J197J112L86J83Q07J143M33n75p80j38O46J119J227
$$ 96981 96713 97086 97446 97602 98149 99346 100458 100844 101027 101834 102977 103410 102835 102055 101917 102563 103682 104909
54594A04909R52L24m35r71r64k84O32R64M56o9J43N92K35q60j598j446r26n06
$$ 104909 105861 106185 105750 104779 103815 103531 104163 105127 105583 105514 105657 106249 106484 105624 104026 102580 101654 101148
54576A01148k3O07J016R54O40L28N3k0K97P55Q34M36m2k81k44L4L48K87k10o01
$$ 101148 101125 101732 102748 103702 104342 104670 104723 104703 105000 105755 106589 107025 106983 106702 106458 106492 106840 107127 106917 106316
54556A06316n34m03m77k44N56J015L97l93q5P68O11n09r95k61O78J257K022K853
$$ 106316 105782 105379 104902 104658 105214 106229 106626 106233 106148 106916 107527 107018 106023 105762 106440 107697 109719 112572
54538A12572K524Q89k80K79J466J598P46J23J05J35r0m32q22j141j041n90m85
$$ 112572 115096 115985 115705 115984 117450 119048 119794 119917 120022 120157 120067 119635 118813 117672 116631 116041 115556
54521A15556r93j359r21j34K97N56J148J729J582Q54L54L12J74l74r54j143j050
$$ 115556 114563 113204 112283 112149 112446 113002 114150 115879 117461 118315 118669 118981 119155 118781 117827 116684 115634
54504A15634j036j196j210o96K37Q92O41l20j194j510j354q56o7O18O63K39J60
$$ 115634 114598 113402 112192 111496 111733 112625 113266 112946 111752 110242 108888 108032 107965 108583 109246 109485 109645
54487A09645P42J349J345Q76L94M6j27J10P58J325J327Q34L01J66O32J411J783
$$ 109645 110387 111736 113081 113957 114351 114397 114270 114380 115138 116463 117790 118624 118925 119091 119723 121134 122917
54470A22917J406R31J125J628J436N95J88N45O92o1j053j449j391j306j045m79
$$ 122917 124323 125254 126379 128007 129443 130038 130226 130771 131463 131402 130349 128900 127509 126203 125158 124679
54454A24679j16k87l81K44J119J271N65l10q22q92n83o6K66K27O1l9k51o11p42
$$ 124679 124563 124276 123895 124139 125258 126529 127094 126784 125962 125070 124487 124421 124687 124914 124975 124936 124685 124074 123332
54435A23332m78k10j36K04J087J829J634P48P0r3j74n55j079j317q35M85K055
$$ 123332 122854 122644 122508 122712 123799 125628 127262 128010 128080 127987 127813 127258 126179 124862 124027 124512 126567
54418A26567K770K083O54l51l72L20J075J243N58n39j273j432j415j328p97J29
$$ 126567 129337 131420 132074 131723 131351 131671 132746 133989 134547 134008 132735 131303 129888 128560 127763 127892
54402A27892P07O08M87Q09J003N02j36lQ22J588K009K213J967R85k45q02m44K72
$$ 127892 128599 129207 129694 130503 131506 132008 131872 131869 132691 134279 136288 138501 140468 141453 141208 140406 139962 140234
54384A40234Q18R67N39m16j294j525j327j270j317j012m31j45k54k50Q4M05N04
$$ 140234 141052 142019 142558 142142 140848 139323 137996 136726 135409 134397 133966 133821 133567 133317 133401 133806 134310
54367A34310O07Q55J048J221J762K709L347L065K259J881K211K522K121J304Q76
$$ 134310 134917 135772 136820 138041 139803 142512 145859 148924 151183 153064 155275 157797 159918 161222 162098
54352A62098R73Q23j48j473k271k327k038j707j481j724k571l231k649j061O5
$$ 162098 163071 163894 163746 162273 160002 157675 155637 153930 152449 150725 148154 144923 142274 141213 141278
54337A41278q2p62j008r50j147j422j205n26J03M79O66N40l7p46j050q09k58L30
$$ 141278 141196 140434 139426 138476 137329 135907 134702 134176 134279 134758 135424 135964 135927 135181 134131 133322 133064 133394
54319A33394O42L41m70j086r72m39j88m04p06p68o24m58l59k39O3M13K99n01j281
$$ 133394 134036 134377 133907 132821 131849 131410 131222 130818 130112 129344 128720 128262 127903 127664 127727 128140 128439 127938 126657
54300A26657j143l23K6m99j035q38k90j7O8K29K31r2k24L10J133J507J242N96
$$ 126657 125514 125191 125217 124718 123683 122845 122555 122538 122606 122835 123066 122974 122750 123060 124193 125700 126942 127538
54282A27538j68p05o25o6L17L37N34J092J324Q46K99K78M37L28K27K88o6r99j485
$$ 127538 127370 126665 126040 125974 126291 126628 127162 128254 129578 130424 130723 131001 131438 131766 131993 132281 132215 131216 129731
54263A29731p95K35N92P58J545K218J551J38k54O24J278J003P67J293J871J684
$$ 129731 128936 129171 129763 130521 132066 134284 135835 135973 135719 136343 137621 138624 139391 140684 142555 144239
54247A44239J015M86J40j38j26K35N44N19L41J48j68n48p43p98r56j090q74n24
$$ 144239 145254 145740 145880 145742 145616 145851 146395 146914 147255 147403 147235 146687 145944 145146 144190 143100 142226 141702
54229A41702n97j053j272j033p68p05n39j28K37L77M30M45K88O8L5J22J35K36
$$ 141702 141105 140052 138780 137747 136979 136274 135735 135607 135844 136221 136651 137096 137384 137452 137487 137609 137744 137980
54211A37980N77O92P8p67r25n39o76j597k313k100j376p64k48K43L51oj72L96
$$ 137980 138557 139249 139327 138560 137635 137096 136420 134823 132510 130410 129034 128270 128022 128265 128616 128610 128438 128834
54193A28834J322J830J602Q34j29q39r28n08l8K89N98P26L27l39m99l0K72m0k99
$$ 128834 130156 131986 133588 134422 134293 133454 132526 132018 131980 132269 132867 133593 133920 133581 133082 133052 133324 133284 132985
54174A32985K37J171J531J112N83M42M58K11k68n18j96M91R80R97P63M52j71j222
$$ 132985 133222 134393 135924 137036 137619 138061 138519 138730 138462 137944 137748 138239 139219 140216 140979 141431 141260 140038
54156A40038k115k155j481q72o86o54o18p24q49n91M1N13N18K81Kl74o72m06N14
$$ 140038 137923 135768 134287 133415 132729 132075 131457 130733 129884 129293 129334 129847 130365 130646 130648 130274 129602 129196 129710
54137A29710J470J824J546R91M58J16L8R0R5N4L5q7m06o72o07l08L7N11J052J046
$$ 129710 131180 133004 134550 135541 135999 136115 136153 136243 136338 136392 136427 136340 135934 135262 134655 134347 134384 134895 135947 136993
54117A36993J32r20j013j86O00R66J364J896K004J532J068R33P58L52J28K80M45
$$ 136993 137125 136205 135192 135006 135606 136572 137936 139832 141836 143368 144436 145369 146127 146479 146607 146887 147332
54100A47332N05Q38J421J462N33p13j347j152m24N15J238J296Q55P04J224J938
$$ 147332 147837 148675 150096 151558 152091 151378 150031 148879 148455 148970 150208 151504 152359 153063 154287 156225
54084A56225K421K949L850M753M983M268K730O45j407k723l081k876k484k003
$$ 156225 158646 161595 165445 170198 175181 179449 182179 182824 181417 178694 175613 172737 170253 168250
54070A68250j619j571j556r72M2N70K41j98K4P66J442J744J530P74ol5O31J091
$$ 168250 166631 165060 163504 162532 162574 163144 163385 163187 163211 163977 165419 167163 168693 169467 169461 169426 170057 171148
54052A71148R68Q70J060Q29r1o37J75J700K636K778K904L380L984M639N435O130
$$ 171148 172116 172986 174046 174875 174784 174147 174322 176022 178658 181436 184340 187720 191704 196343 201778 207908
54036B07908O431O568O913P399P838Q340Q753Q329O756M979M010L486K367P38
$$ 207908 214339 220907 227820 235219 243057 251397 260150 268479 275235 280214 284224 287710 290077 290815
54022B90815k97l54k23n51j107j515j830k174k524l010l790m513m623m261m184
$$ 290815 290518 290164 289941 289390 288283 286768 284938 282764 280240 277230 273440 268927 264304 260043 255859
54007B55859m597m818m405l892l983m541m863m608l969l204k424j785j491j591
$$ 255859 251262 246444 242039 238147 234164 229623 224760 220152 216183 212979 210555 208770 207279 205688
53993B05688j916k254k461k440k192j906j887k287k909l363l396k999k202j056
$$ 205688 203772 201518 199057 196617 194425 192519 190632 188345 185436 182073 178677 175678 173476 172420
53979A72420J42Q93J005Q43Q13Q67Q29Q96J250J421P37o29j703j827j195k87N65
$$ 172420 172562 173455 174460 175303 176116 176983 177812 178708 179958 181379 182116 181487 179784 177957 176762 176475 177040
53962A77040J024Q41L54K55O79J123J275J340J358J064N93N77J236K087K881M011
$$ 177040 178064 178905 179259 179514 180193 181316 182591 183931 185289 186353 186946 187523 188759 190846 193727 197738
53946A97738N624P118Q015Q610R359J0305J1443J2808J3657J2543Q936M082k56
$$ 197738 203362 210480 218495 227105 236464 246769 258212 271020 284677 297220 306156 310238 309982
53933C09982l284m915n100m233l371l066k663j600n55k78j57Q10K233K950K916
$$ 309982 306698 301783 296683 292450 289079 286013 283350 281750 281195 280917 280760 281570 283803 286753 289669
53918B89669L100L745M229M557N501P069Q206Q400Q405Q871R233Q587O932M945
$$ 289669 292769 296514 300743 305300 310801 317870 326076 334476 342881 351752 360985 369572 376504 381449
53904C81449L039J176o61k201k973k722j870j419j921k805l222l296l824m934
$$ 381449 384488 385664 385003 382802 379829 377107 375237 373818 371897 369092 365870 362574 358750 353816
53890C53816n908o382o812p565q322q720q844q777q225p114o016n533n482n106
$$ 353816 347908 341526 334714 327149 318827 310107 301263 292486 284261 277147 271131 265598 260116 255010
53876B55010m042k759k106k448l237l536l099k681l037l839m047l244k098j481
$$ 255010 250968 248209 246103 243655 240418 236882 233783 231102 228065 224226 220179 216935 214837 213356
53862B13356j650k261k834l042k876k633k499k261j661r28n48n80o26m77l22k91
$$ 213356 211706 209445 206611 203569 200693 198060 195561 193300 191639 190711 190163 189583 188957 188480 188158 187867
53846A87867k11K4J67n9n34q04n97j86j61o93j158q36N6N53K58j40J2L86L82K15
$$ 187867 187656 187680 187847 187788 187254 186450 185853 185667 185506 184813 183655 182819 182875 183428 183686 183546 183558 183944 184326 184541
53826A84541M93J076J213O99J67J26M07O62Q81J145J322J214Q98P65J159J946
$$ 184541 185034 186110 187323 188022 188189 188315 188722 189384 190265 191410 192732 193946 194844 195609 196768 198714
53810A98714K459K189J527J376J931K437K458K597L489M709N397N477N488N584
$$ 198714 201173 203362 204889 206265 208196 210633 213091 215688 219177 223886 229283 234760 240248 245832
53796B45832N481N157M823M453L966L661L745L669K781J503R85J572K385K486
$$ 245832 251313 256470 261293 265746 269712 273373 277118 280787 283568 285071 286056 287628 290013 292499
53782B92499J844R67J27q01k064l629n011n666n721n836o129n923n037m475n034
$$ 292499 294343 295310 295437 294636 292572 288943 283932 278266 272545 266709 260580 254657 249620 245145 240111
53767B40111n954n927m949m022l531l061k549k310k130j542r42j185k007k182
$$ 240111 234157 228230 223281 219259 215728 212667 210118 207808 205678 204136 203194 202009 200002 197820
53753A97820j330m17j72k68l56p40j438j713j140l50j34m22o76o45l67O6L75L02
$$ 197820 196490 196073 195901 195633 195277 194537 193099 191386 190246 189896 189762 189340 188664 188019 187652 187718 188093 188395
53735A88395P0J73N95Q91R74J096J082N30k01k61M05J048J459K133K914K866J902
$$ 188395 188465 188638 189233 190124 191098 192194 193276 193806 193605 193344 193749 194797 196256 198389 201303 204169 206071
53718B06071J219J500J935J766J495J744J999J638J161J304J799J995K051K379
$$ 206071 207290 208790 210725 212491 213986 215730 217729 219367 220528 221832 223631 225626 227677 230056
53704B30056K626K312J938K269K937K982K399K077K389K874L234L570L700L229
$$ 230056 232682 234994 236932 239201 242138 245120 247519 249596 251985 254859 258093 261663 265363 268592
53690B68592K370J838J764J471M68q78j827k021j606j060q16q72q29n86n68r65
$$ 268592 270962 272800 274564 276035 276503 275625 273798 271777 270171 269111 268295 267423 266594 266008 265440 264475
53674B64475j209q13l00m47r76r00j17L21k68j256j625j229o77m02k67J6M17N47
$$ 264475 263266 262453 262153 261706 260730 259830 259713 260034 259766 258510 256885 255656 254979 254577 254310 254326 254743 255290
53656B55290M3r74j893k142j614n43P70J861K153J488N17Q8L79R17J298J495J550
$$ 255290 255333 254359 252466 250324 248710 248167 248937 250798 252951 254439 254956 255044 255423 256340 257638 259133 260683
53639B60683J448J326J411J642J672J337R25Q58J207J639J796J741J905K489L038
$$ 260683 262131 263457 264868 266510 268182 269519 270444 271302 272509 274148 275944 277685 279590 282079 285117
53624B85117K986K551K574L295L848L469K722K893M328O018O852O695O124N525
$$ 285117 288103 290654 293228 296523 300371 303840 306562 309455 313783 319801 326653 333348 339472 344997
53610C44997M847M024L276K842K585K203J848K138L221M172L926K674J599J243
$$ 344997 349844 353868 357144 359986 362571 364774 366622 368760 371981 376153 380079 382753 384352 385595
53596C85595R52J87n35n85l40n29r71q42pP46P26Qq70j359j162n43l23j041k249
$$ 385595 386547 386734 386199 385614 385274 384745 383774 382932 382925 383671 384397 384405 383535 382176 381014 380471 380148 379107 376858
53577C76858l075l355l494l477k835j678q60q18r76p52m40n19o86l46K54K87k99
$$ 376858 373783 370428 366934 363457 360622 358944 358084 357266 356290 355538 355098 354579 353893 353547 353801 354088 353789
53560C53789n40J48J041J058K77k38P4N84M77j56o05n05n9N27J254J988K432K577
$$ 353789 353249 353397 354438 355496 355773 355535 355609 356193 356670 356514 355909 355404 355345 355872 357126 359114 361546 364123
53542C64123K788L216L520L401L127L169L549L920M150M516N220O084O804P381
$$ 364123 366911 370127 373647 377048 380175 383344 386893 390813 394963 399479 404699 410783 417587 424968
53528D24968Q085R049J0062J0808J1275J1712J2317J3091J4040J5148J6116J6438
$$ 424968 433053 442102 452164 462972 474247 485959 498276 511367 525407 540555 556671 573109
53516E73109J6131J6047J7061J9037K1051K2517K3605K4544K5137K5181K4960
$$ 573109 589240 605287 622348 641385 662436 684953 708558 733102 758239 783420 808380
53505H08380K5031K5602K6365K6815K6625K5883K4975K4144K3250K2056K0625
$$ 808380 833411 859013 885378 912193 938818 964701 989676 1013820 1037070 1059126 1079751
53494A079751J9252J8140J7413J7240J7628J8177J8475J8582J8769J8910J8652
$$ 1079751 1099003 1117143 1134556 1151796 1169424 1187601 1206076 1224658 1243427 1262337 1280989
53483A280989J8063J7655J7756J8232J8740J8831J7966J5969J3398J0965Q711
$$ 1280989 1299052 1316707 1334463 1352695 1371435 1390266 1408232 1424201 1437599 1448564 1457275
53472A457275O268L729J522m25k639n215p725r973j2116j3992j5185j5716j5965
$$ 1457275 1463543 1467272 1468794 1468369 1465730 1460515 1452790 1442817 1430701 1416709 1401524 1385808 1369843
53459A369843j5886j5252j4666j5243j7093j9176k0867k2455k3802k3880k2418
$$ 1369843 1353957 1338705 1324039 1308796 1291703 1272527 1251660 1229205 1205403 1181523 1159105
53448A159105k0753k0187k0420k0520k0396k0275j9545j7444j4422j1689r653
$$ 1159105 1138352 1118165 1097745 1077225 1056829 1036554 1017009 999565 985143 973454 963801
53437I63801p784n824m153l087k555k433k510k244j102Q76L181N342P031Q022
$$ 963801 956017 950193 946040 942953 940398 937965 935455 933211 932109 932985 936166 941508 948539 956561
53423I56561Q456Q842R553J0688J2483J5089J7803J9438K0003K0967K3213K5748
$$ 956561 965017 973859 983412 994100 1006583 1021672 1039475 1058913 1078916 1099883 1123096 1148844
53411A148844K7310K8297K9881L2062L3952L5439L7139L9005M0341M1207M2532
$$ 1148844 1176154 1204451 1234332 1266394 1300346 1335785 1372924 1411929 1452270 1493477 1536009
53400A536009M4735M7233M9459N1429N3225N4645N5582N6110N6346N6642N7616
$$ 1536009 1580744 1627977 1677436 1728865 1782090 1836735 1892317 1948427 2004773 2061415 2119031
53389B119031N9252O0359N9784N7849N5676N3483N0722M7609M5121M3334M1061
$$ 2119031 2178283 2238642 2298426 2356275 2411951 2465434 2516156 2563765 2608886 2652220 2693281
53378B693281L7485L3154K8933K4918K0801J6450J1747O554J250l480p804j3121
$$ 2693281 2730766 2763920 2792853 2817771 2838572 2855022 2866769 2873323 2874573 2871093 2863289 2850168
53366B850168k0619k9867l9132m6832n2366n5907n7847n8505n8220n7591n7253
$$ 2850168 2829549 2799682 2760550 2713718 2661352 2605445 2547598 2489093 2430873 2373282 2316029
53355B316029n7227n6805n5386n3081n0224m6856m3268m0492l9416l9723m0500
$$ 2316029 2258802 2201997 2146611 2093530 2043306 1996450 1953182 1912690 1873274 1833551 1793051
53344A793051m1487m2793m3787m3452m1773l9743l7903l5926l3632l1331k8954
$$ 1793051 1751564 1708771 1664984 1621532 1579759 1540016 1502113 1466187 1432555 1401224 1372270
53333A372270k5918k2173j8516j5500j2958j0951j0246j1324j3451j5280j5977
$$ 1372270 1346352 1324179 1305663 1290163 1277205 1266254 1256008 1244684 1231233 1215953 1199976
53322A199976j5574j4670j3993j3704j3084j1454r346p940p398o676n161l453
$$ 1199976 1184402 1169732 1155739 1142035 1128951 1117497 1108151 1100211 1092813 1086137 1080976 1077523
53310A077523k099o71J279L150M100M412N256P248R863J2146J3682J4844J6314
$$ 1077523 1075424 1074753 1076032 1079182 1083282 1087694 1092950 1100198 1110061 1122207 1135889 1150733 1167047
53297A167047J8311K0409K2187K3797K5425K6695K7291K7834K9077L0384L0168
$$ 1167047 1185358 1205767 1227954 1251751 1277176 1303871 1331162 1358996 1388073 1418457 1448625
53286A448625K8093K5625K4044K2904K1182J8908J6845J5143J3155J0282O434
$$ 1448625 1476718 1502343 1526387 1549291 1570473 1589381 1606226 1621369 1634524 1644806 1651240
53275A651240J966k445o096q832j1052j3092j5035j7169j9880k2857k5121k6235
$$ 1651240 1653206 1650761 1644665 1635833 1624781 1611689 1596654 1579485 1559605 1536748 1511627 1485392
53263A485392k6777k7361k7891k8183k8493k8944k9217k9375l0140l1633l2615
$$ 1485392 1458615 1431254 1403363 1375180 1346687 1317743 1288526 1259151 1229011 1197378 1164763
53252A164763l1927l0070k8432k7393k6286k4946k4141k4397k5320k6226k6808
$$ 1164763 1132836 1102766 1074334 1046941 1020655 995709 971568 947171 921851 895625 868817
53241H68817k6846k6003k4274k2357k1107k0705k0455j9452j7438j4997j2906
$$ 868817 841971 815968 791694 769337 748230 727525 707070 687618 670180 655183 642277
53230F42277j1360r947q326o693n600n535o580q202r526j0137j0488j1194j2187
$$ 642277 630917 620970 612644 605951 600351 594816 588236 580034 570508 560371 549883 538689 526502
53217E26502j3073j3931j4931j5427j4574j2837j1747j1761j1594j0181q218o984
$$ 526502 513429 499498 484567 469140 454566 441729 429982 418221 406627 396446 388228 381244
53205C81244o525o048n409n163n478n918o225o528o846o947o673o061n244m517
$$ 381244 374719 368671 363262 358099 352621 346703 340478 333950 327104 320157 313484 307423 302179 297662
53191B97662m223m320m393m298m304m339l841k754j986k165k659k566k090j985
$$ 297662 293439 289119 284726 280428 276124 271785 267944 265190 263204 261039 258380 255814 253724 251739
53177B51739k168j964j455j450k091k565k407k122k180k220j715q95l92k65K7
$$ 251739 249571 247607 246152 244702 242611 240046 237639 235517 233337 231117 229402 228507 228115 227850 227877
53162B27877P98J617J778J110J44n45r32j300j590j444q77m10l86n88p45r17j110
$$ 227877 228675 230292 232070 233180 233324 232779 231847 230547 228957 227513 226636 226226 225840 225252 224507 223590 222480
53145B22480r63l22L11L65j1j83J25O28R65J029Q75O26L17k02r64j433r05M11
$$ 222480 221517 221195 221506 221871 221860 221677 221802 222430 223395 224424 225299 225925 226242 226040 225076 223643 222738 223149
53127B23149J353J227O73N71P32M74pJ18R14J483J327J008J171J626J772J475
$$ 223149 224502 225729 226402 226973 227705 228179 228172 228290 229204 230687 232014 233022 234193 235819 237591 239066
53111B39066J099R37R32Q40M23l45j219j835k065k099k170k283k249j997j666
$$ 239066 240165 241102 242034 242874 243297 242952 241733 239898 237833 235734 233564 231281 229032 227035 225369
53096B25369j470j402j280j072r51r02o09NL68r2j044j548j201m56Q2J90j05n63
$$ 225369 223899 222497 221217 220145 219194 218292 217683 217688 218056 217964 216920 215372 214171 213715 213797 213987 213882 213319
53078B13319o25M0Q76J048O90O73J055Q60l07j498j810j537j263q29J6P12O31
$$ 213319 212694 212734 213610 214658 215348 216021 217076 217936 217629 216131 214321 212784 211521 210692 210708 211420 212051
53061B12051Q9k45m00o87q44n35k01m11p64m90K04M11Pj82L38J200J902K224J905
$$ 212051 212140 211895 211495 210808 209964 209429 209228 208817 208053 207563 207767 208178 208185 208003 208341 209541 211443 213667 215572
53042B15572P61p19j640j649j129m79J77N98M87J9k42r8J20J22o8l69o60o32j52
$$ 215572 216333 215614 213974 212325 211196 210717 210894 211492 211979 211998 211756 211658 211778 211900 211832 211463 210803 210171 210019
53023B10019L42L67K22N96J355J468L61j208j924j268Q6J015J041O86P59J268
$$ 210019 210361 210728 210950 211546 212901 214369 214730 213522 211598 210330 210416 211431 212472 213158 213917 215185
53007B15185J496J140P53P19N23l11j286j682j664j700j449l15J215J957J698
$$ 215185 216681 217821 218574 219293 219816 219505 218219 216537 214873 213173 211724 211409 212624 214581 216279
52992B16279J274J125Q59L84K36M44K25p23j524j309l54M72Q73J141J509J952
$$ 216279 217553 218678 219537 219921 220157 220601 220826 220103 218579 217270 216916 217388 218261 219402 220911 222863
52976B22863K330K462K313K266K731L406L431K524J369O84M11J64n2k9Q2j08o73
$$ 222863 225193 227655 229968 232234 234965 238371 241802 244326 245695 246379 246790 246954 246902 246873 246955 246847 246174
52959B46174j216j253o71O8K52l74j239j568j248q02o33p22r16j108j122r04p13
$$ 246174 244958 243705 243034 243102 243354 242980 241741 240173 238925 238123 237490 236768 235852 234744 233622 232718 232005
52942B32005p71q23n67k54l14n31l69j4k49j213k100k323k171j998j542n52M94
$$ 232005 231234 230411 229844 229590 229276 228745 228376 228362 228113 226900 224800 222477 220306 218308 216766 216214 216708
52925B16708Q83N68R6j34j52j65k94n42q04r22p61k57M89J095J128O74L41L90
$$ 216708 217591 218159 218255 218121 217969 217804 217510 216968 216164 215242 214481 214224 214713 215808 216936 217610 217951 218341
52907B18341K87m01j177j334j054r40q43j76P26Q01j23r75j037p84p57o26LP28
$$ 218341 218628 218227 217050 215716 214662 213722 212879 212703 213429 214230 214107 213132 212095 211311 210554 209928 209931 210659
52889B10659R84Q90Q67R06Q53Q61J028R69L56m31p34m52%L35N76Q09J017J153
$$ 210659 211643 212533 213400 214306 215159 216020 217048 218017 218373 217942 217208 216756 216756 217091 217667 218476 219493 220646
52871B20646J147J065J212J721K120J804J009N88O84M98k23m14Q22K591L159K174
$$ 220646 221793 222858 224070 225791 227911 229715 230724 231312 231996 232494 232271 231857 232679 235270 238429 240603
52855B40603R71O64Q22L06j154k721l454l255k797k732l062l320l292l243l392
$$ 240603 241574 242238 243060 243366 242212 239491 236037 232782 229985 227253 224191 220871 217579 214336 210944
52840B10944l449k910j752n91j14m23r98j262j156r95q70n07J90Q55J176J345
$$ 210944 207495 204585 202833 202242 202128 201705 200707 199445 198289 197294 196424 195917 196107 196962 198138 199483
52824A99483J599J670J167K81m16p13q09p51m35l7J22R0J74L66M53M88O10N95
$$ 199483 201082 202752 203919 204200 203784 203071 202262 201511 201076 201039 201161 201251 201425 201791 202244 202732 203342 203937
52806B03937K55J15Q32K050K673K323J614R43k7j359k343k404j867j369j127j110
$$ 203937 204192 204307 205139 207189 209862 212185 213799 214742 214715 213356 211013 208609 206742 205373 204246 203136
52790B03136j300j475j266p18k34Q6M75P98O30J67J21N86R06R44J335K088K084
$$ 203136 201836 200361 199095 198377 198143 198229 198704 199502 200132 200299 200420 201006 201912 202856 204191 206279 208363
52773B08363O96j142k199k412k276j763q11j52m42j104j052k11N66P42M23k52
$$ 208363 209059 207917 205718 203306 201030 199267 198456 198304 197862 196758 195706 195495 196061 196803 197226 196974
52757A96974j077j417p81L44J043J172J261J408J179N90L25P81J511J848J651
$$ 196974 195897 194480 193699 194043 195086 196258 197519 198927 200106 200696 201021 201802 203313 205161 206812
52742B06812J299J265J762K564L202L406L222K591J369J0m16M81J589J544N12
$$ 206812 208111 209376 211138 213702 216904 220310 223532 226123 227492 227502 227086 227567 229156 230700 231212
52727B31212j37K57Q75P08k28j223j794j947j795j401q82m65l36m49n00k79Np5
$$ 231212 231075 231332 232207 232915 232687 231464 229670 227723 225928 224527 223645 223180 222844 222395 221895 221616 221621 221546
52709B21546n83j141j457j597j608j288n29L48R43J145J074R12Q86J112J318J083
$$ 221546 220963 219822 218365 216768 215160 213872 213343 213691 214634 215779 216853 217765 218651 219763 221081 222164
52693B22164M61p3l23n02o18l53K22N01J64m29q71j057p90J19J014O64j020k492
$$ 222164 222625 222552 222229 221727 221109 220756 220978 221479 221643 221214 220343 219286 218496 218615 219629 220293 219273 216781
52675B16781k459j459p48n17j81K58L25J01N7J16j12m28k74K46N46N97Q64J297
$$ 216781 214322 212863 212115 211598 211417 211675 212000 212101 212158 212274 212162 211734 211460 211706 212252 212849 213713 215010
52657B15010J286O78N7j00J35N85J297K302L446M426M690L605J263j154k396k407
$$ 215010 216296 216974 217031 216931 217066 217651 218948 221250 224696 229122 233812 237417 238680 237526 235130 232723
52641B32723k015j744j497j214j006p66k96K12L63J55j10k90k83K00J129J764
$$ 232723 230708 228964 227467 226253 225247 224481 224185 224397 224760 224915 224805 224515 224232 224432 225561 227325
52625B27325J430M90j91m30o54r70j139j260j589j833j534r56p04n54K23J374
$$ 227325 228755 229245 229054 228624 227970 227000 225861 224601 223012 221179 219645 218689 217985 217431 217654 219028
52609B19028J703Q26p5J99J372K248K157J421P89P48J157J370R05J9o98j061j223
$$ 219028 220731 221557 221482 221681 223053 225301 227458 228879 229668 230416 231573 232943 233848 233867 233169 232108 230885
52592B30885j111n58J36M58M11L75M01L04L10P38J161Q27n1l57L50J251J476J140
$$ 230885 229774 229216 229352 229810 230221 230596 230997 231301 231611 232349 233510 234337 234286 233929 234279 235530 237006 238146
52574B38146P72N45M22M37M03m1p68j066o35j12k20q39j259j081n04qK8l51o77
$$ 238146 238918 239463 239885 240322 240725 240684 239916 238850 238215 238103 237883 237044 235785 234704 234200 234192 234220 233869 233192
52555B33192n94l48l88o24n89k72j38l08m23l41l38m58l35J14M80M90K90n2o42
$$ 233192 232598 232250 231862 231238 230649 230377 230239 229931 229508 229167 228829 228371 228036 228150 228630 229120 229410 229358 228716
52536B28716j232j307r38p85r53o65N09J804K232J781J141P54O99J048J633J827
$$ 228716 227484 226177 225239 224454 223501 222836 223345 225149 227381 229162 230303 231057 231756 232804 234437 236264
52520B36264J156L7o24m17L14J043J511J686J656J564J473J374J373J711K466
$$ 236264 237420 237457 236833 236416 236730 237773 239284 240970 242626 244190 245663 247037 248410 250121 252587
52505B52587L371L932L713K558P81r72k281l268m084m352l665k414j486j156r51
$$ 252587 255958 259890 263603 266161 266942 265970 263689 260421 256337 251985 248320 245906 244420 243264 242313
52490B42313o54p04j293j819j585p28O4L27J76K0J78N43O52L04m5J21O00P80O48
$$ 242313 241659 240955 239662 237843 236258 235530 235594 235921 236097 236117 236295 236838 237490 237794 237749 237870 238470 239250 239898
52471B39898P17J083J273J138J121J455J785J897K092K592L122L374L338K948
$$ 239898 240615 241698 242971 244109 245230 246685 248470 250367 252459 255051 258173 261547 264885 267833
52457B67833K024P75k88j140k275l651m387l913k815k063j974k286k644k666k109
$$ 267833 269857 270632 270344 269204 266929 263278 258891 254978 252163 250100 248126 245840 243196 240530 238421
52442B38421j357j130j386j205k00P45P46J29k54k99l95m45j7Q29J583J956J913
$$ 238421 237064 235934 234548 233343 233143 233888 234634 234763 234509 234210 233815 233370 233353 234182 235765 237721 239634
52425B39634J318J82r93j669j850j699j048J52J305J793J850K060K309K082J616
$$ 239634 240952 241134 240141 238472 236622 234923 233875 234027 235332 237125 238975 241035 243344 245426 247042
52410B47042J792K813L859M307M576N401O863Q438R652J0285J0167R077O795L230
$$ 247042 248834 251647 255506 259813 264389 269790 276653 285091 294743 305028 315195 324272 331067 334297
52396C34297j255n592q419r026p916o332n266m852m543l781k525j197k82N0j6
$$ 334297 333042 327450 319031 310005 302089 295757 290491 285639 281096 277315 274790 273593 273311 273361 273345
52381B73345r8J60P89J451J798J898K080K462K820L006L180L559M153M791N304
$$ 273345 273247 273407 274196 275647 277445 279343 281423 283885 286705 289711 292891 296450 300603 305394 310698
52366C10698N575N531N074M011K249J93j399k176k494k622k194j009J74M61J97
$$ 310698 316273 321804 326878 330889 333138 333331 331932 329756 327262 324640 322446 321437 321611 322072 322269
52351C22269M93J525K328K356K098J946J526O58K7K74J106J938K764L793M742
$$ 322269 322762 324287 326615 328971 331069 333015 334541 335199 335226 335500 336606 338544 341308 345101 349843
52336C49843N140N047M957N303O288P807R281J0063J0288J0835J2186J3915J5510
$$ 349843 354983 360030 364987 370290 376578 384385 393666 403729 414017 424852 437038 450953 466463
52323D66463J7015J8473J9493J9843J9908K0022J9948J9446J8763J8093J7207
$$ 466463 483478 501951 521444 541287 561195 581217 601165 620611 639374 657467 674674
52312F74674J6137J5568J5904J6583J6862J6750J6502J5921J4869J3929J3690
$$ 674674 690811 706379 722283 738866 755728 772478 788980 804901 819770 833699 847389
52301H47389J3771J3269J1877R976Q118O845O512O576N731L390M97j851l784n875
$$ 847389 861160 874429 886306 896282 904400 911245 917757 924333 930064 933454 933951 932100 928316 922441
52287I22441p766q802r345j0085j0487r410p104n155m337l836k817j511k91J194
$$ 922441 914675 905873 896528 886443 875956 866546 859442 854287 849950 846114 843297 841786 841495 842689
52273H42689L295N515P120Q105R143J0832J3196J5572J6917J6633J5215J3788
$$ 842689 845984 851499 858619 866724 875867 886699 899895 915467 932384 949017 964232 978020
52261I78020J2977J2609J2393J2271J2183J1969J1701J1648J1812J1914J1738
$$ 978020 990997 1003606 1015999 1028270 1040453 1052422 1064123 1075771 1087583 1099497 1111235
52250A111235J1231J0314R044P753O534M785J894j756n051p346q781r538r601
$$ 1111235 1122466 1132780 1141824 1149577 1156111 1160896 1162790 1161034 1155983 1148637 1139856 1130318 1120717
52237A120717r270r175r521r881r915r764r576r212q614q020p532o905n966m883
$$ 1120717 1111447 1102272 1092751 1082870 1072955 1063191 1053615 1044403 1035789 1027769 1020237 1013332 1007366 1002483
52223A002483l814k600j114L33J159J101O14N94J496K688L087K637K552L726N469
$$ 1002483 998669 996069 994955 995288 996447 997548 998162 998756 1000252 1002940 1006027 1008664 1011216 1014942 1020411
52208A020411O439O415O279O513O691O400N825N287M870M690M861N116N004M641
$$ 1020411 1026850 1033265 1039544 1046057 1052748 1059148 1064973 1070260 1075130 1079820 1084681 1089797 1094801 1099442
52194A099442M640N141N487N102M250L687L860M629N430N595M799L306J648L6
$$ 1099442 1104082 1109223 1114710 1119812 1124062 1127749 1131609 1136238 1141668 1147263 1152062 1155368 1157016 1157052
52180A157052j704l772o160q616j0519j1201j0757j0187j0197j0229r335p688
$$ 1157052 1155348 1151576 1145416 1136800 1126281 1115080 1104323 1094136 1083939 1073710 1064375 1056687
52168A056687o336n651m952l711k230r62J00J039J702K040K283K591K878L056
$$ 1056687 1050351 1044700 1039748 1036037 1033807 1032845 1032945 1033984 1035686 1037726 1040009 1042600 1045478 1048534
52154A048534L022K468J277j4p10r32j320j877j912j254n69k19K76J165J730J259
$$ 1048534 1051556 1054024 1055301 1055287 1054577 1053645 1052325 1050448 1048536 1047282 1046713 1046494 1046770 1047935 1049665 1050924
52138A050924K07l74k14ol34r08q61L72K501M607O052P163Q837J1573J5102J8820
$$ 1050924 1051131 1050757 1050543 1050537 1050203 1049295 1048434 1048806 1051307 1055914 1061966 1069129 1077966 1089539 1104641 1123461
52122A123461K2183K4763K6478K7731K8903K9750K9728K8942K8094K7511K6754
$$ 1123461 1145644 1170407 1196885 1224616 1253519 1283269 1312997 1341939 1370033 1397544 1424298
52111A424298K5313K3163K0567J7823J5289J3120J0908Q135N059K600J276P80
$$ 1424298 1449611 1472774 1493341 1511164 1526453 1539573 1550481 1558616 1563675 1566275 1567551 1568331
52099A568331O17N42K20p75k363l874m827n348n776o454p985j0923j4807j8131
$$ 1568331 1568948 1569490 1569710 1568935 1566572 1562698 1557871 1552523 1546747 1540293 1532308 1521385 1506578 1488447
52085A488447j9682j9536j8557j7359j6034j4349j1956q773n327k353PK140M181
$$ 1488447 1468765 1449229 1430672 1413313 1397279 1382930 1370974 1362201 1356874 1354521 1354528 1356668 1360849
52072A360849N913P430R147J1011J2511J3646J4996J6549J7328J6692J5203J3804
$$ 1360849 1366762 1374192 1383339 1394350 1406861 1420507 1435503 1452052 1469380 1486072 1501275 1515079
52060A515079J2821J2221J2024J1799J0538P886N016L414L126K878J669m48k905
$$ 1515079 1527900 1540121 1552145 1563944 1574482 1582368 1587384 1590798 1593924 1596802 1598471 1598023 1595118
52047A595118n297p480r487j1440j3454j5681j8346k1277k3517k4148k3568k3125
$$ 1595118 1589821 1582341 1572854 1561414 1547960 1532279 1513933 1492656 1469139 1444991 1421423 1398298
52035A398298k3190k2625k0665j8277j6770j5956j4781j3107j1641j0483r122
$$ 1398298 1375108 1352483 1331818 1313541 1296771 1280815 1266034 1252927 1241286 1230803 1221681
52024A221681p737p281q009q981r452r793j0598j1493j1526j0470r212q847r625
$$ 1221681 1213944 1206663 1198654 1189673 1180221 1170428 1159830 1148337 1136811 1126341 1117129 1108282 1098657
52011A098657j0816j1556j1699j1778j2227j3029j4117j5583j7173j8122j8054
$$ 1098657 1087841 1076285 1064586 1052808 1040581 1027552 1013435 997852 980679 962557 944503
52000I44503j7757j8373j9938k1363k1770k1288k0457j9425j7930j5706j2723
$$ 944503 926746 908373 888435 867072 845302 824014 803557 784132 766202 750496 737773
51989G37773r401o709n641o331p889r255j0017j0325j0410j0496j0901j1699j2453
$$ 737773 728372 721663 716022 709691 701802 692547 682530 672205 661795 651299 640398 628699 616246
51976F16246j2672j2540j2720j3304j3461j2483j0775r268q158o860n082l120
$$ 616246 603574 591034 578314 565010 551549 539066 528291 519023 510865 504005 498923 495803
51964D95803j091J277L754N447O074O568P676Q627Q176O416M466K758Q19j418
$$ 495803 494712 495989 499743 505190 511264 517832 525508 534135 542311 548727 553193 555951 556770 555352
51950E55352l308m627n852p038p414o459m587k391k4K363M416O160Q049J0096
$$ 555352 552044 547417 541565 534527 527113 520654 516067 513676 513652 516015 520431 526591 534640 544736
51936E44736J1680J2586J3420J4510J5172J4617J2988J0936Q698O048K786j058
$$ 544736 556416 569002 582422 596932 612104 626721 639709 650645 659343 665391 668177 667119
51924F67119m989p833q508p267n456l789j935j94l50l830r743j5712k0029k2249
$$ 667119 662130 654297 645789 638522 633066 629277 627342 627148 626798 622968 613225 597513 577484 555235
51910E55235k2457k1138j9313j7696j5818j2848r029n497k854p06J457L628N502
$$ 555235 532778 511640 492327 474631 458813 445965 436936 431439 428585 427879 429336 432964 438466
51897D38466O733P052O517N556M366K625P7k904n811q470j0647j1723j1412j0296
$$ 438466 445199 452251 458768 464324 468690 471315 471392 468488 462677 454207 443560 431837 420425 410129
51883D10129q973p252m854k341n11P59K131L687N063O252P406Q172Q127P645P316
$$ 410129 401156 393904 389050 386709 386198 386957 389088 392775 397838 404090 411496 419668 427795 435440 442756
51868D42756O816N456L623K467K107J324p02l349n530o860p442p338o624n505
$$ 442756 449572 455028 458651 461118 463225 464549 463847 460498 454968 448108 440666 433328 426704 421199
51854D21199m028k133j44J316K062K520L007L331L126K229O92j160k753l814m758
$$ 421199 417171 415038 414894 416210 418272 420792 423799 427130 430256 432485 433177 432017 429264 425450 420692
51839D20692o022p187p450o822o059n494m776l778k865k061q43Q56K249K710K590
$$ 420692 414670 407483 400033 393211 387152 381658 376882 373104 370239 368178 367335 368191 370440 373150 375740
51824C75740K496K360J692M38r33j953k497k725k939l243l312k744j705q12l44
$$ 375740 378236 380596 382288 382726 381793 379840 377343 374618 371679 368436 365124 362380 360675 359863 359519
51809C59519P4Q50J933L046L975M376L748J984k09j727j993j368p27o12q14q19
$$ 359519 359593 360443 362376 365422 369397 373773 377521 379505 379296 377569 375576 374208 373481 372869 372055 371236
51793C71236n94o51j221j912k384k843l454l758l313k494j871j221n0J201J532
$$ 371236 370642 369991 368770 366858 364474 361631 358177 354419 351106 348612 346741 345520 345470 346671 348203
51778C48203R80P30J338J858J273No10L3J333K323K685K967M037O185Q742J0702
$$ 348203 349183 349913 351251 353109 354382 354387 353777 353810 355143 357466 360151 363118 367155 373340 382082 392784
51762C92784J1649J1786J1290J0143Q443O309L522j12m097p510r933j1508j2179
$$ 392784 404433 416219 427509 437652 446095 452404 455926 455814 451717 444207 434274 422766 410587
51749D10587j1721j0551r584r039q225o842n559m824l959k196K4J573K145K482
$$ 410587 398866 388315 378731 369692 361467 354625 349066 344242 340283 338087 338111 339684 341829 344311
51735C44311L376M993P089R209J0705J0930R609P003L797R07q96j327n43J093
$$ 344311 347687 352680 359769 368978 379683 390613 400222 407225 411022 411929 411033 409706 409163 410256
51721D10256K852L508K098r37l984n870o661o693n687l518j135J10j67j378k926
$$ 410256 413108 416616 418714 417777 413793 407923 401262 394569 388882 385364 384229 384339 384172 382794 379868
51706C79868m445n315m927l553k128r63O66L191N633O389M987K521M09q71j706
$$ 379868 375423 370108 365181 361628 359500 358537 359203 362394 368027 374416 379403 381924 382333 381462 379756
51691C79756k391k574j696J58K001K614J617j95j708k657l660n056o161o064m867
$$ 379756 377365 374791 373095 373253 375254 377868 379485 379290 377582 374925 371265 366209 360048 353984 349117
51676C49117l535k555j477Q3J700K791L407L801L720K824J609J204K200M096N882
$$ 349117 345582 343027 341550 341633 343333 346124 349531 353332 357052 359876 361485 362689 364889 368985 374867
51661C74867O703O170M474K339M49j053k302l158l266k540j158P02K839M921O773
$$ 374867 381570 387740 392214 394553 395002 393949 391647 388489 385223 382683 381525 382227 385066 389987 396760
51646C96760Q402R300Q209M429r00n564q345r526r692r042p970p209p018o910
$$ 396760 405162 414462 422671 427100 426200 420636 412291 402765 393073 384031 376061 368852 361834 354924
51632C54924o458n704m571k782o91O79J008J319K585M258N002M454L527L035K770
$$ 354924 348466 342762 338191 335409 334718 335397 336405 337724 340309 344567 349569 354023 357550 360585 363355
51617C63355K000M84j255k478k942k995l021l022k897k901l296l720l562k939
$$ 363355 365355 365839 364584 362106 359164 356169 353148 350126 347229 344328 341032 337312 333750 330811
51603C30811k657k972l070k074j43J812L129L828M376N249O592Q157R731J1361
$$ 330811 328154 325182 322112 320038 319895 321707 324836 328664 333040 338289 344881 353038 362769 374130
51589C74130J2653J2118Q268J713m679q280q921q228p430o492m951k760k96J985
$$ 374130 386783 398901 407169 408882 404203 395923 387002 378774 371344 364852 359901 357141 356845 358830
51575C58830L847N493P440R880J2273J3753J3945J3372J3148J4250J6695J9353
$$ 358830 362677 368170 375610 385490 397763 411516 425461 438833 451981 466231 482926 502279
51563E02279K0780K0392J8836J7413J7421J9695K4049K9132L3485L6710L8991
$$ 502279 523059 543451 562287 579700 597121 616816 640865 669997 703482 740192 779183
51552G79183L9572L6742K9763J9962R395q69j0591j9259k6121l1017l4490l7055
$$ 779183 818755 855497 885260 905222 914617 913748 903157 883898 857777 826760 792270 755215
51540G55215l8763l9320l8301l5478l1336k6959k3097j9592j6015j2548r752p837
$$ 755215 716452 677132 638831 603353 572017 545058 521961 502369 486354 473806 464054 456217
51528D56217o647o082n972n636m253j797P83K489L137L261L297L072K013j45k964
$$ 456217 449570 443488 437516 431880 427627 425830 426613 429102 432239 435500 438797 441869 443882 443737 440773
51513D40773n590p339p942p499o477n594n309n454n610n630n475m873l758k801
$$ 440773 435183 427844 419902 412403 405926 400332 395023 389569 383959 378329 372854 367981 364223 361422
51499C61422k698l031k721j666r52j143j415q85M0L79N4j69J43O81R70Q56M42
$$ 361422 358724 355693 352972 351306 350354 349211 347796 346911 346951 347330 347384 347215 347358 348039 349009 349865 350307
51482C50307p4n91j239k073k701k598j935j483j569j719j585j507j748j858j430
$$ 350307 350233 349642 348403 346330 343629 341031 339096 337613 336044 334325 332740 331233 329485 327627 326197
51467C26197r13j009j614k034k002j863j898j930j656j012k59J73Q8k17k43M1
$$ 326197 325284 324275 322661 320627 318625 316762 314864 312934 311278 310266 310007 310180 310268 310051 309808 309849
51451C09849K51K64M17Q80J381J734K158K893L926N265P035R231J1714J4321J6308
$$ 309849 310100 310364 310781 311661 313042 314776 316934 319827 323753 329018 336053 345284 356998 371319 387627
51436C87627J6045J2327O166K53l527n094m844k940m58M60j249m217o381p101
$$ 387627 403672 415999 422165 422418 418891 413797 408953 406013 405555 406015 404766 400549 394168 387067
51422C87067o738n337l017q01L31O38P30K35j404l356m091l324j988o28Q56K118
$$ 387067 380329 374992 371975 371174 371505 372143 372873 373108 371704 368348 364257 360933 358945 358317 359173 361291
51406C61291K390J665P39k8r11j828k135j581o59J55P58J085J148J357K120L190
$$ 361291 363681 365346 366085 366057 365146 363318 361183 359602 358943 359098 359856 360941 362089 363446 365566 368756
51390C68756M092M921N992P093P975R205J1459J4231J6471J8405K1449K6213L1775
$$ 368756 372848 377769 383761 390854 398829 408034 419493 433724 450195 468600 490049 516262 548037
51377E48037L7044M1782M5986M9506N2551N5387N6905N4570M6679L4247K0124
$$ 548037 585081 626863 672849 722355 774906 830293 887198 941768 988447 1022694 1042818
51366A042818O709n146j5660k5246l3882m0966m5874m8644m9842m9866m8824m6876
$$ 1042818 1049527 1044381 1028721 1003475 969593 928627 882753 834109 784267 734401 685577 638701
51354F38701m4054l9942l4322k8201k3329k0379j8309j5789j2671r810p971p282
$$ 638701 594647 554705 520383 492182 468853 448474 430165 414376 401705 391895 383924 376642
51342C76642p291p263o711n739m710l780l064k879l203l250k416j443j542k471
$$ 376642 369351 362088 355377 349638 344928 341148 338084 335205 332002 328752 326336 324893 323351 320880
51328C20880k691j595l84k41p10o69J0N81O67N55N54P51J202J909K621K968K734
$$ 320880 318189 316594 316210 315969 315259 314590 314600 315181 315848 316403 316957 317708 318910 320819 323440 326408 329142
51311C29142J920P78j77n41m77m71o53q42j151j874k680k683j669n67l41r00j547
$$ 329142 331062 331840 331663 331122 330645 330174 329521 328679 327528 325654 322974 320291 318622 318055 317714 316814 315267
51294C15267j913k016j812j331r28r44j216j310j036m29N92K107L746M794M852
$$ 315267 313354 311338 309526 308195 307267 306323 305107 303797 302761 302332 302924 305031 308777 313571 318423
51279C18423M250L739L772M163M414M256L718K826J604M14j58o4L9k98o22k63
$$ 318423 322673 326412 330184 334347 338761 343017 346735 349561 351165 351579 351421 351357 351396 351098 350476 350213
51263C50213P49J888K864L502L313J975Q6j296j778j696j338q68p74j479k616
$$ 350213 350962 352850 355714 359216 362529 364504 364590 363294 361516 359820 358482 357614 356840 355361 352745
51248C52745l422l845m337m747m470l652l180l251l099k390j842j916j954j299
$$ 352745 349323 345478 341141 336394 331924 328272 325092 321841 318742 316352 314510 312594 310640 309341
51234C09341l61R8J74M19Q02Q07L74J0N0L15M96N58P22J127J607J839J824J974
$$ 309341 308980 309078 309252 309671 310473 311280 311654 311664 311714 312029 312525 313083 313805 314932 316539 318378 320202 322176
51216C22176K444K739K412J808J513J374Q27n0o59q80j036q95J70J876L004K937
$$ 322176 324620 327359 329771 331579 333092 334466 335293 335243 334584 333704 332668 331773 331943 333819 336823 339760
51200C39760K352J966J601R20K72J25L25L80Q3n40j300j722j421q20p53j178j134
$$ 339760 342112 344078 345679 346599 346871 346996 347321 347701 347784 347244 345944 344222 342801 341981 341228 340050 338916
51183C38916k47O81J027J216J725K119J858J272R45P61L46j32l13m08q26j463
$$ 338916 338669 339350 340377 341593 343318 345437 347295 348567 349512 350273 350619 350487 350174 349766 348940 347477
51167C47477j987k407k726k454j129Q80K698L868M520M861M945M775M319L578
$$ 347477 345490 343083 340357 337903 336774 337654 340352 344220 348740 353601 358546 363321 367640 371218
51153C71218K746J966Q59j121l683n628o074n245l860k431j424j304j944k565
$$ 371218 373964 375930 376789 375668 371985 366357 360283 355038 351178 348747 347323 346019 344075 341510
51139C41510k693k624k634k449j900j354r89m20N09J279J525J560J556J158M48
$$ 341510 338817 336193 333559 331110 329210 327856 326867 326447 326956 328235 329760 331320 332876 334034 334482
51124C34482L97J481K747L119K901K989L369L476L379L517L668L294K529J905
$$ 334482 334879 336360 339107 342226 345127 348116 351485 354961 358340 361857 365525 368819 371348 373253
51110C73253J423Q46M83P27J161J148R27J099J339Q04l57j041p52l9N92J216J753
$$ 373253 374676 375522 376005 376732 377893 379041 379968 381067 382406 383210 382853 381812 381060 381021 381613 382829 384582
51093C84582J763J165M47l2l02l10M5L65jr64j613j360n90n8j33p34j486j815
$$ 384582 386345 387510 387957 387925 387623 387313 387358 387723 387722 386758 385145 383785 383195 383137 383004 382270 380784 378969
51075C78969j372m40M09J041J667K233K512K707L280M134M648M674M909O031P964
$$ 378969 377597 377157 377566 378607 380274 382507 385019 387726 391006 395140 399788 404462 409371 415402 423366
51060D23366J0191J2483J5026J7984K0847K2157K0266J5060Q803M707M468P477
$$ 423366 433557 446040 461066 479050 499897 522054 542320 557380 566183 570890 575358 582835
51048E82835J2035J6482J9178J8663J4799R502N384L329J678j839p522j3261j6577
$$ 582835 594870 611352 630530 649193 663992 673494 678878 682207 683885 682046 674524 661263 644686
51035F44686j6564j3864r647n542l852o188j1493j6478j8661j8210j6571j4360
$$ 644686 628122 614258 604611 599069 595217 589029 577536 561058 542397 524187 507616 493256
51023D93256j1448q104n023k552p21M08J053J841K934L661L665L764M722N954
$$ 493256 481808 473704 468681 466129 465408 465816 466869 468710 471644 475305 478970 482734 487456 493410
51009D93410O499O708P709R462J0761J0972J0668J0483J0424J0392J0386J0049
$$ 493410 499909 506617 514326 523788 534549 545521 556189 566672 577096 587488 597874 607923
50997F07923Q903P158N570M460L535K649J968J417P66J62j83o53j681k686k482
$$ 607923 616826 623984 629554 634014 637549 640198 642166 643583 644349 644511 644328 643675 641994 639308 636826
50982F36826p77J649M241P137J0253J2912J4640J5467J5308J4010J2269J1572
$$ 636826 636049 637698 641939 649076 659329 672241 686881 702348 717656 731666 743935 755507
50970G55507J2776J5501J9114K3523K8625L3779L8422M2669M6840N0868N4455
$$ 755507 768283 783784 802898 826421 855046 888825 927247 969916 1016756 1067624 1122079
50959A122079N7474N9967O2096O4094O5834O6505O5241O2124N7958N3147M7513
$$ 1122079 1179553 1239520 1301616 1365710 1431544 1498049 1563290 1625414 1683372 1736519 1784032
50948A784032M1221L5031K9447K4389J9896J6408J4219J3259J3591J5265J7442
$$ 1784032 1825253 1860284 1889731 1914120 1934016 1950424 1964643 1977902 1991493 2006758 2024200
50937B024200J8494J7389J4456J0575O355K297j123m050p294j1369j5979k0772
$$ 2024200 2042694 2060083 2074539 2085114 2091469 2093766 2092643 2088593 2081299 2069930 2053951 2033179
50925B033179k5990l1970l8517m5188n1686n7642o2503o5963o8196o9322o9126
$$ 2033179 2007189 1975219 1936702 1891514 1839828 1782186 1719683 1653720 1585524 1516202 1447076
50914A447076o7435o4356n9983n4474m8525m3101l8419l3869k9280k5484k3185
$$ 1447076 1379641 1315285 1255302 1200828 1152303 1109202 1070783 1036914 1007634 982150 958965
50903I58965k1889k0584j8950j7344j5967j4720j3635j2908j2480j1912j0759
$$ 958965 937076 916492 897542 880198 864231 849511 835876 822968 810488 798576 787817
50892G87817q939o855n110l923k941j901j160j111j293q45K18J009J137J211J805
$$ 787817 778878 772023 766913 762990 760049 758148 756988 755877 754584 753739 753957 754966 756103 757314 759119
50877G59119K739L663M632N675O444O771P061P772Q912J0304J1796J3050J3719
$$ 759119 761858 765521 770153 775828 782272 789043 796104 803876 812788 823092 834888 847938 861657
50864H61657J4124J5135J7114J9599K2249K5288K8692L1785L4253L6857M0518
$$ 861657 875781 890916 908030 927629 949878 975166 1003858 1035643 1069896 1106753 1147271
50853A147271M5246N0583N6575O3583P1501P9853Q8364R6977J05546J13863J21770
$$ 1147271 1192517 1243100 1299675 1363258 1434759 1514612 1602976 1699953 1805499 1919362 2041132
50842B041132J28954J35065J40241J44933J48779J50236J47776J41012J30278
$$ 2041132 2170086 2305151 2445392 2590325 2739104 2889340 3037116 3178128 3308406
50833C308406J15890R8557P9882O1539M4171K7797J3010R50p757j3276j5729j4779
$$ 3308406 3424296 3522853 3602735 3664274 3708445 3736242 3749252 3750202 3742445 3729169 3713440 3698661
50821C698661j0210k527P229J7978K8657L7897M3672M3681L6545K2913M995j5139
$$ 3698661 3688451 3685924 3693153 3711131 3739788 3777685 3821357 3865038 3901583 3924496 3929491 3914352
50809C914352l6542n8737q0806j01659j20739j37847j52431j63446j69951j71592
$$ 3914352 3877810 3819073 3738267 3636608 3515869 3378022 3225591 3062145 2892194 2720602
50799B720602j68638j61746j51620j38954j24788j10650r7763q6096p4779o3460
$$ 2720602 2551964 2390218 2238598 2099644 1974856 1864206 1766443 1680347 1605568 1542108
50789A542108n2711m3013l4158k5902j8489j2213p125l553k055k395l251l561
$$ 1542108 1489397 1446384 1412226 1386324 1367835 1355622 1348497 1344944 1342889 1340494 1337243 1333682
50777A333682l590m054m923n754o598p760r077j0282j1640j3512j5534j7050j8108
$$ 1333682 1330092 1326038 1321115 1315361 1308763 1301003 1291926 1281644 1270004 1256492 1240958 1223908 1205800
50764A205800j9225k0303k0654k0139j9499j9380j9549j9308j8335j6933j5614
$$ 1205800 1186575 1166272 1145618 1125479 1105980 1086600 1067051 1047743 1029408 1012475 996861
50753I96861j4504j3116j0926q186n733l870j951O10L501O252R198J2963J7340
$$ 996861 982357 969241 958315 950129 944396 940526 938575 939185 942686 948938 958136 971099 988439
50740I88439K1503K5173K8810L2712L6705M0699M4872M9180N3319N7298O1442
$$ 988439 1009942 1035115 1063925 1096637 1133342 1174041 1218913 1268093 1321412 1378710 1440152
50729A440152O5587O8833P0520P1086P1475P1931P1802P0616O8845O7330O6054
$$ 1440152 1505739 1574572 1645092 1716178 1787653 1859584 1931386 2002002 2070847 2138177 2204231
50718B204231O3849N9407N2257M2649L0894J7353K881j1149k3322l2344l7047
$$ 2204231 2268080 2327487 2379744 2422393 2453287 2470640 2473521 2462372 2439050 2406706 2369659
50707B369659l6896l2608k5758j7582q572Q31R739J7251K2907K6629K8450K8157
$$ 2369659 2332763 2300155 2274397 2256815 2248243 2249074 2258813 2276064 2298971 2325600 2354050 2382207
50695B382207K4755J6668L374j3314l0550m6950o2689p7197q8345r4569r6417
$$ 2382207 2406962 2423630 2427004 2413690 2383140 2336190 2273501 2196304 2107959 2013390 1916973
50684A916973r5166r1084q4172p5605o7027n8932n0754m2181l3442k4635j5794
$$ 1916973 1821807 1730723 1646551 1570946 1503919 1444987 1394233 1352052 1318610 1293975 1278181
50673A278181p326L95P598J4534K0693K5373K8677L1111L2494L2232L0446K7891
$$ 1278181 1270855 1271250 1278848 1293382 1314075 1339448 1368125 1399236 1431730 1463962 1494408 1522299
50661A522299K4917K1390J7651J4681J3090J2538J2269J1853J1384J1299J1981
$$ 1522299 1547216 1568606 1586257 1600938 1614028 1626566 1638835 1650688 1662072 1673371 1685352
50650A685352J3203J4271J4956J5926J7860K0592K3576K6767L0425L4474L8625
$$ 1685352 1698555 1712826 1727782 1743708 1761568 1782160 1805736 1832503 1862928 1897402 1936027
50639A936027M2801M6836N0082N1968N2655N2593N1751M9766M6574M2459L7847
$$ 1936027 1978828 2025664 2075746 2127714 2180369 2232962 2284713 2334479 2381053 2423512 2461359
50628B461359L3446L0055K7975K7220K8246L0783L1204K3131L130k4501n0297
$$ 2461359 2494805 2524860 2552835 2580055 2608301 2639084 2670288 2693419 2696549 2672048 2621751
50617B621751o6852p2557o9534o0619m8678l6406k5185j4861n161L310R797J4020
$$ 2621751 2554899 2482342 2412808 2352189 2303511 2267105 2241920 2227059 2221898 2225208 2235005 2249025
50605B249025J5750J4522J0222L267n991j7340l0115m3143n5406o6030p3865p8059
$$ 2249025 2264775 2279297 2289519 2292786 2286795 2269455 2239340 2196197 2140791 2074761 2000896 1922837
50593A922837p9121p8400p6400p2617o7160o1371n6463n2470m8904m5536m2224
$$ 1922837 1843716 1765316 1688916 1616299 1549139 1487768 1431305 1378835 1329931 1284395 1242171
50582A242171l8813l5549l2790l0075k6441k1990j8075j5538j3673j1471q856
$$ 1242171 1203358 1167809 1135019 1104944 1078503 1056513 1038438 1022900 1009227 997756 988900
50571I88900o148l219p8K539M093N237P027R496J1722J3108J3878J4567J5632
$$ 988900 982752 979533 979455 981994 986087 991324 998351 1007847 1019569 1032677 1046555 1061122 1076754
50558A076754J7482K0306K3744K7084K9931L2469L4975L7081L7792L6483L3914
$$ 1076754 1094236 1114542 1138286 1165370 1195301 1227770 1262745 1299826 1337618 1374101 1408015
50547A408015L1703L0627K9976K8888K7618K6862K6706K7143K8927L2666L7543
$$ 1408015 1439718 1470345 1500321 1529209 1556827 1583689 1610395 1637538 1666465 1699131 1736674
50536A736674M2328M7296N3594O1020O8120P4515Q1260Q8625R5460J01375J07698
$$ 1736674 1779002 1826298 1879892 1940912 2009032 2083547 2164807 2253432 2348892 2450267 2557965
50525B557965J15274J22949J29383J34759J39365J41939J41117J37470J32349
$$ 2557965 2673239 2796188 2925571 3060330 3199695 3341634 3482751 3620221 3752570
50516C752570J25451J15170J00947Q3631O3886M1788J8018o076k9724n2889p5016
$$ 3752570 3878021 3993191 4094138 4177769 4241655 4283443 4301461 4295385 4265661 4212772 4137756
50505D137756r4762j11195j24226j33499j37765j35896j28051j15444r9343q0517
$$ 4137756 4042994 3931799 3807573 3674074 3536309 3400413 3272362 3156918 3057575 2977058
50495B977058n9435l6762j3724Q168K7919M5222N9556O9455P2949O8442N4994
$$ 2977058 2917623 2880861 2867137 2875305 2903224 2948446 3008002 3077457 3150406 3218848 3273842
50484C273842L2668L396k8986o0585q9256j14028j33423j45623j50309j49195
$$ 3273842 3306510 3309906 3280920 3220335 3131079 3017051 2883628 2738005 2587696 2438501
50474B438501j44480j37552j29257j20347j11089j01152r0455p9743o9858o0903
$$ 2438501 2294021 2156469 2027212 1906865 1795776 1694624 1604169 1524426 1454568 1393665
50464A393665n2524m4760l8044l2608k8288k4938k2654k1422k0703j9529j7152
$$ 1393665 1341141 1296381 1258337 1225729 1197441 1172503 1149849 1128427 1107724 1088195 1071043
50453A071043j3625r695o096l075n55J499L132M568O127P979J0137J2620J5456
$$ 1071043 1057418 1047723 1041627 1038552 1037997 1039496 1042628 1047196 1053323 1061302 1071439 1084059 1099515
50440A099515J8599K1766K4115K4290K1384J6139J0649O565L981K375J886K954
$$ 1099515 1118114 1139880 1163995 1188285 1209669 1225808 1236457 1243022 1247003 1249378 1251264 1254218
50428A254218N146P370R129J0803J2621J4161J5110J5808J6687J7669J8543J9642
$$ 1254218 1259364 1266734 1275863 1286666 1299287 1313448 1328558 1344366 1361053 1378722 1397265 1416907
50416A416907K1702K5175K9879L5222M0627M5858N1076N6547O2232O7687P2294
$$ 1416907 1438609 1463784 1493663 1528885 1569512 1615370 1666446 1722993 1785225 1852912 1925206
50405A925206P5449P6588P5360P1985O7233O1999N6785N1434M5216L7239K7060
$$ 1925206 2000655 2077243 2152603 2224588 2291821 2353820 2410605 2462039 2507255 2544494 2571554
50394B571554J4951J550j2688k7500m2459n6862o9943q0838q8414r1546q9912
$$ 2571554 2586505 2588055 2575367 2547867 2505408 2448546 2378603 2297765 2209351 2117805 2027893
50383B027893q4390p6460o7220n7059m6055l4444k2571j0634J281J2786K2963
$$ 2027893 1943503 1867043 1799823 1742764 1696709 1662265 1639694 1629060 1630341 1643127 1666090
50372A666090L0666L5021L5519L1814K3834J2256j460j5820k9884m3011n4274
$$ 1666090 1696756 1731777 1767296 1799110 1822944 1835200 1833740 1817920 1788036 1745025 1690751
50361A690751o2641o7647o9579o8971o6312o2246n7633n3055m8597m4280m0474
$$ 1690751 1628110 1560463 1490884 1421913 1355601 1293355 1235722 1182667 1134070 1089790 1049316
50350A049316l7419l4634l1243k6956k2216j7418j2437p163j961K738O732R446
$$ 1049316 1011897 977263 946020 919064 896848 879430 866993 859830 857869 860607 867339 876785
50338H76785R525N990k08o522j0838j2701j2583j0928q294n592l489j921o57J74
$$ 876785 886310 892300 892092 885570 874732 862031 849448 838520 830226 824634 821145 819224 818567 818741
50324H18741O03J313K855M689N812O135O452P123P589P299O482N677N041M364
$$ 818741 819344 820657 823512 828201 834013 840148 846600 853723 861312 868611 875093 880770 885811 890175
50310H90175L468K395J459J204K017L671N408O576P046P075O958O896P099P888
$$ 890175 893643 896038 897497 898701 900718 904389 909797 916373 923419 930494 937452 944348 951447 959335
50296I59335R550J1906J4200J5936J7650K0236K3626K6907K9818L3216L8104M5399
$$ 959335 968885 980791 994991 1010927 1028577 1048813 1072439 1099346 1129164 1162380 1200484 1245883
50284A245883N6251O9803P9388P4153M8331Q779k9336n4491o5029o5132n8875
$$ 1245883 1302134 1371937 1451325 1525478 1573809 1582588 1553252 1498761 1433732 1368600 1309725
50273A309725m9272l9401l1322k4843j9090j4456j1779j0680j0111r726r524q903
$$ 1309725 1260453 1221052 1189730 1164887 1145797 1131341 1119562 1108882 1098771 1089045 1079521 1070618
50261A070618p392n606m299l040r04J975M766P426J0717J4993J9803K4484K8439
$$ 1070618 1063226 1057620 1053321 1050281 1049377 1051352 1056118 1063544 1074261 1089254 1109057 1133541 1161980
50248A161980L1197L2865L4070L4798L4014L1239K7778K5377K4260K3597K3188
$$ 1161980 1193177 1226042 1260112 1294910 1328924 1360163 1387941 1413318 1437578 1461175 1484363
50237A484363K3284K3132K1167J6620R762Q14j0035k1460l1305l8429m3180m5859
$$ 1484363 1507647 1530779 1551946 1568566 1578328 1579142 1569107 1547647 1516342 1477913 1434733 1388874
50225A388874m5969m3452l9496l5224l0527k5082k0016j7623j9367k4528l0736
$$ 1388874 1342905 1299453 1259957 1224733 1194206 1169124 1149108 1131485 1112118 1087590 1056854
50214A056854l5478l7408l6715l4483l1628k8367k4510k0138j5920j2774j1082
$$ 1056854 1021376 983968 947253 912770 881142 852775 828265 808127 792207 779433 768351
50203G68351j0261r349q073o923o086n001l351j872j512k171k973l539m157m874
$$ 768351 758090 748741 740668 733745 727659 722658 719307 717435 715923 713752 710779 707240 703083 698209
50189F98209n250n083m733m512m368m269m449n023n652n841n399m558l769l403
$$ 698209 692959 687876 683143 678631 674263 669994 665545 660522 654870 649029 643630 639072 635303 631900
50175F31900l476l705l796l562k852j719p29n31r45r96k02Q42J501K040K943L944
$$ 631900 628424 624719 620923 617361 614509 612790 612061 611530 610585 609589 609387 610229 611730 613770 616713 620657
50159F20657M562N046N849O566O470N959O336Q068J0190J1649J2419J2997J3452
$$ 620657 625219 630265 636114 642680 649150 655109 661445 669513 679703 691352 703771 716768 730220
50146G30220J3484J2977J2118J1244J0793J1235J2892J5750J9498K3675K8111
$$ 730220 743704 756681 768799 780043 790836 802071 814963 830713 850211 873886 901997
50135I01997L3242L9686M7262N4789O0994O5166O6779O5341O1252N6240N2095
$$ 901997 935239 974925 1022187 1076976 1137970 1203136 1269915 1335256 1396508 1452748 1504843
50124A504843M9377M7900M7798M9069N0466M9870M5728L7452K4906Q687r183k6011
$$ 1504843 1554220 1602120 1649918 1698987 1749453 1799323 1845051 1882503 1907409 1916096 1906913 1880902
50112A880902m0169n1414n9772o5150o8018o9188o8675o5776o0657n4863m9748
$$ 1880902 1840733 1789319 1729547 1664397 1596379 1527191 1458516 1392740 1332083 1277220 1227472
50101A227472m5213m0515l5569l0898k6966k4188k3025k3368k4052k3543k1168
$$ 1227472 1182259 1141744 1106175 1075277 1048311 1024123 1001098 977730 953678 930135 908967
50090I08967j7442j3381r733o653l835r76J851M347O356P842Q683Q849Q679Q558
$$ 908967 891525 878144 868411 861758 857923 856947 858798 863145 869501 877343 886026 894875 903554 912112
50076I12112Q372P689O451N114M050L195K225Q45j037l068m564n274n703o310
$$ 912112 920484 928173 934624 939738 943788 946983 949208 950053 949016 945948 941384 936110 930407 924097
50062I24097o695o250n295m850n337o238o989p499p728p395o366m803k991j357
$$ 924097 917402 911152 905857 901007 895670 889432 882443 874944 867216 859821 853455 848652 845661 844304
50048H44304m40k39K52K070M889P313Q565R200J0038J1178J2235J2869J2869J2267
$$ 844304 843864 843625 843877 845947 850836 858149 866714 875914 885952 897130 909365 922234 935103 947370
50034I47370J1544J1283J1527J1804J1808J1515J0817R627Q293P351O869O536
$$ 947370 958914 970197 981724 993528 1005336 1016851 1027668 1037295 1045588 1052939 1059808 1066344
50022A066344O183N734N004M214M403O440R932J3939J8314K3151K7333K9075K8018
$$ 1066344 1072527 1078261 1083265 1087479 1091882 1098322 1108254 1122193 1140507 1163658 1190991 1220066 1248084
50009A248084K5493K2595J9299J5658J2396R958Q225P610R043J2246J5176J5892
$$ 1248084 1273577 1296172 1315471 1331129 1343525 1353483 1361708 1369318 1378361 1390607 1405783 1421675
49997A421675J3883R198J595q473j9256k9112l7650m4635m8966m9842m8116m5301
$$ 1421675 1435558 1444756 1446351 1437878 1418622 1389510 1351860 1307225 1258259 1208417 1160301 1115000
49985A115000m1932l8006l4296l1833l0454k9155k7658k6481k5621k4336k2388
$$ 1115000 1073068 1035062 1000766 968933 938479 909324 881666 855185 829564 805228 782840
49974G82840k0519j9382j8710j7759j6070j3691j1066q875p615p180o975o480
$$ 782840 762321 742939 724229 706470 690400 676709 665643 656768 649153 641973 634998 628518
49962F28518n669n002m946n302n182m038k553j807j697j089L87J840K843M357
$$ 628518 622849 617847 612901 607599 602417 598379 595826 594019 592322 591233 591620 593460 596303 600660
49948F00660P194J0502J2843J3981J4477J4129J2158Q806N537L473K472J913J564
$$ 600660 607854 618356 631199 645180 659657 673786 685944 694750 700287 703760 706232 708145 709709
49935G09709J383R54n11l593p976j2323j5171j6277j6722j7342j7518j6079j3085
$$ 709709 711092 712046 711535 707942 699966 687643 672472 656195 639473 622131 604613 588534 575449
49922E75449j0053q345p833p176n242k279K68J300J280J510K309K731K214J489
$$ 575449 565396 557051 549218 542042 536800 534521 534789 536089 537369 538879 541188 543919 546133 547622
49908E47622J382J715K059K786M350O174P241P447P478P769Q467R998J2572J5197
$$ 547622 549004 550719 552778 555564 559914 566088 573329 580776 588254 596023 604490 614488 627060 642257
49894F42257J6229J5002J2178Q633M909J694k45r53j356k182l404m981p302j0364
$$ 642257 658486 673488 685666 694299 699208 700902 700657 699704 698348 696166 692762 687781 680479 670115
49880F70115j3097j4236j3733j2847j2778j3482j3829j2857j0705q373o673n615
$$ 670115 657018 642782 629049 616202 603424 589942 576113 563256 552551 544178 537505 531890
49868E31890m766l828k723j397Q1J418K291K656K757K937L510M535N741O806P768
$$ 531890 527124 523296 520573 519176 519257 520675 522966 525622 528379 531316 534826 539361 545102 551908 559676
49853E59676Q782R673J0221J0783J1938J3351J3860J2933J1256R470P264M409
$$ 559676 568458 578131 588352 599135 611073 624424 638284 651217 662473 671943 679207 683616
$$ [...]
##END NTUPLES=NMR SPECTRUM
##END=
