##TITLE=AC1503_INDRS13310_8125488_1tnHXh314G
##JCAMPDX= 6.0         $$ Bruker NMR JCAMP-DX V2.0
##DATA TYPE= NMR SPECTRUM
##DATA CLASS= NTUPLES
##ORIGIN= BRUKER
##OWNER= Administrator
$$ 1.72 TOPSPIN		Version 2.1
$$ 2013-08-16 17:58:58.064 -0700  Administrator@X
$$ Compression mode = diff/dup
##.OBSERVE FREQUENCY= 400.02188249412
##.OBSERVE NUCLEUS= ^1H
##.ACQUISITION MODE= SIMULTANEOUS (DQD)
##.ACQUISITION SCHEME= undefined
##.AVERAGES= 8
##.DIGITISER RES= 22
##SPECTROMETER/DATA SYSTEM= spect
##.PULSE SEQUENCE= zg30
##.SOLVENT NAME= COFFEE_meoh
##.SHIFT REFERENCE= INTERNAL, COFFEE_meoh, 1, 14.98509
##AUDIT TRAIL= $$ (NUMBER, WHEN, WHO, WHERE, PROCESS, VERSION, WHAT)
$$ ##TITLE= Audit trail, TOPSPIN		Version 2.1
$$ ##JCAMPDX= 5.01
$$ ##ORIGIN= Bruker BioSpin GmbH
$$ ##OWNER= Administrator
$$ $$ E:\/data/COFFEE/nmr/AC1503_INDRS13310_8125488_1tnHXh314G/20/pdata/1/auditp.txt
$$ ##AUDIT TRAIL=  $$ (NUMBER, WHEN, WHO, WHERE, PROCESS, VERSION, WHAT)
(   1,<2013-08-16 17:58:51.396 -0700>,<Administrator>,<X>,<go>,<TOPSPIN 2.1>,
      <created by zg
	started at 2013-08-16 17:57:45.247 -0700,
	POWCHK enabled, PULCHK disabled,
       configuration hash MD5:
       C8 4E 4E 5D D3 5C D8 9E 9F 52 82 E0 59 8A DE 15
       data hash MD5: 64K
       50 C3 D1 30 81 90 11 81 4A 78 3B 74 CF F0 57 6D>)
(   2,<2013-08-16 17:58:54.412 -0700>,<Administrator>,<X>,<proc1d>,<TOPSPIN 2.1>,
      <Start of raw data processing
       efp LB = 0 FT_mod = 6 PKNL = 1 PHC0 = 0 PHC1 = 0 SI = 32K 
       data hash MD5: 32K
       2E 6E A6 6C EE 02 66 C9 C1 A3 C5 7F 0B 85 E9 1A>)
(   3,<2013-08-16 17:58:54.799 -0700>,<Administrator>,<X>,<proc1d>,<TOPSPIN 2.1>,
      <pk PHC0 = 98.74512 PHC1 = 0 
       data hash MD5: 32K
       9A 3A 68 D3 9F E3 F3 D6 18 39 F5 DF 2D BE 9C 10>)
(   4,<2013-08-16 17:58:54.917 -0700>,<Administrator>,<X>,<proc1d>,<TOPSPIN 2.1>,
      <abs ABSG = 1 
       data hash MD5: 32K
       02 A8 19 2E BC F3 50 FB 48 D6 BB 93 7D 78 22 80>)
(   5,<2013-08-16 17:58:54.985 -0700>,<Administrator>,<X>,<proc1d>,<TOPSPIN 2.1>,
      <abs ABSG = 2 
       data hash MD5: 32K
       38 4B 0B 67 D5 E3 14 F0 B5 A8 6F 9D 8B 55 69 56>)
(   6,<2013-08-16 17:58:55.035 -0700>,<Administrator>,<X>,<proc1d>,<TOPSPIN 2.1>,
      <abs ABSG = 3 
       data hash MD5: 32K
       C7 D9 65 82 7E 8F 2B F5 CA 13 8A F0 7F 17 66 65>)
(   7,<2013-08-16 17:58:55.086 -0700>,<Administrator>,<X>,<proc1d>,<TOPSPIN 2.1>,
      <abs ABSG = 4 
       data hash MD5: 32K
       D0 77 9F 05 BA CB 30 08 52 6C C3 D5 9A 0E FC 65>)
(   8,<2013-08-16 17:58:55.136 -0700>,<Administrator>,<X>,<proc1d>,<TOPSPIN 2.1>,
      <abs ABSG = 5 
       data hash MD5: 32K
       C0 94 27 5D 6C FE 43 59 0E 42 30 70 ED 03 FF ED>)
$$ ##END=
$$ 
$$ $$ hash MD5
$$ $$ 77 C9 48 A0 03 81 F9 C5 A1 3E 0E 2C 79 6E 43 01
##$RELAX= 
##$RELAX= 
##$RELAX= 
##$RELAX= 
##$RELAX= 
##$RELAX= 
##$RELAX= 
$$ Bruker specific parameters
$$ --------------------------
##$DU= <E:\>
##$EXPNO= 20
##$NAME= <AC1503_INDRS13310_8125488_1tnHXh314G>
$$ [...]
150 150 150 150 150 150 150 150
##$TP07= 0
##$TPNAME0= <>
##$TPNAME1= <>
##$TPNAME2= <>
##$TPNAME3= <>
##$TPNAME4= <>
##$TPNAME5= <>
##$TPNAME6= <>
##$TPNAME7= <>
##$TPOAL= (0..7)
0.5 0.5 0.5 0.5 0.5 0.5 0.5 0.5
##$TPOFFS= (0..7)
0 0 0 0 0 0 0 0
##$TUNHIN= 0
##$TUNHOUT= 0
##$TUNXOUT= 0
##$USERA1= <user>
##$USERA2= <user>
##$USERA3= <user>
##$USERA4= <user>
##$USERA5= <user>
##$V9= 5
##$VALIST= <valist>
##$VCLIST= <CCCCCCCCCCCCCCC>
##$VD= 0
##$VDLIST= <DDDDDDDDDDDDDDD>
##$VPLIST= <PPPPPPPPPPPPPPP>
##$VTLIST= <TTTTTTTTTTTTTTT>
##$WBST= 2048
##$WBSW= 25
##$XGAIN= (0..3)
0 0 0 0
##$XL= 0
##$YL= 0
##$YMAX_a= 656702
##$YMIN_a= -560699
##$ZGOPTNS= <>
##$ZL1= 120
##$ZL2= 120
##$ZL3= 120
##$ZL4= 120
##$ABSF1= 14.98509
##$ABSF2= -5.573092
##$ABSG= 5
##$ABSL= 3
##$ALPHA= 0
##$AQORDER= 0
##$ASSFAC= 0
##$ASSFACI= 0
##$ASSFACX= 0
##$ASSWID= 0
##$AUNMP= <proc_prof1d_extract_pilot.lims>
##$AXLEFT= 0
##$AXNAME= <>
##$AXNUC= <1H>
##$AXRIGHT= 0
##$AXTYPE= 0
##$AXUNIT= <>
##$AZFE= 0.1
##$AZFW= 0.1
##$BCFW= 0
##$BC_mod= 0
##$BYTORDP= 0
##$COROFFS= 0
##$CY= 15
##$DATMOD= 1
##$DC= 0
##$DFILT= <>
##$DTYPP= 0
##$F1P= 0
##$F2P= 0
##$FCOR= 0.5
##$FTSIZE= 32768
##$FT_mod= 6
##$GAMMA= 0
##$GB= 0
##$INTBC= 1
##$INTSCL= 1
##$ISEN= 128
##$LB= 0
##$LEV0= 0
##$LPBIN= 0
##$MAXI= 10000
##$MC2= 0
##$MEAN= 0
##$ME_mod= 0
##$MI= 0
##$NCOEF= 0
##$NC_proc= -8
##$NLEV= 6
##$NOISF1= 0
##$NOISF2= 0
##$NSP= 0
##$NTH_PI= 0
##$NZP= 0
##$OFFSET= 14.98509
##$PC= 1
##$PHC0= 98.74512
##$PHC1= 0
##$PH_mod= 1
##$PKNL= yes
##$PPARMOD= 0
##$PPDIAG= 0
##$PPIPTYP= 0
##$PPMPNUM= 2147483647
##$PPRESOL= 1
##$PSCAL= 4
##$PSIGN= 0
##$PYNMP= <proc.py>
##$REVERSE= no
##$SF= 400.02
##$SI= 32768
##$SIGF1= 0
##$SIGF2= 0
##$SINO= 400
##$SIOLD= 32768
##$SPECTYP= <>
##$SREGLST= <1H.CDCl3>
##$SSB= 0
##$STSI= 32768
##$STSR= 0
##$SW_p= 8223.68421052631
##$SYMM= 0
##$S_DEV= 0
##$TDeff= 65536
##$TDoff= 0
##$TI= <>
##$TILT= no
##$TM1= 0
##$TM2= 0
##$TOPLEV= 0
##$USERP1= <user>
##$USERP2= <user>
##$USERP3= <user>
##$USERP4= <user>
##$USERP5= <user>
##$WDW= 1
##$XDIM= 32768
##$YMAX_p= 456496422
##$YMIN_p= -660777
##$CURPLOT= <Network HP LaserJet P1505>
##$CURPRIN= <$Network HP LaserJet P1505>
##$DFORMAT= <normdp>
##$LAYOUT= <+/1D_H.xwp>
##$LFORMAT= <normlp>
##$PFORMAT= <normpl>
##$SURQMSG= 1
$$ End of Bruker specific parameters
$$ ---------------------------------
##NTUPLES= NMR SPECTRUM
##VAR_NAME=  FREQUENCY,     SPECTRUM/REAL,   SPECTRUM/IMAG
##SYMBOL=    X,             R,               I
##VAR_TYPE=  INDEPENDENT,   DEPENDENT,       DEPENDENT
##VAR_FORM=  AFFN,          ASDF,            ASDF
##VAR_DIM=   32768,         32768,           32768
##UNITS=     HZ,            ARBITRARY UNITS, ARBITRARY UNITS
##FACTOR=    0.250966925370066, 1,           1
##FIRST=     8223.43324360094, 185132,       -185839
##LAST=      0,             128832,          -30220
##MIN=       0,             -660777,         0
##MAX=       8223.43324360094, 456496422,    0
$$ Real data points
##PAGE= N=1
##DATA TABLE= (X++(R..R)), XYDATA
$$ [...]
19558b31503P7742l3833j2778i1932B84566a35491p1241h183k52626a23342D4824
19546C8380M7621a83551G6670J55933i6560k90361p896k54171G2030L3476Q8123
19535A93629b46757O0745M4168j42704O4942M6414L7197B65614H8440d7944F6046
19523A89053a41591J2854H5016J04982m823C0705J75098f3601j69366A54423L0991
19512A85414k2115a39711m4997A02276a42487N6004k4981k14676i3892j95180
19502b89072A45645c05736H1c46479E8415f8882l8755l35294a85092i1252a9824
19490b83343A05613E2767a18253A35331a69305Q2686I2551c6113C29696A17757
19479b27110B03877f4419k80163B6310J93873e2972q4082j78176i8633A04610
$$ y = [-231503, -153761, -187594, -200372, -91932, 284566, -135491, -206732, -8183, -260809, -123342, 44824, 38380, 86001, -183551, 76670, 232603, -96560, -386921, -394817, -648988, 72030, 105506, 193629, -246757, -186012, -141844, -284548, -219606, -173192, -135995, 265614, 88440, -47944, 66046, 189053, -141591, -128737, 85016, 189998, 185175, 30705, 205803, -63601, -232967, 154423, 185414, 163299, -139711, -184708, 102276, -142487, -86483, -111464, -326140, -93892, -289072, 145645, -305736, 81, -346479, 58415, -68882, -107637, -442931, -185092, -91252, -19824, -283343, 105613, 52767, -118253, 135331, -169305, -86619, 92551, -36113, 329696, 117757, -227110, 203877, -64419, -344582, 26310, 220183, -52972, -137054, -315230, -98633, 104610]
19468a47897j29785A40671c61121A7243J39295F3343P6999a40244l7192D0749
19457i8731p2633a217j11171m7354j41143J33905A21562K6416d02652A69636b55971
19445A86113b29434g2925p7468B8661K21315d92722d4288k51705e6170n9546j397
19434a17113L7929k76777b2190F2609h6204E8971F217C099a32245B4187a41828
19422e9003n91818g4707p1246k1720D2809a80852P9838B67294E8952c6900k9995
19411f6895j4650C51928A26695J26877b40692e5326A25818b21747O945J8740R4031
19400a02031j42220j22313A10642c2754G5302a52143I0852m3510b49348j11922
19390c61270N0951A71192a42079a3252j63041A6925a06964j61645E1430b0988
$$ y = [-147897, -277682, 140671, -361121, 17243, 156538, 63343, 140342, -140244, -177436, 40749, -98731, -171364, -1217, -112388, -159742, -300885, -166980, 121562, 147978, -402652, 169636, -255971, 186113, -229434, -72925, -150393, 28661, 249976, -492722, -44288, -295993, -56170, -115716, -117113, -79184, -355961, -22190, 62609, -86204, 58971, 6217, 3099, -132245, 24187, -141828, -59003, -650821, -74707, -145953, -167673, 42809, -180852, -101014, 267294, 58952, -36900, -66895, -81545, 351928, 126695, 253572, -240692, -55326, 125818, -221747, -214802, -196062, -102031, -244251, -366564, 110642, -32754, 75302, -152143, 90852, 47342, -249348, -361270, -310319, 171192, -142079, -13252, -176293, 16925, -106964, -268609, 51430, -20988]
19379b37116Q1792n9786A18296b1775k81417J07671a879D823a47781k9557A0359
19367A03953a98082R0375j87780P3598f4071j68683A47109o7655a38244l3424
19357a71668c5470k10285C9706d30280a57215A63666q577o3497c49345a22824
19346I3018c7343B71853h4180i642j70774A2547b49948n7085J40816K2958B18388
19334E2565J39565Q1a31047j15584j07249C4153R3810a47736h052j07126G1546
19322a02230n1625G5921O5033b10216C9770a87750F5160b23127E4819M22763B09701
19310b5474d753j4733j45456d9530k36948K1883g4336B23668a41016A1255L6969
19299D8224a82363l04777a95265G1918c7967j03454j12102g6331k7563C2995b32832
$$ y = [-237116, -155324, -215110, 118296, -21775, -303192, -195521, -1879, 4823, -147781, -177338, 10359, 103953, -198082, -107707, -295487, -221889, -64071, -232754, 147109, 79454, -138244, -171668, -35470, -245755, 39706, -430280, -157215, 163666, 155089, 91592, -349345, -122824, 93018, -37343, 271853, -84180, -9642, -180416, 12547, -249948, -307033, -166217, -143259, 218388, 52565, 192130, 192211, -131047, -246631, -353880, 34153, 127963, -147736, -8052, -115178, 71546, -102230, -153855, 75921, 140954, -210216, 39770, -187750, 65160, -223127, 54819, 477582, 209701, -25474, -4753, -19486, -164942, -49530, -286478, -264595, -74336, 223668, -141016, 11255, 48224, -182363, -487140, -195265, 71918, -37967, -141421, -253523, -76331, -103894, 32995, -232832]
19287a59658g3734r5691f2434H8189C1942b8721k57301H6303f8323A90741b09777
19275a223j76686b2198A98705q5293a8400p9673l9513f0590G0703b4346e282E24358
19262i3323j0178I0498K06118a71034o2105G8719d3218n7447B45641b4673C2072
19250d3995q8066M7418j33927d2652J1406k18604d5602j87985j00621g8254K8474
19239d9780k64774J47905C167M1893a68557d8926A46954J6211b95894A76842B7165
19227b10210a02857D8953b8058p1004b2633j09394r572O4280B4488J51802k2983
19216A53307a41103n8281b7154I3607h2694m6700A78367a41142J7567j87686F4262
19204f5938O097a0457B2829K5860K31377a32957G1998E986b89302N6615D96295
$$ y = [-159658, -73734, -169425, -62434, 88189, 31942, -28721, -286022, 86303, -68323, 190741, -209777, -1223, -177909, -22198, 198705, 113412, -18400, -98073, -137586, -60590, 70703, -24346, -5282, 524358, -93323, -103501, 90498, 296616, -171034, -233139, 78719, -43218, -100665, 245641, -24673, 32072, -43995, -132061, -84643, -218570, -42652, -31246, -249850, -45602, -233587, -334208, -78254, -49780, -314554, -166649, 3167, 45060, -168557, -48926, 146954, 163165, -295894, 176842, 27165, -210210, -102857, 48953, -28058, -99062, -22633, -132027, -141599, -77319, 24488, 176290, 153307, -141103, -199384, -27154, 93607, -82694, -129394, 178367, -141142, -123575, -311261, 64262, -65938, -59841, -10457, 22829, 48689, 280066, -132957, 71998, 5986, -289302, -232687, 496295]
19192c9472k2428j6386l10642G333i8319j22804O1627j11340G5165e6434A17566
19180i3661J3495B72025A0362c3471L934B56613c5885j19588I4510b13825a5232
19168b05965R7981f800B29606b22467i1394A60312A9071c42290q7295a96660B53344
19156d3266m11534a6689j84288N0253a303k54502A36244i9908r3473C5582a04267
19144I8760J59219e9581k87486r5032n5398e7828j43227m3515h9136n9769A56628
19132b23172B85848j14280f408j71796m4112A00809b03752g6378c5027m2928B2886
19120c23423B8617f57k77073B12400a28328C4700a7542A73613a18828r6977Q6826
19109a28979C6102J43900b1196C3598a13657A61696a84074C120b78035C41020
$$ y = [-39472, -61900, -78286, -388928, 7333, -98319, -221123, -159496, -270836, 75165, -56434, 117566, -93661, -80166, 272025, 10362, -33471, -29537, 256613, -35885, -155473, 94510, -213825, -15232, -205965, -107984, -6800, 229606, -222467, -91394, 160312, 19071, -342290, -429585, -196660, 253344, -43266, -454800, -16689, -200977, -150724, -1303, -255805, 136244, -99908, -193381, 35582, -104267, 98760, 257979, -59581, -347067, -442099, -497497, -57828, -201055, -244570, -89136, -148905, 156628, -223172, 285848, 171568, -6408, -178204, -222316, 100809, -203752, -76378, -35027, -77955, 22886, -323423, 28617, -657, -277730, 212400, -128328, 34700, -17542, 173613, -118828, -215805, -128979, 36102, 180002, -21196, 33598, -113657, 161696, -184074, 3120, -278035, 341020]
19098b8483A8838a66097A25298b16080O8906A51069b46648j61201g3613A41482
19087a38470J0215F9671J8947a14324A35430A0138J51208a50604n2113A45478
19076I5924a50284A04446R8035C2780N3287B3347a22833C32730g3174I9237f6588
19064a43522I5721C204b52730F3567a05469A05183P7693A8905K13015e4004j9992
19053g3996L2671k73850f6818f171G5369N3053l3113A8791J68389a65194l37495
19042e02689b22189k48246G332J0844J36633M7862a53597B7674J38853f0879p42
19031f1621C3272g7488j33084K4351j4085B40397e3631R293J8372C7098a57475
19019a02013k86168i4243j04800C1088O4714g441j5978k086k08640A12652b31920
$$ y = [-28483, 18838, -166097, 125298, -216080, -147174, 151069, -246648, -407849, -73613, 141482, -138470, -128255, 69671, 88618, -114324, 135430, 10138, 161346, -150604, -202717, 145478, 95924, -150284, 104446, 202481, 32780, 86067, 23347, -122833, 332730, -73174, 99237, -66588, -143522, 95721, 3204, -252730, 63567, -105469, 105183, 182876, 18905, 231920, -54004, -73996, -41325, -315175, -66818, -6171, 75369, 128422, 95309, 18791, 187180, -165194, -502689, -222189, -470435, 7332, 18176, 154809, 202671, -153597, 27674, 166527, -60879, -61621, 33272, -77488, -210572, -186221, -200306, 240397, -53631, -44338, -25966, 37098, -157475, -102013, -388181, -94243, -199043, 31088, 95802, -7441, -23419, -25505, -234145, 112652, -231920]
19007f0464E6592b04949A29243a22511A06277m1390a92195j4648D4592a36531
18996a58737f6146K7284E6440J13590o6953b08785H0311R235b9301J4314q6475
18985a01462D9711a0623j82615H8648k9516a66437A0219a45026B2245K94831b03320
18973A86050o8270c71955f488m2311e581B6060g0264C27821a9725A42372a70086
18961B00754p6153K8006D8281J37567i232A97381a87682O3295e6858b0382O246
18950a4136k30193A54310d2786a5161j04647m7207I722J11199b79063j6773B8017
18938a42111B32079E9854a6287A33156b0799B175P3243A6273K0587b93852J14470
18927a79382J618J7656e7270j81071g9008j38004i4141C621a8046H3658c46269
$$ y = [-60464, 56592, -204949, 129243, -122511, 106277, 64887, -192195, -206843, 44592, -136531, -158737, -66146, -38862, 56440, 170030, 103077, -208785, 80311, 89546, -29301, -14987, -101462, 49711, -10623, -193238, 88648, 59132, -166437, 10219, -145026, 22245, 317076, -203320, 186050, 117780, -371955, -6488, -48799, -5581, 26060, -70264, 327821, -19725, 142372, -170086, 200754, 124601, 152607, 48281, 185848, -9232, 197381, -187682, -124387, -56858, -20382, -14136, -244329, 154310, -42786, -15161, -119808, -167015, 9722, 120921, -279063, -295836, 28017, -142111, 232079, 59854, -16287, 133156, -20799, 2175, 75418, 16273, 36860, -293852, -179382, -177764, -160108, -57270, -238341, -79008, -217012, -94141, 3621, -18046, 83658, -346269]
18915b16955C46716B4210J35944a05204A27961b11861P6092A38335b07895C36307
18904i2248j57307J2639D9365R0884M9821L418a35665e6477A31943E735d35092
18892A5932b59926N8261C2292a54887j39535E5087R9930E6369J13210i9835j94692
18881b94527J07069d6153J7046A14105c50560a36389E1077M3951a4087k69384
18871b83471P5255l7792c6085p0968E3735a37317c5054o9992A58493a53539B6027
18859b46884O6765j1410P6474M2688b1650j42118E8681a96861J9607n8490M6771
18848a88973M5682B38852f2782A87513e3130j35087b910E9619d33928E2197a72726
18836A86618A1364Q4822a26637L1651g953k77023a33504b7035C2258R9744b80426
$$ y = [-216955, 346716, 24210, 160154, -105204, 127961, -211861, -135769, 138335, -207895, 336307, -92248, -249555, -236916, 49365, 140249, 190070, 193488, -135665, -56477, 131943, 5735, -435092, 15932, -259926, -201665, 32292, -154887, -294422, 55087, 155017, 56369, 169579, -99835, -294527, -187458, -46153, -29107, 114105, -350560, -136389, 51077, 95028, -14087, -283471, -208216, -246008, -36085, -107053, 53735, -137317, -35054, -105046, 158493, -153539, 26027, -246884, -180119, -191529, -115055, -72367, -21650, -163768, 58681, -196861, -177254, -235744, -188973, -143291, 238852, -62782, 187513, -53130, -188217, -2910, 59619, -433928, 52197, -172726, 186618, 11364, 96186, -126637, -94986, -7953, -284976, -133504, -27035, 32258, 132002, -280426]
18824E2303P4797C9948c91089J75124c4077B939J32591K2622a8114A55914a84843
18812a27620e9873B64567k3438a44915O9120B58812F4947b37705l25223F2752
18801d62149a60788B02588C0244J87803d7244A17699m0990a8619m1406F2131K96254
18790C58385r5024o0131M1616E1798b02554P9928H5010l3857a21535j65857C1473
18778g3879A03779b98661B30372a51442g945j01256C3693a13102m4919j6827a8030
18766i9236G0036a05201l40577P0490B73137F0720i5923A06531a49852j67088
18756c16940c4407r1410B84133g2717l3868P44E536a35565d7016m1025b3922j28708
18744a52630e7018k13493A3846a42447C3482b13746B202K80868b60654E2787a19805
$$ y = [52303, 127100, 39948, -391089, -215965, -34077, 2939, 135530, 158152, -18114, 155914, -184843, -127620, -59873, 264567, 241129, -144915, -75795, 258812, 64947, -237705, -562928, 62752, -462149, -160788, 202588, 30244, 218047, -47244, 117699, 76709, -18619, -60025, 62131, 358385, 263361, 203230, 244846, 51798, -202554, -122626, 85010, 51153, -121535, -287392, 31473, -73879, 103779, -298661, 230372, -151442, -7945, -109201, 33693, -113102, -158021, -174848, -18030, -99236, 70036, -105201, -445778, -375288, 273137, 60720, -95923, 106531, -149852, -316940, -34407, -125817, 284133, -72717, -106585, -105841, 5536, -135565, -47016, -88041, -23922, -152630, -57018, -270511, 13846, -142447, 33482, -213746, 2202, 283070, -260654, 52787, -119805]
18732b03702J9983d1233j99733B90312j40532a79191C8993h5493A82385l0291
18722A52094a43785l2812o6630i8665B7418f7108p8700k351l18375a83556F5089
18710B50477j22719C9216a0093j20544k51609B02845h9904c9439p3973D4526L54492
18699C99018E2886b19166C3156K6646a50677m5928C22724e0041K4645F6860P211
18688G4071a00190A90896n1583d01947D7127d8017I019h4780c6336j13214B07066
18676c7150a3354A56633J03267D4855J28954A2668c92699E7848a91210f0521D0881
18664a25165j11876O7926d0212A4408o806b1521j57497a7757l1866f108C19228
18652a89189A2109b2563q3548L6162m7787P414J6851K4547B28849E5094Q0392
$$ y = [-203702, -183719, -41233, -240966, 290312, 149780, -179191, 38993, -85493, 182385, 152094, -143785, -176597, -243227, -98665, 27418, -67108, -145808, -148159, -466534, -183556, 65089, 250477, 127758, 39216, -10093, -130637, -382246, 202845, -89904, -39439, -113412, 44526, 399018, 52886, -219166, 33156, 59802, -150677, -196605, 322724, -50041, -25396, 66860, 74071, -100190, 190896, 139313, -401947, 47127, -48017, 9019, -84780, -36336, -149550, 207066, -37150, -13354, 156633, 259900, 44855, 173809, 12668, -392699, 57848, -191210, -60521, 40881, -125165, -237041, -169115, -40212, 14408, 7602, -21521, -179018, -17757, -49623, -6108, 319228, -189189, 12109, -22563, -106111, -69949, -117736, -110322, -93471, -68924, 228849, 55094, 135486]
18641A35486J8555b96295q4124C9722e682j00768f761n8301i565l28736a16665
18629i8091f607l0516j36984P2201A03507b98460E8011a22461b7751j67628h0994
18617G5939c77401A53646e7404A09971e0928k7246m946r507l6147A36192M3282
18606A79474e8051j62498i3502q6650k28675C3397i3971k06463B15788a07524
18595A09486A1095h5705J59l6105F8064b03805A04876L9377g5735l4451p1637
18584a81823h1098B1734J44890c4464H7818J46976h325k52755A3290b66902B15180
18572a26854j26596C9041A8096J72217g6324C6244a16964L1926A11034g4936B92411
18560a28412J4165B10128b8560r4182k60950a1451j78068n2904D0361b12379n2248
$$ y = [135486, 154041, -296295, -380419, 39722, -5682, -106450, -6761, -65062, -9565, -338301, -116665, -98091, -6607, -37123, -174107, -101906, 103507, -298460, 58011, -122461, -27751, -195379, -80994, 75939, -377401, 153646, -57404, 109971, -50928, -78174, -83120, -92627, -128774, 136192, 179474, -58051, -220549, -93502, -180152, -408827, 33397, -93971, -300434, 215788, -107524, 109486, 11095, -85705, -85546, -121651, 68064, -203805, 104876, 144253, -75735, -110186, -181823, -81098, 21734, 166624, -34464, 87818, 234794, -8325, -261080, 13290, -266902, 215180, -126854, -253450, 39041, 18096, 190313, -76324, 36244, -116964, -85038, 111034, -74936, 292411, -128412, -114247, 210128, -28560, -122742, -383692, -11451, -189519, -242423, 40361, -212379, -264627]
18549b64627F8917a05760k0265c9035q7939A947c4979m0942j92821J27093b9687
18537A70274O7988r0748C5586A5875K8812h9939n4602J1569B3778a48319D6274
18525F4868b63726a4013n8824q0627B91787H1290J67465D1420K05664a20106j34376
18514b54482M2558E3796K79069a53450A1941b1245j95272j73346O6135A81200
18503E9317b27144a03108D3686J19425a28956k55003B73985P1983A13433h5739
18492B58309A0562e5638Q523C4186a20904K2408n5979Q514E4277L6056c28526
18480a07686A21025K0318R0202a46577n8031A25472n1675O2369f3233A8124c35076
18468c36891o7279I8379c8674B26914c01764E0491J2962b77983A8885a52089E6615
$$ y = [-264627, 68917, -105760, -126025, -39035, -126974, 1947, -34979, -75921, -268742, -141649, -29687, 170274, 238262, 147514, 35586, 15875, 44687, -89939, -144541, -132972, 23778, -148319, 46274, 64868, -263726, -14013, -72837, -153464, 291787, 81290, 248755, 41420, 247084, -120106, -254482, -211924, 53796, 332865, -153450, 11941, -21245, -216517, -389863, -323728, 181200, 59317, -227144, -103108, 43686, 163111, -128956, -383959, 273985, 345968, 113433, -85739, 258309, 10562, -55638, -47115, 34186, -120904, -98496, -154475, -145961, 54277, 90333, -328526, -107686, 121025, 141343, 231545, -146577, -204608, 125472, 73797, 136166, -63233, 18124, -335076, -336891, -404170, 98379, -38674, 226914, -301764, 50491, 63453, -277983, 18885, -152089, 56615]
18456a55291G9359O7544h5617D1719a19432k9986d5164k21986g8033k6946k64394
18445c69373A6204d9525A08377j1020B4897i9213B40506A7018J618a93272j04708
18434b97980C0458b53851H0577A5726N8489c1034k20180J14997c4826A14732b83490
18422g5016K3205n6686q5128A56174J5195J444a02162B0583A111M87164a96132
18410B2739J88914b77002H4944c33024E768e1814m0363j58535c7884A60564K1944
18399A82508C6041a74078q9278G852g1128B1077J6843J63766a40292I1631a00357
18387B53761o4069f5942A39088E369b19390O2762I053a66913B08216E28Q7815
18376H8343L3514a51617N9018E7051B3161b38627h9189k58929A41319a76908g4810
$$ y = [-155291, 79359, 146903, -85617, 41719, -119432, -149418, -45164, -267150, -78033, -104979, -369373, 16204, -49525, 108377, 97357, 24897, -99213, 240506, 17018, 18636, -193272, -297980, 30458, -253851, 80577, 15726, 74215, -31034, -251214, -136217, -34826, 114732, -283490, -75016, -51811, -108497, -193625, 156174, 171369, 172813, -102162, 20583, 1111, 488275, -196132, 22739, 211653, -277002, 84944, -333024, 5768, -51814, -92177, -250712, -37884, 160564, 182508, 36041, -174078, -263356, 7852, -71128, 21077, 37920, 201686, -140292, 91631, -100357, 253761, 189692, -65942, 139088, 5369, -219390, -156628, 9053, -166913, 208216, 528, 88343, 121857, -151617, -92599, 57051, 23161, -238627, -89189, -348118, 141319, -176908, -74810]
18364A04468a07948j57970k1988c6527l0370j48539D0037M6120a4769B8140K11688
18353B39828B0567J26001b72124I4820b232A35966R3745i5903A7769c98623i2687
18341D83527i8085K3940L5274a1731D6096a2651m19753b2657I6940k9840C3321
18329a31151o5454a6288l4111k15306P1143C8271J66785D5612N9694a99333N9738
18318a39595L1136A10536C5663b6799n9212b3898c319A5708a68184P6330B1854
18306a90713f3523j79139A80324N788a05036P431I2367b39891J01318j23549a01067
18294c53722Q6378f9955f57B72150c2756j32328E2859a30286K6241H4841a29377
18282a68121M6791J9198d9202b1384m04463b00642F1297J05614b67357A3728a74025
$$ y = [104468, -107948, -265918, -287906, -36527, -66897, -215436, 40037, 86157, -14769, 28140, 239828, 20567, 146568, -272124, 94820, -2232, 135966, 229711, -95903, 17769, -398623, -92687, 483527, -98085, -74145, -38871, -11731, 46096, -12651, -432404, -22657, 96940, 67100, 33321, -131151, -196605, -16288, -50399, -265705, -194562, 38271, 205056, 45612, 105306, -199333, -139595, -108459, 110536, 35663, -26799, -86011, -23898, -3319, 15708, -168184, -91854, 21854, -190713, -63523, -242662, 180324, 186112, -105036, -97605, 92367, -239891, -138573, -262122, -101067, -353722, -267344, -69955, -657, 272150, -32756, -165084, 52859, -130286, -104045, 84841, -129377, -168121, -121330, -102132, -49202, -21384, -425847, -200642, 61297, 166911, -267357, 13728, -174025]
18270i9572j01342a0785H5781L06383d46530C3447g7937j36596r6633g7170j93794
18259b70964B34412a67685L9515J7848m3438e9388A70565d4426A36078P2304c55393
18247D1108K51590e8065j78585B09624f7868D4964a57042n9061i5139k9385j7791
18236a42315A48654a65088C6474i4822m5476D9400b42812a0110r8501A52135O0041
18225B12176o9029a62532C4185c23806C6645J10011K9873a84477P5558A02353
18214I1372f2828C7942h4191A02126j7320B8295d21237A35471R9146A03448a4192
18202a7808C21216D0441a9880o7751j80930F7903K2475C026b00026e911B25818
18190a25929G2716K62432B7418b03467F6091L6713J29263f6689A72546p5205b04845
$$ y = [-99572, -200914, -10785, 85781, 392164, -446530, 33447, -77937, -214533, -311166, -77170, -270964, 234412, -167685, -128170, -110322, -153760, -59388, 170565, -44426, 136078, 208382, -355393, 41108, 292698, -58065, -236650, 209624, -67868, 44964, -157042, -216103, -95139, -124524, -142315, 148654, -165088, 36474, -94822, -140298, 49400, -242812, -10110, -108611, 152135, 212176, 143147, -162532, 34185, -323806, 36645, 146656, 176529, -184477, -108919, 102353, 91372, -62828, 37942, -84191, 102126, 84806, 28295, -421237, 135471, 234617, 103448, -14192, -17808, 321216, 40441, -19880, -87631, -268561, 67903, 90378, 3026, -200026, -5911, 225818, -125929, 72716, 335148, 27418, -203467, 66091, 102804, 232067, -66689, 172546, 97341, -204845]
18178B67119E142L24871A08296h2416E7561J91297a63438M7602A26743J45857
18168B72600a04364C42019h7037L9583l4526n0091k91894O5515i8508b9902C7689
18156a69283A83188K09625b02682f7221j21762o5971A02182b12505H949a7065
18145G9906a79041B4012d5513j53044A92944c53695j07291a35048j42971D5308
18134f1656m9607K2783b0232F4237a01590C31769c3220h09j43456A58816L3735
18123A92551a29240j10142L5048g3299l3744a5006r7674n2204o4105F3775J98654
18112B62429B6590b19392A2395K07050n8699b30305O2094B05448a00187j01867
18102b02054h288A8796k975a08016A0950J24457a14722f648q1590k07480A41514
$$ y = [267119, 5142, 330013, 108296, -82416, 57561, 248858, -163438, -115836, 126743, 272600, -104364, 342019, -87037, -47454, -81980, -132071, -423965, -358450, -98508, -29902, 37689, -169283, 183188, 392813, -202682, -67221, -188983, -254954, 102182, -212505, 8949, -17065, 79906, -179041, 24012, -45513, -198557, 192944, -353695, -460986, -135048, -278019, 45308, -61656, -111263, -88480, -20232, 64237, -101590, 331769, -33220, -809, -144265, 158816, 192551, -129240, -239382, -204334, -73299, -107043, -15006, -112680, -164884, -228989, 63775, 262429, 26590, -219392, 12395, 219445, 160746, -230305, -168211, 205448, -100187, -202054, -8288, 18796, 15821, -108016, 10950, 135407, -114722, -6648, -88238, -295718, 141514]
18090A56350k6945e2702r8777B64383I6302J42498a13046F8554b04482A79596
18079g1720A64573c21956B4794b87712A03396J03487a99262G5810B3290R5438
18069A18728K12431b69088d8552k05459C2021k438Q8665D4403a24200k10567J3161
18058c21606h4540j4962j14933d509A33871d00470B999J79623h4448j43279j00740
18047c28467A12265a68588M2903e1546E053a94968A48908J09363b3863r380C3563
18035A74919a31234k43820F6634a08868L5704B54990b06274i9449A0772f2317
18024b83605D6885Q6982J09997f8064j39983B58827b70561J09998I168L889h1583
18012c8894k34376b8151F0159c12097C7489a59568R308B20390a94806j01069g5367
$$ y = [156350, 129405, -52702, -151479, 264383, 96302, 238800, -113046, 68554, -204482, 179596, -71720, 164573, -321956, 24794, -287712, 103396, 206883, -199262, 75810, 23290, 118728, 331159, -269088, -48552, -254011, 32021, 29583, 118248, 44403, -124200, -334767, -321606, -84540, -99502, -214435, -4509, 133871, -400470, 2999, 182622, -84448, -227727, -328467, 112265, -168588, -125685, -51546, 5053, -194968, 148908, 258271, -23863, -33243, 33563, 174919, -131234, -375054, 66634, -108868, -73164, 254990, -206274, -99449, 10772, -62317, -283605, 46885, 133867, 243864, -68064, -208047, 258827, -270561, -160563, 9168, 13057, -81583, -38894, -273270, -28151, 60159, -312097, 37489, -159568, -150260, 220390, -194806, -295875, -75367]
18000a90318A64582d68545I5671d184m6678A53008D2446d74493C6405j5650a55786
17988a38745B4809J65835a58175E4070a89020m6908e1580A51017m7815M0296D3993
17976g7200A55789O2546r0890c29396d1394p2378M1793k5164q2586A36826a63396
17964b51591A77305H4848a20455C44675a49947A2421c5073j4448b4565F1878a40653
17952a00959E067J47315R216k8273c095B6508a11518H1369d2257A39390A3128
17940a49811A53133g1011E8150J0628R0902e7035B4957a38690A95690I1629b29243
17928a23414n0019M1066C56903f9249A16589b33863Q1265j7160B70848A10915
17917h3330A20313c20B74531F5381a24559a1261j70670G6420a59200L5920r164
$$ y = [-190318, 164582, -468545, 95671, -4184, -50862, 153008, 42446, -474493, 36405, 20755, -155786, -138745, 24809, 190644, -158175, 54070, -189020, -235928, -51580, 151017, 103202, 143498, 43993, -77200, 155789, 218335, 127445, -329396, -41394, -113772, -71979, -97143, -179729, 136826, -163396, -251591, 177305, 84848, -120455, 344675, -149947, 12421, -35073, -49521, -24565, 61878, -140653, -100959, 5067, 152382, 161598, 133325, -3095, 26508, -111518, 81369, -42257, 139390, 13128, -149811, 153133, -71011, 58150, 68778, 159680, -57035, 24957, -138690, 195690, 91629, -229243, -123414, -173433, -132367, 356903, -69249, 116589, -233863, -152598, -169758, 270848, 110915, -83330, 120313, -320, 274531, 65381, -124559, -11261, -181931, 76420, -159200, -123280, -132444]
17906a32444j35819F7608k9020g801j39319c2071p0549a8611p8770A47554b01622
17894A39707L3516j0197c44445g9956A1236J28492b86201J7447B4504M9544C1380
17882D8229b24420F614f1670r6984G6743k8012f2182a1722j92634A8656Q2867
17871A01523f2148j93601C38186p4610e2318k1261P162j01714P9541A60875b3038
17859h8273r4104E0692a11027H2885f4099j5187B15097A1593b6471c348A43396
17847F5165N3226J12901c23092g4090B19484a86499B23733a13986j71563e653
17836B63468E1498K07198B5581k319g7026A37953i8479k27030h9341A29684B9760
17824c03320a49098C25108I0179m0633J00077E5190o324P0090b5860n8554L4010
$$ y = [-132444, -268263, 67608, 38588, -7801, -147120, -32071, -102620, -18611, -97381, 147554, -201622, 139707, 173223, 163026, -344445, -79956, 11236, 139728, -286201, -268754, 24504, 74048, 31380, 48229, -224420, 6614, -61670, -158654, 76743, 48731, -62182, -11722, -204356, 18656, 101523, -62148, -255749, 338186, 263576, -52318, -73579, -66417, -168131, -88590, 160875, -23038, -88273, -182377, 50692, -111027, 82885, -64099, -79286, 215097, 11593, -26471, -3348, 143396, 65165, 118391, 231292, -323092, -74090, 219484, -186499, 223733, -113986, -285549, -5653, 263468, 51498, 258696, 25581, 23262, -77026, 137953, -98479, -325509, -89341, 129684, 29760, -303320, -149098, 325108, 90179, 49546, 149623, 55190, 48866, 118956, -25860, -84414, -50404]
17813e0404A16183M6981J19904d5183m5210L6383E8478K10906N0201c9001j1182
17802e0183A4572a51262k047k06353f1940m6634G3125a9111p0867j06703D1274
17790i8427n742a5564j96149B68143a0174n5585c2416H6072K46422a21066j44192
17779b65258J7903a02373A69161d50050C470c0125k02168a6104r5943A83560J809
17768A85369l2089c9397A35409a96513I7189a54028D895i9375A00053h0098I183
17756F7683J18573D2387h5426m2369j3760A89019a70297L6416H5112d8296n0353
17745i8649j65563C1652b84946a27321l0263O0636C3759a64811B70277G248R0690
17734I7938a15021j00430B0593b74971Q625B83107b31366A3051a80200M6523c101
$$ y = [-50404, 116183, 163164, 283068, -45183, -90393, -54010, 58478, 269384, 319585, -39001, -50183, 14572, -151262, -153309, -359662, -61940, -108574, 73125, -19111, -89978, -196681, 41274, -98427, -104169, -15564, -211713, 268143, -10174, -65759, -32416, 86072, 332494, -121066, -265258, -247355, -102373, 169161, -450050, 3470, -30125, -232293, -16104, -112047, 183560, 185369, 153280, -39397, 135409, -196513, 97189, -154028, 4895, -99375, 100053, -80098, 9183, 67683, 186256, 42387, -85426, -127795, -141555, 189019, -170297, -133881, 85112, -48296, -98649, -264212, 31652, -284946, -127321, -157584, -96948, 33759, -164811, 270277, 7248, 97938, -115021, -215451, 20593, -274971, -266346, 283107, -231366, 13051, -180200, -133677, -3101]
17722A57432L0592b16102R6445B04159a00369c4076A20208d26112A54887O9952
17712B24839F2975K00665a10586q3460A90407O1287r7774m2785a49521j00777
17702b50298e6811D23514e5252B29246D4591i7466A1174a51929F1952b44837E0422
17690g7217B15240d969j3755j67229M7761A03781b32850B8884a59098I1558k9182
17679F2376b31944I5537i3667k79742i0010A40123A6907K26798d1595j37055P3256
17668a05394j29167F1897a78175C8308N6454i0647d189l56231A47528A4051a06606
17656A10075J33709b40644A6286h6710q1405e8561k51758A43840A937R7744K3506
17645A23187M327B030J10476N4625b5886A31368M9968n2995M0272a57163B59015
$$ y = [157432, 188024, -216102, -119657, 204159, -100369, -34076, 120208, -426112, 154887, 224839, 62975, 263640, -110586, -194046, 190407, 251694, 153920, 111135, -149521, -250298, -56811, 423514, -55252, 229246, 44591, -97466, 11174, -151929, 61952, -244837, 50422, -77217, 215240, -4969, -18724, -185953, -138192, 103781, -232850, 28884, -159098, 91558, 62376, -231944, 95537, -93667, -373409, -90010, 140123, 16907, 243705, -41595, -178650, -105394, -234561, 61897, -178175, 38308, 94762, -90647, -4189, -360420, 147528, 14051, -106606, 110075, 243784, -240644, 16286, -86710, -168115, -58561, -310319, 143840, 1937, 99681, 123187, 127514, 2030, 112506, 167131, -25886, 131368, 181336, 128341, 168613, -157163, 259015]
17633c3946n732j93434C2385L6926k0888b27727A05181b63756F3627a08540A0058
17621C08409b03324B44199j1182C9370O6866k4596a88412H1618J24317a04200
17610B67487n4414E3592b9356B64915a50992N8722d100j8851F0153c9196B4866
17598C07357B6989K104N5667c47544M0426A66201b38287H133Q1907J31156a85536
17586A51260g3808J9907l4312A19635a99768O1317G4105h4486a7906q5892I7007
17574A56143Q1582c6612n97C35807j53399J3970a3923O336B12588e0755k46138
17563b96893a09874A88301o4093A8793M2375b89000P3409E3953J4082b428A26797
17551D22133d5331B26915G7175L7500e5550A00937a40831m3023C13323a14839
$$ y = [-33946, -39678, -233112, 32385, 69311, 48423, -227727, 105181, -263756, 63627, -108540, 10058, 308409, -203324, 244199, 233017, 39370, 106236, 81640, -188412, 81618, 205935, -104200, 267487, 213073, 53592, -29356, 264915, -150992, -92270, -4100, -22951, 60153, -39196, 24866, 307357, 26989, 29093, 84760, -347544, -307118, 166201, -238287, 8133, 90040, 221196, -185536, 151260, -73808, -53901, -88213, 119635, -199768, -138451, 74105, -84486, -17906, -103798, 97007, 156143, 237725, -36612, -37209, 335807, 182408, 196378, -13923, -7587, 212588, -50755, -296893, -109874, 188301, 124208, 18793, 61168, -289000, -215591, 53953, 68035, -2428, 126797, 422133, -45331, 226915, 77175, 114675, -55550, 100937, -140831, -183854, 313323, -114839]
17540i7648A87883g1170A8489L84723A72142J85881a16323A3360J33431h1999
17529H1431J23372D0004K02980n5803B7377K60569a30048B6759h7429A51673F2143
17517F2715M6503B7527O7452N6445N3223F0319A7856a03455q152E0987R6818a04905
17504C61585E5937J51865R987a84889B24567d4255j12366J5086C10689d8142F5707
17492a66953B05692B4950R917O6658a48114j30317I7988b69397D70955B23323
17481A8288M51153h9210A39439J07735I1540a55897g930A82240K718L22206a25042
17469e6418A00788A1484K12813K99916c23895A02539a11210b030A76873R4134
17459B71007r4937L03495B4144J4245J15301J036a9334B72160I6772M16863B18319
$$ y = [-97648, 187883, -71170, 18489, 403212, 172142, 358023, -116323, 13360, 146791, -81999, 81431, 204803, 40004, 242984, 187181, 27377, 287946, -130048, 26759, -87429, 151673, 62143, 62715, 109218, 27527, 94979, 151424, 204647, 60319, 17856, -103455, -111607, 50987, 147805, -104905, 361585, 55937, 207802, 217789, -184889, 224567, -44255, -156621, -141535, 310689, -48142, 65707, -166953, 205692, 24950, 34867, 101525, -148114, -278431, 97988, -269397, 470955, 223323, 18288, 469441, -89210, 139439, 247174, 91540, -155897, -7930, 182240, 184958, 507164, -125042, -56418, 100788, 11484, 224297, 524213, -323895, 102539, -111210, -2030, 176873, 271007, 176070, 479565, 24144, 38389, 153690, 154726, -19334, 272160, 96772, 513635, 218319]
17447A37677M9982J61514J208D0019P8576E6345L99931j12936d2729B98837P1544
17436C70381I8903L1204d228A7588K43284e8408C30570m1404j26462c811A56717
17424b2913A59614m8680K3527K28075j14756n961J77042j12247o361j32480K55162
17413D22935A79658J66886j47740o0990K12245G0850K18909c35520A25536n9122
17403F6414k4152K86105b1040A15877K24312f3016O161C58797n4759I7741d9956
17391A47161N5206n3902J49658j48018e9706D2455Q8102a62697B16992A07218
17380B74573j21279P8404C3464a42154H5837a08661A27994J68200n2496a08750
17369a01067A09192b0695A61230L48818j93800a74856M6902a206C10009a04095
$$ y = [137677, 187659, 349173, 350381, 40019, 118595, 56345, 456276, 343340, -42729, 298837, 370381, 98903, 130107, -4228, 17588, 260872, -58408, 330570, 289166, 162704, -3811, 156717, -22913, 159614, 110934, 134461, 362536, 247780, 241819, 418861, 306614, 300253, 167773, 422935, 179658, 346544, 198804, 137814, 350059, 70850, 289759, -335520, 125536, 66414, 42262, 328367, -21040, 115877, 340189, -63016, -56855, 358797, 304038, 97741, -49956, 147161, 202367, 148465, 298123, 150105, -59706, 42455, 130557, -162697, 216992, 107218, 274573, 153294, 231698, 33464, -142154, 85837, -108661, 127994, 296194, 243698, -108750, -101067, 109192, -20695, 161230, 510048, 316248, -174856, -127954, -1206, 310009, -104095]
17358d7745j48539f999q6719G2377M07655b2183j4259A13263f328C30662G5609
17346B76862K6077I6965O5552J99742P1369q7687k8734I153a44888k2674L1777
17335a35785r047b7235A71821a34390H9582J60661d832F4017L7134R6201D2985
17323a73614B31654C9028K86453a34665B5575a66568B78780o0878h0972B58519
17312A98636P3267a98000A2160L77889b2036H8248a21971A34769K17020A18894
17301B35186r4922i6245D7203j6660J08073J14359A2876J53411C0168J05189N2596
17290A87953D7072b96137B17356J99776n8144g9315C04874a39464D0924e0994
17279i8946d3600m8846B60414l6916a43454A48705a08876A88131j5673D4414K61000
$$ y = [-47745, -196284, -6999, -93718, 72377, 480032, -22183, -36442, 113263, -6328, 330662, 75609, 276862, 302939, 96965, 162517, 362259, 433628, 345941, 317207, 9153, -144888, -167562, -135785, -144832, -27235, 171821, -134390, 89582, 250243, -4832, 64017, 101151, 197352, 42985, -173614, 231654, 39028, 325481, -134665, 25575, -166568, 278780, 217902, -80972, 258519, 198636, 271903, -198000, 12160, 390049, -22036, 88248, -121971, 134769, 351789, 118894, 235186, 140264, -96245, 47203, 30543, 138616, 252975, 12876, 166287, 30168, 135357, 187953, 47072, -296137, 217356, 417132, 358988, -79315, 304874, -139464, 40924, -50994, -98946, -43600, -92446, 260414, 223498, -143454, 148705, -108876, 188131, 172458, 44414, 305414]
17268C05414a3295A07628P4794L10888a62731k8551C59536o221a34285B24160
17257A76373J15868A44348F1919k7237P6969B522L74855j82957q8087J75409K7509
17246C09251b46638A64310P9525j7496a0536B23290l2784p428q2251C3015J95365
17235B28380N1691M5492q1745J29716F8347J72016A09041J52777j09909K9912
17225A81821L746F975J35953M5579J60414A69958L7221h7469A63298o1894K26409
17214C27813n4500I8073P5676C6716J4732L95025j4375B5227K13664J6673a26443
17202C98768A04246J42379O4400m4539O211q6001m4451m9548K63524R3134k00402
17191B48953F6154M42400j78540Q3610M0157A85848H5950b55214A84210R1671
$$ y = [305414, -13295, 107628, 182422, 493310, -162731, -191282, 359536, 353315, -134285, 224160, 176373, 292241, 144348, 61919, 34682, 111651, 2522, 377377, 194420, 106333, 281742, 309251, -246638, 164310, 243835, 226339, -10536, 223290, 190506, 183078, 100827, 33015, 228380, 280071, 325563, 243818, 373534, 68347, 240363, 109041, 261818, 151909, 181821, 185567, 6975, 142928, 188507, 348921, 169958, 207179, -87469, 163298, 101404, 327813, 273313, 98073, 173749, 36716, 51448, 446473, 432098, 25227, 238891, 255564, -126443, 398768, 104246, 246625, 311025, 266486, 272697, 186696, 142245, 92697, 356221, 449355, 248953, 66154, 508554, 330014, 413624, 453781, 185848, 85950, -255214, 184210, 275881]
17181B75881A20194K82331o6320A16425d6990B48900K26762n0814A26621J98737
17171C25358j0781j22302J10378m1734n9479H7896J01159j0229q8511L41391A97339
17159C88415C1926K91049p171J49835G7833R2024J29690j48803O4091p9223k3153
17148A12459K11238J5643j38175m7452d94o349D08402j86018m9333M20482A43721
17136D57264m4994J02706j53808j69339a9001D20955J89089C4785J36898J70405
17126C42088P2710B04389K1688L74095B14213J60900j04523J70900j7914A69467
17115B25777k7384K96985Q8424p8307H6673N46292A23694J37148K28469j18929
17105C70382j53338q5586K52341n1121G0411K37224j39457P6523P9630j39574
$$ y = [275881, 120194, 402525, 336205, 116425, -46990, 248900, 475662, 424848, 126621, 325358, 314577, 192275, 302653, 260919, 201440, 87896, 189055, 178826, 90315, 431706, 197339, 388415, 31926, 322975, 315804, 465639, 77833, 169857, 299547, 150744, 214835, 135612, 112459, 323697, 339340, 201165, 153713, -494, -6843, 408402, 222384, 173051, 593533, 143721, 457264, 412270, 514976, 361168, 191829, -19001, 420955, 610044, 34785, 171683, 342088, 414798, 204389, 226077, 600172, 214213, 375113, 270590, 441490, 423576, 169467, 225777, 198393, 495378, 583802, 505495, 86673, 632965, 123694, 260842, 489311, 370382, 217044, 131458, 383799, 332678, 70411, 307635, 168178, 244701, 324331, 184757]
17095A84757O2023L17592B63470M08480A24159J81417A51962J2816k8028J4222
17085A50972L0504L92649H2888L85098J4835j02589A75120K11480r2760N8447
17075C52287m0578j3836o6072O1354N01089l38009C7756M49422J936Q0390B67302
17063C20856K4074J02434r0935m1629J83506j6188n7202J98118j52183R5844k21708
17052C44987l3253J24067O9187J61789B68963L33374q3662M5478j72862K39562
17042F30853M5306j97494N2210j01682m102L9071J4393j15489L92501k70428j37253
17031C47886J74262m984j65199j42706L94857K94710k52874p5411R176O637l1265
17020E55089p063L3643J74202l25446L78761l14902O5461N66208m70436k0390
$$ y = [184757, 246780, 564372, 263470, 671950, 124159, 305576, 151962, 164778, 136750, 150972, 181476, 574125, 82888, 467986, 482821, 380232, 175120, 386600, 293840, 352287, 311709, 297873, 231801, 293155, 794244, 456235, 37756, 487178, 489114, 569504, 267302, 320856, 344930, 447364, 356429, 314800, 498306, 482118, 424916, 623034, 470851, 566695, 344987, 311734, 435801, 504988, 666777, 268963, 602337, 518675, 564153, 391291, 630853, 676159, 478665, 530875, 429193, 425091, 464162, 478555, 363066, 755567, 485139, 347886, 522148, 517164, 351965, 209259, 604116, 898826, 645952, 570541, 579717, 586354, 555089, 548026, 581669, 755871, 430425, 809186, 494284, 559745, 1125953, 655517, 635127]
17010F35127m6029J6760n0600o3662L67530J19991C63894L35280J0123k59925
17000D49372J33894J39614k0024j48070j28028Q1550K71330j21777J08167j76153
16990E89875M1361L09978l69561K82461j05105J95125m47054J03093m3753K94680
16980H51100k0905j66466J6804L02079m42322K95948K20284m75830n2574j1265
16970E16853K90964k25855L50595O5057j67545j23559J09300k42863K36554j49439
16960F60062K68176K8165j24302P042K77974m29427J51417j21257r512P3874K4636
16949H06848K59911R7270k40848k98037P6876L69959m70294O39735m74473K51073
16939A018020k5689J4837P6749p4103J74619k23710K12775j84028J70266j5165
$$ y = [635127, 589098, 605858, 555258, 491596, 859126, 979117, 363894, 699174, 709297, 449372, 583266, 722880, 702856, 554786, 426758, 508308, 779638, 657861, 766028, 589875, 631236, 941214, 571653, 854114, 749009, 944134, 497080, 600173, 556420, 851100, 830195, 663729, 680533, 982612, 540290, 836238, 1056522, 580692, 528118, 516853, 807817, 581962, 932557, 997614, 830069, 706510, 815810, 572947, 809501, 660062, 928238, 956403, 832101, 839143, 1117117, 687690, 839107, 717850, 708338, 782212, 806848, 1066759, 1164029, 923181, 625144, 702020, 1071979, 601685, 1241420, 766947, 1018020, 992331, 1007168, 1083917, 1009814, 1184433, 960723, 1173498, 989470, 1159736, 1144571]
16929A144571P3785k27286K10045l8172N2035o6534J5629J00884N6242p1103n6517
16918A193579K51915k98387L29475n7988J529j92800L09805k5591k07060K57392
16908A561869l09392J02703K01326Q5300m16829K81852q5247p5550j38971M05778
16898A612839k17922J40093N0305j69445K04934J54731j46233R8679q0994j63308
16888A483679J99987L17426r7517Q3188n6016J8249Q0636k66275K3861k9897p6527
16877A680794K57540M08885m20724j84617M45819M6086j46284L6009K11839J53985
16867B489332l25826J99284k81079M39175r5360K51437m65983J83598M00860k58399
16857B537039N8438J57563o4557Q5550K45621l10635M45623k21709k8373L1614
$$ y = [1144571, 1218356, 991070, 1201115, 1162943, 1214978, 1148444, 1164073, 1264957, 1321199, 1250096, 1193579, 1445494, 1147107, 1476582, 1418594, 1420123, 1227323, 1537128, 1511537, 1304477, 1561869, 1252477, 1355180, 1556506, 1641806, 1224977, 1506829, 1421582, 1346032, 1207061, 1612839, 1394917, 1535010, 1585315, 1415870, 1620804, 1775535, 1629302, 1727981, 1646987, 1483679, 1683666, 2001092, 1903575, 1986763, 1930747, 1948996, 2029632, 1763357, 1787218, 1757321, 1680794, 1938334, 2347219, 1926495, 1741878, 2187697, 2233783, 2087499, 2123508, 2335347, 2489332, 2163506, 2362790, 2081711, 2520886, 2425526, 2676963, 2210980, 2394578, 2795438, 2537039, 2595477, 2753040, 2688483, 2774033, 3019654, 2709019, 3154642, 2932933, 2904560, 2936174]
16847B936174j72376M73325J22456K9757j48942K37739K00788k14130j2030K50377
16837C703138R485J59020k12788o828M0058J69757n5860k63828K91340R8589L95615
16826D327698J63414j37668J61566J34062J97544M854n4827K78340J02458j3136
16816E164305K75676Q9162j94378K89585K03422L1065J88377O9719K30316j03576
16806F243673M4517J57069M39902J29854J55262M8584J86368J42554K8593M40860
16796H017236J76991K60776j73684L86451K7562Q53216k75343M70339L4930N18869
16786A0297343L72086J97506J78720K36985Q66544j21965O19245L30720L20117
16777A3297301O30122L25278L62047L64446O88433M09629O97924M13250Q70174
$$ y = [2936174, 2763798, 3237123, 3359579, 3389336, 3240394, 3478133, 3678921, 3464791, 3452761, 3703138, 3712623, 3871643, 3658855, 3652027, 3692085, 3861842, 3805982, 3542154, 3833494, 3932083, 4327698, 4491112, 4353444, 4515010, 4649072, 4846616, 4851470, 4796643, 5074983, 5177441, 5164305, 5439981, 5529143, 5334765, 5624350, 5827772, 5858837, 6047214, 6116933, 6347249, 6243673, 6288190, 6445259, 6885161, 7015015, 7170277, 7218861, 7405229, 7547783, 7576376, 8017236, 8194227, 8455003, 8281319, 8667770, 8695332, 9548548, 9273205, 9743544, 9778474, 10297343, 10669429, 10866935, 11045655, 11282640, 12149184, 12027219, 12646464, 12977184, 13297301, 13927423, 14252701, 14614748, 14979194, 15667627, 16077256, 16775180, 17188430, 18058604]
16768A8058604N31699N80695N82193R94831O45788R50024J055136J304134K12757
16759B4915861J689943J074888J107005J313108Q93682J460988J505462K264188
16751C6225125J749024J638192J711582K651140K393628K300767K837124L059761
16743E4566343L157525L354878L761988L995330L942562M176364N557040N383585
16735H7895615N475937O136252O471557O728687P219836P647738Q160932Q324763
16727A44061317Q473185Q651400Q183869P927252P829249P024483N970585M520241
16719B02641581L353675K026645M99175j053182k806505l710907n398886o088824
16711A89462772p551787p846755q167820q796755q485366q638405q369566p891057
$$ y = [18058604, 18590303, 19170998, 19753191, 20748022, 21393810, 22343834, 23398970, 24703104, 24915861, 26605804, 27680692, 28787697, 30100805, 30994487, 32455475, 33960937, 36225125, 37974149, 39612341, 41323923, 43975063, 46368691, 48669458, 51506582, 54566343, 57723868, 61078746, 64840734, 68836064, 72778626, 76954990, 82512030, 87895615, 93371552, 99507804, 105979361, 112708048, 119927884, 127575622, 135736554, 144061317, 152534502, 161185902, 169369771, 177297023, 185126272, 192150755, 198121340, 202641581, 205995256, 208021901, 208521076, 207467894, 204661389, 200950482, 195551596, 189462772, 181910985, 174064230, 165896410, 157099655, 148614289, 139975884, 131606318, 123715261]
16703A23715261p424557p476724o712243o408120n958936n499679n244751m736488
16695G4253763m429868m050359m170764l234582l751120k964900k820827k092791
16687D6738552k566282k548558k290743j722881j750446j657490j713113j284218
16679C1204821j597596j425994j321804j101943j063058r12007q21659j077414
16671B1883346o54600j052810q20159p05288o54015l79602q89273o38491l80153
16662A5708955p81052n61382l18836n04205k99212n27983k36773m04124l74002
16653A1701386k62792l71651o44755m13590k11334m93023L2625n9566n33520k49367
16643H494413k48683n2567n41939M09183n58265j00134j60732m54510J30664k68159
$$ y = [123715261, 116290704, 108813980, 102101737, 95693617, 89734681, 84235002, 78990251, 74253763, 69823895, 65773536, 61602772, 58368190, 54617070, 51652170, 48831343, 46738552, 44172270, 41623712, 39332969, 37610088, 35859642, 34202152, 32489039, 31204821, 29607225, 28181231, 26859427, 25757484, 24694426, 23782419, 22960760, 21883346, 21228746, 20175936, 19355777, 18650489, 17996474, 17616872, 16727599, 16089108, 15708955, 14927903, 14366521, 14047685, 13543480, 13244268, 12716285, 12479512, 12075388, 11701386, 11438594, 11066943, 10422188, 10008598, 9797264, 9304241, 9336866, 9277300, 8743780, 8494413, 8245730, 8193163, 7651224, 8060407, 7502142, 7402008, 7241276, 6786766, 6917430, 6649271]
16633F649271k57275j53308J10121O1079j32300p42223o5391k80070J66343j88044
16623E168203k18575j5931K49770k79874k00118o5390l05522J05145L1496q9066
16613D380138k17564k23460K85689j19608j9421k98205j36559L1791j42824J18438
16603C658415n82627K26800j08047L0389j50728l22365L59998j96017k47344L54462
16593C022936k6180j47675k36207L9760l06447M28599k7908j36789k27620O2295
16583B444764M03446J7580o64535K50594m51933M21839l89951K09327k68400L49034
16573B321765m04229j64768N53749n00283J19776O3967L3066M2724l86608K58756
16563A937915r058k25167K1714k5234j78109M7896J58243J89390n02159K98090
$$ y = [6649271, 6391996, 6238688, 6348809, 6409888, 6277588, 5535365, 5469974, 5189904, 5356247, 5168203, 4949628, 4933697, 5183467, 4903593, 4703475, 4638085, 4332563, 4437708, 4469204, 4380138, 4162574, 3939114, 4224803, 4105195, 4085774, 3787569, 3651010, 3682801, 3539977, 3658415, 3075788, 3302588, 3194541, 3224930, 3074202, 2751837, 3111835, 2915818, 2668474, 3022936, 2996756, 2849081, 2612874, 2652634, 2346187, 2774786, 2746878, 2610089, 2382469, 2444764, 2848210, 2865790, 2201255, 2451849, 1999916, 2421755, 2031804, 2241131, 1972731, 2321765, 1917536, 1752768, 2306517, 1806234, 1926010, 1989977, 2023043, 2065767, 1679159, 1937915, 1928857, 1703690, 1725404, 1700170, 1522061, 1569957, 1728200, 1917590, 1415431, 1713521]
16553A713521o4824l05056J25695J9417j46244L53570j42037J27047k06356r8275
16543A376458J55158k45926L05409m70657K91425R072M7552j19824k52898L63191
16533A458960M7415m10809R1160k497l019J26903M1300R5462j35690l8614j54673
16522A115898K02675j19448m17061K15839j8280j42447K29359j78747L66286l47106
16512I06968M32096m36003k40568K87612j53492k22403N46763m34591L43643J1834
16502A041859k1019K23116k08116j90512j2962k34433L31014k16195K61115Q953
16492I82820j34475J44951l70982m169L30914l31013M0598K19390M2666l22106
16482E98594B98154M10636M5097N7n3023L02730q4180J9772k34281k08553K60774
$$ y = [1713521, 1648697, 1343641, 1469336, 1488753, 1342509, 1696079, 1554042, 1681089, 1474733, 1376458, 1531616, 1285690, 1591099, 1120442, 1411867, 1420939, 1468491, 1348667, 1095769, 1458960, 1506375, 1095566, 1186726, 1184229, 1181210, 1308113, 1349413, 1444875, 1309185, 1270571, 1115898, 1318573, 1199125, 782064, 997903, 979623, 837176, 1066535, 887788, 1254074, 906968, 1339064, 903061, 662493, 950105, 796613, 574210, 1120973, 686382, 1030025, 1041859, 1020840, 1243956, 1035840, 845328, 832366, 597933, 928947, 712752, 973867, 982820, 848345, 993296, 622314, 618145, 949059, 618046, 658644, 878034, 920700, 598594, 298154, 708790, 753887, 753944, 700921, 1003651, 919471, 939243, 704962, 496409, 757183]
16471G57183j88763M1726j8371J55813j8135j93857N8485A33837N26614l031j02510
16460E54910j45054J05780R7012j11709J16982j48901j6006j41307J62177J01240
16450E75124N1130j04334J37301B55348N35179K8250k55014A60130M94558c2671
16439D50981Q6851L30931m9357l36025J44667j592A03624L25316P1493j04794
16429C95639K38115k52009K05816l7750j41545J91603j42978j66835M462K3611
16419C18129L59433k77015J44447k51690L33562j98984A99559O3829J44238O3433
16409D71059k17469j2752N34967A94984O4192j09124o7003J68622K09447P5175
16399E36293p4595l8851K5666m9423j44847K4791O2748n9608j4402K74536A57474
$$ y = [757183, 568420, 610146, 591775, 747588, 729453, 535596, 594081, 133837, 660451, 657420, 554910, 409856, 515636, 612648, 500939, 617921, 469020, 453014, 311707, 473884, 575124, 626254, 521920, 659221, 255348, 790527, 818777, 563763, 160130, 654688, -32671, 450981, 537832, 868763, 819406, 483381, 628048, 626456, 103624, 428940, 500433, 395639, 633754, 381745, 587561, 549811, 408266, 599869, 456891, 290056, 294518, 318129, 677562, 400547, 544994, 293304, 626866, 427882, 199559, 263388, 407626, 471059, 253590, 240838, 775805, 194984, 259176, 150052, 83049, 251671, 461118, 536293, 461698, 422847, 448513, 399090, 254243, 279034, 341782, 282174, 267772, 542308, 157474]
16387F05473B23594k1793J70560A27180C8158N60497l4622B39271D0165K33558
16377B73723o2916J0298K82403j02097j95686K26920j21611j54069K60958q7610
16367C30313A45865M22343n6603A70790K40978F8140J21741K05390A84610R6501
16357B81111j06555P4009J37932j47786e8317D50040D4890i5247C64245A23590
16346B74657J99477B06525K27278a20826B41548q8213J29591J10718j12265R63
16336B82342N0817C140K61728M6104A25577e0329C72547p0500J34339J42720j37467
16325D41639L907H4396K03678L03429k65157C9539L36068j4875m3687J40099L7708
16314D94852A68176J05422d5664A17096K78276A29964J29686P1383H0126K31370
$$ y = [605473, 223594, 201801, 372361, 127180, 38158, 598655, 564033, 239271, 40165, 273723, 210807, 221105, 503508, 401411, 205725, 432645, 311034, 156965, 417923, 330313, 145865, 568208, 511605, 170790, 411768, 68140, 189881, 395271, 184610, 281111, 174556, 248565, 386497, 238711, -58317, 450040, 44890, -95247, 364245, 123590, 274657, 474134, 206525, 433803, -120826, 241548, 153335, 282926, 393644, 281379, 282342, 333159, 3140, 264868, 310972, 125577, -50329, 372547, 302047, 436386, 579106, 441639, 445546, 84396, 288074, 591503, 326346, 39539, 375607, 360732, 317045, 457144, 494852, 168176, 273598, -45664, 117096, 395372, 129964, 259650, 331033, 80126, 311496]
16304C11496J7978A22846J24338J79927G6524J74051q0822a27274L2582D88148
16293B90337D0523b6786A71615K83769A87585E2563L34143A25224J22760N1460
16283B99444n9887A0320J71496K05269f8188A93354e9601I1695M2879L24813h6
16271E40749j86104j46612o6616J8468J50970A06453K06041j31024o1006j8345
16261A02119i9353H1097a09550L2784I659P3575a2444p8093A82537K8633k9183
16250A81987M7028j05945g3828K1998A76783R9197a21639E3626Q5647F8540C3687
16238B611Q3851k546L25797q5964p209H2169K99974d7536A91085d4929n1036A85007
16225h0623p2963E8975O361a17179j13933B27852a18894A87277b35628A90877
$$ y = [311496, 329474, 122846, 247184, 427111, 76524, 250575, 169753, -127274, -94692, 488148, 290337, 40523, -26786, 171615, 455384, 187585, 52563, 386706, 125224, 247984, 299444, 239557, 10320, 181816, 387085, -68188, 193354, -59601, 91695, 134574, 459387, -86, 540749, 354645, 208033, 141417, 159885, 310855, 106453, 312494, 181470, 120464, 102119, -99353, 81097, -109550, -76766, 9659, 83234, -12444, -90537, 182537, 211170, 181987, 229015, 123070, -73828, -51830, 176783, 275980, -121639, 53626, 139273, 68540, 33687, 2611, 86462, 83916, 409713, 323749, 316540, 82169, 382143, -47536, 191085, -44929, -95965, 185007, -80623, -153586, 58975, 65336, -117179, -231112, 227852, -118894, 187277, -235628, 190877]
16214a0563A75839d1235r2096A34125a1969B35921J48909p377g0906B9592J53667
16203A83259a55692B68465a57701A17442K16818j29112M0155e2650j7032k3146
16193i2828A92796J53223A67624J37832a37644b9041m6154A10197K6494l5973
16183A00718K47214a3674A57196L3430N5194A10330A1701a20893k8661A50247
16172C26769c3617j57863B59022l3475n721O5799a55294a7890k7679C01463b33349
16160A1330c4795B33356j05625Q6182b4026E5056J17617a26367M0474B01708i1800
16148h4334d1857l4963c6613C817K4614J00271b73259I3500j6135K4492a0992
16136A38417b54478b4974D3168a20800b4318F4627a55154A13942J11548A01517
$$ y = [-10563, 175839, -41235, -133331, 134125, -11969, 235921, 384830, 377453, -70906, 29592, 183259, -155692, 268465, -157701, 117442, 334260, 205148, 245303, -52650, -69682, -92828, 192796, 346019, 167624, 305456, -137644, -29041, -75195, 110197, 136691, 100718, 347932, -13674, 157196, 190626, 245820, 110330, 11701, -120893, -149554, 150247, 326769, -33617, -191480, 259022, 225547, 219826, 285625, -155294, -17890, -45569, 301463, -233349, 11330, -34795, 233356, 127731, 213913, -24026, 55056, 172673, -126367, -85893, 201708, -91800, -84334, -41857, -76820, -36613, 3817, 28431, 128702, -273259, 93500, 77365, 101857, -10992, 138417, -254478, -24974, 43168, -120800, -24318, 64627, -155154, 113942, 225490, 101517]
16125A38161C6427a00777K2019c859C23684a51879K3032A58026L01651a35297
16114A06277a89282g5976o4854C6196J53699p5280n4485f68k8751E39420b63908
16102I9656J20638o18h5319A73146e7447C1312J79865b56364f4757j84823E9353
16090a66206a6326j54721C19065A12026Q0545F8403a1888l91496g3205H1444L4838
16079A16282J5622c11953h5685B04181o3686F1033a47587C4702A6814b68543A15257
16067I7948J05923b73026f3056B2888K49310a86600B24469A8027J2889L2419b8946
16055a92308g4773A44038R0718f6686A22157a3493A97484d0165j40255A59532
16044i8080j6713I3392J00896n9228a42392j4716A81471J3080g1704A14329K8195
$$ y = [138161, 36427, -100777, -78758, -3859, 323684, -151879, -128847, 158026, 459677, -135297, 106277, -189282, -75976, -140830, 36196, 189895, 114615, 60130, -668, -29419, 539420, -263908, 99656, 220294, 219676, -85319, 173146, -57447, 31312, 211177, -256364, -64757, -249580, 59353, -166206, -16326, -171047, 319065, 112026, 192571, 68403, -11888, -403384, -73205, 81444, 116282, 131904, -311953, -85685, 204181, 140495, 61033, -147587, 34702, 16814, -268543, 115257, 97948, 203871, -273026, -63056, 22888, 272198, -186600, 224469, 18027, 30916, 63335, -28946, -192308, -74773, 144038, 234756, -66686, 122157, -13493, 197484, -40165, -180420, 159532, -98080, -114793, 93392, 194288, 135060, -142392, -157108, 181471, 194551, -71704, 114329, 142524]
16033A42524a1743j81890C7423c33402B5925M3783K59230i5663A88436d4980C21314
16021B7288a75484b8002m4666j17794B66494h6299j54199J17249r795e4483j76790
16010b31273m0075K9272B32671b40706L3973i1686B09046a21295l6262G6142P1577
15999A47719c1403E4636J50682h4107O853C0847b49925J04908e0106r1743d9397
15987A10420j232P9620N1983a79574C54902n7735q2190K23392A06080a56453B35837
15975A59432f1600k5008H361L415K13872a86064C6452a63425B49247c74389J52428
15964b21961B7266i6904B42170n8799H0050a78733a6913k6598k1440j47830f5946
15952B43725H9056d0378q3034L0449B1745J82534a64024N8203d991H8512m2444
$$ y = [142524, -11743, -193633, 37423, -333402, 25925, 69708, 328938, -95663, 188436, -44980, 321314, 27288, -175484, -28002, -72668, -190462, 266494, -86299, -240498, -123249, -133044, -54483, -231273, -271348, -242076, 232671, -240706, -206733, -91686, 209046, -121295, -157557, 76142, 147719, -31403, 54636, 205318, -84107, -77254, 30847, -249925, -145017, -50106, -141849, -49397, 110420, 109188, 188808, 240791, -179574, 354902, 297167, 214977, 438369, 106080, -156453, 235837, 159432, -61600, -86608, 8361, 11776, 225648, -186064, 36452, -163425, 249247, -374389, -221961, 27266, -96904, 242170, 183371, 80050, -178733, -16913, -43511, -64951, -212781, -65946, 243725, 89056, -40378, -123412, -92963, 21745, 204279, -164024, -105821, -4991, 88512, 46068]
15941D6068j7902a36277j0750f2731j27088M8508j9516a4100l44913j66824a89821
15929a47521k3940C64052D6635b70277a7551m9486D61749C8745Q677b80036C11454
15917b15781r1798A01829a55947p8332A08051c22779a25336c3579k37359k0699
15907b91637l2420a28224p361d4854j31751G2013c57308A07552R7524I1909f3662
15895H5945e9480l13800G9916L1662h9199j8150A05108Q3365H4849d75140b04849
15883C18418c10223d4880j12007A6056a31992A23744a04259D8815L1007a65214
15872c2576q5801k8911j38159A53650m6425Q4231b24949A15544J49155a90506
15861a09193M591M8709D7079J09125a32811B12374G3399b50172J11808m2927r3263
$$ y = [46068, 28166, -136277, -147027, -62731, -189819, -141311, -160827, -14100, -359013, -525837, -189821, -147521, -171461, 364052, 46635, -270277, -17551, -67037, 461749, 38745, 47422, -280036, 311454, -215781, -307579, 101829, -155947, -234279, 108051, -322779, -125336, -33579, -270938, -291637, -324057, -128224, -135585, -44854, -176605, 72013, -357308, 107552, 205076, 91909, -63662, 85945, -59480, -373280, 79916, 111578, -89199, -107349, 105108, 188473, 84849, -475140, -204849, 318418, -310223, -44880, -156887, 16056, -131992, 123744, -104259, 48815, 79822, -165214, -32576, -118377, -147288, -285447, 153650, 107225, 191456, -224949, 115544, 264699, -190506, -109193, -104602, -55893, 47079, 156204, -132811, 212374, 73399, -250172, -138364, -181291, -274554]
15850b74554j9935a07184A81496a64724B09658b51192c3533c701m24486G5226
15839I6075a59912A5786a8048q8768k2485A06965E06c7110k04707h0641q1034
15828a61675B41297b19128R3837A23023a71117J3512G743i6976A41189l3199c49855
15816b81735h4808n8698A53765b5127A51381D9631b3561k14910d5275A80352g003
15804e19607B64359f5230C6022J53944b33129J9937D44008d76999b17232c3553
15793g5601D3525J64490o6008g6359m7696A54177j8051b41552i3640J4556C7723
15781a57569A21352J66678A4324b02385A42143c88595h6174A18703a91635K2247
15771a69388j55159g7966K8257m7440H6922m0997b37845J14657B82509i768B0741
$$ y = [-274554, -294489, -107184, 181496, -164724, 209658, -251192, -33533, -3701, -428187, 75226, 96075, -159912, 15786, -18048, -106816, -129301, 106965, 506, -37110, -241817, -80641, -161675, 241297, -219128, -125291, 123023, -171117, -157605, 7743, -96976, 141189, 107990, -349855, -281735, -84808, -143506, 153765, -25127, 151381, 49631, -23561, -238471, -45275, 180352, -7003, -519607, 264359, -65230, 36022, 189966, -233129, -213192, 444008, -476999, -217232, -33553, -75601, 43525, 208015, 142007, -76359, -124055, 154177, 136126, -241552, -93640, -79084, 37723, -157569, 121352, 288030, 14324, -202385, 142143, -388595, -86174, 118703, -191635, -169388, -324547, -77966, -49709, -97149, 86922, 45925, -237845, -123188, 282509, -9768, 20741]
15759A5333f2668j42568N9435B53374A00483L4230c92580H5327A7924K52799a33817
15747B4834i6992j12760i7686L4624J4711B14074j470A7512b02452E0693J93879
15736B44572c85243G2745N0655a1818n7043o4376B84495h1240A58528c55819i1895
15724a63694G4076a12861j19254E0b43396g7440B0410J22658A3260J50272i0159
15712a73180o6732D4953M1773K6558d3919B19255a09450a0283B00535f7622A03772
15700a02271p9103h8528B1180J42003G7435a98410A51205a25257D165a20650B23640
15688H5612c7866j84822A03248A0353Q6931e3277I6109b14615C8042b08800a7042
15676e865p1620n7756N7967R715B45608g114k3353r1315B3449L5973O8250b2751
$$ y = [15333, -62668, -205236, -145801, 253374, 100483, 134713, -392580, 85327, 17924, 270723, -133817, 24834, -96992, -209752, -97686, -63062, -48351, 214074, 212604, 17512, -202452, 50693, 244572, -385243, 72745, 123400, -11818, -68861, -133237, 284495, -81240, 158528, -355819, -91895, -163694, 74076, -112861, -232115, 50, -243396, -77440, 20410, 143068, 13260, 163532, -90159, -173180, -239912, 44953, 86726, 113284, -43919, 219255, -109450, -10283, 200535, -67622, 103772, -102271, -181374, -88528, 21180, 163183, 77435, -198410, 151205, -125257, 4165, -120650, 223640, 85612, -37866, -222688, 103248, 10353, 97284, -53277, 96109, -214615, 38042, -208800, -17042, -5865, -77485, -135241, -77274, -67559, 245608, -7114, -30467, -121782, 23449, 59422, 127672, -22751]
15663A55949E0723a35382q6891j74558A87546g8575B9821a99524F9336i0540k87552
15652c78092b9946A27798a03974A32496b568A1976a02994A64498b46014R9027
15642a46987G749b91411R8589I0085c02911i6687r8275l8153P601j24790a44363
15630d6105o4233b9974k14510J3008H4915i9236c2172j35044P9161B17283a47267
15618a41493m584O0732b796r6090A69588n9165a09794G7897b64671A61638b1305
15606b86176A29376a79066m4632Q7376n2201m5475J14997C05425a02390J9253
15596h3137m4557C5248R0417k9549J42313a06096b5227k24233Q1986k02710A64770
15584a76601g5143c3926B8470J74856a04325l28526E1399b1378j4746m5055k40416
$$ y = [155949, 50723, -135382, -222273, -396831, 187546, -78575, 29821, -199524, 69336, -90540, -378092, -29946, 127798, -103974, 132496, -2568, 11976, -102994, 164498, -246014, -146987, 7749, -291411, -192822, 90085, -302911, -96687, -194962, -233115, -225514, -350304, -144363, -46105, -110338, -29974, -244484, -231476, 84915, -99236, -32172, -167216, -88055, 217283, -147267, -141493, -146077, -85345, -2796, -98886, 169588, 110423, -109794, 77897, -264671, 161638, -21305, -286176, 129376, -179066, -223698, -136322, -188523, -233998, -119001, 305425, -102390, -83137, -127694, 35248, 125665, 96116, 238429, -106096, -25227, -249460, -167474, -370184, 164770, -176601, -75143, -33926, 28470, 203326, -104325, -432851, 51399, -21378, -36124, -81179, -321595]
15573c21595R7710o4536i8720j66056F3950a96890e9595A54756a79013C03462
15562b02929A31569C3977a23920C16614a387F974f4282G4917i5714D76607b01310
15550a3769C2653a16417A57866b26631P8838j4091j312A11504J05753H1037J4538
15539I5575k4094b7611n1179A03064a15575j56533a15899M2232A04766C3449B09
15527a38631a2030E6980O9469K27491F4700a2346n6087K2893r4743B13230g2003
15515h7892C39963A22601b08706A93499m0449F9825L7846O8370D181M17169A82322
15503C26584A9147J37381e3542r9762D77004A33315J3418P622b506A03605b35416
15491B31352D8313j9317J2322K3229B9640J33827a12452A4298J58433m6068a55811
$$ y = [-321595, -223885, -288421, -98720, -264776, 63950, -196890, -59595, 154756, -179013, 303462, -202929, 131569, 33977, -123920, 316614, -1387, 6974, -64282, 74917, -95714, 476607, -201310, -13769, 32653, -116417, 157866, -226631, -147793, -161884, -163196, 111504, 217257, 81037, 95575, 71481, -27611, -78790, 103064, -115575, -272108, -115899, -73667, 104766, 33449, 209, -138631, -12030, 56980, 126449, 353940, 64700, -12346, -68433, -45540, -140283, 213230, -72003, -87892, 339963, 122601, -208706, 193499, 153050, 69825, 107671, 176041, 4181, 421350, 182322, 326584, 19147, 156528, -53542, -153304, 477004, 133315, 146733, 154355, -2506, 103605, -235416, 231352, 48313, 28996, 41318, 64547, 29640, 163467, -112452, 14298, 172731, 126663, -155811]
15479c04523A60539i144j29992F8694a876q3667G9166J5360g233q5114c4208A84881
15466B57114g0623k43515d471l3885e9j65655j04769D25217j46862a41278B2857
15454H7159M4722g0426d445A15150b32736p0545h783l05261F321h4734j67827
15443b52561A36930c10875J7924a12448A71602b01813n4964j6054e088k08146
15433b13234A10885F288J1053b84516P9339C42790k6344r7893j06095j1758b93359
15421B03896C1864Q442a28041B65705C6886J31475N7213B5992f6628C62977A02451
15409I6326K7406a75148j05390G4561a90388d6591R539p5243k43399a65978P2130
15398i3848d6266j12613k02855J64502B58379b31849R1562o5572A37834b08313
$$ y = [-304523, 160539, -9144, -139136, 68694, -1876, -85543, 79166, 94526, -7233, -92347, -34208, 184881, 257114, -70623, -314138, -4471, -38356, -59, -165714, -270483, 425217, 278355, -141278, 22857, 87159, 131881, -70426, -4445, 115150, -232736, -303281, -8783, -314044, 6321, -84734, -252561, 136930, -310875, -292951, -112448, 171602, -201813, -256777, -272831, -5088, -213234, 110885, 6288, 17341, -284516, -205177, 342790, 316446, 218553, 112458, 100700, -293359, 203896, 31864, 40306, -128041, 265705, 36886, 168361, 225574, 25992, -66628, 362977, 102451, 96326, 123732, -175148, -280538, 74561, -190388, -46591, -37052, -112295, -355694, -165978, -93848, -46266, -158879, -361734, -197232, 258379, -231849, -140287, -205859, 137834, -208313]
15387B00979d1726m1015k50903g0696a2637A2696K03231f6452B1288a6874C15331
15375b92778j0474B30444r2474A5978c681I4288L655h688n86B75482c81960E161
15362a57706A86268J76847i9441A77843j2188a56347H5617a97119F0200J1695
15352G1895K0504a05107A49158I003O2677e0062A43934b64749k4343P444B49367
15340C84792C7945M3137B010J01731b927m9348A64639i8630j1172B79271L5394
15329C14665q8028d6454D2009b69866J08042f5408A24551E9629J09181g8021H966
15317G390c9030p4606o7565f3544B31034n8883o3817L8966b32017G7295J0586
15306H7881b52348J04175E79Q2617L7859c39111A20015B9081i6759E2922a03395
$$ y = [200979, -41726, -82741, -333644, -70696, -12637, 12696, 215927, -66452, 21288, -16874, 315331, -292778, -303252, 230444, 137970, 15978, -3681, 94288, 97943, -8688, -9274, 275482, -381960, 5161, -157706, 186268, 363115, -99441, 177843, 165655, -156347, 85617, -197119, 60200, 71895, 92399, -105107, 149158, 9003, 71680, -50062, 143934, -264749, -289092, -281648, 249367, 384792, 37945, 81082, 2010, 103741, -2927, -52275, 164639, -98630, -109802, 279271, 314665, 226637, -46454, 42009, -269866, -161824, -65408, 124551, 59629, 168810, -78021, 8966, 7390, -39030, -113636, -181201, -63544, 231034, 172151, 108334, 147300, -232017, 77295, 87881, -252348, -148173, 579, 83196, 121055, -339111, 120015, 29081, -96759, 52922, -103395]
15294b19511C80687A03515f201o508A94345n8708f2717p7976K5843H6000a10144
15282A39580d337j37591A1927J6292R5548a82096j3351A64951h384j53538D7129
15270E1041K6012K34625G2861B4733L01485A15015n5008J26322B1253a68452A86040
15258C18464D5719J29681L0589L61315A27910m4935M08851B28436l2294k6046
15248A70096P02771J042084M19354p45930P30308j135674m49618A89500k8534
15239A60966D8156K10240c2870A32557K4264b221G9661b0614B52041i7022K4728
15228g2294p890H32J1237J18370j0046R8270j08040k0207L9136C995g6901p7062
15216a53963c8411N504A43875L6128B6252h5382A72989d3367A89389b04134P0408
$$ y = [-219511, 380687, 103515, -6201, -12709, 194345, 135637, -62717, -140693, -114850, 86000, -110144, 139580, -4337, -141928, 11927, 28219, 123767, -182096, -195447, 164951, -8384, -161922, 47129, 51041, 77053, 311678, 72861, 24733, 326218, 115015, 60007, 186329, 21253, -168452, 186040, 318464, 45719, 175400, 205989, 567304, 127910, 82975, 491826, 228436, 196142, 170096, 872867, 1914951, 2334305, 1588375, 2318683, 1183009, 733391, 189500, 160966, 48156, 258396, -32870, 132557, 156821, -2221, 79661, -20614, 252041, -97022, -72294, -80184, 832, 12069, 130439, 120393, 218663, 110623, 90416, 129552, 3995, -76901, -153963, -38411, -32907, 143875, 180003, 26252, -85382, 172989, -43367, 189389, -204134, -133726]
15205a33726r2419A73197m0775K10147g3786j87996B66455a92015d5722C58366
15194a00219H6781M01920j79996q0963f9444R82G8713c09269c1670q247r7511
15183a37428C50594b11278B8694M6173l0749d0161B29731j9891k7370e6126C6616
15171A34315a74662A73923b02439N9039C41142K6234f0975A70802K7450m9640
15161A48612Q0772M3900Q6400A11778D7450i930A33392A9035O7312a24097A34688
15149A00027a43526C6676K9840k9643j8293L00982A62a60358e4112H6177J96815
15138B82992D3291o337l538a3104A69002b5907C22429k0124a30543A87796G5558
15126A01163a0226A64321J64571A05954Q9286J49112R891p7268H4985l7329A2388
$$ y = [-133726, -226145, 173197, 132422, 342569, -73786, -261782, 266455, -192015, -45722, 358366, -100219, 86781, 488701, 308705, 227742, -69444, -68462, 78713, -309269, -31670, -39917, -137428, 350594, -211278, 28694, 74867, 44118, -40161, 229731, 209840, 182470, -56126, 36616, 134315, -174662, 173923, -202439, -143400, 341142, 367376, -60975, 170802, 198252, 148612, 229384, 273284, 359684, 111778, 47450, -9930, 133392, 19035, 86347, -124097, 134688, 100027, -143526, 36676, 66516, 36873, 18580, 319562, 162, -160358, -54112, 86177, 282992, 43291, 36954, 33416, -13104, 169002, -25907, 322429, 302305, -130543, 187796, 75558, 101163, -10226, 164321, 328892, 105954, 195240, 344352, 354243, 276975, 84985, 47656, 12388]
15114A86078J66324j45248J11950a26331E07880A19983D347M3062J34737N6244
15104B38390q4747K34111j75351m0413H2787g1266H6907K27321A09383a52626
15093b24851C12730i9309A70394J49767n2082i7084p174E641f2750N245C89897
15081A78558m9799a46008A82959b4034B25765n3r7273J9088p1758L62880h2757
15069B95214b78745B00416Q759h3890A94068C6202K19133g7969A7680B12M55437
15058D55649a6814C31936F9926J68445G8371R5118N5154a01704j69841d6584A153
15046I3461b7192A72923j8918J057P9316B50K59766L5777M8692D2164K56728A11620
15033B56680N186f5518B92042p9577K5752j04273a09662A56911K73625L6409A88156
$$ y = [186078, 352402, 207154, 319104, -126331, 507880, 119983, 4347, 47409, 182146, 238390, 153643, 387754, 212403, 171990, 82787, -71266, 86907, 314228, 109383, -152626, -224851, 312730, -99309, 170394, 320161, 268079, -97084, -104258, 5641, -62750, -57505, 389897, 178558, 128759, -146008, 182959, -24034, 225765, 225712, 128439, 147527, 75769, 438649, -82757, 295214, -278745, 200416, 209175, -83890, 194068, 36202, 255335, -77969, 17680, 212, 455649, -16814, 331936, 69926, 238371, 78371, 173489, 228643, -101704, -271545, -46584, 1153, 93461, -27192, 172923, 154005, 155062, 234378, 250, 260016, 295793, 344485, 42164, 298892, 111620, 256680, 261866, -65518, 292042, 212465, 238217, 133944, -109662, 156911, 430536, 466945, 188156]
15021I2530Q7459Q1982q4568n6128M83462A72793i3814m4809C61981i0684A1124
15009C20320D4588K97614b13516Q5235F7571K22515M3954j13283j09980K03716
14999C14493j45063J20149P1744i4511B0111L57966b2950C19290j9770J05346
14989D04866l2403p2359p0711Q1680n7347I3175B7328L45886g544C67077m915
14978C62162A09507K68866K6298R5535j61063j58493L6812B9594K83580o4064
14968B49110J82217A48589L8190N4999G4951k1284J29710K1566J34944m2573F0875
14956A23093J93900j7794J05220C1823I088K74590o0446r4977a9891A60570L61743
14945E22313A07503e7506I9527L05725A88123e880F56469C0094M13759A29188
$$ y = [92530, 179989, 261971, 177403, 121275, 604737, 172793, -93814, -138623, 361981, -90684, 11124, 320320, 44588, 342202, -213516, -128281, 67571, 290086, 334040, 220757, 110777, 314493, 169430, 289579, 361323, -94511, 20111, 378077, -22950, 319290, 299520, 404866, 372463, 300104, 229393, 311073, 253726, 93175, 27328, 373214, -7544, 367077, 362162, 109507, 378373, 404671, 500206, 339143, 180650, 217462, 29594, 313174, 249110, 431327, 148589, 186779, 241778, 74951, 53667, 183377, 204943, 339887, 297314, 60875, 123093, 316993, 299199, 404419, 31823, 9088, 283678, 223232, 128255, -19891, 160570, 522313, 107503, -57506, 99527, 405252, 188123, -5880, 656469, 30094, 443853, 129188]
14934A49172A1546J39650P9888r6362L89013G7281a65462B61609o3767L81422
14924E79264p9023j48672j69707B691N8223L07157A4811J87246K17889I8967J86033
14913B85000l5571J21872M103Q9846J575j67643I3951J74099L04135o4960M0539
14902E47764A97240L8001J54676Q0036k22088K30070A86234J78566M742j00290
14892B69252J86016j37391J72594A07473L78904B13138J87614A80044J07134A02584
14881E8875M50356B33261J90406J29283A85277K27292j35555k3998J14220J68652
14871E35888m9326j69351L36544k86169J36665j47235p8179J78498P2783N9715
14861E89833B3002J99711K26139k13058J6424A13428Q9755J79419j83586C2655
$$ y = [149172, 11546, 151196, 231084, 134722, 523735, 77281, -165462, 261609, 197842, 579264, 500241, 351569, 181862, 2691, 60914, 368071, 14811, 202057, 419946, 98967, 285000, 249429, 371301, 375404, 465250, 466825, 299182, 93951, 268050, 572185, 507225, 547764, 197240, 235241, 389917, 469953, 247865, 477935, 186234, 364800, 369542, 269252, 455268, 317877, 490471, 107473, 486377, 213138, 400752, 180044, 287178, 102584, 58875, 509231, 233261, 423667, 552950, 185277, 412569, 277014, 253016, 367236, 535888, 486562, 317211, 653755, 367586, 504251, 357016, 278837, 457335, 530118, 589833, 23002, 222713, 448852, 235794, 252218, 113428, 203183, 382602, 199016, 32655]
14850D58458k9618j35686L71020k39307J51123A68937L31463K08568k16808R1086
14840E83246k58854L42588k47391A87450L01653o0446M0890k08329L83080k82964
14830C61334K67492A70486L73826k37652M5164K57921B67975J53441J55918B66442
14819B97275f625G15745j23363j91361J20699n0603J15838n3655J13500k64484
14809C82316J66326k05962J08469K70101j84972J58232k05492J9995o4875j62253
14799B81885L73780K10149C81609K78230k17742K33090j47219Q7080p4244k55456
14789B85348L08903k1316n1011J65933K36243l18597r3795j28556J28128B10857
14778F61638B16596L14149m2556J57962C03167J83250K40803j80547J04014r3173
$$ y = [458458, 428840, 293154, 664174, 424867, 575990, 168937, 500400, 708968, 492160, 583246, 324392, 666980, 419589, 187450, 489103, 428657, 469547, 261218, 644298, 361334, 628826, 170486, 544312, 306660, 351824, 609745, 267975, 421416, 577334, 266442, 297275, -6625, 715745, 592382, 401021, 521720, 471117, 586955, 533300, 646800, 382316, 548642, 342680, 451149, 721250, 536278, 694510, 489018, 509013, 444138, 281885, 655665, 865814, 381609, 659839, 442097, 675187, 527968, 615048, 540804, 285348, 594251, 572935, 521924, 687857, 924100, 605503, 511708, 383152, 511280, 210857, 661638, 216596, 530745, 488189, 646151, 303167, 486417, 727220, 546673, 650687, 557514]
14768E57514J57844R066j27558J5159j42001K19092K03661l23365J97090j33587
14758F32915k44549J44316Q3944O2946o6367L49114C66583K33464J12396j53973
14748E58470L92484k13742N0902J87l11683K13807M3257K80155m95544M71663
14738I89956k12841K7344C57325M33446M9935j63010j73173K57283q5387j21974
14728E54445j57416O53834l09943l21195N55114k00157j52345L47658k31695K17808
14718I56108r4428k02371R1765J16975j62487n2298K03867N9134m18728L02694
14708H00231N1770J49659m00427L79730m59903J47627J77559J17022k88566J72088
14698H46790j81814K37268j36952j22953J84581K52795j23805j78481L75685j36535
$$ y = [557514, 715358, 724424, 596866, 612025, 470024, 689116, 892777, 569412, 766502, 632915, 388366, 532682, 616626, 679572, 613205, 962319, 366583, 600047, 712443, 558470, 950954, 737212, 788114, 788301, 476618, 690425, 733682, 1013837, 518293, 989956, 777115, 804459, 357325, 790771, 840706, 677696, 504523, 761806, 676419, 554445, 397029, 1050863, 740920, 419725, 974839, 774682, 622337, 969995, 738300, 956108, 861680, 659309, 751074, 868049, 705562, 653264, 857131, 916265, 497537, 800231, 852001, 1001660, 601233, 980963, 521060, 668687, 846246, 963268, 674702, 846790, 664976, 902244, 765292, 642339, 826920, 1079715, 955910, 777429, 1153114, 1016579]
14688A016579n8862L10304o3151k31153q6423L77917k09514j93883L47964j73476
14678A036302k19129L6004j14613j37330J29268J1286J50279J73083r398J3410
14668A069162q3029Q0420k885q4691Q3314k72399M02728q6308L26976k15130J12862
14657A331020k22160Q8160k1598o2213j27289L60728j20963P7233k84021l8128
14647I80769l6892Q394J89670K21610J10149k11114j2995k02877O17482l26710
14637A337486q844J02502l38957M14803k39717p7004K76962o6052M3424o9603
14627A375000n9452K38008p4589k23241M82211j23449j20428j20079N7947k2616
14617A409312L21345k37231P3080j07788j56875l6081K45250J50212k85852L2830
$$ y = [1016579, 957717, 1268021, 1204870, 973717, 887294, 1265211, 1055697, 861814, 1209778, 1036302, 817173, 853177, 738564, 601234, 730502, 741788, 892067, 1065150, 1055752, 1069162, 986133, 1066553, 1063668, 978977, 1062291, 789892, 1192620, 1106312, 1433288, 1218158, 1331020, 1108860, 1197020, 1175422, 1113209, 985920, 1346648, 1225685, 1302918, 1018897, 980769, 943877, 952271, 1141941, 1363551, 1473700, 1262586, 1249591, 1046714, 1664196, 1337486, 1328642, 1431144, 1092187, 1506990, 1267273, 1190269, 1467231, 1401179, 1444603, 1375000, 1315548, 1553556, 1478967, 1255726, 1737937, 1614488, 1494060, 1373981, 1431928, 1409312, 1730657, 1493426, 1566506, 1458718, 1301843, 1265762, 1511012, 1661224, 1375372, 1408202]
14607A408202j71424J87443L27802k11143L2619K47299k35800M47718k35649k96908
14597A500159K03253J91478j65823r7776J76560J54387o5886J72118j49032o5478
14587A853960K0180q8818J33782K77756j46859k65172L20178P6267l5263k6133
14577B119878L00324k02928J48593k72136J1514O1519p5976R8360j43240M41938
14567B487846K34109o1482j76752J88575k50524O8857J76581R5815J01573k38276
14557B626322J40059O78915r1106K76903L37265P29161Q81296Q45521K256314
14548H680650M549732Q327174J5193683K214940j8499316r230315j320966m446992
14540E468590k293839p02329k42217l03841L56236l8809l66223K48516k7176K60654
$$ y = [1408202, 1236778, 1424221, 1752023, 1540880, 1573499, 1820798, 1584998, 2032716, 1797067, 1500159, 1703412, 1894890, 1729067, 1631291, 1807851, 1962238, 1896352, 2068470, 1919438, 1853960, 1874140, 1785322, 1919104, 2196860, 2050001, 1784829, 2105007, 2181274, 2146011, 2119878, 2420202, 2217274, 2365867, 2093731, 2105245, 2166764, 2090788, 2189148, 2045908, 2487846, 2721955, 2660473, 2483721, 2672296, 2421772, 2490629, 2667210, 2763025, 2864598, 2626322, 2766381, 3445296, 3354190, 3631093, 3968358, 4697519, 5578815, 6424336, 8680650, 13230382, 21557556, 36751239, 38966179, 20466863, 11236548, 9915582, 5468590, 3174751, 2472422, 2230205, 1926364, 2282600, 2243791, 1877568, 2126084, 2098908, 2359562]
14530B359562j55501k67794K34046j8275q1624J87597k4599L81086k69684J08821
14520B453635N1543j02420K76285J67115j24227J78788o09552M16553m27695O15402
14510B895427K63263k37198n2877o6298K85690n52068M74566J67965L75544o06948
14500B947066J39844n9172l3264M3567K02725o148P1268j78321L93848l68846
14490C152567N29995k47051O0280K21479q3623J8169j14745K94290m5255n5428
14480C730678M04349l28691L90176j13219K20276l86924K35000j0129L25627l65216
14470D101927J10375L39666k9800N3033J44032k28680K38980m990j36353K75100
14460D863290K65689j81120J50581K35202m0768r0469J35516K51276j9557k8251
$$ y = [2359562, 2204061, 1936267, 2170313, 2152038, 2070414, 2258011, 2233412, 2614498, 2344814, 2453635, 2505178, 2402758, 2679043, 2846158, 2721931, 2900719, 2291167, 2707720, 2280025, 2895427, 3158690, 2921492, 2868615, 2802317, 3088007, 2535939, 3010505, 3178470, 3554014, 2947066, 3086910, 3027738, 2994474, 3038041, 3240766, 3234618, 3305886, 3127565, 3521413, 3152567, 3682562, 3435511, 3495791, 3717270, 3633647, 3651816, 3537071, 3831361, 3786106, 3730678, 4135027, 3806336, 4196512, 4083293, 4303569, 3916645, 4151645, 4141516, 4467143, 4101927, 4212302, 4551968, 4522168, 4575201, 4719233, 4490553, 4729533, 4724543, 4588190, 4863290, 5128979, 4947859, 5098440, 5333642, 5292874, 5202405, 5337921, 5589197, 5569640, 5541389]
14450E541389r2407k4904L34467j93804J19715M51079m40217K15998n3055R1123
14440E949384L11459j56323J68502n6886L13390J24545K36258l44692J62289r3113
14430F614813K93372P531L58857K31460P2706j58454L26124P6590k16062M44096
14420H051033j1355j9865L79741J9100K57248K89797o6037j54580J57950O7797
14410H970829r878K02259N37751j08766J84681K52610j30420M56984l2910L80410
14400A0703550K27427p0824K38660K28226K52990K95276k34609M22728K53576
14391A2317000K41288J09415J65829K77249J97111M60260J17070q0345L18212
14382A4123089K48143L20138K82561M98119K60766K12333L19235M44694K45451
$$ y = [5541389, 5448982, 5424078, 5758545, 5564741, 5684456, 6135535, 5695318, 5911316, 5858261, 5949384, 6260843, 6104520, 6273022, 6216136, 6529526, 6654071, 6890329, 6545637, 6707926, 6614813, 6908185, 6915716, 7274573, 7506033, 7578739, 7420285, 7746409, 7822999, 7606937, 8051033, 8039678, 8019813, 8399554, 8418654, 8675902, 8965699, 8899662, 8745082, 8903032, 8970829, 8960951, 9163210, 9700961, 9592195, 9776876, 10029486, 9899066, 10356050, 10323140, 10703550, 10930977, 10860153, 11098813, 11327039, 11580029, 11875305, 11640696, 12063424, 12317000, 12558288, 12667703, 12833532, 13110781, 13307892, 13768152, 13885222, 13804877, 14123089, 14371232, 14691370, 14973931, 15472050, 15732816, 15945149, 16264384, 16709078, 16954529]
14373A6954529K97028K86725L12541L70245J16965L12234O15732N42027N26548
14364B0334574J34379M20963M85944Q30889j8545M86143R17435M94803L34270
14355B4420855O92928O53469N55877N67899O43006M67902Q16602N05451J013421
14346C0337410O60948O29807J039619P04068J016013P76543J024637P69359J180423
14337C8138827R47254J132449J167244J261336J244745J486010J234963J133763
14329D7746591J530639J761640J747403J419882K211881J384796K261433J986870
14321F2051135J870991K334357K503885K164134K977794K920807K287774L131648
14313H2242525L627596L328044L387345L980545L778974M546968M222937M743024
$$ y = [16954529, 17251557, 17538282, 17850823, 18221068, 18338033, 18650267, 19265999, 19808026, 20334574, 20468953, 20889916, 21375860, 22206749, 22188204, 22674347, 23591782, 24086585, 24420855, 25113783, 25767252, 26323129, 26891028, 27534034, 28001936, 28818538, 29323989, 30337410, 30998358, 31628165, 32667784, 33371852, 34387865, 35164408, 36189045, 36958404, 38138827, 39086081, 40218530, 41385774, 42647110, 43891855, 45377865, 46612828, 47746591, 49277230, 51038870, 52786273, 54206155, 56418036, 57802832, 60064265, 62051135, 63922126, 66256483, 68760368, 70924502, 73902296, 76823103, 79110877, 82242525, 85870121, 89198165, 92585510, 96566055, 100345029, 104891997, 109114934, 113857958]
14305A13857958M855417N490342N685035N757936O103252O875182O811302P374807
14297A62811231P977740Q488265Q541507R803472R823793J0440312J0642939J1731702
14289B40260961J1843432J2359612J2994777J3524631J4369509J4154053J4372403
14282C33879378J4772753J4657248J4240513J4107765J3311547J2496662J1402017
14275D28867883R919369P780771N125350K980761J044446P77842o69244l033382
14267D52793796l467613n423764p670698r216479j0568984j1926039j2679858
14260C91840361j3423450j4337313j5090910j5028808j4929807j4746358j4250084
14253B90033631j3438713j1828890j2613242j2693826j1584503j0737242j0974040
$$ y = [113857958, 118713375, 124203717, 129888752, 135646688, 141749940, 148625122, 155436424, 162811231, 170788971, 179277236, 187818743, 197622215, 207446008, 217886320, 228529259, 240260961, 252104393, 264464005, 277458782, 290983413, 305352922, 319506975, 333879378, 348652131, 363309379, 377549892, 391657657, 404969204, 417465866, 428867883, 438787252, 446568023, 451693373, 454674134, 455718580, 456496422, 455827178, 452793796, 449326183, 443902419, 436231721, 427015242, 416446258, 404520219, 391840361, 378416911, 364079598, 348988688, 333959880, 319030073, 304283715, 290033631, 276594918, 264766028, 252152786, 239458960, 227874457, 217137215, 206163175]
14246B06163175r723528r006311q634647q631357p638530p637960o829325o963022
14238A41098495n601877n873947n565758n169346n201810m604040m295618l820532
14230A00965567m002567m197617l275064l562187l049002l170823k965415k798004
14222G3944888k590845k253217k369272k326123k325862j961090j918702j894479
14214E6305298j475841j620674j738141j280990j772862j318973j429418r41240
14206D4727159j331205j248611j157545j368557p22706j024731r92258j057546
14198C5824000p27849j217788r57687l80624r18491o81656j179518m29528j161855
14189B8169004o78658o14271l65586o57092o74032m46819m53919p34902k74806
$$ y = [206163175, 196439647, 187433336, 178798689, 170167332, 162528802, 154890842, 148061517, 141098495, 135496618, 129622671, 124056913, 118887567, 113685757, 109081717, 104786099, 100965567, 96963000, 92765383, 89490319, 85928132, 82879130, 79708307, 76742892, 73944888, 71354043, 69100826, 66731554, 64405431, 62079569, 60118479, 58199777, 56305298, 54829457, 53208783, 51470642, 50189652, 48416790, 47097817, 45668399, 44727159, 43395954, 42147343, 40989798, 39621241, 38898535, 37873804, 36881546, 35824000, 35096151, 33878363, 32920676, 32540052, 31621561, 30939905, 29760387, 29330859, 28169004, 27490346, 26876075, 26510489, 25853397, 25179365, 24732546, 24278627, 23543725, 23268919]
14180B3268919m22885o14365o19304k10490o67162l02400l59470l29509n67393
14171A9175941n44694j24788l14825m66950k32271n18215m66778R284l68241m68988
14161A5679475m69866Q8201P670l16235j44580n94738j90425l38229l42047j70817
14151A3208409J61731n79479J11776k40820m37000q309o47966K49103q7655n50756
14141A1179034L06971m29797k71025K07152m09775j33769k33131K16514o08072
14132I824102K32399l24052j94833P5325l16158p1309l78638J4281K30919o4400
14122I027636k56924l41828j94039R386l40266K36978k82810k0420j47779R551
14112G699485J5943j72380m63016J95692P9648m11289k61849L82855j75122k05587
$$ y = [23268919, 22846034, 22231669, 21612365, 21401875, 20734713, 20432313, 20072843, 19743334, 19175941, 18631247, 18506459, 18191634, 17724684, 17492413, 16974198, 16507420, 16516704, 16148463, 15679475, 15209609, 15297810, 15305480, 14989245, 14844665, 14249927, 14059502, 13721273, 13379226, 13208409, 13370140, 12790661, 12902437, 12661617, 12224617, 12216308, 11568342, 11817445, 11729790, 11179034, 11486005, 11056208, 10785183, 10992335, 10582560, 10448791, 10215660, 10432174, 9824102, 10056501, 9732449, 9537616, 9612941, 9296783, 9225474, 8846836, 8861117, 9092036, 9027636, 8770712, 8428884, 8234845, 8244231, 7903965, 8140943, 7858133, 7837713, 7689934, 7699485, 7715428, 7543048, 7080032, 7275724, 7355372, 6944083, 6682234, 7065089, 6889967, 6684380]
14102F684380j30217n2214m3515J00797o3553k80379k28603n6153K24329P1698
14092F226570m15713j11016M13495n43948J42377k51077J49605j95938O1211P5039
14082E550605k06465j0521l69560K41147P2968l08915L4583j95471o5011L3089
14072D776449l16378j20474L71143K98796k82329l22632K7952m0517j14436r6208
14062D181366J2976l2906J9778J60024m8907j22028m1362k15892M06036l37405
14052C981680j43609J3658J28155k32463k23289K13776J65109j68732k7343k37787
14042C469155n7609M0121K3283L8267q7609o9539L3783R515N6170P3130l47311
14031C181356J18373N437K13531k85401j65778J52667k03087l16794K43586M6345
$$ y = [6684380, 6554163, 6501949, 6458434, 6559231, 6495678, 6215299, 5986696, 5930543, 6154872, 6226570, 5810857, 5699841, 6113336, 5569388, 5711765, 5460688, 5610293, 5414355, 5475566, 5550605, 5344140, 5333619, 4964059, 5205206, 5278174, 4969259, 5003842, 4808371, 4743360, 4776449, 4460071, 4339597, 4710740, 5009536, 4727207, 4404575, 4432527, 4392010, 4277574, 4181366, 4194342, 4161436, 4181214, 4341238, 4292331, 4170303, 4128941, 3913049, 4319085, 3981680, 3838071, 3851729, 3979884, 3747421, 3524132, 3737908, 3903017, 3734285, 3706942, 3469155, 3411546, 3451667, 3474950, 3513217, 3425608, 3356069, 3389852, 3399367, 3455537, 3528667, 3181356, 3299729, 3305166, 3518697, 3233296, 3067518, 3220185, 3017098, 2700304, 2943890, 2990235]
14021B990235j68241O0799K46m7551L1114j35783J56377M4425k44856j20355N7800
14010B624210J0637K1733K15854l95780N0005K14463k13358k28086P3962Q1156
14000B454796l22374K56048k86988M18644l27991J78848k52423L83190J79613
13991B681363L19153K06068J707983L175487P298776J6024831R677919j5790880
13983B5300700j1034492m921641k813994j111363o86994m73189l38030m99018
13975C421979j16548k73939p043k47158m03870K55211J9653L3162K73998j76166
13965B779279k18056k18724M01381m49802Q8909k17209K89438j08533L83132n19249
13955B210566m18827M49692o4511M5743k04796n675j29699K5901o8967J16310
$$ y = [2990235, 2821994, 2882793, 2883039, 2835488, 2866602, 2730819, 2887196, 2931621, 2686765, 2566410, 2624210, 2634847, 2656580, 2872434, 2476654, 2526659, 2741122, 2527764, 2299678, 2373640, 2454796, 2132422, 2388470, 2101482, 2520126, 2192135, 2370983, 2118560, 2501750, 2681363, 3000516, 3206584, 4914567, 8090054, 15388830, 31413661, 41091580, 25300700, 14266208, 9344567, 6530573, 5419210, 4732216, 4259027, 3920997, 3421979, 3305431, 3031492, 3024449, 2777291, 2373421, 2628632, 2648285, 2681447, 2955445, 2779279, 2561223, 2342499, 2743880, 2294078, 2382987, 2165778, 2455216, 2346683, 2729815, 2210566, 1791739, 2241431, 2176920, 2222663, 2017867, 2012192, 1882493, 1908394, 1839427, 1955737]
13945A955737j3217M6487k10685O3694j25710J63745k93301J98739K57531j05324
13935A937696k23894o2664J27695j39403j04587L71930m74160M07421j33913N5660
13925A761781R5929J04043m7390l40734R8062L8076j59001o5482o5632J74110
13915A593762L14164j56745k54114N36904n17653J43784j47415p384l8542P8543
13905A545304j6270q3902k06652J88017m1557L67570m92775J9263L36295l14701
13895A300592j40496K52681o9945L80426k50903o03185N13240J33410P4096k08687
13885A381229l76803J41865J05478J51160J00200n7886j76237N700O9514k57427
13875A086793O36200l57890m6559M0875k50833R4242J50576l85723N18855l695
$$ y = [1955737, 1942520, 1989007, 1778322, 1842016, 1716306, 1880051, 1586750, 1785489, 2043020, 1937696, 1713802, 1651138, 1778833, 1639430, 1534843, 1906773, 1432613, 1840034, 1706121, 1761781, 1857710, 1961753, 1914363, 1573629, 1671691, 1709767, 1550766, 1485284, 1419652, 1593762, 1907926, 1751181, 1497067, 2033971, 1516318, 1660102, 1512687, 1505303, 1466761, 1545304, 1529034, 1445132, 1238480, 1426497, 1384940, 1752510, 1259735, 1278998, 1615293, 1300592, 1160096, 1412777, 1342832, 1723258, 1472355, 869170, 1382410, 1515820, 1589916, 1381229, 1004426, 1146291, 1251769, 1402929, 1503129, 1445243, 1269006, 1274706, 1344220, 1086793, 1722993, 1365103, 1318544, 1359419, 1108586, 1202828, 1353404, 967681, 1486536, 1482841]
13865A482841l09806l5515J54540M5497J7863k25365K56633l05474Q1163j84812
13855I77565M79913n0503j3427j68187O5694l63192K20919j64730M27676l83558
13845A028170J92128k40531J13467K38468k51797L39043m93527j0161J71580K10396
13835A297236j56162k28686J91469j72987K16799R7159l99003M13617q8535p340
13825A163567l11945r6457K6871j44871L76064J16158l03066j17029K62734j46220
13815H25806J91633k01873L4388L4143K74928r6445l45379J48385K15641j53561
13805I27666J17479j86192q4719J10086k88426K46037j54621O4680l00216L21301
13795G73075k40722M59735J33038l92639K61398j18821R2264j16251p242j1033
$$ y = [1482841, 1173035, 1137520, 1292060, 1337557, 1355420, 1130055, 1386688, 1081214, 1162377, 977565, 1457478, 1406975, 1393548, 1225361, 1291055, 927863, 1148782, 984052, 1411728, 1028170, 1220298, 979767, 1093234, 1331702, 1079905, 1418948, 925421, 915260, 1086840, 1297236, 1141074, 912388, 1103857, 930870, 1147669, 1244828, 845825, 1259442, 1170907, 1163567, 851622, 755165, 782036, 637165, 1013229, 1129387, 826321, 709292, 972026, 825806, 1017439, 815566, 849954, 884097, 1159025, 1062580, 717201, 865586, 1081227, 927666, 1045145, 858953, 774234, 884320, 595894, 841931, 687310, 751990, 451774, 773075, 532353, 992088, 1125126, 732487, 993885, 875064, 967328, 851077, 843835, 832802]
13785H32802J91604m11089J68879n9542M79755k68544l12322J87381o9242M9036
13775G88718R3214j85528J18533K9105m4513J28492j94667P9567q1935k56721
13765D74265q504L96277k96549J33112q4913N6514R0455q7632r7558N70342m04986
13754G40823R9846m910j15908N6651j48712K80190l07677o1750J71055K00949
13744I10557k55301J75391k98843Q7540K19201j56587J86669j99720L0312K4250
13734G23469J4468j30448k43901K45490J04038q2512q4220L56206k41242m9085
13724F12263J80275k99165K01076P7769j13952j37555J04296k74018M05955j05442
13714F51502M3456C15612K39052j88689K67200J14865R6856l81163J01820j88792
$$ y = [832802, 1024406, 613317, 782196, 722654, 1202409, 933865, 621543, 808924, 739682, 788718, 881932, 696404, 814937, 844042, 799529, 928021, 733354, 812921, 730986, 474265, 465761, 862038, 565489, 698601, 613688, 670202, 760657, 673025, 575467, 1145809, 740823, 840669, 835759, 719851, 776502, 627790, 907980, 600303, 538553, 709608, 910557, 655256, 830647, 531804, 619344, 838545, 681958, 868627, 668907, 699219, 723469, 737937, 607489, 363588, 609078, 713116, 630604, 546384, 902590, 661348, 612263, 792538, 493373, 694449, 772218, 658266, 520711, 625007, 350989, 756944, 651502, 694958, 315612, 554664, 365975, 633175, 748040, 844896, 463733, 565553, 376761]
13704C76761q7745N11224l9809k35176J10294J86741j42826K9344k69444R9425
13694E38789k32575M51586n5674j76900K67580k82360r0437J92347o663J96553
13684H02246B23104K2496K47220J7189k21706J53695J09905B46429L61960k00187
13674D08202q5766j06411O21516l90525K57616k96305J47843p5584K01232n6384
13664F25434O2258p427k73917j43993M18493k40858j41672K69538k51585K25511
13654E41782L12838l63504K19844R833l20196R0705j04658K1090J16799Q5131
13644F09664B47098O7971J41913M28896l68428m2249j75855J7592L08263m8098
13634E77103q1034k33206n9450N0238L30487q4864K22247l35070J68208k47609
$$ y = [376761, 289016, 800240, 760431, 525255, 635549, 822290, 679464, 708808, 439364, 538789, 306214, 757800, 702126, 525226, 792806, 510446, 420009, 612356, 605693, 802246, 223104, 245600, 492820, 510009, 288303, 441998, 551903, 246429, 608389, 408202, 322436, 216025, 837541, 447016, 704632, 408327, 556170, 480586, 681818, 625434, 687692, 680265, 406348, 262355, 680848, 439990, 298318, 567856, 316271, 541782, 854620, 491116, 710960, 720793, 400597, 491302, 386644, 407734, 524533, 609664, 247098, 315069, 456982, 885878, 517450, 475201, 299346, 316938, 625201, 577103, 496069, 262863, 203413, 253651, 584138, 499274, 721521, 386451, 554659, 307050]
13624C07050J24483L14835B16140O4242J4670j1628J37282n2423q426K72786B57955
13612E68784C0277K74795L6013K4142J92881B22906J15459J08239N8729j72996
13602C32337J65798p0908P0462k06484K01589J6471j18152l9857n2260K38113
13592E37109J72223k60763L3840A38866L76722j26192J32539k28267Q5328A18730
13581D62091q7397L6236r0938J20568K19403l5959j76912J29210k56923n5478
13571B63901n7811B6138K60457P4988L32619A36638L36020l9252j86892K42597
13561D89111j14931J42775J35140k06316k02198J7468K40131B00675K0587J98083
13551D19345n4208B9324J89653O6404A30589K67438j16298r5471L49212r2209
$$ y = [307050, 431533, 746368, 216140, 280382, 295052, 283424, 420706, 368283, 359857, 632643, 257955, 568784, 30277, 305072, 341085, 365227, 558108, 222906, 338365, 446604, 505333, 332337, 498135, 427227, 497689, 291205, 492794, 509265, 391113, 351256, 298996, 537109, 709332, 448569, 482409, 138866, 515588, 389396, 521935, 293668, 378996, 118730, 462091, 374694, 410930, 319992, 440560, 659963, 624004, 447092, 576302, 319379, 263901, 206090, 26138, 286595, 361583, 694202, 136638, 472658, 433406, 246514, 489111, 374180, 516955, 652095, 445779, 243581, 261049, 501180, 200675, 221262, 419345, 365137, 29324, 218977, 285381, 130589, 398027, 281729, 186258, 535470, 443261]
13541D43261J89958j71592I5437L83041k12428P488B0354L72074J62615A61970
13530C93623A73601K87932J15892B75005A27425A625J69833k6051M37698k36868
13520C46237K79325B04136R9423J57350j66437J25706R3843B16207K25005A08060
13509C75212j29840q5252j7257J30503m4153J49254l3287J78989A03144L13018
13499D16162K32655k61782b5138B84644K02464m6745k8862j04781l5712k1703
13489B49305r35L29916j39492p7499K3903a45425C15362J00712M1162j91235A18205
13477C79723A27248J31790J99580A71760E4295J81608L80942b6569C15315j24734
13467A90581J4499N55292c1670D80893O179r6058j19403J08917A04418J88661
$$ y = [443261, 633219, 461627, 95437, 478478, 266050, 273538, 20354, 392428, 555043, 161970, 393623, 173601, 461533, 577425, 275005, 127425, 1625, 171458, 145407, 583105, 346237, 625562, 204136, 303559, 460909, 294472, 420178, 514021, 216207, 441212, 108060, 375212, 245372, 160120, 142863, 273366, 229213, 378467, 345180, 524169, 103144, 416162, 648817, 387035, -25138, 284644, 487108, 440363, 411501, 306720, 271008, 249305, 248370, 578286, 438794, 361295, 385198, -145425, 315362, 416074, 457236, 266001, 118205, 379723, 127248, 259038, 458618, 171760, 54295, 235903, 616845, -26569, 315315, 190581, 205080, 760372, -31670, 480893, 487072, 391014, 271611, 380528, 104418, 293079]
13457B93079j18126P7899J27096A73081K09005A49225J59409J2333P9878o195
13447C94650o0470d5209B49749a79999B73440d5069B1098K66475M13529B1695
13436C62651p5618C7340O27570A39937Q2640H3715J10987P727A00907J77858F7956
13424A25418j482K47931j25102L0418m3480J54889L7526p6238L5861K8948J3312
13413D28001D9965K00635H4780J7960m7179L06748j58658J5762J31127p2347A0204
13401d609B87881J76510H9917N1414J97244q3342l8986J20103A42771B4113N58675
13390E82788j63316D6885R9810G3084e480C18660b0092A60899J21198a08337B37046
13378B09315F4895J26009a18593B7904J07942J1986J70628j1651A34160K75692
$$ y = [293079, 174953, 252852, 379948, 173081, 382086, 149225, 308634, 320967, 400845, 394650, 334180, -45209, 249749, -179999, 273440, -45069, 21098, 287573, 701102, 21695, 362651, 287033, 37340, 664910, 139937, 222577, 83715, 194702, 202429, 100907, 278765, 67956, 125418, 123936, 371867, 246765, 277183, 233703, 388592, 426118, 349880, 385741, 414689, 428001, 49965, 250600, 84780, 102740, 55561, 362309, 203651, 219413, 350540, 278193, 10204, -4609, 287881, 464391, 89917, 141331, 338575, 255233, 216247, 336350, 142771, 24113, 582788, 419472, 46885, 146695, 73084, -5480, 318660, -20092, 160899, 282097, -108337, 237046, 209315, 64895, 190904, -118593, 27904, 135846, 147832, 318460, 306809, 134160, 409852]
13368D09852j69435K91452k52143K63513B8303R5979a243A52083P1636n0947K47658
13357D20430n3928j22712K28128j10744A70727O0537j2615G5796J55530a8270
13346D52859F1858n961K40047R2719k0227j24622r5300K38467r0770B511K20269
13335B22780P1310A27347L8180J33944K2236A24902A7932a59652N6777C99013
13324C27952r073F9044J68300N163F4762L27331m9374A70403J94171K08757A41174
13312g5168B41355l8560m6117C2313P0052a13022D8868j8763M9892M3043J4741
13301A37781f9646B80656G8636P0570G0899K03060A4775K32956c07460A70927
13290B92668H2558J82593j14824n5470B4856a08022E97844B57391a12836C58977
$$ y = [409852, 240417, 531869, 279726, 543239, 28303, 124282, -1243, 152083, 223719, 172772, 420430, 366502, 243790, 471918, 361174, 170727, 231264, 218649, 75796, 231326, -18270, 452859, 61858, 55897, 295944, 388663, 368436, 243814, 148514, 386981, 296211, 2511, 222780, 294090, 127347, 165527, 299471, 321707, 124902, 17932, -159652, -102875, 399013, 327952, 318879, 69044, 237344, 242507, 64762, 392093, 342719, 170403, 364574, 573331, 141174, -75168, 241355, 202795, 156678, 32313, 102365, -113022, 48868, 30105, 79997, 123040, 137781, -69646, 280656, 78636, 149206, 70899, 273959, 14775, 247731, -307460, 170927, 292668, 82558, 265151, 150327, 94857, 24856, -108022, 597844, 257391, -112836, 358977]
13279C09481j44401A5055K99098i4580B05213k8502N0879e2720A35845J8488b4011
13267B28888j3242e8313A9933a35360D3573M835c00755i947J83I6535O7490L5372
13255A99397a6475C10164j08858r6078K56505h9999B46745J48581j54896I5786
13244F9732c7214D18231D8618g714A94249K5510D9895c5266B41590d8228A36076
13232B05471p6012E5662b07576B51811r1197L22585a07669A46665K7208q1659
13222I2214R7132m3091M9949j8994K23658m1752J58443B31695d087B83856A9880
13210b5582B3724K79275L652a449B40238R9463i7389E9578J83614J54316b9171
13198C18913J82389a08597B53632l5790R851a06910I3032C6161K49458a6979A91513
$$ y = [309481, 165080, 15055, 314153, -94580, 205213, 176711, 227590, -52720, 135845, 154333, -24011, 228888, 215646, -58313, 19933, -135360, 43573, 48408, -300755, -9947, -9764, 96535, 164025, 199397, -16475, 310164, 201306, 105228, 361733, -89999, 246745, 395326, 240430, 95786, 69732, -37214, 418231, 48618, -7714, 194249, 219759, 49895, -35266, 241590, -48228, 136076, 205471, 129459, 55662, -207576, 251811, 160614, 483199, -107669, 146665, 173873, 92214, 189346, 146255, 196204, 177210, 400868, 359116, 517559, 231695, -4087, 283856, 19880, -25582, 23724, 302999, 306651, -1449, 240238, 339701, -97389, 59578, 243192, 397508, -29171, 318913, 501302, -108597, 253632, 217842, 227693, -106910, 93032, 36161, 285619, -16979, 191513]
13186A07690K14089A25532O8710b19512a1369C10927C2483a63700D7643g7746
13175a83096C2468J78233J00614r8446p2497D4967J38415K3649b95D55106j66764
13164B88342o2641I9835J48899a14311p663A30516i623k42604A57141h7003G4760
13152B39841J15538a58772D7912K56452J65151d3024B88141E6036a43347B72391
13141A82793a06489A25161L6743L1675l3292b27263C04158i8608C32512J16844
13131D49356a05690B92012K32548a38428A82839Q0315F3747J89928q9008F3548
13120B24446d1610F9665a0778C11079A17657a32690J2598B16440o1731A3844J17092
13109A30936k6321D2496G017L81160a23445A89287j0997K23437H9984J1940J62930
$$ y = [107690, 321779, 125532, 194242, -219512, -11369, 310927, 32483, -163700, 47643, -77746, -183096, 32468, 210701, 311315, 212869, 140372, 44967, 183382, 207031, -295, 455106, 288342, 225701, 99835, 248734, -114311, -121974, 130516, -9623, -252227, 157141, -87003, 74760, 239841, 355379, -158772, 47912, 304364, 469515, -43024, 288141, 56036, -143347, 272391, 182793, -106489, 125161, 161904, 193579, 160287, -227263, 304158, -98608, 332512, 449356, -105690, 292012, 524560, -138428, 182839, 263154, 63747, 253675, 164667, 63548, 224446, -41610, 69665, -10778, 311079, 117657, -132690, -120092, 216440, 154709, 13844, 130936, 104615, 42496, 7017, 388177, -123445, 189287, 178290, 401727, 89984, 101924, 264854]
13098B64854j11013c14099A28223F0123a91294A23782b2787A3099L9004d7518
13087a5330C8195K22715a05739B05103j01410k5929a40461D3872b14465c1070
13076E5595J08190l1727E5626d2108A40182K49957A027L04120K0942q0146K6967
13065B72910f5558k2804B18619J2011L00498A00980a35486B39231n916o4550E2450
13053a78318B3522M04390b01895a8576D5862d6643H8489J11377k2705g4753F614
13041E206J47553d0999r96A46993B2967g9181B40716a57888e4898B24011D8001
13029A96416N0472a92400c6128n9666B89583B3395R3419D2112a49996N4757B1995
13017b46693E58983B19887D4794J14161P1747B1412K0405K9330J45688H6782K22116
$$ y = [264854, 153841, -314099, 128223, 60123, -191294, 123782, -22787, 13099, 52103, -47518, -15330, 38195, 260910, -105739, 205103, 103693, 77764, -140461, 43872, -214465, -31070, 55595, 163785, 132058, 55626, -42108, 140182, 390139, 1027, 305147, 326089, 245943, 272910, -65558, -88362, 218619, 230630, 531128, 100980, -135486, 239231, 233315, 168765, 52450, -178318, 23522, 427912, -201895, -18576, 45862, -46643, 88489, 199866, 177161, -74753, 6614, 5206, 152759, -40999, -41995, 146993, 22967, -79181, 240716, -157888, -54898, 224011, 48001, 196416, 246888, -192400, -36128, -95794, 289583, 23395, 116814, 42112, -149996, -95239, 21995, -246693, 558983, 219887, 44794, 158955, 230702, 21412, 41817, 71147, 216835, 86782, 308898]
13006C08898l5069f2518C29423o5770a09772B99727c42791C01064a0837A07063
12995C94563b18156A13304g4596C80077a37323A15418M696d2411B2255Q9158N8205
12984A69618p6346i3490A40549b36030A69187K08645b33364a13053A68908C7412
12973B65171m3454A08717K48629G6545M07653A81884b02404C46842g3724K8005
12963d5719I3840J88926I3847h9712j49530H7559i762m78735B83431J0o0376j01909
12951A21156a9923A02598m9029L0238K44142a73080F347a2770A54455F2866J41181
12940B04047I5791a09608q4785A93702B8782K42576j20986A1981J76004o2095
12930A25890a39639B66539n9707a4297k3446A57308k2484a08511B36693r3538
$$ y = [308898, 273829, -62518, 329423, 263653, -109772, 299727, -342791, 301064, -10837, 107063, 394563, -218156, 113304, -74596, 380077, -137323, 115418, 120114, -42411, 22255, 111413, 169618, 93272, -93490, 140549, -236030, 169187, 377832, -233364, -113053, 168908, 37412, 265171, 221717, 108717, 357346, 76545, 484198, 181884, -202404, 346842, -73724, -45719, 93840, 282766, 93847, -89712, -239242, 87559, -9762, -488497, 283431, 283441, 223065, 121156, -19923, 102598, 53569, 83807, 327949, -173080, 6347, -12770, 154455, 62866, 204047, 95791, -109608, -194393, 193702, 28782, 271358, 150372, 11981, 187985, 125890, -139639, 266539, 206832, -14297, -37743, 157308, 134824, -108511, 236693, 143155]
12920A43155l9648L3028K0371o934n1256J49331A11813L1387J24740M2544J34174
12909D44658a24023C18334A55751m4093J23949a19423C53494E9527K33260g379
12898B41104q2013a17720G9054a67559A39855g3264B08226E8311c80206A07363
12887B65687a4527A90114F2955R247J39827b40458H9563b25000E5350Q1053c5751
12875I9293j2118b7106C25650h6202C2532O737a11171C08398J31714b51149B42240
12863A40169a61099L7860d7574r4840b0159q0792c6360A43703a22560d2649B4277
12851b41544B8490L52640A20919a10272e3335B1376J79203H4272L30342A57992
12840b38049p4776A80076a98926N4250F7323a25912c0363A15733J30050a28922
$$ y = [143155, 103507, 136535, 156906, 149972, 98716, 248047, 111813, 143200, 267940, 310484, 444658, -124023, 318334, 155751, 111658, 235607, -119423, 353494, 59527, 292787, -7379, 241104, 159091, -117720, 79054, -167559, 139855, -73264, 208226, 58311, -380206, 107363, 265687, -14527, 190114, 62955, 72202, 212029, -240458, 89563, -225000, 55350, 136403, -35751, 99293, 87175, -27106, 325650, -86202, 32532, 39269, -111171, 308398, 440112, -251149, 242240, 140169, -161099, -123239, -47574, -142414, -20159, -100951, -36360, 143703, -122560, -42649, 24277, -241544, 28490, 381130, 120919, -110272, -53335, 21376, 200579, 84272, 414614, 157992, -238049, -312825, 180076, -198926, -144676, 67323, -125912, -30363, 115733, 245783, -128922]
12829I4683J48536E4155g840j46248B75728C123Q3059a23049A98391g6701C19396
12817A90092j7669a99114H7868k4445k5119J45710a63809C29821a03411a2710
12806a09000A66560j2368a975A13947Q9012P0735F436a06614b7163D4206L4491
12795G8697D744J28736m4149i5442A7291N4384L55576a2767F9485e2155A88755
12783a95854b8184k15937A72555a29909D4716a81099r9576A22821k3508a86226
12772b04493B48069J819i3242i58m5394k21107L7291C0252c81990C43231A69347
12760A74713a26838D37770L5619k25609M4625k0273e341A71717B443J1500a1597
12748a1659A34826P8123h5019q9661A32561O0313H5489n184b42503A88061o3285
$$ y = [94683, 243219, 54155, -7840, -154088, 275728, 3123, 86182, -123049, 198391, -76701, 319396, 190092, 172423, -199114, 87868, 63423, 38304, 184014, -163809, 329821, -103411, -12710, -109000, 166560, 154192, -1975, 113947, 202959, 273694, 6436, -106614, -27163, 44206, 78697, 4744, 133480, 89331, -95442, 17291, 71675, 427251, -12767, 69485, -52155, 188755, -195854, -28184, -244121, 172555, -129909, 44716, -181099, -280675, 122821, 99313, -186226, -204493, 248069, 249888, -93242, -958, -46352, -267459, -230168, 30252, -381990, 343231, 169347, 174713, -126838, 437770, 473389, 247780, 292405, 272132, -5341, 171717, 2443, 13943, -11597, -11659, 134826, 212949, -85019, -174680, 132561, 192874, 85489, 80305, -242503, 188061, 124776]
12737A24776A5268L72173a9864A68184K21898j20510E2668J63657Q515a64362
12726A11756J46742H2749J4499D2567L5775R8768f6850o9000C33341b12427F9023
12714a04014A89027N9386h1464C45194g5056K0670E62769A15839B0861P6055J61771
12703B58687a48923A88373F2632c18914d1845j6143B88706f9114B22071j05702
12693A16369P9231b299A37406d780A51616n9722K52067C4467K22637E9645J74169
12682B33814e5955q1954B12765N1425G41K22248J1042C5950K17114M738P3430
12671C31232G4114M5074d4299B27636j06081m3821J07263J78889h7552B6397J08750
12660A35147g6175j9437A32412o4804B4912K39155I35a78840H9172J13031J8456
$$ y = [124776, 15268, 387441, -19864, 168184, 390082, 269572, 52668, 216325, 224840, -164362, 111756, 258498, 82749, 97248, 42567, 78342, 177110, -66850, -135850, 333341, -212427, 69023, -104014, 189027, 248413, -81464, 345194, -75056, -54386, 562769, 115839, 20861, 96916, 258687, -148923, 188373, 62632, -318914, -41845, -57988, 288706, -69114, 222071, 116369, 195600, -2299, 137406, -4780, 151616, 91894, 343961, 34467, 257104, 59645, 233814, -55955, -137909, 212765, 264190, 741, 222989, 234031, 35950, 253064, 257802, 331232, 74114, 119188, -44299, 227636, 121555, 77734, 184997, 363886, -87552, 26397, 135147, -76175, -95612, 132412, 67608, 24912, 264067, 935, -178840, 89172, 202203, 220659]
12649B20659q1702A1522K22004C0022d3871C11663a02926C45263H0537P6981b2661
12637I0860J19181N1539a60171I6902a34137B09551m4179E0987J73188K20369
12627D44544j91908k1790C5100L4611J39216q9303K05995j40121F2773K98178
12617C60951B0807M9436b5840o5382A05868c42l0631l5514A79624b94620a23178
12605A3640c1781A36732i6574M853C38648A25561a8399j2747A03823k8193a90360
12593B14959b36573B92187M9068A48357J31744a70889f2938A08856K83412j08948
12583B83320E7945b86692I4654c90474A42042i0947j52775B43061q5917E8482
12572A76307a74968J143j9636d8723A21860K08606c15678J45735B61196a07389
$$ y = [220659, 138957, 11522, 233526, 30022, -43871, 311663, -102926, 345263, 80537, 157518, -22661, 90860, 210041, 261580, -160171, 96902, -134137, 209551, 165372, 50987, 224175, 444544, 252636, 230846, 35100, 69711, 208927, 119624, 325619, 185498, 62773, 360951, 20807, 70243, -25840, -91222, 105868, -342, -30973, -66487, 179624, -294620, -123178, 13640, -31781, 136732, -96574, -91721, 338648, 125561, -18399, -31146, 103823, 75630, -190360, 214959, -236573, 292187, 341255, 148357, 280101, -170889, -62938, 108856, 392268, 283320, 57945, -286692, 94654, -390474, 142042, -90947, -243722, 243061, 157144, 58482, 176307, -174968, -173825, -193461, -48723, 121860, 330466, -315678, -169943, 261196, -107389]
12561A43780C9697O7694J97398F6579J16178b20184A21925k488d2537C9260b26336
12549C13673e877G9853b18727A46546c53673J59688B03695K9337q314j5929A7790
12537h1555j25496F7562a34120d6829K904j87914B49974c4309A50721c66816D8519
12525f778l6329m97806b16577A19515b75104d3123A23522C5938o298R2703g4886
12513g3782I7743c5177j89075j73314J05925J39847g0716I5214a1207B73763b35990
12501A05833a85875E635L78611a7458j04110H6624J69910a62286P8729A73322
12490b65596D9689i9795f991C94035D5037a53943B8670J14648R8586I7509a17119
12478H2245i0738I5124d4926D15423G5141e8853A66666b10131A98365P6286N5867
$$ y = [143780, 39697, 107391, 304789, 66579, 182757, -220184, 121925, 119437, -42537, 39260, -226336, 313673, -5877, 79853, -218727, 146546, -353673, -193985, 203695, 233032, 224718, 208789, 17790, -81555, -207051, 67562, -134120, -46829, -43925, -231839, 249974, -34309, 150721, -366816, 48519, -6778, -43107, -540913, -216577, 119515, -275104, -43123, 123522, 35938, 29640, 122343, -74886, -73782, 97743, -35177, -224252, -397566, -291641, -151794, -70716, 95214, -11207, 273763, -235990, 105833, -185875, 5635, 384246, -17458, -121568, 86624, 256534, -162286, -83557, 173322, -265596, 49689, -99795, -6991, 394035, 45037, -153943, 28670, 143318, 241904, 97509, -117119, 82245, -90738, 95124, -44926, 415423, 75141, -58853, 166666, -210131, 198365, 274651, 330518]
12467C30518A3425I75i9347H3062d19621e6039D10618a70034B23168p7399f2581
12455B3374h4836J1317p7559I576J9285K7605e2706C13211p8417a01196A88389
12443a53256F5966B9931b52959D9392c54348a29427E3329k3637b5637r8027A33037
12431a89136c2114I9839a3226A64629a49939L4607A90740a203j01755A73029c5225
12419G0687I783a323j39599n7730j80541g3658A13543b0357C33501F3825a07830
12407A0783c18587B489K08049r6437a72240A52446J80142H8293b53057j0737k0958
12396b84752G2349d5661G6858M9820J45508C2050a48911B93059i6019M1174A20245
12384e2756A64710B9806O7151G783g3072b0179A88192d0724G6817a28945j00230
$$ y = [330518, 13425, 975, -99347, 83062, -419621, -56039, 410618, -170034, 223168, 145769, -62581, 23374, -84836, -73519, -151078, 9576, 28861, 56466, -52706, 313211, 234794, -101196, 188389, -153256, 65966, 29931, -252959, 49392, -354348, -129427, 53329, 29692, -25637, -123664, 133037, -189136, -32114, 99839, -13226, 164629, -149939, -115332, 190740, -1203, -102958, 173029, -35225, 70687, 9783, -1323, -140922, -198652, -379193, -73658, 113543, -20357, 333501, 63825, -107830, 10783, -318587, 2489, 210538, 114101, -172240, 152446, 332588, 88293, -253057, -263794, -284752, 72349, -45661, 76858, 126678, 272186, 32050, -148911, 293059, -96019, -54845, 120245, -52756, 164710, 29806, 96957, 7783, -73072, -20179, 188192, -40724, 76817, -128945, -229175]
12373b29175A08006j1968A2818P1703a26120B2075a35187D2120d7242k2872F8581
12361f0480m1555j41737j38343B52179e1290j79304c4159F5467k294O9925J04103
12350B37201i1304d2521m9620A22353b62852i3979A4940d5679j65557h714A32647
12338f4453A71219j5175K3252m7944L32231b77359B12061D7570J09547a04887
12327E4982J97822a10952a5647H3398a35989F2988J52822J65913G5489B2939J56989
12316A79928B5370J71045d04035A81783d3355J0897A10364l3138F315M3271O0722
12305A10308B3102J91224H6897c83128e0873A02136m2327J49799M5325C1883d8930
12293C65611f1420B8810D990N4000a69695i525M010B89769A39924h9023I2940
$$ y = [-229175, 108006, 96038, 12818, 84521, -126120, 22075, -135187, 42120, -47242, -70114, 68581, -60480, -102035, -243772, -382115, 252179, -51290, -230594, -34159, 65467, 63173, 133098, 237201, -91304, -42521, -92141, 122353, -262852, -93979, 14940, -45679, -211236, -8714, 132647, -64453, 171219, 156044, 179296, 131352, 463583, -277359, 212061, 47570, 157117, -104887, 54982, 252804, -110952, -15647, 83398, -135989, 62988, 215810, 381723, 75489, 22939, 179928, 25370, 196415, -404035, 181783, -43355, -32458, 110364, 77226, 6315, 49586, 110308, 23102, 214326, 86897, -383128, -50873, 102136, 59809, 209608, 254933, 31883, -48930, 365611, -61420, 28810, 4990, 58990, -169695, -9525, -5515, 289769, 139924, -89023, 92940]
12281A6592b9754j05777C56486I4682c04512O5640C94286d9294I1410a61808b5584
12269A03900k4308a58830a2378G5323j0132h705k02655B84349E4381J17309R1445
12258B63135a19119A71491O8232m9483l1343a10514E6110b3408B87174a35031
12247A65033E3462a95327G5239e7216m8086r208d1817r4264K7128c5369A55497
12235D42624B16945b5447B06246C2618M6230C2389Q0741J74397J97628e27F30
12223H9453O0251J38062b7197j07477c8992j32500C53053B4840k67J46672C3891
12211A06775B7283J50224J5304a84292a6303H5556C4245O1297j6611K43693C6059
12199C54626j39284P7698j26266a65681b2718G5732b172G120L22874P0959m2710
$$ y = [16592, -29754, -135531, 356486, 94682, -304512, -238872, 394286, -49294, 91410, -161808, -25584, 103900, 79592, -158830, -12378, 75323, 65191, -8705, -211360, 284349, 54381, 171690, 263135, -119119, 171491, 239723, 190240, 158897, -110514, 56110, -23408, 287174, -135031, 165033, 53462, -195327, 75239, -57216, -105302, -114510, -41817, -136081, -108953, -35369, 155497, 442624, 216945, -25447, 206246, 32618, 78848, 32389, 113130, 287527, 485155, -527, 630, 89453, 149704, 287766, -27197, -134674, -38992, -171492, 353053, 24840, 24573, 171245, 33891, 106775, 27283, 177507, 192811, -184292, -16303, 85556, 34245, 95542, 78931, 322624, 36059, 354626, 215342, 293040, 166774, -165681, -22718, 75732, -2172, 7120, 329994, 400953, 358243]
12188C58243J52889k03708M145e1468A70496J81492j44188L46971A02488J0646
12178A13134f4921A07928J61809j23067R6793F9957N8792J7658Q8631A11483D2648
12166b80407E4526j8620g9649D6630a14987B19512e0329r180a7355p7185k33522
12155c28062a021n1135C91457A88401E594J619a9823A51799o9270l5200N852b1487
12142b23904A35977E36c11560A36540K2883F4320J70619a96081C96757c30950
12131a70123b1303l8990B3195M70815a21775C1430b16149I7013J3387j087a11988
12119B6375Q3213P1196b9754o3501r6108A09897b86922I010K41292G9457K64194
12108C43651A23492E8269R64O9420L7034Q3188f6969h065C60320e8444r3440E7172
$$ y = [358243, 511132, 307424, 311569, -51468, 170496, 351988, 207800, 554771, 102488, 113134, -64921, 107928, 269737, 146670, 243463, 69957, 128749, 146407, 235038, 111483, 42648, -280407, 54526, 35906, -79649, 46630, -114987, 219512, -50329, -59509, -17355, -94540, -328062, -1021, -52156, 391457, 188401, 5594, 7213, -19823, 151799, 82529, 47329, 53181, -21487, -223904, 135977, 536, -311560, 136540, 159423, 64320, 234939, -196081, 396757, -330950, -170123, -21303, -60293, 23195, 494010, -121775, 31430, -216149, 97013, 110400, 109313, -111988, 26375, 109588, 180784, -29754, -93255, -189363, 109897, -286922, 9010, 250302, 79457, 343651, 123492, 58269, 59233, 128653, 165687, 248875, -66969, -8065, 360320, -58444, -151884, 57172]
12095f7888k11469c7239A08948a5223A02624a56808m3437B63994H3611a4454b366
12083b23303A35119e6786I0945C7734J25274c55396A28979l8237J1028a24748
12072C4938c2698J0902m7674j20552B09897R234i5190I7152D1228a47396C38396
12060I91817m67352D7825Q0048C0014a26085C50085H506K16865D2160J51076c3147
12048b114B23157J40497A03961c49424J53370n6425i9184r4546E907b06160e0917
12036a8579r4488p5325i1895A54351l1067C418K03205A7545g9830j69238A59025
12024c28329G5670j1611A377K83936d3663D50771j66258B7790K97653b00031B9467
12012G1330N9184a15273A81150h9459H0523g8586i170B14447c0801k2542A46923
$$ y = [-67888, -279357, -37239, 108948, -15223, 102624, -156808, -200245, 263994, 83611, -14454, -2366, -223303, 135119, -56786, 90945, 37734, 163008, -355396, 128979, 90742, 101770, -124748, 34938, -32698, -21796, -69470, -190022, 209897, 219131, -95190, 97152, 41228, -147396, 338396, 991817, 524465, 47825, 127873, 30014, -126085, 350085, 8506, 225371, 42160, 193236, -33147, -2114, 223157, 363654, 103961, -349424, -196054, -252479, -99184, -193730, 5907, -206160, -50917, -18579, -113067, -188392, -91895, 154351, 123284, 3418, 206623, 17545, -79830, -249068, 159025, -328329, 75670, 64059, 1377, 285313, -43663, 450771, 284513, 27790, 325443, -200031, 29467, 71330, 130514, -115273, 181150, -89459, 80523, -78586, -9170, 214447, -30801, -53343, 146923]
12000C23550b26794c6483h037r8584e2707k24403A58517g6217D52797b46907A59541
11988I4751h8345B29635a0898B07809p6637l6500a69071C8306J37998F0181J59266
11977B19447A6152a34445C19445l0865B9644a19042m566f1172F952b48062a8727
11965b22965N9889p9507C30921b49124A72678A6267J19224J08516c63112J73365
11955a89747F2112M4950a70627j01651G0338c7009B5778q384R7709n6209J66766
11944B25660B466i8897j99548B62245G141J04972C5664K15612a833j45043b0745
11932A80181b96630M8998C36005b6625B8858A2682b76938H65J58909J25869a97569
11920i2301b0115j12991q6458A8006J229c82388e877n1254D44982d42664a33424
$$ y = [323550, -226794, -36483, -8037, -106621, -52707, -277110, 158517, -76217, 452797, -246907, 159541, 94751, -88345, 229635, -10898, 207809, 131172, 94672, -169071, 38306, 176304, 60181, 219447, 16152, -134445, 319445, 288580, 29644, -119042, -123608, -61172, 6952, -248062, -18727, -222965, -163076, -242583, 330921, -249124, 172678, 16267, 135491, 244007, -363112, -189747, 62112, 107062, -170627, -272278, 70338, -37009, 25778, 17394, 115103, 58894, 225660, 2466, -98897, -298445, 262245, 7141, 112113, 35664, 251276, -1833, -146876, -20745, 180181, -296630, -247632, 336005, -26625, 28858, 12682, -276938, 865, 159774, 285643, -197569, -92301, -20115, -133106, -219564, 18006, 19235, -382388, -5877, -57131, 444982, -442664, -133424]
11908B71969A05884l719P97K5552d5529l4068o725a3690r0751J1473l6746R304
11896a20410l6738A29583M1139b01927E3111d08681a42571N5698L4632A3855d39670
11884b55624C4400a61688D8598c44619J31515j94968a73297e1728j71911e950
11873B85513a54929p4889B2965a06625p4527C00838g9106B45217I1826d57938
11862B8577a13469j63867A2735K79802h2766A46172e3718A3876a37005F9220a31898
11850a8244k82583f7733B38132b2755D7901b60716a10782B77681i9428b6575m315
11839c0890B42457j06710J0937R7378a7397B6135f9497A17636a32059n5569C51
11827c9687n3439L2731k9664b0356k04349a9429o7678j37254F0386Q106J09451
$$ y = [271969, 105884, 102165, 102962, 128514, -45529, -79597, -86322, -13690, -104441, -92968, -129714, -120410, -157148, 129583, 170722, -201927, 53111, -408681, -142571, -86873, -52241, 13855, -439670, -255624, 34400, -161688, 48598, -344619, -213104, -408072, -173297, -51728, -223639, -5950, 285513, -154929, -229818, 22965, -106625, -181152, 300838, -79106, 245217, 91826, -457938, 28577, -113469, -277336, 12735, 292537, -82766, 146172, -53718, 13876, -137005, 69220, -131898, -18244, -300827, -67733, 238132, -22755, 47901, -260716, -110782, 277681, -99428, -26575, -30890, 242457, 135747, 146684, 244062, -17397, 26135, -69497, 117636, -132059, -187628, 351, -39687, -93126, -60395, -90059, -20356, -224705, -19429, -87107, -224361, 60386, 68492, 177943]
11816A77943f8682r4968j35932i1638j54183B2620h0779A07464a24247D1614e4232
11804b42329N6425j4019e1070k62254G334b35323M4744A6347M189f857j04352
11793a11209H17a5556o7783j7463F5827d5247B09039N257a68201K3567k8861B55466
11780B25093c1239k37513b5235l8277B14408i1020E9809i325k74964A04004C6097
11768b49219d8821l1079k3654A67754b2453F4376J44484c33849K6629I451b18779
11756A55341a18370B09886L4799a00993n9293j7901B10499d78171B03747a16934
11745B03843R9061g3884k36770a11069K9730p4192A5624c70550G8593d6847F032
11733a3417F293b95282M5974I8124a45543N9204C35064d01147b9201k26741J10025
$$ y = [177943, -68682, -163650, -299582, -91638, -245821, 22620, -80779, 107464, -124247, 41614, -54232, -242329, -185904, -199923, -51070, -313324, 7334, -235323, -190579, 16347, 20536, -6857, -111209, 817, -15556, -83339, -100802, 65827, -45247, 209039, 214296, -168201, -144634, -173495, 255466, 225093, -31239, -268752, -25235, -63512, 214408, -91020, 59809, -9325, -284289, 104004, 36097, -249219, -48821, -79900, -103554, 167754, -22453, 64376, 208860, -333849, -307220, 9451, -218779, 155341, -118370, 209886, 244685, -100993, -160286, -178187, 210499, -478171, 203747, -116934, 203843, 302904, -73884, -310654, -111069, -81339, -155531, 15624, -370550, 78593, -46847, 6032, -13417, 6293, -295282, -249308, 98124, -145543, -86339, 335064, -401147, -29201, -255942, -145917]
11722a45917K3735L9969a7361I3563b43972R740k3324B907J0832c4148j37733
11711a71881G9514j2388L56769E9835b17502K0121K7084G8316b22695A39339N8968
11700A98307G4344g8071c1755j17721A47306b0823q8762B5854a70079j3255g447
11688a96126b5670B51425a39016j4298A69550A500P8407b15980C3646b22175B82037
11676A29742n3351K7964e827j44640g1654d784n0773B05433e8626A53786o4688
11665H9098c813r5794j16427J05118j04833A29787n6125R0305F1204A4401a00577
11653B98531I8838K02795B3788K06150a93356P3238A3794b8007j07690A4402Q3829
11642I8231a06756E2041b27346A86822a98789I6995b65024B24988j10965A0057
$$ y = [-145917, -122182, -82213, -17361, 93563, -243972, -234232, -257556, 2907, 13739, -34148, -171881, 79514, 67126, 423895, 59835, -217502, -197381, -170297, 78316, -222695, 139339, 198307, 74344, -78071, -31755, -149476, 147306, -20823, -109585, 25854, -170079, -183334, -7447, -196126, -25670, 251425, -139016, -153314, 169550, 1500, 79907, -215980, 33646, -222175, 282037, 129742, 76391, 104355, -5827, -150467, -71654, -4784, -55557, 205433, -58626, 153786, 89098, -3813, -99607, -216034, -110916, -215749, 129787, 73662, 163967, 61204, 14401, -100577, 298531, 98838, 301633, 23788, 229938, -193356, -120118, 13794, -28007, -135697, 14402, 98231, -106756, 52041, -227346, 186822, -198789, 96995, -265024, 224988, 114023, 10057]
11631A62559e5452A32513h9180E0098b46898N0888Q233I2465R253c72770A23731
11619a70255D0226R9134b69909A55928b17676D2774a08710A82402r1123b2013
11608A37062d4303o3027q426H6476h9941A735L37549F6194A5721g0992j13425
11597a84417i0833j71019a5488q4729E7021a53481A05896m6959d464H6106J56996
11586B43102r5954b1222k43997J22348q9618g3536q4142B67383a21758B370c21607
11574a6643c43k76986J12757G6647h497A67005g383A13783K5927E1994g4920H7481
11561c86290a2922k15761i2217A08095h1905r0901F5703d49986a05385D4436o295
11550C8141O6597a29178e4383m347B72744b426k89976Q3696R9522B3250a02128
$$ y = [162559, -55452, 132513, -89180, 50098, -246898, -196010, -187777, 92465, 101718, -372770, 123731, -170255, 40226, 139360, -269909, 155928, -217676, 42774, -108710, 182402, 91279, -22013, 137062, -44303, -107330, -115756, 86476, -89941, 1735, 339284, 66194, 15721, -70992, -184417, -90833, -261852, -15488, -100217, 57021, -153481, 105896, 58937, -4464, 86106, 243102, 147148, -21222, -265219, -142871, -232489, -73536, -157678, 267383, -121758, 2370, -321607, -16643, -343, -277329, -164572, 76647, -8497, 167005, -7383, 113783, 139710, 51994, -74920, 87481, -386290, -12922, -228683, -92217, 108095, -81905, -172806, 65703, -449986, -105385, 44436, 38141, 104738, -129178, -54383, -58730, 272744, -2426, -292402, -208706, -109184, 23250, -102128]
11538a50919H8840M615i1536C76722A02059j8674a1307l36973a34187c1361A85859
11526B715J06624J12509A2428a640C12987c8093j27128A85725c374B14147d0026
11514a82840A26683J3962J17396a17669c0928B2248L5725N0320M18823a17320
11503a17235G9395P1350a7436D86158e7778A63224p7790L9453c1023A95727b37864
11491B2069K06199a26884J4282B02053A3213d5749C08357j35023H3994K48627
11481C32621e4298B24830B0880A80J5510m457R3260J50275b35274J8840i4929
11469A03511J8641e9127D35348j66391F976M3368f3892o3476A26495h0468b6558
11457A61709l7201N9531F9247J64671A07594P9947p8210a96862N2729K7706j20865
$$ y = [-150919, 88840, 93455, -91536, 376722, 102059, 83385, -11307, -348280, -134187, -31361, 185859, 2715, 109339, 221848, 12428, -1640, 312987, -38093, -165221, 185725, -3374, 214147, -40026, -182840, 126683, 140645, 258041, -117669, -30928, 22248, 57973, 108293, 527116, -117320, -117235, 79395, 150745, -17436, 486158, -57778, 163224, 85434, 124887, -31023, 195727, -237864, 22069, 228268, -126884, -112602, 202053, 13213, -45749, 308357, 173334, 83994, 332621, -54298, 224830, 20880, 180, 15690, 11233, 104493, 254768, -235274, -216434, -94929, 103511, 122152, -59127, 435348, 268957, 6976, 50344, -63892, -127368, 126495, -80468, -26558, 161709, 124508, 184039, 69247, 233918, 107594, 187541, 109331, -196862, -144133, -116427, -237292]
11446b37292A14257J02169f475j61453f4515A6501b53248e1682C14654p0041o5779
11435A78834k2971a59723A1994a02760j96051g6368o7668A11105m4199A3709c17373
11423B55143h0021q2590d7165F0695K17586a8120p6359r7046B10031c4419D6137
11411a48540b4826k919m273H9666g1997B95423a55217B33524A9794J72938G6801
11399F8477L9059h8694k27F8956L8344c9010n2848p7628j30847E2510K4241P5885
11387A52636k3815k1194b76482A3658M099b66999C22408c89884A5013c9400B39683
11375a95917k912c5734j3525l51600Q2129B00505c75241a16478J4357A34266b71569
11363c32090a23699r6883l14634c9515j06126j10758b6482G5746a46003D1430
$$ y = [-237292, 114257, 216426, -6475, -167928, -64515, 16501, -253248, -51682, 314654, 244613, 178834, 155863, -159723, 11994, -102760, -298811, -76368, -144036, 111105, 66906, 13709, -317373, 255143, -80021, -162611, -47165, 60695, 278281, -18120, -94479, -191525, 210031, -34419, 46137, -148540, -24826, -27745, -32018, 89666, -71997, 295423, -155217, 233524, 19794, 192732, 76801, 68477, 107536, -88694, -88921, 68956, 107300, -39010, -91858, -169486, -300333, 52510, 76751, 152636, 128821, 107627, -276482, 13658, 17757, -266999, 322408, -389884, 15013, -39400, 239683, -195917, -198829, -35734, -49259, -400859, -318730, 200505, -375241, -116478, -102121, 134266, -271569, -332090, -123699, -220582, -535216, -39515, -145641, -256399, -26482, 75746, -146003, 41430]
11352c5043A21432c29090I0562J09014q0871h2043J3766j20577h5693m3002K2044
11341a06651d9163B15997E5942j9357J08106J0040J9404J71910A51581a97079
11330B84765c50352a43845C39898h290m1684r0376A94407b78652O0229J6951D2985
11318a64437m6376A62663j9133a76093E96c4178n27072A11550B8182F480h2869
11306c87547a83094B67118c1046m9971k99886J50978G3351a40565j80936a4601
11295b1345j90828A5556h3328j90833B12314o8365q476i180k32219B90390a49591
11283B07095f2994B15858f4141A09668b13419j0139J01722D5983J63055a32058
11272b31267M2166I1705g5633A14886R8941f4560B43369j21167m6680H927h5807
$$ y = [-35043, 121432, -329090, 90562, 199576, 118705, -82043, -68277, -188854, -85693, -128695, -106651, -49163, 215997, 55942, 36585, 144691, 154731, 174135, 346045, 151581, -197079, 284765, -350352, -143845, 339898, -8290, -49974, -140350, 194407, -278652, -218423, -201472, 42985, -164437, -210813, 162663, 143530, -176093, 596, -34178, -561250, 111550, 28182, 6480, -82869, -387547, -183094, 267118, -31046, -81017, -380903, -229925, 73351, -140565, -321501, -14601, -21345, -212173, 15556, -83328, -274161, 212314, 143949, 135473, -9180, -241399, 290390, -149591, 207095, -62994, 215858, -64141, 109668, -213419, -223558, -121836, 45983, 209038, -132058, -231267, -189101, 91705, -75633, 114886, 213827, -64560, 243369, 122202, 75522, 8927, -85807]
11260B09570F374b10124A42068J08565c23243J8420L2866l8952a0591j92260A90698
11248b84284a17087A01450a17693M1997A45502l2172a18757D54510b20035D8056
11237a84797B71400H876b70492g9822J9973q1296G5491c13417B99220a76153C02351
11225a15363M5374C3197e1820l0984p7480D3004L2998P4320a77875a1354A03873
11213a19440j75616A7095K77635g8016o7555B7804J34849i2052j80380C20584
11202b76045I6717a30571A17393J25522a6551l3191A63523a84963A27768d8269
11191e6493A04205C1127b45817R9949K8900j56420a01547B22486A6855a43429
11180A93441i2793o7772C81262a87241A8121J07706l005r674J8916a41228M5504
$$ y = [209570, 6374, -210124, 142068, 250633, -323243, -304823, -271957, -310909, -10591, -202851, 190698, -284284, -117087, 101450, -117693, -75696, 145502, 113330, -118757, 454510, -220035, 48056, -184797, 271400, 8876, -270492, -79822, -59849, -141145, 75491, -313417, 299220, -176153, 302351, -115363, -69989, 33197, -51820, -82804, -160284, 43004, 76002, 150322, -177875, -11354, 103873, -119440, -295056, 17095, 294730, -78016, -145571, 27804, 162653, -92052, -272432, 320584, -276045, 96717, -130571, 117393, 242915, -16551, -49742, 163523, -184963, 127768, -48269, -56493, 104205, 31127, -245817, -145868, -116968, -273388, -101547, 222486, 16855, -143429, 193441, -92793, -160565, 381262, -187241, 18121, 125827, 122822, 113148, 132064, -141228, -95724]
11169i5724l3799q2340k43796A47438h607j20878A59996O1211a93609h6390L8522
11158d7868I4934B4292L9255a35466j8778e1091k30524A59785n8356M0929K2927
11147A65285K7547K8697b43895j4320B53583o4622a80014j0169m9990P6050A92842
11135C43414b49545F3324j9792a1684j44359B63044a07949A89484H8423B3763
11124a25474j5922A18749a35910k19524A33644b2301j54505M8522J8439A40118
11113E28848a07849B47282l2595n7891l6935J79055j10901d7826k15816F7521
11102d552n841A63570j1940b186A60286G4491l5171R6602n2302P4405M5543B4617
11089A88878d6661a3948B8938J91177c31572A68672O1350J4943A09190l4553L10118
$$ y = [-95724, -129523, -211863, -455659, 147438, -8607, -129485, 159996, 221207, -193609, -86390, -47868, 94934, 24292, 63547, -135466, -154244, -51091, -281615, 159785, 101429, 142358, 165285, 192832, 221529, -243895, -258215, 253583, 188961, -180014, -190183, -240173, -164123, 192842, 343414, -249545, 63324, 43532, -11684, -156043, 263044, -107949, 189484, 88423, 23763, -125474, -141396, 118749, -135910, -355434, 133644, -22301, -176806, -128284, -109845, 140118, 528848, -107849, 247282, 214687, 156796, 119861, 298916, 188015, -47826, -263642, 67521, -4552, -10393, 163570, 151630, -2186, 160286, 74491, 39320, 135922, 83620, 158025, 203568, 24617, 188878, -46661, -13948, 28938, 220115, -331572, 168672, 230022, 244965, 109190, 74637, 384755]
11078C84755j06498O8123K955m195A51150J693K94166k16228L3119K61455j89707
11067C35648k776A00308Q1949L02100p6950J15960j65368Q8015p7934L53140C48482
11055D58426J5209J94825o2484L068q9000j74041q3202M71972J73586m32775J15083
11044E90667M4594N8883k57759R2504o5513J22902l7716l0131L6669J93602j92714
11033E55988k16982O2919K17461p5208N5027J989K4796A75720O35566k23604K73025
11022H60707k75765K4286B00269M8308J37820K07955j5356j16984j34608O735
11012C34139o6327M05198j12105j32973K61727R7706k2262j20609k64085J16606
11002D97015J5514k05735K96916j58051J09608k72050K05622R3871j64165K86697
$$ y = [384755, 278257, 346380, 349335, 345140, 151150, 152843, 447009, 230781, 263900, 525355, 335648, 332872, 100308, 182257, 484357, 407407, 523367, 357999, 446014, 368080, 721220, 348482, 458426, 473635, 668460, 605976, 609044, 520044, 346003, 262801, 734773, 908359, 475584, 590667, 635261, 694144, 436385, 528889, 463376, 586278, 548562, 518431, 555100, 748702, 555988, 339006, 401925, 619386, 544178, 599205, 601194, 625990, 175720, 811286, 587682, 860707, 584942, 609228, 200269, 248577, 386397, 594352, 578996, 462012, 327404, 334139, 267812, 673010, 560905, 427932, 689659, 787365, 765103, 644494, 380409, 497015, 512529, 306794, 603710, 445659, 555267, 283217, 488839, 582710, 418545, 705242]
10992G05242k11398K67239N3974k18101Q7915K16750j28063j47079J33608K93080
10982A053167j89743M80589n55114O65463m4874l9757K92226M57976O4322O1970
10972B246225L00386m8102Q4221k81566l33048j56632k27158k56003n72059K16989
10962I73253k19559N8525K64610j43497k45416J55352Q1551k14298l4079A48882
10951G21673B03728L16363g188B60448b89869A41383A7227K46854j30870j4961
10941A18250d5325G6400a44279B00613f9312L772B94540q4251i627k22057A13481
10929B15854f2559n7486K6215A01404g354q2009q3626C9809h341F200c59274A0813
10916I2283f2239p016B4150L38040b21079A40046D9559c54326D4187d3202g974
$$ y = [705242, 493844, 761083, 815057, 596956, 684871, 901621, 773558, 626479, 760087, 1053167, 863424, 1344013, 788899, 1454362, 1409488, 1369731, 1661957, 2119933, 2184255, 2246225, 2546611, 2498509, 2582730, 2301164, 1968116, 1811484, 1584326, 1328323, 756264, 973253, 753694, 812219, 1076829, 933332, 687916, 843268, 924819, 710521, 676442, 148882, 721673, 203728, 520091, -7188, 260448, -289869, 141383, 17227, 264081, 133211, 118250, -45325, 76400, -144279, 200613, -69312, -65540, 294540, 210289, -9627, -231684, 113481, 215854, -62559, -120045, -93830, 101404, -7354, -89363, -172989, 39809, -8341, 6200, -359274, 10813, 92283, -62239, -69255, 24150, 362190, -221079, 140046, 49559, -354326, 44187, -43202, -7974]
10904F4621J6847C0K02594c281A7754Q1802b55367B27069B7856c59556I5783a58879
10891h3323m3067c7024B33357g9475b658C4330a142j58825C2912J25579e1003
10879i2477A69876o9263b45853I7859k5364g8792p7730r6254C8953J12309o569
10868A44693Q3664H7147c6793o7508A27748l0567c73745f7817B9951a11867E1600
10856a29746f0480A50544b68363Q9520h4468B13512c38557A48502o6059i6868
10845c15471e2548j05782e6060l6355B45030b21096A98354a19544q8933A4226
10834A45972b13859E2819K24255a25623F1802b2759A49629a66719A17677j7301
10824A00376a80619n5960E4996p623K38587d3347q4068k69927B4211c11448A69058
$$ y = [64621, 81468, 30, 202624, -3281, 17754, 99556, -255367, 227069, 27856, -359556, 95783, -158879, -83323, -126390, -37024, 233357, -79475, -2658, 34330, -1142, -159967, 32912, 158491, -51003, -92477, 169876, 100613, -245853, 97859, 72495, -78792, -156522, -252776, 38953, 151262, 144693, 228357, 87147, -36793, -104301, 127748, 97181, -373745, -67817, 29951, -111867, 51600, -129746, -60480, 150544, -268363, -178843, -84468, 213512, -338557, 148502, 82443, -96868, -315471, -52548, -158330, -56060, -92415, 245030, -221096, 198354, -119544, -208477, 14226, 145972, -213859, 52819, 277074, -125623, 61802, -22759, 149629, -166719, 117677, 100376, -180619, -236579, 54996, 47373, 285960, -43347, -127415, -397342, 24211, -311448, 169058]
10812A29173a0727l4190j56772L4364B2109J8434O7050b87445B5150a58982G4621
10800A7291K32381f5011b7612g288p2935c8770q0330F0129a09695A4331F800L11884
10788C18684I1349c5622j68779a6327B42584a61472j2523H1028c22810J15638
10778b07172A79615L6416o7402o7883b07644b1947r7186B96918A9626b29787N1450
10767a78337F5297b18261L4660a9037o180B17176b69251a11969E988Q9305a85375
10755E2646L46075d4761A35295Q587h1608I046b15145A03194f9482A36645g992
10743a85888h6619j26091b9627a164k5369n0041A18314L5527a59323b6332k76906
10732c03238K7567B81352a19157B84553F053b33743G9214P7287b7101k87086A42972
$$ y = [129173, -10727, -44917, -201689, -167325, 22109, 40543, 107593, -287445, 25150, -158982, 74621, 17291, 249672, -65011, -27612, -7288, -80223, -38770, -119100, 60129, -109695, 14331, 6800, 318684, 91349, -35622, -204401, -16327, 242584, -161472, -173995, 81028, -322810, -207172, 179615, 216031, 148629, 80746, -207644, -21947, -119133, 296918, 19626, -229787, -178337, 65297, -218261, -183601, -19037, -25217, 217176, -269251, -111969, 5988, 95293, -185375, 52646, 398721, -44761, 135295, 143882, -81608, 9046, -215145, 103194, -69482, 136645, -7992, -185888, -86619, -212710, -29627, -1164, -26533, -76574, 118314, 153841, -159323, -26332, -303238, -275671, 281352, -119157, 284553, 6053, -233743, 79214, 156501, -27101, -314187, 142972]
10720A889d06483a6791G9577a00969A2941e0026k30930A32953R677c01259G3675
10708B8488a62978a6274F6667d77496B38904g2546j3806q9802k60793g6456l5711
10697a12167B52602a32449a4881f114m15349M8556A33163l2321b0608A54690J01285
10686B55975b00245O5352d0826A83221M8015d88230a91050B17607c959B19995
10675b64498A06370a82408j11266d9352j77480j02702J34490C8846b6965I5308
10664A76677O000K2262o7614i8669A81869b3122q8685j01969A04914J20665f8146
10652a72534K2864A5329a88531a2452A34011O3888b6407G5172a56160A22338i9982
10640a4125m3184A95225r6606b53588g7459J0169B2787e8109F0969J14420p1650
$$ y = [1889, -406483, -16791, 79577, -100969, 12941, -50026, -280956, 132953, 142630, -301259, 73675, 28488, -162978, -16274, 66667, -477496, 238904, -72546, -86352, -176154, -436947, -76456, -112167, 252602, -132449, -14881, -6114, -421463, -372907, 133163, 100842, -20608, 154690, 255975, -200245, -134893, -40826, 183221, 231236, -488230, -191050, 217607, -3959, 219995, -264498, 106370, -182408, -293674, -49352, -226832, -329534, -195044, 38846, -26965, 95308, 176677, 182677, 204939, 137325, -98669, 181869, -23122, -111807, -213776, 104914, 225579, -68146, -172534, -149670, 15329, -188531, -12452, 134011, 197899, -26407, 75172, -156160, 122338, -99982, -14125, -57309, 195225, 98619, -253588, -77459, -67290, 22787, -58109, 60969, 175389, 103739]
10629A03739b2701k20098R7338A33100k381i8421j21394A82907c51288m1206a79526
10617a59616b0135q9525b7614A93791A8113a31891N6369A24460c06255I5161d81596
10605c49388O6010G5891Q0270C3093h887B769h7705o229m8731j20561a00250p7742
10593a77992c9939j35233L6126i57j08434c2871j11750H6743J05030c65820E9947
10581C90158b04331L6063q8010J1744G156J66860G5860a29268A97489a16141B07964
10569I3522A0235b01751e7893j16918B91601g5173k6913k05243D0615K38604j20365
10558A58854a06438H1162B9082d5286K870k1668l35171A67069b91885B31929G4184
10546C61710C2520A2563a64878B14548a1388c652p1759j83646B74486A8014d6464
$$ y = [103739, -22701, -242799, -145461, 133100, 130719, -98421, -219815, 182907, -351288, -392494, -179526, -159616, -20135, -109660, -27614, 193791, 18113, -131891, -75522, 124460, -306255, 95161, -481596, -349388, -283378, 75891, 156161, 33093, -8887, 2769, -87705, -93934, -142665, -263226, -100250, -177992, -39939, -175172, -139046, -957, -109391, -32871, -144621, 86743, 191773, -365820, 59947, 390158, -204331, -168268, -256278, -244534, 7156, 174016, 75860, -129268, 197489, -116141, 207964, 93522, 10235, -201751, -57893, -174811, 291601, -75173, -102086, -307329, 40615, 279219, 158854, -106438, 81162, 29082, -45286, -42416, -64084, -399255, 167069, -291885, 231929, 74184, 361710, 32520, 12563, -164878, 214548, -11388, -3652, -75411, -259057, 274486, 18014, -46464]
10534a72225A2800A564a09205A38308a60467j84887a27967B18557C1082C452g7642
10522b04565B93446A9561d3648j38115j066B36559a5895k01106l8654b7395j33125
10511a60520A18563b49031J7784J03040a18j8471o7034A3271e7828a0660j75198
10500a85858K1180K3972A7920k06J33209a8517j52090B07862a9851q6333m7078
10489a53262B02820K19189a68056r6145e0194A03256a09135K0976B54688a05712
10478d15940B53240D6519c166j68321a6203H6390K5905b43726I284k426N1351
10467E8209N2552h1195E896K15556H1194b48374A09788c03012K8390G0195P9164
10456A49359k3299a52388A58506O9419b34206b475n2928a4701k22928B33040O3900
$$ y = [-172225, 12800, 1564, -109205, 138308, -160467, -345354, -127967, 218557, 31082, 3452, -77642, -204565, 293446, 19561, -43648, -181763, -182829, 236559, -15895, -217001, -255655, -27395, -160520, 118563, -249031, -231247, -128207, -118, -18589, -85623, 13271, -57828, -10660, -185858, -164678, -140706, 17920, 17714, 150923, -18517, -170607, 207862, -19851, -106184, -153262, 202820, 422009, -168056, -264201, -50194, 103256, -109135, -88159, 254688, -105712, -415940, 253240, 46519, -3166, -171487, -16203, 86390, 112295, -243726, 9284, 6858, 58209, 110761, -81195, 5896, 221452, 81194, -248374, 109788, -303012, -274622, 70195, 149359, 126060, -152388, 158506, 227925, -234206, -2475, -55403, -14701, -237629, 233040, 296940]
10445B96940c454B664a67173j37668a40667A74054c5481r0584j45212G3440J43020
10434B16460a01494I8541q545g2584j15420b249l502A42539C8823J89842b53953
10422a72970A09721f2652r0466J1837o76D24546E0812i5730l82058K01193A24293
10410a25157D46266A9285K0652i0517m4135C11852C3013M0965Q0583D4256J40918
10399A85174J07164f0534j08089C29936c57690A66914C0936K35947h8257B54241
10388c97928a80527B05932e0124B77346o703f3898A83742m8728K19235f293C46539
10376G5033K48143d128A37550O4906Q857q0835M7020a53575D63780k3177q0259
10365C60344A57040J67165R8613G6135M6177R8843B484K57417j06664N5968o6210
$$ y = [296940, -3454, 2664, -167173, -304841, -140667, 174054, -35481, -126065, -271277, 73440, 216460, -101494, 98541, 89996, -72584, -188004, -2249, -5751, 142539, 38823, 228665, -253953, -172970, 109721, -62652, -153118, -141281, -141957, 424546, 50812, -95730, -477788, -276595, 124293, -125157, 446266, 19285, 39937, -90517, -134652, 311852, 33013, 73978, 154561, 44256, 185174, 292338, -60534, -168623, 329936, -357690, 166914, 30936, 266883, -88257, 254241, -397928, -180527, 205932, -50124, 277346, 270643, -63898, 183742, 135014, 354249, -6293, 346539, 75033, 323176, -4128, 137550, 202456, 211313, 130478, 177498, -153575, 463780, 440603, 360344, 157040, 324205, 422818, 76135, 122312, 221155, 2484, 259901, 153237, 209205, 142995]
10354A42995m1328K26643A32O90251l45154k5781p6769o8614A7932c31102C49917
10342a4330A06183A5182L31520G9553Q9767m3060n0931Q2875J51066e921F7404
10330i7212D98709A77182a95002g6712C8681q479K45865K75596a49247C47742
10319c5384a5348j547A63781J0163L2508a50256I8556k9657K43495a58379A15183
10307d0922B67205b37212J15049B69541A5987a5721k8381m685A77385E4462c13204
10295I9672f7727G095g1816F357O1680b60038R1699R611A09651J52686b2598p7556
10283a00154b3805h048m6328k53413c1211B6637b32927L8338o2006h4189A0977
10271A93619i6270a6505j8620j68481P0961H8564d35385e2159H3809a26405B49694
$$ y = [142995, 101667, 328310, 132, 690383, 345229, 319448, 242679, 174065, 17932, -331102, 349917, -14330, 106183, 15182, 346702, 79553, 169320, 126260, 75329, 158204, 309270, -5921, 67404, -97212, 498709, 177182, -195002, -76712, 38681, 30202, 276067, 551663, -149247, 347742, -35384, -15348, -16895, 163781, 173944, 206452, -150256, 98556, 68899, 312394, -158379, 115183, -40922, 267205, -237212, -122163, 269541, 15987, -15721, -44102, -48787, 177385, 54462, -313204, 99672, -67727, 7095, -71816, 6357, 68037, -260038, -168339, -158728, 109651, 262337, -22598, -100154, -23805, -8048, -54376, -307789, -31211, 26637, -232927, -194589, -256595, -84189, 10977, 193619, -96270, -16505, -35125, -203606, -132645, 88564, -435385, -52159, 83809, -126405, 249694]
10259C33394a95387l8702C31499A43984J6653K8667a02167b5892B36001E3603
10248d82780a99541A27794a37118A93176c3409k8854j12608K8678i503j51479
10238a60982b4686k17311A63454c06889f7671B7612a73240A87320c26064D0396
10227g8327D8813c71410H5916i0538J0635B67397h8440A6189J1894c71155A88992
10215d55876A47451a22958e6591A36484a05474D2837a99407O4479I4584a50282
10204H2920B6717c572E1229d2187B28081m1294i8061r9595H5032J9774a69756
10192i4503I416O2089g0791a1913j734B85229d4791B99203c0979j03828F0208
10180a33921K622l4758A86871E2784c8295j31368E4537a38582j38016A8437e9296
$$ y = [333394, -195387, -234089, 331499, 143984, 160637, 189304, -102167, -25892, 236001, 53603, -482780, -199541, 127794, -137118, 193176, -33409, -62263, -174871, -146193, -9503, -160982, -24686, -241997, 163454, -306889, -67671, 27612, -173240, 187320, -326064, 40396, -78327, 48813, -371410, 85916, -90538, -79903, 267397, -88440, 16189, 28083, -371155, 188992, -455876, 147451, -122958, -56591, 136484, -105474, 42837, -199407, -134928, 94584, -150282, 82920, 26717, -3572, 51229, -42187, 228081, 186787, -98061, -197656, 85032, 104806, -169756, -94503, 9416, 71505, -70791, -11913, -13647, 285229, -44791, 299203, -30979, -134807, 60208, -133921, -131299, -166057, 186871, 52784, -38295, -169663, 54537, -138582, -276598, 18437, -59296]
10168b47867e6429j1537c0462B87263o6335a40555L9304k7564M4016l2999m5891
10157a63689B64060j16895i2156D9574b25799k1990l23491a49532j00470a068
10146h908A60086a10448c234j98067c8268l6498A16346g0170B89104g5426B68462
10134D748b06680I7886b56726I5305l4086K79969c5190k02955A32751i7828A40540
10122c24806e4629k28876A87819c24307Q8994n5534B4784e2594l3133A74166b01666
10110a10263F8689q815a06517k02430J03527D7731b54122h9719p4866k7784M4645
10099a47724B0089K1318e0867p5056o1977C303b07726O7457B33122a28774G8228
10087C4021c47152A3046a22375M3977c3673j26063C4284a18963e9108p0791i603
$$ y = [-247867, -56429, -67966, -30462, 287263, 220928, -140555, -101251, -128815, -84799, -117798, -163689, 264060, 147165, -92156, 49574, -225799, -247789, -571280, -149532, -250002, -1068, -8908, 160086, -110448, -3234, -201301, -38268, -74766, 116346, -70170, 289104, -75426, 268462, 4748, -206680, 97886, -256726, 95305, 61219, 341188, -35190, -238145, 132751, -97828, 140540, -324806, -54629, -283505, 187819, -324307, -235313, -290847, 24784, -52594, -85727, 174166, -201666, -110263, 68689, 59874, -106517, -308947, -205420, 47731, -254122, -89719, -164585, -192369, -147724, 20089, 41407, -50867, -125923, -187900, 3303, -207726, -140269, 233122, -128774, 78228, 34021, -347152, 13046, -122375, -78398, -33673, -159736, 34284, -118963, -59108, -129899, -9603]
10075a21490F7665a15465B35780C7382n967d297E673a7075A31258a35102d0407
10063a26181p0102A5391b41137d8953b2605j4326p4821j68376A17821l5039a22761
10051a6201j92223r7628e8408m1493C60923c46239g289B24670l3211D7339a15006
10039d70930A15040a4509j30495a8257A80315G0868l4791K54623g5480C14881
10028b28061o5306g7841I620e6806b0567A83769b71570f0779C53566j48674a33160
10016b2899B4481K10514j10624a72662c8541k72469A16972A5344a52345D6792
10005e36193a72280a8491A36606a90266j81652f9853q9905k10848A67807b80381
9994C0164N5739a82729B7456K13903a06444k7635j32752F8700c55652A14689g3468
$$ y = [-121490, 67665, -115465, 235780, 37382, 31415, -4297, 5673, -17075, 131258, -135102, -40407, -126181, -196283, 15391, -241137, -48953, -22605, -36931, -111752, -280128, 117821, 82782, -122761, -16201, -208424, -306052, -58408, -99901, 360923, -346239, -7289, 224670, 191459, 47339, -115006, -470930, 115040, -14509, -145004, -18257, 180315, 70868, 36077, 290700, -75480, 314881, -228061, -293367, -77841, 9620, -56806, -20567, 183769, -271570, -60779, 353566, 204892, -133160, -22899, 24481, 234995, 124371, -172662, -38541, -311010, 116972, 15344, -152345, 46792, -536193, -172280, -18491, 136606, -190266, -371918, -69853, -159758, -370606, 167807, -280381, 30164, 85903, -182729, 27456, 241359, -106444, -134079, -266831, 68700, -355652, 114689, -73468]
9982a20217o3907f6193F7122A2813K11393c0199A32747r367n538a04174A91193
9970a27554j83454E8999b2824m65178K06849O3755a01898j75267A17361G672M50127
9959D57799d4880C0019b19455f0158B12933e25843A43696a65925g2821l1958A24610
9947f6654n6716a7441r6808r5586N1098A49746L5881G1315D977a42731G8129a24246
9934a0044I5813J13501J48377b07260i5284A44881J15763b49157J10158j26523
9924b65522O7512e180A28457a66308a3284k33953a0597k19083N8109P7601G0866
9912B9481b31639j21249J61201H5975J9934B1304b92609A14715l0773a30072A19657
9900b74414B89802C0811N2540C4771R5208e5675l5324j26325A4594J62058e7591
$$ y = [-120217, -184124, -66193, 67122, 12813, 224206, -30199, 132747, 123380, 117842, -104174, 191193, -127554, -311008, 58999, -22824, -488002, -281153, -217398, -101898, -277165, 117361, 7672, 457799, -44880, 30019, -219455, -60158, 212933, -525843, 143696, -165925, -72821, -104779, 124610, -66654, -123370, -17441, -114249, -209835, -158737, 149746, 185627, 71315, 4977, -142731, 78129, -124246, -10044, 95813, 209314, 357691, -207260, -95284, 144881, 260644, -249157, -138999, -265522, -198010, -5180, 128457, -166308, -13284, -247237, -10597, -229680, -171571, -93970, 70866, 29481, -231639, -352888, -191687, 85975, 105909, 21304, -292609, 114715, 83942, -130072, 119657, -274414, 289802, 30811, 83351, 34771, 129979, -55675, -90999, -217324, 14594, 176652, -57591]
9888b93850I8329b51253A8525i5715E3913a1140j47614p1466h2900A26183C9592
9876A52762b79125f5452A57117c27174K633J21503C1257e1579n6344L1111a2084
9864f3786E87295e2978l20564a057H4745C7545b80287d0406B00879A3012e3173
9852b34486c6326A78471i1288I0579b26797h4075D12913c8344G0743K81267a72187
9840G8226a08820K3959J3184A58044a77985f2983J1734D87023b13161j5198A59248
9828C1697c5462A4122b55960H4431b57788d8273n3027F6902j9373M5570c92874
9816b04586A87464c05864a22326A35962E2858f3787B62343A0009c23370d3861
9805b57662A94512h0485C16550a48723O5636B86642B0723h6711r9637F3508b04867
$$ y = [-293850, 98329, -251253, 18525, -95715, 53913, -11140, -158754, -230220, -82900, 126183, 39592, 152762, -279125, -65452, 157117, -327174, -324541, -203038, 31257, -51579, -107923, -76812, -12084, -63786, 587295, -52978, -373542, -1057, 84745, 37545, -280287, -40406, 200879, 13012, -53173, -234486, -36326, 178471, -91288, 90579, -226797, -84075, 412913, -38344, 70743, 352010, -172187, 78226, -108820, -84861, -71677, 158044, -177985, -62983, -51249, 487023, -213161, -228359, 159248, 31697, -35462, 14122, -255960, 84431, -257788, -48273, -101300, 66902, 47529, 93099, -392874, -204586, 187464, -305864, -122326, 135962, 52858, -63787, 262343, 10009, -323370, -43861, -257662, 194512, -80485, 316550, -148723, -83087, 286642, 20723, -86711, -186348, 63508, -204867]
9793A04243b02222g5394c2876k47469c6633r2369b5803j70630m2743B3988f5592
9781a22522I3837a85034c6336C5159b2240G3622a5632o6322A30612h896r9775
9770a08671L139A07085j9959O8938n3856f5218F7893i8855l71843G5956a19075
9758a19774G6467Q6560d4975a3396j25373k0383D75388B28174A7285J38669d6060
9746d61856d7357A04141n1468a57740K8158m5454g9693A82526D4121b31715K7539
9735b04176c6865l2353B66639a45024H6953E194a0006j67712A50839b51685e9075
9723c18058R7443R3092d2137A24792L1359b78932C67667c69209f5835k16398a953
9711A41862c5496C9817b70393a4807l6835l9397I8557j2029b37847F1641b13286
$$ y = [104243, -202222, -75394, -32876, -280345, -36633, -129002, -25803, -196433, -239176, 23988, -65592, -122522, 93837, -185034, -36336, 35159, -22240, 73622, -15632, -81954, 130612, -8896, -108671, -105532, 107085, 87126, 156064, 102208, -65218, 67893, -98855, -470698, 75956, -119075, -119774, 76467, 163027, -44975, -13396, -138769, -159152, 475388, 228174, 17285, 155954, -46060, -461856, -47357, 104141, 52673, -157740, -129582, -175036, -79693, 182526, 44121, -231715, -204176, -36865, -69218, 266639, -145024, 86953, 5194, -10006, -177718, 150839, -251685, -59075, -318058, -220615, -127523, -42137, 124792, 156151, -278932, 367667, -369209, -65835, -282233, -1953, 141862, -35496, 39817, -270393, -14807, -51642, -91039, 98557, 86528, -237847, 61641, -213286]
9699I2008k5329e7496j50035P9248A0587h0742H0228h9685J0776j16123l277R7831
9687a00478o100B0165b82988a959j07279J2841j07245O7909B6269k262J2381b98562
9674a10980P25J5184j66918j00860E8995k5999P8186i4726l67727e4081r6144
9663a50225j22937D10259g3509B09364a73460l44287b32010F2941b39312R7091
9653a42221B26410j0730b87057Q8713A05229a35397l00051A51797a22626N4393
9643f8233j44073G5866C2014h9132B0746J79176c06362a2015B33698G6202f6423
9631b7209q0302p0715g6389j14675i2852j1557F0459K7952N8234d7047i278A21073
9618D7153d6302D6427a19868l4012A02662a80981N4412l39I6640k6079a51970
$$ y = [92008, 66679, -57496, -207531, -128283, 10587, -80742, 80228, -89685, -78909, -195032, -198309, -100478, -106578, 20165, -282988, -1959, -109238, -96397, -203642, -135733, 26269, 24007, 36388, -298562, -110980, -110255, -95071, -261989, -362849, 58995, 32996, 111182, -94726, -462453, -54081, -150225, -273162, 410259, -73509, 209364, -173460, -517747, -232010, 62941, -239312, -142221, 226410, 215680, -287057, -198344, 105229, -135397, -435448, 151797, -122626, -68233, -212306, 75866, 32014, -89132, 20746, 199922, -306362, -12015, 233698, 76202, -66423, -27209, -107511, -178226, -76389, -191064, -92852, -104409, 60459, 88411, 146645, -47047, -9278, 121073, 47153, -46302, 46427, -119868, -153880, 102662, -180981, -126569, -126908, 96640, 70561, -151970]
9606B1240K2887b77150J09344H2326g2880k19852A0750a3385l6999j08611H4897
9594b30707A74096b96737F9213c46302b846m7062j71280F5241B911b94779R7219
9583a97560i4048m0574M6971C721h9715d4045o5074c0870B65502c33055a08180
9571A51443F9023M6646J2155c5384C37447H7375l5420d8228p600j28429j0626
9560a94883e4260l8318c6552a0047B3161P042J5164K22101b1525j55341B94781
9548c1516p4831C9726J74146D8884b47525b3849A00640b01808K7601A08536J29299
9537B37835a47925C33646J8939A12645a8799Q802j11205j16137A13549b84673
9526A30627J0179D8715b45434R9357F2417R4469a13986A1812f7114B09457d0734
$$ y = [21240, 44127, -277150, -167806, 82326, -72880, -292732, 10750, -13385, -50384, -158995, 84897, -230707, 174096, -296737, 69213, -346302, -2846, -49908, -221188, 65241, 2911, -294779, -197560, -94048, -134622, -87651, 3721, -89715, -44045, -109119, -30870, 265502, -333055, -108180, 151443, 69023, 115669, 127824, -35384, 337447, 87375, 51955, -48228, -55828, -184257, -194883, -54260, -92578, -36552, -10047, 23161, 30203, 45367, 267468, -21525, -176866, 294781, -31516, -106347, 39726, 213872, 48884, -247525, -23849, 100640, -201808, -174207, 108536, 237835, -147925, 333646, 352585, 112645, -18799, -9997, -121202, -237339, 113549, -284673, 130627, 140806, 48715, -245434, -146077, 62417, 156886, -113986, 11812, -67114, 209457, -40734]
9514b53580A8316a619B5301c4031j25523j90238a68498g5362J9842A61550f3828
9502C14095a67523D1063b22359k51575B06075c59426B10980C7855c65484A5595
9491b02256A40132c03051M1880J24091m03149a71961N5678d8073b1152j21382
9481a42534j7609d4662A90941O3000F9618a76132n0755N0533H6787C4962a41083
9469a82837A80648A3143a24924a2169B9149b15855B64329a65010A4371Q2544G27
9457F9021N6163h7429p4530J896j55589a07556A04476C3511a547l27480i4482
9445b93898q8103C5444h4111A9770b11835P7993I8051m2479I842h9154m5788j02322
9433b37264A20818a63994A711c9533o4741A51983c9799I1003k536a37207F6858
$$ y = [-253580, 18316, -1619, 25301, -34031, -159554, -349792, -168498, -75362, -55520, 161550, -63828, 314095, -167523, 41063, -222359, -473934, 206075, -359426, 210980, 37855, -365484, 15595, -202256, 140132, -303051, -261171, -137080, -540229, -171961, -116283, -48073, -21152, -142534, -160143, -44662, 190941, 253941, 69618, -176132, -226887, -176354, 86787, 34962, -141083, -182837, 180648, 13143, -124924, -12169, 29149, -215855, 264329, -165010, 14371, 96915, 727, 69021, 125184, -87429, -161959, -160063, -315652, -107556, 104476, 33511, -1547, -329027, -94482, -293898, -382001, 35444, -84111, 19770, -211835, -133842, 98051, 55572, 9842, -89154, -134942, -237264, 120818, -163994, 1711, -39533, -104274, 151983, -39799, 91003, 88467, -137207, 66858]
9421b45045B29019a3787k5378l2499A48144b70431a18074n7993P7502I5178a65838
9409b37789Q4150q4453B37073b24069n2045j30352H7882K62013A33303C2057a4615
9397A64482a63631E578a16676b5473a0607j90641J8991j20375N6630J05517A96988
9385f5879a9042j08095j00437A90340a04046j02945A36623e0866j69818J00353
9375a20331G4524A7353h5486L4139k18271P3947A77881d9153M458j44978c3440
9363a82288A31999F0542L8730O0486b7852l46973A03586m6415j4105J88884G6692
9351a85947N8733m7494a0777G9708p822e16372B50602G0181e9741j51042B9198
9339d37j53215h223j64212B6911F303c56863B5423b74923G7791L70479a27348
$$ y = [-245045, 229019, -13787, -39165, -71664, 148144, -270431, -118074, -176067, -98565, 95178, -165838, -237789, -153639, -238092, 237073, -224069, -276114, -406466, 87882, 349895, 133303, 32057, -14615, 164482, -163631, 5578, -116676, -25473, -10607, -201248, -182257, -302632, -246002, -140485, 196988, -65879, -19042, -127137, -227574, 190340, -104046, -206991, 136623, -50866, -220684, -120331, 74524, 17353, -85486, -51347, -269618, -195671, 177881, -49153, -44695, -189673, -33440, -182288, 131999, 60542, 99272, 159758, -27852, -374825, 103586, 57171, 43066, 231950, 76692, -185947, -127214, -174708, -10777, 79708, 71886, -516372, 250602, 70181, -59741, -210783, 29198, -437, -153652, -8223, -172435, 26911, 6303, -356863, 25423, -274923, 77791, 448270, -127348]
9327b72167b6013B41395L6753b17783O7462c7926J8181D6049O1192b29113j19610
9316c48723e3274l14427I7561m676i5395j10366D5022a77146B7869a27790k1562
9305a49352I0525a51947g174B57539f9836m60083a53984g4096m3682A45568a13416
9293a65462A74971L2514b20552j33741f7291J4256j43108b0123j63774A28537
9282A55067a26465A19293J16272g3810B04138b14220A31735c30328e8675l96859
9272d55534b9286B37787A4114c55425L1657N4637F8014k1191a46560r4367e4824
9260c10781B21577H8001K8982f6350J9688A08081a62947A27429a92116o0982a16804
9248c99804C5394e49809G213a86062f765A39570e39710B77286a34399B2685K79867
$$ y = [-272167, -26013, 241395, 278148, -217783, -150321, -37926, -19745, 46049, 107241, -229113, -348723, -53274, -367701, 97561, 92885, -95395, -205761, 45022, -177146, 27869, -127790, -149352, 90525, -151947, -7174, 257539, -69836, -529919, -153984, -74096, -117778, 145568, -113416, -165462, 174971, 207485, -220552, -354293, -67291, -53035, -196143, -20123, -183897, 128537, 155067, -126465, 119293, 235565, -73810, 204138, -214220, 131735, -330328, -58675, -455534, -29286, 237787, 14114, -355425, -323768, -269131, 68014, 46823, -146560, -240927, -54824, -310781, 221577, 88001, 116983, -66350, -46662, 108081, -162947, 127429, -192116, -253098, -116804, -399804, 35394, -549809, 7213, -186062, -6765, 139570, -539710, 277286, -134399, 22685, 302552]
9237C02552C0832j4226K0673f9924A80346c3945A53593c9281H3845b56712a14454
9225A90603c6895l61143A01641M3347a93485h402m8182c237G7428b08966m780
9214b13746C06101c00814a20991e2778B52427g3814B21359b43993o204f6653j57855
9203b24508d4211k87472J23611G2906J48476D4284b58943A09367c46281B8039
9192H4984B1572d48865b23829B4873O7008a53388A53921h5346B9198a15663I6750
9180A13064B4756b9765A42643J89308c17284A44559b51745A8152b523D5396a50748
9168d4760j48879E526L3831J70688a33375A1412c19060F9712a34299b9163j07070
9157a36233j3182b0805A82665Q2108a0605F6002J9288g8989k34793a26906n9184
$$ y = [302552, 30832, 16606, 37279, -69924, 180346, -33945, 153593, -39281, 83845, -256712, -114454, 190603, -36895, -398038, 101641, 144988, -193485, -8402, -56584, -3237, 77428, -208966, -213746, 306101, -300814, -120991, -52778, 252427, -73814, 221359, -243993, -250197, -66653, -224508, -44211, -331683, -208072, 72906, 221382, 44284, -258943, 109367, -346281, 28039, 84984, 21572, -448865, -223829, 24873, 91881, -153388, 153921, -85346, 29198, -115663, 96750, 113064, 24756, -29765, 142643, 331951, -317284, 144559, -251745, 18152, -2523, 45396, -150748, -44760, -193639, 5526, 39357, 210045, -133375, 11412, -319060, 69712, -134299, -29163, -136233, -149415, -20805, 182665, 264773, -10605, 66002, 85290, -78989, -313782, -126906, -186090]
9146a86090L9724m5407B31204A15039c4646k71928a03550A40135J37065b92276
9135d5035E50807a22327k8612B37301a67650K260h0438n984A26591F1971A6538
9123a99156B26708a59978E2455J15371M1693K7603a98270g0765D3063N986c7302
9111B42816a39105p7637B68980b04295P4092k59806a08944k9167F7134a6418j80767
9100a97185J632n252C6167j2917a39977D4600b96373C77258g7354c1043D2682
9088B9062b32837J3557n3812J13655B00442b4074A83816a3070j59598M335H9492
9076a64917I5311J0042n2479a11999k98262i1675l7203l1142j16297C8484b9232
9064b73081a2685m22305A37703g788k40057a5895E6306g4605B97955I0006J1353
$$ y = [-186090, -146366, -191773, 231204, 115039, -34646, -306574, -103550, 140135, 277200, -292276, -45035, 550807, -122327, -150939, 237301, -167650, -165390, -80438, -86422, 126591, 61971, 16538, -199156, 226708, -159978, 52455, 167826, 209519, 237122, -198270, -70765, 43063, 49049, -37302, 242816, -139105, -216742, 268980, -204295, -130203, -390009, -108944, -138111, 67134, -16418, -197185, -195553, -200805, 36167, 23250, -139977, 44600, -296373, 377258, -77354, -31043, 42682, 29062, -232837, -219280, -273092, -159437, 200442, -24074, 183816, -13070, -172668, -168333, 89492, -164917, 95311, 105353, 52874, -111999, -410261, -91675, -128878, -160020, -276317, 38484, -29232, -273081, -12685, -434990, 137703, -7788, -247845, -15895, 56306, -74605, 297955, 90006, 101359]
9053A01359K28665a99899c4996p6615B18840b41030K1178B25467e906r777j45962
9042a61645M3917G4317h3935k4171A83028a31444j10304A13531a00870n0518c7930
9030I6539b9770k44085a18643j32268A19185J49500h5446l92870h1700j5912i817
9018A65789n6000e2249A28062a00817d8126j29749A83544b33303i0262a5851k27750
9007b43601h67C9122a97633e6196k73763B39113i657m34133a91496d971q0573
8996h5544d2698R750I5772B5650L4272a04840j64655B696J21311c7568C16929
8984c01794D3747d93422b3528A17072J0326P6706E8883d4337m1141p1731B36771
8972d8390p8374A3913P5326k4912b73803a9452I6865r832h4943J1319n8635A0049
$$ y = [101359, 330024, -199899, -34996, -111611, 218840, -241030, -219852, 225467, -5906, -15683, -161645, -117728, 74317, -83935, -108106, 183028, -131444, -241748, 113531, -100870, -151388, -37930, 96539, -29770, -273855, -118643, -250911, 119185, 268685, -85446, -478316, -81700, -97612, -9817, 165789, 109789, -52249, 128062, -100817, -48126, -177875, 183544, -233303, -90262, -15851, -243601, -867, 39122, -197633, -56196, -329959, 239113, -9657, -443790, -191496, -4971, -85544, -42698, -32948, 95772, 25650, 59922, -104840, -269495, 2696, 124007, -37568, 316929, -301794, 43747, -493422, -23528, 117072, 127398, 204104, 58883, -44337, -85478, -157209, 236771, -48390, -126764, 13913, 89239, 64327, -273803, -19452, 96865, 87033, -84943, -73624, -132259, 10049]
8959c74348D2815c4328a6829H096g4703C6010c7932B7246g3647j86793a02432
8947F2386N3696a8399r8414e817q9517A65205P8161r1274D1729c25655F6647k9754
8935C6893K28794R5174E3514a25218F1098J63301I1879J19155L11417Q7643J84193
8924G94287J335172K503683J0926256j399644C484423A537980F31820B85553j16536
8915A69017k6224E944K20593q3456K48704A17263J98188J16623K1338h8298B40268
8903B6930J54537b12953B759K28359n3882a4669B34189b23064k28197K24624j05850
8892c32487A61042B5812a95838k0783k6464B4706J57259d7486C045L63836A60701
8880A37073a17890r3088A30059L4606b36230E9804N0646N3670d9051I5207Q9424
$$ y = [-374348, 42815, -34328, -16829, 8096, -74703, 36010, -37932, 27246, -73647, -260440, -102432, 62386, 116082, -18399, -116813, -5817, -95334, 165205, 243366, 152092, 41729, -325655, 66647, 36893, 265687, 360861, 53514, -125218, 61098, 224399, 91879, 211034, 522451, 610094, 794287, 2129459, 4633142, 15559398, 14159754, 3484423, 1537980, 631820, 285553, 169017, 142793, 5944, 226537, 143081, 391785, 117263, 315451, 432074, 453412, -88298, 240268, 26930, 181467, -212953, 2759, 231118, 177236, -14669, 234189, -223064, -451261, -226637, -332487, 161042, 25812, -195838, -216621, -243085, 24706, 181965, -47486, 3045, 366881, 160701, 137073, -117890, -210978, 130059, 164665, -236230, 59804, 110450, 164120, -49051, 95207, 184631]
8869A84631b68160h0034E1107c33543a59082A2406M1570g3571q3361B62631A03420
8857H9137d1647k3483o5282j82050C0556f1983A94596a37640j3643A7094g1162
8845h5002j7220L2639j01155L7287A07083b09760H8407l6432b2628p6441K8723
8834g0346k97000D2528c41669a11595B84057b33472G3194K06551e0455j29508
$$ y = [184631, -268160, -80034, 51107, -333543, -159082, 12406, 53976, -73571, -156932, 262631, 103420, 89137, -41647, -65130, -130412, -312462, 30556, -61983, 194596, -137640, -151283, 17094, -71162, -85002, -102222, -69583, -170738, -133451, 107083, -209760, 88407, 51975, -22628, -99069, -70346, -367346, 42528, -341669, -111595, 284057, -233472, 73194, 279745, -50455, -179963]
$$ [...]
##END NTUPLES=NMR SPECTRUM
##END=
