##TITLE=AC1504_CUNCR13311_8126415_M5UcxKlBcI
##JCAMPDX= 6.0         $$ Bruker NMR JCAMP-DX V2.0
##DATA TYPE= NMR SPECTRUM
##DATA CLASS= NTUPLES
##ORIGIN= BRUKER
##OWNER= Administrator
$$ 1.72 TOPSPIN		Version 2.1
$$ 2013-08-15 21:38:50.955 -0700  Administrator@X
$$ Compression mode = diff/dup
##.OBSERVE FREQUENCY= 400.02188249412
##.OBSERVE NUCLEUS= ^1H
##.ACQUISITION MODE= SIMULTANEOUS (DQD)
##.ACQUISITION SCHEME= undefined
##.AVERAGES= 64
##.DIGITISER RES= 22
##SPECTROMETER/DATA SYSTEM= spect
##.PULSE SEQUENCE= noesygpps1d.comp
##.SOLVENT NAME= COFFEE_meoh
##.SHIFT REFERENCE= INTERNAL, COFFEE_meoh, 1, 14.96101
##AUDIT TRAIL= $$ (NUMBER, WHEN, WHO, WHERE, PROCESS, VERSION, WHAT)
$$ ##TITLE= Audit trail, TOPSPIN		Version 2.1
$$ ##JCAMPDX= 5.01
$$ ##ORIGIN= Bruker BioSpin GmbH
$$ ##OWNER= Administrator
$$ $$ E:\/data/COFFEE/nmr/AC1504_CUNCR13311_8126415_M5UcxKlBcI/12/pdata/1/auditp.txt
$$ ##AUDIT TRAIL=  $$ (NUMBER, WHEN, WHO, WHERE, PROCESS, VERSION, WHAT)
(   1,<2013-08-15 21:38:45.987 -0700>,<Administrator>,<X>,<go>,<TOPSPIN 2.1>,
      <created by zg
	started at 2013-08-15 21:27:16.158 -0700,
	POWCHK enabled, PULCHK disabled,
       configuration hash MD5:
       C8 4E 4E 5D D3 5C D8 9E 9F 52 82 E0 59 8A DE 15
       data hash MD5: 64K
       E9 10 33 4C AE A8 05 84 97 79 B0 7D E5 4C AE 6B>)
(   2,<2013-08-15 21:38:48.987 -0700>,<Administrator>,<X>,<proc1d>,<TOPSPIN 2.1>,
      <Start of raw data processing
       efp LB = 0.3 FT_mod = 6 PKNL = 1 PHC0 = 0 PHC1 = 0 SI = 128K 
       data hash MD5: 128K
       6E 1A CF 79 6A 23 D1 13 DB D1 36 AF FF 9E DC 25>)
(   3,<2013-08-15 21:38:49.987 -0700>,<Administrator>,<X>,<proc1d>,<TOPSPIN 2.1>,
      <pk PHC0 = -80.18372 PHC1 = 0 
       data hash MD5: 128K
       8B 19 03 0E 1C 2C 0E 8B 3E 3A 92 E9 E9 4A E4 D4>)
(   4,<2013-08-15 21:38:50.408 -0700>,<Administrator>,<X>,<proc1d>,<TOPSPIN 2.1>,
      <abs ABSG = 1 
       data hash MD5: 128K
       A8 2A EF 40 1F BD 76 33 7B 62 9D B0 28 91 0E 87>)
(   5,<2013-08-15 21:38:50.518 -0700>,<Administrator>,<X>,<proc1d>,<TOPSPIN 2.1>,
      <abs ABSG = 2 
       data hash MD5: 128K
       ED 19 3F CB 30 24 D9 22 A0 52 C4 D8 B2 1D 58 E5>)
(   6,<2013-08-15 21:38:50.596 -0700>,<Administrator>,<X>,<proc1d>,<TOPSPIN 2.1>,
      <abs ABSG = 3 
       data hash MD5: 128K
       D0 2C A3 DD B7 E2 FA AB 17 9B 67 7A 97 5E 51 E3>)
(   7,<2013-08-15 21:38:50.674 -0700>,<Administrator>,<X>,<proc1d>,<TOPSPIN 2.1>,
      <abs ABSG = 4 
       data hash MD5: 128K
       30 45 77 6B F3 16 E8 FE 60 C5 53 1A C3 CB C4 67>)
(   8,<2013-08-15 21:38:50.752 -0700>,<Administrator>,<X>,<proc1d>,<TOPSPIN 2.1>,
      <abs ABSG = 5 
       data hash MD5: 128K
       EC 8F E8 AD 13 C1 80 A9 64 1F 68 F4 4A 04 93 4D>)
$$ ##END=
$$ 
$$ $$ hash MD5
$$ $$ 16 A9 EA 8B 9E 80 F9 2D 0C 43 D5 76 F6 84 B6 34
##$RELAX= 
##$RELAX= 
##$RELAX= 
##$RELAX= 
##$RELAX= 
##$RELAX= 
##$RELAX= 
##$RELAX= 
$$ Bruker specific parameters
$$ --------------------------
##$DU= <E:\>
##$EXPNO= 12
$$ [...]
##$TP07= 0
##$TPNAME0= <>
##$TPNAME1= <>
##$TPNAME2= <>
##$TPNAME3= <>
##$TPNAME4= <>
##$TPNAME5= <>
##$TPNAME6= <>
##$TPNAME7= <>
##$TPOAL= (0..7)
0.5 0.5 0.5 0.5 0.5 0.5 0.5 0.5
##$TPOFFS= (0..7)
0 0 0 0 0 0 0 0
##$TUNHIN= 0
##$TUNHOUT= 0
##$TUNXOUT= 0
##$USERA1= <user>
##$USERA2= <user>
##$USERA3= <user>
##$USERA4= <user>
##$USERA5= <user>
##$V9= 5
##$VALIST= <valist>
##$VCLIST= <CCCCCCCCCCCCCCC>
##$VD= 0
##$VDLIST= <DDDDDDDDDDDDDDD>
##$VPLIST= <PPPPPPPPPPPPPPP>
##$VTLIST= <TTTTTTTTTTTTTTT>
##$WBST= 1024
##$WBSW= 4
##$XGAIN= (0..3)
0 0 0 0
##$XL= 0
##$YL= 0
##$YMAX_a= 6255183
##$YMIN_a= -13878705
##$ZGOPTNS= <>
##$ZL1= 120
##$ZL2= 120
##$ZL3= 120
##$ZL4= 120
##$ABSF1= 14.96101
##$ABSF2= -5.597172
##$ABSG= 5
##$ABSL= 3
##$ALPHA= 0
##$AQORDER= 0
##$ASSFAC= 0
##$ASSFACI= 0
##$ASSFACX= 0
##$ASSWID= 0
##$AUNMP= <proc_prof1d_extract.lims>
##$AXLEFT= 0
##$AXNAME= <>
##$AXNUC= <1H>
##$AXRIGHT= 0
##$AXTYPE= 0
##$AXUNIT= <>
##$AZFE= 0.1
##$AZFW= 0.1
##$BCFW= 0
##$BC_mod= 0
##$BYTORDP= 0
##$COROFFS= 0
##$CY= 15
##$DATMOD= 1
##$DC= 0
##$DFILT= <>
##$DTYPP= 0
##$F1P= 0
##$F2P= 0
##$FCOR= 0.5
##$FTSIZE= 131072
##$FT_mod= 6
##$GAMMA= 0
##$GB= 0
##$INTBC= 1
##$INTSCL= 1
##$ISEN= 128
##$LB= 0.3
##$LEV0= 0
##$LPBIN= 0
##$MAXI= 10000
##$MC2= 0
##$MEAN= 0
##$ME_mod= 0
##$MI= 0
##$NCOEF= 0
##$NC_proc= -2
##$NLEV= 6
##$NOISF1= 0
##$NOISF2= 0
##$NSP= 0
##$NTH_PI= 0
##$NZP= 0
##$OFFSET= 14.96101
##$PC= 1
##$PHC0= -80.18372
##$PHC1= 0
##$PH_mod= 1
##$PKNL= yes
##$PPARMOD= 0
##$PPDIAG= 0
##$PPIPTYP= 0
##$PPMPNUM= 2147483647
##$PPRESOL= 1
##$PSCAL= 4
##$PSIGN= 0
##$PYNMP= <proc.py>
##$REVERSE= no
##$SF= 400.020009633793
##$SI= 131072
##$SIGF1= 0
##$SIGF2= 0
##$SINO= 400
##$SIOLD= 131072
##$SPECTYP= <>
##$SREGLST= <1H.CDCl3>
##$SSB= 0
##$STSI= 131072
##$STSR= 0
##$SW_p= 8223.68421052631
##$SYMM= 0
##$S_DEV= 0
##$TDeff= 65536
##$TDoff= 0
##$TI= <>
##$TILT= no
##$TM1= 0
##$TM2= 0
##$TOPLEV= 0
##$USERP1= <user>
##$USERP2= <user>
##$USERP3= <user>
##$USERP4= <user>
##$USERP5= <user>
##$WDW= 1
##$XDIM= 131072
##$YMAX_p= 351637292
##$YMIN_p= -12212
##$CURPLOT= <Network HP LaserJet P1505>
##$CURPRIN= <$Network HP LaserJet P1505>
##$DFORMAT= <normdp>
##$LAYOUT= <+/1D_H.xwp>
##$LFORMAT= <normlp>
##$PFORMAT= <normpl>
##$SURQMSG= 1
$$ End of Bruker specific parameters
$$ ---------------------------------
##NTUPLES= NMR SPECTRUM
##VAR_NAME=  FREQUENCY,     SPECTRUM/REAL,   SPECTRUM/IMAG
##SYMBOL=    X,             R,               I
##VAR_TYPE=  INDEPENDENT,   DEPENDENT,       DEPENDENT
##VAR_FORM=  AFFN,          ASDF,            ASDF
##VAR_DIM=   131072,        131072,          131072
##UNITS=     HZ,            ARBITRARY UNITS, ARBITRARY UNITS
##FACTOR=    0.0627417313425164, 1,          1
##FIRST=     8223.62146879497, 1414,         -70165
##LAST=      0,             3912,            -69869
##MIN=       0,             -12212,          0
##MAX=       8223.62146879497, 351637292,    0
$$ Real data points
##PAGE= N=1
##DATA TABLE= (X++(R..R)), XYDATA
$$ [...]
$$ plain form
61623 434433 431129 427889 424978 422900 421860 421408 420895 420013 418692 416791 414308 411685 409496 407855 406395
61608 406395 404697 402439 399263 395006 390192 385883 382766 380503 378179 375265 371972 368747 365696 362660
61594 362660 359714 357291 355676 354518 353142 351363 349705 348695 348179 347527 346323 344598 342612 340759 339562
61579 339562 339309 339628 339674 338874 337305 335376 333532 332348 332463 333948 335888 337006 336896 336428 336784 338155
61563 338155 339561 340001 339607 339464 340341 341936 343518 344938 346583 348492 350099 351015 351588 352319 353033 353082 352302
61546 352302 351392 351185 351816 352721 353359 353793 354603 356324 358960 361967 364618 366428 367370 367855 368494 369718 371499
61529 371499 373379 374765 375287 375024 374507 374308 374447 374294 373314 371777 370353 369077 367262 364692 362335 361352
61513 361352 361697 362303 362515 362677 363194 363688 363528 362764 362019 361600 361203 360520 359710 359126 358849 358715 358645 358717 358965
$$ packed form
61623D34433l304l240k911k078j040m52n13q82j321j901k483k623k189j641j460
61608D06395j698k258l176m257m814m309l117k263k324k914l293l225l051l036
61594C62660k946k423j615j158j376j779j658j010n16o52j204j725j986j853j197
61579C39562k53L19M6q00j569j929j844j184J15J485J940J118j10m68L56J371
61563C38155J406M40l94j43Q77J595J582J420J645J909J607R16N73P31P14M9p80
61546C52302r10k07O31R05O38M34Q10J721K636L007K651J810R42M85O39J224J781
61529C71499J880J386N22k63n17j99J39j53r80j537j424j276j815k570k357r83
61513C61352L45O06K12J62N17M94j60p64p45m19l97o83q10n84k77j34p0P2K48
$$ plain form
61494 358965 359214 359122 358349 356810 354940 353557 353221 353664 354074 353994 353748 353925 354753 356153 358071 360291 362122
61477 362122 362869 362779 363028 364464 366677 368583 369617 370020 370248 370606 371328 372440 373442 373593 372727 371449 370403
61460 370403 369640 368946 368407 368324 368778 369607 370725 372113 373574 374756 375437 375648 375625 375918 377303 380117 383577
61443 383577 386185 387062 386737 386516 387334 389325 392142 395302 398321 400864 402857 404358 405395 406041 406560 407274
61427 407274 408297 409464 410463 410946 410697 409939 409369 409648 410842 412509 414168 415467 416082 415959 415655 416004 417219
61410 417219 418663 419672 420263 420778 421178 421060 420167 418557 416381 413835 411259 408993 407140 405663 404600
61395 404600 403950 403453 402762 401842 400966 400395 400314 400891 402025 403120 403558 403436 403416 403815 404315 404693 405261 406300
61377 406300 407495 408430 409328 410784 412895 415123 416981 418473 419815 421072 422210 423338 424781 426945 429982
$$ packed form
61494C58965K49r2p73j539j870j383l36M43M10q0k46J77Q28J400J918K220J831
61477C62122P47r0K49J436K213J906J034M03K28L58P22J112J002J51q66j278j046
61460C70403p63o94n39q3M54Q29J118J388J461J182O81K11k3K93J385K814L460
61443C83577K608Q77l25k21Q18J991K817L160L019K543J993J501J037O46N19P14
61427D07274J023J167R99M83k49p58n70K79J194J667J659J299O15j23l04L49J215
61410D17219J444J009N91N15M00j18q93j610k176k546k576k266j853j477j063
61395D04600o50m97o91r20q76n71q1N77J134J095M38j22k0L99N00L78N68J039
61377D06300J195R35Q98J456K111K228J858J492J342J257J138J128J443K164L037
$$ plain form
61362 429982 433445 436450 438424 439705 441138 443151 445447 447600 449735 452535 456688 462270 468587 474722
61348 474722 480424 486322 493036 500287 507197 513284 518727 523757 528396 532829 537421 542116 546331 549757
61334 549757 552774 555734 558327 560143 561458 562817 564162 565033 565501 566116 566840 566768 565243 562766 560469 559094
61318 559094 558776 559468 561140 563680 566953 570913 575544 580874 587228 595209 605149 616734 629357 642613
61304 642613 656195 669661 682785 695931 709494 722929 734873 744312 751161 755613 757546 756951 754367
61291 754367 750258 744217 735472 724196 711769 699590 688114 677224 667011 657666 648887 639987 630768
61278 630768 621935 614437 608626 604272 601199 599530 599302 600170 601716 603855 606670 609969 613325 616579 620011
61263 620011 623841 627808 631469 634794 638269 642426 647488 653385 659878 666560 672976 678908 684486 689872
$$ packed form
61362D29982L463L005J974J281J433K013K296K153K135K800M153N582O317O135
61348D74722N702N898O714P251O910O087N443N030M639M433M592M695M215L426
61334E49757L017K960K593J816J315J359J345Q71M68O15P24p2j525k477k297j375
61318E59094l18O92J672K540L273L960M631N330O354P981R940J1585J2623J3256
61304F42613J3582J3466J3124J3146J3563J3435J1944R439O849M452J933n95k584
61291G54367m109o041q745j1276j2427j2179j1476j0890j0213r345q779q900r219
61278F30768q833p498n811m354l073j669k28Q68J546K139K815L299L356L254L432
61263F20011L830L967L661L325L475M157N062N897O493O682O416N932N578N386
$$ plain form
61249 689872 694857 698890 701574 703113 704105 704828 704808 703374 700659 697729 695460 693543 690981 687539 684246
61234 684246 682323 681982 682523 683339 684445 686132 688481 691366 694804 699148 704879 712092 720221 728485 736720
61219 736720 745579 755662 766659 777605 787877 797594 807045 816152 824591 832151 838791 844620 850035
61206 850035 855574 861402 867093 872207 876910 881706 886717 891700 896771 902652 909989 918743 928491 939076
61192 939076 950678 963437 977249 991753 1006256 1019817 1031726 1041881 1050368 1056770 1060287 1060646
61180 1060646 1058543 1055090 1051091 1046922 1042643 1037918 1032144 1025094 1017309 1009553 1001978 994149 985687 976497
61166 976497 966388 954970 942052 927889 912918 897536 882161 867207 852781 838647 824631
61155 824631 810923 797872 785742 774746 765076 756726 749477 743186 737806 733035 728335 723601 719445
$$ packed form
61249F89872M985M033K684J539R92P23k0j434k715k930k269j917k562l442l293
61234F84246j923l41N41Q16J106J687K349K885L438M344N731P213Q129Q264Q235
61219G36720Q859J0083J0997J0946J0272R717R451R107Q439P560O640N829N415
61206H50035N539N828N691N114M703M796N011M983N071N881P337Q754R748J0585
61192I39076J1602J2759J3812J4504J4503J3561J1909J0155Q487O402L517L59
61180A060646k103l453l999m169m279m725n774p050p785p756p575p829q462r190
61166I76497j0109j1418j2918j4163j4971j5382j5375j4954j4426j4134j4016
61155H24631j3708j3051j2130j0996r670q350p249o291n380m771m700m734m156
$$ plain form
61142 719445 716364 713842 710754 706558 701616 696424 691131 685969 681661 679020 678363 679500 682084 685770
61128 685770 690285 695661 702372 711023 721940 735137 750554 768197 788069 810032 833639 858128
61116 858128 882899 908225 935269 965052 997402 1031015 1064446 1096800 1127698 1157077 1185174
61105 1185174 1212322 1238392 1262546 1283777 1301648 1316339 1328053 1336590 1341534 1342584 1339531 1332050
61093 1332050 1319811 1302981 1282503 1259637 1235130 1208895 1180623 1150604 1119840 1089321 1059392
61082 1059392 1029909 1000924 973037 947011 923117 900913 879730 859386 840429 823671 809515
61071 809515 797787 788062 779946 773054 767063 762045 758582 757205 757694 759223 761214 763825 767476 772281
61057 772281 778153 785267 793999 804411 816082 828521 841574 855395 870250 886480 904463 924405
$$ packed form
61142G19445l081k522l088m196m942n192n293n162m308k641o57J137K584L686
61128F85770M515N376O711Q651J0917J3197J5417J7643J9872K1963K3607K4489
61116H58128K4771K5326K7044K9783L2350L3613L3431L2354L0898K9379K8097
61105A185174K7148K6070K4154K1231J7871J4691J1714Q537M944J050l053p481
61093A332050j2239j6830k0478k2866k4507k6235k8272l0019l0764l0519k9929
61082A059392k9483k8985k7887k6026k3894k2204k1183k0344j8957j6758j4156
61071H09515j1728r725q116o892n991n018l463j377M89J529J991K611L651M805
61057G72281N872P114Q732J0412J1671J2439J3053J3821J4855J6230J7983J9942
$$ plain form
61045 924405 946197 969575 994367 1020534 1048034 1076844 1107143 1139355 1173821 1210354 1248166
61034 1248166 1286388 1324710 1363513 1403371 1444547 1487039 1530955 1576631 1624345 1674037 1725335
61023 1725335 1777836 1831423 1886474 1943843 2004672 2070198 2141637 2220020 2306170 2401316 2508091
61012 2508091 2630715 2773819 2941226 3136205 3362712 3625919 3931868 4287684 4702585
61003 4702585 5188010 5756082 6417922 7183020 8058538 9047359 10146423 11347809 12641871
60994 12641871 14018948 15467552 16970168 18498865 20011766 21451433 22747855 23828618
60986 23828618 24635001 25137808 25345168 25298525 25058995 24689361 24236134 23715376 23107684
60977 23107684 22367299 21443539 20304166 18949529 17414333 15761086 14069004 12419443
$$ packed form
61045I24405K1792K3378K4792K6167K7500K8810L0299L2212L4466L6533L7812
61034A248166L8222L8322L8803L9858M1176M2492M3916M5676M7714M9692N1298
61023A725335N2501N3587N5051N7369O0829O5526P1439P8383Q6150R5146J06775
61012B508091J22624J43104J67407J94979K26507K63207L05949L55816M14901
61003D702585M85425N68072O61840P65098Q75518R88821J099064J201386J294062
60994A2641871J377077J448604J502616J528697J512901J439667J296422J080763
60986B3828618Q06383N02807K07360m6643k39530l69634m53227n20758o07692
60977B3107684p40385r23760j139373j354637j535196j653247j692082j649561
$$ plain form
60969 12419443 10880498 9496630 8287284 7252386 6379545 5649995 5042957 4538368 4117812
60960 4117812 3764723 3465133 3208496 2987208 2795088 2626488 2476683 2342327 2221107
60951 2221107 2111215 2011350 1920853 1839222 1765421 1697920 1635484 1577626 1524073 1473946 1425788
60940 1425788 1378520 1332113 1287162 1243933 1202100 1161331 1121830 1084201 1048889 1015824 984509
60929 984509 954455 925633 898505 873546 850790 829955 810827 793384 777724 764124 752923
60918 752923 743874 735785 727400 718713 710894 704819 700234 696530 693645 691766 690664 689910 689482 689679 690604
60903 690604 692088 693912 695711 696911 697240 697164 697399 698039 698536 698387 697501 696002 693973 691327 687644 682385
60887 682385 675668 668548 662006 655832 649067 641420 633542 625864 617942 609236 599956 590766 582069 573937
$$ packed form
60969A2419443j538945j383868j209346j034898q72841p29550o07038n04589m20556
60960D117812l53089k99590k56637k21288j92120j68600j49805j34356j21220
60951B221107j09892r9865r0497q1631p3801o7501o2436n7858n3553n0127m8158
60940A425788m7268m6407m4951m3229m1833m0769l9501l7629l5312l3065l1315
60929I84509l0054k8822k7128k4959k2756k0835j9128j7443j5660j3600j1201
60918G52923r049q089q385q687p819o075m585l704k885j879j102p54m28J97R25
60903F90604J484J824J799J200L29p6K35O40M97j49q86j499k029k646l683n259
60887F82385o717p120o542o174o765p647p878p678p922q706r280r190q697q132
$$ plain form
60873 573937 566355 559169 552096 545191 539097 534429 531004 527993 524819 521642 518973 517031 515601 514448
60859 514448 513771 514089 515577 517636 519371 520485 521474 522889 524707 526549 528266 530093 532289 534826 537433
60844 537433 539836 541882 543390 544036 543641 542611 541672 540887 539316 536174 532082 528520 526099 524036 521444
60829 521444 518425 515574 513082 510863 509132 508317 508488 509285 510200 510714 510420 509384 508154 507074 505757 503610
60813 503610 500629 497296 493902 490409 486884 483513 480218 476688 472879 469117 465643 462371 459141 455834
60799 455834 452229 448115 443735 439770 436655 434129 431602 428822 425994 423431 421291 419556 418114 416875
60785 416875 415902 415363 415288 415416 415355 414889 414122 413400 413086 413361 414141 415234 416554 418153 420065 422196 424379
60768 424379 426559 428887 431572 434565 437410 439631 441340 443263 446014 449552 453441 457424 461352 464795
$$ packed form
60873E73937p582p186p073o905o094m668l425l011l174l177k669j942j430j153
60859E14448o77L18J488K059J735J114R89J415J818J842J717J827K196K537K607
60844E37433K403K046J508O46l95j030r39p85j571l142m092l562k421k063k592
60829E21444l019k851k492k219j731q15J71P97R15N14k94j036j230j080j317k147
60813E03610k981l333l394l493l525l371l295l530l809l762l474l272l230l307
60799D55834l605m114m380l965l115k526k527k780k828k563k140j735j442j239
60785D16875r73n39p5J28o1m66p67p22l14K75P80J093J320J599J912K131K183
60768D24379K180K328K685K993K845K221J709J923K751L538L889L983L928L443
$$ plain form
60754 464795 467194 468465 469057 469231 468602 466637 463454 459911 456914 454737 452957 450968 448583 446157 444057
60739 444057 442112 439722 436513 432650 428419 423743 418351 412345 406404 401311 397292 393867 390429 386967
60725 386967 384077 382164 380854 379497 378085 377199 377020 376931 376315 375312 374374 373452 372220 370880 370148 370375
60709 370375 371183 372141 373243 374554 375850 377014 378355 380098 381902 383481 385446 388719 393024 396749 398728
60694 398728 399647 401119 403772 406845 409487 411789 414428 417836 421934 426300 430367 433692 436331 438827
60680 438827 441722 445160 448927 452617 455711 457877 459378 460894 462641 463939 463957 462688 460844 458962 457028
60665 457028 454936 452833 450897 449059 447120 444975 442591 439972 437230 434529 431853 428991 425915 423110
60651 423110 421337 421022 421923 423397 424934 426411 427873 429263 430522 431791 433183 434277 434204 432516 429818
$$ packed form
60754D64795K399J271N92J74o29j965l183l543k997k177j780j989k385k426k100
60739D44057j945k390l209l863m231m676n392o006n941n093m019l425l438l462
60725C86967k890j913j310j357j412q86j79q9o16j003r38r22j232j340p32K27
60709C70375Q08R58J102J311J296J164J341J743J804J579J965L273M305L725J979
60694C98728R19J472K653L073K642K302K639L408M098M366M067L325K639K496
60680D38827K895L438L767L690L094K166J501J516J747J298J8j269j844j882j934
60665D57028k092k103j936j838j939k145k384k619k742k701k676k862l076k805
60651D23110j773l15R01J474J537J477J462J390J259J269J392J094p3j688k698
$$ plain form
60636 429818 427275 425566 424465 423321 421700 419712 417974 417220 417674 418816 419907 420595 420838 420569 419901 419444
60620 419444 419846 420931 421846 422148 422303 422978 424294 425932 427450 428287 427967 426697 425372 424605 424144 423610 423392
60603 423392 424186 425901 427653 428759 429215 429223 428849 428259 427837 427817 428077 428438 428928 429666 430728 432177 433958 435710
60585 435710 436928 437385 437208 436565 435654 435030 435453 437091 439187 440835 441951 443237 445391 448657 452983 458206
60569 458206 463985 469839 475468 481036 487106 494226 502406 510925 518822 525807 532563 539923 547739 554769
60555 554769 559697 562127 562550 561599 559558 556587 553197 550263 548412 547489 546884 546422 546659 548150 550756 554032
60539 554032 558087 563563 570767 579337 588806 599006 609682 620238 630323 640340 650835 661614
60527 661614 671899 681188 689387 696183 700988 703604 704360 703333 700040 694336 687192 680044 673574 667525
$$ packed form
60636D29818k543j709j101j144j621j988j738p54M54J142J091O88K43k69o68m57
60620D19444M02J085R15L02J55O75J316J638J518Q37l20j270j325p67m61n34k18
60603D23392P94J715J752J106M56Ql74n90m22k0K60L61M90P38J062J449J781J752
60585D35710J218M57j77o43r11o24M23J638K096J648J116J286K154L266M326N223
60569D58206N779N854N629N568O070P120Q180Q519P897O985O756P360P816P030
60555E54769M928K430M23r51k041k971l390k934j851r23o05m62K37J491K606L276
60539E54032M055N476P204Q570R469J0200J0676J0556J0085J0017J0495J0779
60527F61614J0285R289Q199O796M805K616P56j027l293n704p144p148o470o049
$$ plain form
60513 667525 661534 655696 650449 646316 643710 642656 642736 643591 645384 648510 653079 659107 667089 677792 691448
60498 691448 707627 725970 746629 769857 795616 823637 853423 884110 914869 945596 976585
60487 976585 1007250 1035770 1060398 1080609 1096506 1107626 1112973 1111899 1104363 1090627 1071333 1047647
60475 1047647 1020636 990578 957439 921868 885095 848053 811380 776220 744034 715307 689166
60464 689166 664687 641964 621518 603237 586484 570932 556816 544508 534134 525429 517818 510875
60452 510875 504811 500057 496268 492326 487709 483326 480457 479281 478890 478348 477118 474903 471867 468877 466818
60437 466818 465680 464877 464252 464056 464077 463681 462839 462250 462197 462038 461234 460170 459483 459149 458783 458359 458027 457621 456972
60418 456972 456364 456098 455912 455515 455484 456780 459392 462239 464570 466721 469214 471813 473974 475708 477413 479146
$$ packed form
60513F67525n991n838n247m133k606j054Q0Q55J793L126M569O028P982J0703J3656
60498F91448J6179J8343K0659K3228K5759K8021K9786L0687L0759L0727L0989
60487I76585L0665K8520K4628K0211J5897J1120N347j074p536j3736j9294k3686
60475A047647k7011l0058l3139l5571l6773l7042l6673l5160l2186k8727k6141
60464F89166k4479k2723k0446j8281j6753j5552j4116j2308j0374q705p611o943
60452E10875o064m754l789l942m617m383k869j176l91n42j230k215l036k990k059
60437D66818j138q03o25j96K1l96q42n89n3j59q04j064o87l34l66m24l32m06o49
60418D56972o08k66j86l97l1J296K612K847K331K151K493K599K161J734J705J733
$$ plain form
60402 479146 480642 481932 483383 485088 486630 487642 488305 489104 490291 491784 493554 495879 499078 502999 506952
60387 506952 510288 513020 515695 518714 521983 525308 528753 532370 535803 538547 540481 541914 543207 544739
60373 544739 547089 550689 555140 559326 562543 565218 568206 571669 575063 578052 580932 584142 587758 591575
60359 591575 595326 598735 601673 604491 607902 612340 617618 623401 629751 636916 644790 652933 661074 669245
60345 669245 677404 685299 692751 699707 705834 710356 712576 712424 710302 706532 701228 694650 687329 679764
60331 679764 672124 664357 656474 648644 641124 634174 628010 622729 618266 614452 611154 608281 605655 602924
60317 602924 599834 596702 594515 594247 595982 598902 602258 606201 611524 618761 627766 638031 649091 660643
60303 660643 672604 685171 698579 712597 726407 739108 750227 759586 766727 770654 770233 764908 755228
$$ packed form
60402D79146J496J290J451J705J542J012O63P99J187J493J770K325L199L921L953
60387E06952L336K732K675L019L269L325L445L617L433K744J934J433J293J532
60373E44739K350L600M451M186L217K675K988L463L394K989K880L210L616L817
60359E91575L751L409K938K818L411M438N278N783O350P165P874Q143Q141Q171
60345F69245Q159P895P452O956O127M522K220j52k122l770n304o578p321p565
60331F79764p640p767p883p830p520o950o164n281m463l814l298k873k626k731
60317F02924l090l132k187k68J735K920L356L943N323P237R005J0265J1060J1552
60303F60643J1961J2567J3408J4018J3810J2701J1119R359P141L927m21n325r680
$$ plain form
60290 755228 742731 729109 715277 701193 686575 671690 657398 644613 633799 624802 617027 609925
60278 609925 603513 598258 594302 590981 587397 583354 579360 575784 572388 568796 565029 561329 557701 553935
60264 553935 550022 546299 543172 540725 538636 536472 534178 532213 531036 530470 529810 528589 526974 525388 524100
60249 524100 523374 523590 524833 526582 528229 529759 531524 533506 535258 536593 537778 538934 539717 539863 539641
60234 539641 539448 539293 539064 539062 539773 541172 542714 544068 545533 547642 550603 554238 558207 562113 565623 568763
60218 568763 572003 575893 580593 585905 591718 598262 605834 614357 623291 632038 640414 648710 657289 666212
60204 666212 675299 684450 693720 703034 711975 719982 726761 732496 737730 742965 748171 752630 755387 755979
60190 755979 754721 752339 749553 746944 744761 742513 739022 733394 725951 717888 710007 702159 693985 685772
$$ packed form
60290G55228j2497j3622j3832j4084j4618j4885j4292j2785j0814q997p775p102
60278F09925o412n255l956l321l584m043l994l576l396l592l767l700l628l766
60264E53935l913l723l127k447k089k164k294j965j177n66o60j221j615j586j288
60249E24100p26K16J243J749J647J530J765J982J752J335J185J156P83J46k22
60234E39641j93j55k29kP11J399J542J354J465K109K961L635L969L906L510L140
60218E68763L240L890M700N312N813O544P572Q523Q934Q747Q376Q296Q579Q923
60204F66212R087R151R270R314Q941Q007O779N735N234N235N206M459K757N92
60190G55979j258k382k786k609k183k248l491n628p443q063p881p848q174q213
$$ plain form
60176 685772 678262 671821 666065 660252 653919 647337 641459 637248 634800 633234 631577 629639 627833 626405
60162 626405 625197 624092 623311 623111 623418 623904 624316 624699 625312 626351 627681 628958 630101 631512 633577 636105
60146 636105 638496 640452 642256 644432 647458 651734 657398 664000 670742 677271 683999 691506 699891 708901
60132 708901 718295 727768 736797 745070 752941 760990 769100 776354 781957 785960 788959 791397 793440 795316
60118 795316 797404 799875 802432 804562 806084 807402 809189 811830 815130 818445 821026 822364 822413 821561 820230
60103 820230 818462 815919 812284 807546 801979 796058 790397 785448 781094 776781 772247 767948 764642 762742
60089 762742 762207 762738 763765 764474 764346 763673 763285 763735 764936 766399 767503 767639 766572 764700 762597 760180
60073 760180 756686 751592 745228 738278 730959 722963 714035 704355 694428 684697 675256 665897 656543 647625
$$ packed form
60176F85772p510o441n756n813o333o582n878m211k448j566j657j938j806j428
60162F26405j208j105p81k00L07M86M12L83O13J039J330J277J143J411K065K528
60146F36105K391J956J804K176L026M276N664O602O742O529O728P507Q385R010
60132G08901R394R473R029Q273P871Q049Q110P254N603M003K999K438K043J876
60118G95316K088K471K557K130J522J318J787K641L300L315K581J338M9q52j331
60103H20230j768k543l635m738n567n921n661m949m354m313m534m299l306j900
60089G62742n35N31J027P09j28o73l88M50J201J463J104J36j067j872k103k417
60073G60180l494n094o364o950p319p996q928r680r927r731r441r359r354q918
$$ plain form
60059 647625 639816 633326 627741 622676 618305 614988 612591 610549 608614 607278 607323 609055 611978 615222 618357
60044 618357 621859 626669 633145 640516 647518 653539 659028 664806 671112 677380 682747 686682 689215 690766
60030 690766 691811 692501 692415 690725 686876 681225 674859 668646 662609 656261 649226 641311 632314 622308 612043
60015 612043 602487 593829 585367 576553 567709 559464 551939 544973 538827 534081 530907 528916 527799 527644
60001 527644 528421 529515 530144 530124 529973 530275 531138 532257 533303 534132 534782 535524 536889 539379 542993 547181 551423
59984 551423 555691 560230 565046 569823 574171 577662 579712 579881 578362 575876 572985 569761 566128 562177
59970 562177 558053 553872 549912 546553 543848 541538 539661 538839 539629 541858 544858 548159 551666 555421 559456
59955 559456 563655 567529 570375 571985 572967 573979 574958 575435 575323 574898 574266 573406 572593 572109 571600 570344 568297
$$ packed form
60059F47625p809o490n585n065m371l317k397k042j935j336M5J732K923L244L135
60044F18357L502M810O476P371P002O021N489N778O306O268N367L935K533J551
60030F90766J045O90q6j690l849n651o366o213o037o348p035p915q997j0006j0265
60015F12043r556q658q462q814q844q245p525o966o146m746l174j991j117j55
60001E27644P77J094O29k0j51L02Q63J119J046Q29O50P42J365K490L614M188M242
59984E51423M268M539M816M777M348L491K050J69j519k486k891l224l633l951
59970E62177m124m181l960l359k705k310j877q22P90K229L000L301L507L755M035
59955E59456M199L874K846J610R82J012R79M77j12m25o32q60q13m84n09j256k047
$$ plain form
59938 568297 566290 565017 564277 563394 561963 560053 558133 556976 557168 558388 559570 560130 560697 562310 565197
59923 565197 568831 572967 578092 584738 592674 600907 608402 614812 620610 626492 632585 638292 642892 646200
59909 646200 648568 650448 652112 653717 655417 657312 659315 661154 662630 663905 665390 667168 668713 669395
59895 669395 669222 668808 668692 668959 669480 670103 670649 671087 671863 673674 676767 680808 685545 691090 697322 703516
59879 703516 709008 713960 718950 724044 728750 732754 736195 739187 741521 742999 743700 743737 742986 741271 738701
59864 738701 735640 732365 728880 725123 721268 717686 714549 711612 708550 705422 702611 700352 698626 697518
59850 697518 697322 698123 699612 701552 704147 707665 711895 716318 720703 725272 730255 735443 740123 743363 744586
59835 744586 744078 742860 741833 741141 740431 739542 738690 738119 737775 737216 735714 732598 727710 721409 714095 706025
$$ packed form
59938E68297k007j273p40q83j431j910j920j157J92J220J182N60N67J613K887
59923E65197L634M136N125O646P936Q233P495O410N798N882O093N707M600L308
59909F46200K368J880J664J605J700J895K003J839J476J275J485J778J545O82
59895F69395j73m14j16K67N21O23N46M38P76J811L093M041M737N545O232O194
59879G03516N492M952M990N094M706M004L441K992K334J478P01L7p51j715k570
59864G38701l061l275l485l757l855l582l137k937l062l128k811k259j726j108
59850F97518j96Q01J489J940K595L518M230M423M385M569M983N188M680L240J223
59835G44586n08j218j027o92p10q89q52n71l44n59j502l116m888o301p314q070
$$ plain form
59819 706025 697725 690217 684382 680249 677101 674031 670237 665247 659432 653972 649795 646715 644068 641840
59805 641840 640406 639393 637726 634963 631819 629085 626719 624319 621886 619619 617382 614909 612276 609783
59791 609783 607484 605134 602470 599367 595827 592018 588171 584419 580887 577916 575824 574395 573006 571423
59777 571423 570092 569530 569811 570752 572138 573528 574436 575112 576591 579442 582883 585737 587952 590516 594126
59762 594126 598649 603816 609640 615979 622317 628318 634252 640597 647503 654866 662728 671369 681050 691672
59748 691672 702583 712836 721909 730154 738206 745948 752459 757108 760362 763235 766177 768806 770518 771039
59734 771039 770399 768748 766354 763619 760817 757863 754500 750764 747071 743746 740635 737376 733936 730626
59720 730626 727675 725152 723228 722050 721251 720079 718272 716364 714815 713310 711360 709191 707430 706187
$$ packed form
59819G06025q300p508n835m133l148l070l794m990n815n460m177l080k647k228
59805F41840j434j013j667k763l144k734k366k400k433k267k237k473k633k493
59791F09783k299k350k664l103l540l809l847l752l532k971k092j429j389j583
59777E71423j331n62K81R41J386J390R08O76J479K851L441K854K215K564L610
59762E94126M523N167N824O339O338O001N934O345O906P363P862Q641R681J0622
59748F91672J0911J0253R073Q245Q052P742O511M649L254K873K942K629J712N21
59734G71039o40j651k394k735k802k954l363l736l693l325l111l259l440l310
59720G30626k951k523j924j178p99j172j807j908j549j505j950k169j761j243
$$ plain form
59706 706187 705146 704386 704342 704898 705267 705019 704686 705096 706582 709053 712344 716126 719844 723151 726224 729469
59690 729469 733153 737433 742290 747137 750834 752536 752359 751013 748982 746324 743012 739162 735089 731296
59676 731296 728107 725119 721422 716712 711802 707528 703572 698955 693450 687740 682260 676674 670673 664665
59662 664665 659340 655029 651785 649704 648863 649151 650443 652692 655640 658663 661192 663181 665000 667041 669532
59647 669532 672511 675707 678516 680320 680824 680093 678459 676424 674377 672183 669260 665328 660943 656986 653726
59632 653726 650693 647492 644445 642252 641136 640558 639789 638639 637449 636362 634870 632344 628908 625424 622590
59617 622590 620415 618617 617004 615183 612409 608380 603990 600674 598992 598367 598225 598730 600123 601904 603232
59602 603232 603901 604475 605508 607016 608622 609884 610493 610470 610217 610106 609974 609374 608428 608023 608802 610194 610845
$$ packed form
59706G06187j041p60m4N56L69k48l33M10J486K471L291L782L718L307L073L245
59690G29469L684M280M857M847L697J702j77j346k031k658l312l850m073l793
59676G31296l189k988l697m710m910m274l956m617n505n710n480n586o001o008
59662F64665n325m311l244k081q41K88J292K249K948L023K529J989J819K041K491
59647F69532K979L196K809J804N04p31j634k035k047k194k923l932m385l957l260
59632F53726l033l201l047k193j116n78p69j150j190j087j492k526l436l484k834
59617F22590k175j798j613j821k774m029m390l316j682o25j42N05J393J781J328
59602F03232O69N74J033J508J606J262O09k3k53j11j32o00r46m05P79J392O51
$$ plain form
59585 610845 609985 608056 605974 604164 602525 600983 599761 599086 598867 598696 598094 596817 595004 592997 590967
59570 590967 588817 586522 584382 582751 581657 580910 580474 580414 580567 580666 580812 581382 582340 583096 583287 583261 583429 583500
59552 583500 582963 582131 582044 583251 585157 586793 587842 588777 590353 593241 597782 603713 610224 616647 623114
59537 623114 630353 638923 648811 659754 671603 684230 697177 709526 720135 728088 733064 735416 735866
59524 735866 735004 733030 730047 726662 724118 723521 724798 726647 727737 727803 727355 726495 724524 720756 715265 708563
59508 708563 700885 692233 682944 673736 665042 656682 648400 640553 633972 629129 625642 622745 620075 617780
59494 617780 615913 614065 611924 609983 609277 610306 612487 614844 617020 619367 622201 625358 628597 632207
59480 632207 636932 643208 650638 658413 666231 674524 683666 693209 702243 710328 717720 724715 731234 737110
$$ packed form
59585F10845q60j929k082j810j639j542j222o75k19j71o02j277j813k007k030
59570E90967k150k295k140j631j094p47m36o0J53R9J46N70R58P56J91k6J68P1
59552E83500n37q32q7J207J906J636J049R35J576K888M541N931O511O423O467
59537F23114P239Q570R888J0943J1849J2627J2947J2349J0609P953M976K352M50
59524G35866q62j974k983l385k544n97J277J849J090O6m48q60j971l768n491o702
59508G08563p678q652r289r208q694q360q282p847o581m843l487k897k670k295
59494F17780j867j848k141j941p06J029K181K357K176K347K834L157L239L610
59480F32207M725O276P430P775P818Q293R142R543R034Q085P392O995O519N876
$$ plain form
59466 737110 742274 746414 748911 749567 749178 748985 749641 751035 753042 756031 760536 766643 773833 781490 789589
59451 789589 798818 809789 822097 834514 846148 856969 867002 875603 882024 886225 888432 888237 884940
59438 884940 878662 870343 860607 849417 837022 824469 812798 802314 793014 785120 778758 773590 769330
59425 769330 766327 765134 765806 768049 771844 777471 785157 795201 808289 825050 845250 867728 891122
59412 891122 914341 936620 957665 977817 997482 1016211 1032660 1045534 1054171 1058149 1056958 1050604
59400 1050604 1040305 1028130 1015938 1004837 995434 988090 982755 978818 975269 970892 964298 954122 939673
59387 939673 921493 901096 880064 859496 840278 823389 809450 798126 788415 779681 772088 766013
59375 766013 761419 758058 755870 754744 754101 753190 751830 750526 749793 749665 749899 750365 751065 751984 753218 755202
$$ packed form
59466G37110N164M140K497O56l89j93O56J394K007K989M505O107P190P657Q099
59451G89589R229J0971J2308J2417J1634J0821J0033Q601O421M201K207j95l297
59438H84940o278q319r736j1190j2395j2553j1671j0484r300p894o362n168m260
59425G69330l003j193O72K243L795N627P686J0044J3088J6761K0200K2478K3394
59412H91122K3219K2279K1045K0152J9665J8729J6449J2874Q637L978j191o354
59400A050604j0299j2175j2192j1101r403p344n335l937l549m377o594j0176j4449
59387I39673j8180k0397k1032k0568j9218j6889j3939j1324r711q734p593o075
59375G66013m594l361k188j126o43r11j360j304p33j28K34M66P00R19J234J984
$$ plain form
59359 755202 758613 763912 770937 778979 787360 795975 805276 815792 827824 841564 857167 874449 892670
59346 892670 910955 928915 946689 964382 981753 998440 1014259 1029104 1042767 1054963 1065414
59335 1065414 1073646 1078746 1079611 1075770 1067952 1057558 1045425 1031262 1014549 995721 976012 956184
59323 956184 935981 915047 893901 873618 854889 837791 822217 808066 795167 783420 772985
59312 772985 763975 756099 748904 742236 736076 730136 724195 718774 714852 712804 712144 712505 714333 718247 724047
59297 724047 730749 737460 743937 750450 757335 764648 772072 779026 784707 787973 787543 782842 774663 764604
59283 764604 753888 743097 732919 724423 718349 714734 713498 714848 718704 724327 731119 739475 750221
59270 750221 763388 778012 793013 807758 821857 834955 846829 857402 866622 874486 880999 885787
$$ packed form
59359G55202L411N299P025Q042Q381Q615R301J0516J2032J3740J5603J7282J8221
59346H92670J8285J7960J7774J7693J7371J6687J5819J4845J3663J2196J0451
59335A065414Q232N100Q65l841p818j0394j2133j4163j6713j8828j9709j9828
59323I56184k0203k0934k1146k0283j8729j7098j5574j4151j2899j1747j0435
59312G72985r010p876p195o668o160n940n941n421l922k048o60L61J828L914N800
59297G24047O702O711O477O513O885P313P424O954N681L266m30m701q179j0059
59283G64604j0716j0791j0178q496o074l615j236J350L856N623O792Q356J0746
59270G50221J3167J4624J5001J4745J4099J3098J1874J0573R220P864O513M788
$$ plain form
59258 885787 888006 887116 883646 878681 872633 865082 855946 846221 837250 829579 822900 816824 811361 806746
59244 806746 803200 800994 800459 801683 804205 807303 810764 815225 821379 828842 836224 842519 848024 853572
59230 853572 859143 863724 866369 866910 865703 863176 859678 855314 849708 842224 832611 821272 808896 796105
59216 796105 783430 771210 759315 747283 735008 723125 712502 703485 695770 688903 682766 677617
59204 677617 673731 671038 669155 667850 667233 667295 667536 667471 667406 668202 670208 672935 675802 678632 681251 683253
59188 683253 684640 686211 688795 692422 696605 701063 705651 709965 713737 717466 721896 726911 731580 735394
59174 735394 738834 742531 746457 750250 753806 757188 760368 763488 767130 771820 777348 782890 787672 791290
59160 791290 793591 794642 794785 794320 793062 790406 785904 779553 771613 762421 752385 741874 731007 719831
$$ packed form
59258H85787K219q90l470m965o048p551r136r725q971p671o679o076n463m615
59244H06746l546k206n35J224K522L098L461M461O154P463P382O295N505N548
59230H53572N571M581K645N41j207k527l498m364n606p484r613j1339j2376j2791
59216G96105j2675j2220j1895j2032j2275j1883j0623r017p715o867o137n149
59204F77617l886k693j883j305o17O2K41o5o5P96K006K727K867K830K619K002
59188F83253J387J571K584L627M183M458M588M314L772L729M430N015M669L814
59174G35394L440L697L926L793L556L382L180L120L642M690N528N542M782L618
59160G91290K301J051J43m65j258k656m502o351p940r192j0036j0511j0867j1176
$$ plain form
59146 719831 708689 698060 687921 677648 666936 656492 647436 640110 633911 628225 623021 618524 614773
59133 614773 611808 609842 608900 608499 608089 607660 607626 608249 609576 611830 615342 620042 625481 631493 638390 646263
59117 646263 654498 662410 670060 678030 686607 695645 705038 714746 724335 733124 740956 748325 755477 761921
59103 761921 767245 771910 776598 781028 784135 785450 785631 785423 784706 782957 780242 777244 774527 772259 770540
59088 770540 769482 768866 768092 766690 764708 762474 760152 757620 754611 750816 745970 740012 733128 725595 717644
59073 717644 709484 701312 693233 685309 677785 671116 665659 661392 658080 655548 653625 651922 650015 647892
59059 647892 646053 644991 644672 644637 644530 644388 644356 644318 644040 643626 643576 644095 644604 644293 643182 642225 642153 642572 642470
59040 642470 641390 639736 638104 636775 635849 635479 635793 636843 638746 641718 645804 650763 656290 662286 668862
$$ packed form
59146G19831j1142j0629j0139j0273j0712j0444r056p326o199n686n204m497l751
59133F14773k965j966r42m01m10m29l4O23J327K254L512M700N439O012O897P873
59117F46263Q235P912P650P970Q577R038R393R708R589Q789P832P369P152O444
59103G61921N324M665M688M430L107J315J81k08p17j749k715k998k717k268j719
59088G70540j058o16p74j402j982k234k322k532l009l795m846n958o884p533p951
59073G17644q160q172q079p924p524o669n457m267l312k532j923j703j907k123
59059F47892j839j062l19l5j07j42l2l8k78m14n0N19N09l11j111r57p2M19j02
59040F42470j080j654j632j329r26l70L14J050J903K972M086M959N527N996O576
$$ plain form
59025 668862 676203 684478 693732 703881 714961 727293 741099 755814 770042 782416 792393 800180
59013 800180 806156 810538 813388 814619 814126 812136 809325 806359 803410 800337 797261 794635 792837 792009 792294
58998 792294 793834 796431 799611 803238 807758 813461 819770 825633 830522 834627 838071 840503 841666 841969
58984 841969 842049 841988 841401 840263 839229 839043 839995 842140 845734 851051 857940 865931 874807 884799 896101 908416
58968 908416 921192 934238 947961 962914 979097 995670 1011353 1025160 1036780 1046383 1054208 1060388
58956 1060388 1064913 1067463 1067332 1063771 1056554 1046072 1032887 1017404 1000076 981687 963129 944894
58944 944894 926921 909035 891459 874863 860005 847332 836877 828376 821415 815518 810355 806037
58932 806037 803111 802065 802759 804385 806029 807254 808202 809214 810386 811434 811918 811582 810435 808571 806132
$$ packed form
59025F68862P341Q275R254J0149J1080J2332J3806J4715J4228J2374R977P787
59013H00180N976M382K850J231m93j990k811k966k949l073l076k626j798q28K85
58998G92294J540K597L180L627M520N703O309N863M889M105L444K432J163L03
58984H41969Q0o1n87j138j034j86R52K145L594N317O889P991Q876R992J1302J2315
58968I08416J2776J3046J3723J4953J6183J6573J5683J3807J1620R603P825O180
58956A060388M525K550j31l561p217j0482j3185j5483j7328j8389j8558j8235
58944I44894j7973j7886j7576j6596j4858j2673j0455q501o961n897n163m318
58932H06037k926j046O94J626J644J225R48J012J172J048M84l36j147j864k439
$$ plain form
58917 806132 803473 801129 799385 798031 796758 795679 795233 795691 797139 799863 804326 810584 818106 826375 835441
58902 835441 845669 857153 869632 882881 897012 912443 929652 948802 969419 990577 1011551
58891 1011551 1032203 1052658 1072829 1092493 1111706 1130842 1150189 1169632 1188708 1206849 1223582
58880 1223582 1238592 1251533 1261715 1268150 1270104 1267635 1261525 1252689 1241670 1228541 1213148 1195611
58868 1195611 1176664 1157422 1138717 1120773 1103601 1087431 1072552 1058920 1046260 1034395 1023191
58857 1023191 1012315 1001420 990518 979816 969172 958170 946859 936010 926309 917559 908935 899898
58845 899898 890560 881297 872344 863759 855395 846772 837248 826663 815702 805302 795621 785918 775626
58832 775626 765286 756058 748507 742273 736955 732743 729945 728352 727545 727628 729147 732254 736374 740756 745089
$$ packed form
58917H06132k659k344j744j354j273j079m46M58J448K724M463O258P522Q269R066
58902H35441J0228J1484J2479J3249J4131J5431J7209J9150K0617K1158K0974
58891A011551K0652K0455K0171J9664J9213J9136J9347J9443J9076J8141J6733
58880A223582J5010J2941J0182O435J954k469o110q836j1019j3129j5393j7537
58868A195611j8947j9242j8705j7944j7172j6170j4879j3632j2660j1865j1204
58857A023191j0876j0895j0902j0702j0644j1002j1311j0849r701q750q624r037
58845H99898r338r263q953q585q364q623r524j0585j0961j0400r681r703j0292
58832G75626j0340r228p551o234n318m212k798j593q07Q3J519L107M120M382M333
$$ plain form
58817 745089 749521 754332 759652 765268 770639 775324 779472 783595 787719 791043 792697 792714 792022 791460 790975
58802 790975 789743 786964 782522 776944 770765 764038 756644 748913 741583 734942 728433 721511 714692 709198
58788 709198 705498 702745 699869 696854 694570 693713 694361 696375 699618 703718 708129 712654 717482 722486 726927
58773 726927 730145 732146 733094 732629 730295 726409 721762 716466 709841 701665 692868 684643 677346 670724 664794
58758 664794 659991 656635 654687 653887 653828 654037 654376 655215 656919 659280 661832 664516 667597 670972 674054 676498
58742 676498 678691 681384 685033 689648 695016 700873 706934 712961 718870 724755 730737 736728 742404 747568
58728 747568 752548 757953 763984 770250 776364 782391 788529 794722 800941 807516 814712 822146 829091 835335
58714 835335 841348 847682 854529 861726 868799 875037 879902 883334 885341 885450 882975 877726 869955 859753
$$ packed form
58817G45089M432M811N320N616N371M685M148M123M124L324J654J7o92n62m85
58802G90975j232k779m442n578o179o727p394p731p330o641o509o922o819n494
58788G09198l700k753k876l015k284q57O48K014L243M100M411M525M828N004M441
58773G26927L218K001R48m65k334l886m647n296o625q176q797q225p297o622n930
58758F64794m803l356j948q00n9K09L39Q39J704K361K552K684L081L375L082K444
58742F76498K193K693L649M615N368N857O061O027N909N885N982N991N676N164
58728G47568M980N405O031O266O114O027O138O193O219O575P196P434O945O244
58714H35335O013O334O847P197P073O238M865L432K007J09k475n249p771j0202
$$ plain form
58700 859753 847093 832478 816840 800584 783244 764371 744316 724022 704509 686734 671334
58689 671334 658086 646049 634646 624262 615449 607944 600948 594068 587486 581433 575997 571346 567645
58676 567645 564769 562457 560770 560022 560255 561121 562436 564614 568415 574312 582070 590798 599498 607785 616095
58661 616095 625003 634297 642912 649851 654912 658314 659835 658806 655114 649825 644307 638860 632644 625052
58647 625052 616640 608489 601204 595013 590305 587326 585483 583750 581799 580123 579009 578178 577623 578078 580091
58632 580091 583168 586355 589262 592044 594666 596822 598426 599657 600536 600864 600628 600156 599839 599942 600723 602459
58616 602459 605279 609064 613590 618642 623999 629426 634811 640314 646267 652741 659187 664688 668654 671055
58602 671055 671910 671052 668839 666604 665616 665619 665154 663371 660830 658398 656214 654188 652822 652874 654515 657318
$$ packed form
58700H59753j2660j4615j5638j6256j7340j8873k0055k0294j9513j7775j5400
58689F71334j3248j2037j1403j0384q813p505o996o880o582o053n436m651l701
58676E67645k876k312j687p48K33Q66J315K178L801N897P758Q728Q700Q287Q310
58661F16095Q908R294Q615O939N061L402J521j029l692n289n518n447o216p592
58647F25052q412q151p285o191m708k979j843j733j951j676j114q31n55M55K013
58632E80091L077L187K907K782K622K156J604J231Q79L28k36m72l17J03P81J736
58616F02459K820L785M526N052N357N427N385N503N953O474O446N501L966K401
58602F71055Q55q58k213k235r88Lm65j783k541k432k184k026j366N2J641K803
$$ plain form
58586 657318 660865 665073 670174 676661 684924 694681 705115 715806 727108 739297 751785 763636 774552
58573 774552 784997 795681 807213 819901 833485 847425 861865 877924 896646 918000 941340
58562 941340 966382 993199 1021583 1050938 1080528 1109362 1136166 1160000 1180647 1197972 1211340
58551 1211340 1220153 1224551 1224986 1221561 1214497 1204804 1193662 1181415 1167928 1153613 1139171 1124495 1108786
58538 1108786 1091678 1073348 1053596 1031841 1008164 983450 958372 933124 908374 885469 865204
58527 865204 847105 830460 815479 802939 793155 785821 780559 777121 775149 773953 772594 770330 767289
58514 767289 764479 762682 761383 759327 756097 752555 749689 747611 745757 743511 740519 736946 733548 731069
58500 731069 729550 728673 728556 729460 730836 731631 731753 732269 733896 736159 738448 740996 744266 748199 752769 758654
$$ packed form
58586F57318L547M208N101O487Q263R757J0434J0691J1302J2189J2488J1851J0916
58573G74552J0445J0684J1532J2688J3584J3940J4440J6059J8722K1354K3340
58562I41340K5042K6817K8384K9355K9590K8834K6804K3834K0647J7325J3368
58551A211340Q813M398M35l425p064r693j1142j2247j3487j4315j4442j4676j5709
58538A108786j7108j8330j9752k1755k3677k4714k5078k5248k4750k2905k0265
58527H65204j8099j6645j4981j2540r784p334n262l438j972j196j359k264l041
58514G67289k810j797j299k056l230l542k866k078j854k246k992l573l398k479
58500G31069j519q77j17R04J376P95J22N16J627K263K289K548L270L933M570N885
$$ plain form
58484 758654 766599 776479 787642 799809 813089 827382 842339 857732 873433 889199 904725 919748
58472 919748 933887 946690 957887 967112 973335 975306 972954 967650 960688 952157 941900 930894 920905
58459 920905 913208 908324 906493 907553 910609 914743 919962 926758 934858 943156 950816 957645 963249 966612
58445 966612 966917 964328 959613 953245 945158 935222 923743 911555 899725 889115 880138 872909 867500
58432 867500 864004 862434 862660 864432 867529 871980 878055 885778 894562 903569 912386 920996 929195 936458
58418 936458 942388 946777 949138 948688 945041 938584 930129 920523 910530 900433 889682 877627 864758
58405 864758 852565 841940 832428 823347 814832 807355 800952 795543 791409 788748 787243 786589 786925 788228
58391 788228 789803 790967 791743 792350 792608 792514 792811 794195 796338 798442 800458 803051 806657 811310 817070 823919
$$ packed form
58484G58654P945R880J1163J2167J3280J4293J4957J5393J5701J5766J5526J5023
58472I19748J4139J2803J1197R225O223J971k352n304o962q531j0257j1006r989
58459I20905p697m884j831J060L056M134N219O796Q100Q298P660O829N604L363
58445I66612L05k589m715o368q087r936j1479j2188j1830j0610q977p229n409
58432H67500l496j570K26J772L097M451O075P723Q784R007Q817Q610Q199P263
58418I36458N930M389K361m50l647o457q455r606r993j0097j0751j2055j2869
58405H64758j2193j0625r512r081q515p477o403n409m134k661j505o54L36J303
58391G88228J575J164P76O07K58r4K97J384K143K104K016K593L606M653N760O849
$$ plain form
58375 823919 831445 839302 847806 857512 868416 880125 892481 905383 918365 931079 943939 957558
58363 957558 971704 985502 998565 1011293 1024233 1037658 1051621 1065806 1079452 1091829 1102676
58352 1102676 1111946 1119586 1125863 1131235 1135397 1137306 1136898 1135926 1136124 1137349 1138693 1140639 1144598 1150767 1158055
58337 1158055 1166008 1175237 1185909 1197348 1209368 1222596 1237103 1252013 1266884 1282240 1298183 1313596
58325 1313596 1327323 1339235 1349537 1357962 1364352 1369297 1373470 1376866 1379241 1380824 1382119 1383481 1385273
58312 1385273 1388022 1392018 1397089 1403036 1409968 1418078 1427477 1438287 1450460 1463492 1476845 1490597 1505061
58299 1505061 1519922 1534516 1549032 1564474 1581263 1598678 1615940 1633034 1650227 1667537 1685155
58288 1685155 1703639 1723194 1743208 1762900 1782115 1801326 1821219 1842325 1864615 1887460 1910499
$$ packed form
58375H23919P526P857Q504R706J0904J1709J2356J2902J2982J2714J2860J3619
58363I57558J4146J3798J3063J2728J2940J3425J3963J4185J3646J2377J0847
58352A102676R270P640O277N372M162J909m08r72J98J225J344J946L959O169P288
58337A158055P953R229J0672J1439J2020J3228J4507J4910J4871J5356J5943J5413
58325A313596J3727J1912J0302Q425O390M945M173L396K375J583J295J362J792
58312A385273K749L996N071N947O932Q110R399J0810J2173J3032J3353J3752J4464
58299A505061J4861J4594J4516J5442J6789J7415J7262J7094J7193J7310J7618
58288A685155J8484J9555K0014J9692J9215J9211J9893K1106K2290K2845K3039
$$ plain form
58277 1910499 1934413 1960270 1988306 2018212 2050471 2086410 2126748 2171001 2218415 2268649 2321437
58266 2321437 2376587 2434580 2496267 2561563 2629131 2697636 2766671 2836415 2907131 2979130 3052473
58255 3052473 3126675 3201413 3277311 3355018 3433721 3511882 3589598 3669024 3752264 3839947 3931996
58244 3931996 4028579 4130012 4236949 4350899 4473526 4605224 4745490 4894639 5053841 5223574
58234 5223574 5403685 5595151 5800062 6019628 6253915 6503892 6771956 7060124 7369677
58225 7369677 7703168 8064670 8457214 8881940 9340870 9838870 10382134 10976669 11629398
58216 11629398 12349137 13145585 14029197 15013320 16115526 17357135 18764351 20371471 22222164
58207 22222164 24368541 26872471 29808294 33260572 37318055 42073909 47634639 54127399
$$ packed form
58277A910499K3914K5857K8036K9906L2259L5939M0338M4253M7414N0234N2788
58266B321437N5150N7993O1687O5296O7568O8505O9035O9744P0716P1999P3343
58255C052473P4202P4738P5898P7707P8703P8161P7716P9426Q3240Q7683R2049
58244C931996R6583J01433J06937J13950J22627J31698J40266J49149J59202J69733
58234E223574J80111J91466K04911K19566K34287K49977K68064K88168L09553
58225G369677L33491L61502L92544M24726M58930M98000N43264N94535O52729
58216A1629398P19739P96448Q83612R84123J102206J241609J407216J607120J850693
58207B2222164K146377K503930K935823L452278M057483M755854N560730O492760
$$ plain form
58199 54127399 61699401 70514759 80749825 92576434 106129295 121471242 138570502
58192 138570502 157292679 177411991 198648309 220708808 243282806 265963928 288139457
58185 288139457 308911221 327079784 341208139 349804343 351637292 346088360 333363871
58178 333363871 314467473 290983648 264786126 237735833 211398542 186846114 164614774
58171 164614774 144815811 127307871 111842266 98156727 86030358 75305282 65875486
58164 65875486 57657418 50563714 44490501 39317724 34918916 31173943 27976454 25234322
58156 25234322 22868807 20815428 19023076 17450019 16061039 14827547 13727048 12740530
58148 12740530 11851198 11045810 10314794 9649825 9042631 8486575 7977453 7511628 7084679
$$ packed form
58199E4127399P572002Q815358J0235066J1826609J3552861J5341947J7099260
58192A38570502J8722177K0119312K1236318K2060499K2573998K2681122K2175529
58185B88139457K0771764J8168563J4128355Q596204J832949n548932j2724489
58178C33363871j8896398k3483825k6197522k7050293k6337291k4552428k2231340
58171A64614774j9798963j7507940j5465605j3685539j2126369j0725076r429796
58164F5875486q218068p093704o073213n172777m398808l744973l197489k742132
58156B5234322k365515k053379j792352j573057j388980j233492j100499r86518
58148A2740530q89332q05388p31016o64969o07194n56056n09122m65825m26949
$$ plain form
58139 7084679 6692532 6332446 6002052 5698602 5419659 5163243 4926731 4706838 4501152
58130 4501152 4308406 4126927 3954325 3789325 3632446 3484122 3343461 3209631 3083174
58121 3083174 2964961 2854746 2751575 2654819 2564095 2478884 2398812 2323685 2252929 2185759 2122169
58110 2122169 2062740 2007162 1954050 1902707 1853989 1808811 1766825 1727286 1690190 1655652 1622982
58099 1622982 1591386 1561038 1532505 1505437 1478693 1451726 1425219 1400223 1376876 1354027 1330211
58088 1330211 1305088 1279722 1255170 1231266 1207347 1183536 1160369 1137566 1114491 1091618 1070169
58077 1070169 1050214 1030509 1010474 990884 972260 954013 935750 918005 900948 883778 866407
58066 866407 850439 837218 825848 814410 802396 790707 779899 769737 760067 750913 741902 732611
$$ packed form
58139G084679l92147l60086l30394l03450k78943k56416k36512k19893k05686
58130D501152j92746j81479j72602j65000j56879j48324j40661j33830j26457
58121C083174j18213j10215j03171r6756r0724q5211q0072p5127p0756o7170o3590
58110B122169n9429n5578n3112n1343m8718m5178m1986l9539l7096l4538l2670
58099A622982l1596l0348k8533k7068k6744k6967k6507k4996k3347k2849k3816
58088A330211k5123k5366k4552k3904k3919k3811k3167k2803k3075k2873k1449
58077A070169j9955j9705k0035j9590j8624j8247j8263j7745j7057j7170j7371
58066H66407j5968j3221j1370j1438j2014j1689j0808j0162r670r154r011r291
$$ plain form
58054 732611 723318 714504 705825 696498 686544 676754 667521 658558 649785 641682 634667 628764 623925 620043
58040 620043 616595 612894 608820 604815 600996 596726 591257 584473 576903 569190 561681 554379 547203 540195
58026 540195 533302 526075 517996 509219 500607 492847 485946 479717 474184 469179 464187 459119 454764 451845
58012 451845 450004 448301 446402 444609 442970 441080 438757 436323 434230 432779 432142 432208 432466 432488 432474 432971
57996 432971 434140 435717 437565 439846 442653 445823 449053 451944 454125 455646 457019 458483 459474 459323 458234
57981 458234 456978 455722 453835 450894 447262 443506 439729 435733 431458 427023 422614 418543 415241 413016
57967 413016 411883 411628 411913 412347 412658 412798 412771 412501 412024 411620 411461 411222 410364 408706 406459 403820 400885
57950 400885 397888 395128 392695 390513 388624 387100 385838 384851 384675 386031 389032 393071 397501 402009 406410
$$ packed form
58054G32611r293q814q679r327r954r790r233q963q773q103p015n903m839l882
58040F20043l448l701m074m005l819m270n469o784p570p713p509p302p176p008
58026E40195o893p227q079q777q612p760o901o229n533n005m992n068m355k919
58012D51845j841j703j899j793j639j890k323k434k093j451o37O6K58K2j4M97
57996D32971J169J577J848K281K807L170L230K891K181J521J373J464R91j51j089
57981D58234j256j256j887k941l632l756l777l996m275m435m409m071l302k225
57967D13016j133k55K85M34L11J40k7k70m77m04j59k39q58j658k247k639k935
57950D00885k997k760k433k182j889j524j262r87j76J356L001M039M430M508M401
$$ plain form
57935 406410 410664 415263 420976 427841 434784 440704 445563 449982 454006 456841 457856 457308 455844 453615
57921 453615 450269 445719 440502 435207 429785 423746 416969 410037 403730 398474 394381 391491 389662 388398
57907 388398 387142 385757 384547 383881 383908 384537 385499 386535 387715 389441 391881 394556 396763 398294 399445
57892 399445 400462 401330 402052 402634 402782 402128 400943 400184 400445 401164 401244 400334 399068 398074 397140 395550 392958
57875 392958 389628 385884 381689 377011 372383 368723 366453 365081 363853 362622 361862 361996 363004 364635 366633
57860 366633 368701 370565 372256 374242 377058 380872 385435 390444 395816 401591 407608 413339 418200 422017
57846 422017 425130 427911 430276 431748 431924 430807 428755 426227 423524 420581 417015 412488 407062 401218
57832 401218 395541 390405 385827 381558 377390 373435 370071 367561 365869 364870 364462 364348 363972 363027 361933
$$ packed form
57935D06410M254M599N713O865O943N920M859M419M024K835J015n48j464k229
57921D53615l346m550n217n295n422o039o777o932o307n256m093k890j829j264
57907C88398j256j385j210o66K7O29R62J036J180J726K440K675K207J531J151
57892C99445J017Q68P22N82J48o54j185p59K61P19Q0r10j266r94r34j590k592
57875C92958l330l744m195m678m628l660k270j372j228j231p60J34J008J631J998
57860C66633K068J864J691J986K816L814M563N009N372N775O017N731M861L817
57846D22017L113K781K365J472J76j117k052k528k703k943l566m527n426n844
57832D01218n677n136m578m269m168l955l364k510j692r99m08j14l76r45j094
$$ plain form
57817 361933 361480 361899 362526 362433 361263 359360 357239 355094 352856 350595 348615 346922 344687 340654 334337
57802 334337 326656 319159 312731 307282 302519 298579 295760 293933 292546 291179 289861 288800 288010 287459 287443
57787 287443 288432 290425 292827 295290 298338 302763 308559 314942 321242 327242 332780 337808 342946 349160
57773 349160 356535 364016 370676 376486 381390 384489 385055 383768 382055 380560 379113 377765 376678 375110
57759 375110 371756 366457 360614 355523 351076 346552 341951 337890 334670 332041 329658 327278 324727 322148
57745 322148 320201 319603 320447 322125 323900 325399 326687 327996 329451 331043 332849 335028 337390 339191 339853
57730 339853 339844 340426 342416 345552 349041 352250 354752 356302 357070 357588 358197 358855 359583 360619 361819 362391 361683
57713 361683 359954 358021 356367 355004 353932 353210 352648 351782 350175 347527 343699 339013 334435 331036 329157
$$ packed form
57817C61933m53M19O27r3j170j903k121k145k238k261j980j693k235m033o317
57802C34337p681p497o428n449m763l940k819j827j387j367j318j061p90n51j6
57787B87443R89J993K402K463L048M425N796O383O300O000N538N028N138O214
57773C49160P375P481O660N810M904L099N66j287j713j495j447j348j087j568
57759C75110l354n299n843n091m447m524m601m061l220k629k383k380k551k579
57745C22148j947n98Q44J678J775J499J288J309J455J592J806K179K362J801O62
57730C39853rN82J990L136L489L209K502J550P68N18O09O58P28J036J200N72p08
57713C61683j729j933j654j363j072p22n62q66j607k648l828m686m578l399j879
$$ plain form
57698 329157 328311 327849 327490 327185 326821 326221 325333 324271 323181 322092 320882 319374 317423 314931 311932 308854
57682 308854 306552 305724 306324 307939 310835 316190 325041 337350 352424 369952 390166 413183 438669
57669 438669 466229 495781 527370 560703 594796 627914 657810 682111 698570 705180 700609 684850
57657 684850 659359 626345 588022 546562 504333 463684 426481 393955 366718 344640 326925
57646 326925 312729 301625 293210 286601 280873 275954 272432 270400 269071 267728 266485 265703 265124 264156
57632 264156 262824 261802 261446 261300 260772 259942 259328 259058 258655 257640 255979 253831 251199 248134 245051 242442
57616 242442 240314 238244 236014 233832 231885 230046 228264 226878 226246 226188 226115 225553 224415 222913 221462 220517
57600 220517 220235 220392 220746 221238 221631 221304 219901 217956 216323 215093 213583 211388 208845 206375 204022 201860
$$ packed form
57698C29157q46m62l59l05l64o00q88j062j090j089j210j508j951k492k999l078
57682C08854k302q28O00J615K896N355Q851J2309J5074J7528K0214K3017K5486
57669D38669K7560K9552L1589L3333L4093L3118K9896K4301J6459O610m571j5759
57657F84850k5491l3014l8323m1460m2229m0649l7203l2526k7237k2078j7715
57646C26925j4196j1104q415o609n728m919l522k032j329j343j243p82n79r68
57632B64156j332j022l56j46n28q30o14k70m03j015j661k148k632l065l083k609
57616B42442k128k070k230k182j947j839j782j386o32n8p3n62j138j502j451r45
57600B20517k82J57L54M92L93l27j403j945j633j230j510k195k543k470k353k162
$$ plain form
57584 201860 200282 199392 198569 197102 195070 193096 191457 189899 188253 186732 185508 184383 182983 181079 178721
57569 178721 176296 174462 173709 173818 173969 173502 172422 171154 170070 169361 169092 169135 169196 169096 168940 168870 168857 168905 169277
57550 169277 170206 171512 172816 174083 175652 177728 180136 182575 184805 186552 187608 188173 188771 189617 190316
57535 190316 190355 189664 188564 187477 186896 187242 188386 189590 190301 190803 191673 192866 193856 194476 194987 195330 195054
57518 195054 194136 193300 193175 193615 194156 194766 195710 196973 198221 199200 199864 200181 200069 199525 198712 197948 197582 197658
57500 197658 197714 197222 196318 195722 195780 195983 195626 194585 193122 191353 189242 186867 184291 181498 178814 177021
57484 177021 176467 176329 175440 173722 172165 171400 171054 170658 170440 170799 171526 172043 172097 171762 170994 169700 168205 167211
57466 167211 167132 167643 167989 167676 166847 166066 165764 165878 166023 165968 165798 165629 165399 165090 164986 165450 166424 167343 167637
$$ packed form
57584B01860j578q90q23j467k032j974j639j558j646j521j224j125j400j904k358
57569A78721k425j834p53J09J51m67j080j268j084p09k69M3O1j00j56p0j3M8L72
57550A69277R29J306J304J267J569K076K408K439K230J747J056N65N98Q46O99
57535A90316L9o91j100j087n81L46J144J204P11N02Q70J193R90O20N11L43k76
57518A95054r18q36j25M40N41O10R44J263J248R79O64L17j12n44q13p64l66P6
57500A97658N6m92r04n96N8K03l57j041j463j769k111k375k576k793k684j793
57484A77021n54j38q89j718j557p65l46l96k18L59P27N17N4l35p68j294j495r94
57466A67211p9N11L46l13q29p81l02J14J45n5j70j69k30l09j04M64R74R19K94
$$ plain form
57447 167637 167232 166435 165434 164164 162779 161968 162404 163843 165174 165629 165694 166472 168306 170446 172040 173006
57431 173006 173725 174296 174512 174360 174126 173921 173465 172613 171832 171800 172515 173172 173155 172855 173145 174180 175233 175787 176249
57412 176249 177198 178373 178955 178740 178467 178877 179908 180992 181786 182323 182691 182934 183176 183554 183974 184115 183774 183115
57394 183115 182490 182121 182040 182296 183053 184383 186067 187722 189128 190326 191510 192983 195154 198247 201868 205110
57378 205110 207354 208834 210175 211483 212203 211865 210737 209616 209089 209095 209137 208781 207903 206571 204881 203077 201646
57361 201646 200969 200844 200661 200162 199765 199998 200900 202170 203592 205020 206240 207204 208301 209985 212163 214275
57345 214275 215898 217017 217728 218060 218140 218274 218714 219425 220062 220193 219760 219397 219966 221485 222890 223217 222730 222325
57327 222325 222140 221447 219844 217834 216107 214938 214417 214594 215118 215295 214862 214221 213720 213268 212952 213313 214446
$$ packed form
57447A67637m05p97j001j270j385q11M36J439J331M55O5P78J834K140J594R66
57431A73006P19N71K16j52k34k05m56q52p81l2P15O57j7l00K90J035J053N54M62
57412A76249R49J175N82k15k73M10J031J084P94N37L68K43K42L78M20J41l41o59
57394A83115o25l69q1K56P57J330J684J655J406J198J184J473K171L093L621L242
57378B05110K244J480J341J308P20l38j128j121n27OM2l56q78j332j690j804j431
57361B01646o77j25j83m99l97K33R02J270J422J428J220R64J097J684K178K112
57345B14275J623J119P11L32Q0J34M40P11O37J31m33l63N69J519J405L27m87m05
57327B22325j85o93j603k010j727j169n21J77N24J77m33o41n01m52l16L61J133
$$ plain form
57310 214446 215421 215355 214685 214614 215518 216676 217494 218168 219031 219943 220677 221425 222596 224436 227042 230358 233888
57293 233888 236719 238264 238900 239597 240989 243008 245260 247420 249230 250461 251122 251618 252504 254044 256030
57278 256030 258033 259774 261291 262791 264424 266173 267928 269687 271671 274209 277484 281457 286032 291149
57264 291149 296606 301940 306722 310968 315101 319485 324167 329024 333897 338554 342835 346944 351310 355901
57250 355901 359963 362811 364782 366972 369961 373130 375491 376973 378630 381589 385967 390843 395105 398289
57236 398289 400768 403357 406733 411018 415768 420417 424794 429118 433556 437976 442303 446851 452029 457834
57222 457834 463917 470073 476277 482295 487706 492512 497342 502746 508522 514047 519096 523949 528779 533356
57208 533356 537443 541241 545318 550259 556486 564295 573920 585538 599162 614439 630614 646837 662641
$$ packed form
57310B14446R75o6o70p1R04J158Q18O74Q63R12P34P48J171J840K606L316L530
57293B33888K831J545O36O97J392K019K252K160J810J231O61M96Q86J540J986
57278B56030K003J741J517J500J633J749J755J759J984K538L275L973M575N117
57264B91149N457N334M782M246M133M384M682M857M873M657M281M109M366M591
57250C55901M062K848J971K190K989L169K361J482J657K959M378M876M262L184
57236C98289K479K589L376M285M750M649M377M324M438M420M327M548N178N805
57222D57834O083O156O204O018N411M806M830N404N776N525N049M853M830M577
57208E33356M087L798M077M941O227P809R625J1618J3624J5277J6175J6223J5804
$$ plain form
57195 662641 678066 693371 708733 724268 740148 756504 773329 790661 808877 828567 850018
57184 850018 872986 897060 922043 947768 973760 999438 1024662 1049725 1074701 1099103 1122325
57173 1122325 1144152 1164640 1183836 1201915 1219394 1236775 1254117 1271351 1289061 1308584 1331205
57162 1331205 1357419 1387025 1419668 1455192 1493651 1535096 1579264 1625405 1672514 1719786 1766834
57151 1766834 1813615 1860302 1907163 1954337 2001737 2049289 2097161 2145583 2194560 2244049 2294352
57140 2294352 2345906 2398668 2452071 2505723 2559840 2614833 2670824 2727837 2786278 2846850 2910033
57129 2910033 2975838 3044104 3114835 3188258 3264682 3344492 3428237 3516686 3610733 3711412 3820155
57118 3820155 3939051 4070544 4216602 4378143 4555314 4748378 4958569 5188477 5441815
$$ packed form
57195F62641J5425J5305J5362J5535J5880J6356J6825J7332J8216J9690K1451
57184H50018K2968K4074K4983K5725K5992K5678K5224K5063K4976K4402K3222
57173A122325K1827K0488J9196J8079J7479J7381J7342J7234J7710J9523K2621
57162A331205K6214K9606L2643L5524L8459M1445M4168M6141M7109M7272M7048
57151A766834M6781M6687M6861M7174M7400M7552M7872M8422M8977M9489N0303
57140B294352N1554N2762N3403N3652N4117N4993N5991N7013N8441O0572O3183
57129B910033O5805O8266P0731P3423P6424P9810Q3745Q8449R4047J00679J08743
57118C820155J18896J31493J46058J61541J77171J93064K10191K29908K53338
$$ plain form
57109 5441815 5722721 6035290 6384086 6775428 7218346 7724627 8308448 8986154 9776331
57100 9776331 10700314 11782978 13052660 14539484 16273547 18284602 20602003 23252556
57092 23252556 26257817 29634504 33397106 37558065 42125473 47103318 52493683 58293227
57084 58293227 64482320 71014647 77805718 84703683 91443913 97633897 102820928 106626682
57076 106626682 108857944 109515491 108715050 106600520 103306920 98966894 93727432 87759621
57068 87759621 81260752 74447332 67537840 60732585 54200254 48072111 42439389 37353197
57060 37353197 32829014 28854259 25395413 22404539 19826902 17608168 15698083 14051067
57052 14051067 12626680 11390625 10314585 9374665 8550088 7822860 7177664 6601760 6085131
$$ packed form
57109E441815K80906L12569L48796L91342M42918N06281N83821O77706P90177
57100I776331R23983J082664J269682J486824J734063K011055K317401K650553
57092B3252556L005261L376687L762602M160959M567408M977845N390365N799544
57084E8293227O189093O532327O791071O897965O740230O189984N187031L805754
57076A06626682K231262O57547q00441k114530l293600m340026n239462n967811
57068H7759621o498869o813420o909492o805255o532331o128143n632722n086192
57060C7353197m524183l974755l458846k990874k577637k218734j910085j647016
57052A4051067j424387j236055j076040r39920q24577p27228o45196n75904n16629
$$ plain form
57043 6085131 5620309 5201384 4823101 4480964 4171597 3892222 3639926 3411869 3205962
57034 3205962 3020766 2854857 2706778 2575479 2460313 2360678 2276022 2206054 2150427 2108192
57024 2108192 2077836 2057762 2046387 2041915 2042327 2045387 2047985 2045444 2032061 2002990 1955936 1891358
57012 1891358 1811477 1719344 1618671 1513966 1410071 1311037 1219336 1136192 1062300 997738 941427
57001 941427 891522 846725 806792 771594 740270 711752 685651 662081 640930 621883 604957
56990 604957 590437 578310 568230 560067 553966 549732 546613 543936 541675 540064 538717 536352 531498
56977 531498 523447 512502 499409 484733 468882 452563 436929 423183 412144 404161 399236 397171
56965 397171 397746 400783 406021 413081 421768 432327 445027 459452 474424 488622 501062 511042 518070
$$ packed form
57043F085131m64822m18925l78283l42137l09367k79375k52296k28057k05907
57034C205962j85196j65909j48079j31299j15166r9635q4656o9968n5627m2235
57024B108192l0356k0074j1375m472M12L060K598k541j3383k9071m7054o4578
57012A891358p9881r2133j00673j04705j03895r9034r1701q3144p3892o4562n6311
57001I41427m9905m4797l9933l5198l1324k8518k6101k3570k1151j9047j6926
56990F04957j4520j2127j0080q163o101m234l119k677k261j611j347k365m854
56977E31498q051j0945j3093j4676j5851j6319j5634j3746j1039p983m925k065
56965C97171N75L037N238P060Q687J0559J2700J4425J4972J4198J2440R980P028
$$ plain form
56952 518070 521906 522279 518465 509557 495434 477300 457174 437066 418608 402967 390781 382309 377765
56939 377765 377359 381052 388605 399790 414204 430917 448919 467927 488128 508903 528363 544375
56927 544375 555401 560135 557263 546324 528366 505179 478234 448892 419012 390448 364026 339711
56915 339711 317590 298126 281581 267802 256484 247100 238765 230859 223770 218404 214950 212713 211142
56902 211142 210305 210243 210607 211315 213032 216543 221968 228917 237121 246544 257085 268527 280783 293978
56888 293978 308318 323965 340851 358443 375689 391281 403994 412819 417020 416349 411351 403359 393980
56875 393980 384376 375033 366368 359489 356042 357149 362790 372400 385847 403485 425429 451205 480186
56862 480186 512120 547034 584553 623244 660586 693712 720339 739000 748633 748464 738508 719924
$$ packed form
56952E18070L836L73l814q908j4123j8134k0126k0108j8458j5641j2186q472m544
56939C77765m06L693P553J1185J4414J6713J8002J9008K0201K0775J9460J6012
56927E44375J1026M734k872j0939j7958k3187k6945k9342k9880k8564k6422k4315
56915C39711k2121j9464j6545j3779j1318r384q335p906p089n366l454k237j571
56902B11142q37o2L64P08J717L511N425O949Q204R423J0541J1442J2256J3195
56888B93978J4340J5647J6886J7592J7246J5592J2713Q825M201o71m998p992r379
56875C93980r604r343q665o879l447J107N641R610J3447J7638K1944K5776K8981
56862D80186L1934L4914L7519L8691L7342L3126K6627J8661R633j69r956j8584
$$ plain form
56850 719924 694702 665251 634425 605436 581242 564002 555159 555615 565481 584075 610658 644914
56838 644914 686341 733558 784863 839211 895869 953118 1007952 1057142 1097944 1127586 1142797
56827 1142797 1140606 1119800 1081675 1029698 968577 903346 838832 779375 728404 687815 657926
56816 657926 638296 628539 628277 636766 653021 676070 704664 737113 771911 808169 844630 878485
56804 878485 906040 924570 932700 929100 912131 881520 839630 790348 737161 682818 630174 582288
56792 582288 541524 509032 485116 469644 461981 460894 464837 472466 482993 496055 511199 527573
56780 527573 544177 560129 574276 584683 589115 586117 575294 556693 530749 499087 464546 429763
56768 429763 396053 363991 334500 308655 286672 267778 251022 235869 222220 210322 200500 192519
$$ packed form
56850G19924k5222k9451l0826k8989k4194j7240q843M56R866J8594K6583L4256
56838F44914M1427M7217N1305N4348N6658N7249N4834M9190M0802K9642J5211
56827A142797k191k0806l8125n1977o1121o5231o4514n9457n0971m0589k9889
56816F57926j9630r757k62Q489J6255K3049K8594L2449L4798L6258L6461L3855
56804H78485K7555J8530Q130l600j6969l0611m1890m9282n3187n4343n2644m7886
56792E82288m0764l2492k3916j5472p663j087L943P629J0527J3062J5144J6374
56780E27573J6604J5952J4147J0407M432k998j0823j8601k5944l1662l4541l4783
56768D29763l3710l2062k9491k5845k1983j8894j6756j5153j3649j1898r822p981
$$ plain form
56756 192519 185333 177970 170589 164274 159808 157066 155416 154205 152850 151039 148929 146785 144404 141423
56742 141423 138225 135930 135182 135420 135679 135659 135603 135517 135138 134529 134171 134427 135278 136563 138034 139171 139450 139057
56724 139057 138959 139883 141477 142809 143486 143853 144184 144273 144006 143863 144448 145763 147309 148781 150285 151884 153384
56707 153384 154733 156281 158396 160927 163316 165146 166373 167078 167276 167074 166768 166591 166470 166226 165984 166132
56691 166132 166844 167828 168670 169260 169765 170326 170908 171319 171237 170504 169626 169656 171119 173226 174646 174993 174913 174856 174608
56672 174608 174296 174847 176761 179101 180524 180941 181339 182217 183123 183709 184355 185531 187158 188853 190307 191210
56656 191210 191278 190639 189835 189208 188652 188102 187923 188542 189930 191667 193284 194398 194792 194613 194332 194344 194619 194794
56638 194794 194501 193642 192483 191435 190572 189576 188367 187479 187341 187461 186982 185946 185219 185114 184896 183916 182397
$$ packed form
56756A92519p186p363p381o315m466k742j650j211j355j811k110k144k381k981
56742A41423l198k295p48K38K59k0n6q6l79o09l58K56Q51J285J471J137K79l93
56724A39057r8R24J594J332O77L67L31Q9k67j43N85J315J546J472J504J599J500
56707A53384J349J548K115K531K389J830J227P05J98k02l06j77j21k44k42J48
56691A66132P12R84Q42N90N05N61N82M11q2p33q78L0J463K107J420L47q0n7k48
56672A74608l12N51J914K340J423M17L98Q78R06N86O46J176J627J695J454R03
56656A91210O8o39q04o27n56n50j79O19J388J737J617J114L94j79k81J2K75J75
56638A94794k93q59j159j048q63r96j209q88j38J20m79j036p27j05k18r80j519
$$ plain form
56621 182397 180714 178709 176367 174451 173602 173216 172091 170041 168054 166898 166372 166069 166097 166650 167368 167618
56605 167618 167176 166319 165394 164644 164321 164610 165342 166082 166656 167397 168641 170080 171037 171453 172161 173819 175868
56588 175868 177071 176985 176386 176171 176416 176782 177348 178520 180302 182135 183540 184623 185818 187308 188908 190514
56572 190514 192423 194995 198124 201383 204797 208997 214362 220468 226797 233578 241263 249519 257571 265495
56558 265495 274268 284337 294925 305072 314658 323956 332725 340256 345947 349502 350940 350759 349767 348423
56544 348423 346589 344053 340848 336932 332213 327179 322829 319483 316212 311973 306771 301154 295231 288970
56530 288970 282968 277932 273580 268977 263907 259121 255199 251946 249093 246804 245093 243305 240688 237327
56516 237327 234129 231866 230397 228928 226995 224999 223596 222766 221876 220604 219225 217932 216643 215711 215949
$$ packed form
56621A82397j683k005k342j916q49l86j125k050j987j156n26l03K8N53P18K50
56605A67618m42q57r25p50l23K89P32P40N74P41J244J439R57M16P08J658K049
56588A75868J203q6n99k15K45L66N66J172J782J833J405J083J195J490J600J606
56572A90514J909K572L129L259L414M200N365O106O329O781P685Q256Q052P924
56558B65495Q773J0069J0588J0147R586R298Q769P531N691L555J438j81r92j344
56544C48423j834k536l205l916m719n034m350l346l271m239n202n617n923o261
56530B88970o002n036m352m603n070m786l922l253k853k289j711j788k617l361
56516B37327l198k263j469j469j933j996j403q30q90j272j379j293j289r32K38
$$ plain form
56501 215949 217297 218204 217226 214754 212322 210609 209194 208005 207750 208661 209859 210390 210241 209920 209646 209386
56485 209386 209266 209534 210273 211331 212367 212945 212927 212788 213219 214344 215624 216510 216832 216641 216157 215861 216188 217028
56467 217028 217902 218597 219196 219521 219168 218153 216964 215866 214691 213507 212881 213196 214150 215225 216223 217069 217532
56450 217532 217517 217349 217438 217871 218548 219475 220709 222226 224025 226100 228165 229676 230350 230428 230236 229740 228727
56433 228727 227289 225932 225253 225530 226465 227370 227830 228097 228652 229490 230244 230832 231433 231871 231672 230890 230229 230056
56415 230056 229909 229392 228999 229471 230681 231788 232349 232758 233586 234919 236417 237681 238466 238783 238971 239562 240890
56398 240890 242728 244404 245487 246351 247726 249555 250747 250557 249908 250581 253116 256159 258068 258516 258286 258107
56382 258107 258158 258325 258463 258576 258981 260054 261612 262906 263452 263552 263697 263867 263805 263678 264026 265145 266844 268710
$$ packed form
56501B15949J348R07r78k472k432j713j415j189k55R11J198N31j49l21k74k60
56485B09386j20K68P39J058J036N78j8j39M31J125J280Q86L22j91m84k96L27Q40
56467B17028Q74O95N99L25l53j015j189j098j175j184o26L15R54J075R98Q46M63
56450B17532j5j68Q9M33O77R27J234J517J799K075K065J511O74P8j92m96j013
56433B28727j438j357o79K77R35R05M60K67N55Q38P54N88O01M38j99p82o61j73
56415B30056j47n17l93M72J210J107N61M09Q28J333J498J264P85L17J88N91J328
56398B40890J838J676J083Q64J375J829J192j90o49O73K535L043J909M48k30j79
56382B58107N1J67J38J13M05J073J558J294N46J00J45J70o2j27L48J119J699J866
$$ plain form
56364 268710 270336 271491 272288 273093 274126 275350 276819 278778 281137 283252 284594 285367 286021 286506 286553 286495
56348 286495 287149 288801 290868 292713 294382 296273 298428 300512 302322 303979 305646 307321 309039 311026
56334 311026 313432 316014 318322 320261 322193 324359 326491 328279 330037 332521 336070 340199 344050 347076
56320 347076 349390 351643 354450 357657 360356 361932 362884 364211 366200 368413 370598 372856 375002 376634
56306 376634 378041 380214 383606 387631 391706 396027 400872 405981 411311 417649 425558 434151 441888 448344
56292 448344 454331 460468 466567 472452 478448 484785 491245 497764 504816 512771 521335 530094 539304 549631
56278 549631 561229 573538 586074 599038 612929 627860 643625 660367 678750 699235 721632
56267 721632 745741 772161 801862 835030 870955 909250 950633 996292 1046973 1103101 1165399
$$ packed form
56364B68710J626J155P97Q05J033J224J469J959K359K115J342P73O54M85M7n8
56348B86495O54J652K067J845J669J891K155K084J810J657J667J675J718J987
56334C11026K406K582K308J939J932K166K132J788J758K484L549M129L851L026
56320C47076K314K253K807L207K699J576R52J327J989K213K185K258K146J632
56306C76634J407K173L392M025M075M321M845N109N330O338P909Q593P737O456
56292D48344N987O137O099N885N996O337O460O519P052P955Q564Q759R210J0327
56278E49631J1598J2309J2536J2964J3891J4931J5765J6742J8383K0485K2397
56267G21632K4109K6420K9701L3168L5925L8295M1383M5659N0681N6128O2298
$$ plain form
56256 1165399 1234888 1312418 1398524 1493678 1598417 1713315 1838913 1975479 2122666 2279677
56246 2279677 2445890 2620978 2804180 2993703 3187020 3381306 3573276 3759017 3934582
56237 3934582 4096701 4242574 4369095 4472717 4550077 4598641 4616929 4604491 4561744 4489856
56227 4489856 4390970 4268517 4126797 3969896 3801138 3623677 3441091 3256925 3073853 2893662
56217 2893662 2717934 2548472 2387217 2235850 2095179 1964731 1843359 1730524 1626579
56208 1626579 1531611 1444655 1364615 1291357 1225127 1165288 1110448 1059691 1012908 970045 930873
56197 930873 895646 865078 839237 816912 796515 777368 759800 744214 730375 717591 705392
56186 705392 693935 683687 674837 667154 660391 654513 649439 644883 640675 636901 633516 630170 626779 623926
$$ packed form
56256A165399O9489P7530Q6106R5154J04739J14898J25598J36566J47187J57011
56246B279677J66213J75088J83202J89523J93317J94286J91970J85741J75565
56237C934582J62119J45873J26521J03622P7360M8564J8288j2438m2747p1888
56227D489856r8886j22453j41720j56901j68758j77461j82586j84166j83072j80191
56217B893662j75728j69462j61255j51367j40671j30448j21372j12835j03945
56208A626579r4968q6956q0040p3258o6230n9839n4840n0757m6783m2863l9172
56197I30873l5227l0568k5841k2325k0397j9147j7568j5586j3839j2784j2199
56186G05392j1457j0248q850p683o763n878n074m556m208l774l385l346l391k853
$$ plain form
56172 623926 622253 621652 621480 621418 621694 622563 623985 625830 628092 630924 634653 639627 645799 652621 659606 666890
56156 666890 675025 684446 695350 707873 722073 737850 755196 774417 796037 820628 848864 881426
56144 881426 918684 960757 1007945 1060694 1119059 1182713 1251630 1326076 1405583 1488596 1573509
56133 1573509 1659349 1744893 1827787 1905376 1975984 2038857 2093422 2139376 2177112 2207326 2230519
56122 2230519 2247364 2258784 2264717 2263322 2252471 2231880 2202985 2167138 2124828 2076232 2021371 1959842
56110 1959842 1891479 1817350 1739298 1658794 1577242 1497119 1421493 1352235 1289731 1234355 1187004
56099 1187004 1147888 1115961 1090046 1069668 1054370 1043066 1034630 1028464 1024078 1020744 1018025 1016201
56087 1016201 1015819 1017098 1019908 1023891 1028491 1033361 1038772 1045164 1052344 1059716 1067266 1075663 1085288 1095800
$$ packed form
56172F23926j673o01j72o2K76Q69J422J845K262K832L729M974O172O822O985P284
56156F66890Q135R421J0904J2523J4200J5777J7346J9221K1620K4591K8236L2562
56144H81426L7258M2073M7188N2749N8365O3654O8917P4446P9507Q3013Q4913
56133A573509Q5840Q5544Q2894P7589P0608O2873N4565M5954L7736L0214K3193
56122B230519J6845J1420N933j395j0851k0591k8895l5847m2310m8596n4861o1529
56110A959842o8363p4129p8052q0504q1552q0123p5626o9258o2504n5376m7351
56099A187004l9116l1927k5915k0378j5298j1304q436o166m386l334k719j824
56087A016201l82J279K810L983M600M870N411O392P180P372P550Q397R625J0512
$$ plain form
56073 1095800 1106654 1117501 1128138 1138699 1149828 1161962 1174560 1186820 1199034 1212334 1227160
56062 1227160 1242965 1259469 1277068 1295686 1314276 1331982 1349078 1366286 1383785 1401219 1418139
56051 1418139 1434184 1449335 1464152 1479319 1494934 1510749 1526896 1543630 1560524 1576895 1593066
56040 1593066 1610341 1629626 1650878 1673879 1698645 1725059 1753060 1783290 1816665 1853342 1892932
56029 1892932 1935595 1981779 2030928 2081658 2133295 2186145 2240231 2295030 2350502 2407134 2464890
56018 2464890 2523397 2583192 2645323 2709708 2775504 2843264 2914901 2991081 3070429 3151962 3236664
56007 3236664 3325855 3419641 3517824 3620941 3729455 3843218 3962515 4088483 4221894 4362747
55997 4362747 4511556 4669655 4837742 5015647 5204025 5404616 5618284 5844660 6084499
$$ packed form
56073A095800J0854J0847J0637J0561J1129J2134J2598J2260J2214J3300J4826
56062A227160J5805J6504J7599J8618J8590J7706J7096J7208J7499J7434J6920
56051A418139J6045J5151J4817J5167J5615J5815J6147J6734J6894J6371J6171
56040A593066J7275J9285K1252K3001K4766K6414K8001L0230L3375L6677L9590
56029A892932M2663M6184M9149N0730N1637N2850N4086N4799N5472N6632N7756
56018B464890N8507N9795O2131O4385O5796O7760P1637P6180P9348Q1533Q4702
56007C236664Q9191R3786R8183J03117J08514J13763J19297J25968J33411J40853
55997D362747J48809J58099J68087J77905J88378K00591K13668K26376K39839
$$ plain form
55988 6084499 6340600 6615654 6911094 7228941 7572799 7945977 8350515 8789127 9266296
55979 9266296 9786642 10354429 10975877 11660012 12416388 13254510 14186917 15230967 16407196
55970 16407196 17739552 19259663 21009346 23038994 25407934 28188447 31465469 35329484
55962 35329484 39873206 45198561 51425061 58690845 67150803 76974809 88335597 101378878
55954 101378878 116186532 132747479 150941239 170543422 191267222 212822241 234926445
55947 234926445 257224752 279149751 299811156 317972376 332131924 340725490 342442822
55940 342442822 336567476 323187869 303195814 278117913 249868197 220460845 191705315
55933 191705315 164959643 141033245 120247233 102570557 87752539 75429853 65210992
$$ packed form
55988F084499K56101K75054K95440L17847L43858L73178M04538M38612M77169
55979I266296N20346N67787O21448O84135P56376Q38122R32407J044050J176229
55970A6407196J332356J520111J749683K029648K368940K780513L277022L864015
55962C5329484M543722N325355O226500P265784Q459958R824006J1360788J3043281
55954A01378878J4807654J6560947J8193760J9602183K0723800K1555019K2104204
55947B34926445K2298307K1924999K0661405J8161220J4159548Q593566J717332
55940C42442822n875346j3379607j9992055k5077901k8249716k9407352k8755530
55933A91705315k6745672k3926398k0786012j7676676j4818018j2322686j0218861
$$ plain form
55926 65210992 56730461 49669040 43756444 38772108 34542191 30928952 27820560 25127858
55918 25127858 22782144 20728589 18920804 17321206 15901525 14638742 13511442 12501010
55910 12501010 11593207 10775964 10037343 9367229 8758730 8205861 7701548 7239418 6815619
55901 6815619 6427048 6069434 5738761 5432925 5150300 4888141 4644027 4417426 4208074
55892 4208074 4013934 3832442 3662833 3505590 3360224 3225034 3098576 2980299 2870129
55883 2870129 2768197 2674442 2587900 2507121 2431663 2362132 2298190 2237735 2178816 2121187 2065133
55872 2065133 2009974 1954826 1899795 1845318 1791216 1737476 1685156 1635426 1588372 1543718 1502005
55861 1502005 1464088 1430061 1399529 1372156 1347029 1322370 1297085 1271948 1248061 1224729 1200165
$$ packed form
55926F5210992q480531p061421n912596m984336m229917l613239l108392k692702
55918B5127858k345714k053555j807785j599598j419681j262783j127300j010432
55910A2501010r07803q17243p38621o70114o08499n52869n04313m62130m23799
55901F815619l88571l57614l30673l05836k82625k62159k44114k26601k09352
55892D208074j94140j81492j69609j57243j45366j35190j26458j18277j10170
55883B870129j01932r3755q6542q0779p5458o9531o3942o0455n8919n7629n6054
55872B065133n5159n5148n5031n4477n4102n3740n2320m9730m7054m4654m1713
55861A502005l7917l4027l0532k7373k5127k4659k5285k5137k3887k3332k4564
$$ plain form
55850 1200165 1173799 1146527 1118833 1090035 1059560 1027950 996339 965655 936460 908917 882808
55839 882808 858073 835253 814885 796613 779465 762951 747377 733170 720395 708810 697917
55828 697917 687097 676161 665628 656023 647080 638088 628787 619390 609938 600259 590455 580818 571295
55815 571295 561630 552062 543295 535670 528856 522555 517056 512846 510021 508348 507764 508561 511066 515207 520363
55800 520363 525663 530535 535005 539469 544186 548913 552928 555476 556393 556243 555620 554330 551513 546614 539882
55785 539882 531920 523138 513890 504829 496772 490229 485090 480704 476339 471833 467778 464825 462905 461502
55771 461502 460561 460669 462401 465982 471453 478358 485183 489916 491583 490611 487418 481399 471839 459160 444619
55756 444619 429237 413674 398731 385247 373630 364036 356752 351813 348464 345571 342504 339154 335287
$$ packed form
55850A200165k6366k7272k7694k8798l0475l1610l1611l0684k9195k7543k6109
55839H82808k4735k2820k0368j8272j7148j6514j5574j4207j2775j1585j0893
55828F97917j0820j0936j0533r605q943q992r301r397r452r679r804r637r523
55815E71295r665r568q767p625o814o301n499m210k825j673n84P97K505M141N156
55800E20363N300M872M470M464M717M727M015K548R17j50o23j290k817m899o732
55785E39882p962q782r248r061q057o543n139m386m365m506m055k953j920j403
55771D61502r41J08J732L581N471O905O825M733J667r72l193o019r560j2679j4541
55756D44619j5382j5563j4943j3484j1617r594p284m939l349k893l067l350l867
$$ plain form
55743 335287 330520 324947 319302 314352 310424 307435 304997 302528 299660 296634 294044 292129 290470 288315
55729 288315 285091 280726 275736 270900 266680 262953 259339 255576 251524 247197 242972 239415 236654 234304
55715 234304 232300 231391 232399 235277 239320 243945 248795 253400 257407 260974 264404 267457 269526 270334 269888
55700 269888 267915 263939 257988 250640 242412 233677 225256 218417 213918 211452 210133 209153 207879 205976
55686 205976 203845 202489 202428 202976 203049 202569 202598 204059 206744 209697 212248 214379 216261 217818 218796 218942 217929
55669 217929 215420 211633 207677 204811 203278 202284 201201 200242 199746 199455 199096 199273 201047 204636 209052 213017
55653 213017 215890 217831 219588 222109 225816 230030 233455 235381 236187 236651 237072 237189 236594 235061 232657
55638 232657 229699 226465 222878 218580 213352 207369 201109 195137 189896 185456 181521 177836 174502 171727
$$ packed form
55743C35287m767n573n645m950l928k989k438k469k868l026k590j915j659k155
55729B88315l224m365m990m836m220l727l614l763m052m327m225l557k761k350
55715B34304k004r09J008K878M043M625M850M605M007L567L430L053K069Q08m46
55700B69888j973l976n951p348q228q735q421o839m499k466j319r80j274j903
55686B05976k131j356o1N48P3m80K9J461K685K953K551K131J882J557R78J46j013
55669B17929k509l787l956k866j533r94j083r59m96k91l59J77J774L589M416L965
55653B13017K873J941J757K521L707M214L425J926Q06M64M21J17n95j533k404
55638B32657k958l234l587m298n228n983o260n972n241m440l935l685l334k775
$$ plain form
55624 171727 169493 167730 166618 166240 166053 165220 163527 161563 159960 158897 158354 158303 158427 158109 157001 155304
55608 155304 153341 151270 149369 148090 147386 146462 144722 142723 141590 141585 141795 141298 140125 138944 138212 137941
55592 137941 137988 138169 138126 137476 136257 135097 134697 135147 135932 136642 137510 139016 141215 143743 146461 149733 153977
55575 153977 159263 165454 172392 179736 186999 194094 201573 209875 218528 226613 233937 241060 247996 253590
55561 253590 256673 257324 256375 253985 249562 243073 235506 227636 219061 209210 198833 189614 182365 176399
55547 176399 170800 165550 161048 157171 153419 149685 146315 143587 141608 140588 140721 141788 143230 144640
55533 144640 145861 146689 146858 146378 145481 144151 142127 139543 137195 135827 135312 134808 133638 131809 129751 127737
55517 127737 125670 123353 120901 118730 117088 115753 114361 112876 111472 110148 108878 108046 108088 108595 108408
$$ packed form
55624A71727k234j763j112l78j87q33j693j964j603j063n43n1J24l18j108j697
55608A55304j963k071j901j279p04r24j740j999j133nK10m97j173j181p32k71
55592A37941M7J81m3o50j219j160m00M50P85P10Q68J506K199K528K718L272M244
55575A53977N286O191O938P344P263P095P479Q302Q653Q085P324P123O936N594
55561B53590L083O51r49k390m423o489p567p870q575r851j0377r219p249n966
55547A76399n599n250m502l877l752l734l370k728j979j020J33J067J442J410
55533A44640J221Q28J69m80q97j330k024k584k348j368n15n04j170j829k058k014
55517A27737k067k317k452k171j642j335j392j485j404j324j270q32M2N07j87
$$ plain form
55502 108408 106997 105180 103972 103217 102056 100471 99429 99485 100126 100806 101851 103757 106084 107771 108333 108190
55486 108190 107912 107705 107584 107522 107355 107020 106968 107827 109441 110761 111001 110511 110114 109996 109740 109157 108461 107691 106634
55467 106634 105357 104280 103492 102523 101121 99851 99514 100137 100862 100765 99583 97781 96169 95364 95345 95516 95334
55450 95334 94870 94650 95013 95760 96413 96741 97018 97790 99277 101014 102214 102533 102358 102327 102779 103717 104988 106270
55432 106270 107077 107091 106461 105664 105120 105068 105619 106675 107846 108621 108725 108288 107743 107558 107892 108504 109100 109785 110929
55413 110929 112572 114336 115993 117702 119462 120727 121013 120588 120130 119800 119094 117534 115176 112479 109949
55398 109949 107895 106260 104743 103277 102231 101888 101962 101952 101832 101978 102541 103374 104516 106165 108037 109222
55382 109222 109008 107634 106063 105152 105136 105714 106427 106967 107167 106850 105885 104434 102844 101125 98931 96335 94251
$$ packed form
55502A08408j411j817j208p55j161j585j042N6O41O80J045J906K327J687N62j43
55486A08190k78k07j21o2j67l35n2Q59J614J320K40m90l97j18k56n83o96p70j057
55467A06634j277j077p88r69j402j270l37O23P25r7j182j802j612q05j9J71j82
55450I5334m64k20L63P47O53L28K77P72J487J737J200L19j75l1M52R38J271J282
55432A06270Q07J4o30p97n44n2N51J056J171P75J04m37n45j85L34O12N96O85J144
55413A10929J643J764J657J709J760J265K86m25m58l30p06j560k358k697k530
55398A09949k054j635j517j466j046l43P4j0j20J46N63Q33J142J649J872J185
55382A09222k14j374j571r11j6N78P13N40K00l17r65j451j590j719k194k596k084
$$ plain form
55365 94251 93599 94255 95317 96176 96757 96948 96523 95653 94823 94163 93444 92834 92924 93803 94783 95367 95893 96791 97779
55346 97779 98295 98297 98068 97577 96659 95674 95379 96090 97376 98659 99767 100764 101455 101382 100396 99110 98459 98733 99276
55327 99276 99398 99289 99603 100388 101029 101201 101191 101212 101129 101078 101607 102857 104164 104907 105172 105173 104641 103402 102006 101047
55307 101047 100288 99201 98102 97885 98744 99933 100812 101441 102096 102847 103800 105146 106723 107953 108475 108465 108232
55290 108232 107874 107504 107425 107814 108559 109573 110982 112760 114443 115446 115553 114883 113608 111888 109996 108272
55274 108272 106990 106325 106365 106988 107798 108317 108320 107956 107550 107299 107137 106914 106643 106426 106137 105400 104129 102935 102690
55255 102690 103602 105007 106163 106986 107817 108630 108914 108426 107662 107225 106895 105882 104092 102588 102391 103274 104337
55238 104337 105434 107144 109381 110993 111166 110452 109870 109579 109097 108383 107897 107777 107666 107379 107218 107553 108447
$$ packed form
55365I4251o52O56J062Q59N81J91m25q70q30o60p19o10R0Q79R80N84N26Q98R88
55346I7779N16Kk29m91r18r85k95P11J286J283J108R97O91p3r86j286o51K74N43
55327I9276J22j09L14P85O41J72j0K1q3n1N29J250J307P43K65Jn32j239j396r59
55307A01047p59j087j099k17Q59J189Q79O29O55P51R53J346J577J230N22j0k33
55290A08232l58l70p9L89P45J014J409J778J683J003J07o70j275j720j892j724
55274A08272j282o65M0O23Q10N19Ll64m06k51j62k23k71k17k89p37j271j194k45
55255A02690R12J405J156Q23Q31Q13K84m88p64m37l30j013j790j504j97Q83J063
55238A04337J097J710K237J612J73p14n82k91m82p14m86j20j11k87j61L35Q94
$$ plain form
55221 108447 109666 110759 111241 111058 110753 110856 111301 111788 112414 113420 114581 115466 116139 116967 117813 118214 118307 118781
55203 118781 119754 120475 120341 119488 118093 115941 113160 110725 109558 109607 110245 111103 111915 112056 111059 109377 107972
55186 107972 107236 106922 107009 107915 109751 111918 113653 114606 114824 114570 114264 114184 114034 113162 111426 109587 108600 108720
55168 108720 109492 110416 111301 112065 112535 112594 112381 112168 112091 112121 112279 112732 113541 114426 114984 115129 115133 115235 115481 115946
55148 115946 116777 117820 118478 118275 117407 116438 115620 114838 114142 113838 113979 114170 114053 113730 113455 113209 112834 112384
55130 112384 112035 111766 111432 111102 110981 111002 110844 110420 109987 109666 109211 108528 108077 108318 109007 109561 110045 111219 113473
55111 113473 116194 118434 119798 120434 120552 120399 120367 120669 121002 120967 120671 120536 120638 120768 121053 121944 123449 124861
55093 124861 125493 125335 124822 124283 123825 123454 123062 122592 122395 123084 124765 126711 128116 128901 129476 130030 130509 131036
$$ packed form
55221A08447J219J093M82j83l05J03M45M87O26J006J161Q85O73Q28Q46M01R3M74
55203A18781R73P21j34q53j395k152k781k435j167M9O38Q58Q12J41r97j682j405
55186A07972p36l14Q7R06J836K167J735R53K18k54l06q0j50q72j736j839r87J20
55168A08720P72R24Q85P64M70N9k13k13p7L0J58M53Q09Q85N58J45MJ02K46M65
55148A15946Q31J043O58k03q68r69q18p82o96l04J41J91j17l23k75k46l75m50
55130A12384l49k69l34l30j21K1j58m24m33l21m55o83m51K41O89N54M84J174K254
55111A13473K721K240J364O36J18j53l2L02L33l5k96j35J02J30K85Q91J505J412
55093A24861O32j58n13n39m58l71l92m70j97O89J681J946J405P85N75N54M79N27
$$ plain form
55075 131036 131783 132502 132793 132882 133517 134852 136006 136095 135289 134385 133744 133243 133051 133588 134568 134841 133678 131704
55057 131704 130036 128874 127649 126333 125726 126280 127386 128168 128384 128146 127318 125833 124233 123239 122950 122980 123239
55040 123239 123940 124972 125886 126486 126864 126844 126041 124614 123341 122715 122494 122319 122221 122274 122288 122133 121922 121607 120900
55021 120900 119926 119340 119399 119475 119023 118543 118970 120489 122498 124351 125468 125213 123595 121902 121716 123202 125083
55004 125083 126294 126914 127435 127989 128629 129557 130589 130985 130308 129099 128282 128226 128728 129523 130352 130864 130922 130850 130963
54985 130963 131019 130560 129704 129175 129508 130496 131452 131777 131300 130328 129427 129012 129086 129411 129818 130228 130541 130800 131377
54966 131377 132645 134451 136158 137329 138134 138968 139897 140622 140826 140315 139052 137368 136136 136254 137730 139505
54950 139505 140430 140307 139772 139361 139108 138976 139171 139744 140290 140364 139999 139475 138796 137755 136456 135293 134423 133631
$$ packed form
55075A31036P47P19K91Q9O35J335J154Q9q06r04o41n01j92N37R80K73j163j974
55057A31704j668j162j225j316o07N54J106P82K16k38q28j485j600r94k89L0K59
55040A23239P01J032R14O00L78k0q03j427j273o26k21j75r8N3J4j55k11l15p07
55021A20900r74n86N9P6m52m80M27J519K009J853J117k55j618j693j86J486J881
55004A25083J211O20N21N54O40R28J032L96o77j209q17n6N02P95Q29N12N8p2J13
54985A30963N6m59q56n29L33R88R56L25m77r72r01m15P4L25M07M10L13K59N77
54966A31377J268J806J707J171Q05Q34R29P25K04n11j263j684j232J18J476J775
54950A39505R25j23n35m11k53j32J95N73N46P4l65n24o79j041j299j163q70p92
$$ plain form
54932 133631 132833 132369 132581 133356 134352 135527 137226 139797 143238 147142 150889 154042 156731 159644 163474
54917 163474 168303 173572 178600 183091 187126 190747 193683 195575 196395 196373 195484 193270 189478 184642 179620
54902 179620 174644 169327 163719 158755 155269 152956 150852 148687 147158 146791 147092 147159 146793 146594 147048 147937
54886 147937 148725 149218 149738 150765 152576 155048 157686 160002 162035 164349 167326 170676 173951 177283 181110
54871 181110 185251 188921 191752 194127 196196 197308 196986 195852 194757 193361 190554 186192 181524 177700
54857 177700 174660 171762 168826 166137 163894 162097 160644 159228 157490 155456 153472 151532 149195 146465
54843 146465 144140 142825 142125 141364 140623 140340 140218 139404 137699 135826 134400 133309 132282 131450 131055 130995 131003
54826 131003 131002 131102 131414 132016 132895 133783 134237 134008 133223 132248 131555 131618 132594 134042 135224 135781 135902 135923 136106
$$ packed form
54932A33631p98m64K12P75R96J175J699K571L441L904L747L153K689K913L830
54917A63474M829N269N028M491M035L621K936J892Q20k2q89k214l792m836n022
54902A79620m976n317n608m964l486k313k104k165j529l67L01O7l66j99M54Q89
54886A47937P88M93N20J027J811K472K638K316K033K314K977L350L275L332L827
54871A81110M141L670K831K375K069J112l22j134j095j396k807m362m668l824
54857A77700l040k898k936k689k243j797j453j416j738k034j984j940k337k730
54843A46465k325j315p00p61p41k83j22q14j705j873j426j091j027q32l95o0Q
54826A31003jJ00L12O02Q79Q88M54k29p85r75o93O3R76J448J182N57J21K1J83
$$ plain form
54807 136106 136770 138138 139856 141092 141373 141061 140784 140723 140695 140671 140844 141347 142202 143373 144606 145340 145126 144111
54789 144111 142941 142239 142303 143101 144226 144980 144877 144133 143471 143427 144094 145450 147521 150070 152470 154196 155354
54772 155354 156524 158115 160080 162228 164660 167773 171856 176717 181761 186479 190884 195469 200658 206302
54758 206302 211684 215999 218825 220205 220399 219656 218154 215982 213071 209234 204376 198654 192376 185828 179358
54743 179358 173494 168692 164907 161727 159053 157392 157190 158053 158949 159149 158700 158007 157358 157004 157321 158534
54727 158534 160360 162213 163791 165324 167255 169884 173295 177378 181736 185750 189004 191667 194262 196999
54713 196999 199396 200630 200251 198481 195891 192905 189680 186374 183315 180726 178359 175613 172158 168246
54699 168246 164348 160703 157482 155117 153935 153384 152217 149794 146869 144674 143479 142567 141491 140706 140788
$$ packed form
54807A36106O64J368J718J236K81l12k77o1k8k4J73N03Q55J171J233P34k14j015
54789A44111j170p02O4P98J125P54j03p44o62m4O67J356K071K549K400J726J158
54772A55354J170J591J965K148K432L113M083M861N044M718M405M585N189N644
54758B06302N382M315K826J380J94p43j502k172k911l837m858n722o278o548o470
54743A79358n864m802l785l180k674j661k02Q63Q96K00m49o93o49l54L17J213
54727A58534J826J853J578J533J931K629L411M083M358M014L254K663K595K737
54713A96999K397J234l79j770k590k986l225l306l059k589k367k746l455l912
54699A68246l898l645l221k365j182n51j167k423k925k195j195r12j076p85Q2
$$ plain form
54684 140788 141579 142422 142906 143005 142693 141890 140729 139581 138686 137992 137429 137142 137322 137872 138448 138854 139269 139937
54666 139937 140683 140968 140518 139708 139114 138883 138830 139058 140011 141782 143710 144899 144969 144211 143249 142768 143191 144298
54648 144298 145303 145652 145597 145651 145679 145050 143680 142379 141939 142284 142804 143258 143893 144821 145691 146126 146221 146404 146872
54629 146872 147340 147362 146746 145589 143982 141930 139639 137702 136768 136960 137730 138368 138648 139001 139998 141636 143207
54612 143207 143991 144035 143996 144227 144380 144085 143650 143625 143860 143525 142125 140068 138110 136641 135693 135308 135482 135934
54594 135934 136330 136769 137742 139436 141256 142264 142125 141433 140965 140780 140383 139758 139720 140929 142889 144429 145021
54577 145021 145109 145186 145165 144838 144396 144127 143952 143642 143237 142880 142453 141720 140717 139705 138831 138131 137774 138026 138941
54558 138941 140288 141729 142977 143926 144822 146065 147613 148774 148985 148644 148751 149728 151033 151941 152289 152353 152400
$$ packed form
54684A40788P91Q43M84R9l12q03j161j148q95o94n63k87J80N50N76M06M15O68
54666A39937P46K85m50q10n94k31n3K28R53J771J928J189P0p58r62m81M23J107
54648A44298J005L49n5N4K8o29j370j301m40L45N20M54O35R28Q70M35R5J83M68
54629A46872M68K2o16j157j607k052k291j937r34J92P70O38K80L53R97J638J571
54612A43207P84M4l9K31J53k95m35k5K35l35j400k057j958j469r48l85J74M52
54594A35934L96M39R73J694J820J008j39o92m68j85l97o25l8J209J960J540N92
54577A45021Q8P7k1l27m42k69j75l10m05l57m27p33j003j012q74p00l57K52R15
54558A38941J347J441J248R49Q96J243J548J161K11l41J07R77J305R08L48O4M7
$$ plain form
54541 152400 152595 153048 153674 154276 154941 156122 158025 160097 161500 162034 162296 162872 163658 164063 163715 162764 161569
54524 161569 160283 158828 157188 155616 154503 154081 154248 154635 154805 154503 153791 152974 152358 152078 152134 152514 153202
54507 153202 154130 155090 155700 155570 154685 153590 152843 152257 151073 149114 147340 146835 147488 148222 148419 148471 148926 149732
54489 149732 150631 151724 153086 154180 154267 153436 152753 153218 154785 156558 157761 158364 158857 159639 160703 161806
54473 161806 162701 163207 163225 162870 162506 162466 162778 163250 163744 164208 164572 164857 165311 166179 167334 168339 168832 168658 167765
54454 167765 166350 165029 164386 164273 164006 163352 162817 162763 162803 162493 162185 162589 163690 164680 164954 164759 164777 165329 166034
54435 166034 166084 164919 162824 160809 159737 159686 160274 161307 162708 164068 164771 164654 164172 163846 163808 163961 164324
54418 164324 165092 166472 168476 170739 172616 173699 174175 174494 174747 174637 174002 173101 172324 171858 171671 171617 171572 171591
$$ packed form
54541A52400J95M53O26O02O65J181J903K072J403N34K62N76P86M05l48r51j195
54524A61569j286j455j640j572j113m22J67L87J70l02p12q17o16k80N6L80O88
54507A53202R28R60O10j30q85j095p47n86j184j959j774n05O53P34J97N2M55Q06
54489A49732Q99J093J362J094Q7q31o83M65J567J773J203O03M93P82J064J103
54473A61806Q95N06J8l55l64m0L12M72M94M64L64K85M54Q68J155J005M93j74q93
54454A67765j415j321o43j13k67o54n35n4M0l10l08M04J101R90K74j95J8N52P05
54435A66034N0j165k095k015j072n1N88J033J401J360P03j17m82l26l8J53L63
54418A64324P68J380K004K263J877J083M76L19K53j10o35r01p77m66j87n4m5J9
$$ plain form
54400 171591 171898 172491 172915 172766 172367 172539 173640 175165 176388 177030 177178 176941 176568 176686 178027 180756 184123
54383 184123 186818 187813 187019 185174 183092 181178 179710 179141 179720 180957 182032 182734 183559 184857 186362 187663
54367 187663 188699 189609 190580 191989 194274 197414 200947 204744 209240 214538 219724 223606 225923 227324 228392
54352 228392 229122 229248 228625 227277 225415 223388 221350 219050 216154 212687 208872 204713 200082 195177 190573
54337 190573 186799 184046 182214 181006 180095 179447 179379 180055 181062 181736 181765 181222 180296 179367 179143 180097 181761
54320 181761 183018 183206 182583 181737 181019 180559 180330 180013 179223 178076 177143 176669 176220 175354 174334 173838 174172 175051
54302 175051 175980 176641 177035 177346 177561 177197 175746 173503 171582 170856 171169 171806 172358 172771 172912 172658 172322 172479
54284 172479 173298 174361 175130 175357 175128 174863 175257 176766 179037 181099 182214 182308 181637 180447 179115 178158 177807
$$ packed form
54400A71591L07N93M24j49l99J72J101J525J223O42J48k37l73J18J341K729L367
54383A84123K695R95p94j845k082j914j468n69N79J237J075P02Q25J298J505J301
54367A87663J036R10R71J409K285L140L533L797M496N298N186L882K317J401J068
54352B28392P30J26o23j348j862k027k038k300k896l467l815m159m631m905m604
54337A90573l774k753j832j208r11o48o8O76J007O74K9n43r26r29k24R54J664
54320A81761J257J88o23q46p18m60k29l17p90j147r33m74m49q66j020m96L34Q79
54302A75051R29O61L94L11K15l64j451k243j921p26L13O37N52M13J41k54l36J57
54284A72479Q19J063P69K27k29k65L94J509K271K062J115R4o71j190j332r57l51
$$ plain form
54267 177807 177830 178070 178846 180379 182066 182914 182809 182803 183908 185975 188071 189632 190749 191463 191379 190231 188487
54250 188487 187124 186910 188025 190053 192097 193109 192561 190909 189165 188018 187518 187447 187633 187846 187794 187461 187234
54233 187234 187416 187733 187593 186791 185823 185422 185862 186707 187231 187122 186732 186570 186663 186636 186340 186118 186351 187035 187910
54214 187910 188753 189348 189446 189028 188389 187717 186791 185447 184118 183474 183469 183234 182082 180367 179157 179168 180136 181123
54196 181123 181414 181202 181391 182593 184378 185647 185731 184900 183884 183201 182948 182930 182824 182455 182067 182100 182624 183226
54178 183226 183602 183988 184799 186052 187295 187971 187721 186620 185341 184786 185245 186103 186611 186698 186650 186379 185639 184829
54160 184829 184806 185765 186872 187270 186911 186147 185083 183821 182907 182918 183718 184583 184965 184788 184128 183093 182014 181346
54142 181346 181298 181822 182840 184132 185129 185323 184950 184766 185087 185518 185742 186002 186553 187211 187794 188542 189575 190366
$$ packed form
54267A77807K3K40P76J533J687Q48j05oJ105K067K096J561J117P14q4j148j744
54250A88487j363k14J115K028K044J012n48j652j744j147n00p1J86K13n2l33k27
54233A87234J82L17j40q02r68m01M40Q45N24j09l90j62R3k7k96k22K33O84Q75
54214A87910Q43N95R8m18o39o72r26j344j329o44nk35j152j715j210J1R68R87
54196A81123K91k12J89J202J785J269Q4q31j016o83k53j8j06l69l88L3N24O02
54178A83226L76L86Q11J253J243O76k50j101j279n55M59Q58N08Q7m8k71p40q10
54160A84829k3R59J107L98l59p64j064j262r14J1Q00Q65L82j77o60j035j079o68
54142A81346m8N24J018J292R97J94l73j84L21M31K24K60N51O58N83P48J033P91
$$ plain form
54124 190366 190383 189962 189900 190327 190683 190770 191101 192021 193095 193711 193826 193766 193698 193656 193821 194322 194965 195521 196165 197235
54104 197235 198580 199527 199621 199168 198840 198897 198987 198778 198567 199058 200534 202525 204486 206533 209173 212462 215875
54087 215875 219068 222278 225879 229949 234475 239537 244902 249764 253275 255133 255342 253753 250356 245868
54073 245868 241489 238028 235505 233451 231247 228377 224962 221984 220422 220079 219835 219063 218140 217493 216926 216319
54057 216319 216198 216945 217917 218178 217822 217836 218790 220388 222278 224490 226879 228895 230377 232054 234724 238246
54041 238246 241844 245262 249122 254172 260561 267917 275809 283938 292053 299865 307090 313574 319399 324798
54027 324798 329856 334330 337889 340459 342203 343149 343081 341920 340047 338092 336435 335052 333780 332497 330966
54012 330966 328745 325557 321732 318002 314701 311321 307093 301997 296925 292783 289613 286686 283335 279489
$$ packed form
54124A90366J7m21o2M27L56Q7L31R20J074O16J15o0o8m2J65N01O43N56O44J070
54104A97235J345R47R4m53l28N7R0k09k11M91J476J991J961K047K640L289L413
54087B15875L193L210L601M070M526N062N365M862L511J858K09j589l397m488
54073B45868m379l461k523k054k204k870l415k978j562l43k44p72r23o47n67o07
54057B16319j21P47R72K61l56J4R54J598J890K212K389K016J482J677K670L522
54041B38246L598L418L860N050O389P356P892Q129Q115P812P225O484N825N399
54027C24798N058M474L559K570J744R46o8j161j873j955j657j383j272j283j531
54012C30966k221l188l825l730l301l380m228n096n072m142l170k927l351l846
$$ plain form
53998 279489 275542 271947 268912 266287 263647 260641 257380 254453 252458 251528 251255 250935 249920 247952 245380
53983 245380 242980 241422 240859 240969 241277 241325 240757 239500 237881 236363 235119 233957 232712 231542 230743 230381
53967 230381 230179 229795 229174 228697 228963 230356 232737 235573 238322 240646 242346 243367 243982 244809 246403 248797
53951 248797 251545 254273 257160 260889 266020 272374 279121 285676 292468 300540 310272 320851 331215 341252
53937 341252 351653 362702 373745 383929 392977 400859 407001 410321 410133 406761 401204 394447 387228
53924 387228 380251 374268 369810 366913 365262 364602 364970 366494 369106 372479 376275 380392 384995 390353 396611
53909 396611 403592 410768 417501 423396 428463 432919 436804 439794 441463 441749 441115 440110 438799 436766 433724
53894 433724 429940 425934 421877 417421 412112 405854 399065 392450 386488 380988 375207 368569 361166 353428
$$ packed form
53998B79489l947l595l035k625k640l006l261k927j995r30k73l20j015j968k572
53983B45380k400j558n63J10L08M8n68j257j619j518j244j162j245j170p99l62
53967B30381k02l84o21m77K66J393K381K836K749K324J700J021O15Q27J594K394
53951B48797K748K728K887L729N131O354O747O555O792Q072R732J0579J0364J0037
53937C41252J0401J1049J1043J0184R048P882O142L320j88l372n557o757p219
53924C87228o977n983m458k897j651o60L68J524K612L373L796M117M603N358O258
53909C96611O981P176O733N895N067M456L885K990J669K86o34j005j311k033l042
53894D33724l784m006m057m456n309o258o789o615n962n500n781o638p403p738
$$ plain form
53880 353428 345580 337793 330707 325132 321072 317554 313738 309787 306273 303144 299883 296472 293456 290942
53866 290942 288226 284735 280884 277544 274932 272557 270126 267932 266264 264864 263252 261296 259137 256803
53852 256803 254300 252023 250575 249951 249241 247483 244669 241665 239229 237560 236750 237145 238854 241123 242661
53837 242661 242700 241538 240028 238751 237743 236854 236148 235935 236498 237812 239507 241116 242342 243091 243319 243010
53821 243010 242383 241937 242122 242892 243766 244428 245145 246439 248419 250682 252906 255246 257948 260772 263171 265024
53805 265024 266857 269251 272283 275751 279689 284343 289648 294972 299500 302933 305825 309253 313984 319890
53791 319890 326146 331919 336751 340394 342755 344161 345305 346562 347554 347702 347022 345992 344763 342996 340508
53776 340508 337583 334505 331176 327426 323334 319053 314625 310239 306321 302939 299371 294761 289198 283705
$$ packed form
53880C53428p848p787p086n575m060l518l816l951l514l129l261l411l016k514
53866B90942k716l491l851l340k612k375k431k194j668j400j612j956k159k334
53852B56803k503k277j448o24p10j758k814l004k436j669q10L95J709K269J538
53837B42661L9j162j510j277j008q89p06k13N63J314J695J609J226P49K28l09
53821B43010o27m46J85P70Q74O62P17J294J980K263K224K340K702K824K399J853
53805B65024J833K394L032L468L938M654N305N324M528L433K892L428M731N906
53791C19890O256N773M832L643K361J406J144J257R92J48o80j030j229j767k488
53776C40508k925l078l329l750m092m281m428m386l918l382l568m610n563n493
$$ plain form
53762 283705 279128 275477 272465 270217 268998 268479 267746 266119 263741 261272 259211 257644 256431 255397 254384
53747 254384 253305 252192 251056 249684 247794 245481 243382 242164 241918 242178 242502 242842 243414 244372 245658 246977
53731 246977 247933 248375 248642 249280 250431 251674 252560 253187 254102 255733 258008 260446 262608 264451 266260 268117
53715 268117 269628 270418 270879 272005 274373 277597 280928 284012 286799 289155 291039 292845 295052 297612 300052
53700 300052 302140 304089 306222 308806 312085 315946 319599 322191 323897 325816 328547 331393 333336 334336
53686 334336 335126 336017 336517 336117 334941 333492 332067 330614 329037 327487 326285 325512 324811 323825 322802 322375
53670 322375 322627 322799 322245 321284 320629 320264 319561 318398 317486 317369 317663 317628 317086 316436 315974 315655 315359 315072 314761
53651 314761 314344 313852 313482 313431 313742 314353 315230 316398 317825 319263 320319 320808 321003 321406 322266 323460 324796
$$ packed form
53762B83705m577l651l012k248j219n19p33j627k378k469k061j567j213j034j013
53747B54384j079j113j136j372j890k313k099j218k46K60L24L40N72R58J286J319
53731B46977R56M42K67O38J151J243Q86O27R15J631K275K438K162J843J809J857
53715B68117J511P90M61J126K368L224L331L084K787K356J884J806K207K560K440
53700C00052K088J949K133K584L279L861L653K592J706J919K731K846J943J000
53686C34336P90Q91N00m00j176j449j425j453j577j550j202p73p01r86j023m27
53670C22375K52J72n54r61o55l65p03j163r12j17K94l5n42o50m62l19k96k87l11
53651C14761m17m92l70n1L11O11Q77J168J427J438J056M89J95M03Q60J194J336
$$ plain form
53634 324796 326236 327782 329391 331141 333266 335877 338811 341902 345225 348854 352542 355959 359227 362913
53620 362913 367351 372177 376687 380629 384488 388948 394170 399712 405140 410529 416138 421791 426937 431432
53606 431432 435857 440782 445988 450702 454416 457112 458844 459622 459741 459744 459844 459773 459394 459063 459079 459022 458118 456168
53588 456168 453718 451319 449022 446695 444465 442557 440901 439188 437276 435328 433554 432020 430755 429847
53574 429847 429288 428832 428185 427305 426399 425631 424944 424199 423309 422186 420821 419554 419093 419911 421641 423300 424163
53557 424163 424298 424285 424733 426057 428278 430802 432684 433438 433480 433624 434325 435675 437768 440585 443631 446274
53541 446274 448574 451343 455234 460140 465646 471675 478365 485634 493184 500752 508105 515053 521883 529604
53527 529604 539307 551192 564514 578439 592685 607376 622709 638856 655869 673506 691419 709658
$$ packed form
53634C24796J440J546J609J750K125K611K934L091L323L629L688L417L268L686
53620C62913M438M826M510L942L859M460N222N542N428N389N609N653N146M495
53606D31432M425M925N206M714L714K696J732P78J19LJ00p1l79l31J6n7r04j950
53588D56168k450k399k297k327k230j908j656j713j912j948j774j534j265r08
53574D29847n59m56o47q80r06p68o87p45q90j123j365j267m61Q18J730J659Q63
53557D24163J35j3M48J324K221K524J882P54M2J44P01J350K093K817L046K643
53541D46274K300K769L891M906N506O029O690P269P550P568P353O948O830P721
53527E29604R703J1885J3322J3925J4246J4691J5333J6147J7013J7637J7913J8239
$$ plain form
53515 709658 728754 749083 770364 791979 813681 835836 859068 883823 910185 937912 966613
53504 966613 995913 1025420 1054619 1083084 1110812 1138090 1164895 1190725 1215220 1238699 1261772
53493 1261772 1284582 1306769 1328045 1348458 1368221 1387630 1407188 1427322 1447886 1468237 1487930
53482 1487930 1507005 1525485 1542995 1559221 1574473 1589280 1603507 1616251 1626698 1634789 1640939 1645333
53470 1645333 1647725 1647745 1645160 1639930 1632264 1622631 1611442 1598606 1583661 1566604 1548330 1529844 1511097
53457 1511097 1491102 1469400 1446937 1425102 1404212 1383370 1361698 1339152 1316205 1293293 1270836
53446 1270836 1249357 1229180 1210126 1191754 1173857 1156662 1140686 1126494 1114407 1104326 1095946
53435 1095946 1089193 1084220 1080971 1079085 1078397 1079154 1081463 1084853 1088842 1093750 1100488 1109551 1120638 1133244
$$ packed form
53515G09658J9096K0329K1281K1615K1702K2155K3232K4755K6362K7727K8701
53504I66613K9300K9507K9199K8465K7728K7278K6805K5830K4495K3479K3073
53493A261772K2810K2187K1276K0413J9763J9409J9558K0134K0564K0351J9693
53482A487930J9075J8480J7510J6226J5252J4807J4227J2744J0447Q091O150M394
53470A645333K392K0k585n230p666r633j1189j2836j4945j7057j8274j8486j8747
53457A511097j9995k1702k2463k1835k0890k0842k1672k2546k2947k2912k2457
53446A270836k1479k0177j9054j8372j7897j7195j5976j4192j2087j0081q380
53435A095946o753m973l249j886o88P57K309L390L989M908O738R063J1087J2606
$$ plain form
53421 1133244 1147238 1162701 1179569 1197676 1217042 1237974 1260948 1286352 1314158 1343865 1374980
53410 1374980 1407593 1442276 1479333 1518431 1559047 1601087 1644878 1690743 1738762 1788856 1840898
53399 1840898 1894756 1950289 2007271 2065355 2124253 2183980 2244695 2306249 2368092 2429745 2491135
53388 2491135 2552271 2612803 2672160 2729955 2785974 2839805 2890780 2938319 2982141 3022168 3058424
53377 3058424 3091000 3119798 3144227 3163388 3176697 3184168 3186009 3182137 3172221 3156027 3133593 3105244
53365 3105244 3071576 3033259 2990654 2943698 2892403 2837360 2779538 2719741 2658520 2596594 2534923
53354 2534923 2474203 2414527 2355709 2297775 2241010 2185728 2132202 2080629 2030963 1982875 1936035
53343 1936035 1890335 1845722 1802050 1759403 1718354 1679522 1642852 1607795 1574204 1542660 1513682
$$ packed form
53421A133244J3994J5463J6868J8107J9366K0932K2974K5404K7806K9707L1115
53410A374980L2613L4683L7057L9098M0616M2040M3791M5865M8019N0094N2042
53399A840898N3858N5533N6982N8084N8898N9727O0715O1554O1843O1653O1390
53388B491135O1136O0532N9357N7795N6019N3831N0975M7539M3822M0027L6256
53377C058424L2576K8798K4429J9161J3309P471J841l872r916j6194k2434k8349
53365C105244l3668l8317m2605m6956n1295n5043n7822n9797o1221o1926o1671
53354B534923o0720n9676n8818n7934n6765n5282n3526n1573m9666m8088m6840
53343A936035m5700m4613m3672m2647m1049l8832l6670l5057l3591l1544k8978
$$ plain form
53332 1513682 1487062 1462282 1439309 1418504 1399866 1382769 1366567 1351119 1336546 1322723 1309271
53321 1309271 1296025 1283310 1271678 1261415 1252362 1244192 1236773 1230279 1225126 1221897 1221159 1223050 1227070
53308 1227070 1232506 1239075 1246974 1256322 1266969 1278942 1292671 1308457 1326036 1345031 1365539 1387831
53296 1387831 1411620 1436178 1461190 1487076 1514358 1543060 1572838 1603253 1633724 1663546 1692248
53285 1692248 1719720 1745759 1769709 1790794 1808691 1823521 1835398 1844258 1850046 1852805 1852542 1849225
53273 1849225 1842926 1833813 1821943 1807285 1790030 1770740 1750000 1727910 1704033 1677890 1649525 1619551
53261 1619551 1588679 1557221 1525089 1492216 1458891 1425630 1392700 1359847 1326507 1292375 1257731
53250 1257731 1223253 1189568 1157049 1125907 1096195 1067623 1039620 1011862 984661 958594 933799
$$ packed form
53332A513682k6620k4780k2973k0805j8638j7097j6202j5448j4573j3823j3452
53321A309271j3246j2715j1632j0263r053q170p419o494n153l229p38J891M020
53308A227070N436O569P899R348J0647J1973J3729J5786J7579J8995K0508K2292
53296A387831K3789K4558K5012K5886K7282K8702K9778L0415L0471K9822K8702
53285A692248K7472K6039K3950K1085J7897J4830J1877Q860N788K759k63l317
53273A849225o299r113j1870j4658j7255j9290k0740k2090k3877k6143k8365k9974
53261A619551l0872l1458l2132l2873l3325l3261l2930l2853l3340l4132l4644
53250A257731l4478l3685l2519l1142k9712k8572k8003k7758k7201k6067k4795
$$ plain form
53239 933799 909821 886179 862866 840307 818999 799269 781164 764377 748394 732888 718048
53228 718048 704471 692658 682480 673072 663301 652475 640650 628342 616060 604092 592458 580842
53216 580842 568784 556224 543723 531883 520629 509414 498131 487469 478244 470626 464100 457948
53204 457948 451672 445125 438426 431711 424986 418238 411565 405020 398511 392146 386486 381980 378208 374182
53190 374182 369504 364735 360475 356560 352517 348405 344776 341968 339706 337352 334414 330986 327778 325438
53176 325438 323775 322006 319816 317724 316202 314934 313361 311534 309946 308803 307921 307141 306410 305630 304785
53161 304785 304054 303427 302456 300815 298877 297278 296068 294788 293255 291736 290409 289196 288094 287232 286585
53146 286585 286066 285833 286049 286350 286110 285268 284407 283961 283922 284418 285867 288217 290535 291824 291966 291555 291094 290693
$$ packed form
53239I33799k3978k3642k3313k2559k1308j9730j8105j6787j5983j5506j4840
53228G18048j3577j1813j0178r408r771j0826j1825j2308j2282j1968j1634j1616
53216E80842j2058j2560j2501j1840j1254j1215j1283j0662r225p618o526o152
53204D57948o276o547o699o715o725o748o673o545o509o365n660m506l772m026
53190C74182m678m769m260l915m043m112l629k808k262k354k938l428l208k340
53176C25438j663j769k190k092j522j268j573j827j588j143q82p80p31p80q45
53161C04785p31o27r71j641j938j599j210j280j533j519j327j213j102q62o47
53146B86585n19k33K16L01k40q42q61m46l9M96J449K350K318J289J42m11m61m01
$$ plain form
53128 290693 290368 290258 290556 291353 292509 293705 294807 296116 297959 300010 301492 302137 302548 303362 304463 305299
53112 305299 305651 305735 305790 305919 306137 306289 306055 305273 304130 302809 301220 299333 297524 296188 295153 293914 292385
53095 292385 291013 290065 289220 288042 286548 285116 283986 283061 282140 281144 280161 279395 279125 279499 280265 280827 280813
53078 280813 280557 280751 281607 282612 283180 283216 282843 281980 280618 279232 278413 278165 277976 277496 276684 275438 273735
53061 273735 272194 271791 272705 273960 274510 274274 273766 273223 272603 272131 272288 273268 274743 276187 277279 278128 279167
53044 279167 280617 281956 282281 281319 279739 278296 277082 275885 274840 274273 274185 274276 274237 273714 272338 270228 268193
53027 268193 266991 266624 266727 267263 268322 269582 270623 271584 272795 273947 274392 274218 274275 275015 276039 276920 277678
53010 277678 278225 278121 277399 276955 277593 279106 280846 282614 284362 285483 285386 284601 284376 285018 285518 285173 284731
$$ packed form
53128B90693l25j10K98P97J156J196J102J309J843K051J482O45M11Q14J101Q36
53112C05299L52Q4N5J29K18J52k34p82j143j321j589j887j809j336j035j239j529
53095B92385j372r48q45j178j494j432j130r25r21r96r83p66k70L74P66N62j4
53078B80813k56J94Q56J005N68L6l73q63j362j386q19k48j89m80q12j246j703
53061B73735j541m03R14J255N50k36n08n43o20m72J57R80J475J444J092Q49J039
53044B79167J450J339L25r62j580j443j214j197j045n67q8R1l9n23j376k110k035
53027B68193j202l67J03N36J059J260J041R61J211J152M45j74N7P40J024Q81P58
53010B77678N47j04p22m44O38J513J740J768J748J121r7p85k25O42N00l45m42
$$ plain form
52993 284731 285259 286489 287163 286792 286124 285833 285666 285282 285149 285913 287375 288806 290042 291513 293310 294952
52977 294952 296142 297081 297888 298368 298578 299059 300170 301633 302981 303963 304328 303827 302863 302532 303517 305369 307295
52960 307295 309090 310751 311867 312226 312555 313686 315196 315820 315118 313845 312751 311838 310875 309763 308218 305863
52944 305863 302922 300167 297964 296014 294199 292956 292475 292219 291663 290977 290563 290398 290277 290277 290511 290748 290666 290231
52926 290231 289562 288721 287892 287430 287427 287548 287489 287258 286823 285972 284887 284389 285140 286803 288397 289252 289295 288687 287634
52907 287634 286412 285247 284217 283408 282940 282741 282580 282509 282906 283826 284698 284922 284445 283507 282328 281357 281303 282351
52889 282351 283646 284130 283643 282709 281634 280411 279291 278764 278960 279561 280250 280837 281108 281001 280838 280938 281155
52872 281155 281321 281984 284068 287786 292332 296677 300231 302767 304350 305462 306755 308423 310065 311170 311461
$$ packed form
52993B84731N28J230O74l71o68k91j67l84j33P64J462J431J236J471J797J642
52977B94952J190R39Q07M80K10M81J111J463J348R82L65n01r64l31R85J852J926
52960C07295J795J661J116L59L29J131J510O24p02j273j094r13r63j112j545k355
52944C05863k941k755k203j950j815j243m81k56n56o86m14j65j21%K34K37q2m35
52926B90231o69q41q29m62lJ21n9k31m35q51j085m98P51J663J594Q55M3o08j053
52907B87634j222j165j030q09m68j99j61p1L97R20Q72K24m77r38j179r71n4J048
52889B82351J295M84m87r34j075j223j120n27J96O01O89N87K71j07j63J00K17
52872B81155J66O63K084L718M546M345L554K536J583J112J293J668J642J105K91
$$ plain form
52857 311461 310831 309366 307417 305324 303048 300454 297781 295440 293464 291658 290110 288932 287599 285357
52843 285357 282376 279668 277673 275707 273154 270435 268319 266960 266191 266199 267172 268688 270149 271485 272761
52828 272761 273398 272656 270851 269321 268987 269536 270175 270590 270836 270828 270435 269836 269301 268673 267441 265434 263243 261811
52810 261811 261659 262540 263792 264889 265666 266182 266532 266827 267148 267384 267209 266399 265222 264345 264207 264491 264319 263098
52792 263098 261125 259297 258237 257839 257605 257198 256584 255889 255339 255164 255327 255447 255309 255301 256047 257612 259430 260987
52774 260987 262229 263259 264058 264682 265333 265996 266282 265936 265293 264898 264795 264498 263673 262551 261628 261134 260950 260940
52756 260940 261225 261956 262900 263511 263571 263550 264037 264967 265831 266551 267596 269135 270666 271747 272623 273672 274684
52739 274684 275282 275777 276941 278895 280759 281589 281331 280719 280530 281045 281984 282803 283182 283310 283607 284190 284802 285227
$$ packed form
52857C11461o30j465j949k093k276k594k673k341j976j806j548j178j333k242
52843B85357k981k708j995j966k553k719k116j359p69QR73J516J461J336J276
52828B72761O37p42j805j530l34N49O39M15K46ql93n99n35o28j232k007k191j432
52810B61811j52Q81J252J097P77N16L50K95L21K36j75q10j177q77j38K84j72j221
52792B63098j973j828j060l98k34m07o14o95n50j75J63J20j38qP46J565J818J557
52774B60987J242J030P99O24O51O63K86l46o43l95j03k97q25j122r23m94j84j0
52756B60940K85P31R44O11O0k1M87R30Q64P20J045J539J531J081Q76J049J012
52739B74684N98M95J164J954J864Q30k58o12j89N15R39Q19L79J28K97N83O12M25
$$ plain form
52721 285227 285537 285833 285970 285666 284814 283568 282250 281133 280233 279312 278220 277212 276766 277015 277523 277687 277272
52704 277272 276582 276250 276817 278271 279941 281054 281460 281601 281743 281634 281084 280525 280548 281118 281705 282135 282806 283946
52686 283946 285117 285708 285632 285274 284964 284768 284592 284236 283518 282649 282248 282592 283011 282556 281288 280340 280568 281722
52668 281722 283211 285034 287370 289675 290920 290709 289627 288507 287828 287785 288405 289456 290675 292182 294267
52653 294267 296690 298711 300023 301182 302818 304830 306717 308328 309811 311004 311347 310396 308197 305250 302289
52638 302289 299949 298338 297035 295711 294601 294139 294337 294857 295555 296637 298300 300464 302789 304748 305895
52623 305895 306326 306701 307490 308348 308596 308103 307222 306044 304375 302505 301313 301347 302224 303189 303911 304486 305107 305984
52605 305984 307280 308772 309853 310143 309924 309725 309748 309908 310181 310569 310952 311299 311811 312528 313000 312737 311853 310913
$$ packed form
52721B85227L10K96J37l04q52j246j318j117r00r21j092j008m46K49N08J64m15
52704B77272o90l32N67J454J670J113M06J41J42j09n50n59K3N70N87M30O71J140
52686B83946J171N91p6l58l10j96j76l56p18q69m01L44M19m55j268r48K28J154
52668B81722J489J823K336K305J245k11j082j120o79m3O20J051J219J507K085
52653B94267K423K021J312J159J636K012J887J611J483J193L43r51k199k947k961
52638C02289k340j611j303j324j110m62J98N20O98J082J663K164K325J959J147
52623C05895M31L75P89Q58K48m93q81j178j669j870j192L4Q77R65P22N75O21Q77
52605C05984J296J492J081K90k19j99K3J60K73L88L83L47N12P17M72k63q84r40
$$ plain form
52587 310913 310247 309843 309802 310405 311616 312945 313979 314784 315718 317064 318919 321102 323084 324280 324620 324613 324805
52570 324805 325333 326026 326596 326649 325945 324884 324311 324494 324595 323626 321739 320058 319330 319217 318978 318352 317595 317037
52552 317037 316881 317142 317542 317597 317088 316319 315739 315469 315376 315478 315912 316508 316706 316091 314866 313680 313011 312807 312661
52533 312661 312217 311404 310409 309568 309270 309814 311245 313326 315711 318115 320300 322035 323229 324028 324644 325161
52517 325161 325680 326580 328297 330811 333593 336176 338563 341007 343629 346332 348853 350778 351853 352418 353219
52502 353219 354471 355420 355103 353303 350457 347034 343486 340492 338563 337414 336271 334791 333229 331786 330421
52487 330421 329314 328803 328706 328352 327563 326980 327056 327337 327247 327046 327413 328404 329453 330220 330907 331846 333220 335042
52469 335042 337013 338557 339448 340228 341572 343381 344994 346169 347320 348836 350716 352865 355182 357263 358550
$$ packed form
52587C10913o66m04m1O03J211J329J034Q05R34J346J855K183J982J196L40pJ92
52570C24805N28O93N70N3p04j061n73J83J01r69j887j681p28j13k39o26p57n58
52552C17037j56K61M00N5n09p69n80k70r3J02M34N96J98o15j225j186o69k04j46
52533C12661m44q13r95q41k98N44J431K081K385K404K185J735J194P99O16N17
52517C25161N19R00J717K514K782K583K387K444K622K703K521J925J075N65Q01
52502C53219J252R49l17j800k846l423l548k994j929j149j143j480j562j443j365
52487C30421j107n11r7l54p89n83P6K81r0k01L67R91J049P67O87R39J374J822
52469C35042J971J544Q91P80J344J809J613J175J151J516J880K149K317K081J287
$$ plain form
52454 358550 358942 358791 358196 356724 354065 350533 346697 342918 339399 336285 333429 330480 327506 325200 324072
52439 324072 323688 323092 321781 319958 318062 316414 315182 314273 313317 312091 310879 310151 309972 310031 310199 310642 311380
52422 311380 312088 312492 312658 312773 312952 313408 314564 316681 319473 322326 324892 327328 330024 333350 337647 343141
52406 343141 349619 356376 362761 368782 374933 381414 387830 393696 398875 403231 406163 406951 405534 402566
52392 402566 398688 394090 388849 383258 377674 372370 367748 364356 362321 360992 359542 357860 356622 356491
52378 356491 357555 359482 361977 364918 368181 371504 374579 377358 380170 383354 386755 389843 392472 395213
52364 395213 398711 402861 406867 409904 411474 411400 409972 408014 406351 405143 404067 403114 402742 403186 404134 405249
52348 405249 406509 407788 408657 409083 409898 411909 414780 417444 419571 421919 425134 428888 432538 436087 440063
$$ packed form
52454C58550L92j51n95j472k659l532l836l779l519l114k856k949k974k306j128
52439C24072l84n96j311j823j896j648j232r09r56j226j212p28j79N9J68M43P38
52422C11380P08M04J66J15J79M56J156K117K792K853K566K436K696L326M297N494
52406C43141O478O757O385O021O151O481O416N866N179M356K932P88j417k968
52392D02566l878m598n241n591n584n304m622l392k035j329j450j682j238j31
52378C56491J064J927K495K941L263L323L075K779K812L184L401L088K629K741
52364C95213L498M150M006L037J570p4j428j958j663j208j076r53l72M44R48J115
52348D05249J260J279Q69M26Q15K011K871K664K127K348L215L754L650L549L976
$$ plain form
52333 440063 444855 450719 458095 467253 477663 488372 499146 510709 523673 537740 552301 567356
52321 567356 583251 599809 616377 632749 649413 666596 683580 699408 714061 728482 743465
52310 743465 758941 774457 789950 805697 821678 837429 852621 867482 882387 897236 911542
52299 911542 925092 938105 950666 962395 972903 982228 990425 996948 1000948 1002239 1001567 999798 997141
52286 997141 993260 987842 980920 972986 965041 958272 953328 949940 947403 945333 943788 942882 942595 943020 944594
52271 944594 947959 953502 960908 969194 977497 985916 995283 1005959 1017256 1028402 1039684 1052016 1065510
52258 1065510 1079168 1092089 1104451 1117012 1130140 1143679 1157365 1170916 1183804 1195402 1205390
52247 1205390 1213763 1220471 1225341 1228408 1230106 1230970 1231205 1230579 1228629 1224948 1219387 1212160 1203850 1195254 1187088
$$ packed form
52333D40063M792N864P376R158J0410J0709J0774J1563J2964J4067J4561J5055
52321E67356J5895J6558J6568J6372J6664J7183J6984J5828J4653J4421J4983
52310G43465J5476J5516J5493J5747J5981J5751J5192J4861J4905J4849J4306
52299I11542J3550J3013J2561J1729J0508R325Q197O523M000J291o72j769k657
52286I97141l881n418o922p934p945o769m944l388k537k070j545r06k87M25J574
52271I44594L365N543P406Q286Q303Q419R367J0676J1297J1146J1282J2332J3494
52258A065510J3658J2921J2362J2561J3128J3539J3686J3551J2888J1598R988
52247A205390Q373O708M870L067J698Q64K35o26j950l681n561p227q310q596q166
$$ plain form
52232 1187088 1179653 1172741 1166018 1159505 1153564 1148269 1143059 1137269 1130986 1125069 1120275 1116624 1113711 1111407
52218 1111407 1109940 1109397 1109494 1109915 1110732 1112331 1114998 1118609 1122680 1126729 1130730 1135230 1140863 1147548 1154265
52203 1154265 1159892 1164318 1168542 1173587 1179483 1185444 1190908 1196071 1201381 1206846 1212092 1216998 1221953 1227446
52189 1227446 1233592 1240154 1246780 1253096 1258703 1263331 1266901 1269212 1269669 1267672 1263311 1257364 1250547 1243089
52175 1243089 1235135 1227075 1219126 1210916 1202027 1192846 1184389 1177239 1171078 1165366 1160126 1155920 1153325 1152566
52161 1152566 1153386 1155106 1157061 1159098 1161522 1164490 1167731 1170965 1174183 1177240 1179492 1180319 1179890 1179024 1178263
52146 1178263 1177326 1175647 1173256 1170928 1169422 1168652 1167790 1166299 1164698 1164038 1164741 1166295 1168054 1169844 1171696
52131 1171696 1173557 1175697 1178974 1184223 1191616 1201034 1212743 1227172 1244145 1262921 1282977 1304291
$$ packed form
52232A187088p435o912o723o513n941n295n210n790o283n917m794l651k913k304
52218A111407j467n43R7M21Q17J599K667L611M071M049M001M500N633O685O717
52203A154265N627M426M224N045N896N961N464N163N310N465N246M906M955N493
52189A227446O146O562O626O316N607M628L570K311M57j997m361n947o817p458
52175A243089p954q060p949q210q889r181q457p150o161n712n240m206k595p59
52161A152566Q20J720J955K037K424K968L241L234L218L057K252Q27m29q66p61
52146A178263r37j679k391k328j506p70q62j491j601o60P03J554J759J790J852
52131A171696J861K140L277N249P393R418J1709J4429J6973J8776K0056K1314
$$ plain form
52119 1304291 1326843 1350334 1374483 1399131 1423903 1448175 1471569 1494151 1515997 1536909 1556685
52108 1556685 1575340 1592829 1608837 1623089 1635612 1646465 1655465 1662500 1668020 1672908 1677885 1683145
52096 1683145 1688441 1693247 1696866 1698669 1698450 1696442 1692886 1687569 1679954 1669886 1658032 1645304 1631845
52083 1631845 1617015 1600586 1583567 1567441 1552968 1540311 1530049 1523101 1519457 1517702 1516331 1515125
52071 1515125 1514956 1516630 1520337 1525894 1532992 1541211 1550147 1559539 1569220 1579121 1589379 1600146 1611138
52058 1611138 1621717 1631581 1641014 1650207 1658782 1666363 1673182 1679573 1685180 1689219 1691341 1691704 1690327 1686963
52044 1686963 1681506 1673978 1664193 1652027 1638017 1623075 1607560 1591293 1574468 1557801 1541505 1524948
52032 1524948 1507891 1491391 1476802 1464202 1452513 1440950 1429684 1419123 1409238 1399763 1390581 1381631
$$ packed form
52119A304291K2552K3491K4149K4648K4772K4272K3394K2582K1846K0912J9776
52108A556685J8655J7489J6008J4252J2523J0853R000P035N520M888M977N260
52096A683145N296M806L619J803k19k008l556n317p615j0068j1854j2728j3459
52083A631845j4830j6429j7019j6126j4473j2657j0262o948l644j755j371j206
52071A515125j69J674L707N557P098Q219Q936R392R681R901J0258J0767J0992
52058A611138J0579R864R433R193Q575P581O819O391N607M039K122L63j377l364
52044A686963n457p528r785j2166j4010j4942j5515j6267j6825j6667j6296j6557
52032A524948j7057j6500j4589j2600j1689j1563j1266j0561r885r475r182q950
$$ plain form
52020 1381631 1372672 1363409 1353767 1343995 1334492 1325456 1316579 1307244 1297208 1286958 1277104 1267544 1257613
52007 1257613 1246996 1236034 1224957 1213287 1200287 1185684 1169673 1152446 1134158 1115160 1095824
51996 1095824 1076148 1055969 1035624 1015991 997668 980477 964071 948709 934986 922838 911282
51985 911282 899260 886528 873553 860770 848129 835266 821878 807909 793511 778966 764651
51974 764651 750940 738006 725680 713661 701998 691278 682173 674929 669494 666063 665082 666595 669890
51961 669890 674089 678900 684515 690862 697334 703293 708530 713052 716595 718608 718699 716948 713728 709353 704074
51946 704074 698374 693104 689175 687205 687532 690444 696105 704218 713975 724517 735385 746514 757914
51933 757914 769432 780730 791382 801059 809548 816531 821424 823701 823369 820858 816448 810181 802432 794085
$$ packed form
52020A381631q959r263r642r772r503r036q877r335j0036j0250r854r560r931
52007A257613j0617j0962j1077j1670j3000j4603j6011j7227j8288j8998j9336
51996A095824j9676k0179k0345j9633j8323j7191j6406j5362j3723j2148j1556
51985I11282j2022j2732j2975j2783j2641j2863j3388j3969j4398j4545j4315
51974G64651j3711j2934j2326j2019j1663j0720r105p244n435l431r81J513L295
51961F69890M199M811N615O347O472N959N237M522L543K013R1j751l220m375n279
51946G04074n700n270l929j970L27K912N661Q113R757J0542J0868J1129J1400
51933G57914J1518J1298J0652R677Q489O983M893K277l32k511m410o267p749q347
$$ plain form
51919 794085 785847 777729 769552 761587 754101 746531 737745 727151 715049 701888 687722 672625 657217
51906 657217 642572 629820 619864 613038 608897 606648 605960 606982 609452 612318 614637 616454 618336 620202
51892 620202 621069 619808 615830 609136 600180 589750 578693 567638 557121 547899 540806 536175 533541
51879 533541 532084 531385 531813 534176 538878 545397 552741 560437 568757 577797 586732 594402 600425 605249 609163
51864 609163 611793 612655 611750 609447 606083 601950 597356 592485 587410 582499 578598 576459 576017 576436 576847
51849 576847 576958 576976 577123 577215 576630 574763 571591 567691 563563 559021 553470 546741 539422 532321 525822 519883
51833 519883 514490 509839 506066 502994 500345 498161 496876 496875 498022 499679 501162 502065 502206 501446 499740 497298
51817 497298 494544 491874 489499 487486 485864 484644 483832 483507 483851 485009 486857 488962 490807 492143 493086
$$ packed form
51919G94085q238q118q177p965p486p570q786j0594j2102j3161j4166j5097j5408
51906F57217j4645j2752r956o826m141k249o88J022K470K866K319J817J882J866
51892F20202Q67j261l978o694q956j0430j1057j1055j0517r222p093m631k634
51879E33541j457o99M28K363M702O519P344P696Q320R040Q935P670O023M824L914
51864F09163K630Q62r05k303l364m133m594m871n075m911l901k139m42M19M11
51849E76847J11J8J47R2n85j867l172l900m128m542n551o729p319p101o499n939
51833E19883n393m651l773l072k649k184j285jJ147J657J483R03J41p60j706k442
51817D97298k754k670k375k013j622j220q12l25L44J158J848K105J845J336R43
$$ plain form
51802 493086 493887 494599 494968 494641 493498 491770 489832 487901 486029 484417 483514 483535 483984 483991 483238 482199 481284
51785 481284 480162 478315 475969 473872 472285 470829 469437 468799 469563 471583 474365 477755 481702 485784 489675
51770 489675 493875 499249 505871 513053 520609 529298 539661 551004 562040 572027 580788 588032 593392
51757 593392 596939 598932 599020 596350 590650 582658 573232 562586 550855 538932 528054 518672 510327 502710
51743 502710 496314 491758 488947 487291 486487 486635 487738 489691 492796 497692 504407 511931 519230 526399 534240
51728 534240 542767 550769 557038 561476 564653 566751 567469 566760 565180 563467 562084 561085 560066 558240 554944
51713 554944 550297 545153 540323 535933 531611 527090 522573 518571 515441 512990 510610 507940 505313 503358
51699 503358 502273 501855 502147 503524 505947 508559 510388 511206 511396 511261 510885 510555 510722 511399 511924 511576 510290
$$ packed form
51802D93086Q01P12L69l27j143j728j938j931j872j612r03K1M49Pp53j039r15
51785D81284j122j847k346k097j587j456j392o38P64K020K782L390L947M082L891
51770D89675M200N374O622P182P556Q689J0363J1343J1036R987Q761P244N360
51757E93392L547J993Q8k670n700p992r426j0646j1731j1923j0878r382q345p617
51743E02710o396m556k811j656q04J48J103J953L105M896O715P524P299P169P841
51728E34240Q527Q002O269M438L177K098P18p09j580j713j383r99j019j826l296
51713E54944m647n144m830m390m322m521m517m002l130k451k380k670k627j955
51699E03358j085m18K92J377K423K612J829Q18J90j35l76l30J67O77N25l48j286
$$ plain form
51682 510290 508555 506718 504657 502181 499592 497596 496642 496494 496701 497382 499298 503018 508224 514008 519730
51667 519730 525363 531080 536833 542544 548547 555517 563678 572186 579539 584717 587743 589146 589278 588447 587259
51652 587259 586175 584808 582380 578988 575797 573725 572546 571655 571075 571058 571103 570057 567071 561854 554266 544400
51636 544400 533112 521765 511235 501544 492517 484266 476932 470530 465314 461828 460244 459984 460325 461074
51622 461074 462414 464333 466553 468795 470807 472227 472691 472035 470254 467446 463991 460545 457591 455007 452317
51607 452317 449372 446613 444633 443493 442526 440972 438975 437785 438667 441629 445590 449718 454121 459183 464895
51592 464895 471155 478127 485772 493444 500487 506906 512848 517714 520499 520961 519788 517704 515102 512723
51578 512723 511937 513848 518466 525066 533121 542693 554165 567856 583729 601385 620562 641632 665140
$$ packed form
51682E10290j735j837k061k476k589j996r54j48K07O81J916L720N206N784N722
51667E19730N633N717N753N711O003O970Q161Q508P353N178L026J403J32q31j188
51652E87259j084j367k428l392l191k072j179q91n80j7M5j046k986n217p588r866
51636E44400j1288j1347j0530r691r027q251p334o402n216l486j584k60L41P49
51622D61074J340J919K220K242K012J420M64o56j781k808l455l446k954k584k690
51607D52317k945k759j980j140r67j554j997j190Q82K962L961M128M403N062N712
51592D64895O260O972P645P672P043O419N942M866K785M62j173k084k602k379
51578E12723p86J911M618O600Q055R572J1472J3691J5873J7656J9177K1070K3508
$$ plain form
51565 665140 690714 717032 743301 770382 799887 832380 866977 902527 938533 974837 1011067
51554 1011067 1046709 1081350 1114448 1144972 1171429 1192132 1205331 1209441 1203612 1188203 1164536 1134181
51542 1134181 1098450 1058414 1015132 969851 924075 879406 837042 797447 760698 727195 697749
51531 697749 672850 652111 634677 620030 608082 598585 590897 584489 579333 575500 572579 569794 566669
51518 566669 563331 560165 557430 555212 553404 551454 548370 543474 537249 531106 526049 521761 517203 511908
51504 511908 506299 500820 495383 489855 484642 480277 476654 473161 469503 465973 462917 460400 458521 457622
51490 457622 457908 459127 460880 463000 465355 467509 468897 469335 469111 468569 467757 466438 464341 461446 458145
51475 458145 455053 452568 450643 448996 447392 445662 443704 441619 439663 437903 436082 434018 431943 430206
$$ packed form
51565F65140K5574K6318K6269K7081K9505L2493L4597L5550L6006L6304L6230
51554A011067L5642L4641L3098L0524K6457K0703J3199M110n829j5409k3667l0355
51542A134181l5731m0036m3282m5281m5776m4669m2364l9595l6749l3503k9446
51531F97749k4899k0739j7434j4647j1948r497p688o408n156l833k921k785l125
51518E66669l338l166k735k218j808j950l084m896o225o143n057m288m558n295
51504E11908n609n479n437n528n213m365l623l493l658l530l056k517j879q99
51490D57622K86J219J753K120K355K154J388M38k24n42q12j319k097k895l301
51475D58145l092k485j925j647j604j730j958k085j956j760j821k064k075j737
$$ plain form
51461 430206 428780 427314 425643 424071 423203 423560 425093 426977 428153 428395 428581 429647 431560 433724 436090
51446 436090 439275 443757 449500 456325 464031 472100 479909 487441 495292 503775 512462 520758 528484 535639
51432 535639 542011 547248 550954 552566 551661 548694 544920 541182 537175 532300 526786 521462 516794 512719
51418 512719 509153 506061 503219 500550 498575 497926 498439 499289 499943 500405 500551 500031 499036 498451 498829 499657 500071
51401 500071 499943 499876 500417 501654 503365 505227 507067 509271 512732 518089 525207 533801 544313 557558 573511
51386 573511 591116 609670 630020 653924 682377 715021 751244 791334 836150 885737 938738
51375 938738 993382 1048745 1104657 1160514 1214624 1264856 1309473 1347030 1375780 1393713 1399310 1392051
51363 1392051 1372290 1340962 1299543 1250036 1194731 1135873 1075404 1014835 955375 898291 845048
$$ packed form
51461D30206j426j466j671j572q68L57J533J884J176K42J86J066J913K164K366
51446D36090L185M482N743O825P706Q069P809P532P851Q483Q687Q296P726P155
51432E35639O372N237L706J612r05k967l774l738m007m875n514n324m668m075
51418E12719l566l092k842k669j975o49N13Q50O54M62J46n20r95n85L78Q28M14
51401E00071j28o7N41J237J711J862J840K204L461N357P118Q594J0512J3245J5953
51386E73511J7605J8554K0350K3904K8453L2644L6223M0090M4816M9587N3001
51375I38738N4644N5363N5912N5857N4110N0232M4617L7557K8750J7933N597p259
51363A392051j9761l1328m1419m9507n5305n8858o0469o0569n9460n7084n3243
$$ plain form
51352 845048 796786 753652 714868 679598 647562 618846 593483 571424 552601 536721 523192
51341 523192 511518 501625 493504 486720 480659 475189 470583 466743 462978 458789 454558 451115 448790 447141
51327 447141 445476 443508 441594 440510 440817 442212 443648 444324 444498 445096 446682 449066 451773 454442 456754
51312 456754 458426 459516 460429 461370 462040 462161 462056 462235 462451 461671 459241 455766 452471 449823 447176 443837
51296 443837 440031 436588 433993 432122 430662 429249 427282 424278 420720 417987 417006 417363 418191 419507 421995
51281 421995 425657 429555 433010 436362 440245 444658 449145 453494 457844 462363 467096 471872 476089 478886
51267 478886 479897 479631 478898 478198 477952 478806 481050 483895 486012 486840 486872 486657 486070 484719 482551 479822 476793
51250 476793 473681 470636 467565 464144 460137 455529 450409 445081 440313 436962 435066 433667 431823 429525
$$ packed form
51352H45048m8262m3134l8784l5270l2036k8716k5363k2059j8823j5880j3529
51341E23192j1674r893q121o784o061n470m606l840l765m189m231l443k325j649
51327D47141j665j968j914j084L07J395J436O76J74N98J586K384K707K669K312
51312D56754J672J090R13R41O70J21j05J79K16p80k430l475l295k648k647l339
51296D43837l806l443k595j871j460j413j967l004l558k733r81L57Q28J316K488
51281D21995L662L898L455L352L883M413M487M349M350M519M733M776M217K797
51267D78886J011k66p33p00k46Q54K244K845K117Q28L2k15n87j351k168k729l029
51250D76793l112l045l071l421m007m608n120n328m768l351j896j399j844k298
$$ plain form
51236 429525 427395 425808 424676 423781 422905 421824 420606 419762 419650 419836 419530 418659 418035 418375 419565 420986
51220 420986 422179 423035 423763 424910 427063 430171 433394 435951 437918 439974 442523 445433 448385 451058 453057
51205 453057 454162 454767 455665 457158 458661 459408 459399 459411 460183 461801 463781 465501 466562 466911 466774 466442 466017
51188 466017 465356 464269 462829 461456 460633 460485 460764 461287 462196 463577 465056 466141 466885 467685 468410 468362 467447
51171 467447 466796 467502 469024 469609 468358 466164 464433 463552 463067 462858 463422 465049 467302 469542 471676 474150
51155 474150 477272 480709 483690 485658 486675 487170 487422 487335 486597 484850 481821 477601 472910 468743 465565
51140 465565 463004 460469 457839 455399 453313 451494 449861 448432 447209 446207 445579 445482 445819 446386 447287 449009
51124 449009 451906 455700 459554 462693 465042 467341 470517 474813 479634 484312 488816 493444 498000 501713
$$ packed form
51236D29525k130j587j132q95q76j081j218q44j12J86l06q71o24L40J190J421
51220D20986J193Q56P28J147K153L108L223K557J967K056K549K910K952K673J999
51205D53057J105O05Q98J493J503P47rJ2P72J618J980J720J061L49j37l32m25
51188D66017o61j087j440j373q23j48K79N23R09J381J479J085P44Q00P25m8r15
51171D67447o51P06J522N85j251k194j731q81m85k09N64J627K253K240K134K474
51155D74150L122L437K981J968J017M95K52q7p38j747l029m220m691m167l178
51140D65565k561k535k630k440k086j819j633j429j223j002o28r7L37N67R01J722
51124D49009K897L794L854L139K349K299L176M296M821M678M504M628M556L713
$$ plain form
51110 501713 504066 505368 506370 507531 508775 509721 509988 509502 508673 508153 508225 508512 508465 508011 507544 507377 507465 507662
51092 507662 508005 508582 509244 509660 509666 509416 509111 508651 507685 506043 504002 502092 500691 499854 499445 499343 499570 500282
51074 500282 501620 503564 505999 508940 512544 516860 521792 527396 533994 541762 550490 560035 570747 583016
51060 583016 596522 610560 625120 641050 658898 678119 697791 717633 737752 757637 776090
51049 776090 792277 806462 819508 831862 843164 852710 860172 865817 869943 872079 870977 865612 856216
51036 856216 844159 830933 817371 803704 790012 776506 763471 750986 738677 725904 712385
51025 712385 698617 685533 673850 663856 655653 649242 644465 641213 639675 640087 642207 645370 649135 653584
51011 653584 658945 665297 672736 681376 690968 700897 710904 721485 733196 745770 758236 769734 779820
$$ packed form
51110E01713K353J302J002J161J244R46K67m86q29n20P2K87m7m54m67j67Q8J97
51092E07662L43N77O62M16Ok50l05m60r66j642k041j910j401q37m09j02K27P12
51074E00282J338J944K435K941L604M316M932N604O598P768Q728R545J0712J2269
51060E83016J3506J4038J4560J5930J7848J9221J9672J9842K0119J9885J8453
51049G76090J6187J4185J3046J2354J1302R546P462N645M126K136j102n365r396
51036H56216j2057j3226j3562j3667j3692j3506j3035j2485j2309j2773j3519
51025G12385j3768j3084j1683r994q203o411m777l252j538M12K120L163L765M449
51011F53584N361O352P439Q640R592R929J0007J0581J1711J2574J2466J1498J0086
$$ plain form
50998 779820 788240 795001 800682 806129 811569 816253 819113 819613 817980 814870 810915 806451 801649 797042
50984 797042 793675 792377 792987 794806 797838 802978 810795 820727 831850 843980 857555 872814 889669
50971 889669 908169 928472 950422 973756 998834 1026702 1058167 1093083 1130682 1170434 1212518
50960 1212518 1257566 1305992 1357401 1410693 1464830 1519412 1574334 1629100 1682793 1734583 1783902
50949 1783902 1830243 1873249 1913018 1949884 1983877 2014758 2042612 2067916 2090974 2111742 2130355
50938 2130355 2147320 2162977 2177207 2189836 2200719 2209156 2213813 2213750 2209111 2200405 2187555 2170169 2148275
50925 2148275 2122111 2091413 2055729 2015323 1971181 1924073 1874165 1821547 1766567 1709639 1651325
50914 1651325 1592770 1535532 1480708 1428547 1379041 1332542 1289592 1250489 1215151 1183209 1154129
$$ packed form
50998G79820Q420O761N681N447N440M684K860N00j633l110l955m464m802m607
50984G97042l367j298O10J819L032N140P817R932J1123J2130J3575J5259J6855
50971H89669J8500K0303K1950K3334K5078K7868L1465L4916L7599L9752M2084
50960A212518M5048M8426N1409N3292N4137N4582N4922N4766N3693N1790M9319
50949A783902M6341M3006L9769L6866L3993L0881K7854K5304K3058K0768J8613
50938B130355J6965J5657J4230J2629J0883Q437M657o3m639q706j2850j7386k1894
50925B148275k6164l0698l5684m0406m4142m7108m9908n2618n4980n6928n8314
50914A651325n8555n7238n4824n2161m9506m6499m2950l9103l5338l1942k9080
$$ plain form
50903 1154129 1127517 1103418 1082054 1063240 1046340 1030832 1016544 1003321 990931 979479 969507
50892 969507 961353 954674 948820 943478 938798 935143 932848 931969 932038 932310 932439 932729 933653 935361 937796 940943
50876 940943 944740 949085 954090 960051 966925 974234 981845 990542 1001346 1014415 1029031 1044570 1061136
50863 1061136 1079278 1099471 1121942 1146721 1173778 1203254 1235608 1271451 1311269 1355347 1403890
50852 1403890 1457026 1514844 1577556 1645627 1719646 1800198 1887805 1982659 2084130 2190772 2301102
50841 2301102 2414354 2530291 2648448 2767759 2886742 3003714 3116875 3224508 3325160
50832 3325160 3417607 3500822 3574189 3637575 3690939 3734078 3767213 3791736 3809924 3823789 3834536
50821 3834536 3843217 3851377 3860647 3871778 3884337 3897208 3909070 3918332 3922948 3920683 3909657 3888416
$$ packed form
50903A154129k6612k4099k1364j8814j6900j5508j4288j3223j2390j1452r972
50892I69507q154o679n854n342m680l655k295q79O9K72J29K90R24J708K435L147
50876I40943L797M345N005N961O874P309P611Q697J0804J3069J4616J5539J6566
50863A061136J8142K0193K2471K4779K7057K9476L2354L5843L9818M4078M8543
50852A403890N3136N7818O2712O8071P4019Q0552Q7607R4854J01471J06642J10330
50841B301102J13252J15937J18157J19311J18983J16972J13161J07633J00652
50832C325160R2447Q3215P3367O3386N3364M3139L3135K4523J8188J3865J0747
50821C834536Q681Q160R270J1131J2559J2871J1862R262M616k265j1026k1241
$$ plain form
50809 3888416 3855408 3808703 3746663 3668967 3576735 3471621 3355118 3228887 3095371 2957694
50799 2957694 2818988 2681929 2548756 2421336 2301185 2189482 2087052 1994276 1911213 1837903
50789 1837903 1774417 1720510 1675328 1637638 1606236 1580194 1558929 1542083 1529018 1518400 1508759
50778 1508759 1499623 1491559 1484793 1478339 1470993 1462682 1454163 1445679 1436736 1426980 1416529 1405361 1393124
50765 1393124 1379749 1365668 1351218 1336309 1320893 1305332 1290059 1275180 1260577 1246160 1231967
50754 1231967 1218361 1206157 1196173 1188569 1183005 1179512 1178710 1181022 1186183 1193833 1204218 1218023 1235765
50741 1235765 1257638 1283706 1313948 1348226 1386354 1428108 1473144 1521121 1571929 1625554 1681749
50730 1681749 1740109 1800374 1862164 1924475 1986039 2046337 2105653 2163918 2220085 2272974 2322135
$$ packed form
50809C888416l3008m6705o2040p7696r2232j05114j16503j26231j33516j37677
50799B957694j38706j37059j33173j27420j20151j11703j02430r2776q3063p3310
50789A837903o3486n3907m5182l7690l1402k6042k1265j6846j3065j0618r641
50778A508759r136q064o766o454p346q311q519q484q943r756j0451j1168j2237
50765A393124j3375j4081j4450j4909j5416j5561j5273j4879j4603j4417j4193
50754A231967j3606j2204r984p604n564l493q02K312N161P650J0385J3805J7742
50741A235765K1873K6068L0242L4278L8128M1754M5036M7977N0808N3625N6195
50730A681749N8360O0265O1790O2311O1564O0298N9316N8265N6167N2889M9161
$$ plain form
50719 2322135 2367499 2408735 2445559 2478154 2506527 2529704 2546347 2556125 2559913 2558715 2553040 2543434
50707 2543434 2531033 2517258 2503305 2490238 2479361 2472044 2468989 2469730 2473025 2477783 2483398 2488955 2492425
50694 2492425 2491170 2483266 2467814 2444050 2411052 2368800 2318701 2262276 2199822 2131232 2057830 1982516
50682 1982516 1908176 1836780 1769982 1709560 1656759 1611835 1574684 1545463 1524217 1510315 1502762
50671 1502762 1500855 1504163 1512009 1523440 1537734 1554686 1574224 1595829 1618440 1641028 1663215 1685088
50659 1685088 1706373 1726203 1744127 1761033 1778489 1797179 1816619 1836495 1857632 1881249 1907748
50648 1907748 1936728 1967946 2001768 2038776 2079280 2123200 2170160 2219763 2271981 2327235 2385854
50637 2385854 2447517 2511423 2576885 2643453 2710481 2776985 2842048 2905079 2965459 3022121 3073852
$$ packed form
50719B322135M5364M1236L6824L2595K8373K3177J6643R778L788j198n675r606
50707B543434j2401j3775j3953j3067j0877p317l055P41L295M758N615N557L470
50694B492425j255p904j5452k3764l2998m2252n0099n6425o2454o8590p3402p5314
50682A982516p4340p1396o6798o0422n2801m4924l7151k9221k1246j3902p553
50671A502762j907L308P846J1431J4294J6952J9538K1605K2611K2588K2187K1873
50659A685088K1285J9830J7924J6906J7456J8690J9440J9876K1137K3617K6499
50648A907748K8980L1218L3822L7008M0504M3920M6960M9603N2218N5254N8619
50637B385854O1663O3906O5462O6568O7028O6504O5063O3031O0380N6662N1731
$$ plain form
50626 3073852 3120061 3161009 3197176 3228478 3254150 3273196 3284665 3287479 3280355 3262276 3233264 3194859
50614 3194859 3150000 3102413 3055721 3012651 2974742 2942563 2915955 2893993 2875061 2857395 2839562
50603 2839562 2820320 2798151 2771279 2738194 2697989 2650253 2594974 2532611 2464035 2390289 2312577
50592 2312577 2232426 2151517 2071239 1992671 1917007 1845592 1779223 1717750 1660730 1608305 1561048
50581 1561048 1519025 1481440 1447248 1415852 1387114 1361134 1338254 1319100 1304168 1293258 1285508
50570 1285508 1280180 1277424 1278189 1283263 1292410 1304482 1318375 1333789 1350997 1370018 1390292 1411251
50558 1411251 1433008 1456281 1481624 1508881 1537378 1566525 1596137 1626278 1656897 1687630 1717888
50547 1717888 1747218 1775673 1803832 1832384 1861713 1891913 1923151 1955993 1991445 2030730 2074856
$$ packed form
50626C073852M6209M0948L6167L1302K5672J9046J1469K814p124j8079k9012l8405
50614C194859m4859m7587m6692m3070l7909l2179k6608k1962j8932j7666j7833
50603B839562j9242k2169k6872l3085m0205m7736n5279o2363o8576p3746p7712
50592B312577q0151q0909q0278p8568p5664p1415o6369o1473n7020n2425m7257
50581A561048m2023l7585l4192l1396k8738k5980k2880j9154j4932j0910p750
50570A285508n328k756P65N074R147J2072J3893J5414J7208J9021K0274K0959
50558A411251K1757K3273K5343K7257K8497K9147K9612L0141L0619L0733L0258
50547A717888K9330K8455K8159K8552K9329L0200L1238L2842L5452L9285M4126
$$ plain form
50536 2074856 2124276 2179101 2239826 2307618 2383549 2467688 2559330 2658064 2764177 2877939 2999000
50525 2999000 3126639 3260061 3398132 3539246 3681856 3824778 3966579 4105046 4237759
50516 4237759 4362894 4478854 4583286 4673173 4746011 4800437 4835719 4851162 4846201 4820827 4775947
50505 4775947 4713730 4637546 4550951 4456645 4356807 4254483 4153959 4059435 3973785 3898809 3836082
50494 3836082 3787000 3752231 3731584 3724139 3728046 3740241 3756789 3773602 3786890 3793242 3789571 3772850
50482 3772850 3739887 3687853 3615509 3523772 3414861 3291244 3155805 3012540 2866155 2720686
50472 2720686 2578848 2442694 2314349 2195817 2088362 1992290 1907110 1831753 1764981 1705911
50462 1705911 1654212 1609690 1571736 1539318 1511467 1487713 1467979 1452099 1439506 1429485 1421725
$$ packed form
50536B074856M9420N4825O0725O7792P5931Q4139R1642R8734J06113J13762J21061
50525B999000J27639J33422J38071J41114J42610J42922J41801J38467J32713
50516D237759J25135J15960J04432Q9887P2838N4426L5282J5443m961k5374m4880
50505D775947o2217p6184q6595r4306r9838j02324j00524r4524q5650p4976o2727
50494C836082m9082l4769k0647p445L907J2195J6548J6813J3288O352l671j6721
50482C772850l2963n2034p2344r1737j08911j23617j35439j43265j46385j45469
50472B720686j41838j36154j28345j18532j07455r6072q5180p5357o6772n9070
50462A705911n1699m4522l7954l2418k7851k3754j9734j5880j2593j0021p760
$$ plain form
50451 1421725 1416436 1413887 1414028 1416736 1422216 1430782 1442217 1455648 1470218 1485782 1502776 1521406 1541099
50438 1541099 1560839 1579993 1598630 1616900 1634299 1649883 1663211 1674741 1685134 1694481 1702411 1708756
50426 1708756 1713836 1718268 1722734 1727816 1733860 1741095 1750011 1761440 1776097 1794244 1815998 1841677 1871575
50413 1871575 1905706 1944172 1987537 2036298 2090139 2148220 2210094 2275740 2344665 2415552 2486873
50402 2486873 2557294 2625254 2688835 2746492 2797548 2841615 2877815 2904888 2921768 2927662 2921879 2904061
50390 2904061 2874569 2834372 2784683 2726919 2662774 2593963 2522101 2449197 2378082 2311800 2252459
50379 2252459 2201013 2158056 2124313 2100144 2085026 2077814 2077243 2081890 2089894 2099086 2107362 2112716 2113032
50366 2113032 2106290 2091156 2067231 2034619 1993466 1944157 1887833 1826430 1762101 1696719 1631912
$$ packed form
50451A421725n289k549J41K708N480Q566J1435J3431J4570J5564J6994J8630J9693
50438A541099J9740J9154J8637J8270J7399J5584J3328J1530J0393R347P930O345
50426A708756N080M432M466N082O044P235Q916J1429J4657J8147K1754K5679K9898
50413A871575L4131L8466M3365M8761N3841N8081O1874O5646O8925P0887P1321
50402B486873P0421O7960O3581N7657N1056M4067L6200K7073J6880N894n783j7818
50390B904061k9492m0197m9689n7764o4145o8811p1862p2904p1115o6282n9341
50379B252459n1446m2957l3743k4169j5118p212n71M647Q004R192Q276N354L16
50366B113032o742j5134k3925l2612m1153m9309n6324o1403o4329o5382o4807
$$ plain form
50355 1631912 1569186 1509699 1454051 1402611 1355986 1314807 1278959 1247450 1219354 1194727 1174266
50344 1174266 1158200 1145909 1136676 1130409 1127326 1127069 1128481 1130263 1131568 1131866 1130508 1126851 1120886 1113448
50330 1113448 1105616 1098050 1091018 1084836 1079994 1076949 1076047 1077524 1081197 1086243 1091740 1097528 1104137 1111726
50316 1111726 1119596 1126968 1133788 1140338 1146403 1151346 1154746 1156488 1156460 1154780 1152314 1150324 1149477 1149598 1150417
50301 1150417 1152071 1154760 1158451 1163183 1169242 1176781 1185695 1196096 1208397 1222502 1237409 1252153 1266902
50288 1266902 1282476 1298923 1315141 1329821 1342077 1351077 1355732 1355237 1349640 1339627 1326054 1310041
50276 1310041 1293281 1277675 1264405 1253470 1244288 1236718 1231383 1228912 1228921 1229943 1230477 1230085 1229377 1229063 1229181
50261 1229181 1229199 1228670 1227797 1227387 1228155 1230000 1232230 1234683 1238272 1244012 1251795 1260781 1270868 1282889 1297061
$$ packed form
50355A631912o2726n9487n5648n1440m6625m1179l5848l1509k8096k4627k0461
50344A174266j6066j2291r233o267l083k57J412J782J305K98j358l657n965p438
50330A113448p832p566p032o182m842l045r02J477L673N046N497N788O609P589
50316A111726P870P372O820O550O065M943L400J742k8j680k466j990q47J21Q19
50301A150417J654K689L691M732O059P539Q914J0401J2301J4105J4907J4744J4749
50288A266902J5574J6447J6218J4680J2256R000M655m95n597j0013j3573j6013
50276A310041j6760j5606j3270j0935r182p570n335k471RJ022N34l92p08l14J18
50261A229181J8n29q73m10P68J845K230K453L589N740P783Q986J0087J2021J4172
$$ plain form
50246 1297061 1312091 1326481 1340194 1354278 1369154 1384115 1398483 1412402 1426153 1439347 1451270
50235 1451270 1461639 1470529 1477745 1482723 1485025 1484507 1480968 1474022 1463564 1450093 1434348 1416782 1397713
50222 1397713 1377875 1358354 1339778 1321896 1304162 1286429 1268634 1250026 1229268 1205458 1178774
50211 1178774 1150056 1120170 1089947 1060321 1032177 1006191 982894 962654 945436 930872 918747
50200 918747 909079 901527 895140 889046 883058 877238 871285 864922 858581 853000 848223 843590 838685 833728
50186 833728 829006 824517 820175 815781 810762 804655 798057 792412 788465 785418 781965 777701 773208 769271
50172 769271 766443 764838 763828 762314 759887 757532 756610 757347 758829 760323 761961 764148 766866 769797 772810
50157 772810 776175 780431 786050 792994 800609 808109 815153 821911 828815 836431 845285 855346 865822 875874
$$ packed form
50246A297061J5030J4390J3713J4084J4876J4961J4368J3919J3751J3194J1923
50235A451270J0369Q890P216M978K302n18l539o946j0458j3471j5745j7566j9069
50222A397713j9838j9521j8576j7882j7734j7733j7795j8608k0758k3810k6684
50211A178774k8718k9886l0223k9626k8144k5986k3297k0240j7218j4564j2125
50200I18747r668p552o387o094n988n820n953o363o341n581m777m633m905m957
50186H33728m722m489m342m394n019o107o598n645l947l047l453m264m493l937
50172G69271k828j605j010j514k427k355r22P37J482J494J638K187K718K931L013
50157G72810L365M256N619O944P615P500P044O758O904P616Q854J0061J0476J0052
$$ plain form
50143 875874 885508 895388 905847 916528 927117 938072 950477 965355 983159 1003725 1026608 1051589
50131 1051589 1078853 1108576 1140553 1174427 1210025 1247073 1284668 1321443 1356330 1388947 1419344
50120 1419344 1447690 1474043 1497988 1518481 1534371 1545059 1550293 1549628 1542680 1529861 1512138 1489978
50108 1489978 1463288 1432613 1399669 1366270 1333295 1301162 1270680 1242715 1217288 1193702 1171472
50097 1171472 1150702 1131605 1114076 1097681 1081776 1065846 1050060 1035413 1022931 1012828 1004651
50086 1004651 998042 992970 989450 987500 987304 988978 992195 996416 1001408 1007165 1013343 1019320 1024845 1030132
50072 1030132 1035161 1039367 1042267 1044053 1045305 1046340 1047045 1047142 1046396 1044738 1042370 1039657 1036772 1033557 1029810
50057 1029810 1025548 1020929 1016075 1011054 1005875 1000469 994923 989812 986004 983928 983248 983432 984415 986533 990036
$$ packed form
50143H75874R634R880J0459J0681J0589J0955J2405J4878J7804K0566K2883K4981
50131A051589K7264K9723L1977L3874L5598L7048L7595L6775L4887L2617L0397
50120A419344K8346K6353K3945K0493J5890J0688N234o65o948j2819j7723k2160
50108A489978k6690l0675l2944l3399l2975l2133l0482k7965k5427k3586k2230
50097A171472k0770j9097j7529j6395j5905j5930j5786j4647j2482j0103q177
50086A004651o609n072l520j950j96J674L217M221M992N757O178N977N525N287
50072A030132N029M206K900J786J252J035P05R7p46j658k368k713k885l215l747
50057A029810m262m619m854n021n179n406n546n111l808k076o80J84R83K118L503
$$ plain form
50042 990036 994948 1001252 1008882 1017608 1027178 1037475 1048382 1059614 1070980 1082697 1095116 1108246
50030 1108246 1121875 1136052 1150902 1165900 1179910 1192257 1203408 1214234 1224903 1234854 1243590 1251064
50018 1251064 1257435 1262939 1268010 1273129 1278519 1284264 1290644 1297915 1305712 1313174 1319838 1325963 1331802 1337076
50004 1337076 1341508 1345418 1349268 1353045 1356661 1360572 1365139 1369519 1372130 1372322 1370696 1367447 1361354 1351044
49990 1351044 1336513 1318590 1297527 1273207 1246530 1219386 1193008 1167177 1141321 1115604 1090455
49979 1090455 1065801 1041409 1017589 994888 973291 952339 931971 912717 895064 879001 864228
49968 864228 850498 837832 826671 817735 811326 806814 803164 799918 797246 795137 793173 791235 789855
49955 789855 789628 790755 793407 797915 804191 811477 819276 828086 838579 850331 862138 873302 883819
$$ packed form
50042I90036M912O304P630Q726R570J0297J0907J1232J1366J1717J2419J3130
50030A108246J3629J4177J4850J4998J4010J2347J1151J0826J0669R951Q736P474
50018A251064O371N504N071N119N390N745O380P271P797P462O664O125N839N274
50004A337076M432L910L850L777L616L911M567M380K611J92j626l249o093j0310
49990A351044j4531j7923k1063k4320k6677k7144k6378k5831k5856k5717k5149
49979A090455k4654k4392k3820k2701k1597k0952k0368j9254j7653j6063j4773
49968H64228j3730j2666j1161q936o409m512l650l246k672k109j964j938j380
49955G89855k27J127K652M508O276P286P799Q810J0493J1752J1807J1164J0517
$$ plain form
49942 883819 893386 901245 907224 912003 915888 918063 917665 914995 911010 906026 899608 891404 881352 869244
49928 869244 854845 838490 821064 803399 786160 770183 756207 744211 733651 724517 717493 712859
49916 712859 709939 708060 707469 708681 711358 714546 717895 721937 727128 733188 739568 746127 753132 760832
49902 760832 769356 778844 789456 801183 813752 826719 839714 852630 865586 878586 891209 902629
49890 902629 911970 918569 922031 922250 919479 914284 907204 898385 887576 874537 859470 843064 826196
$$ packed form
49942H83819R567P859N979M779L885K175l98k670l985m984o418q204j0052j2108
49928H69244j4399j6355j7426j7665j7239j5977j3976j1996j0560r134p024m634
49916G12859k920j879n91J212K677L188L349M042N191O060O380O559P005P700
49902G60832Q524R488J0612J1727J2569J2967J2995J2916J2956J3000J2623J1420
49890I02629R341O599L462K19k771n195p080q819j0809j3039j5067j6406j6868
$$ [...]
##END NTUPLES=NMR SPECTRUM
##END=
