##TITLE=AC1505_CUNDCR13312_8126462_q7w8fun3M6
##JCAMPDX= 6.0         $$ Bruker NMR JCAMP-DX V2.0
##DATA TYPE= NMR SPECTRUM
##DATA CLASS= NTUPLES
##ORIGIN= BRUKER
##OWNER= Administrator
$$ 1.72 TOPSPIN		Version 2.1
$$ 2013-08-15 22:12:30.160 -0700  Administrator@X
$$ Compression mode = diff/dup
##.OBSERVE FREQUENCY= 400.02188249412
##.OBSERVE NUCLEUS= ^1H
##.ACQUISITION MODE= SIMULTANEOUS (DQD)
##.ACQUISITION SCHEME= undefined
##.AVERAGES= 64
##.DIGITISER RES= 22
##SPECTROMETER/DATA SYSTEM= spect
##.PULSE SEQUENCE= noesygpps1d.comp
##.SOLVENT NAME= COFFEE_meoh
##.SHIFT REFERENCE= INTERNAL, COFFEE_meoh, 1, 14.96084
##AUDIT TRAIL= $$ (NUMBER, WHEN, WHO, WHERE, PROCESS, VERSION, WHAT)
$$ ##TITLE= Audit trail, TOPSPIN		Version 2.1
$$ ##JCAMPDX= 5.01
$$ ##ORIGIN= Bruker BioSpin GmbH
$$ ##OWNER= Administrator
$$ $$ E:\/data/COFFEE/nmr/AC1505_CUNDCR13312_8126462_q7w8fun3M6/12/pdata/1/auditp.txt
$$ ##AUDIT TRAIL=  $$ (NUMBER, WHEN, WHO, WHERE, PROCESS, VERSION, WHAT)
(   1,<2013-08-15 22:12:25.129 -0700>,<Administrator>,<X>,<go>,<TOPSPIN 2.1>,
      <created by zg
	started at 2013-08-15 22:00:55.174 -0700,
	POWCHK enabled, PULCHK disabled,
       configuration hash MD5:
       C8 4E 4E 5D D3 5C D8 9E 9F 52 82 E0 59 8A DE 15
       data hash MD5: 64K
       7B 04 B3 8E AD E3 80 F1 76 F5 36 EB AB AB 10 B1>)
(   2,<2013-08-15 22:12:28.035 -0700>,<Administrator>,<X>,<proc1d>,<TOPSPIN 2.1>,
      <Start of raw data processing
       efp LB = 0.3 FT_mod = 6 PKNL = 1 PHC0 = 0 PHC1 = 0 SI = 128K 
       data hash MD5: 128K
       9B FB 87 D1 8F 37 44 1A 7A F8 71 D1 2E FD ED DF>)
(   3,<2013-08-15 22:12:29.082 -0700>,<Administrator>,<X>,<proc1d>,<TOPSPIN 2.1>,
      <pk PHC0 = -80.41443 PHC1 = 0 
       data hash MD5: 128K
       37 96 9B 96 B3 5F D6 22 10 2B 49 90 7A 53 33 A1>)
(   4,<2013-08-15 22:12:29.598 -0700>,<Administrator>,<X>,<proc1d>,<TOPSPIN 2.1>,
      <abs ABSG = 1 
       data hash MD5: 128K
       A1 BA 73 8F 76 90 72 C8 77 3F FD A7 F4 03 C5 9E>)
(   5,<2013-08-15 22:12:29.691 -0700>,<Administrator>,<X>,<proc1d>,<TOPSPIN 2.1>,
      <abs ABSG = 2 
       data hash MD5: 128K
       21 C2 D3 05 5E 2E DA C7 0F 99 AD 1F A5 4E E7 A5>)
(   6,<2013-08-15 22:12:29.770 -0700>,<Administrator>,<X>,<proc1d>,<TOPSPIN 2.1>,
      <abs ABSG = 3 
       data hash MD5: 128K
       19 8F 55 C8 15 D3 B2 E1 8A A5 CD A3 59 06 D2 2F>)
(   7,<2013-08-15 22:12:29.879 -0700>,<Administrator>,<X>,<proc1d>,<TOPSPIN 2.1>,
      <abs ABSG = 4 
       data hash MD5: 128K
       D5 86 1F 63 AD 21 19 06 63 8A C7 9B 75 FA 7E 9B>)
(   8,<2013-08-15 22:12:29.973 -0700>,<Administrator>,<X>,<proc1d>,<TOPSPIN 2.1>,
      <abs ABSG = 5 
       data hash MD5: 128K
       D5 E8 B4 CC 32 B9 9E 1D D2 88 3F BD 53 F9 4E 09>)
$$ ##END=
$$ 
$$ $$ hash MD5
$$ $$ 58 7D EF 55 8F CF 3E DB 8A A2 90 CF BB 1A 21 A7
##$RELAX= 
##$RELAX= 
##$RELAX= 
##$RELAX= 
##$RELAX= 
##$RELAX= 
##$RELAX= 
##$RELAX= 
$$ Bruker specific parameters
$$ --------------------------
##$DU= <E:\>
##$EXPNO= 12
$$ [...]
##$TP07= 0
##$TPNAME0= <>
##$TPNAME1= <>
##$TPNAME2= <>
##$TPNAME3= <>
##$TPNAME4= <>
##$TPNAME5= <>
##$TPNAME6= <>
##$TPNAME7= <>
##$TPOAL= (0..7)
0.5 0.5 0.5 0.5 0.5 0.5 0.5 0.5
##$TPOFFS= (0..7)
0 0 0 0 0 0 0 0
##$TUNHIN= 0
##$TUNHOUT= 0
##$TUNXOUT= 0
##$USERA1= <user>
##$USERA2= <user>
##$USERA3= <user>
##$USERA4= <user>
##$USERA5= <user>
##$V9= 5
##$VALIST= <valist>
##$VCLIST= <CCCCCCCCCCCCCCC>
##$VD= 0
##$VDLIST= <DDDDDDDDDDDDDDD>
##$VPLIST= <PPPPPPPPPPPPPPP>
##$VTLIST= <TTTTTTTTTTTTTTT>
##$WBST= 1024
##$WBSW= 4
##$XGAIN= (0..3)
0 0 0 0
##$XL= 0
##$YL= 0
##$YMAX_a= 6266190
##$YMIN_a= -14091661
##$ZGOPTNS= <>
##$ZL1= 120
##$ZL2= 120
##$ZL3= 120
##$ZL4= 120
##$ABSF1= 14.96084
##$ABSF2= -5.597342
##$ABSG= 5
##$ABSL= 3
##$ALPHA= 0
##$AQORDER= 0
##$ASSFAC= 0
##$ASSFACI= 0
##$ASSFACX= 0
##$ASSWID= 0
##$AUNMP= <proc_prof1d_extract.lims>
##$AXLEFT= 0
##$AXNAME= <>
##$AXNUC= <1H>
##$AXRIGHT= 0
##$AXTYPE= 0
##$AXUNIT= <>
##$AZFE= 0.1
##$AZFW= 0.1
##$BCFW= 0
##$BC_mod= 0
##$BYTORDP= 0
##$COROFFS= 0
##$CY= 15
##$DATMOD= 1
##$DC= 0
##$DFILT= <>
##$DTYPP= 0
##$F1P= 0
##$F2P= 0
##$FCOR= 0.5
##$FTSIZE= 131072
##$FT_mod= 6
##$GAMMA= 0
##$GB= 0
##$INTBC= 1
##$INTSCL= 1
##$ISEN= 128
##$LB= 0.3
##$LEV0= 0
##$LPBIN= 0
##$MAXI= 10000
##$MC2= 0
##$MEAN= 0
##$ME_mod= 0
##$MI= 0
##$NCOEF= 0
##$NC_proc= -2
##$NLEV= 6
##$NOISF1= 0
##$NOISF2= 0
##$NSP= 0
##$NTH_PI= 0
##$NZP= 0
##$OFFSET= 14.96084
##$PC= 1
##$PHC0= -80.41443
##$PHC1= 0
##$PH_mod= 1
##$PKNL= yes
##$PPARMOD= 0
##$PPDIAG= 0
##$PPIPTYP= 0
##$PPMPNUM= 2147483647
##$PPRESOL= 1
##$PSCAL= 4
##$PSIGN= 0
##$PYNMP= <proc.py>
##$REVERSE= no
##$SF= 400.020009698986
##$SI= 131072
##$SIGF1= 0
##$SIGF2= 0
##$SINO= 400
##$SIOLD= 131072
##$SPECTYP= <>
##$SREGLST= <1H.CDCl3>
##$SSB= 0
##$STSI= 131072
##$STSR= 0
##$SW_p= 8223.68421052631
##$SYMM= 0
##$S_DEV= 0
##$TDeff= 65536
##$TDoff= 0
##$TI= <>
##$TILT= no
##$TM1= 0
##$TM2= 0
##$TOPLEV= 0
##$USERP1= <user>
##$USERP2= <user>
##$USERP3= <user>
##$USERP4= <user>
##$USERP5= <user>
##$WDW= 1
##$XDIM= 131072
##$YMAX_p= 375508182
##$YMIN_p= -12156
##$CURPLOT= <Network HP LaserJet P1505>
##$CURPRIN= <$Network HP LaserJet P1505>
##$DFORMAT= <normdp>
##$LAYOUT= <+/1D_H.xwp>
##$LFORMAT= <normlp>
##$PFORMAT= <normpl>
##$SURQMSG= 1
$$ End of Bruker specific parameters
$$ ---------------------------------
##NTUPLES= NMR SPECTRUM
##VAR_NAME=  FREQUENCY,     SPECTRUM/REAL,   SPECTRUM/IMAG
##SYMBOL=    X,             R,               I
##VAR_TYPE=  INDEPENDENT,   DEPENDENT,       DEPENDENT
##VAR_FORM=  AFFN,          ASDF,            ASDF
##VAR_DIM=   131072,        131072,          131072
##UNITS=     HZ,            ARBITRARY UNITS, ARBITRARY UNITS
##FACTOR=    0.0627417313425164, 1,          1
##FIRST=     8223.62146879497, 782,          -70337
##LAST=      0,             3830,            -71053
##MIN=       0,             -12156,          0
##MAX=       8223.62146879497, 375508182,    0
$$ Real data points
##PAGE= N=1
##DATA TABLE= (X++(R..R)), XYDATA
$$ [...]
61596C60516k499k347k437k802l181l175k556j499n06m7k92j137k307l331l651
$$ 360516 358017 355670 353233 350431 347250 344075 341519 340020 339514 339467 339175 338038 335731 332400 328749
61581C28749l048j950j099q26q22o61l92m17q64j312j240o21J22O35Q75Q72N58
$$ 328749 325701 323751 322652 321826 321004 320343 319951 319534 318670 317358 316118 315497 315619 316254 317129 318001 318559
61564C18559on12p61q04o30OJ043J795J740J398J690K453K458J140m30q34jR90
$$ 318559 318553 318041 317280 316476 315846 315852 316895 318690 320430 321828 323518 325971 328429 329569 329139 328305 328304 329294
61546C29294J369J264J062Q77P78R37J346J704J767J605J401J219J064J005J118
$$ 329294 330663 331927 332989 333866 334644 335581 336927 338631 340398 342003 343404 344623 345687 346692 347810
61531C47810J377J648J725J427Q08K30M8J39l5p36j511j658j122o69r99j893k478
$$ 347810 349187 350835 352560 353987 354795 355025 355073 355212 355177 354441 352930 351272 350150 349481 348482 346589 344111
61514C44111k220j405n88K5M96P31N55R8k23j37K46O05O17J43o09j149j196r97
$$ 344111 341891 340486 339898 339923 340419 341150 341705 341803 341580 341443 341689 342294 342911 343054 342445 341296 340100 339103
61496C39103r20r03p07m65m98o28k95N46J238J289R07N16K72K44N40R35Q83L26
$$ 339103 338183 337280 336573 336108 335610 334982 334687 335233 336471 337760 338667 339183 339455 339699 340239 341174 342057 342383
61478C42383m0L09R54J199J058R83J025R31Q69J275K003K305J729N89n51j354
$$ 342383 342343 342652 343606 344805 345863 346846 347871 348802 349671 350946 352949 355254 356983 357572 357021 355667
61462C55667j648j314m38O75J638K039J509K12r20r44O2J118J509J341R72N55
$$ 355667 354019 352705 352267 352942 354580 356619 358128 358340 357420 356476 356538 357656 359165 360506 361478 362033
61446C62033K36K84O43Q26N58J75R0K34L95P09J381K133K448K304K212K505K953
$$ 362033 362269 362553 363196 364022 364580 364755 364845 365079 365474 366183 367564 369697 372145 374449 376661 379166 382119
61429C82119L141K930K439J848J328J018R42J011J119J179J076P74M96N37Q56
$$ 382119 385260 388190 390629 392477 393805 394823 395765 396776 397895 399074 400150 400924 401420 401957 402813
61414D02813J061R15P18R14J469J925J995J772J345N59o14j737k306k371k419
$$ 402813 403874 404789 405507 406421 407890 409815 411810 413582 414927 415486 414872 413135 410829 408458 406039
61399D06039k693k939k902k745k790k986k884k133q81L42J113J423J515J493J218
$$ 406039 403346 400407 397505 394760 391970 388984 386100 383967 383086 383428 384541 385964 387479 388972 390190
61384C90190O46K5l57n21o36o52l61K32Q22J149J218J190J267J566J956K066J722
$$ 390190 390836 390861 390504 389983 389347 388695 388334 388566 389388 390537 391755 392945 394212 395778 397734 399800 401522
61367D01522J248J024R22N54O3L1N75J134J365J698K558L536L835L305K599K401
$$ 401522 402770 403794 404716 405270 405333 405364 405939 407073 408438 410136 412694 416230 420065 423370 425969 428370
61351D28370K866L807N013O335P527Q191P950O862N570M826M791N044N190N153
$$ 428370 431236 435043 440056 446391 453918 462109 470059 476921 482491 487317 492108 497152 502342 507495
61337E07495M891M365L800L535L515L317K782K091J203j34j616k340j960j147
$$ 507495 512386 516751 520551 524086 527601 530918 533700 535791 536994 536860 535244 532904 530944 529797
61323E29797o31l71j44j43l92k49O66J730K248K576L392M414M899N007N559O593
$$ 529797 529166 528795 528651 528508 528116 527867 528533 530263 532511 535087 538479 542893 547792 552799 558358 564951
61307E64951P404P905Q785J0178J1265J1531J1380J1140J0381Q740O645M707L002
$$ 564951 572355 580260 589045 599223 610488 622019 633399 644539 654920 663660 670305 675012 678014
61294F78014J342k07j597l046m646o103p244q327r519j0459j0682j0201r368q478
$$ 678014 679356 679149 677552 674506 669860 663757 656513 648186 638667 628208 617526 607325 597957 589479
61280E89479p675o877n750m148k668k140k359k094o76J094K169K647L269M015
$$ 589479 581804 574927 569177 565029 562361 560221 557862 555768 555092 556186 558355 561002 564271 568286
61266E68286M138L406K529K305K882L892M836N364N574O060P214Q471Q734P657
$$ 568286 572424 575830 578359 580664 583546 587438 592274 597638 603212 609272 616486 624957 633691 641348
61252F41348O105N098M713M343L739L244K955K272O49j441k783k820k323k471
$$ 641348 647453 652551 657264 661607 665346 668590 671545 673817 674466 673025 670242 667422 665099 662628
61238F62628l442m287m063k876j719j466j988k316j691l82P84J534K326L359M185
$$ 662628 659186 654899 650836 647960 646241 644775 642787 640471 638780 638398 639182 640716 643042 646401 650586
61223F50586M592N146O300P501P959P798P689P729P590P392P527P736P398O631
$$ 650586 655178 660324 666624 674125 682084 689882 697571 705300 712890 720282 727809 735545 742943 749574
61209G49574O108N777M921L637L012L453L943L570K862K867L727M870O019P222
$$ 749574 755682 761459 766380 770017 773029 776482 780425 783995 786857 789724 793451 798321 804340 811562
61195H11562Q339R192R956J0905J2043J3317J4701J5704J5360J3281J0325P753
$$ 811562 819901 829093 839049 849954 861997 875314 890015 905719 921079 934360 944685 952438
61183I52438O008M762L690K670J596M81m36j023j531k242l173m317n757p361q761
$$ 952438 958446 963208 966898 969568 971164 971645 971209 970186 968655 966413 963240 958923 953166 945805 937044
61168I37044r796j0522j0762j0413j0222j1290j3449j5121j5329j4853j4762j4848
$$ 937044 927248 916726 905964 895551 885329 874039 860590 845469 830140 815287 800525 785677
61156G85677j4350j3351j2420j1563j0593r875r639r111p420m968k867j464m41
$$ 785677 771327 757976 745556 733993 723400 713525 703886 694775 687355 682387 679520 678056 677615
61143F77615Q1k71j182j990k793m001n113n167m273l470l122k632j717o77O46
$$ 677615 677696 677425 676243 674253 671460 667459 662346 657179 652906 649436 646314 643682 641965 641288 641934
61128F41934K812N464P331P999Q507R807J1623J3381J5167J7228J9363K1444K3712
$$ 641934 644746 650210 657541 665540 674047 683854 695477 708858 724025 741253 760616 782060 805772
61115H05772K6063K7809K8652K9190K9911L0453L0396L0027K9657K8833K7054
$$ 805772 831835 859644 888296 917486 947397 977850 1008246 1038273 1067930 1096763 1123817
61104A123817K4712K2601K0824J8841J6310J3297R859N983J779k626p202j1686
$$ 1123817 1148529 1171130 1191954 1210795 1227105 1240402 1250261 1256244 1258023 1255397 1248195 1236509
61092A236509j5476j8209k0260k2325k4667k6999k8819k9639k9229k7954k6658
$$ 1236509 1221033 1202824 1182564 1160239 1135572 1108573 1079754 1050115 1020886 992932 966274
61081I66274k5910k5548k5043k4056k2510k0482j8276j6304j4720j3364j2157
$$ 966274 940364 914816 889773 865717 843207 822725 804449 788145 773425 760061 747904
61070G47904j1114j0032q619p033n724m634l164j184O09J701K449L342M186M639
$$ 747904 736790 726758 718139 711106 705382 700748 697584 696400 697009 698710 701159 704501 708687 713326
61056G13326N092O286Q243J0153J1291J1697J2010J2932J4653J6641J8130J8963
$$ 713326 718418 724704 732947 743100 754391 766088 778098 791030 805683 822324 840454 859417
61044H59417J9649K0680K2185K4279K7014K9758L1412L1737L1851L2854L4526
$$ 859417 879066 899746 921931 946210 973224 1002982 1034394 1066131 1097982 1130836 1165362
61033A165362L5918L6728L7360L8048L8748L9728M1498M4095M6863M9006N0071
$$ 1165362 1201280 1238008 1275368 1313416 1352164 1391892 1433390 1477485 1524348 1573354 1623425
61022A623425N0103M9729M9928N1406N4252N8357O3825P0698P8735Q7704R7624
$$ 1623425 1673528 1723257 1773185 1824591 1878843 1937200 2001025 2071723 2150458 2238162 2335786
61011B335786J08544J20793J35782J55797J82382K15664K55989L05313L65913
$$ 2335786 2444330 2565123 2700905 2856702 3039084 3254748 3510737 3816050 4181963
61002D181963M38571N23543O22904P40476Q80138J046170J242954J466105J686443
$$ 4181963 4620534 5144077 5766981 6507457 7387595 8433765 9676719 11142824 12829267
60993A2829267J844880J874831J742725J473143J135072Q02562N25687L29617
$$ 12829267 14674147 16548978 18291703 19764846 20899918 21702480 22228167 22557784
60985B2557784K24378K00857K17009K02085R0791j37388m48904p83075j088071
$$ 22557784 22782162 22983019 23200028 23402113 23492904 23355516 22906612 22123537 21035466
60976B1035466j337302j522427j639527j683838j654741j562330j427035j271697
$$ 21035466 19698164 18175737 16536210 14852372 13197631 11635301 10208266 8936569
60968H936569j113219r60482q17886o88702n75278m78129l96281l28220k72221
$$ 8936569 7823350 6862868 6044982 5356280 4781002 4302873 3906592 3578372 3306151
60959C306151k26486j89429j59667j35610j15672r8890q4781p2618o1646n1961
$$ 3306151 3079665 2890236 2730569 2594959 2479287 2380397 2295616 2222998 2161352 2109391
60949B109391m4262l8561l4086l0636k8869k8834k9404k9774l0447l1889l3379
$$ 2109391 2065129 2026568 1992482 1961846 1932977 1904143 1874739 1844965 1814518 1782629 1749250
60938A749250l4182l4953l6637l8621l9440l8968l8505l8766l9101l8810l8031
$$ 1749250 1715068 1680115 1643478 1604857 1565417 1526449 1487944 1449178 1410077 1371267 1333236
60927A333236l7035l5699l4109l2845l2123l1439l0321k8946k7576k6097k4453
$$ 1333236 1296201 1260502 1226393 1193548 1161425 1129986 1099665 1070719 1043143 1017046 992593
60916I92593k2951k1689k0284j8626j7301j6696j6130j4616j2204r884q345p438
$$ 992593 969642 947953 927669 909043 891742 875046 858916 844300 832096 822212 813867 806429
60904H06429o794o355o120n889n436m744l976l417l334l669l978l979l974m373
$$ 806429 799635 793280 787160 781271 775835 771091 767115 763698 760364 756695 752717 748738 744764 740391
60890G40391m922n021m717m732n358n993o100o057o494p259p693p691p721p901
$$ 740391 735469 730448 725731 720999 715641 709648 703548 697491 690997 683738 676045 668354 660633 652732
60876F52732p766p161o717p030p734p848o900n394m188l669l603l625l654l795
$$ 652732 644966 637805 631088 624058 616324 608476 601576 596182 591994 588325 584722 581097 577443 573648
60862E73648l899l542k587j555j104j239j424j401j448j719j832j417p02k64l63
$$ 573648 569749 566207 563620 562065 560961 559722 558298 556897 555449 553730 551898 550481 549779 549515 549152
60847E49152q77j611k365k833k808k421j991j721j753k253l128l837l945l693
$$ 549152 548275 546664 544299 541466 538658 536237 534246 532525 530772 528519 525391 521554 517609 513916
60833E13916l640l812l750l310k885k671k308j468l76N79J365K063K432K189J520
$$ 513916 510276 506464 502714 499404 496519 493848 491540 490072 489696 490275 491640 493703 496135 498324 499844
60818D99844R47P41P15N53N7p95j739k231j943j194o63n99o79o38o23q36j195
$$ 499844 500791 501532 502247 502800 502857 502062 500323 498092 496149 494955 494292 493693 493014 492376 491753 490917 489722
60801D89722j598k178k927l349l004k226j896k366l083l373l159k782k445k162
$$ 489722 488124 485946 483019 479670 476666 474440 472544 470178 467095 463722 460563 457781 455336 453174
60787D53174k045k236k688l239l749m010l723k897k037j557j209n62J17J86k54
$$ 453174 451129 448893 446205 442966 439217 435207 431484 428587 426550 424993 423784 423222 423339 423525 423271
60772D23271k89M79J271J251P21N20O91N40j26o31l98L46J056J609K203K841L252
$$ 423271 422982 423461 424732 425983 426704 427224 427915 428455 428329 427698 427300 427646 428702 430311 432514 435355 438607
60755D38607L231K859K444K278K418K600K514K169J836J616J299P19J03j70j35
$$ 438607 441838 444697 447141 449419 451837 454437 456951 459120 460956 462572 463871 464590 464693 464523 464388
60740D64388m12j566l323m643m822m377m439n289o039n914n288n001n085m889
$$ 464388 463976 462410 459087 454444 449622 445245 440806 435517 429478 423564 418276 413275 408190 403301
60726D03301m183l466l133l051l003k958k714j910p56j36n80j454j659q69K87
$$ 403301 399118 395652 392519 389468 386465 383507 380793 378883 378127 377991 377411 375957 374298 373429 373716
60711C73716J038J018K89p44j462j460r07k51K77O43P26M53J50L36J053J836K333
$$ 373716 374754 375772 376061 375317 373855 372395 371488 371237 371514 372157 372883 373336 373486 373822 374875 376711 379044
60694C79044K620K817K782K428J975J668J495J448J819K840M108M774M419L483
$$ 379044 381664 384481 387263 389691 391666 393334 394829 396277 398096 400936 405044 409818 414237 417720
60680D17720K778K782L392M150M555M425M075L973M099L877K965J879J445J683
$$ 417720 420498 423280 426672 430822 435377 439802 443877 447850 451949 455826 458791 460670 462115 463798
60666D63798J700P51q99k381l196l492l622l727l725l513l106k672k417k335k170
$$ 463798 465498 466249 465350 462969 459773 456281 452659 448932 445207 441694 438588 435916 433499 431164 428994
60651D28994j706j030l87J07N00Q33J031R56M66m19j349j807j674j444j660k230
$$ 428994 427288 426258 425871 425978 426478 427311 428342 429298 429764 429345 427996 426189 424515 423071 421411 419181
60635D19181k625k627k533k579k535k070j280o20l79l51q2N55J125J095N25J20
$$ 419181 416556 413929 411396 408817 406282 404212 402932 402312 401933 401582 401500 402055 403180 404275 404800 404920
60619D04920L51R05J195J205J296J371Q73l00j415j733j306p02k84j12k04n07
$$ 404920 405271 406176 407371 408576 409872 411243 412116 411816 410401 408668 407362 406660 406376 406264 406060 405553
60603D05553p10n46j66P9K14O57J545K380K517J932J277J120J259J058M04J9M86
$$ 405553 404843 404297 404131 404210 404424 405081 406626 409006 411523 413455 414732 415852 417111 418169 418573 418592 419078
60586D19078J343J676J442J473K083K417J688M13k65l4N37J058J607J999J816
$$ 419078 420421 422097 423539 425012 427095 429512 431200 431613 431348 431314 431851 432909 434516 436515 438331
60571D38331J344J685L388N587P060P677Q218R050R748R933R803R625R190Q132
$$ 438331 439675 441360 444748 450335 457395 465072 473290 482340 492088 502021 511824 521449 530639 538771
60557E38771O480M668L032J555L9j549k945l754l859l541l143k587j509J07J671
$$ 538771 545251 549919 552951 554506 554545 552996 550051 546297 542438 538897 535754 533167 531658 531765 533436
60542E33436K572K884L299M398O101P845R153J0025J0868J1992J3166J3711J3172
$$ 533436 536008 538892 542191 546589 552690 560535 569688 579713 590581 602573 615739 629450 642622
60529F42622J1802J0214Q603O584L874R16j388k538k928l407m414n536n999n552
$$ 642622 654424 664638 673241 679825 683699 684615 683227 680689 677761 674354 669940 664404 658405 652853
60515F52853m789m455m570m451l598k296j205n84j54L75J018J794L039N099P845
$$ 652853 648064 643609 639039 634588 630990 628694 627489 626905 626751 627126 628144 629938 632977 638076 645921
60500F45921J0710J3344J6038J9294K3119K6932L0186L2834L5153L7292L9089
$$ 645921 656631 669975 686013 705307 728426 755358 785544 818378 853531 890823 929912
60489I29912M0098L9728L7550L3691K8648K2655J5535P452o80q054j4976k2281
$$ 929912 970010 1009738 1047288 1080979 1109627 1132282 1147817 1155269 1154589 1146535 1131559 1109278
60477A109278k9792l6072l9900m1467m1829m1701m1113l9829l7654l4555l0820
$$ 1109278 1079486 1043414 1003514 962047 920218 878517 837404 797575 759921 725366 694546
60466F94546k7051k3764k1109j9007j7274j5606j3795j2102j1062j0651j0111
$$ 694546 667495 643731 622622 603615 586341 570735 556940 544838 533776 523125 513014
60455E13014q844p112n572m491l719l074k391j632j217j847l451m834m885l852
$$ 513014 504170 497058 491486 486995 483276 480202 477811 476179 474962 473115 469664 464830 459945 456093
60441D56093k749j973j218n04l32p87j280j378j286j309j315j015m12J26J30n52
$$ 456093 453344 451371 450153 449649 449317 448530 447250 445872 444586 443277 441962 440947 440535 440661 440791 440239
60425D40239j368j401m64M51M02j86j62O43J303J321J180J260J198P89N60R28
$$ 440239 438871 437470 437006 437457 437859 437673 437511 438154 439457 440778 441958 443218 444416 445205 445765 446693
60409D46693J427J421J020P25O59P10J046J791K504K554J951J360J352J895K502
$$ 446693 448120 449541 450561 451286 451945 452655 453701 455492 457996 460550 462501 463861 465213 467108 469610
60394D69610K661K309J994K326L141L599L249K519J963J519R77O45J002J927K860
$$ 469610 472271 474580 476574 478900 482041 485640 488889 491408 493371 494890 495867 496512 497514 499441 502301
60379E02301L510L901L971L625L093K733K562K371K214K309K496K358J968K007
$$ 502301 505811 509712 513683 517308 520401 523134 525696 528067 530281 532590 535086 537444 539412 541419
60365E41419K840L825L955L102K267K390L191L532K912K113K142K923L539L521
$$ 541419 544259 548084 552039 555141 557408 559798 562989 566521 569433 571546 573688 576611 580150 583671
60351E83671L320L626M733O505Q322R191Q587P295O621O656O183M476K240L17
$$ 583671 586991 590617 595350 601855 610177 619368 627955 635250 641871 648527 654710 659186 661426 661743
60337F61743j449l327m699m950m707n020n773o027n689n582n945o001n273m375
$$ 661743 660294 656967 652268 647318 642611 637591 631818 625791 620102 614520 608575 602574 597301 592926
60323E92926m054m261m535m725m872m863m606m201l625k565q60J080K590L373
$$ 592926 588872 584611 580076 575351 570479 565616 561010 556809 553184 550619 549759 550839 553429 556802
60309E56802L704M186N307P135R312J1463J3508J5467J7112J8085J8272J7732
$$ 556802 560506 564692 569999 577134 586446 597909 611417 626884 643996 662081 680353 698085
60297F98085J6334J3783J0012N267q4n556j0395j3840j5665j6266j6166j5651
$$ 698085 714419 728202 738214 743481 743397 737841 727446 713606 697941 681675 665509 649858
60285F49858j4798j3568j1846r671p443n738m881m754m962n042m706m089l668
$$ 649858 635060 621492 609646 599975 592532 586794 581913 577159 572197 567155 562449 558360 554692
60272E54692l770m253m783n113m964m040k521j225q24j161j690k267k984l506
$$ 554692 550922 546669 541886 536773 531809 527769 525248 524023 523199 522038 520348 518081 515097 511591
60258E11591l283k326j208l48K38N12L39j16m59n37m24%R06J970K508K334J915
$$ 511591 508308 505982 504774 504426 504664 505176 505515 505399 504940 504403 503979 503979 504885 506855 509363 511697 513612
60241E13612J602J223N74j27n49o23m08N4N63P68O00N02R64J989L017L412L011
$$ 513612 515214 516437 517011 516884 516335 515712 515304 515358 515921 516689 517289 517791 518755 520744 523761 527173 530184
60224E30184K354K194K666L184L306L314L573L861L922M192N154O250O465N908
$$ 530184 532538 534732 537398 540582 543888 547202 550775 554636 558558 562750 567904 574154 580619 586527
60210E86527N788O701P926Q697R188R767J0163R973R377Q689P763O477N332M887
$$ 586527 592315 599016 606942 615639 624827 634594 644757 654730 664107 672796 680559 687036 692368 697255
60196F97255M918M763M295L921L791L597L119K463J692N97r78k824m472n529n925
$$ 697255 702173 706936 711231 715152 718943 722540 725659 728122 729814 730411 729433 726609 722137 716608 710683
60181G10683n947o029o415p002p447p456p007o381n867n391m640l668l001k911
$$ 710683 704736 698707 692292 685290 677843 670387 663380 656999 651132 645741 641101 637433 634432 631521
60167F31521k989k798k567k676k836k554k109k229k823k965k156q31N27J841K851
$$ 631521 628532 625734 623167 620491 617655 615101 612992 610763 607940 604975 602819 601988 602515 604356 607207
60152F07207K985K267J557J464J708J890K152K633L007L089L257L745M136M146
$$ 607207 610192 612459 614016 615480 617188 619078 621230 623863 626870 629959 633216 636961 641097 645243
60138F45243M234M871N810O644P517Q561R290R268Q917Q808Q690P988O900O011
$$ 645243 649477 654348 660158 666802 674319 682880 692170 701438 710355 719163 727853 735841 742741 748752
60124G48752N177L768J887M35o7R1N49J254K007K344K150J855J814J868J684J201
$$ 748752 753929 757697 759584 760019 759952 760043 760592 761846 763853 766197 768347 770202 772016 773884 775568 776769
60108G76769N94K9m93j184k224l379m122m389m781n676o614p049p195p518p722
$$ 776769 777363 777392 776899 775715 773491 770112 765990 761601 756820 751144 744530 737481 730286 722768 715046
60093G15046p100n670m172l060k168j355p32k45K70O29M95J49L44J308K488L303
$$ 715046 707946 702276 698104 695044 692876 691521 690789 690544 690814 691443 691938 692087 692431 693739 696227 699530
60077F99530L592L276K277R23j99j027k095l647n253o487p448q320q955r180r110
$$ 699530 703122 706398 708675 709598 709399 708372 706277 702630 697377 690890 683442 675122 666167 656987 647877
60062F47877q886q526q177q090q115p753o828n730m684l466k059j045q17q51l30
$$ 647877 638991 630465 622288 614198 606083 598330 591502 585772 581088 577622 575563 574518 573701 572850 572520
60047E72520Q36K045K819L187L461M042N175O545P387P348O992P040P367P259
$$ 572520 573356 575401 578220 581407 584868 588910 594085 600630 608017 615365 622357 629397 636764 644023
60033F44023O470N398M310L028J494P8r64j902l097m471n683o606p361q016q534
$$ 644023 650493 655891 660201 663229 664723 664801 663837 661935 658838 654367 648684 642078 634717 626701 618167
60018F18167q891q977q563p671o872o769p222p454p044o360n857n472n022m720
$$ 618167 609276 600299 591736 584065 577193 570424 563202 555748 548704 542344 536487 531015 525993 521273
60004E21273m678m280k858q84L27L27J37P90J920K334J616N88L53J276K804M006
$$ 521273 516595 512315 509457 508573 508900 509227 509364 510154 512074 514408 516024 516612 516965 518241 521045 525051
59988E25051M399M378M627N111N083M238L243K806K740K463J897J277N14n72j693
$$ 525051 529450 533828 538455 543566 548649 552887 556130 558936 561676 564139 566036 567313 567827 567255 565562
59973E65562k421k884l480m138m508m578m470l828k305m43P43J070J260J707K113
$$ 565562 563141 560257 556777 552639 548131 543553 539083 535255 532950 532507 533250 534320 535580 537287 539400
59958E39400K424L101M155M728M181K906J715R36N01K91M2n64j339j579j004k39
$$ 539400 541824 544925 549080 553808 557989 560895 562610 563546 564047 564338 564380 563816 562477 560898 559894 559655
59942E59655M7o4j84l47p66j285j619j771j862j769j399r23m33K50J039J367J035
$$ 559655 559702 559638 559454 559107 558341 557056 555437 553666 551804 550035 548636 547713 547280 547530 548569 549936 550971
59925E50971Q24J611L194M685N752O726P623P967P683P398P578P905P882P499
$$ 550971 551795 553406 556600 561285 567037 573763 581386 589353 597036 604434 612012 619917 627799 635298
59911F35298O979O148M639K619R30K86N06P33M17j54m15m13p26j554k334k506
$$ 635298 642277 648425 653064 655683 656613 656899 657405 658138 658555 658401 657986 657573 656847 655293 652959 650453
59895F50453k228k020j977j744j096j48R15J983K954L756M447M988N090M609M008
$$ 650453 648225 646205 644228 642484 641388 641240 642155 644138 647092 650848 655295 660283 665373 669982 673990
59880F73990M049M945O127O909P100O895O462N797M855L692K488J451N87l58j561
$$ 673990 678039 682984 689111 696020 703120 710015 716477 722274 727129 730821 733309 734760 735347 734989 733428
59865G33428k747l450l656l912m704n884o839p098o637n747m849m273m010l689
$$ 733428 730681 727231 723575 719663 714959 709075 702236 695138 688501 682754 677905 673632 669622 665933
59851F65933l027k194j568j101k49J392L519N433O629O961O444N278L927K837
$$ 665933 662906 660712 659144 658043 657794 659186 662705 668138 674767 681728 688172 693450 697377 700214
59837G00214K027J274O29L63M60N91O30P04O70J47p41j360j627k351l925n383
$$ 700214 702241 703515 704144 704507 704967 705558 706188 706892 707562 707709 706968 705608 703981 701630 697705 692322
59821F92322n532m620l955m148m655m884m833m542l873l019k529k606k904l145
$$ 692322 686790 682170 678215 674067 669412 664528 659695 655153 651280 648261 645732 643126 640222 637077
59807F37077l342l301k750k075k185l366m838n679n615m761l413k318k215k809
$$ 637077 633735 630434 627684 625609 623424 620058 615220 609541 603926 599165 595752 593434 591219 588410
59793E88410k951k292j858k428l305l427k906k530k360j824q32J43Q17J191J112
$$ 588410 585459 583167 581309 578881 575576 572149 569243 566713 564353 562529 561697 561840 562657 563848 564960
59778E64960M65l94j017j369j439q47M71J695K122K225K802L442L077J836J087
$$ 564960 565425 565031 564014 562645 561206 560359 560830 562525 564647 566872 569674 573116 576193 578029 579116
59763E79116J542K501L187L707M331M760M761M701M928N225N296N316N552N957
$$ 579116 580658 583159 586346 590053 594384 599144 603905 608606 613534 618759 624055 629371 634923 640880
59749F40880O501P389Q516R231R069Q379P830P594P379O920O137N000L601K158
$$ 640880 647381 654770 663286 672517 681586 689965 697795 705389 712768 719688 725825 730825 734426 736584
59735G36584Q00m43j386j799j830j905k093k083j908k071k670l062k769k229k052
$$ 736584 737384 736941 735555 733756 731926 730021 727928 725845 723937 721866 719196 716134 713365 711136 709084
59720G09084k075j753j151q79j202j793k283k533k420j908j330j136j282j217
$$ 709084 707009 705256 704105 703226 702024 700231 697948 695415 692995 691087 689757 688621 687339 686122
59706F86122n64M20J179J413J240R92R45J189J698K481L551M741N738O373O729
$$ 686122 685558 685978 687157 688570 689810 690802 691747 692936 694634 697115 700666 705407 711145 717518 724247
59691G24247O827O451N444L990K506J368P33L85k03j311k395k584j894j382j764
$$ 724247 731074 737525 742969 746959 749465 750833 751566 751951 751748 750437 748042 745458 743564 742182 740418
59676G40418k560l105l725n089o812p759p642p319p391p433o906o080n485n098
$$ 740418 737858 734753 731028 725939 719127 711368 703726 696407 689016 681583 674677 668597 663112 658014
59662F58014m618m051l503k691j303L56J612K246K615L007L285L260L008K703
$$ 658014 653396 649345 645842 643151 641848 642204 643816 646062 648677 651684 654969 658229 661237 663940
59648F63940K464K424K648K821K331R36q22k202l119m126n500o692o930o141m992
$$ 663940 666404 668828 671476 674297 676628 677564 676742 674540 671421 667295 661795 655103 648173 642032 637040
59633F37040m050l320k566j789j080l99J85K44n31j703k452k600k765l323l779
$$ 637040 632990 629670 627104 625315 624235 623836 624021 624265 623734 622031 619579 616979 614214 610891 607112
59618F07112l574l012k844l149l280k841k200j887j939k002j787j233n08M6K37
$$ 607112 603538 600526 597682 594533 591253 588412 586212 584325 582386 580384 578597 577364 576856 576902 577139
59603E77139L85R89J956K496K052R91J09k48k04J26O83J102R48L04k42l49k46
$$ 577139 577524 578513 580469 582965 585017 586008 586117 585869 585665 585791 586474 587576 588524 588828 588586 588237 587991
59586E87991k42k75k20k57o45j275j838k328k999l857m407m185l308k387j926
$$ 587991 587749 587474 587254 586997 586352 585077 583239 580911 577912 574055 569648 565463 562155 559768 557842
59571E57842j950k195k428k511k285j720j013m01J41O90R66N90k02n82j63M64
$$ 557842 555892 553697 551269 548758 546473 544753 543740 543339 543480 544170 545136 545726 545524 544942 544779 545243
59555E45243O92Q89J730K875L209K468J685J735K199K279K159K646L821M866N238
$$ 545243 545935 546824 548554 551429 554638 557106 558791 560526 562725 565004 567163 569809 573630 578496 583734
59540E83734N329N775O710P977R747J2292J5210J7188J6858J3989R695N513K264
$$ 583734 589063 594838 601548 609525 619272 631564 646774 663962 680820 694809 704504 710017 712281
59527G12281j12j876k929l026k198q68M26J319J760J936J987J805J214K06j138
$$ 712281 712169 710293 707364 704338 702140 701272 701698 703017 704777 706713 708700 710505 711719 711925 710787
59512G10787k855m842o574p525p922q511r458r992r491q346p391o863o443n962
$$ 710787 707932 703090 696516 688991 681069 672558 663100 653108 643617 635271 627880 621017 614574 608612
59498F08612n481m836l692k104o18K01J95k90n35P9J295K076J807J205J411K496
$$ 608612 603131 598295 594603 592499 591881 592082 592277 591987 591452 591531 592826 594902 596709 597914 599325 601821
59482F01821L550M122M716N765O847P383P510P856Q731R907J0887J1119J0212
$$ 601821 605371 609493 614209 619974 626821 634204 641714 649570 658301 668208 679095 690214 700426
59469G00426Q309O105M251K849J629M73m84j057j143p12J05J011J826K760M240
$$ 700426 708735 714840 719091 721940 723569 724042 723558 722501 721358 720646 720751 721762 723588 726348 730588
59454G30588O408Q798J0605J1392J1546J1920J2897J3994J4460J4035J2833J0773
$$ 730588 736996 745794 756399 767791 779337 791257 804154 818148 832608 846643 859476 870249
59442H70249P622L606n46m248p384r949j1802j2950j3671j4103j4009j3225j2019
$$ 870249 877871 881477 880931 876683 869299 859350 847548 834598 820927 806824 792815 779590 767571
59429G67571j0768r509q116o647n212l701j988k07J488L397O056R497J3064J6039
$$ 767571 756803 747294 739178 732531 727319 723618 721630 721423 722911 726308 732364 741861 754925 770964
59415G70964J8242K0027K1906K4259K7059K9587L0479K8418K3071J5376O913j015
$$ 770964 789206 809233 831139 855398 882457 912044 942523 970941 994012 1009388 1016301 1015286
59403A015286p707j2723j5564j5797j3363q693k811K516N133L758r39o824j2059
$$ 1015286 1007579 994856 979292 963495 950132 941439 938628 941144 946277 950035 949096 942272 930213
59390I30213j6209j9636k2327k3748k3593k2227k0279j8125j5836j3429j1076
$$ 930213 914004 894368 872041 848293 824700 802473 782194 764069 748233 734804 723728
59379G23728q998p187n260k823r9J961K544J866R92P29J006J423J921K609L201
$$ 723728 714730 707543 702283 699460 699361 701322 703866 705732 706724 707453 708459 709882 711803 714412 717613
59364G17613L231K792K511K650K828K886L432M897O512P139O963P331Q734J0002
$$ 717613 720844 723636 726147 728797 731625 734511 737943 742840 749352 756491 763454 770785 779519 789521
59350G89521J0084R784J0772J3310J6010J7687J8529J9181J9578J9198J7996J6511
$$ 789521 799605 809389 820161 833471 849481 867168 885697 904878 924456 943654 961650 978161
59338I78161J5164J3813J2000R463O351K970n67m290p938j0908j2854j4119j5274
$$ 978161 993325 1007138 1019138 1028601 1034952 1037922 1037355 1033065 1025127 1014219 1001365 987246 971972
59325I71972j6445j7403j8066j8350j7815j6108j3817j2203j1789j1778j1148
$$ 971972 955527 938124 920058 901708 883893 867785 853968 841765 829976 818198 807050
59314H07050r901q852q506q537q278p386o088m899m116l552k846j921r13J77J468
$$ 807050 797149 788297 779791 771254 762976 755590 749502 744603 740487 736935 734089 732168 731255 731432 732900
59299G32900K877M253N772P646R354R806Q514O100L368L41l288p248j0763j3264
$$ 732900 735777 740030 745802 753448 762802 772608 781122 787222 790590 790931 787643 780395 769632 756368
59285G56368j4516j4288j2535r861p257n287l861k751j805o28J392M366P526R975
$$ 756368 741852 727564 715029 705168 697911 692624 688763 686012 684207 683579 684971 689337 696863 706838
59271G06838J1594J2914J4178J5031J5163J4827J4413J3741J2238R768O884M162
$$ 706838 718432 731346 745524 760555 775718 790545 804958 818699 830937 840705 847589 851751
59259H51751J685o82k855m674o194p504q399q642q371p943p481o944o498o347
$$ 851751 853436 852754 849899 845225 839031 831527 823128 814486 806115 798172 790691 783747 777249 770902
59245G70902o201n411l754j719J4J074J418J311J366K159L612N009N787O011O010
$$ 770902 764701 759290 755536 753817 753831 754905 756323 757634 759000 761159 764771 769780 775567 781578 787588
59230G87588N943N816N524M759L262J286n38j984l444n188o829p791q024p944
$$ 787588 793531 799347 804871 809630 812892 814178 813640 811656 808212 803024 796195 788404 780380 772436
59216G72436p940q160q503q605q122p223o545o460o715o896o869o535n688m458
$$ 772436 764496 756336 747833 739228 731106 723883 717338 710878 704163 697267 690398 683863 678175 673717
59202F73717l485l252l458l528l364l182k842j976p28K07L90J64K12P83J513J943
$$ 673717 670232 666980 663522 659994 656630 653448 650606 648630 647902 648109 648499 648663 648875 649658 651171 653114
59186F53114K079K395L191M108M533M435M397M751N106N007M658M670N256O062
$$ 653114 655193 657588 660779 664887 669420 673855 678252 683003 688109 693116 697774 702444 707700 713762
59172G13762O691P111P520P992Q313Q221P810P595P904Q441Q708Q625Q262P218
$$ 713762 720453 727564 735084 743076 751389 759610 767420 775015 782919 791360 800068 808693 816955 824173
59158H24173N049K320K81q37k333n328r176j2246j3699j3828j3174j2086j1040
$$ 824173 829222 831542 831823 830986 828653 823325 814149 801903 788204 774376 761202 749116 738076
59145G38076j0574j0809j1381j1829j1744j0832r258p732o861o569o426o252o010
$$ 738076 727502 716693 705312 693483 681739 670907 661649 653917 647056 640487 634061 627809 621799
59132F21799n448m367l047j927j074l28K64O48J139K047L141L998M724N743O980
$$ 621799 616351 611984 608937 607010 605936 605608 605872 606520 607659 609706 612847 616845 621569 627312 634292
59117F34292P832P998P836P839Q129Q501Q708Q653Q527Q581Q607P979O506M858
$$ 634292 642124 650122 657958 665797 673926 682427 691135 699788 708315 716896 725503 733482 739988 744846
59103G44846L753L135K618K314K482K720K349J449P04K72l38j276k069k469k749
$$ 744846 748599 751734 754352 756666 759148 761868 764217 765666 766370 766642 766304 765028 762959 760490 757741
59088G57741k879k272p94O38J008L46o16j492k448l592m743n724o521p066p221
$$ 757741 754862 752590 751796 752434 753442 753788 753172 751680 749232 745640 740897 735173 728652 721586 714365
59073G14365p051o870o907p045p013o761o450o016n045l434j916j469k074k670
$$ 714365 707314 700444 693537 686492 679479 672718 666268 660252 655207 651773 649857 648388 646314 643644
59059F43644k518k076k116k514k536j951j205o23j39K33K29k37q69j288j294r41
$$ 643644 641126 639050 636934 634420 631884 629933 628728 628105 627966 628199 628428 628191 627322 626034 624740 623799
59043F23799o01p53j393j846j597j045r45j303j463j127n95K0J083K737M447N582
$$ 623799 623198 622445 621052 619206 617609 616564 615619 614316 612853 611726 611131 611151 612234 614971 619418 625000
59027F25000O153O718P757R259J0752J1782J2412J3172J4285J5140J4883J3336
$$ 625000 631153 637871 645628 654887 665639 677421 689833 703005 717290 732430 747313 760649
59015G60649J0998Q381N791L553J882N35r20k518l904m818n128m647l382j935
$$ 760649 771647 780028 785819 789372 791254 791789 790869 788351 784447 779629 774501 769854 766472 764537
59001G64537j005m86L99K000L768M979N501N636N627N501N255N004M899M817M224
$$ 764537 763532 763046 763445 765445 769213 774192 779693 785329 790956 796457 801712 806716 811615 816432 820656
58986H20656K780J054M1k10q03k363l970m347l344j584O18K972M611N008N108
$$ 820656 823436 824490 824531 824321 823518 821155 817185 812838 809494 807910 808528 811500 816111 821119 826227
58971H26227O218Q120R597J0558J2061J4230J5757J5905J5444J5141J4569J3222
$$ 826227 832445 840565 850162 860720 872781 887011 902768 918673 934117 949258 963827 977049
58959I77049J1553J0058Q260N527K185r68l727o397r120j1852j4521j6775j8012
$$ 977049 988602 998660 1006920 1012447 1014632 1013664 1009937 1003540 994420 982568 968047 951272 933260
58946I33260j8153j7871j7690j7400j6694j5776j4850j3635j1867r831p937o187
$$ 933260 915107 897236 879546 862146 845452 829676 814826 801191 789324 779493 771556 765369
58934G65369m490l011j863r11k02m6l37m02O0M43J20o08r22m79L37P99L12j048
$$ 765369 760879 757868 756005 755094 754892 754846 754509 754107 754167 754610 754730 754122 753200 752721 753058 753857 754169 753121
58916G53121k321k597k161j976k029j282M59J928K312K614M078O201P521P769
$$ 753121 750800 748203 746042 744066 742037 740755 741214 743142 745454 748068 752146 758347 765868 773637
58902G73637Q026R108J0826J2650J4195J5147J5508J5828J6523J7190J7263J7087
$$ 773637 781663 790771 801597 814247 828442 843589 859097 874925 891448 908638 925901 942988
58890I42988J7575J8846K0007K0376K0310K0647K1720K2974K3332K1952J8929
$$ 942988 960563 979409 999416 1019792 1040102 1060749 1082469 1105443 1128775 1150727 1169656
58879A169656J5194J1620Q383N240J992j565n649j0050j3964j6692j8232j8982
$$ 1169656 1184850 1196470 1204853 1210093 1212085 1210520 1204871 1194821 1180857 1164165 1145933 1126951
58867A126951j9182j8949j8418j7559j6214j4595j3276j2429j1584j0515r777
$$ 1126951 1107769 1088820 1070402 1052843 1036629 1022034 1008758 996329 984745 974230 964453
58856I64453r878j0447j0774j0755j0748j0892j1035j1020j0597r544q222p537
$$ 964453 954575 944128 933354 922599 911851 900959 889924 878904 868307 858763 850541 843004
58844H43004p794q149p768p081p165q222r362r753r420q949q843r078r090q397
$$ 843004 835210 827061 819293 812212 805047 796825 787463 777710 768290 759341 750498 741420 732330 723933
58830G23933p283o455o008n326m135k906j953r97N4P64J098J735K874L730L910
$$ 723933 716650 710195 704187 698861 694726 691820 689867 688870 688924 689688 690786 692521 695395 699125 703035
58815G03035M295N555O710O395M874L568L077K834K350J651P08m73j370j521j403
$$ 703035 707330 712885 719595 725990 730864 734432 737509 740343 742693 744344 745052 744579 743209 741688 740285
58800G40285j849k786l465l745m154m808n154m869m306l987m180m794n249m825
$$ 740285 738436 735650 732185 728440 724286 719478 714324 709455 705149 701162 696982 692188 686939 682114
58786F82114l551k254j251J61K292M006M234L766M196N661O882P094O576N567
$$ 682114 678563 676309 675058 675219 677511 681517 685751 689517 693713 699374 706256 713350 719926 725493
58772G25493M011K261P91p42k950n371o830p090o901o638o119n667n923o463o037
$$ 725493 729504 731765 732556 731814 728864 723493 716663 709573 702672 696034 689915 684248 678325 671862 665825
58757F65825m400k688j698j060l57J86N02J024J769K189K227K495L036L041K266
$$ 665825 661425 658737 657039 655979 655622 655808 656310 657334 659103 661292 663519 666014 669050 672091 674357
58742F74357J623J841K526L109L694M405M780M557M282M474M828M853M644M537
$$ 674357 675980 677821 680347 683456 687150 691555 696335 700892 705174 709648 714476 719329 723973 728510
58728G28510M540M626N027N770O418O612O446O091N649N529O222P412Q067P769
$$ 728510 733050 737676 742703 748473 754891 761503 767949 774040 779689 785218 791440 798852 806919 814688
58714H14688P224P142P309P231O914O467N618M179K506R37p58k928n452q020j0467
$$ 814688 821912 829054 836363 843594 850508 856975 862593 866772 869278 870215 869457 866529 861077 853057 842590
58699H42590j2567j3925j4601j5382j6867j8617j9591j9222j7785j5910j4078
$$ 842590 830023 816098 801497 786115 769248 750631 731040 711818 694033 678123 664045
58688F64045j2483j1136j0029r077p948o383m911m638n731o664n906l957k634
$$ 664045 651562 640426 630397 621320 613372 606989 602078 597440 591709 585045 579139 575182 572548
58675E72548k546k510j522k0J200K131L145M256N352O469P409P835Q001Q678R997
$$ 572548 570002 567492 565970 565950 567150 569281 572426 576682 582034 588503 595912 603747 611748 620426 630423
58660F30423J1009J0780R252O793L703N28j977l672n199o855p980p912o962n987
$$ 630423 641432 652212 661464 668257 671960 672488 670511 666839 661640 654785 646805 638893 631931 625944
58646F25944n465n376n490n426m860l965l251k826k323j598q80j22J047K505L503
$$ 625944 620479 615103 609613 604187 599327 595362 592111 589285 586962 585364 584484 584362 585409 587914 591417
58631E91417L655L375L095K694K026J381J060R59P90L51m35j223j134L62K508
$$ 591417 595072 598447 601542 604236 606262 607643 608703 609662 610452 610803 610368 609145 608011 608373 610881
58616F10881L998M552M950N561N940N877N782N759N371M580L956L675L246K407
$$ 610881 614879 619431 624381 629942 635882 641759 647541 653300 658671 663251 667207 670882 674128 676535
58602F76535J499P17n8o52q38j130k181l336l204j799o89o66q26l59L21Q76J891
$$ 676535 678034 678751 678693 678041 677203 676073 673892 670556 667352 665553 664864 664198 663372 663013 663334 664210 666101
58585F66101L633N308O439P661R352J0707J1084J0976J0846J0283R223Q694R258
$$ 666101 669734 675042 681481 689142 698494 709201 720285 731261 742107 752390 761613 770307 779565
58572G79565R919R717R225R405J0156J1236J3294J6633J9955K1912K3060K4800
$$ 779565 789484 799201 808426 817831 827987 839223 852517 869150 889105 911017 934077 958877
58560I58877K7167K9030K9845K9784K8668K6211K2880J9229J4907R451L741p08
$$ 958877 986044 1015074 1044919 1074703 1103371 1129582 1152462 1171691 1186598 1196049 1199790 1199082
58548A199082l547n616p371q556r114r369r423r352r860j1724j4674j7580j9784
$$ 1199082 1195535 1189919 1182548 1173992 1164878 1155509 1146086 1136734 1126874 1115150 1100476 1082896 1063112
58535A063112k1504k3058k4334k5014k4893k3958k2349k0124j7137j3675j0908
$$ 1063112 1041608 1018550 994216 969202 944309 920351 898002 877878 860741 847066 836158
58524H36158r745r347p973n473l445k703k172j061k71o35j387j631j935k968l820
$$ 836158 826413 817066 809093 803620 800175 797472 795300 794239 793968 793333 791946 790315 788380 785412 781592
58509G81592l316j999j230j115q18k34J19K29L58J85n41j209j266j252j765k264
$$ 781592 778276 776277 775047 773932 773114 772880 772999 773228 773586 773771 773230 772021 770755 769503 767738 765474
58493G65474k052j541j290p04Q70K584L188L023L462M898O656Q331R922J1182
$$ 765474 763422 761881 760591 759887 760757 763341 766529 769552 773014 777912 784568 792899 802821 814003
58479H14003J2080J3294J5192J7019J8093J8800J9264J8366J5476J1859Q739N289
$$ 814003 826083 839377 854569 871588 889681 908481 927745 946111 961587 973446 982185 987474
58467I87474M39m555p596q761r608j0270r621p816o230n095l360p19K139N106
$$ 987474 987913 983358 975762 967001 957393 947123 937502 929686 923456 918361 915001 914282 916421 921527
58453I21527Q501J1630J3297J3514J2949J1235P780L738Q81j069l790p352j0135
$$ 921527 930028 941658 954955 968469 981418 992653 1000433 1004171 1005052 1003983 1000193 992841 982706
58440I82706j1573j2553j3196j2590j0916r475q330o225l094n02Q74K059L678
$$ 982706 971133 958580 945384 932794 921878 912403 904073 897848 894754 894252 895126 897185 900863
58427I00863N058N944P152Q939J0493J1431J2099J2141J0667Q109N962M367J976
$$ 900863 905921 911865 919017 927956 938449 949880 961979 974120 984787 992896 998858 1003225 1005201
58414A005201j388m039n051n569o747q194r212r965j0608j0726j0293r856r364
$$ 1005201 1003813 999774 994723 989154 982407 974213 965001 955036 944428 933702 923409 913553 904189
58401I04189q157o402n096m374l394j992r03j75R07K202K782K783L316M356M671
$$ 904189 896032 889630 884534 880160 876766 874774 873871 873696 874603 876805 879587 882370 885686 890042 894713
58386H94713M058L706M020M145L931M364N490O036N546M983M690L792K149R50
$$ 894713 898771 902477 906497 910642 914573 918937 924427 930463 936009 940992 945682 949474 951623 952573
58372I52573P57R12J328K827N185O906P565Q377R900J1246J2126J3506J5531J6950
$$ 952573 953330 954242 955570 958397 963582 970488 978053 986430 996330 1007576 1019702 1033208 1048739 1065689
58358A065689J7316J7640J8213J7845J6032J3807J1735R205O298M142K806J181
$$ 1065689 1083005 1100645 1118858 1136703 1152735 1166542 1178277 1187482 1193780 1197922 1200728 1201909
58346A201909m31k08J973L844M304M920O720Q269Q455Q679J0389J2668J4056J4835
$$ 1201909 1201478 1201270 1203243 1207087 1211391 1216311 1223031 1231300 1239755 1248434 1258823 1271491 1285547 1300382
58332A300382J5856J6872J7482J8130J8865J8809J7877J7206J6884J5369J2215
$$ 1300382 1316238 1333110 1350592 1368722 1387587 1406396 1424273 1441479 1458363 1473732 1485947
58321A485947R182P558O545N428M988N560N937N640N986P571R072R756J0780J2626
$$ 1485947 1495129 1502687 1509232 1514660 1519648 1525208 1531145 1536785 1542771 1550342 1559414 1569170 1579950 1592576
58307A592576J3789J3605J3798J5530J7373J8006J8497K0004K1501K1809K1688
$$ 1592576 1606365 1619970 1633768 1649298 1666671 1684677 1703174 1723178 1744679 1766488 1788176
58296A788176K2117K2492K2293K2490K3648K4645K4857K5407K6839K7944K8292
$$ 1788176 1810293 1832785 1855078 1877568 1901216 1925861 1950718 1976125 2002964 2030908 2059200
58285B059200K9417L1856L3731L3964L4253L5999L7990L9021M0107M2018M3310
$$ 2059200 2088617 2120473 2154204 2188168 2222421 2258420 2296410 2335431 2375538 2417556 2460866
58274B460866M2917M2184M2442M2978M3285M4566M7201M9514N0909N3295N7644
$$ 2460866 2503783 2545967 2588409 2631387 2674672 2719238 2766439 2815953 2866862 2920157 2977801
58263B977801O2158O5638O9430P4107P7719P9396Q1101Q3796Q5520Q5441Q5896
$$ 2977801 3039959 3105597 3175027 3249134 3326853 3406249 3487350 3571146 3656666 3742107 3828003
58252C828003Q8095Q9950R0593R2658R7449J02203J05105J08550J14436J20784
$$ 3828003 3916098 4006048 4096641 4189299 4286748 4388951 4494056 4602606 4717042 4837826
58242D837826J26199J32858J41831J50322J57031J65110J76254J87259J96334
$$ 4837826 4964025 5096883 5238714 5389036 5546067 5711177 5887431 6074690 6271024
58233F271024K07036K21754K37126K50501K64944K83056L02040L19934L40319
$$ 6271024 6478060 6699814 6936940 7187441 7452385 7735441 8037481 8357415 8697734
58224H697734L65451L91653M17088M46893M84408N25089N65808O12052O68498
$$ 8697734 9063185 9454838 9871926 10318819 10803227 11328316 11894124 12506176 13174674
58215A3174674P31072P96562Q71197R60822J062063J173084J303362J462022J646994
$$ 13174674 13905746 14702308 15573505 16534327 17596390 18769474 20072836 21534858 23181852
58206B3181852J857750K108233K414610K782451L220565L754539M410437N199379
$$ 23181852 25039602 27147835 29562445 32344896 35565461 39320000 43730437 48929816
58198D8929816O136139P255618Q589361J0147082J1950652J4064039J6555057
$$ 48929816 55065955 62321573 70910934 81058016 93008668 107072707 123627764
58191A23627764J9453919K2780133K6513497L0348046L3405199L4353901L2070214
$$ 123627764 143081683 165861816 192375313 222723359 256128558 290482459 322552673
58184C22552673K6347941J8041013Q566555p51146r039280j5876041k1122547
$$ 322552673 348900614 366941627 375508182 374757036 365717756 349841715 328719168
58177C28719168k4764319k6846103k7500677k6988820k5658018k3835720k1759550
$$ 328719168 303954849 277108746 249608069 222619249 196961231 173125511 151365961
58170A51365961j9586428j7422521j5330532j3341640j1487578r812262q344613
$$ 151365961 131779533 114357012 99026480 85684840 74197262 64385000 56040387
58163E6040387p078555n992107n070849m301517l659404l118564k665587k291924
$$ 56040387 48961832 42969725 37898876 33597359 29937955 26819391 24153804 21861880
58155B1861880j982268j721329j503445j325102j175829j045805r34797q44202
$$ 21861880 19879612 18158283 16654838 15329736 14153907 13108102 12173305 11329103
58147A1329103p67248o95951o30946n75663n26817m79240m34495l96386l62870
$$ 11329103 10561855 9865904 9234958 8659295 8132478 7653238 7218743 6822357 6459487
58138F459487l30242l00622k77686k59241k41145k24509k12222k02233j90965
$$ 6459487 6129245 5828623 5550937 5291696 5050551 4826042 4613820 4411587 4220622
58129D220622j79698j71158j63443j53451j42895j34823j27676j18763j10141
$$ 4220622 4040924 3869766 3706323 3552872 3409977 3275154 3147478 3028715 2918574
58120B918574j04893j00857r4271q6644q1822p8852p4066o7919o3648o0974n7126
$$ 2918574 2813681 2712824 2618553 2531909 2450087 2371235 2297169 2229250 2165602 2104628 2047502
58109B047502n2554m9919m8736m6361m3191m1821m1982m1256l9778l9637m0497
$$ 2047502 1994948 1945029 1896293 1849932 1806741 1764920 1722938 1681682 1641904 1602267 1561770
58098A561770m0219l8963l8429l8004l5815l2712l1085l0591k8981k6336k4569
$$ 1561770 1521551 1482588 1444159 1406155 1370340 1337628 1306543 1275952 1246971 1220635 1196066
58087A196066k3554k1684j9487j8867j9362j8869j7519j7177j7745j7511j6701
$$ 1196066 1172512 1150828 1131341 1112474 1093112 1074243 1056724 1039547 1021802 1004291 987590
58076I87590j7078j8353j8428j6990j5682j4910j3693j2310j2073j2601j2264
$$ 987590 970512 952159 933731 916741 901059 886149 872456 860146 848073 835472 823208
58065H23208j1117j0636j0809j0242q877p981p678p083o514p060q295q862q863
$$ 823208 812091 801455 790646 780404 771527 763546 755868 748785 742271 735211 726916 718054 709191
58052G09191r323r858r327q199p760p632o578n119m700m912m308l314l562m766
$$ 709191 699868 690010 680683 672484 664724 657092 650514 645395 640695 635783 631475 628161 624599 619833
58038F19833n126m506m363m795m519l674l862n341o694p333p927q469q317q000
$$ 619833 614707 610201 605838 601043 596524 592850 588988 583647 576953 569620 561693 553224 544907 536907
58024E36907q537r127q072n880m839n517o241o085n792n574m679l402l048l505
$$ 536907 528370 519243 511171 505291 500452 494935 488694 482609 476817 471243 466564 463162 460114 456609
58010D56609l200j882j089j395j520o89J60J89k78q45j452j437r8J619J970J046
$$ 456609 453409 451527 450438 449043 447523 446834 446994 447183 446905 446060 444608 443171 443073 444692 446662 447708
57994D47708N82R87Q15n12j686j835j770k216k664k590k226j688q26k41p61j786
$$ 447708 448290 449277 450092 449580 447894 446059 444289 442073 439409 436819 434593 432905 432079 431838 431077 429291
57978D29291j918j334j574k799l435k825k135k069j901j350j330j946j842m47
$$ 429291 427373 426039 424465 421666 418231 415406 413271 411202 409301 407951 406621 404675 402833 402386
57964D02386Q50P74j74r49j321j220l10R80J445R06N11O48J34j633l361l683k976
$$ 402386 403236 404010 403836 402887 401566 400346 400036 401016 402461 403367 403878 404526 404660 403027 399666 395983 393007
57947C93007k346k041j780j530j107K2J745L101L627L913M415M866N323O474Q274
$$ 393007 390661 388620 386840 385310 384203 384225 385970 389071 392698 396611 401026 405892 411215 417689 425963
57932D25963R551R576Q926Q240P287N883M451L140J538j57j025j005j330k660
$$ 425963 435514 445090 454016 462256 469543 475426 479877 483017 484555 484398 483373 482368 481038 478378
57918D78378m110m763m873m828m330l448l135l701l953k940j441o53m21P0P23
$$ 478378 474268 469505 464632 459804 455474 452026 448891 445190 441237 438297 436856 436203 435782 435852 436575
57903D36575Q30L52k17p98j644k637l410l826l897l611l172k914k701k078j189
$$ 436575 437405 437757 437540 436742 435098 432461 429051 425225 421328 417717 414545 411631 408930 406852 405663
57888D05663o92o34l56J76J23p14j276q27m6J53p4j72k56o29r99j009r37j172
$$ 405663 404971 404337 403981 404157 404280 403566 402290 401463 401417 401570 401496 401324 401068 400439 399440 398431 397494 396322
57870C96322j475j445j168q68m26K49Q83J336J877K577L034L039K921K909K819
$$ 396322 394847 393402 392234 391366 390940 391189 392072 393408 395285 397862 400896 403935 406856 409765 412584
57855D12584K654K857L506L956L641K733J794J251J249J443J008l33j561j596
$$ 412584 415238 418095 421601 425557 429198 431931 433725 434976 436225 437668 438676 438343 436782 435186
57841D35186j060j484k900l738l255k484k353k507k508k709l154l093k338j756
$$ 435186 434126 432642 429742 426004 422749 420265 417912 415405 412897 410188 407034 403941 401603 399847
57827C99847j658j163l7M24n59j755j766j122j044j253o58O18J430J351R23M63
$$ 399847 398189 397026 396989 397413 396854 395099 393333 392211 391167 389914 389256 389874 391304 392655 393578 394041
57811C94041r5n27n76o44j312k424l383m018m448m575m354m121l995l562k704
$$ 394041 393946 393419 392843 392199 390887 388463 385080 381062 376614 372039 367685 363564 359569 356007 353303
57796C53303k053j911j544l60R65J472J368J522K120K723L184L558L684L641M037
$$ 353303 351250 349339 347795 347435 348400 349872 351240 352762 354882 357605 360789 364347 368031 371672 375709
57781C75709N005N601N115M285M191M650M803M613M540M262L169J766J189J422
$$ 375709 380714 386315 391430 395715 399906 404556 409359 413972 418512 422774 425943 427709 428898 430320
57767D30320J284J82j258k391l227l764l730l317l326m088m881m779l742k548
$$ 430320 431604 431786 430528 428137 424910 421146 417416 414099 410773 406685 401804 397025 393283 390735
57753C90735j916j814j574o91N35J451J994K645L340L322K400J536J564K118K500
$$ 390735 388819 387005 385431 384740 385275 386726 388720 391365 394705 398027 400427 401963 403527 405645 408145
57738D08145K814L414L898L663K936K391K074J688J457J798K380K509K189J960
$$ 408145 410959 414373 418271 421934 424870 427261 429335 431023 432480 434278 436658 439167 441356 443316
57724D43316J841J343M33l16n27l51p4l7p12k224l820m462l943l003k442k551
$$ 443316 445157 446500 446933 446617 446090 445739 445665 445628 444916 442692 438872 434410 430467 427464 425022 422471
57708D22471l130l669l711l361l119k944k208r15j44n58j165n76J106K544K933
$$ 422471 419341 415672 411961 408600 405481 402537 400329 399414 399270 398712 397547 396971 398077 400621 403554
57693D03554K493J621N81j79m02n82j315k272k653k484k499k822k672j464N06
$$ 403554 406047 407668 408249 408070 407668 407086 405771 403499 400846 398362 395863 393041 390369 388905 389411
57678C89411K632M643O629Q854J1557J4617J7675K0870K4996L0430L6423M1930
$$ 389411 392043 396686 403315 412169 423726 438343 456018 476888 501884 532314 568737 610667
57666F10667M6409M9006M7819M1323L0227J6883L016j0800k3647l3729l9692m1700
$$ 610667 657076 706082 753901 795224 825451 842334 845350 834550 810903 777174 737482 695782
57654F95782m0882l8397l5178l1831k8422k4782k1072j7662j4592j1678r010o852
$$ 695782 654900 616503 581325 549494 521072 496290 475218 457556 442964 431286 422276 415424
57642D15424n121l549k198j292p63l65r0L3K33N78P06N15O20J399K114J825P81
$$ 415424 410303 406754 404556 403264 402501 402136 402046 402079 402312 402890 403596 404111 404731 406130 408244 410069 410850
57625D10850n3m56r21j502j709j487j296j299j303j317j351r20K16J118N64j124
$$ 410850 410797 410341 409420 407918 406209 404722 403426 402127 400824 399507 398156 397236 397452 398570 399134 398010
57609C98010k372k409j925j633j335p45j58J35K52K19j45o16n63J04P04P03K37
$$ 398010 395638 393229 391304 389671 388336 387591 387433 387568 387820 388039 387894 387278 386715 386819 387523 388226 388463
57592C88463m00j123j691j706j235r05j119j615j852j534p44o6k45j255j929j252
$$ 388463 388063 386940 385249 383543 382308 381403 380284 378669 376817 375283 374539 374473 374228 372973 371044 369792
57576C69792K35J106Q75K90L1J26M94J065J359R35K61J44L91J38m97m04O47J450
$$ 369792 370027 371133 372008 372298 372329 372455 372949 374014 375373 376308 376569 376713 377104 377242 376745 376341 376988 378438
57558C78438J197O96J071K124K828K769K439K411K783L253L450L353L304L355
$$ 378438 379635 380331 381402 383526 386354 389123 391562 393973 396756 400009 403459 406812 410116 413471
57544D13471K943J785O58N03J001J099P51R23J880K695K784K739L143L623L533
$$ 413471 416414 418199 418857 419360 420361 421460 422211 423134 425014 427709 430493 433232 436375 439998 443531
57529D43531K759J475o0j127r00M39J758K484L125L984M433M046L485L459L636
$$ 443531 446290 447765 447705 446578 445678 446117 447875 450359 453484 457468 461901 465947 469432 472891 476527
57514D76527L347K715K425K793L607M428M622L722K229J465K090L262L707L156
$$ 476527 479874 482589 485014 487807 491414 495842 500464 504186 506415 507880 509970 513232 516939 520095
57500E20095K262J638J503J783K076J844J044K71K5J95M88Q26J103J047O89N14
$$ 520095 522357 523995 525498 527281 529357 531201 532245 532516 532541 532736 533224 534050 535153 536200 536889 537403
57484E37403R19J797K847L774M211L895L122K466K019J485R83J048J725K437K798
$$ 537403 538322 540119 542966 546740 550951 554846 557968 560434 562453 563938 564921 565969 567694 570131 572929
57469E72929K899K705K063J365J362K169L191M137N120N783N468M474M008M493
$$ 572929 575828 578533 580596 581961 583323 585492 588683 592820 597940 603723 609191 613665 617673 622166
57455F22166N090N153N064N144M995M513M396M878N126M649M245M669N328N326
$$ 622166 627256 632409 637473 642617 647612 652125 656521 661399 666525 671174 675419 680088 685416 690742
57441F90742M948N095N849O546O798O648O179N689N684O192O593O630O777P123
$$ 690742 695690 700785 706634 713180 719978 726626 732805 738494 744178 750370 756963 763593 770370 777493
57427G77493O920N969N402O085P099P018N920N038M890N055N376O101O978P335
$$ 777493 784413 790382 795784 801869 808968 815986 821906 826944 831834 836889 842265 848366 855344 862679
57413H62679P057O703O663O883P329P992Q567Q748Q765R015R316R111Q336P559
$$ 862679 869736 876439 883102 889985 897314 905306 913873 922621 931386 940401 949717 958828 967164 974723
57399I74723P270P420P681P894Q265R062J0026J0411J0007R811J0748J2046J2100
$$ 974723 981993 989413 997094 1004988 1013253 1022315 1032341 1042752 1052759 1062570 1073318 1085364 1097464
57386A097464J0983J0611J1963J3669J4148J3767J3735J3994J3618J2538J1583
$$ 1097464 1108447 1119058 1131021 1144690 1158838 1172605 1186340 1200334 1213952 1226490 1238073
57375A238073J1222J1281J1538J1755J1518J0815J0273J0252J0296J0117J0274
$$ 1238073 1249295 1260576 1272114 1283869 1295387 1306202 1316475 1326727 1337023 1347140 1357414
57364A357414J1134J2071J2563J3092J3964J4287J3403J2409J2812J4313J5482
$$ 1357414 1368548 1380619 1393182 1406274 1420238 1434525 1447928 1460337 1473149 1487462 1502944
57353A502944J6015J6680J7463J7498J6812J6470J6875J7300J7330J7501J8129
$$ 1502944 1518959 1535639 1553102 1570600 1587412 1603882 1620757 1638057 1655387 1672888 1691017
57342A691017J8644J8523J8065J7837J7990J8402J8945J9477J9904K0259K0419
$$ 1691017 1709661 1728184 1746249 1764086 1782076 1800478 1819423 1838900 1858804 1879063 1899482
57331A899482K0081J9406J9272K0180K1416K1944K1784K1757K2212K2802K3228
$$ 1899482 1919563 1938969 1958241 1978421 1999837 2021781 2043565 2065322 2087534 2110336 2133564
57320B133564K3475K3572K3714K4276K5163K5734K5895K6526K8031K9339K9296
$$ 2133564 2157039 2180611 2204325 2228601 2253764 2279498 2305393 2331919 2359950 2389289 2418585
57309B418585K8384K7870K8022K8277K8598K9284K9916K9881K9612L0029L1079
$$ 2418585 2446969 2474839 2502861 2531138 2559736 2589020 2618936 2648817 2678429 2708458 2739537
57298B739537L2011L2734L3639L4371L4234L3557L3403L3996L4683L5220L5835
$$ 2739537 2771548 2804282 2837921 2872292 2906526 2940083 2973486 3007482 3042165 3077385 3113220
57287C113220L6330L6448L6890L8524M0747M2050M2139M2072M2431M2794M3015
$$ 3113220 3149550 3185998 3222888 3261412 3302159 3344209 3386348 3428420 3470851 3513645 3556660
57276C556660M3438M3835M3562M2869M2585M2506M1649M0234L9709M0504M1404
$$ 3556660 3600098 3643933 3687495 3730364 3772949 3815455 3857104 3897338 3937047 3977551 4018955
57265D018955M1595M1771M2612M3629M4233M4674M5305M5975M6661M7635M8546
$$ 4018955 4060550 4102321 4144933 4188562 4232795 4277469 4322774 4368749 4415410 4463045 4511591
57254D511591M8486M7406M6330M5771M5072M3833M2816M2847M3853M5461M7517
$$ 4511591 4560077 4607483 4653813 4699584 4744656 4788489 4831305 4874152 4918005 4963466 5010983
57243E010983M9607N1150N2468N4672N7955O1025O2774O3534O4102O4512O4333
$$ 5010983 5060590 5111740 5164208 5218880 5276835 5337860 5400634 5464168 5528270 5592782 5657115
57232E657115O3372O1590N9032N6244N3946N2088N0068M7928M6377M5563M4974
$$ 5657115 5720487 5782077 5841109 5897353 5951299 6003387 6053455 6101383 6147760 6193323 6238297
57221F238297M4723M5588M7603M9943N2410N5546N8925O1019O1421O1587O2576
$$ 6238297 6283020 6328608 6376211 6426154 6478564 6534110 6593035 6654054 6715475 6777062 6839638
57210F839638O3517O3255O2150O1107O0074N8663N7240N6278N5429N4292N3381
$$ 6839638 6903155 6966410 7028560 7089667 7149741 7208404 7265644 7321922 7377351 7431643 7485024
57199G485024N3366N4005N4571N4674N4069N2454N0194M8461M7928M7949M7560
$$ 7485024 7538390 7592395 7646966 7701640 7755709 7808163 7858357 7906818 7954746 8002695 8050255
57188H050255M6597M5369M4064M2970M2463M2323M1814M0725L9458L7993L6002
$$ 8050255 8096852 8142221 8186285 8229255 8271718 8314041 8355855 8396580 8436038 8474031 8510033
57177H510033L4109L3525L4010L3856L2439L1088L0593K9542K6407K1790J7294
$$ 8510033 8544142 8577667 8611677 8645533 8677972 8709060 8739653 8769195 8795602 8817392 8834686
57166H834686J3380R653O114K852p04n012r692j4415j9626k5519l1378l6804m2482
$$ 8834686 8848066 8857719 8863833 8866685 8865981 8860969 8851277 8836862 8817236 8791717 8760339 8723535 8681053
57153H681053m8727n4478n8716o1911o4880o7355o8579o8241o5838o0442n2294
$$ 8681053 8632326 8577848 8519132 8457221 8392341 8324986 8256407 8188166 8122328 8061886 8009592
57142H009592m3394l5274k7373j8764j0272l532Q49K804J675l026j0723k0860
$$ 8009592 7966198 7930924 7903551 7884787 7874515 7870983 7871832 7874636 7876311 7873285 7862562 7841702
57130G841702l3699m8635o2936p3629p9671q1054p7218o7873n4372l8725k2333
$$ 7841702 7808003 7759368 7696432 7622803 7543132 7462078 7384860 7316987 7262615 7223890 7201557
57119G201557o803N434J3072J7363K0405K3430K7973L6752N1485P1392R5447J24299
$$ 7201557 7194754 7200188 7213260 7230623 7251028 7274458 7302431 7339183 7390668 7462060 7557507 7681806
57107G681806J58383J96478K38439K87395L47053M19020N05027O09317P36153
$$ 7681806 7840189 8036667 8275106 8562501 8909554 9328574 9833601 10442918 11179071
57098A1179071Q87647J067168J282022J539098J840340K185778K577349L014748
$$ 11179071 12066718 13133886 14415908 15955006 17795346 19981124 22558473 25573221
57090B5573221L490541L994047M515740N041317N545513N998721O371799O618274
$$ 25573221 29063762 33057809 37573549 42614866 48160379 54159100 60530899 67149173
57082F7149173O653475O373162N709626M670585L328619J791983J93516j317441
$$ 67149173 73802648 80175810 85885436 90556021 93884640 95676623 95870139 94552698
57074I4552698k610773l621475m358973m872850n214930n426066n536516n563317
$$ 94552698 91941925 88320450 83961477 79088627 73873697 68447631 62911115 57347798
57066E7347798n509423n372078n152449m857429m498125m091286l659578l226233
$$ 57347798 51838375 46466297 41313848 36456419 31958294 27867008 24207430 20981197
57058B0981197k809267k421032k070144j761174j494111j266412j075010r15802
$$ 20981197 18171930 15750898 13680754 11919580 10425469 9159057 8084047 7168245
57050G168245p83310o72629n80712n04856m41397l86978l39859k99105k63647
$$ 7168245 6384935 5712306 5131594 4626738 4185341 3798363 3458504 3159399 2895752
57041B895752k32837k06509j83764j62982j43736j27193j13769j01831q9687p7502
$$ 2895752 2662915 2456406 2272642 2109660 1965924 1838731 1724962 1623131 1533444 1455942
57031A455942o6191n5631m5132l4562k3841j2108J386J5945K9487L9185M1798
$$ 1455942 1389751 1334120 1288988 1254426 1230585 1218477 1219863 1235808 1265295 1304480 1346278
57020A346278L4927J9272j037k1475m0079n6842p1280q1828q7189q7225q2813
$$ 1346278 1381205 1400477 1399440 1377965 1337886 1281044 1209764 1127936 1040747 953522 870709
57009H70709p5628o7686o0196n2989m5530l8160l1815k6925k3189k0050j6979
$$ 870709 795081 727395 667199 614210 568680 530520 498705 471780 448591 428541 411562
56998D11562j3688j0599q586p859p587p010o227n393m022j929K1J168K413N068
$$ 411562 397874 387275 378689 370830 363243 356233 350006 344613 340591 338662 338683 339851 342264 347332
56984C47332Q660J1133J1141R022N532Q85m621j0139j4889j8630k1139k1893k0722
$$ 347332 355992 367125 378266 387288 392820 393705 389084 378945 364056 345426 324287 302394 281672
56971B81672j8287j5548j3049j0895q947o817m090q52K336N212Q126J1449J5025
$$ 281672 263385 247837 234788 223893 214946 208129 204039 203187 205523 210735 218861 230310 245335
56958B45335J8387K0956K1858K0193J6000J0458M688j226p491j3409j7695j9843
$$ 245335 263722 284678 306536 326729 342729 353187 357875 356649 349158 335749 318054 298211
56946B98211k0385j9861j8237j5468j1980q345m883j693J349M696Q712J3043J6972
$$ 298211 277826 257965 239728 224260 212280 203935 199052 197359 198708 203404 212116 225159 242131
56933B42131K0491K4290K8184L0340K8782K3377J5626O849k502j1845j9831k5211
$$ 242131 262622 286912 315096 345436 374218 397595 413221 420070 417568 405723 385892 360681
56921C60681k7887k8739k8659k7963k6437k3736j9975j6071j3152j1405r894p814
$$ 360681 332794 304055 275396 247433 220996 197260 177285 161214 148062 136657 126763 118949
56909A18949n595m296m142m237l786k970k355j859q38Q79K577L501L793M335N751
$$ 118949 113354 109058 104916 100679 96893 93923 91568 89709 88871 89750 92327 95828 99621 103956 109707
56894A09707P858J0032J1836J3222J4393J5716J7545J9837K1904K2734K1681J8839
$$ 109707 117565 127597 139433 152655 167048 182764 200309 220146 242050 264784 286465 305304
56882C05304J4755R894M469j206o335r944j1711j2225j2138j1309r184n884k201
$$ 305304 320059 329953 334422 333216 326881 316937 305226 293001 280863 269554 260370 254486 252285
56869B52285J474N592J0513J5818K1003K6277L2116L8353M4271M9158N2135N1720
$$ 252285 253759 259351 269864 285682 306685 332962 365078 403431 447702 496860 548995 600715
56857F00715M6481L6360K2909Q324n442j6986k5682l1744l5500l6594l4443k9400
$$ 600715 647196 683556 706465 714789 709347 692361 666679 634935 599435 562841 528398 498998
56845D98998k2796j5726q322l55Q119J6873K5845L5085M4819N5485O7016P7731
$$ 498998 476202 460476 452154 451799 459918 476791 502636 537721 582540 638025 705041 782772
56833G82772Q4484Q4384P6189O0364L8652J4036r861l0351m6706n9216o7649p1202
$$ 782772 867256 951640 1027829 1088193 1126845 1140881 1131020 1100669 1053963 994747 927098 855896
56821H55896o9802o4650n7381m8996l9737k9597j8828q043K062J1282K0172K9617
$$ 855896 786094 721444 664063 615067 575330 545733 526905 518862 520924 532206 552378 581995
56809E81995L9788M9467N6284N7906N3214M2682K7807J0403p657k4490l8527m8897
$$ 581995 621783 671250 727534 785440 838654 881336 909143 919546 911889 887399 848872 799975
56797G99975n5382n8122n7533n4323m9277m3050l6225k9336k2549j5557q193r61
$$ 799975 744593 686471 628938 574615 525338 482288 446063 416727 394178 378621 370428 369467
56785C69467N476J1132J6619K2106K6766K9193K8220K3540J5903O670l108j2942
$$ 369467 374943 386075 402694 424800 451566 480759 508979 532519 548422 555092 551984 539042
56773E39042k2119k9325l3643l5499l5921l5237l3255l0374k7443k4635k1536
$$ 539042 516923 487598 453955 418456 382535 347298 314043 283669 256226 231591 210055
56762B10055j8322j5821j4249j2841j0998q970p184n761m912m850n085m711l765
$$ 210055 191733 175912 161663 148822 137824 128854 121670 115909 110997 106147 101062 96351 92586
56749I2586l309l689l797k669r17J80K80j32p24j345j578j179o60p24j270j522
$$ 92586 89277 85588 81791 79122 78205 78385 78665 78533 77809 76464 74886 73707 73047 72323 71053 69531
56733F9531r99M8J006J381J151Q42R53J243J079N04K44N80R96J140J222J186O06
$$ 69531 68532 68580 69586 70967 72118 72960 73913 75156 76235 76739 76983 77563 78559 79699 80921 82107 82713
56716H2713j33K75K147L848L755K316J136Q10P99Q06J020J287J267J139J280J444
$$ 82713 82580 82855 85002 88850 92605 94921 96057 96867 97666 98472 99492 100779 102046 103185 104465 105909
56700A05909J174P26O85R05Q71Q11J384K388K772K009O39n82j303j422j050o05
$$ 105909 107083 107809 108494 109399 110270 111081 112465 114853 117625 119634 120273 119691 118388 116966 115916 115311
56684A15311l43L1O72R21K22o99o42K82Q41O12M97J111J798J693Q44j46q52r75
$$ 115311 114968 114999 115671 116592 116814 116115 115473 115755 116596 117208 117705 118816 120614 122307 123151 123005 122153 121178
56666A21178k42J101K246K593K254J648J080Q06R36J136J004P48R11J360J344
$$ 121178 120936 122037 124283 126876 129130 130778 131858 132664 133600 134736 135740 136488 137399 138759 140103
56651A40103P73N94J415K502K730J982R86J85m97j051j198q83m35j64n7rp8l28
$$ 140103 140876 141470 142885 145387 148117 150099 151085 151270 150773 149722 148524 147641 147206 147042 146985 146976 146898 146570
56633A46570n75n11j81n6m81j176j577j589j556j532j210o81n75j114j644j674
$$ 146570 145995 145484 145303 145247 144766 143590 142013 140424 138868 137336 136126 135445 134870 133756 132112 130438
56617A30438j706k313k936k515j077K53P67Q29R34R06L88m32r55q06j79L33K47
$$ 130438 128732 126419 123483 120968 119891 120144 120911 121740 122674 123580 123968 123536 122581 121775 121596 121929 122176
56600A22176l02o60m37J24O41J094J415J167J98p86r76n37k40k37j6N86J110J198
$$ 122176 121874 121214 120777 120901 121542 122636 124051 125218 125416 124630 123654 123117 122877 122640 122624 123210 124320 125518
56582A25518R63N84K13J77P08J418J678J494J426J666J845J801J844K142K356
$$ 125518 126481 127065 127278 127455 128163 129581 131259 132753 134179 135845 137690 139491 141335 143477 145833
56567A45833K177J807J717K210L234M446N512O495P727R070R741R223P896O359
$$ 145833 148010 149817 151534 153744 156978 161424 166936 173431 181158 190228 199969 209192 217088 223447
56553B23447M601K448L13j241k266l088l604l662l675l998m123l477k541k180
$$ 223447 228048 230496 230809 229568 227302 224214 220610 216948 213273 209275 205152 201675 199134 196954
56539A96954k230j914j389j499k160k285j454m57J4J47L11N19P77R99O44n73j715
$$ 196954 194724 192810 191421 189922 187762 185477 184023 183566 183580 183727 184038 184557 185334 186333 186977 186404 184689
56522A84689j496k03O36M65K27M22K54p34j629j588j066q44q53p98r86j637k177
$$ 184689 183193 182990 183626 184091 184318 184740 184994 184260 182631 181043 179977 179133 178280 177482 176496 174859 172682
56505A72682k059j597j261q68j57M91O00L27k9o34j575k288k150j268j87P09J135
$$ 172682 170623 169026 167765 166897 166740 167231 167831 168158 168129 167495 165920 163632 161482 160214 160027 160736 161871
56488A61871Q81K82Q9M70P74O69P09J259J746J556J010P25P12P83J105J667J805
$$ 161871 162752 163034 163123 163593 164367 165036 165745 167004 168750 170306 171316 172041 172753 173536 174641 176308 178113
56471A78113J092J71r8J98M88Q20J561K342K264J167o5n05o2O25Q29L80j47o4
$$ 178113 179205 179376 179278 179476 179964 180784 182345 184687 186951 188118 188053 187548 187486 188111 188940 189320 189173 189109
56453A89109N39Q65N21k2k55l03m20l60K09J131J963K408K281J498L88m51p68
$$ 189109 189648 190513 191034 191012 190757 190454 190034 189674 189883 191014 192977 195385 197666 199164 199552 199101 198333
56436A98333p18l21M65J102Q13j96p71l99J75K65J36J09j08n64n36K73R87Q33
$$ 198333 197615 197294 197759 198861 199674 199478 198707 198308 198483 198748 198884 198993 198885 198321 197785 198058 199045 199878
56418A99878L44L54O02L54k88o47n58k35L01Q68P94r7p93l85N41Q80P69J106J797
$$ 199878 200222 200576 201178 201532 201244 200597 200039 199804 200105 200973 201767 201670 200877 200492 201033 201913 202682 203788 205585
56399B05585J794Q06k29n44l53j54m9J18N02J185J826J648M11q73r55P1J036J353
$$ 205585 207379 208185 207956 207412 207059 206905 206856 206974 207476 208661 210487 212135 212546 211673 210718 210789 211825 213178
56381B13178J514J950K261J901J053M48O38J541K480K676J999J138Q27J043J227
$$ 213178 214692 216642 218903 220804 221857 222305 222943 224484 226964 229640 231639 232777 233604 234647 235874
56366B35874J053O92M44M04L95J86j03O6Q85J578J209J16l45M19J557K123K108
$$ 235874 236927 237619 238063 238467 238862 239048 238945 239011 239896 241474 242683 242799 242454 242873 244430 246553 248661
56349B48661J867J465J136J340J859J784J033P33J492K324K224J641J452J502
$$ 248661 250528 251993 253129 254469 256328 258112 259145 259878 261370 263694 265918 267559 269011 270513
56335B70513J336J351J993K636K590K480L222M327M594L987L353K841K038J260
$$ 270513 271849 273200 275193 277829 280419 282899 286121 290448 295042 299029 302382 305223 307261 308521
56321C08521J208J608J640J470J908K690K661J705R83J106J450J522J697K174
$$ 308521 309729 311337 312977 314447 316355 319045 321706 323411 324394 325500 326950 328472 330169 332343
56307C32343K404K037J581J612K151L062M349N781O855P336P337O877N973N082
$$ 332343 334747 336784 338365 339977 342128 345190 349539 355320 362175 369511 376848 383725 389698 394780
56293C94780M730M748M517L912L393L218L322L736M461N031N075N054N724O980
$$ 394780 399510 404258 408775 412687 416080 419298 422620 426356 430817 435848 440923 445977 451701 458681
56279D58681Q026Q574R008R519R925J0314J1040J2028J2896J3702J4861J6365
$$ 458681 466707 475281 484289 493808 503733 514047 525087 537115 550011 563713 578574 594939
56267E94939J7787J9001K0303K1925K3957K6497K9299L1712L3637L6061L9832
$$ 594939 612726 631727 652030 673955 697912 724409 753708 785420 819057 855118 894950
56256H94950M4489M9233N4471O1185O9164P7215Q4991R3324J02726J12666J22451
$$ 894950 939439 988672 1043143 1104328 1173492 1250707 1335698 1429022 1531748 1644414 1766865
56245A766865J31779J40348J47739J53781J58337J60833J60630J57560J51366
$$ 1766865 1898644 2038992 2186731 2340512 2498849 2659682 2820312 2977872 3129238
56236C129238J41150J26356J07855Q6995O4058L8833J2312j3650l8106o1120q2265
$$ 3129238 3270388 3396744 3504599 3591594 3655652 3694485 3706797 3693147 3655041 3593921 3511656
56225C511656j00471j15325j27162j35861j40919j42815j42975j42064j39529
$$ 3511656 3411185 3295860 3168698 3032837 2891918 2749103 2606128 2464064 2324535
56216B324535j35081j29461j23406j16877j09617j01706r3369q4996p7346p1006
$$ 2324535 2189454 2059993 1936587 1819710 1710093 1608387 1515018 1430022 1352676 1281670
56206A281670o5668o0643n5834n1413m7021m2377l8202l5288l3008l0049k6346
$$ 1281670 1216002 1155359 1099525 1048112 1001091 958714 920512 885224 852216 822167 795821
56195G95821k2972k0370j8103j6151j4889j3920j2374j0375q806p678o224m519
$$ 795821 772849 752479 734376 718225 703336 689416 677042 666667 657861 650183 643959 639440
56183F39440l553l576l816l846l840l562k618j650j654k106j488K49J454J246
$$ 639440 635887 632311 628495 624649 620809 617247 614629 612979 611325 609219 607731 607980 609434 610680
56169F10680N55M08Q40J775L363N016N655N331N222N749O177O298O845P986Q959
$$ 610680 611235 611643 612483 614258 617621 622637 628292 633623 638845 644594 650771 657069 663914 671900 680859
56154F80859R556J0429J1661J2641J3597J5574J8527K1153K3022K5205K8403L2193
$$ 680859 690415 700844 712505 725146 738743 754317 772844 793997 817019 842224 870627 902820
56142I02820L6486M1933M8345N4447N9762O5091P0576P4944P7156P7218P5052
$$ 902820 939306 981239 1029584 1084031 1143793 1208884 1279460 1354404 1431560 1508778 1583830
56131A583830P0395O4331N8961N4973N1206M7016M3093L9489L4917K8825K2133
$$ 1583830 1654225 1718556 1777517 1832490 1883696 1930712 1973805 2013294 2048211 2077036 2099169
56120B099169J5270P565o54p641j2974j8629k6140l4737m3331n2222o1364o8867
$$ 2099169 2114439 2122004 2121350 2113709 2100735 2082106 2055966 2021229 1977898 1925676 1864312 1795445
56108A795445p3004p4237p3858p1988o8262o3169n7462n1195m4405l7656l1234
$$ 1795445 1722441 1648204 1574346 1502358 1434096 1370927 1313465 1262270 1217865 1180209 1148975
56097A148975k4970j9338j5270j2473r518o043l125j075J114L622N295N870O549
$$ 1148975 1124005 1104667 1089397 1076924 1067406 1061363 1058238 1057163 1058277 1061899 1067194 1073064 1079613
56084A079613P643P985P457P720R459J1160J1674J1658J1586J0824R722J0038
$$ 1079613 1087256 1095241 1102698 1110418 1119877 1131037 1142711 1154369 1165955 1176779 1186501 1196539
56072A196539J2005J3533J3582J3791J5369J7096J7870J8581J9833K0430J9873
$$ 1196539 1208544 1222077 1235659 1249450 1264819 1281915 1299785 1318366 1338199 1358629 1378502
56061A378502J9763K1001K2134K2162K2316K3322K3625K2381K1430K2230K3466
$$ 1378502 1398265 1419266 1441400 1463562 1485878 1509200 1532825 1555206 1576636 1598866 1622332
56050A622332K3748K4037K5188K5818K4967K4300K5296K6772K7388K8049K9544
$$ 1622332 1646080 1670117 1695305 1721123 1746090 1770390 1795686 1822458 1849846 1877895 1907439
56039A907439L0583L0493L1029L3133L4777L4571L4482L6253L8242L8694L9133
$$ 1907439 1938022 1968515 1999544 2032677 2067454 2102025 2136507 2172760 2211002 2249696 2288829
56028B288829M1456M4539M6856M9553N3693N7437N9184O0686O3801O7109O9079
$$ 2288829 2330285 2374824 2421680 2471233 2524926 2582363 2641547 2702233 2766034 2833143 2902222
56017B902222P1348P5410P9225Q0942Q2696Q6817R1475R4213R6576J01005J06172
$$ 2902222 2973570 3048980 3128205 3209147 3291843 3378660 3470135 3564348 3660924 3761929 3868101
56006C868101J09861J13439J19063J25432J30617J36071J43502J51054J57144
$$ 3868101 3977962 4091401 4210464 4335896 4466513 4602584 4746086 4897140 5054284
55997E054284J64461J75363J86999J96085K04806K16691K30371K42990K56053
$$ 5054284 5218745 5394108 5581107 5777192 5981998 6198689 6429060 6672050 6928103
55988F928103K72143K89699L06812L26162L50287L76428M02138M31092M66760
$$ 6928103 7200246 7489945 7796757 8122919 8473206 8849634 9251772 9682864 10149624
55979A0149624N05775N44910N88723O42295P02457P65162Q35291R19496J015907
$$ 10149624 10655399 11200309 11789032 12431327 13133784 13898946 14734237 15653733 16669640
55970A6669640J121735J244369J393360J568416J768381K005038K294580K643569
$$ 16669640 17791375 19035744 20429104 21997520 23765901 25770939 28065519 30709088
55962C0709088L059301L565759M191718M951877N859002O943606Q238158R755214
$$ 30709088 33768389 37334148 41525866 46477743 52336745 59280351 67518509 77273723
55954G7273723J1511957J3563659J5976543J8783382K2005519K5652608K9516846
$$ 77273723 88785680 102349339 118325882 137109264 159114783 184767391 214284237
55947B14284237L2851995L4362057L2755097K7516749J9253879R348724p22883
$$ 214284237 247136232 281498289 314253386 341770135 361024014 370372738 369649855
55940C69649855r883573j7544747k3438154k7436278k9508553k9793836k8649112
$$ 369649855 359766282 342221535 318783381 291347103 261838550 232044714 203395602
55933B03395602k6563655k3989751k1239773j8506916j5923720j3576700j1499698
$$ 203395602 176831947 152842196 131602423 113095507 97171787 83595087 72095389
55926G2095389r692666q148158o851375n770993m870402m123711l510655l005286
$$ 72095389 62402723 54254565 47403190 41632197 36761795 32638084 29127429 26122143
55918B6122143k582554k229408j938251j695660j487537j309189j160095j033904
$$ 26122143 23539589 21310181 19371930 17676270 16188733 14879544 13719449 12685545
55910A2685545r22607q25290p43656o73463o08885n50946n03120m62576m23806
$$ 12685545 11762938 10937648 10193992 9520529 8911644 8360698 7857578 7395002 6971196
55901F971196l87301l56769l31049l06243k82933k63953k47663k30350k12874
$$ 6971196 6583895 6227126 5896077 5589834 5306901 5042948 4795285 4564935 4352061
55892D352061j98354j85597j71348j56858j45853j37704j28784j18986j11011
$$ 4352061 4153707 3968110 3796762 3639904 3494051 3356347 3227563 3108577 2997566
55883B997566j04576r6980q8347q1143p5655p0654o7187o6881o7823o6883o4811
$$ 2997566 2892990 2796010 2707663 2626520 2550865 2480211 2413024 2346143 2278320 2211437 2146626
55872B146626o4489o5478o5008o3122o2112o1753n9761n6133n2855n0022m6369
$$ 2146626 2082137 2016659 1951651 1888529 1826417 1764664 1704903 1648770 1595915 1545893 1499524
55861A499524m2810m1386m1398m0469l8638l7558l6662l4079l0555k8411k7385
$$ 1499524 1456714 1415328 1373930 1333461 1294823 1257265 1220603 1186524 1155969 1127558 1100173
55850A100173k5492k3254k2959k4254k4573k3611k3346k3848k3136k1136j9882
$$ 1100173 1074681 1051427 1028468 1004214 979641 956030 932684 908836 885700 864564 844682
55839H44682j9601j8414j6270j5387j6220j6440j4773j2659j1413j0491r362q473
$$ 844682 825081 806667 790397 775010 758790 742350 727577 714918 703505 693014 683652 675179
55827F75179p789o705n773o203p530q110p911q349r435r736r237r437j0387j0365
$$ 675179 667390 660685 654912 648709 641179 633069 625158 616809 607374 597638 588401 578964 568577 558212
55813E58212q901p507o951o265m981l921l275k084k44J230K240L799N745O602
$$ 558212 549311 541804 534853 528588 523607 519686 516411 514327 514083 515313 517553 521352 527097 533699
55799E33699O150N926O566O751N542L728K117L91j632l258m212n162o385p334
$$ 533699 539849 545775 552341 559092 564634 568362 570479 570870 569238 565980 561768 556606 550221 542887
55785E42887p861q375q600p770o363n937o900p966q124p610o718n265l515k001
$$ 542887 535026 526651 518051 510281 503918 497981 491081 483115 474991 467381 460663 455398 451883 449882
55771D49882j41L284P904J1571J2734J1603Q830M769K75l504o569r854j3232j5386
$$ 449882 449741 453025 460929 472500 485234 496837 505667 510436 510711 507207 500638 490784 477552 462166
55757D62166j5932j5965j6063j5476j3876j2257j1417j0982j0581j0546j0832
$$ 462166 446234 430269 414206 398730 384854 372597 361180 350198 339617 329071 318239
55746C18239j0537r250p709o575n595m489l570k951k153r31L56J328J747J178
$$ 318239 307702 298452 290743 284168 278573 274084 270514 267563 265410 264479 264835 266163 267910 269088
55732B69088m45k090k696k762l562m978n703n429n072m919m392l717l820m326
$$ 269088 268643 266553 263857 261095 257533 252555 246852 241423 236351 231432 227040 223323 219503 215177
55718B15177l722j918o11m83j95J067K154K174K183L319M872N628N714N735N262
$$ 215177 211455 209537 208926 208443 208248 209315 211469 213643 215826 219145 224017 229645 235359 241094 246356
55703B46356L675J489m16k112l989n646o462o686o883o975o597n843m943l834
$$ 246356 250031 251520 251104 248992 245003 239357 232895 226209 219326 212351 205754 199911 194968 191134
55689A91134k670j978j741j168M7J087J297J145J261J483J618K132L194L877L250
$$ 191134 188464 186486 184745 183577 183624 184711 186008 187153 188414 189897 191515 193647 196841 200718 203968
55674B03968J656J50p00q65m43M7j71j012j305m12P41J045P18N46M59o2p20o79
$$ 203968 205624 205774 205074 204209 203766 203813 203642 202630 201325 200913 201654 202699 203417 203963 204422 204360 203640 202961
55656B02961K17J349K186K526K306J777J556J829J945J393O65M83O20K61q58k253
$$ 202961 203178 204527 206713 209239 211545 213322 214878 216707 218652 220045 220710 221193 221813 222074 221216 218963
55640B18963l397m001l986l718l910m746n437n212m399l950m188m524m279l357
$$ 218963 215566 211565 207579 203861 199951 195205 189768 184556 180157 176207 172019 167495 163216 159859
55626A59859k282j738j851j837q92N28J053K47p87j026q71j213j890j999j311
$$ 159859 157577 155839 153988 152151 151259 151787 152840 153087 152300 151274 150403 149190 147300 145301 143990
55611A43990n45m37j074j942k263j611n13k7m46r67r64q83j333j991k157j855
$$ 143990 143445 143008 141934 139992 137729 136118 135605 135578 135132 134165 133201 132318 130985 128994 126837 124982
55595A24982j604j470j133o61m56o00p96r12r93q89l18O35J479J804J647J405
$$ 124982 123378 121908 120775 120114 119658 119058 118262 117350 116357 115468 115150 115785 117264 119068 120715 122120
55579A22120J502J998K565L013L687M893O153O732O827P435Q868J0199J0536R987
$$ 122120 123622 125620 128185 131198 134885 139778 145931 152663 159490 166925 175793 185992 196528 206515
55565B06515R024P675N897M086K570J120n68k375m137n910p483q241q040p600
$$ 206515 215539 223214 229111 233197 235767 236887 236319 233944 229807 223897 216414 208173 200133 192533
55551A92533p575p763p734p551p339o775n704m619l923l235k145j040m18N4Q88
$$ 192533 184958 177195 169461 161910 154571 147796 142092 137473 133550 130315 128170 127130 126712 126766 127654
55536A27654J668J523N00m11n21j2N70P67K63p99j686j810j436j225j286j323
$$ 127654 129322 130845 131345 130934 130413 130401 130971 131738 132001 131202 129516 127706 126270 125045 123759 122436
55520A22436j399j852k507k722k265j621j351j563k002k275k010j234n33m41p67
$$ 122436 121037 119185 116678 113956 111691 110070 108719 107156 105154 102879 100869 99635 99102 98661 97894
55505I7894q46m57j10l36r54j264q52j83j97j142k100k062j234o58o50n12P8M51
$$ 97894 97048 96591 96481 96145 95191 93927 93075 92892 92695 91553 89453 87391 86157 85499 84849 84337 84415 84866
55487H4866J78p7L06P10K58o59q04P4R43R37L69O0L26Q30J100R45N46J85j26n39
$$ 84866 85044 84967 85273 85983 86241 85582 84778 84852 85795 86732 87101 87161 87487 88317 89417 90362 90908 91093 90967 90428
55467I0428r27r10m62p3p8l35o96j249j784j664p39K01M05J21K1J88L14M16O86
$$ 90428 89501 88591 88129 88056 87978 87643 86947 85698 83914 82250 81511 81712 82117 82238 82259 82447 82761 83177 83863
55448H3863R49R35P23M12k17j091j415o52M81Q54M15m0k35n13p66l81O19J353
$$ 83863 84812 85747 86470 86882 86665 85574 84159 83507 83988 84842 85257 85217 84982 84469 83703 83322 83941 85294
55430H5294J307R21P64P84P38O85O62M33j24o47p15l13K82Q49J281J579J869K250
$$ 85294 86601 87522 88286 89070 89808 90493 91155 91588 91464 90817 90102 89789 90071 90920 92201 93780 95649 97899
55412I7899K542K411J837J183P52M48K0n37r48r74p13m97m85n01l93l67o45r97
$$ 97899 100441 102852 104689 105872 106624 107072 107092 106555 105607 104633 103920 103423 102938 102437 102044 101677 101032 100035
55394A00035j052r80j226j604j430o33P5L55O81J177J022k66j748k205j714j155
$$ 100035 98983 98003 96777 95173 93743 93110 93185 93540 94221 95398 96420 96154 94406 92201 90487 89332
55378H9332p79k94M1l22r87q47L25J451J575P98l16j464k282k176j023L80J060
$$ 89332 88553 88259 88300 87978 86991 86144 86469 87920 89495 90293 89977 88513 86231 84055 83032 83412 84472
55361H4472Q67L82J19J20J69P8k44p34j127j088n42Q5K32p3j25N37J355J491J065
$$ 84472 85339 85721 85840 85960 86129 86207 85963 85229 84102 83014 82472 82557 82789 82716 82591 83128 84483 85974 87039
55342H7039R28J330J673J627J465J048k98k262l137j828N01J864J781J160N85
$$ 87039 87967 89297 90970 92597 94062 95110 94812 92550 89413 87585 88086 89950 91731 92891 93476
55327I3476r0p96j162j208j188r41k60L52K72j47n5N37R28J023J330J718J424
$$ 93476 93386 92590 91428 90220 89032 88091 87831 88183 88455 88308 88253 88790 89718 90741 92071 93789 95213
55310I5213L88m93p08p18r68j226j164q64l85L55J059J091L63m09n84j87M02Q40
$$ 95213 95601 95108 94400 93682 92714 91488 90324 89460 89075 89430 90489 91580 91943 91534 90950 90763 91165 92005
55292I2005P92J85m53m89l3L05L68M46M73P0n42o75k83r6m66q91q85m85J99J095
$$ 92005 92797 92982 92529 92040 92007 92312 92680 93126 93599 93669 93127 92452 92169 92073 91607 90716 89831 89346 89545 90640
55272I0640J692J370L79l89p07j128j654j486m92K80J36l04k84r2k45m31j95J08
$$ 90640 92332 93702 94081 93692 92985 91857 90203 88717 88225 88505 88641 88337 88053 87961 87716 87285 87090 87198
55254H7198p2m38l29K31P55J147J511J546R02q3p25q82q40n77J24R69J222N99
$$ 87198 87126 86688 86359 86590 87345 88492 90003 91549 92451 92368 91643 90761 89921 89344 89468 90437 91659 92258
55236I2258l83r83r11m18nO6O1L63P67N90l12j128j042j59P87J270J113L46o13
$$ 92258 91875 90892 89981 89563 89558 89624 89685 90048 90815 91405 91093 89965 88923 88764 89551 90821 91934 92280 91667
55217I1667r78m05M79P87M05p3j90P3N81J172J536J419R22L56q7l42l63k77m56
$$ 91667 90689 90284 90763 91550 91955 91882 91692 91765 92346 93518 95054 96473 97395 97751 97664 97322 96959 96682 96226
55198I6226j115j904k190j650n62L72N41K9l60J9P82J035P15O10R57R61J84m97
$$ 96226 95111 93207 91017 89367 88805 89177 89718 89747 89387 89406 90188 91223 91938 92548 93505 94466 94650 94153
55180I4153j29P66R46K89j50J65O05N45L06M03O41N49L14N51J230J433N10r48
$$ 94153 94024 94790 95736 96025 95875 96040 96645 97190 97496 97899 98540 99089 99403 99954 101184 102617 103127 102179
55162A02179j666j096J58J214J696J499M43j260k628k704j649m48K75O09O55L38
$$ 102179 100513 99417 99575 100789 102485 103984 104427 103167 100539 97835 96186 95738 96013 96622 97277 97615
55146I7615j17k62j68l47p98q86l53K72O03Q65J175J135O72L79N08L76m53j225
$$ 97615 97498 97236 97068 96721 95923 95037 94684 94956 95559 96424 97599 98734 99406 99785 100293 100669 100216 98991
55128I8991j010j35L98L74L41M49L31J8nL46O37P55J112J797K220J846Q70j32
$$ 98991 97981 97846 98244 98618 98959 99408 99739 99757 99752 100098 100735 101490 102602 104399 106619 108465 109335 109203
55110A09203p87r69o10K08J104J557J292N20k32n53m47r4N01J330J944J677N29
$$ 109203 108416 107447 106837 107045 108149 109706 110998 111518 111286 110733 110286 110192 110693 112023 113967 115644 116173
55093A16173o01q36k37M19M87l7n92n22K35R21P76M5m14m09n87j183j547j242
$$ 116173 115572 114736 114499 114918 115405 115368 114776 114254 114489 115410 116186 116231 115817 115408 114821 113638 112091 110849
55075A10849o98l73m7M65P40N78N89J156J553J002l8n40l43j6K00L28J9r45j842
$$ 110849 110151 109778 109731 110196 110936 111514 112103 113259 114812 115814 115776 115236 114893 114877 115077 115405 115424 114479 112637
55056A12637j813j169r01j098j019n24k17k30mN91J007J030J000Q86K87n16n92
$$ 112637 110824 109655 108754 107656 106637 106113 105896 105666 105662 106253 107260 108290 109290 110176 110463 109947 109355
55039A09355J78P26L02n90j180j374j280p42LJ21o75j438j168j29O99Q98P11L61
$$ 109355 109533 110259 110561 109971 108791 107417 106137 105395 105398 105519 104844 103406 102238 102109 102808 103706 104417 104778
55021A04778j8j41J24M27M89N39P95R03N42J07J13K42j31p28n57O14J795K045
$$ 104778 104760 104619 104743 105170 105659 106198 106993 107896 108438 108545 108658 108900 108769 108041 107484 108098 109893 111938
55003A11938J540J096J070J166J060Q16P19Q90J107J005M47k96q11r05o19j04
$$ 111938 113478 114574 115644 116810 117870 118686 119405 120295 121402 122407 122854 122558 121747 120842 120223 120119
54987A20119M18O07K37n18j109j030k45P63J305J034K32m57p04p81j095j551j591
$$ 120119 120537 121144 121381 120863 119754 118724 118479 119242 120547 121581 121813 121356 120652 119871 118776 117225 115634
54970A15634q78K42J014J020N18P9jJ28K45L17L73K86l8m09n10k62J39N08P94
$$ 115634 114756 114998 116012 117032 117550 117629 117628 117756 118001 118318 118691 118977 118939 118530 118020 117758 117897 118405 119199
54951A19199R95J052R36O89M38L87O20Q44N97j02n57k46L69L58m92j431j690j174
$$ 119199 120194 121246 122182 122871 123309 123696 124316 125160 125757 125655 125098 124852 125221 125579 125087 123656 121966 120792
54933A20792k35P18J210R29K13l8O51J721K268K139J957K279L048L827M254M305
$$ 120792 120557 121275 122485 123414 123627 123589 124240 125961 128229 130368 132325 134604 137652 141479 145733 150038
54917A50038M325M733N504O018N704M727L718K821J485o14k786l990m082l945
$$ 150038 154363 159096 164600 170618 176322 181049 184767 187588 189073 188459 185673 181683 177601 173656
54903A73656m288m800m774m123l372k876k557k305k140j948j552j104r48r98p95
$$ 173656 169368 164568 159794 155671 152299 149423 146866 144561 142421 140473 138921 137817 136869 135871 135076
54888A35076k78N6M0J79P70J339J483J655K342L084L154K819K913L441L715L737
$$ 135076 134798 134854 134894 135073 135843 137182 138665 140320 142662 145746 148900 151719 154632 158073 161788 165525
54872A65525M235N163N372M240K582J395N76m01j366j915k363l263m328m802m612
$$ 165525 169760 174923 180295 184535 187117 188512 189088 188687 187321 185406 183043 179780 175452 170650 166038
54857A66038m299l898k925j592r85j645k709l051k657k277k228k239k223k329
$$ 166038 161739 157841 154916 153324 152339 150694 147985 144934 142277 140000 137772 135533 133310 130981
54843A30981k308j659o00r3n26j027o59J50K40n62j196r21j82K60L23L12K41L7
$$ 130981 128673 127014 126414 126321 125795 124768 124109 124259 124499 123937 122741 121820 121638 121898 122221 122533 122774 122811
54825A22811q4K8L8l95r98j229r62l32O94J980K771K365J196M40N16P12L39m06
$$ 122811 122727 122755 122793 122398 121400 120171 119209 118877 119571 121551 124322 126687 127883 128323 128839 129551 129890 129484
54807A29484r83j193j008l50N78J233J392J431J608J502O57n50j237j051l91K50
$$ 129484 128501 127308 126300 125950 126528 127761 129153 130584 132192 133694 134351 133801 132564 131513 131122 131372
54791A31372P62J128J142O25k58j052j384j220p80k86J91O01Q14P99Q15J146J674
$$ 131372 132134 133262 134404 135029 134771 133719 132335 131115 130335 130049 130240 130841 131655 132454 133269 134415 136089
54774A36089J943J727J355J308J672K145K495K893L685M876N948O370O197N978
$$ 136089 138032 139759 141114 142422 144094 146239 148734 151627 155312 160188 166136 172506 178703 184681
54760A84681O006O000N626M899L861K292K12j656k542k615k833l837n366o699
$$ 184681 190687 196687 202313 207212 211073 213365 213577 211921 209379 206764 203931 200094 194728 188029
54746A88029p247o775n576m384l746l435k888k104j603j574j645j531j318j029
$$ 188029 180782 174007 168431 164047 160301 156866 153978 151874 150271 148697 147052 145521 144203 143174
54732A43174m85K02N00J79l03l04L70J435K414K953L153L574M460N167M928M073
$$ 143174 142689 142891 143391 143570 143267 142963 143333 144768 147182 150135 153288 156862 161322 166489 171417 175490
54716A75490L655L853L658K453R64J00l66j244k630l879m517m578m300l989m027
$$ 175490 179145 182998 186656 189109 190073 190173 189807 188563 185933 182054 177537 172959 168659 164670 160643
54701A60643m471m815m484l478k259j242o03l25j74J20M48M38Q3j82j92l07p22
$$ 160643 156172 151357 146873 143395 141136 139894 139291 138966 138792 138912 139360 139798 139881 139699 139507 139200 138478
54684A38478j136j429j963k718k885j956o86n6P1M47J003J023M88J15N5l08j034
$$ 138478 137342 135913 133950 131232 128347 126391 125705 125649 125720 126167 127170 128193 128681 128796 128851 128543 127509
54667A27509j199k53R53J167K80p29j036o74j31K31L01O8m23r46j042l03J075
$$ 127509 126310 126057 127010 128177 128457 127728 126692 126018 125887 126118 126419 126487 126064 125118 124076 123773 124848
54650A24848K235K410J670P05k4n54r40j062q98o96o44o45n54l41k6L47N54L11
$$ 124848 127083 129493 131163 131868 131844 131290 130350 129288 128390 127694 127050 126405 125851 125510 125484 125831 126385 126696
54632A26696k72o57m67O5M10L50J41J54N70J240J762J725J081J75o78j421j959
$$ 126696 126424 125767 125300 125365 125775 126125 126266 126420 126990 128230 129992 131717 132798 132973 132295 130874 128915
54615A28915j878r18L58R24N06l8Q6N54O07L81O52J351J414M27n80n82k9j2n65
$$ 128915 127037 126119 126477 127401 127907 127869 127955 128509 129116 129497 130149 131500 132914 133341 132761 132179 132150 132138 131573
54596A31573q13m61n6J17L59P08P51M87M65Q05R35O07L38M22L54k43q71r32o07
$$ 131573 130760 130299 130243 130360 130719 131427 132178 132665 133130 133935 134870 135477 135815 136237 136591 136348 135477 134545 133938
54577A33938l65j65J70L14j15q47j306j354j145o18K08Q46R07P05O77N51j28r08
$$ 133938 133573 133408 133578 133892 133777 132930 131624 130270 129125 128507 128715 129561 130468 131173 131850 132401 132273 131365
54559A31365q34K07J326J856J924J772J288N91K43N05Q28N63j28n07k34L34P68
$$ 131365 130531 130738 132064 133920 135844 137616 138904 139495 139738 140243 141071 141634 141506 140999 140765 141099 141867
54542A41867J066J368J452R30p1q33q70n03k57q3L62R73J378J645J968J861P15
$$ 141867 142933 144301 145753 146683 146612 145779 144909 144406 144149 144066 144428 145401 146779 148424 150392 152253 152968
54525A52968q31j320n59k6o27j334j012k66l02q40p39l4K02k04l05K01M16k09
$$ 152968 152137 150817 150258 150232 149605 148271 147259 146993 146691 145851 145112 145078 145280 145076 144771 144972 145388 145179
54507A45179r20p31L20J413J768J066l43j509j702j246r65r57n90K80R56R46N76
$$ 145179 144259 143528 143848 145261 147029 148095 147752 146243 144541 143295 142330 141373 140783 141063 142019 142965 143541
54490A43541L66L47K32j86r57j840k235j736p10J28N73Q74J072J065J142J585
$$ 143541 143907 144254 144486 144300 143343 141503 139268 137532 136822 136950 137523 138397 139469 140534 141676 143261
54474A43261J965J666R50N92O02L14l11n93l92l13m75k85L14N47J49j54L7J79
$$ 143261 145226 146892 147842 148434 149036 149350 149039 148446 148054 147741 147266 146981 147295 147842 147991 147837 147874 148053
54456A48053J2K39J136J690J038j48o74m40j05J62N67Q63O88K88Q5r3m91o96l12
$$ 148053 148065 148304 149440 151130 152168 152020 151346 150906 150801 150963 151530 152393 153081 153369 153454 153361 152870 152174 151862
54437A51862K1n77j712k052j166k1L91J46j37j46lN1j35m24m42o6L36M67N94J023
$$ 151862 151883 151306 149594 147542 146376 146355 146746 146892 146755 146609 146606 146657 146522 146098 145656 145590 145926 146393 146987 148010
54417A48010J439J359R73Q00P75M26j10j05N86J203J165P98O18N05P8m73n53M1
$$ 148010 149449 150808 151781 152581 153356 153782 153672 153567 154153 155356 156521 157319 157937 158442 158520 158047 157494 157535
54399A57535Q56J349J410J297J273J406J613J759J740J603J584J892K276K031
$$ 157535 158391 159740 161150 162447 163720 165126 166739 168498 170238 171841 173425 175317 177593 179624
54385A79624P67r36k003k000j452j006p72o59q12j311j810j825j285m73K82P39
$$ 179624 180391 179455 177452 175452 174000 172994 172222 171563 170751 169440 167630 165805 164520 164047 164329 165068
54369A65068Q43Q71J220J800K042J776J613K062K693K716K108J575J618K112K688
$$ 165068 165911 166782 168002 169802 171844 173620 175233 177295 179988 182704 184812 186387 188005 190117 192805
54354A92805L064L097K889K795K917K776J886N19n64j040j251j587k092k667l204
$$ 192805 195869 198966 201855 204650 207567 210343 212229 212748 212184 211144 209893 208306 206214 203547 200343
54339B00343l507l458l315l465l827l828l138k137j505j531j870j917j325l29
$$ 200343 196836 193378 190063 186598 182771 178943 175805 173668 172163 170632 168762 166845 165520 165191
54325A65191M86P55O02L43R8j77m62o31o43n84o08q17j039q90k60L16K04m55r44
$$ 165191 165677 166432 167034 167377 167475 167298 166836 166205 165562 164978 164370 163553 162514 161624 161364 161680 161884 161429 160485
54306A60485j051j260j712j743r29P3L62j9l46k77%L03N19M22M7j9P00J739K175
$$ 160485 159434 158174 156462 154719 153790 153863 154225 154206 153860 153583 153583 153886 154405 154827 154874 154855 155555 157294 159469
54287A59469J749R92M33K13K70K96k27j342k159j776m77O44J078J195J322J312
$$ 159469 161218 162210 162643 162856 163126 163422 163195 161853 159694 157918 157441 158085 159163 160358 161680 162992
54271A62992J095Q39N96L48L86R32J485J385Q95Q54J247J241O70L98P76R44L19
$$ 162992 164087 164926 165522 165870 166256 167188 168673 170058 170953 171807 173054 174295 174965 175363 176139 177083 177402
54254A77402l28j05N25N58J47L48J404K330K256J330J36j031k020k472k136j345
$$ 177402 177074 176969 177494 178052 178199 178547 179951 182281 184537 185867 186003 184972 182952 180480 178344 176999
54238A76999q21r32j320j353r06n19o79j151j236n87M76J369J665J218K64o21
$$ 176999 176178 175246 173926 172573 171667 171148 170469 169318 168082 167495 167971 169340 171005 172223 172487 171866
54222A71866r90r60r31r26o32m6M71P46R33J033Q82O66P82J045P58j74q67o38
$$ 171866 170876 169916 168985 168059 167427 167381 167852 168598 169531 170564 171446 172112 172894 173939 174697 174523 173656 173018
54204A73018Q0M99N72O98Q35O03Oo09j112j568j750j319m24L36N67L63ql26m22
$$ 173018 173098 173597 174169 174867 175702 176305 176311 175702 174590 173022 171272 169953 169529 169865 170432 170795 170787 170461 170039
54185A70039k72n7R9K66L94J40n77j169j000k48L66N54O02O89O35L99K43L14M47
$$ 170039 169767 169710 169809 170075 170469 170609 170032 168863 167863 167615 167981 168535 169137 169826 170461 170860 171103 171417 171864
54166A71864M68L19q7p28j232j217q78o97o13j46O35J000O96L85M82L27p65k150
$$ 171864 172332 172651 172564 171836 170604 169387 168509 167812 167199 167053 167688 168688 169384 169769 170251 170578 169813 167663
54148A67663k516j639o13k99m42m33k35j11l6J56L62M19M96Q87J489J904J980
$$ 167663 165147 163508 162895 162596 162154 161721 161486 161375 161339 161495 161857 162276 162772 163659 165148 167052 169032
54131A69032J982K131K251J969J129j8r83j374j184p46l51k9K95N80P81R81J229
$$ 169032 171014 173145 175396 177365 178494 178476 177493 176119 174935 174189 173838 173809 174104 174684 175465 176446 177675
54114A77675J313J003M66J62K79N39N88L83J83L67J148K215K683J847R0j321j494
$$ 177675 178988 179991 180457 180619 180898 181437 182025 182408 182591 182958 184106 186321 189004 190851 190941 189620 188126
54097A88126o75L25J005J245R98L45l62p45p00k78M27J102J320J152J268J992
$$ 188126 187451 187776 188781 190026 191024 191369 191007 190262 189562 189284 189711 190813 192133 193285 194553 196545
54081A96545K676K573K010J981K720L470L682L696M044M675N173N237M724L535
$$ 196545 199221 201794 203804 205785 208505 211975 215657 219353 223397 228072 233245 238482 243206 246741
54067B46741J811m9j677k864l446l481l499m001m631m415l086j589r25j006j058
$$ 246741 248552 248503 246826 243962 240516 237035 233536 229535 224904 220489 217403 215814 214889 213883 212825
54052B12825p22k00L42R37J508J876K074K285K584K952L408L906M284M581N103
$$ 212825 212103 211903 212245 213182 214690 216566 218640 220925 223509 226461 229869 233775 238059 242640 247743
54037B47743N870O281N885N213N262O203P219P641P575P269O613N652M996N043
$$ 247743 253613 259894 265779 270992 276254 282457 289676 297317 304892 312161 318774 324426 329422 334465
54023C34465N195M542L214K307K363K650K283J486J134J383J465Q01l35j406k272
$$ 334465 339660 344202 347416 349723 352086 354736 357019 358505 359639 361022 362487 363288 362953 361547 359275
54008C59275k941l170k809k274k152k536l160m001n159o241o562o136n887o495
$$ 359275 356334 353164 350355 348081 345929 343393 340233 336232 331073 324832 318270 312134 306247 299752
53994B99752p482p798p021n623m292l380k834k411j961j715k097l038l730l399
$$ 299752 292270 284472 277451 271828 267536 264156 261322 258911 256950 255235 253138 250100 246370 242971
53980B42971k231j176q77j207j721k133k218j728p32K06N43L38J06J46L10L40
$$ 242971 240740 239564 238687 237480 235759 233626 231408 229680 228948 229154 229697 230035 230141 230287 230597 230937
53964B30937J70j33m29m19J79J138J703J452R85J287K402L267L059K219J814K210
$$ 230937 231107 230974 230545 230126 230305 231443 233146 234598 235583 236870 239272 242539 245598 247817 249631 251841
53948B51841K885L344L698M250M921N306N138M564M045M027M653N709O834P756
$$ 251841 254726 258070 261768 266018 270939 276245 281383 285947 289992 294019 298672 304381 311215 318971
53934C18971Q358Q662Q816Q969R166R534J0465J2298J4777J7261J9445K1323K2318
$$ 318971 327329 335991 344807 353776 362942 372476 382941 395239 410016 427277 446722 468045 490363
53921D90363K1241J7650J2646P719L368n30l591n260n850o118n971m708k630j158
$$ 490363 511604 529254 541900 549619 552987 552457 548866 543606 537756 531638 525667 520959 518329 517171
53907E17171j024j363j103l52J14o2q64k316m122n421n595n051m675m810n196
$$ 517171 516147 514784 513681 513329 513443 513381 512517 510201 506079 500658 495063 490012 485337 480527 475331
53892D75331n557n824o107o722p916r232r798r546r491j0227j0894j0404r098
$$ 475331 469774 463950 457843 451121 443205 433973 424175 414629 405138 394911 384017 373613 364515
53879C64515q278q348q450p832o635n303m064l215l181l948m757m740l741k488
$$ 364515 356237 347889 339439 331607 324972 319669 315605 312390 309209 305261 300504 295764 292023 289535
53865B89535k070l014m674n715n433m434l691l411l204k942k722k332j496n40
$$ 289535 287465 284451 279777 274062 268629 264195 260504 257093 253889 250947 248225 245893 244397 243857
53851B43857j41m32r44j340j568j357l89Q75J352O20n06r44m39M82J156J129L79
$$ 243857 243716 243284 242340 241000 239432 238075 237686 238561 239913 240533 240027 239083 238644 239126 240282 241411 241790
53834B41790n86j102j086r70q79m47L47Q06M12k94l44M20J252J469J145P70O51
$$ 241790 241204 240102 239016 238046 237167 236720 237067 237873 238285 237991 237647 238067 239319 240788 241933 242703 243354
53817B43354O91O92O36P42J176J802K359K759L039L129K953K741K891L438M062
$$ 243354 244045 244737 245373 246115 247291 249093 251452 254211 257250 260379 263332 266073 268964 272402 276464
53802B76464M650N462O543P380P475O906O114N332M601M081L944M051M103M032
$$ 276464 281114 286576 293119 300499 307974 314880 320994 326326 330927 335008 338952 343003 347106 351138
53788C51138L942L629K658J092j83k61O44J245M69j397l060l585l191k774k928
$$ 351138 355080 358709 361367 362459 362276 362015 362659 363904 364373 362976 359916 356331 353140 350366 347438
53773C47438l647m690n806o648o846o351n635n277n353n401n029m475m283m486
$$ 347438 343791 339101 333295 326647 319801 313450 307815 302538 297185 291784 286755 282280 277997 273511
53759B73511m446l740k874k658l064l248k744k049j799j921j909j527q73j39L44
$$ 273511 269065 265325 262451 259793 256729 253481 250737 248688 246889 244968 243059 241532 240659 240520 240864
53744B40864J78n54j127r56k90K06K61J0l63n65j84O94J306J216J070J561K089
$$ 240864 241042 240488 239361 238405 238115 238321 238582 238592 238229 237664 237480 238174 239480 240696 241766 243327 245416
53727B45416J479q1j047n09P39J500J568J482J577J862K263K552K344J553N93
$$ 245416 246895 246814 245767 245258 245997 247497 249065 250547 252124 253986 256249 258801 261145 262698 263291
53712B63291o4k21K06J132K047K351K165K221K769L179K942K426K264K517K880
$$ 263291 263227 263006 263212 264344 266391 268742 270907 273128 275897 279076 282018 284444 286708 289225 292105
53697B92105L226L529L588L327L023K866K621K128J683J608J693J535J081M80
$$ 292105 295331 298860 302448 305775 308798 311664 314285 316413 318096 319704 321397 322932 324013 324493
53683C24493k82j130j619j412r12q23j244j584j437j087j046j335j420q66L2N07
$$ 324493 324211 323081 321462 320050 319138 318315 317071 315487 314050 312963 311917 310582 309162 308296 308328 308835
53667C08835K93rJ56L58j46j058j327q50p21j462k093j644o27p7K3L06O81N33
$$ 308835 309128 309119 309275 309633 309487 308429 307102 306252 305531 304069 301976 300332 299705 299628 299651 299957 300638 301171
53649C01171J8r1L49P64R11J033R73L05n44m36Q29K051K308K212K723L506L387
$$ 301171 301189 301098 301447 302211 303122 304155 305128 305433 304889 304453 305282 307333 309641 311853 314576 318082 321469
53632C21469K182J060J055J859K404K184J687J616K067K577K773K724K613K478
$$ 321469 323651 324711 325766 327625 330029 332213 333900 335516 337583 340160 342933 345657 348270 350748
53618C50748K347K450K948L722M588N543O480O939O550N565M644M166M104M420
$$ 350748 353095 355545 358493 362215 366803 372346 378826 385765 392315 397880 402524 406690 410794 415214
53604D15214N061N724O000N781N225M433L551K960K794K473J333l02j392j582
$$ 415214 420275 425999 431999 437780 443005 447438 450989 453949 456743 459216 460549 460247 458855 457273
53590D57273j636k224k930k892k018j077q21j355k201k753k788k667k915l581
$$ 457273 455637 453413 450483 447591 445573 444496 443675 442320 440119 437366 434578 431911 428996 425415
53576D25415m193m359m068l464k649j793j121o46k22P7N7j47j42J46L74L98M83
$$ 425415 421222 416863 412795 409331 406682 404889 403768 403122 402900 402977 403034 402887 402745 402891 403265 403663 404146
53559D04146P85J044J069J031J061R94P70O33O73O32N04P53J560K274K236J729
$$ 404146 404931 405975 407044 408075 409136 410130 410900 411533 412206 412838 413342 414095 415655 417929 420165 421894
53543D21894J641K369L530M543N049M995M737M883N632O426O673O508O508O887
$$ 421894 423535 425904 429434 433977 439026 444021 448758 453641 459273 465699 472372 478880 485388 492275
53529D92275P501Q341R430J0446J1064J1583J2562J3879J4758J4785J4399J4317
$$ 492275 499776 508117 517547 527993 539057 550640 563202 577081 591839 606624 621023 635340
53517F35340J4940J6275J7879J9017J9368J9632K0754K2626K4217K5034K5669
$$ 635340 650280 666555 684434 703451 722819 742451 763205 785831 810048 835082 860751
53506H60751K6609K7397K7439K6949K6517K6274K5965K5458K4647K3302K1560
$$ 860751 887360 914757 942196 969145 995662 1021936 1047901 1073359 1098006 1121308 1142868
53495A142868K0118J9468J9231J8871J8633J9023J9692J9743J9102J8690J9086
$$ 1142868 1162986 1182454 1201685 1220556 1239189 1258212 1277904 1297647 1316749 1335439 1354525
53484A354525J9763J9954J9611J9137J8673J8028J7055J5714J3961J1876R753
$$ 1354525 1374288 1394242 1413853 1432990 1451663 1469691 1486746 1502460 1516421 1528297 1538050
53473A538050P829O052M203K150j28k508m752o748q726j0929j3046j4399j4809
$$ 1538050 1545879 1551931 1556134 1558284 1558156 1555648 1550896 1544148 1535422 1524493 1511447 1497048 1482239
53460A482239j4881j5208j5763j6317j7022j8107j9362k0404k1297k2321k3192
$$ 1482239 1467358 1452150 1436387 1420070 1403048 1384941 1365579 1345175 1323878 1301557 1278365
53449A278365k3095k1685j9703j8307j8037j8441j8596j7822j6029j3605j1080
$$ 1278365 1255270 1233585 1213882 1195575 1177538 1159097 1140501 1122679 1106650 1093045 1081965
53438A081965q919p438o630o012n009l635k473j773r97L47J871K876L533M732
$$ 1081965 1073046 1065608 1058978 1052966 1047957 1044322 1041849 1040076 1039079 1039426 1041297 1044173 1047706 1052438
53424A052438O728Q736J0010J0784J1776J3365J5535J8120K0670K2512K3439K4095
$$ 1052438 1059166 1067902 1077912 1088696 1100472 1113837 1129372 1147492 1168162 1190674 1214113 1238208
53412A238208K5160K6516K7726K9049L1213L4139L6736L8248L9236M0758M2951
$$ 1238208 1263368 1289884 1317610 1346659 1377872 1412011 1448747 1486995 1526231 1566989 1609940
53401A609940M5003M6372M7486M9022N0971N2731N3928N4817N5786N6822N7636
$$ 1609940 1654943 1701315 1748801 1797823 1848794 1901525 1955453 2010270 2066056 2122878 2180514
53390B180514N8147N8498N8673N8339N7237N5501N3479N1356M9102M6614M3785
$$ 2180514 2238661 2297159 2355832 2414171 2471408 2526909 2580388 2631744 2680846 2727460 2771245
53379B771245M0487L6734L2797K8941K5093K0907J6181J1060N776L68n308j1372
$$ 2771245 2811732 2848466 2881263 2910204 2935297 2956204 2972385 2983445 2989221 2989589 2984281 2972909
53367B972909j7758k4104k9795l4372l8096m1847m6165n0475n3615n5163n5847
$$ 2972909 2955151 2931047 2901252 2866880 2828784 2786937 2740772 2690297 2636682 2581519 2525672
53356B525672n6458n6878n6500n5294n3847n2472n0929m9108m7364m5987m4869
$$ 2525672 2469214 2412336 2355836 2300542 2246695 2194223 2143294 2094186 2046822 2000835 1955966
53345A955966m3970m3543m3449m2827m1136l9057l7614l6703l5385l3420l1510
$$ 1955966 1911996 1868453 1825004 1782177 1741041 1701984 1664370 1627667 1592282 1558862 1527352
53334A527352k9921k8008k5454k3019k1402k0195j8688j7103j6108j5613j4971
$$ 1527352 1497431 1469423 1443969 1420950 1399548 1379353 1360665 1343562 1327454 1311841 1296870
53323A296870j4192j3947j4320j4489j3822j2606j1357j0023q329o477n036m223
$$ 1296870 1282678 1268731 1254411 1239922 1226100 1213494 1202137 1192114 1183785 1177308 1172272 1168049
53311A168049l677k830j335P55L107N379P506R571J1404J2610J3144J3641J4873
$$ 1168049 1164372 1161542 1160207 1160962 1164069 1169448 1176954 1186525 1197929 1210539 1223683 1237324 1252197
53298A252197J6904J8994K0420K1263K2240K3875K5928K7699K8776K9218K9150
$$ 1252197 1269101 1288095 1308515 1329778 1352018 1375893 1401821 1429520 1458296 1487514 1516664
53287A516664K8461K7169K5773K4801K4087K2852K0643J7876J5202J2610R476
$$ 1516664 1545125 1572294 1598067 1622868 1646955 1669807 1690450 1708326 1723528 1736138 1745614
53276A745614N511J271k420n368q038j0729j3167j5035j6685j8763k1251k3322
$$ 1745614 1751125 1752396 1749976 1744608 1736570 1725841 1712674 1697639 1680954 1662191 1640940 1617618
53264A617618k4415k4982k5837k7036k7896k8031k7855k7995k8641k9638l0803
$$ 1617618 1593203 1568221 1542384 1515348 1487452 1459421 1431566 1403571 1374930 1345292 1314489
53253A314489l1794l1951l0808k8834k7226k6733k6948k7011k6755k6729k7151
$$ 1314489 1282695 1250744 1219936 1191102 1163876 1137143 1110195 1083184 1056429 1029700 1002549
53242A002549k7435k6978k5967k5014k4281k3493k2526k1494k0288j8635j6680
$$ 1002549 975114 948136 922169 897155 872874 849381 826855 805361 785073 766438 749758
53231G49758j5016j3931j3088j2115j1111j0339r838r547r500r710j0157j0936
$$ 749758 734742 720811 707723 695608 684497 674158 664320 654773 645273 635563 625406 614470
53219F14470j2013j2811j2677j1950j1825j2744j3643j3379j2257j1390j1101
$$ 614470 602457 589646 576969 565019 553194 540450 526807 513428 501171 489781 478680
53208D78680j0807j0134r228q190p010o065n808o032o178o218o479o686o149n018
$$ 478680 467873 457739 448511 440321 433311 427246 421438 415406 409228 403010 396531 389845 383696 378678
53194C78678m309m494m858m707m273m017l808l398l074l163l397l339l108l055
$$ 378678 374369 369875 365017 360310 356037 352020 348212 344814 341740 338577 335180 331841 328733 325678
53180C25678l076k811k317j949j774j586j385j405j694j987j982j558q32j88k8
$$ 325678 322602 319791 317474 315525 313751 312165 310780 309375 307681 305694 303712 302154 301322 301134 301106
53165C01106l32o61p43p20p09n97n08q98j699j973j074K58P40J99m49o85q96j355
$$ 301106 300774 300113 299370 298650 297941 297344 296836 295938 294239 292266 291192 291450 292190 292389 291940 291255 290359 289004
53147B89004j641j442j155j234j476j470j287j226j180q29k09L79Q35J177J140
$$ 289004 287363 285921 284766 283532 282056 280586 279299 278073 276893 276064 275855 276234 277069 278246 279386
53132B79386M67m12o12J04R77J253J071J017J189J205R09N18J84j08k02J49P54
$$ 279386 279853 279441 278829 278933 279910 281163 282234 283251 284440 285645 286554 287072 287256 287148 286946 287095 287849
53115B87849J006O09p5n41n77n7J071K272K526J551L63k6n6q90k493l576l403
$$ 287849 288855 289464 289389 288848 288271 288214 289285 291557 294083 295634 295997 295971 295915 295025 292532 288956 285553
53098B85553k583j829r65J87R08M12q81j754j698j268j119j278j438j459j381
$$ 285553 282970 281141 280176 280363 281271 281683 280802 279048 277350 276082 274963 273685 272247 270788 269407
53083B69407j221r15l40N11J284J459R80M65M83Q54J003P95N71M63J86m42j192
$$ 269407 268186 267271 266931 267442 268726 270185 271165 271630 272113 272967 273970 274765 275336 275799 275985 275543 274351
53066B74351j731j958j923j682j316r54o64m78m74o52p96o87l97j45R6N29J026
$$ 274351 272620 270662 268739 267057 265741 264787 264123 263645 263171 262519 261723 261036 260639 260494 260590 261119 262145
53049B62145J100N67n5j01M69J100J308J094O88K02l70j005j578j832j478n34
$$ 262145 263245 263812 263757 263656 264125 265225 266533 267627 268315 268517 268147 267142 265564 263732 262254 261720
53033B61720L79M13n21j401j111K82J652K176J987J452N60o01j376j213m49J91
$$ 261720 262099 262512 261991 260590 259479 259761 261413 263589 265576 267028 267588 266987 265611 264398 263949 264140
53017B64140N93J098J575J519R79O25P60R82R71R09R06P43M53M73Q13Q28K10l92
$$ 264140 264733 265831 267406 268925 269904 270529 271289 272271 273242 274151 275057 275800 276253 276726 277539 278367 278577 278185
52999B78185l46Jq0o09j039j140j037p12q2N26O55L50R2K13P34J525K205K220
$$ 278185 277839 277840 277760 277151 276112 274972 273935 273223 273141 273667 274322 274672 274764 274977 275711 277236 279441 281661
52981B81661J541R21R59J233J068P65J164K152K562J769N34l3K66Q11J003O96
$$ 281661 283202 284123 285082 286315 287383 288148 289312 291464 294026 295795 296329 296296 296562 297373 298376 299072
52965B99072J40j75J00P75J266J164N05m16j174j352r38n11o33j120j350j152
$$ 299072 299212 299037 299137 299912 301178 302342 302847 302431 301257 299905 298967 298456 297823 296703 295353 294201
52949B94201q22m78p4O3n20j509j997j669j125p83l60K82N62J18m83n63k84j40
$$ 294201 293379 292901 292827 292890 292370 290861 288864 287195 286070 285287 284927 285209 285771 285889 285406 284843 284559 284419
52931B84419j9L48M34n41k229l177k487p92O51J223J060M65l20r71j152q16j92
$$ 284419 284400 284748 285182 284641 282412 279235 276748 275956 276607 277830 278890 279355 279035 278064 276912 276096 275904
52914B75904M85J084J416J205M60k64k83M17J028P99r5q55j050r45q56o85k72
$$ 275904 276389 277473 278889 280094 280554 280290 280007 280424 281452 282251 282156 281301 280251 279306 278450 277765 277493
52897B77493J80L08K9m50q14p67k22M30N56M9m53m36k27m62j011j095m83R8J0
$$ 277493 277673 277981 278010 277560 276746 275979 275757 276187 276743 276792 276339 275903 275676 275214 274203 273108 272625 272723 272733
52878B72733l46j05P37J189N42o59j228o75M31J332J896K428K972L161K665J635
$$ 272733 272387 272282 273019 274208 274750 274091 272863 272188 272619 273951 275847 278275 281247 284408 287073 288708
52862B88708O56L39Q48J696K130J818J130O18L72O2n32j280j911k299k545k847
$$ 288708 289364 289703 290551 292247 294377 296195 297325 297943 298315 298377 297845 296565 294654 292355 289810 286963
52846B86963l220l319k805j938j443j644k075k229k237k384k405j914j195q80
$$ 286963 283743 280424 277619 275681 274238 272594 270519 268290 266053 263669 261264 259350 258155 257275
52832B57275r95j000o98l82j48K26O87Q65P74P90Q60N15j38k94L15Q48N23l40
$$ 257275 256280 255280 254582 254200 254052 254278 254965 255830 256604 257394 258254 258769 258631 258337 258652 259500 260023 259683
52814B59683r06r29o61k39K59N75P12J083J785K149J673Q75N00L74j30q13q83
$$ 259683 258777 257848 257187 256948 257207 257782 258494 259577 261362 263511 265184 266059 266559 266933 266803 265990 265107
52797B65107k95J03j13l87k54j17n28j259j657j523j189r37p17n14n34r08j272
$$ 265107 264812 264915 264802 264415 264161 264044 263516 262257 260600 259077 257888 256951 256234 255720 255186 254278 253006
52780B53006j013j8J015J315R34N34L68P3m45o97m37j40j12P6O22P16k97j498
$$ 253006 251993 251975 252990 254305 255239 255773 256141 256214 255769 255072 254635 254495 254383 254459 255081 255797 255500 254002
52762B54002j447k91M33J13k05K45P16L42l16j79O80J292J285J068Q23K85l91
$$ 254002 252555 252264 252697 252810 252605 252850 253566 253908 253592 253413 254093 255385 256670 257738 258561 258846 258455
52745B58455m91K85J323J910K086K314K615K544J896J116P73Q66Q69M89J03K65
$$ 258455 257964 258249 259572 261482 263568 265882 268497 271041 272937 274053 274826 275692 276561 277050 277153 277418
52729B77418R42J574J758J557J094L28n24q42k68O41R15K53p29j301j331j138
$$ 277418 278360 279934 281692 283249 284343 284671 284147 283305 283037 283678 284593 284846 284117 282816 281485 280347
52713B80347j016j042j139j137q79m49j89l06n47m96j67k7l04n82l74J23K95P0
$$ 280347 279331 278289 277150 276013 275134 274685 274496 274190 273643 273147 272980 272953 272649 272067 271693 271816 272111 272181
52695B72181J09Q49J746J912J208L53J7K10M97N11K33j2J73P44J074O24l44j009
$$ 272181 272290 273139 274885 276797 278005 278358 278375 278585 279082 279593 279826 279814 279987 280731 281805 282429 282085 281076
52677B81076r69n84l72m63p03r24r49o85l05n8J99Q21J661K030J647J113J053
$$ 281076 280107 279523 279151 278688 277985 277061 276112 275427 275122 275064 275263 276084 277745 279775 281422 282535 283588
52660B83588J221J015N08K61L62L52J80M21J294K077J987J275Q99J261J798J796
$$ 283588 284809 285824 286332 286593 286955 287307 287487 287908 289202 291279 293266 294541 295440 296701 298499 300295
52644C00295J187L46n36j451k194k363j930j440j352j378q21M53J714K155J710
$$ 300295 301482 301828 301292 299841 297647 295284 293354 291914 290562 289184 288363 288816 290530 292685 294395
52629B94395R99O40P98J224J544J581J485J413J151L02j079k321k807k504j696
$$ 294395 295394 296034 296832 298056 299600 301181 302666 304079 305230 305532 304453 302132 299325 296821 295125
52614B95125o07M24P91J93q46j499j544j300q49M7J268K200K415K022J243K22
$$ 295125 294518 294942 295733 295926 295080 293581 292037 290737 289888 289935 291203 293403 295818 297840 299083 299305
52598B99305o60q99m93RL38O97R71N17p04j594j252k61K41K55O61J549K057J810
$$ 299305 298645 297746 297253 297262 297600 298297 299268 299785 299081 297487 296235 295974 296215 296470 297131 298680 300737 302547
52580C02547J508J694J947J721J157O08J9o09q06k31P03J341J570J492Q89l84
$$ 302547 304055 305749 307696 309417 310574 311182 311201 310592 309786 309555 310258 311599 313169 314661 315550 315166
52564C15166j692k108j545q38o93r79j134q58l64j81o30j394j820j772j749j894
$$ 315166 313474 311366 309821 308983 308290 307311 306177 305319 304955 304774 304144 302750 300930 299158 297409 295515
52548B95515j522k39J107J423R32P05R02O48k29o62J0R19R06J47k89K4N89R07
$$ 295515 293993 293754 294861 296284 297216 297921 298823 299471 299242 298580 298590 299509 300415 300562 300273 300297 300886 301793
52530C01793R42P48L08k06m69l52O4P64J766K718K919J960L45p58n18O89J640
$$ 301793 302735 303483 303791 303585 303116 302764 302828 303592 305358 308076 310995 312955 313300 312542 312024 312713 314353
52513C14353J633J268J557K592L576M033M235M394M184L345K173J120L33j81m74
$$ 314353 315986 317254 318811 321403 324979 329012 333247 337641 341825 345170 347343 348463 348796 348615 348141
52498C48141r55k087l505m152l643k801k420k306k091k084k473k445j323O0L12
$$ 348141 347186 345099 341594 337442 333799 330998 328578 326272 324181 322097 319624 317179 315856 315916 316228
52483C16228n07j021n84J10M19N42P09P24O52R55J528J559Q23K28M66J003J054
$$ 316228 315721 314700 314116 314226 314645 315187 315896 316620 317272 318227 319755 321314 322137 322365 322831 323834 324888
52466C24888Q72J200J959K425K402K428K829L274L339K979K288J219k41j747k718
$$ 324888 325760 326960 328919 331344 333746 336174 339003 342277 345616 348595 350883 352102 351861 350114 347396
52451C47396k809k305j902k035k534l089l756m613n177m775l443j898o06L97P97
$$ 347396 344587 342282 340380 338345 335811 332722 328966 324353 319176 314401 310958 309060 308454 308851 309648
52436C09648N3j451k227j390J44Q61M88j02l61m30l63N9O48Q76P37Q12J264J466
$$ 309648 309701 308250 306023 304633 304777 305638 306126 306024 305663 305233 304870 304929 305577 306453 307190 308002 309266 310732
52418C10732R65J85k00j23J36O22J560K766L709M221M702N500O443P136P563Q099
$$ 310732 311697 311882 311682 311559 311695 312317 313877 316643 320352 324573 329275 334775 341218 348354 355917 364016
52402C64016Q870R375Q910P344N246L312J776M14j073k773m501n867o573o710
$$ 364016 372886 382261 391171 398515 403761 407073 408849 409263 408190 405417 400916 395049 388476 381766
52388C81766o650o527o060n035l762k748k056j250l1J352K351K620K284J829J776
$$ 381766 375116 368589 362529 357494 353732 350984 348928 347678 347647 348999 351350 353970 356254 358083 359859
52373C59859K290L083L793M358M903N377N543N325M871M220L186J737K80o52r87
$$ 359859 362149 365232 369025 373383 378286 383663 389206 394531 399402 403622 406808 408545 408825 408173 407186
52358D07186j130j353j446j072l71J26J45J2J88O51R92R83Q25Q19J106J737K716
$$ 407186 406056 404703 403257 402185 401814 401940 402085 402097 402285 402936 403928 404911 405736 406555 407661 409398 412114
52341D12114L811M558M670M378M255M672N517O380O967P363P869Q619R488J0395
$$ 412114 415925 420483 425153 429531 433786 438458 443975 450355 457322 464685 472554 481173 490661 501056
52327E01056J1504J2889J4240J5226J5937J6680J7378J7765J8025J8636J9460
$$ 501056 512560 525449 539689 554915 570852 587532 604910 622675 640700 659336 678796
52316F78796J9653J8764J7374J6309J5719J5406J5452J6004J6786J7425J7953
$$ 678796 698449 717213 734587 750896 766615 782021 797473 813477 830263 847688 865641
52305H65641J8405J8314J7260J5810J5114J5488J6004J5583J3960J1637R358P711
$$ 865641 884046 902360 919620 935430 950544 966032 982036 997619 1011579 1023216 1032574 1040285
52293A040285O632N277K920L6k137l139l779m834o066o874p243p491p596p344
$$ 1040285 1046917 1052194 1055114 1055150 1053013 1049874 1046095 1041261 1035195 1028321 1021078 1013587 1005991 998647
52279I98647o772n919m485k383k69J118K014L311N284P293Q796R906J0816J1288
$$ 998647 991875 985956 981471 979088 978819 979937 981951 985262 990546 997839 1006635 1016541 1027357 1038645
52265A038645J1108J0602J0342J0559J1166J2088J3266J4461J5300J5512J5060
$$ 1038645 1049753 1060355 1070697 1081256 1092422 1104510 1117776 1132237 1147537 1163049 1178109
52254A178109J4241J3660J3815J4477J4714J3841J2110J0277Q593O638M099J352
$$ 1178109 1192350 1206010 1219825 1234302 1249016 1262857 1274967 1285244 1293837 1300475 1304574 1305926
52242A305926r01k435l701n211o818p786p725p259p335p992q346p979p662q065
$$ 1305926 1305025 1302590 1298889 1293678 1286860 1279074 1271349 1264090 1256755 1248763 1240417 1232438 1224776 1216711
52228A216711q400p239m610k247j547k094k542k244j456n30L74J074J512K040
$$ 1216711 1208311 1201072 1196462 1194215 1192668 1190574 1188032 1185788 1184332 1183802 1184176 1185250 1186762 1188802
52214A188802L004M186N067N558N962O343O481O449O681P329Q010Q279Q009P272
$$ 1188802 1191806 1195992 1201059 1206617 1212579 1218922 1225403 1231852 1238533 1245862 1253872 1262151 1270160 1277432
52200A277432O264N465N353N786O123O106O170O604O965O757O310O355O948P321
$$ 1277432 1283696 1289161 1294514 1300300 1306423 1312529 1318699 1325303 1332268 1339025 1345335 1351690 1358638 1365959
52186A365959O794N456L902K619J612M71j237l499n815p721r183j0356j1180j1475
$$ 1365959 1372753 1378209 1382111 1384730 1386342 1386813 1385576 1382077 1376262 1368541 1359358 1349002 1337822 1326347
52172A326347j1237j0558r459q093o927o327o046n478m354k898j350J90J501K285
$$ 1326347 1315110 1304552 1295093 1287000 1280073 1273746 1267700 1262222 1257868 1254970 1253620 1253810 1255311 1257596
52158A257596K608K866L164L135K501J477M20n53j367j839k016k251k549k277
$$ 1257596 1260204 1263070 1266234 1269369 1271870 1273347 1273767 1273214 1271847 1270008 1267992 1265741 1263192 1260915
52144A260915j019N72J433J412J215J087M54q83k036k120j486j183j503j714j034
$$ 1260915 1259896 1260468 1261901 1263313 1264528 1265615 1266069 1265186 1263150 1261030 1259544 1258361 1256858 1255144 1254110
52129A254110P44L429O599R602J1988J4019J6285J8784K1002K2828K4668K6491
$$ 1254110 1254854 1258283 1264882 1274484 1286472 1300491 1316776 1335560 1356562 1379390 1404058 1430549
52117A430549K7593K7688K7416K7268K6814K5657K4387K3658K2890K1049J8355
$$ 1430549 1458142 1485830 1513246 1540514 1567328 1592985 1617372 1641030 1663920 1684969 1703324
52106A703324J6001J4337J2615J0557Q991Q421Q174P557O850O417N719M146K147
$$ 1703324 1719325 1733662 1746277 1756834 1765825 1774246 1782420 1789977 1796827 1803244 1808963 1813109 1815256
52093A815256N79p25k675n424q136j0196j1921j3790j5648j6865j6957j5970j4511
$$ 1815256 1815835 1815110 1812435 1807011 1798875 1788679 1776758 1762968 1747320 1730455 1713498 1697528 1683017
52080A683017j3340j2589j1507r440o807m585k926j109J167L301M854O317Q277
$$ 1683017 1669677 1657088 1645581 1636141 1629334 1624749 1621823 1620714 1621881 1625182 1630036 1636353 1644630
52067A644630J0433J2065J3090J3912J4514J4469J3792J3074J2620J2136J1450
$$ 1644630 1655063 1667128 1680218 1694130 1708644 1723113 1736905 1749979 1762599 1774735 1786185
52056A786185J0945J0748J0111Q341N962M191L302K327N51j598l557n711q709
$$ 1786185 1797130 1807878 1817989 1826330 1832292 1836483 1839785 1842112 1842663 1841065 1837508 1831797 1823088
52043A823088j2233j5288j7464j9103k0358k0948k0908k0738k0648k0328j9647
$$ 1823088 1810855 1795567 1778103 1759000 1738642 1717694 1696786 1676048 1655400 1635072 1615425
52032A615425j8884j8061j6778j5035j3507j2568j1757j0714r934r949j0343j0392
$$ 1615425 1596541 1578480 1561702 1546667 1533160 1520592 1508835 1498121 1488187 1478238 1467895 1457503
52020A457503j0244j0590j1419j1923j1632j0914j0363j0212j0367j0577j0570
$$ 1457503 1447259 1436669 1425250 1413327 1401695 1390781 1380418 1370206 1359839 1349262 1338692
52009A338692j0439j0736j1801j3230j4377j5208j6095j7134j8256j9705k1600
$$ 1338692 1328253 1317517 1305716 1292486 1278109 1262901 1246806 1229672 1211416 1191711 1170111
51998A170111k3243k3714k3067k2122k1136j9683j7909j6748j6492j6155j4900
$$ 1170111 1146868 1123154 1100087 1077965 1056829 1037146 1019237 1002489 985997 969842 954942
51987I54942j3283j2349j2107j1864j1580j1952j3172j4450j5001j4981j5123
$$ 954942 941659 929310 917203 905339 893759 881807 868635 854185 839184 824203 809080
51976H09080j5733j6327j6271j5520j4629j4030j3528j2618j1116r163o767l815
$$ 809080 793347 777020 760749 745229 730600 716570 703042 690424 679308 670145 663378 659563
51964F59563n91K224M236N650O746P400P362O729N854M932L914K628Q68j353l552
$$ 659563 658972 661196 665432 671082 677828 685228 692590 699319 705173 710105 714019 716647 717515 716162 712610
51949G12610n008n466n366n179m819l933k468o22J522L852N903P142P666Q215
$$ 712610 707602 702136 696770 691591 686772 682839 680371 679749 681271 685123 691026 698168 705834 714049
51935G14049R341J0743J1608J1434J0378Q811O799M190J081k070m803p035q900
$$ 714049 723390 734133 745741 757175 767553 776364 783163 787353 788434 786364 781561 774526 765626
51922G65626j0471j1767j2817j3550j3712j3131j1929j0280q137n477k705m47
$$ 765626 755155 743388 730571 717021 703309 690178 678249 667969 659832 654355 651650 651203
51910F51203R64J582J541R97K34n39j393k352l022k994k399j600n60Q58K059K022
$$ 651203 652167 653749 655290 656287 656521 655982 654589 652237 649215 646221 643822 642222 641662 642520 644579 646601
51894F46601N32j622l816o187q706j0624j1387j1561j2102j3057j3563j2867j0843
$$ 646601 647133 645511 641695 635508 626802 616178 604791 593230 581128 568071 554508 541641 530798
51881E30798p827m525j895m01O32K356N025P731R514J0279J0487J0375R879R050
$$ 530798 522971 518446 516551 516150 516782 519138 524163 531894 541408 551687 562174 572549 582428 591478
51867E91478Q039O670M476J409j686l723m537m973n707o394o344n648n031m646
$$ 591478 599517 606187 610663 612072 610386 606663 602126 597153 591446 585052 578708 573060 568029 563383
51853E63383l713j547J406L802M495L363J357k68j006j507k697m627o439p391
$$ 563383 559670 558123 559529 563331 567826 571189 572546 572278 571272 569765 567068 562441 556002 548611
51839E48611p502p249p068p138p218o745n490m018l023k325j219K65J249J247
$$ 548611 541109 533860 526792 519654 512436 505691 500201 496183 493160 490835 489616 489881 491130 492377
51825D92377P52L83K19K23N03P23Q0j610l354m130l993l544k894j842n92M26J175
$$ 492377 493129 493512 493731 493954 494457 495180 495260 493650 490296 486166 482173 478629 475735 473893 473301 473727 474902
51808D74902J824K171J879J145O15O66J083J351J059K41n65q41p42q80j358j666
$$ 474902 476726 478897 480776 481921 482536 483202 484285 485636 486695 486936 486371 485530 484788 483908 482550 480884
51792D80884j597j550j672j528j088j144k076l031l036k297j569r55k11L40K96
$$ 480884 479287 477737 476065 474537 473449 472305 470229 467198 464162 461865 460296 459341 459130 459470 459766
51777D59766Q8M12R83R08J45l84l1J070K647M589O653Q548J0276J1778J2572J2428
$$ 459766 459854 460266 461249 462157 462302 461918 461887 462957 465604 470193 476846 485394 495670 507448 520020 532448
51761E32448J2004J1888J1425R540O505L663J484p98l588o195q049r488j0848
$$ 532448 544452 556340 567765 577305 583810 587473 588957 588159 584571 578376 570327 560839 549991
51748E49991j1787j1975j1634j0983r820q142o428m966l489j846l78P20J767L093
$$ 549991 538204 526229 514595 503612 493792 485650 479222 474256 470767 468921 468543 469263 471030 474123
51734D74123M723O706Q975J0644J0429Q297N837M428L771K838J549O25K92jo87
$$ 474123 478846 485552 494527 505171 515600 523897 529734 534162 537933 540771 542320 542945 543237 543236 542549
51719E42549j549k092k133k079k643m002n221n083l666k361k185k791l411l845
$$ 542549 541000 538908 536775 534696 532053 528051 522830 517747 514081 511720 509535 506744 503333 499488
51705D99488l979l216j278R97K552L306L737L787L174K416K378K856K665J437
$$ 499488 495509 492293 491015 492012 494564 497870 501607 505394 508568 510984 513362 516218 518883 520320
51691E20320L41N76J712K204J225m96j736k149k425l203m280n044n316n278m818
$$ 520320 520661 521237 522949 525153 526378 525882 524146 521997 519572 516369 512089 507045 501729 496451 491633
51676D91633l597j814k27Q01J619K426K813K565K345K864L943M937N725O555P237
$$ 491633 488036 486222 485995 486796 488415 490841 493654 496219 498564 501428 505371 510308 516033 522588 529825
51661E29825P253O506N278L647J572n25j959k591k804k728k065p26R72K816M783
$$ 529825 537078 543584 548862 552509 554081 553556 551597 549006 546202 543474 541409 540683 541655 544471 549254
51646E49254O466O995N847L395M28k538n281p679r734j1573j3110j3920j3657
$$ 549254 555720 562715 568562 571957 572385 569847 564566 556887 547153 535580 522470 508550 494893
51633D94893j2474j0785q865o836m976l636k823k025p19R21J985J733N07m61l20
$$ 494893 482419 471634 462769 455933 450957 447321 444498 442473 441754 442675 444660 446393 446900 446439 446119
51618D46119N35J005N38l87q75m93M17J091R80K16n59q57p54n86l92ON37P77N05
$$ 446119 446654 447659 448197 447810 446935 446442 446859 447950 448930 449146 448587 447730 446976 446390 445998 446004 446541 447318 447823
51599D47823J29L68J516L119M480N441O479P916R222R453Q346O606M983L439J489
$$ 447823 447952 448320 449836 452955 457435 462876 469355 477271 486493 495946 504292 510898 515881 519320 520809
51584E20809q30k791l732l740l436l144k400m38K792O257Q791J0238J1422J3037
$$ 520809 519979 517188 513456 509716 506280 503136 500736 500298 503090 509347 518138 528376 539798 552835
51570E52835J5067J7267J9617K2044K4136K5486K6105K6259K6253K6583K7864
$$ 552835 567902 585169 604786 626830 650966 676452 702557 728816 755069 781652 809516
51559H09516L0188L2855L5150L7122L9166M1012M1644M0157L6293L0259K2359
$$ 809516 839704 872559 907709 944831 983997 1025009 1066653 1106810 1143103 1173362 1195721
51548A195721J3003K722p873j8064k7093l4426l9971m3873m6211m7001m6384m4652
$$ 1195721 1208724 1211446 1203573 1185509 1158416 1123990 1084019 1040146 993935 946934 900550 855898
51536H55898m2168l9346l6464l3363k9577k5028k0403j6681j4368j3286j2806
$$ 855898 813730 774384 737920 704557 674980 649952 629549 612868 598500 585214 572408
51525E72408j2150j0861r221p972p352o716n350l346j337K08J104J276R79Q98
$$ 572408 560258 549397 540176 532204 524852 518136 512786 509440 508103 508311 509415 510691 511670 512568
51511E12568J480K310K587J986O88j150l286n028n714n550n319n305n087m443
$$ 512568 514048 516358 518945 520931 521619 520469 517183 512155 506441 500891 495572 490267 485180 480737
51497D80737l788l438l109k435j601j043q60q10p23o23n56n24n54o97r82j377
$$ 480737 476949 473511 470402 467967 466366 465323 464463 463653 462930 462307 461751 461227 460673 459976 458994 457617
51481D57617j796k146k428k737l089l409l670l924m120m036l562k841k121j616
$$ 457617 455821 453675 451247 448510 445421 442012 438342 434418 430298 426262 422700 419859 417738 416122
51467D16122j567k005k447k269j546j016r77q90l61R0r4n74o79m20j52L08J320
$$ 416122 414555 412550 410103 407834 406288 405272 404295 403405 403044 403134 403040 402466 401787 401367 401215 401523 402843
51450D02843K545L352L846M532N238N451N621O845R162J1325J2582J3482J4453
$$ 402843 405388 408740 412586 417118 422356 427807 433428 440273 449435 460760 473342 486824 501277
51437E01277J4692J3235J0359P177M484K554J433P27l99k294m291n660o572p558
$$ 501277 515969 529204 539563 546740 551224 553778 555211 555938 555539 553245 548954 543294 536722 529164
51423E29164q433q567p925p079o353n630m912m349l704k445n93J015J574J216
$$ 529164 520731 512164 504239 497160 490807 485177 480265 475916 472212 469767 469174 470189 471763 472979
51409D72979Q48J276K550M007M768M333K912J329N56R99K079K668K276J621J667
$$ 472979 473827 475103 477653 481660 486428 490761 493673 495002 495558 496557 498636 501304 503580 505201 506868
51394E06868K354K821K828L176M529O492Q248R599J0981J2814J5296J8513K2367
$$ 506868 509222 512043 514871 518047 522576 529068 537316 546915 557896 570710 586006 604519 626886
51381F26886K6705L1662L7504M3815M9432N3651N7097O0711O4074O5399O3079
$$ 626886 653591 685253 722757 766572 816004 869655 926752 987463 1051537 1116936 1180015
51370A180015N6891M7821L7197K5893J4008J292j1881k4333l5017m3793n0827
$$ 1180015 1236906 1284727 1321924 1347817 1361825 1363117 1351236 1326903 1291886 1248093 1197266
51359A197266n5784n8368n9202n9261n8511n6043n1699m6600m1806l7228l2338
$$ 1197266 1141482 1083114 1023912 964651 906140 850097 798398 751798 709992 672764 640426
51348F40426k7292k2680j8769j5572j3393j2479j2269j1672j0312q904q207q012
$$ 640426 613134 590454 571685 556113 542720 530241 517972 506300 495988 487084 478877 470865
51336D70865p577o654n609m692l728k751k293k702l458l665l105k320j715j129
$$ 470865 463288 456634 451025 446333 442605 439854 437561 434859 431401 427736 424631 422311 420596 419467
51322D19467m12J32J63j72m36l70O7P72J346J222M15j04O75K546M208M628L935
$$ 419467 419055 419187 419350 419178 418742 418372 418439 419211 420557 421779 422194 422090 422765 425311 429519 434147 438082
51305D38082K962K306J964J619J001J24p44j375j829k323k910l454l834m062m178
$$ 438082 441044 443350 445314 446933 447934 448058 447314 445939 444110 441787 438877 435423 431589 427527 423349
51290D23349m172l987l548k801j834q89j34M57R95J609K515L820N100N533M821
$$ 423349 419177 415190 411642 408841 407007 406118 405984 406441 407436 409045 411560 415380 420480 426013 430834
51275D30834L721L242L512L782L468K702J890J248Q52P38Q48J074J452J991K309
$$ 430834 434555 437797 441309 445091 448559 451261 453151 454399 455251 455989 456837 457911 459363 461354 463663
51260D63663J886P57m19j131j471j687j703j447j217j357j776k217k756l558m266
$$ 463663 465549 466306 465887 464756 463285 461598 459895 458448 457231 455874 454098 451881 449125 445567 441301
51245D41301m243l489k782k648k666k175j289p22p95j139j405j667j981k038j617
$$ 441301 437058 433569 430787 428139 425473 423298 422009 421287 420492 419353 417948 416281 414300 412262 410645
51230D10645j070q97j028r58m94J4K01P2j55k42R0R91K156K975L124K759K126
$$ 410645 409575 408678 407650 406692 406198 406212 406413 406485 406330 406088 406178 407169 409325 412300 415424 418183 420309
51213D20309J396R30J163J959K560K471K081K008K231K361K439K810L355L452
$$ 420309 421705 422635 423798 425757 428317 430788 432869 434877 437108 439469 441908 444718 448073 451525
51199D51525K805J857J245J127J178R64K31r41k166k950k978k301j406j004j396
$$ 451525 454330 456187 457432 458559 459737 460701 460932 459991 457825 454875 451897 449596 448190 447186 445790
51184D45790j903j454O1J456J639Q76J19l70q81j159n39P61J502J024J14k06n1
$$ 445790 443887 442433 442494 443950 445589 446465 446584 446214 445333 444174 443635 444396 445898 446922 447036 446830 446779
51167D46779k01p64j105q28k11M01R96J686K365K791K819K487K048J828J979K333
$$ 446779 446578 445814 444709 443881 443670 444071 445067 446753 449118 451909 454728 457215 459263 461091 463070 465403
51151D65403K582K473J857O87p98k060k617k452k018j877k299l077l670l656l110
$$ 465403 467985 470458 472315 473002 472204 470144 467527 465075 463057 461180 458881 455804 452134 448478 445368
51136D45368k445j910j418q85m84m50p71j124j081m48L87O81K08k07M20J877K923
$$ 445368 442923 441013 439595 438710 438226 437776 437005 435881 434800 434352 434739 435420 435628 435421 435841 437718 440641
51119D40641K943K683K990L552L575L134K992L325L567L457L405L656L781L346
$$ 440641 443584 446267 449257 452809 456384 459518 462510 465835 469402 472859 476264 479920 483701 487047
51105D87047K548J821J338J201J653K601L236K760J423L15R8L58L58Rk19j31j25
$$ 487047 489595 491416 492754 493955 495608 498209 501445 504205 505628 505943 506041 506399 506757 506766 506547 506416 506291
51088E06291n86j295j662j468j034o51k18L84Q33P56L63K04K50j48j085j486k89
$$ 506291 505705 504410 502748 501280 500246 499595 499377 499761 500594 501350 501713 501917 502167 502019 500934 499448 499159
51071D99159J954L430L126J967J629K668M262N480O293P285Q868J0938J3075J4848
$$ 499159 501113 504543 507669 509636 511265 513933 518195 523675 529968 537253 546121 557059 570134 584982
51057E84982J5994J6445J6232J5446J4390J3633J3681J4450J5359J5986J6343
$$ 584982 600976 617421 633653 649099 663489 677122 690803 705253 720612 736598 752941
51046G52941J6440J5905J4391J2164R771P234M020r3m462q062j0295j1206j1345
$$ 752941 769381 785286 799677 811841 821612 828846 832866 832773 828311 820249 809954 798748 787403
51033G87403j1497j2271j3498j4285j4014j3179j2878j3573j4617j5027j4301
$$ 787403 775906 763635 750137 735852 721838 708659 695781 682208 667591 652564 638263
51022F38263j2494r871o802l778j294M05J513K604M263O516Q637R714R478Q450
$$ 638263 625769 615898 609096 605318 604024 604429 605942 608546 612809 619325 627962 637676 647154 655604
51008F55604P390O836P077Q134R586J0788J1434J1728J1860J1708J1247J0863
$$ 655604 662994 669830 676907 685041 694627 705415 716849 728577 740437 752145 763392 774255
50996G74255J0904J1170J1203J0876J0298R360P862O023M386L199K250J325M27
$$ 774255 785159 796329 807532 818408 828706 838066 845928 851951 856337 859536 861786 863111 863538
50983H63538m05j053j122k52J369L188N042P158R386J1108J2141J3093J4459J6020
$$ 863538 863133 862080 860958 860706 862075 865263 870305 877463 886849 897957 910098 923191 937650 953670
50969I53670J7525J9402K2199K5739K9485L3305L7211M0814M3844M6883N0656
$$ 953670 971195 990597 1012796 1038535 1068020 1101325 1138536 1179350 1223194 1270077 1320733
50958A320733N4695N7710N9318O0415O1564O2033O0922N8424N5318N1852M7927
$$ 1320733 1375428 1433138 1492456 1552871 1614435 1676468 1737390 1795814 1851132 1902984 1950911
50947A950911M3915M0504L7767L5120L2222K9481K7537K6582K6215K5702K4361
$$ 1950911 1994826 2035330 2073097 2108217 2140439 2169920 2197457 2224039 2250254 2275956 2300317
50936B300317K1953J8813J5475J2165Q769N127J180l159q038j3498j9367k5420
$$ 2300317 2322270 2341083 2356558 2368723 2377492 2382619 2383799 2380640 2372602 2359104 2339737 2314317
50924B314317l1627l8119m4812n1113n6221n9909o2798o5543o7897o8964o8319
$$ 2314317 2282690 2244571 2199759 2148646 2092425 2032516 1969718 1904175 1836278 1767314 1698995
50913A698995o6416o3822o0534n6363n1556m6718m2317l8543l5428l2850l0524
$$ 1698995 1632579 1568757 1508223 1451860 1400304 1353586 1311269 1272726 1237298 1204448 1173924
50902A173924k8200k5753k3058k0072j7170j5052j4026j3610j3068j2068j0672
$$ 1173924 1145724 1119971 1096913 1076841 1059671 1044619 1030593 1016983 1003915 991847 981175
50891I81175q988p212n705m694l993l253k248q49R46K638L319K677J624J402K214
$$ 981175 972187 964975 959270 954576 950583 947330 945082 944233 945179 947817 951136 953813 955437 956839 959053
50876I59053L205L715M047M891O437Q201R569J0394J1125J2315J3952J5488J6611
$$ 959053 962258 965973 970020 974911 981348 989549 999118 1009512 1020637 1032952 1046904 1062392 1079003
50863A079003J7671J9162K1071K3100K5201K7577L0383L3694L7576M1867M6206
$$ 1079003 1096674 1115836 1136907 1160007 1185208 1212785 1243168 1276862 1314438 1356305 1402511
50852A402511N0653N5848O2179O9107P5935Q2799R0273R8191J05719J12530J19049
$$ 1402511 1453164 1509012 1571191 1640298 1716233 1799032 1889305 1987496 2093215 2205745 2324794
50841B324794J25429J30971J34804J36600J36389J34105J29642J23086J14747
$$ 2324794 2450223 2581194 2715998 2852598 2988987 3123092 3252734 3375820 3490567
50832C490567J05062R4342Q2483O9295N5473M2880L3126K6220K1257J8101J7398
$$ 3490567 3595629 3689971 3772454 3841749 3897222 3940102 3973228 3999448 4020705 4038806 4056204
50821D056204J9106K2214K6082L0835L5988L9762M0375L7275L0539J9957N564
$$ 4056204 4075310 4097524 4123606 4154441 4190429 4230191 4270566 4307841 4338380 4358337 4363901
50810D363901j1594l0115m9333o9072q8769j07593j25081j40836j53799j62693
$$ 4363901 4352307 4322192 4272859 4203787 4115018 4007425 3882344 3741508 3587709 3425016
50800C425016j67180j67939j65621j60382j52491j42752j32038j20817j09309
$$ 3425016 3257836 3089897 2924276 2763894 2611403 2468651 2336613 2215796 2106487
50791B106487r7741q6313p5172o4545n4739m5898l7946l0824k4591j9314j5040
$$ 2106487 2008746 1922433 1847261 1782716 1727977 1682079 1644133 1613309 1588718 1569404 1554364
50780A554364j1897r958q929q180p237o248n793o308p673r385j1016j2398j3417
$$ 1554364 1542467 1532509 1523580 1515400 1508163 1501915 1496122 1489814 1482141 1472756 1461740 1449342 1435925
50767A435925j3981j4261j4787j5866j7104j7789j7761j7501j7436j7522j7464
$$ 1435925 1421944 1407683 1392896 1377030 1359926 1342137 1324376 1306875 1289439 1271917 1254453
50756A254453j6902j5425j2930j0155q244p542p078n631k958J75K901M927O635
$$ 1254453 1237551 1222126 1209196 1199041 1190797 1183255 1176177 1170546 1167588 1167763 1170664 1175591 1182226
50743A182226Q757J1762J5440J9253K3044K7041L1267L5580M0241M5597N1036
$$ 1182226 1190983 1202745 1218185 1237438 1260482 1287523 1318790 1354370 1394611 1440208 1491244
50732A491244N5213N7779N9952O2690O5197O6206O6044O6131O6825O7050O6068
$$ 1491244 1546457 1604236 1664188 1726878 1792075 1858281 1924325 1990456 2057281 2124331 2190399
50721B190399O4388O2572O0249N6767N2091M6466L9762L1751K2739J3472M656
$$ 2190399 2254787 2317359 2377608 2434375 2486466 2532932 2572694 2604445 2627184 2640656 2645312
50710B645312l048q828j1989j2444j0684p370l098J549O093J0337J4345J8040
$$ 2645312 2642264 2633436 2621447 2609003 2598319 2590949 2587851 2589400 2595493 2605830 2620175 2638215
50698B638215K0873K1905K0334J5861Q611j132j2915k5963l9362n2455o4775p5572
$$ 2638215 2659088 2680993 2701327 2717188 2725799 2724667 2711752 2685789 2646427 2593972 2529197 2453625
50686B453625q3760q8619r0338q9667q7234q3314p7975p1229o3244n4546m5829
$$ 2453625 2369865 2281246 2190908 2101241 2014007 1930693 1852718 1781489 1718245 1663699 1617870
50675A617870l7461k9401k1735j4790q519k351L966R767J4193J7152J9113K0321
$$ 1617870 1580409 1551008 1529273 1514483 1505964 1503613 1507579 1517346 1531539 1548691 1567804 1588125
50663A588125K0795K0814K0707K0361J9434J8011J6603J5636J5371J6004J7270
$$ 1588125 1608920 1629734 1650441 1670802 1690236 1708247 1724850 1740486 1755857 1771861 1789131
50652A789131J8271J8455J8521J9645K1920K4462K6903K9795L3320L6715L9452
$$ 1789131 1807402 1825857 1844378 1864023 1885943 1910405 1937308 1967103 2000423 2037138 2076590
50641B076590M2127M5598M9775N3926N7659O0952O3535O4861O4729O3452O1497
$$ 2076590 2118717 2164315 2214090 2268016 2325675 2386627 2450162 2515023 2579752 2643204 2704701
50630B704701N9203N6837N4625N2675N0930M8960M5703L9594K9401J5188j427
$$ 2704701 2763904 2820741 2875366 2928041 2978971 3027931 3073634 3113228 3142629 3157817 3156390
50619C156390j7975l2337m3563n1610n6330n7113n3814m7657m0538l3548k6706
$$ 3156390 3138415 3106078 3062515 3010905 2954575 2897462 2843648 2795991 2755453 2721905 2695199
50608B695199k0015j3996r083n346l272m001q132j4733k2219k9993l8533m8038
$$ 2695199 2675184 2661188 2652105 2646759 2643487 2639486 2631354 2616621 2594402 2564409 2525876 2477838
50596B477838n7614o5879p1872p5303p6407p5875p4577p2939p0568o6787o1609
$$ 2477838 2420224 2354345 2282473 2207170 2130763 2054888 1980311 1907372 1836804 1770017 1708408
50585A708408n6031n1135m7105m3310l9327l5446l2084k9151k6318k3588k1089
$$ 1708408 1652377 1601242 1554137 1510827 1471500 1436054 1403970 1374819 1348501 1324913 1303824
50574A303824j8590j5723j2552r416o347l160m9K533M633O785R123J1166J2661
$$ 1303824 1285234 1269511 1256959 1247543 1241196 1238036 1237987 1240520 1245153 1251938 1261061 1272227 1284888
50561A284888J4056J5818J7849J9902K2029K4264K6289K7856K9124L0208L0826
$$ 1284888 1298944 1314762 1332611 1352513 1374542 1398806 1425095 1452951 1482075 1512283 1543109
50550A543109L0794L0457L0147K9661K8750K7738K7076K6639K6157K6109K7388
$$ 1543109 1573903 1604360 1634507 1664168 1692918 1720656 1747732 1774371 1800528 1826637 1854025
50539A854025L0170L3789L7849M2661M8434N4721O1026O7546P4757Q2646R0717
$$ 1854025 1884195 1917984 1955833 1998494 2046928 2101649 2162675 2230221 2304978 2387624 2478341
50528B478341R8589J06185J13449J20289J26815J33264J39438J44502J47514J48173
$$ 2478341 2576930 2683115 2796564 2916853 3043668 3176932 3316370 3460872 3608386 3756559
50518C756559J46683J43001J36469J26457J13111R7221P9431N9893L8720J6469
$$ 3756559 3903242 4046243 4182712 4309169 4422280 4519501 4598932 4658825 4697545 4714014
50508D714014n936k7640m8163o7305q4777r9748j10951j17451j19254j16876j10547
$$ 4714014 4708078 4680438 4632275 4564970 4480193 4380445 4269494 4152043 4032789 3915913 3805366
50497C805366j00250q6558p0719n3752l5976j7742k33J5019K7025L5282L9036
$$ 3805366 3705116 3618558 3547839 3494087 3458111 3440369 3440136 3455155 3482180 3517462 3556498
50486C556498L7273K9572J6557n97k0800m2916o5318q6044j03584j17436j27820
$$ 3556498 3593771 3623343 3639900 3639303 3618503 3575587 3510269 3424225 3320641 3203205 3075385
50475C075385j34943j38784j39449j37346j32831j25993j17198j07486r8020q9150
$$ 3075385 2940442 2801658 2662209 2524863 2392032 2266039 2148841 2041355 1943335 1854185
50465A854185q0520p1947o3693n5927m8448m1134l4176k7815k2238j7695j4239
$$ 1854185 1773665 1701718 1638025 1582098 1533650 1492516 1458340 1430525 1408287 1390592 1376353
50454A376353j1292q195n241l360k588j705J40K336M002N423P370R605J1177J1927
$$ 1376353 1365061 1356866 1351625 1348265 1345677 1343972 1344112 1346448 1350450 1355873 1363243 1372848 1384025 1395952
50440A395952J2633J3651J4404J4350J3676J2747J1558J0139Q961Q469Q423Q148
$$ 1395952 1408585 1422236 1436640 1450990 1464666 1477413 1488971 1499110 1508071 1516540 1524963 1533111
50428A533111P363O624O795Q127R953J1374J2228J3031J4065J5123J6327J8476
$$ 1533111 1540474 1547098 1553893 1562020 1571973 1583347 1595575 1608606 1622671 1637794 1654121 1672597
50416A672597K2019K6227L0094L3704L7949M3093M8499N3627N8567O3389O7675
$$ 1672597 1694616 1720843 1750937 1784641 1822590 1865683 1914182 1967809 2026376 2089765 2157440
50405B157440P0857P2593P2753P1473O9249O6490O2927N7936N1314M3206L3472
$$ 2157440 2228297 2300890 2373643 2445116 2514365 2580855 2643782 2701718 2753032 2796238 2829710
50394B829710K1966R377l152j5423k8202m1524n3892o3785p1094p6361p9295p9133
$$ 2829710 2851676 2861053 2857901 2842478 2814276 2772752 2718860 2655075 2583981 2507620 2428325 2349192
50382B349192p5995p0874o4303n5938m5704l4553k3712j3657m236M427J1573J6379
$$ 2349192 2273197 2202323 2138020 2082082 2036378 2001825 1978113 1964456 1960220 1964647 1976220 1992599
50370A992599J8539J8100J4866Q441q84j1637k2055l1402l9964m7757n4005n8136
$$ 1992599 2011138 2029238 2044104 2052545 2051661 2040024 2017969 1986567 1946603 1898846 1844841 1786705
50358A786705o0610o2100o2415o0984n8154n5166n2732n0360m7341m3764m0161
$$ 1786705 1726095 1663995 1601580 1540596 1482442 1427276 1374544 1324184 1276843 1233079 1192918
50347A192918l6549l2466k7835k3210j9011j4890j0201m899L73M992Q814J1830
$$ 1192918 1156369 1123903 1096068 1072858 1053847 1038957 1028756 1023857 1024230 1029222 1038036 1049866
50335A049866J3811J4539J4039J2301R157M877O13k441m259n701p058p616o858
$$ 1049866 1063677 1078216 1092255 1104556 1113713 1118590 1119203 1116762 1112503 1106802 1099744 1092128 1085270
50322A085270n236l408j450O43K328L123L414L869M422M550M246L917L487K575
$$ 1085270 1080034 1076626 1075176 1075819 1078147 1081270 1084684 1088553 1092975 1097525 1101771 1105688 1109175 1111750
50308A111750J477J004J195J147M86P2P35K117L389M443N593O620P105P427Q483
$$ 1111750 1113227 1114231 1115426 1116573 1117059 1117131 1117866 1119983 1123372 1127815 1133408 1140028 1147133 1154560 1163043
50293A163043J0400J2376J3891J5410J7611K0453K3265K5215K5438K3174J8269
$$ 1163043 1173443 1185819 1199710 1215120 1232731 1253184 1276449 1301664 1327102 1350276 1368545
50282A368545J1482M092k620p694j0790j2439j3472j3964j3148j0693p560n089
$$ 1368545 1380027 1384119 1381499 1373805 1363015 1350576 1337104 1323140 1309992 1299299 1291739 1286650
50270A286650l589k399j017M26J608K243J984P76o87j556j922k665m034n127n113
$$ 1286650 1283061 1280662 1279645 1280071 1281679 1283922 1285906 1286682 1285995 1284439 1282517 1279852 1275818 1270691 1265578
50255A265578m280l362k396r76P38K033K728L600N485Q345J1376J3887J5880J7691
$$ 1265578 1261298 1257936 1255540 1254564 1255302 1257335 1260063 1263663 1269148 1277493 1288869 1302756 1318636 1336327
50241A336327J9337K0403K0735K0835K1149K1263K0474J9160J8621J9220J9509
$$ 1336327 1355664 1376067 1396802 1417637 1438786 1460049 1480523 1499683 1518304 1537524 1557033
50230A557033J7805J4038R303M123j842q627j5433k1322k5716k8274k8954k8334
$$ 1557033 1574838 1588876 1598179 1602302 1600460 1591833 1576400 1555078 1529362 1501088 1472134 1443800
50218A443800k7149k5523k3212k0673j9002j8714j9314k0375k2183k4877k7614
$$ 1443800 1416651 1391128 1367916 1347243 1328241 1309527 1290213 1269838 1247655 1222778 1195164
50207A195164k9251k9441k8551k6991k5123k3391k1925k0261j7968j5411j3312
$$ 1195164 1165913 1136472 1107921 1080930 1055807 1032416 1010491 990230 972262 956851 943539
50196I43539j1828j0578r441q653q161p525o654o114o395p223p869p914p510o989
$$ 943539 931711 921133 911692 903039 894878 887353 880699 874585 868190 860967 853098 845184 837674 830685
50182H30685o501o007n474n016m831m996n364n635n523m936m084l401l150l081
$$ 830685 824184 818177 812703 807687 802856 797860 792496 786861 781338 776402 772318 768917 765767 762686
50168G62686k653j707o77q1J4m2J63R12K186L562M525N076N758O829P809Q155
$$ 762686 760033 758326 757649 757568 757582 757540 757703 758615 760801 764363 768888 773964 779722 786551 794360 802515
50152H02515Q064Q219Q932J0016J1190J2112J2206J1097R217P397N889M398L068
$$ 802515 810579 818798 827730 837746 848936 861048 873254 884351 893568 900965 906854 911252 914320
50139I14320K717L678N150O163O818Q068J0510J3914J7735K1599K5370K9113L2927
$$ 914320 917037 920715 925865 932028 938846 946914 957424 971338 989073 1010672 1036042 1065155 1098082
50126A098082L6517L9074M0022L9848L9713M0212M0837M0886M0434M0178M0464
$$ 1098082 1134599 1173673 1213695 1253543 1293256 1333468 1374305 1415191 1455625 1495803 1536267
50115A536267M0726L9843L6960L1993K5454J7766Q995o31j0131j8221k4446k9448
$$ 1536267 1576993 1616836 1653796 1685789 1711243 1729009 1738004 1737373 1727242 1709021 1684575 1655127
50103A655127l3980l7958m0732m1943m1733m0397l8264l5777l3328l0948k8502
$$ 1655127 1621147 1583189 1542457 1500514 1458781 1418384 1380120 1344343 1311015 1280067 1251565
50092A251565k6056k3800k1658j9354j6877j4512j2370j0284q216o307m424k097
$$ 1251565 1225509 1201709 1180051 1160697 1143820 1129308 1116938 1106654 1098438 1092131 1087707 1085610
50080A085610P28L269M620M725M387M422N093O040O538N957M345K511J247N05
$$ 1085610 1086338 1089607 1094227 1098952 1103339 1107761 1112854 1118894 1125432 1131389 1135734 1138245 1139492 1139997
50066A139997l59j704l231m495n368n974o428o808p239p805q443q893q798p985
$$ 1139997 1139638 1137934 1134703 1130208 1124840 1118866 1112438 1105630 1098391 1090586 1082143 1073250 1064452 1056467
50052A056467o752n681n055m547l638k237o39R40K537M133N541O650P675Q998
$$ 1056467 1049715 1044034 1038979 1034432 1030794 1028557 1027918 1028858 1031395 1035528 1041069 1047719 1055394 1064392
50038A064392J0743J2521J3652J3858J3718J4080J5032J5818J5875J5429J4763
$$ 1064392 1075135 1087656 1101308 1115166 1128884 1142964 1157996 1173814 1189689 1205118 1219881
50027A219881J3517J1391R037P464O728N949M529K743J023m72j562j950j773j694
$$ 1219881 1233398 1244789 1253826 1261290 1268018 1273967 1278496 1281239 1282262 1281790 1280228 1278278 1276505 1274811
50013A274811k118k759l104k866j890j05K117M038N321O365P717R470J1401J3241
$$ 1274811 1272693 1269934 1266830 1263964 1262074 1261969 1264086 1268124 1273445 1279810 1287527 1296997 1308398 1321639
49999A321639J4693J5676J6717J8545K0997K2827K2811K0640J6586J0988M398
$$ 1321639 1336332 1352008 1368725 1387270 1408267 1431094 1453905 1474545 1491131 1502119 1506517
49988A506517k497r499j6854k4178l0257l4472l7660m0673m2871m3041m1423l9530
$$ 1506517 1504020 1494521 1477667 1453489 1423232 1388760 1351100 1310427 1267556 1224515 1183092 1143562
49976A143562l8157l6680l4352l1260k7828k4312k1099j8745j7293j6109j4651
$$ 1143562 1105405 1068725 1034373 1003113 975285 950973 929874 911129 893836 877727 863076
49965H63076j2937j1126r169p167n523m471l878l605l577l368k294l14J765L263
$$ 863076 850139 839013 829844 822677 817154 812683 808805 805200 801623 798255 795961 795647 797412 800675
49951H00675M391N712P311Q902J0278J1234J1422J0829J0073R689R328Q210O218
$$ 800675 805066 810778 818089 826991 837269 848503 859925 870754 880827 890516 899844 908054 914272
49938I14272L999K027J59j832l864n868q112j0805j3664j6122j7848j8866j9269
$$ 914272 918271 920298 920457 918625 914761 908893 900781 889976 876312 860190 842342 823476 804207
49925H04207j9043j8148j6609j4541j2151r716p445n431l833k917k689k534j635
$$ 804207 785164 767016 750407 735866 723715 713999 706554 701123 697290 694373 691684 689150 687515
49912F87515J33K003L202L794M355N098N816O554P729R400J0974J1969J2679J3743
$$ 687515 687648 689651 692853 696647 701002 706100 711916 718470 726199 735599 746573 758542 771221 784964
49898G84964J5229J6492J6823J6007J4360J2463J0718Q985O841M260J705o20l139
$$ 784964 800193 816685 833508 849515 863875 876338 887056 896041 902882 907142 908847 908227 905088
$$ [...]
##END NTUPLES=NMR SPECTRUM
##END=
