##TITLE=AC1505_CUNDCR13312_8126462_q7w8fun3M6
##JCAMPDX= 6.0         $$ Bruker NMR JCAMP-DX V2.0
##DATA TYPE= NMR SPECTRUM
##DATA CLASS= NTUPLES
##ORIGIN= BRUKER
##OWNER= Administrator
$$ 1.72 TOPSPIN		Version 2.1
$$ 2013-08-16 19:18:52.678 -0700  Administrator@X
$$ Compression mode = diff/dup
##.OBSERVE FREQUENCY= 400.02188249412
##.OBSERVE NUCLEUS= ^1H
##.ACQUISITION MODE= SIMULTANEOUS (DQD)
##.ACQUISITION SCHEME= undefined
##.AVERAGES= 64
##.DIGITISER RES= 22
##SPECTROMETER/DATA SYSTEM= spect
##.PULSE SEQUENCE= noesygpps1d.comp
##.SOLVENT NAME= COFFEE_meoh
##.SHIFT REFERENCE= INTERNAL, COFFEE_meoh, 1, 14.96082
##AUDIT TRAIL= $$ (NUMBER, WHEN, WHO, WHERE, PROCESS, VERSION, WHAT)
$$ ##TITLE= Audit trail, TOPSPIN		Version 2.1
$$ ##JCAMPDX= 5.01
$$ ##ORIGIN= Bruker BioSpin GmbH
$$ ##OWNER= Administrator
$$ $$ E:\/data/COFFEE/nmr/AC1505_CUNDCR13312_8126462_q7w8fun3M6/22/pdata/1/auditp.txt
$$ ##AUDIT TRAIL=  $$ (NUMBER, WHEN, WHO, WHERE, PROCESS, VERSION, WHAT)
(   1,<2013-08-16 19:18:47.882 -0700>,<Administrator>,<X>,<go>,<TOPSPIN 2.1>,
      <created by zg
	started at 2013-08-16 19:07:18.147 -0700,
	POWCHK enabled, PULCHK disabled,
       configuration hash MD5:
       C8 4E 4E 5D D3 5C D8 9E 9F 52 82 E0 59 8A DE 15
       data hash MD5: 64K
       10 B9 4D 26 89 F2 6F 5C 25 3A 30 6B 5C 8E 22 44>)
(   2,<2013-08-16 19:18:50.819 -0700>,<Administrator>,<X>,<proc1d>,<TOPSPIN 2.1>,
      <Start of raw data processing
       efp LB = 0.3 FT_mod = 6 PKNL = 1 PHC0 = 0 PHC1 = 0 SI = 128K 
       data hash MD5: 128K
       46 39 99 8D F6 4C 47 C5 0E 6B A0 77 73 9E FA 93>)
(   3,<2013-08-16 19:18:51.741 -0700>,<Administrator>,<X>,<proc1d>,<TOPSPIN 2.1>,
      <pk PHC0 = -77.87109 PHC1 = 0 
       data hash MD5: 128K
       06 E6 5E F3 96 99 D2 7C 95 69 75 1B 2C 5C E2 13>)
(   4,<2013-08-16 19:18:52.132 -0700>,<Administrator>,<X>,<proc1d>,<TOPSPIN 2.1>,
      <abs ABSG = 1 
       data hash MD5: 128K
       CB E1 D3 A7 B2 0E E8 65 AA 97 84 95 03 1A 3B E2>)
(   5,<2013-08-16 19:18:52.241 -0700>,<Administrator>,<X>,<proc1d>,<TOPSPIN 2.1>,
      <abs ABSG = 2 
       data hash MD5: 128K
       3A 81 F4 05 A0 59 65 EC 87 33 1E A5 4F F7 3E 61>)
(   6,<2013-08-16 19:18:52.335 -0700>,<Administrator>,<X>,<proc1d>,<TOPSPIN 2.1>,
      <abs ABSG = 3 
       data hash MD5: 128K
       82 2A 79 55 6D CF A1 5F A7 E8 59 35 58 B0 F3 E6>)
(   7,<2013-08-16 19:18:52.413 -0700>,<Administrator>,<X>,<proc1d>,<TOPSPIN 2.1>,
      <abs ABSG = 4 
       data hash MD5: 128K
       01 B4 42 6D 63 92 93 B4 F7 F5 59 29 1A 3E 9C B5>)
(   8,<2013-08-16 19:18:52.491 -0700>,<Administrator>,<X>,<proc1d>,<TOPSPIN 2.1>,
      <abs ABSG = 5 
       data hash MD5: 128K
       F4 71 C2 E1 21 BF 65 49 F6 52 B0 04 17 0B B5 CC>)
$$ ##END=
$$ 
$$ $$ hash MD5
$$ $$ FF 6B 2C 68 90 3D C9 E4 39 E0 AF 4F 2D 71 D9 19
##$RELAX= 
##$RELAX= 
##$RELAX= 
##$RELAX= 
##$RELAX= 
##$RELAX= 
##$RELAX= 
##$RELAX= 
$$ Bruker specific parameters
$$ --------------------------
##$DU= <E:\>
##$EXPNO= 22
$$ [...]
##$TP07= 0
##$TPNAME0= <>
##$TPNAME1= <>
##$TPNAME2= <>
##$TPNAME3= <>
##$TPNAME4= <>
##$TPNAME5= <>
##$TPNAME6= <>
##$TPNAME7= <>
##$TPOAL= (0..7)
0.5 0.5 0.5 0.5 0.5 0.5 0.5 0.5
##$TPOFFS= (0..7)
0 0 0 0 0 0 0 0
##$TUNHIN= 0
##$TUNHOUT= 0
##$TUNXOUT= 0
##$USERA1= <user>
##$USERA2= <user>
##$USERA3= <user>
##$USERA4= <user>
##$USERA5= <user>
##$V9= 5
##$VALIST= <valist>
##$VCLIST= <CCCCCCCCCCCCCCC>
##$VD= 0
##$VDLIST= <DDDDDDDDDDDDDDD>
##$VPLIST= <PPPPPPPPPPPPPPP>
##$VTLIST= <TTTTTTTTTTTTTTT>
##$WBST= 2048
##$WBSW= 25
##$XGAIN= (0..3)
0 0 0 0
##$XL= 0
##$YL= 0
##$YMAX_a= 6398389
##$YMIN_a= -13824794
##$ZGOPTNS= <>
##$ZL1= 120
##$ZL2= 120
##$ZL3= 120
##$ZL4= 120
##$ABSF1= 14.96082
##$ABSF2= -5.597362
##$ABSG= 5
##$ABSL= 3
##$ALPHA= 0
##$AQORDER= 0
##$ASSFAC= 0
##$ASSFACI= 0
##$ASSFACX= 0
##$ASSWID= 0
##$AUNMP= <proc_prof1d_extract.lims>
##$AXLEFT= 0
##$AXNAME= <>
##$AXNUC= <1H>
##$AXRIGHT= 0
##$AXTYPE= 0
##$AXUNIT= <>
##$AZFE= 0.1
##$AZFW= 0.1
##$BCFW= 0
##$BC_mod= 0
##$BYTORDP= 0
##$COROFFS= 0
##$CY= 15
##$DATMOD= 1
##$DC= 0
##$DFILT= <>
##$DTYPP= 0
##$F1P= 0
##$F2P= 0
##$FCOR= 0.5
##$FTSIZE= 131072
##$FT_mod= 6
##$GAMMA= 0
##$GB= 0
##$INTBC= 1
##$INTSCL= 1
##$ISEN= 128
##$LB= 0.3
##$LEV0= 0
##$LPBIN= 0
##$MAXI= 10000
##$MC2= 0
##$MEAN= 0
##$ME_mod= 0
##$MI= 0
##$NCOEF= 0
##$NC_proc= -2
##$NLEV= 6
##$NOISF1= 0
##$NOISF2= 0
##$NSP= 0
##$NTH_PI= 0
##$NZP= 0
##$OFFSET= 14.96082
##$PC= 1
##$PHC0= -77.87109
##$PHC1= 0
##$PH_mod= 1
##$PKNL= yes
##$PPARMOD= 0
##$PPDIAG= 0
##$PPIPTYP= 0
##$PPMPNUM= 2147483647
##$PPRESOL= 1
##$PSCAL= 4
##$PSIGN= 0
##$PYNMP= <proc.py>
##$REVERSE= no
##$SF= 400.020009706828
##$SI= 131072
##$SIGF1= 0
##$SIGF2= 0
##$SINO= 400
##$SIOLD= 131072
##$SPECTYP= <>
##$SREGLST= <1H.CDCl3>
##$SSB= 0
##$STSI= 131072
##$STSR= 0
##$SW_p= 8223.68421052631
##$SYMM= 0
##$S_DEV= 0
##$TDeff= 65536
##$TDoff= 0
##$TI= <>
##$TILT= no
##$TM1= 0
##$TM2= 0
##$TOPLEV= 0
##$USERP1= <user>
##$USERP2= <user>
##$USERP3= <user>
##$USERP4= <user>
##$USERP5= <user>
##$WDW= 1
##$XDIM= 131072
##$YMAX_p= 389288852
##$YMIN_p= -13228
##$CURPLOT= <Network HP LaserJet P1505>
##$CURPRIN= <$Network HP LaserJet P1505>
##$DFORMAT= <normdp>
##$LAYOUT= <+/1D_H.xwp>
##$LFORMAT= <normlp>
##$PFORMAT= <normpl>
##$SURQMSG= 1
$$ End of Bruker specific parameters
$$ ---------------------------------
##NTUPLES= NMR SPECTRUM
##VAR_NAME=  FREQUENCY,     SPECTRUM/REAL,   SPECTRUM/IMAG
##SYMBOL=    X,             R,               I
##VAR_TYPE=  INDEPENDENT,   DEPENDENT,       DEPENDENT
##VAR_FORM=  AFFN,          ASDF,            ASDF
##VAR_DIM=   131072,        131072,          131072
##UNITS=     HZ,            ARBITRARY UNITS, ARBITRARY UNITS
##FACTOR=    0.0627417313425164, 1,          1
##FIRST=     8223.62146879497, 323,          -72405
##LAST=      0,             3355,            -73053
##MIN=       0,             -13228,          0
##MAX=       8223.62146879497, 389288852,    0
$$ Real data points
##PAGE= N=1
##DATA TABLE= (X++(R..R)), XYDATA
$$ [...]
65191 135726 135250 135087 135073 135309 136014 137048 138050 138897 139663 140275 140635 140969 141663 142790 144135 145557 147023
65174 147023 148423 149727 151201 153033 154821 155917 156228 156193 156001 155427 154639 154526 155795 158032 160123 161516
65158 161516 162784 164967 168517 172913 177189 180795 183881 186761 189424 191840 194509 198139 202762 207726
65144 207726 212758 218591 226121 235269 245109 254947 264836 275048 285433 295535 305130 314395 323511
65131 323511 332314 340478 347986 355150 362065 368216 372811 375353 375786 374297 371257 367216 362615 357580
65117 357580 352170 346577 340727 333960 325702 316373 307039 298121 289095 279509 269602 259671 249611 239545
65103 239545 230266 222365 215336 208253 201098 194729 189614 185316 181286 177614 174677 172465 170575 168717
65089 168717 167009 165764 165124 164950 165069 165438 165909 165935 164937 163072 161290 160419 160417 160770 161249 161955 162825 163517
65071 163517 163735 163429 162778 162160 161926 161995 161896 161478 161247 161617 162130 161998 161249 160747 161063 161846 162466 162784 163102
65052 163102 163657 164394 165052 165355 165267 165105 165238 165704 166312 166977 167697 168209 168051 167002 165208 162892 160252 157703
65034 157703 155831 154898 154578 154258 153486 152121 150276 148275 146505 145242 144563 144314 144057 143308 142049 140884
65018 140884 140349 140286 140166 139868 139735 140072 141044 142862 145447 147975 149516 150185 151004 152478 154093 155464 157196
65001 157196 160013 163615 167009 169564 171235 172192 172886 174117 176300 178745 180311 180735 180740 180945 181307 181720
64985 181720 182475 183802 185428 186950 188388 190070 192141 194402 196520 198184 199187 199505 199296 198696 197663
64970 197663 195963 193319 189635 185260 180992 177612 175296 173599 172009 170389 168800 167160 165258 163083
64956 163083 160912 159035 157458 155962 154461 153211 152557 152506 152628 152464 151996 151662 151892 152621 153245 153117 152185
64939 152185 151063 150423 150416 150833 151655 153022 154690 156046 156836 157472 158278 158912 158984 158909 159475 160711 161824 162296
64921 162296 162393 162414 162011 160677 158604 156684 155843 156471 158266 160410 162182 163558 164966 166385 167204 167243 167364
64904 167364 168510 170533 172597 174432 176501 179183 182607 187191 193289 200125 206106 210716 215281 221172
64890 221172 227988 234308 239593 244310 248551 251771 254011 256267 259202 262262 264531 265906 266958 267996
64876 267996 268682 268343 266433 262989 258823 254938 251635 248570 245691 243423 241662 239457 236300 233066 230890
64861 230890 229568 228017 225953 224063 222554 220628 217656 213991 210202 206249 201975 197827 194391 191479
64847 191479 188236 184163 179654 175572 172500 170355 168578 166798 165358 164987 165791 166833 166977 166006 164586
64832 164586 163299 162113 160864 159859 159639 160246 161144 162007 163300 165689 168945 171902 173624 174225 174374 174535
64816 174535 175101 176728 179756 183476 186781 189606 193074 198122 204584 211749 219133 226425 233340 239970
64802 239970 246822 254075 261112 267104 271694 274845 276441 276456 275083 272332 267915 262006 255675 249938 244676
64787 244676 239136 233251 227782 223287 219687 216879 215020 214002 213225 212303 211595 211678 212537 213601 214500 215565
64771 215565 217537 220806 224953 229167 233185 237639 243209 249658 256064 261978 267895 274477 281695 288924
64757 288924 295604 301515 306599 310884 314659 318483 322731 327108 330765 333083 334290 335151 336084 336778 336689
64742 336689 335609 333690 331201 328329 324906 320210 313464 304847 295616 286985 279140 271683 264600 258282
64728 258282 252905 248415 244933 242633 241257 240271 239449 238859 238411 238000 237989 238881 240466 241960 243136 244674
64712 244674 247184 250446 253886 257226 260323 262884 264823 266521 268235 269518 269651 268492 266474 263896
64698 263896 260621 256413 251252 245302 238862 232394 226476 221576 217825 214912 212248 209481 206933 205308
64684 205308 204883 205128 205282 205117 205066 205742 207453 210014 212936 215925 219207 223242 228155 233680 239575 245749
64668 245749 252033 258300 264883 272349 280605 288680 295660 301363 305806 308490 308765 306610 302557 297109
64654 297109 290740 284227 278323 273096 268102 263268 259092 255914 253473 251369 249563 248219 247477 247688 249530
64639 249530 253374 258564 263806 268508 273487 280081 288679 298487 308761 319772 332188 345793 359360
64626 359360 371668 382089 390188 395463 397807 397616 395043 389623 381139 370410 358639 346357 333646
64613 333646 321035 309286 298425 287935 277972 269517 262984 257542 252309 247570 244195 242362 241535
64600 241535 241354 241775 242445 242723 242530 242642 243847 246118 248849 251605 254346 257033 259434 261460 263487 266099
64584 266099 269450 273052 276332 279316 282540 286301 290310 294230 298339 303326 309387 315725 321064 324692
64570 324692 326956 328763 330572 331892 331807 329926 326709 322850 318518 313258 306508 298123 288559 278744 269689
64555 269689 261944 255259 248812 241873 234399 227103 220961 216551 213833 212506 212424 213430 214954 216189 216863
64540 216863 217511 218761 220610 222680 224872 227261 229487 230770 230648 229282 226933 223605 219482 215378 212313
64525 212313 210709 210213 210136 209835 208832 207005 204790 203024 202470 203396 205422 207669 209315 210296 211339 213018
64509 213018 214963 216346 217003 217580 218601 220018 221932 225067 229969 235985 241781 246905 252363 259395 268015
64494 268015 277016 285289 292828 300354 308117 315290 320598 323386 323861 322490 319588 315615 311462 307985
64480 307985 305315 302922 300360 297751 295456 293468 291226 288057 283798 278932 274045 269264 264482 260076
64466 260076 256889 255271 254551 253828 253007 252641 253031 254020 255525 257666 260297 262917 265131 266818 267842 268092
64450 268092 267903 267898 268223 268404 268217 268235 269134 270829 272645 274135 275432 277112 279949 284457 290286 296390 302276
64433 302276 308843 317527 328821 342152 357076 373974 393552 416260 442459 472676 507402 546870
64421 546870 591383 641671 698678 763051 834941 914162 1000193 1091870 1187118 1283054 1376516
64410 1376516 1464726 1545759 1618570 1682636 1737333 1781321 1812432 1828375 1827846 1811150 1779950 1736597
64398 1736597 1683480 1622414 1554170 1478689 1396028 1307268 1214672 1121333 1030661 945572 867588
64387 867588 796692 732306 674181 622215 575919 534723 498594 467700 441512 418880 399092
64376 399092 382215 368212 356370 345947 336888 329455 323466 318352 313674 309116 304221 298666 292770
64363 292770 287227 282255 277354 272045 266562 261597 257527 254054 250563 246761 243007 240057 238432 238038
64349 238038 238451 239480 241343 244295 248354 253370 259134 265209 270846 275363 278612 280790 281826 281278 279043
64334 279043 275834 272567 269372 265630 261053 256344 252581 250238 249024 248425 248075 247712 247167 246500 245948 245676
64318 245676 245667 245814 245950 245838 245363 244826 244897 246146 248539 251279 253106 253015 250965 247950 245161 243024 241078
64301 241078 238643 235434 231603 227521 223604 220124 217114 214503 212306 210525 208946 207236 205286 203328
64287 203328 201810 201327 202455 205226 208789 212031 214709 217636 221650 226742 232351 238113 243955 249741
64273 249741 255267 260587 266067 272088 278765 285854 292792 298946 303976 307890 310756 312537 313301 313307 312720
64258 312720 311548 310084 309034 308796 308860 308400 307292 305986 304461 302008 298226 293556 288449 282589 275535
64243 275535 267841 260763 254863 249520 244009 238544 233895 230344 227440 224681 222076 220088 219336 220266 222719
64228 222719 225731 228067 229166 229412 229434 229440 229378 229374 229617 229943 229939 229476 228819 228182 227372 225991 223853 221152 218342
64209 218342 215858 213815 211979 210091 208219 206709 205867 205849 206716 208341 210337 212323 214251 216240 218180
64194 218180 219841 221399 223485 226629 230901 236215 242668 250428 259470 269541 280225 291082 301985
64181 301985 313314 325371 337546 348479 357213 363699 367923 369050 366033 358842 348668 336984 324760
64168 324760 312453 300377 288994 278966 270741 264019 257936 252074 246883 242713 238884 234399 229462
64155 229462 225526 223683 223598 224168 224731 225258 225794 226194 226433 226962 228578 231763 236002 240042 243110 245731
64139 245731 248874 252480 255406 256856 257212 257271 257331 257318 257220 256840 255563 253011 249734 246764 244670 243458 243128
64122 243128 243687 244684 245462 246065 247360 250037 253953 258726 264561 271955 280820 290378 299948 309517 319440
64107 319440 329839 340410 350602 359851 367715 373983 378702 382138 384729 387067 389755 393216 397644
64094 397644 403181 409973 417926 426468 434760 442152 448309 452917 455531 455843 453903 449877 443731 435415
64080 435415 425296 414126 402573 390997 379662 368854 358642 348786 339178 330246 322687 316790
64068 316790 312171 308137 304237 300529 297498 295741 295487 296294 297242 297521 296899 295747 294746 294555 295549 297639
64052 297639 300342 303222 306346 310209 315104 320626 326042 331189 336779 343705 352190 361814 372140 382917
64038 382917 393789 404363 414813 425900 437853 449373 458290 463320 464932 464493 462891 460106 455781
64025 455781 449943 443301 436976 431826 427885 424573 421537 419104 417754 417378 417294 416840 415607 413253 409478
64010 409478 404290 397972 390728 382683 374361 366736 360458 355199 350084 344726 339522 335036 331345 328094
63996 328094 324977 322069 319752 318394 318079 318703 320282 322920 326344 329786 332647 335166 338047 341529 345292
63981 345292 349277 353985 359720 366001 372211 378564 385920 394680 404257 413761 422859 431907 441426 451600
63967 451600 462211 472985 483995 495691 508549 522852 538892 557096 577623 599978 623450
63956 623450 648066 674861 705198 740073 780153 826183 879137 940153 1010523 1091608 1184582
63945 1184582 1290299 1409483 1542856 1690825 1853047 2028448 2215578 2412851 2618482
63936 2618482 2830339 3045735 3261200 3472500 3675093 3864609 4036823 4187383 4312042
63927 4312042 4407489 4471948 4504953 4506573 4476897 4416053 4324636 4204278 4058079 3890507 3706673
63916 3706673 3511441 3309011 3103127 2897464 2695684 2501014 2315781 2141438 1979159
63907 1979159 1830289 1695982 1576394 1470498 1376790 1293973 1220939 1156528 1099763 1050114
63897 1050114 1007070 969513 935914 905203 876992 850926 826312 802621 779927 758537 738501
63886 738501 719786 702548 686795 672087 658137 645586 635601 628627 624002 620966 619677 620956 625303
63873 625303 632396 641537 652468 665755 682240 702026 724097 747114 770429 794139 818417 843230
63861 843230 868472 893753 918065 940252 959981 977746 993782 1007531 1018376 1026299 1031397 1033255
63849 1033255 1031357 1025820 1017190 1005742 991388 974118 954056 931286 906040 878958 850731 821540
63837 821540 791229 759992 728497 697375 666945 637445 609175 582345 556958 532890 509964
63826 509964 488132 467781 449633 433964 420066 406845 393866 381457 369956 359378 349775 341365
63814 341365 334128 327629 321365 315050 308608 302238 296501 291919 288371 285261 282283 279658 277525 275635
63800 275635 273793 272194 271013 269995 268752 267207 265518 263775 261954 259940 257473 254327 250724 247291
63786 247291 244429 242048 240065 238706 237925 236947 234999 232394 230366 229757 230193 230662 230535 229897 229150 228562
63770 228562 228183 227973 227868 227755 227533 227296 227331 227748 228228 228327 228020 227657 227409 227062 226466 225794 225194 224481 223522
63751 223522 222712 222691 223594 224840 225763 226299 226994 228351 230159 231587 232017 231772 231872 233119 235537 238593 241661
63734 241661 244290 246356 248143 250046 252211 254657 257666 261572 266049 270178 273523 276754 280832 285893
63720 285893 291281 296421 301176 305496 309167 311936 313698 314593 315055 315589 316286 316658 316165 314718 312570 309977
63704 309977 307228 304713 302570 300457 297987 295290 292907 291328 290857 291644 293467 295754 298227 301315 305402
63689 305402 309962 314036 317443 320830 324536 328135 331245 334025 336500 338011 337928 336566 334881 333440 332165
63674 332165 330947 329974 329385 329014 328746 328848 329638 330916 332081 332897 333795 335101 336179 335852 333726 330631
63658 330631 327643 325127 322909 320782 318387 315094 310705 306006 302001 298788 295891 293477 292331 292496
63644 292496 292855 292438 291505 290956 291243 292318 294131 296580 299311 302095 305218 309035 313344 317637 321822
63629 321822 326237 331059 336178 341661 347912 355246 363533 372333 381223 390070 399256 409598 421679 435201
63615 435201 449284 463570 478788 496024 515637 537177 560265 585182 612408 641833 672716
63604 672716 704331 736244 767891 798253 826294 851463 873381 891148 903475 909585 909727 904869
63592 904869 896325 885713 874590 863652 852522 840572 827678 813894 798759 781449 761542 739274
63580 739274 715186 689923 664329 639292 615380 592839 571990 553417 537777 525540 516793 510970
63568 510970 506921 503735 501635 501681 504369 508842 513745 518601 523946 530272 537319 544632 552399 561354 571902
63553 571902 583805 596942 612024 630057 651191 674654 700011 728002 759712 795259 833794
63542 833794 874578 917338 961339 1004445 1043260 1074038 1093727 1101052 1097294 1085813 1070315 1053381
63530 1053381 1036431 1020447 1006030 992957 980266 966888 951852 933971 912009 885521 855198
63519 855198 822101 786865 750002 712688 676655 643224 612738 584934 559552 536488 515673
63508 515673 497018 480379 465460 451870 439363 427923 417551 408143 399620 392044 385436 379635
63496 379635 374444 369806 365743 362217 359238 356995 355747 355608 356404 357580 358141 357134 354582 351835 350522
63481 350522 351122 352827 354810 357175 360518 364917 369680 373930 377168 379417 381078 382600 384038 384887 384469
63466 384469 382568 379681 376713 374430 373024 371994 370488 368020 365006 362527 361473 361912 363265 364942
63452 364942 366715 368577 370506 372517 374810 377686 381284 385532 390377 395948 402430 409950 418656 428789
63438 428789 440543 453967 469153 486405 505997 527824 551596 577464 606139 638001 671992
63427 671992 705531 735703 760573 779535 792812 801193 806347 810850 817251 827026 840662 858540
63415 858540 881170 908515 939735 973904 1010437 1048334 1085390 1118734 1146109 1166338 1178927
63404 1178927 1183821 1181538 1173118 1159995 1144084 1127507 1111461 1095404 1077986 1058720 1038127 1016310
63392 1016310 992227 964685 933440 899082 862498 824878 787739 752354 719299 688764 660929
63381 660929 635778 612952 592186 573695 557906 545060 535194 528171 523529 520723 519763 521217 525354
63368 525354 531766 540109 550579 563183 577187 592020 608330 627369 649503 674038 700359 728590
63356 728590 759155 792339 828266 866682 906620 946817 986537 1025474 1062723 1096321 1124073
63345 1124073 1144575 1157409 1162866 1161758 1155261 1144578 1130774 1114901 1098016 1080898 1063748 1046117
63333 1046117 1027069 1005604 981213 954068 924623 893215 860233 826471 793062 761173 731908
63322 731908 706160 684161 665362 649122 635437 624749 617280 612762 610208 607420 601274 589538
63310 589538 572503 552309 530877 509158 488025 468627 451544 436448 422977 411251 401281 392628
63298 392628 385021 378694 373688 369460 365513 361853 358463 354983 351357 348104 345428 342679 339323 335840
63284 335840 332958 330541 328024 325567 323826 322783 321665 320038 318269 316866 316003 315713 315974 316493 316868
63269 316868 317016 317046 316856 316412 316335 317511 319987 322824 325223 327288 329524 332115 334981 338117 341541 345215
63253 345215 349212 353672 358416 362977 367245 371698 376767 382282 387872 393580 399723 406375 413443 421137
63239 421137 429990 440380 452290 465551 480079 495870 512937 531260 550697 570994 591951 613402
63227 613402 634936 655929 676141 696107 716511 737297 757919 778472 799944 822950 846747
63216 846747 870062 892584 914963 937333 958543 977033 991927 1002903 1009547 1011401 1008425 1000850
63204 1000850 988707 972022 951458 928264 903508 877829 852033 827422 805252 786140 770176
63193 770176 757276 747268 740036 735921 735634 739482 746927 757245 770284 786162 804528 824708 846471
63180 846471 870103 895727 923082 952035 982757 1015030 1047742 1079464 1109526 1138280 1166267
63169 1166267 1193243 1218146 1239996 1258650 1274384 1286792 1294488 1296064 1290966 1279166 1260485 1234835
63157 1234835 1202946 1166214 1125776 1082213 1036146 988646 940975 894367 850096 809195 771915
63146 771915 737894 706997 679539 655513 634183 614767 597050 580913 565826 551425 538269
63135 538269 527291 518570 511230 504588 498810 494286 490853 487968 485392 483379 482319 482412 483606 485623
63121 485623 487995 490218 492094 493984 496669 500771 506206 512223 517963 522900 526907 530139 532934 535611
63107 535611 538252 540814 543368 545922 547995 548898 548718 548618 549688 551777 553905 555610 557269 559174 560943
63092 560943 562052 562488 562595 562638 562783 563256 564180 565406 566733 568232 570101 572232 574102 575198 575554 575908
63076 575908 577229 580009 583992 588666 593867 599718 606115 612682 619329 626500 634677 643911 654071 665329
63062 665329 678108 692608 708695 726290 745737 767731 792875 821246 852283 885224 919724
63051 919724 956076 994875 1036567 1081278 1128780 1178535 1229950 1282689 1336528 1390912 1445007
63040 1445007 1498461 1551746 1605452 1659466 1713181 1766294 1818980 1871416 1923497 1974792 2024252
63029 2024252 2069965 2109766 2142211 2166548 2181739 2186183 2178761 2159674 2129951 2090566 2042633 1988129
63017 1988129 1929715 1869678 1809425 1750120 1693429 1641358 1595474 1556468 1524431 1499420 1481696
63006 1481696 1471542 1469068 1474313 1487319 1507846 1535114 1568204 1606677 1650361 1698420 1749261 1801695
62994 1801695 1855708 1911611 1968821 2026139 2082904 2139052 2194107 2246980 2296977 2344108 2387863
62983 2387863 2426315 2457073 2478777 2490964 2492792 2482709 2459528 2423262 2374787 2315226 2245913
62972 2245913 2168476 2084605 1996010 1904856 1813786 1724960 1639271 1557018 1479230 1407558 1342721
62961 1342721 1283798 1229493 1179570 1134363 1093335 1055050 1018585 984161 952174 922391 894468
62950 894468 868512 844444 821312 798064 774849 752842 732855 714704 697853 681907 666395
62939 666395 650854 635557 621574 609671 599542 590509 582561 576090 570828 565704 559893 553658 547987
62926 547987 543575 540222 537157 533919 530938 529097 528628 528611 527794 525790 523298 521241 519946 519106 518276 517224
62910 517224 515918 514337 512423 510192 507787 505304 502680 499922 497332 495261 493658 492141 490441 488458
62896 488458 485937 482647 479077 476386 475312 475453 475964 476534 477251 477896 478009 477533 476865 476361 476236 476758 477980
62879 477980 479304 479933 479846 479823 480366 481123 481524 481518 481395 481308 481261 481230 480992 480138 478645 477180 476447 476266 475638 473761
62859 473761 470794 467637 465174 463778 463408 463949 465343 467385 469624 471620 473231 474508 475481 476263 477123
62844 477123 478036 478270 477026 474651 472649 472200 473026 473999 474479 474560 474356 473670 472389 470707 468848 466840 464756
62827 464756 462930 461826 461744 462682 464366 466414 468622 471129 474235 478045 482317 486634 490647 494230 497486
62812 497486 500650 503909 507304 510690 513756 516166 517963 519882 523012 527952 534355 541347 548241 554811
62798 554811 561214 567951 575771 585301 596680 609566 623414 637712 652288 667626 684775 704698
62786 704698 727801 754227 784350 818658 857409 900712 948852 1002083 1060234 1123026 1190754
62775 1190754 1264006 1342472 1424450 1507768 1590812 1672364 1750800 1823926 1889474 1945463 1990246
62764 1990246 2022514 2041252 2045626 2035250 2010861 1974340 1927596 1871622 1807191 1736219 1661613
62753 1661613 1585628 1509070 1432388 1356841 1284033 1214815 1149312 1087751 1030602 978013 929731
62742 929731 885531 845212 808186 773774 742102 714106 690385 670469 653452 638805 626233
62731 626233 615241 605432 596916 589909 584135 579161 575106 572452 571235 571038 571847 574295 578898 585453
62717 585453 593387 602317 612042 622391 633441 645733 660078 677235 697766 721906 749448 780114
62705 780114 814247 852922 897172 947259 1002831 1063570 1129557 1201289 1279513 1364712 1456406
62694 1456406 1553111 1653211 1755779 1860270 1965566 2069499 2169178 2261557 2343823 2413556
62684 2413556 2468556 2506630 2525887 2525559 2506276 2469240 2415374 2345688 2262349 2168782 2068560
62673 2068560 1964447 1858547 1752911 1649589 1550121 1455269 1365368 1280927 1202759 1131374
62663 1131374 1066330 1006474 951003 900101 854409 814038 778305 746263 717227 690942 667471
62652 667471 646860 628663 611896 595724 580115 565606 552505 540545 529195 518081 507211
62641 507211 497087 488500 481899 476967 473054 469839 467290 465224 463433 462159 461809 462141 462244 461452 459779
62626 459779 457387 454313 451042 448581 447326 446351 444537 442145 440500 440215 440595 440941 441658 443579 446754
62611 446754 450542 454640 459413 465233 472016 479500 487508 495753 503898 512227 521923 534159 549025 565819
62597 565819 584278 604939 628243 654013 682138 713135 747426 784450 823053 862461 902217
62586 902217 941372 978482 1012445 1042675 1068308 1087886 1100154 1104775 1102082 1092560 1076816 1055658
62574 1055658 1029857 1000050 967000 931643 894751 856983 819410 783476 750076 719105 690220
62563 690220 663605 639506 617563 597252 578709 562362 547913 534433 521530 509803 500006 492310
62551 492310 486547 482536 479803 477391 474454 470987 467736 465469 464437 464327 464568 464801 465198 466205 467912
62536 467912 469895 471767 473634 475826 478416 481303 484653 488920 494350 500654 507243 513798 520705 529047
62522 529047 540051 554385 571947 592421 615924 642966 673852 708404 746354 787813 833180
62511 833180 882663 936004 992614 1051763 1112529 1173615 1233323 1289797 1341345 1386583 1424329
62500 1424329 1453473 1473070 1482607 1482128 1472132 1453512 1427619 1396210 1361034 1323485 1284851 1246823
62488 1246823 1211423 1180261 1154077 1133112 1117627 1107798 1103425 1104217 1110272 1121828 1138420 1158714
62476 1158714 1181348 1205676 1231431 1257773 1282805 1303951 1318848 1326184 1325944 1318779 1305094 1284846
62464 1284846 1258050 1225104 1186537 1142934 1095439 1045942 996284 947367 899335 852494 807707
62453 807707 765991 728046 694167 664260 637960 614957 595241 578863 565606 555153 547523 542909
62441 542909 541076 541226 542526 544516 546987 549853 553262 557528 562707 568350 573711 578010 580550 580955 579399
62426 579399 576296 571635 565026 556555 547163 537788 528478 518756 508581 498441 488693 479418 470933 463847
62412 463847 458360 453947 449950 446185 442675 439176 435334 431162 426959 422828 418673 414690 411478 409458
62398 409458 408400 407758 407282 407147 407554 408469 409762 411404 413460 415942 418718 421484 423889 425849 427722
62383 427722 430020 432881 435983 439018 442072 445477 449473 454170 459635 465810 472493 479664 487714 497034
62369 497034 507424 518261 529335 541195 554557 569703 586675 605730 627284 651579 678858
62358 678858 709730 744941 784673 828460 875942 927319 982766 1041603 1102405 1163715 1224164
62347 1224164 1281894 1334395 1379294 1415145 1441276 1457288 1463204 1459942 1449050 1431680 1408166 1378712
62335 1378712 1344087 1305351 1263300 1218700 1172925 1127830 1084851 1044535 1006936 972133 940284
62324 940284 911509 885903 863359 843214 824386 806060 787975 769843 750900 730594 709497
62313 709497 688914 669476 650596 631509 612444 594409 578144 563697 550924 539925 530826 523352
62301 523352 516869 510807 505030 499797 495366 491608 488063 484465 481112 478620 477318 477051 477518 478559 480093
62286 480093 482076 484637 487954 491727 495005 497026 498183 499736 502444 505818 508947 511710 514879 519170
62272 519170 524590 530709 537221 544057 551226 558770 566916 576110 586809 599286 613736 630643 650905
62259 650905 675418 704504 737888 775269 816753 862695 913372 968959 1029466 1094284 1161788
62248 1161788 1229639 1295465 1357061 1412158 1458518 1494516 1519501 1533575 1537316 1531739 1518035 1496920
62236 1496920 1468353 1432166 1388945 1340107 1287214 1231463 1173857 1115627 1058336 1003588 952650
62225 952650 906260 864742 828230 796667 769638 746479 726832 710939 699106 690840 684806 679758
62213 679758 675326 671738 668942 666249 662853 658531 653724 648985 644409 639569 633995 627681 621101 614726
62199 614726 608603 602498 596407 590753 586034 582423 579823 578146 577328 577174 577509 578606 581212 585957 592723
62184 592723 600698 608965 617046 625001 633168 641782 650781 659980 669253 678255 686072 691752 695620 699743
62170 699743 706474 716566 729123 743387 760034 780579 806029 836456 871520 910808 953646 998922
62158 998922 1045285 1091383 1135838 1176987 1212811 1241348 1261437 1273144 1277341 1274923 1266493 1252607
62146 1252607 1233949 1211095 1184396 1154210 1121053 1085439 1047902 1009413 971568 936061 903966
62135 903966 875607 850952 829950 812590 798743 787890 779039 771272 764531 759504 756496 754700 752943
62122 752943 750877 749057 748156 748666 751069 755534 761288 767003 772111 777158 782463 786924 788770 787316 783462
62107 783462 778558 773339 768071 763156 759089 755820 752460 747788 741159 733112 725148 718812 714809 712916
62093 712916 712658 713854 716442 720016 723968 728148 733056 739227 746629 754936 764124 774428 785822 798037
62079 798037 811216 826086 843196 862252 882458 903296 924728 946852 969705 993282 1017409
62068 1017409 1041609 1065316 1088246 1110502 1132499 1154965 1178749 1204297 1231415 1259787 1289412
62057 1289412 1320042 1350363 1378343 1402426 1421889 1436105 1444223 1445918 1441881 1433098 1419979 1402465
62045 1402465 1380531 1354048 1322528 1285680 1244213 1199551 1152740 1104087 1053997 1003728 954983
62034 954983 908898 865619 824817 786437 750945 718904 690429 665125 642510 622334 604460
62023 604460 588662 574626 561977 550198 538765 527611 517262 508219 500330 493081 486374 480610
62011 480610 475983 472106 468499 465137 462303 460119 458511 457531 457477 458689 461381 465637 471362 478136 485255
61996 485255 492078 498436 504624 510977 517432 523490 528515 532046 533987 534656 534568 533868 531988 528195 522545
61981 522545 515967 509221 502133 494198 485646 477392 470074 463615 457723 452294 447156 441940 436527 431362
61967 431362 427061 423842 421490 419595 417607 414963 411566 408095 405516 404278 404088 404372 404746 405130 405674
61952 405674 406560 407763 409080 410539 412590 415607 419346 423254 427342 432384 439182 447975 458607 470872
61938 470872 484398 498495 512537 526474 540698 555381 570063 583963 596592 608090 618961
61927 618961 629448 639214 647715 654780 660502 664625 666503 665936 663643 660490 656514 651199 644586 637559
61913 637559 631051 625545 621518 619703 620499 623410 627602 632855 639616 648162 658096 668649 679160 689113
61899 689113 697947 705048 709960 712610 713270 712209 709348 704403 697430 689004 679750 669944 659812 649921
61885 649921 640832 632433 624099 615592 607397 600024 593310 586637 579561 571980 563883 555239 546131 536835
61871 536835 527787 519524 512551 507164 503429 501293 500568 500837 501700 503232 505951 510147 515485 521475 528097
61856 528097 535713 544630 555112 567647 582745 600435 620254 641697 664416 687997 711933 735864
61844 735864 759568 782710 804847 825686 844956 862007 875930 886190 892764 895551 894241 889091
61832 889091 881321 872224 862164 851112 839952 830551 824391 821675 821922 824784 829906 836470 843534 850769
61818 850769 858308 865734 871539 873855 871626 864929 854335 840271 823141 803783 783329 762418 740863
61805 740863 718416 695766 674394 655356 638479 622820 607670 592975 579136 566712 556179
61794 556179 547643 540756 535000 529971 525295 520581 515740 511182 507318 503939 500456 496711 493153 490229
61780 490229 488004 486450 485615 485311 485064 484674 484478 484718 484973 484610 483535 482056 480245 477983 475570 473763
61764 473763 473038 473235 474048 475541 477950 481179 484652 487594 489512 490618 491733 493488 495599 497199 497849
61749 497849 497851 497485 496446 494311 491285 488167 485720 484175 483151 481904 479932 477510 475413 473959 472651
61734 472651 470948 468990 467264 465888 464675 463616 462869 462434 462369 463179 465452 468979 472625 475205 476367
61719 476367 476742 477496 479523 482624 485601 487524 488773 490342 492357 493999 494849 495333 495606 494928 492786 489917
61703 489917 487364 484914 481418 476581 471658 468137 466235 464917 463061 460353 457282 454479 452098 449810
61689 449810 447353 444844 442442 439942 437092 434136 431621 429624 427585 424985 421884 418634 415382 412104
61675 412104 408968 406334 404349 402677 400769 398432 396064 394244 393092 392199 391215 390241 389507 388970 388563 388580
61659 388580 389314 390337 390709 390064 389108 388813 389445 390596 391847 393056 394210 395330 396452 397468 398113 398379
61643 398379 398809 400048 402142 404606 407150 409960 413138 416247 418676 420241 421131 421360 420659 418997 416878
61628 416878 414825 412676 409731 405750 401545 398309 396450 395372 394366 393346 392538 391834 390867 389569 388240
61613 388240 387034 385755 384231 382563 380787 378568 375529 371717 367464 362848 357632 351825 346060 341229
61599 341229 337763 335306 333092 330599 327917 325501 323565 321802 319745 317317 314846 312623 310596 308525
61585 308525 306273 303973 302079 301205 301541 302355 302430 301201 299211 297266 295511 293721 292082 291031 290388 289376
61569 289376 287703 286061 285249 285213 285310 285193 285005 284978 285222 285794 286581 287235 287553 287841 288609 289963 291618 293393
61551 293393 295291 297195 298955 300749 302836 304830 305793 305375 304434 304150 304805 305793 306578 307186 307895 308880 310182
61534 310182 311662 312979 313855 314375 314796 315073 314925 314409 314072 314364 315121 315808 316041 315674 314631 313045 311529
61517 311529 310917 311459 312424 312685 311748 310097 308582 307632 307167 307092 307554 308597 309765 310348 310045 309212 308432 307948
61499 307948 307567 306986 306067 304881 303603 302384 301294 300413 299924 299993 300429 300630 300065 298874 297796 297457 297872
61482 297872 298714 299837 301259 302729 303685 303801 303420 303307 304071 305956 308931 312677 316501 319609 321614 322679
61466 322679 323132 323164 322938 322726 322698 322711 322538 322192 321839 321507 321143 320892 321003 321403 321644 321429 320994 320848 321283 322242
61446 322242 323513 324838 325977 326825 327441 327842 327916 327726 327741 328508 330041 331795 333278 334536 336004 338027
61430 338027 340585 343283 345571 347183 348429 349852 351494 352779 353299 353425 353834 354650 355492 356295 357553 359625
61414 359625 362174 364534 366329 367558 368373 369087 370121 371575 372891 373318 372668 371368 369840 368140 366182
61399 366182 363957 361459 358721 356088 354160 353292 353306 353780 354402 354930 355130 355017 354972 355335 355936 356199 355607 353984
61381 353984 351614 349346 348301 349062 351159 353615 355831 357659 358890 359274 359080 359016 359466 360262 361335 362951
61365 362951 364984 366596 367225 367510 368525 370317 371905 372732 373402 374849 377361 380712 384748 389358 394172
61350 394172 398707 402803 406685 410743 415385 420871 426909 432539 436854 439923 442770 446303 450519 454827
61336 454827 458938 463201 468038 473226 477789 480687 481668 481446 481020 480834 480621 479950 478762 477417 476445 476310
61320 476310 477210 478908 480828 482544 484215 486412 489466 493105 496850 500733 505460 511793 519855 529111
61306 529111 538925 548979 559247 569872 581162 593387 606266 618764 629717 638619 645484 649979
61294 649979 651211 648681 643229 636586 630007 623532 616557 608780 600467 591967 583250 574016 564200 554277
61280 554277 544966 536654 529229 522516 516760 512463 509792 508328 507453 506850 506564 506707 507301 508410 510215
61265 510215 512767 515699 518439 520850 523514 527163 531935 537444 543495 550272 557733 565243 572190 578570
61251 578570 584626 590144 594708 598509 602254 606140 609437 611351 611907 611722 611274 610713 610133 609548 608714 607336
61235 607336 605498 603690 602376 601649 601220 600679 599852 599101 599188 600701 603684 607850 612952 618780 624984 631190
61219 631190 637231 643172 649285 656094 664056 672824 681207 688364 694833 701756 709261 716305 722123 726961
61205 726961 731168 734443 736603 738410 740820 743787 746609 749342 753065 758732 766408 775773 786692 798944
61191 798944 811912 824937 837714 850024 861369 871216 879407 885978 890784 893691 895117 896008 897135
61178 897135 898520 899524 899310 897316 893540 888441 882498 875869 868612 861008 853338 845457 836992 828004
61164 828004 818946 809739 799380 786982 772966 758750 745352 732777 720730 709257 698407 687787
61152 687787 676997 666358 656775 648871 642551 637396 633185 629917 627589 626008 624657 622704 619428 614884
61138 614884 609940 605416 601287 597012 592601 588946 586923 586456 586835 587818 589961 593729 598690 604040 609799
61123 609799 617025 626706 638792 652553 667589 684105 702340 722225 743760 767265 792882 819999
61111 819999 847598 875147 902861 930997 959239 986920 1013563 1038833 1062164 1082894 1100865
61100 1100865 1116536 1130278 1141735 1150020 1154344 1154306 1149857 1141331 1129436 1114907 1098128 1079261 1058605
61087 1058605 1036532 1013147 988439 962820 937106 911799 886728 861637 836897 813367 791732
61076 791732 772172 754522 738489 723806 710405 698408 687867 678625 670540 663643 657950 653331
61064 653331 649753 647389 646225 645811 645743 646257 648007 651302 655862 661244 667277 674089 681964 691052 701079
61049 701079 711566 722601 735114 749969 766965 785195 804206 824338 846038 869475 894800
61038 894800 922104 950992 980797 1011458 1043710 1078210 1114902 1153411 1193537 1235138 1278033
61027 1278033 1322403 1368875 1417741 1468267 1519131 1569527 1619905 1671894 1727526 1788120 1853915
61016 1853915 1925172 2003534 2091654 2191463 2303673 2429343 2571516 2735479 2928643 3160826
61006 3160826 3443902 3790724 4215165 4733408 5363804 6124302 7030238 8093745 9322127
60997 9322127 10715057 12264989 13958645 15765863 17610610 19349878 20799631 21810825
60989 21810825 22343944 22483121 22384838 22210015 22082639 22071044 22166748 22264920 22182054 21727969
60979 21727969 20795869 19409064 17697321 15831428 13964915 12207342 10622134 9234179
60971 9234179 8041013 7025716 6167135 5444241 4836925 4326937 3898837 3539303 3235927
60962 3235927 2977567 2755566 2563707 2397081 2251531 2123913 2012036 1914286 1829528 1756930
60952 1756930 1695260 1642658 1597609 1559722 1528820 1503536 1481629 1461501 1442689 1425093 1408595
60941 1408595 1393433 1380048 1368363 1357863 1348426 1340350 1333438 1326864 1320214 1313912 1308223 1302503 1295928
60928 1295928 1288408 1280272 1271481 1261705 1250873 1239063 1226021 1211332 1195036 1177700 1159838 1141516
60916 1141516 1122477 1102405 1081231 1059457 1038184 1018419 1000242 982802 965242 947543 930424
60905 930424 914528 899874 886096 873058 861023 850179 840233 830648 821156 811776 802493 793278 784391
60892 784391 776235 768738 761195 752930 743938 734700 725575 716559 707423 697926 688023 678057 668541 659570
60878 659570 650666 641486 632488 624531 617846 611748 605449 598835 592327 586189 580210 574031 567660 561642
60864 561642 556682 553012 550140 547312 544243 541284 538859 536958 535268 533571 531775 529643 526921 523814
60850 523814 521009 518941 517186 514905 511833 508532 505626 503065 500236 496631 492270 487642 483310 479477
60836 479477 475856 472107 468292 464637 460891 456416 451072 445578 440707 436616 433334 431362 431071 431819 432524
60821 432524 433063 434270 436394 438435 439398 439533 439787 440514 441344 441962 442354 442433 442072 441532 441324 441535 441734 441681
60803 441681 441681 441957 442043 441241 439567 437762 436292 434765 432630 430165 428267 427251 426327 424535 421833 418954
60787 418954 416429 414187 411985 409709 407179 404146 400719 397500 395067 393494 392448 391497 390184 388127
60773 388127 385368 382555 380531 379744 380015 380725 381216 381259 381275 381910 383304 384954 386354 387499 388689 390085
60757 390085 391651 393206 394402 394979 395269 396118 397994 400446 402715 404655 406670 409022 411566 413987 415887
60742 415887 416844 416850 416580 416702 416949 416313 414195 410886 406828 401928 395910 389040 382151 375989 370756 366250
60726 366250 362301 358987 356364 354110 351718 349142 346916 345375 344059 342325 340309 338720 337807 337155 336554
60711 336554 336352 336689 336992 336665 335915 335394 335278 335124 334491 333316 331810 330362 329516 329644 330568 331746 332881
60694 332881 334162 335840 337797 339644 341134 342384 343725 345389 347340 349400 351548 354020 357118 360898
60680 360898 365082 369262 373214 377091 381271 385884 390528 394612 398023 401248 404797 408695 412631 416319
60666 416319 419446 421448 421795 420604 418729 417010 415562 413942 411907 409755 407824 405900 403430 400354
60652 400354 397457 395690 395233 395365 395182 394259 392751 391183 390206 390210 390937 391584 391405 390088 387526 383573 378394
60635 378394 372860 368198 365041 363020 361312 359438 357459 355650 354242 353478 353670 354997 357168 359398 360848
60620 360848 361212 360895 360626 360893 361618 362231 362011 360636 358578 356891 356409 357097 358264 359313 360127 360772 361233
60603 361233 361579 362167 363350 365034 366771 368263 369552 370673 371466 371941 372561 373852 375820 378036 380227
60588 380227 382405 384411 385760 386123 385660 384668 383200 381383 379832 379281 379864 381114 382656 384511 386731
60573 386731 389206 392052 395873 401266 408149 415782 423444 430982 438795 447369 456816 466783 476721 486162
60559 486162 494707 501918 507394 510838 511888 510074 505337 498572 491254 484496 478768 474475 472201 472112 473584
60544 473584 475847 478682 482206 486348 491118 497093 505034 514980 526218 538200 550960 564464 578019
60531 578019 590619 601598 610696 617642 622039 623639 622634 619667 615570 610941 605904 600398 594679 589341
60517 589341 584758 580716 576768 572759 568876 565407 562713 561262 561277 562348 563747 565230 567319 570709 575698
60502 575698 582453 591527 603738 619511 638701 661135 687018 716602 749641 785373 822999 861956
60490 861956 901730 941546 980210 1016116 1047385 1072182 1089055 1097114 1096021 1085914 1067257 1040712
60478 1040712 1007227 968300 925928 882034 837980 794849 753965 716648 683344 653405 625995
60467 625995 600996 578802 559450 542348 526837 512744 500263 489432 479888 471195 463313 456534
60455 456534 450854 445625 440149 434526 429505 425466 422023 418819 416166 414410 413037 411047 408176 405198
60441 405198 402924 401359 399974 398456 396943 395740 395034 394720 394373 393532 392193 390909 390265 390289 390527 390572 390396
60424 390396 390206 390212 390557 391262 392062 392419 391979 391087 390610 391082 392200 393319 394301 395532 397247 399249 401318
60407 401318 403436 405462 407047 408173 409373 411032 412759 413935 414641 415560 417041 418781 420440 422076 423851
60392 423851 425617 427029 427862 428231 428613 429561 431172 432955 434564 436409 439069 442162 444499 445502 445984
60377 445984 447279 450044 454056 458615 462795 465803 467654 469231 471236 473272 474361 474205 473597 473675 475092
60362 475092 477728 480841 483537 485501 487288 489682 492792 496043 498977 501835 505361 510213 516509 523766
60348 523766 531337 539053 547319 556342 565470 573550 579788 583942 585889 585465 582795 578380 572765 566388
60334 566388 559745 553283 546990 540430 533412 526413 520177 515018 510662 506595 502460 498232 494174 490636
60320 490636 487785 485551 483776 482385 481505 481468 482544 484498 486638 488562 490747 494154 499378 506510 515573
60305 515573 526532 538939 552228 566541 582687 600952 620297 638962 655392 668379 676875 680225
60293 680225 678288 671030 658486 641625 622810 604582 588019 572823 558775 546383 536115 527791
60281 527791 520976 515397 510767 506707 503160 500400 498343 496274 493575 490407 487316 484467 481594 478420
60267 478420 474812 470824 466919 463872 461983 460606 458840 456554 454266 452249 450329 448478 446940 445696
60253 445696 444386 443012 442145 442079 442233 441809 440860 440283 440907 442801 445340 447615 448957 449396 449570 449940 450234
60236 450234 449912 449016 448172 447876 448225 449310 451322 454072 456883 459270 461372 463439 465269 466628 467973
60221 467973 470177 473510 477403 481292 485245 489549 494086 498481 502621 506775 511351 516757 523278 530768
60207 530768 538616 546355 554198 562597 571381 579825 587627 595241 603023 610541 617135 622783 627956 632854
60193 632854 637281 641090 644198 646231 646772 646029 644730 643158 640868 637656 634240 631432 628941 625639 620945
60178 620945 615402 609784 604071 597627 590194 582500 575802 570824 567114 563593 559745 556120 553512 551916
60164 551916 550607 549092 547594 546606 546281 546270 545928 544757 542985 541671 541790 543143 544584 545362 545785 546347
60148 546347 546822 546717 546304 546620 548510 551992 556446 561034 565105 568620 572286 576922 582620 588792 595027
60133 595027 601588 608962 617202 625815 634040 641103 646482 650243 653073 655792 658718 661473 663404 664236
60119 664236 664428 664873 666211 668444 671220 674225 677156 679608 681441 683107 685192 687570 689441 690209 689906
60104 689906 688693 686553 683692 680696 677780 674328 669689 664126 658404 652700 646678 640533 635177 631162
60090 631162 628087 625409 623326 622398 622595 623154 623261 622654 621770 621539 622756 625245 627806 629376 630125 631010
60074 631010 632382 633495 633395 631696 628319 623021 615763 607284 598819 591135 584105 577212 570199 563174
60060 563174 556373 549992 544137 538751 533618 528607 523849 519617 516007 512901 510350 508853 509027 510875
60046 510875 513508 515827 517549 519420 522344 526452 531226 536350 542044 548447 555027 561009 566274 571458
60032 571458 577052 582682 587407 590496 591711 591106 588902 585539 581482 576891 571661 565759 559286 552256
60018 552256 544702 537132 530430 524907 519798 514147 508040 502407 497609 492831 487124 480603 474291 469044
60004 469044 465020 461963 459588 457725 456443 456093 456871 458266 459275 459316 458770 458462 458837 459851 461452 463751
59988 463751 466691 469920 473183 476640 480523 484612 488318 491302 493723 495769 497230 497758 497392 496492 495205
59973 495205 493323 490783 487932 485121 482286 479298 476547 474761 474221 474493 475139 476331 478543 481825 485742
59958 485742 489844 493827 497285 499826 501630 503430 505568 507402 508116 507865 507519 507296 506415 504353 501800
59943 501800 499833 498636 497666 496794 496499 496882 497208 496676 495230 493355 491448 489676 488171 487071 486485 486543
59927 486543 487368 488922 491080 493869 497335 501174 504882 508446 512431 517228 522625 528340 534460 541017
59913 541017 547662 554205 560942 567819 573723 577427 579041 579740 580220 580253 579714 579063 578560 577821 576506 574763
59897 574763 572675 569986 566886 564417 563432 563598 564054 564723 566257 568841 571819 574546 577166 580383 584791
59882 584791 590433 596803 603239 609515 615953 622782 629608 635797 641177 646013 650443 654331 657498 659634
59868 659634 660011 657898 653452 647815 642150 636785 631404 625708 619716 613685 607975 602830 598205 594013
59854 594013 590569 588467 587790 587750 587499 587242 588255 591743 597864 605781 614381 622764 630216 636033 639562
59839 639562 640487 639108 636398 633697 632113 631896 632341 632430 631595 629798 627007 623019 617985 612721 608096 604204
59823 604204 600477 596540 592522 588523 584208 579262 574021 569331 565780 563147 560667 557767 554547 551568
59809 551568 549240 547481 545934 544286 542286 539740 536777 533913 531477 529104 526250 523185 520935 519930
59795 519930 519161 517117 513417 509153 505700 503516 502141 501030 500132 499679 499634 499581 499209 498721 498538 498730 499014
59778 499014 499298 499807 500565 501118 501098 500806 500880 501528 502438 503412 504671 506425 508388 509930 510654 510802 511142 512443
59760 512443 514896 517999 521103 524106 527467 531521 535981 540275 544300 548677 554215 561211 569240 577543
59746 577543 585528 593018 600202 607468 615094 622903 630213 636365 641359 645774 649910 653248 654970 654892 653618
59731 653618 651895 650101 648374 646786 645232 643407 641155 638675 636172 633454 630134 626167 621933 617917
59717 617917 614555 612314 611449 611459 611088 609227 605797 601722 598158 595828 594840 594816 595230 595873 597003 598900
59701 598900 601338 603688 605517 606897 608127 609409 610829 612410 614053 615579 617007 618705 621105 624251
59687 624251 627617 630372 631943 632439 632491 632531 632365 631654 630621 629845 629364 628497 626729 624294 621551 618247 613888
59670 613888 608564 602849 596964 590624 583800 577193 571663 567458 564177 561390 559089 557541 556812 556564 556416
59655 556416 556463 557238 559064 561698 564711 567989 571598 575431 579330 583349 587447 590984 592937 592681 590349
59640 590349 586501 581778 576810 572019 567403 562800 558364 554491 551324 548737 546794 545733 545378 545032 544191
59625 544191 543015 541879 540799 539542 537968 535990 533420 530138 526247 521980 517643 513734 510755 508721
59611 508721 507175 505901 505238 505440 506142 506875 507744 509086 510720 512063 512923 513622 514336 514733 514436 513563 512646
59594 512646 512144 512071 512030 511692 511277 511366 512115 512965 513372 513477 513612 513453 512290 510061 507482 505042 502446 499334
59576 499334 496103 493608 492247 491638 491047 489881 487887 485187 482211 479537 477689 476942 477090 477442 477358 476956
59560 476956 477072 478305 480228 481739 482158 481753 481262 481183 481648 482689 484301 486242 488168 490127 492684 496237
59544 496237 500378 504311 507910 512009 517595 525016 534006 544058 554619 565478 577377 591653 608486
59531 608486 625504 638746 645332 645185 640461 633816 627152 621342 616622 613243 611713 612386 614984 618788
59517 618788 623093 627119 629797 630338 629049 626938 624309 620339 614280 606522 598078 589488 580710 571736
59503 571736 562776 553986 545515 537751 531167 525931 521891 518790 516267 513792 511034 508257 506096 504927
59489 504927 504654 504957 505461 505774 505721 505613 506068 507573 510338 514342 519191 524065 528322 532266 536939 542994
59473 542994 550055 557237 563974 570123 575546 579925 582963 584655 585416 585922 586657 587560 588309 588910 589791 591308
59457 591308 593540 596641 600986 606717 613515 621077 629477 638672 647999 656684 664731 672724 680738 687913
59443 687913 693188 696097 696711 695208 691715 686345 679234 670713 661487 652391 643885 636006 628793 622380
59429 622380 616602 610956 605245 599938 595700 592901 591875 593275 597674 604938 614388 625505 638203 652520
59415 652520 668457 686138 705793 727442 750616 774374 797601 819446 839431 856652 868860
59404 868860 873138 868258 856175 840744 825265 811654 801276 795269 793881 796231 800796 805427 807022
59391 807022 802424 790374 772190 750349 727089 704431 684303 667604 653642 641243 630185 621078
59379 621078 614315 609800 607361 606756 607425 608759 610435 612109 613229 613721 614469 616399 619284 622116 624500
59364 624500 626970 630037 633625 637502 641688 646331 651583 657512 663767 669612 674871 680582 688005 697108
59350 697108 706859 716862 727751 739863 752618 765628 779486 794808 811171 827629 843740 859391
59338 859391 873960 886445 896345 903860 909201 912120 912206 909324 903619 895222 884141 870547 855192
59325 855192 839298 823805 808897 794458 780763 768255 756868 746172 736177 727409 720077 713747
59313 713747 707961 702616 697646 692912 688626 685313 683139 681866 681620 682930 685734 689170 692890 697731
59299 697731 704443 712458 720757 729237 738083 746099 750769 750072 743610 732167 717183 700620 684381
59286 684381 669411 655827 643927 634314 626913 620753 615161 610613 607950 607324 608413 611212 615953 622429
59272 622429 630051 638622 648569 660143 672733 685255 697164 708740 720258 731140 740247 746959
59260 746959 751505 754138 754478 752025 746942 739869 731261 721516 711493 702136 693491 684812 675953 668068
59246 668068 662535 659580 658376 658077 658300 658841 659497 660203 660976 661795 662900 665114 669323 675379 681872 687318
59230 687318 691433 694972 698465 701462 703134 703309 702628 701706 700351 697779 693523 688005 682135 676460 670941
59215 670941 665577 660855 657181 654050 650316 645445 640015 634735 629532 624083 618844 614746 611988 609846
59201 609846 607662 605356 602843 599825 596546 594030 592904 592410 591239 589066 586730 585119 584433 584462 585000
59186 585000 585947 587359 589387 591943 594579 597070 599955 603994 609117 614322 618725 622411 626175 630666
59172 630666 635877 641346 646873 653006 660508 669283 678221 686456 694383 702963 712358 721788 730461 737950
59158 737950 743835 747745 749792 750287 749009 745401 739577 732421 724528 715714 705838 695350 684665 673674
59144 673674 662391 651557 641958 633474 625313 616978 608592 600534 593173 586742 581031 575426 569655 564299
59130 564299 560157 557325 555357 554118 553876 554611 555828 557182 558828 561028 563820 567284 571776 577629 584792
59115 584792 592907 601568 610356 618879 626993 634823 642406 649464 655716 661265 666437 671301 675664 679574
59101 679574 683485 687720 691968 695559 698142 699829 700744 700748 699779 698195 696553 695169 694048 693079 692137 691121
59085 691121 690146 689560 689457 689202 687760 684619 680204 675274 670124 664449 657900 650659 643437 636819 630558
59070 630558 623731 615845 607657 600564 595206 590994 586998 582891 578900 575265 572041 569184 566528 563817
59056 563817 560904 557856 554774 551753 549118 547404 546811 546793 546442 545238 543346 541376 540018 539711 540366 541399
59040 541399 542237 542769 543214 543716 544256 544870 545715 546879 548310 549913 551640 553548 555922 559311 564282 571067
59024 571067 579510 589304 600224 612169 625068 638712 652663 666413 679648 692165 703509 712958
59012 712958 720043 724831 727415 727437 724654 719875 714706 710150 705954 701703 698068 696353 696952 698982 701556
58997 701556 704797 709184 714360 719230 723154 726546 730197 734389 738699 742281 744237 744167 742639 740796 739204
58982 739204 737339 734507 730939 727555 724975 723304 722764 723804 726477 730319 735146 741519 750058 760599
58968 760599 772373 784780 797607 810639 823500 835938 848019 859902 871559 882710 892907
58957 892907 901584 908166 912230 913587 912146 907732 900201 889818 877391 863783 849286 833754 817419
58944 817419 801216 785995 771646 757391 742929 728985 716716 706808 699164 693210 688410 684594
58932 684594 681868 680217 679386 679202 679713 680749 681637 681789 681360 680926 680610 680064 679224 678498 678148 677981 677760 677418
58914 677418 676771 675538 673888 672476 671687 671302 671115 671415 672551 674515 677399 681862 688634 697786 708813
58899 708813 721237 734703 748808 763296 778280 793848 809615 825082 840357 856097 872738
58888 872738 890165 908145 926756 946267 966806 988172 1009785 1030781 1050278 1067556 1081927
58877 1081927 1092625 1099076 1101235 1099481 1094269 1086007 1075143 1062108 1047158 1030462 1012394 993678
58865 993678 975313 958324 943408 930592 919310 908877 898843 888946 878991 868947 858973 849152
58853 849152 839351 829516 819985 811285 803617 796631 789640 782100 774010 765934 758494 751789 745436 739053
58839 739053 732439 725282 717155 707980 698276 688710 679608 670980 662807 655222 648529 643079 638849 635270
58825 635270 631856 628943 627309 627086 627635 628624 630497 633641 637769 642482 647748 653339 658495 662811 666923
58810 666923 671552 676276 680044 682613 684688 686788 688712 690045 690525 689866 687833 684546 680331 675341 669758
58795 669758 664149 658993 653956 648270 641867 635571 630086 625295 620744 616357 612529 609771 608362 608102
58781 608102 608472 609249 610803 613490 616981 620617 624143 627593 630677 632882 634072 634362 633481 630869 626398
58766 626398 620432 613293 605352 597638 591503 587411 584577 582056 579695 577960 577366 578245 580497 583382 586044
58751 586044 588376 590863 593544 595854 597687 599763 602519 605267 607049 607863 608545 609866 612228 615870 620715
58736 620715 626126 631287 635846 639991 644084 648409 653045 657742 662124 666241 670636 675702 681238 686883
58722 686883 692605 698449 704085 709068 713415 717667 722423 728022 734472 741532 748941 756730 765040 773547
58708 773547 781357 787722 792522 795791 797079 795626 791006 783302 772839 760071 745638 730229 714398
58695 714398 698545 682870 667197 651156 634787 618750 603791 590319 578699 569475 562750 557668
58683 557668 553103 548728 544842 541294 537295 532478 527478 523122 519488 516160 513100 510838 509937 510626 512864
58668 512864 516403 520761 525460 530480 536279 543284 551419 560209 569138 577724 585404 591532 595495 596782
58654 596782 595209 591272 586100 580718 575421 570132 565118 560837 557170 553461 549457 545593 542124 538658
58640 538658 534961 531589 529166 527548 526357 525914 526883 529248 532405 536014 539967 543700 546473 548387 550236
58625 550236 552206 553562 553898 553815 553949 554080 553860 553795 554777 556876 559372 561899 565015 569495 575367 581858
58609 581858 588153 594055 599798 605244 609604 612220 613439 614304 615462 616758 617799 618300 617806 615713 611969
58594 611969 607429 603176 599708 596973 594861 593412 592743 593071 594754 598124 603294 610092 618129 627009 636614
58579 636614 647046 658098 669011 679058 688185 696714 704696 712044 719169 726887 735726 745823 757384
58566 757384 770728 785965 803208 822908 845221 869152 893263 917393 942763 969996 997766
58555 997766 1023744 1046285 1064786 1079072 1088999 1094395 1095095 1091391 1084577 1076570 1068745 1061451 1054567
58542 1054567 1047808 1040418 1031438 1020613 1008329 994416 977827 957971 935633 912137 888319 864815
58530 864815 842585 822450 804653 789386 777105 767726 760165 753448 747755 743657 740822 738351 735995
58517 735995 734173 732932 731647 729767 727261 724367 721309 718234 715106 711826 708651 706192 704632 703277
58503 703277 701296 698630 695875 693560 691879 690784 689986 689161 688415 688241 688753 689406 689725 689847 690125 690738 692055
58486 692055 694765 699181 704866 711310 718522 726646 735632 745657 757240 770479 784772 799685 815375
58473 815375 831683 847569 861939 874216 883562 888567 888690 885201 879719 872494 863135 852358 841790
58460 841790 832513 824934 819745 817785 819010 822609 828102 835528 844689 855066 866387 878450 890366
58447 890366 900640 908002 911802 911865 908453 902041 892735 880462 866219 852353 840818 831683 824146
58434 824146 818189 814251 812010 810797 810800 812651 816182 820732 826335 833411 841602 850145 859140 869143 879658
58419 879658 889322 897528 904559 910113 913073 912953 910448 906316 900733 893963 886587 878797 870336 861328
58405 861328 852420 844006 836119 829060 823193 818094 812987 808137 804800 803549 803544 803752 804056 804845 806306 808434
58389 808434 811164 814251 817400 820513 823408 825578 826886 828175 830462 833810 837755 842465 848442 855356
58375 855356 862189 868435 874278 879924 885637 892033 899178 905837 910958 915645 922279 931786 943064 954893
58361 954893 966890 978691 989898 1001108 1013522 1027146 1040686 1053411 1065694 1077420 1087323 1094512
58349 1094512 1099415 1102698 1104444 1104960 1105317 1106427 1108384 1111090 1114740 1119464 1125320 1132803 1142467 1153917
58335 1153917 1166095 1178626 1191996 1206471 1221873 1238265 1255675 1273234 1289836 1305537 1321007
58324 1321007 1335758 1348435 1358752 1367520 1374769 1379657 1382522 1385242 1389077 1393621 1398243 1403020 1407901
58311 1407901 1412558 1417556 1424221 1432901 1442705 1453247 1465168 1478681 1493162 1508447 1524929 1542157
58299 1542157 1559018 1575603 1593101 1611559 1629674 1647136 1665193 1684407 1703885 1723316 1743765
58288 1743765 1765744 1788506 1811963 1837245 1864485 1892041 1918934 1946264 1975362 2006302 2039041
58277 2039041 2074208 2111881 2151271 2192245 2235401 2280171 2324900 2369355 2415049 2462592 2511081
58266 2511081 2560620 2612811 2667933 2724282 2781296 2840697 2903527 2968698 3035489 3104690 3176132
58255 3176132 3248005 3319905 3393675 3469901 3546607 3622906 3700895 3782364 3866806 3954339 4047299
58244 4047299 4146989 4252050 4362024 4479284 4605434 4739178 4879886 5029780 5190317 5359990
58234 5359990 5538182 5727538 5929963 6144103 6369611 6609999 6868171 7143001 7433722
58225 7433722 7743913 8077716 8435919 8819312 9232123 9678574 10159913 10678534 11241214
58216 11241214 11854955 12524098 13255035 14058981 14946643 15925948 17009355 18217899 19574248
58207 19574248 21099155 22820396 24778984 27022760 29604355 32594492 36091692 40216347
58199 40216347 45111024 50960087 58000278 66501985 76750806 89053618 103733553 121077434
58191 121077434 141268158 164348526 190201116 218520359 248803419 280329731 311970134
58184 311970134 341788356 366818500 383572278 389288852 383141469 366506598 342180317
58177 342180317 313239246 282282129 251226509 221400175 193672303 168551075 146258498
58170 146258498 126792799 109991182 95599590 83330940 72894934 64013029 56436333
58163 56436333 49957666 44405620 39633180 35516583 31956642 28870932 26185645 23837679
58155 23837679 21777815 19964715 18358905 16926663 15644518 14494037 13455639 12512041
58147 12512041 11653469 10873921 10165144 9518454 8928828 8392388 7902618 7453271 7042115
58138 7042115 6667626 6324597 6006780 5711040 5435164 5174612 4925741 4689773 4469442
58129 4469442 4263890 4070644 3890112 3723775 3569836 3424920 3288645 3162436 3045089
58120 3045089 2933499 2826907 2726758 2632969 2543788 2458903 2379505 2305457 2235154 2167964 2104438
58109 2104438 2044445 1987329 1933413 1883237 1835832 1789684 1744868 1702364 1661958 1622578 1583958
58098 1583958 1546207 1508665 1471088 1435147 1402818 1373890 1346735 1320774 1296488 1273799 1252166
58087 1252166 1231675 1212442 1193684 1174692 1155850 1137341 1118012 1097065 1075735 1055644 1036554
58076 1036554 1017374 998190 979528 960832 941619 923067 906399 890632 874065 857128 841648
58065 841648 827965 814986 802560 791621 782222 773382 764726 756566 748611 740204 731542 723111 714292
58052 714292 704111 692996 682230 672087 662008 652158 643218 635107 627496 621059 616530 612956 608700
58039 608700 603730 599123 594669 589036 582201 575745 570513 565692 560421 554727 548604 541631 533844 525823
58025 525823 517772 509618 501936 495482 489851 483881 477409 471397 466310 461615 456884 452230 447617 442842
58011 442842 438179 434066 430308 426636 423666 422081 421252 420040 418607 417902 417659 416613 414655 413015 412194
57996 412194 411373 410089 408792 407393 404920 401190 397345 394141 391141 388221 386374 386092 386180 385292 383743
57981 383743 382854 383114 383920 384663 385240 385640 385583 384579 382310 379191 376426 375054 374963 375246 375306 375063 374507 373865
57963 373865 373893 375055 376587 377381 377581 378173 379149 379440 378738 378002 377823 377536 376493 375020 373487 371433 368431
57946 368431 365135 362728 361763 362020 363019 364275 365506 366976 369348 373002 377775 383393 389661 396286 403033
57931 403033 410072 417573 425017 431529 436864 441358 445001 447363 448427 448644 448029 446030 442513 438129 433589
57916 433589 429218 425339 422350 420195 418389 416636 414899 412983 410802 408972 408256 408437 408531 408066 407200 405708
57900 405708 403009 399303 395544 391991 387921 383042 378109 373706 369515 365299 361657 359163 357553 356297
57886 356297 355259 354403 353609 353190 353783 355290 356747 357638 358441 359383 359646 358511 356457 354426 352768 351647
57870 351647 351693 353267 355562 357339 358264 358797 359071 358689 357568 356309 355633 355802 356595 357659 358895 360520
57854 360520 362602 364658 366104 366983 367780 368613 369219 369639 370174 370651 370572 370091 369930 370165 369982 368914 367366
57837 367366 365573 363024 359423 355425 351865 348978 346772 345372 344557 343762 342940 342591 342535 341768 340100 338829
57821 338829 338942 339682 339851 339578 339712 340253 340643 341032 341991 343287 344016 343693 342297 339538 335196 329961 324979
57804 324979 320609 316436 312334 308676 305597 302944 300967 300323 301312 303596 306526 309242 310815 311033 310853
57789 310853 311407 312810 314636 317129 320923 325709 330290 334035 337324 340477 343232 345579 348171 351351
57775 351351 354468 356686 358017 359102 360360 361789 363309 364831 366068 366582 366068 364463 361858 358371 354127
57760 354127 349408 344788 340867 337727 334873 331928 329192 327304 326603 327021 328294 329919 331283 332299 333682
57745 333682 336119 339436 343079 347090 351859 356987 361193 363594 364563 365120 365928 367032 368201 369214 370067
57730 370067 371017 372261 373575 374585 375316 376104 376861 376890 375677 373557 371312 369280 367149 364577 361700 358925
57714 358925 356341 353545 350143 346245 342321 338640 335081 331497 327985 324711 321740 319103 316805 314660
57700 314660 312356 309857 307539 305841 305024 305253 306581 308663 310785 312299 312790 311894 309534 306451 303844
57685 303844 302156 300695 298729 296456 294573 293586 294047 296787 302127 309293 317472 327243 340269 357727
57671 357727 379712 405996 436485 470816 508160 547656 588564 629589 668059 699729 719555
57660 719555 723532 710777 684071 648081 607095 564431 523054 485529 453179 425948 403248 384549
57648 384549 369245 356640 346317 338108 331682 326543 322460 319432 317213 315340 313712 312693 312547 313149
57634 313149 314312 315952 317772 319209 319947 320286 320834 321938 323424 324721 325262 324913 323939 322489 320400 317701
57618 317701 314972 312741 310743 308254 305038 301531 298236 295395 293178 291719 290992 290969 291664 292642 292814 291470
57602 291470 289366 288029 287991 288382 288299 287750 287063 286193 285043 283854 282735 281274 279105 276561 274275 272333
57586 272333 270240 267657 264819 262233 260163 258471 256876 255321 254030 253194 252728 252449 252278 252053 251370 249968
57570 249968 248176 246649 245648 244864 243860 242427 240655 238981 238020 237938 238171 238188 238333 239274 240792 241883
57554 241883 242206 242667 244250 246826 249538 251962 254417 257313 260544 263416 265019 264807 263043 260672 258697
57539 258697 257659 257549 257965 258484 259095 260211 262006 263962 265394 266289 267156 268182 269002 269294 269132 268710 268230
57522 268230 268102 268869 270781 273658 277092 280481 283066 284492 285226 285958 286728 287233 287766 289034 291006 292915
57506 292915 294612 297010 300656 304597 307265 308030 307375 306005 304372 302789 301414 300083 298445 296261 293583
57491 293583 290920 289194 289039 289986 290790 290772 290353 290093 289841 289250 288579 288413 288971 290230 292356 295355 298468
57474 298468 300605 301459 301755 302241 302751 302507 301179 299507 298726 299360 300710 301667 301871 301770 301776 301956 302521 303908
57456 303908 306067 308192 309512 310002 310031 309802 309558 309895 311294 313466 315577 317032 317791 318191 318844 320526
57440 320526 323671 327912 332337 336233 339387 341816 343512 344548 345247 346045 347157 348415 349597 350895 352767
57425 352767 355171 357322 358642 359620 361195 363502 365922 368267 371026 374390 377811 380791 383387 385636
57411 385636 387217 388078 388788 389855 391319 393389 396714 401408 406406 410454 413326 415540 417431 419186 421237
57396 421237 423804 426382 428497 430715 434087 438723 443716 448417 453040 457927 462886 467506 471730 475952
57382 475952 480773 486586 493082 499341 504809 509998 515741 521924 527523 531880 535338 538511 541496 544038
57368 544038 546166 548321 550936 553943 556740 558858 560700 563320 567198 571585 575421 578598 581863 585721
57354 585721 590034 594541 599194 603910 608484 612935 617650 623119 629613 636933 644303 650815 656386 662025
57340 662025 668789 676652 684813 692754 700436 707746 714518 721110 728165 735658 742776 749051 755117 761998
57326 761998 769866 777768 784496 789690 794211 799336 805590 812526 819764 827644 836462 845558 853898 861381
57312 861381 868798 876677 884877 893247 901837 910428 918704 927092 936559 947170 957560 966396 973884 981347
57298 981347 989802 999431 1010028 1021302 1032861 1044462 1056319 1068831 1081981 1095204 1107877 1119866
57286 1119866 1131631 1143835 1156726 1169853 1182541 1194662 1206755 1219449 1232959 1247190 1261971
57275 1261971 1277010 1291821 1305888 1318942 1331174 1343271 1356060 1369828 1384053 1398048 1411813
57264 1411813 1425943 1440890 1456702 1473331 1490655 1508248 1525661 1543067 1561132 1580175 1599888
57253 1599888 1619899 1640035 1659947 1679134 1697655 1716258 1735522 1755364 1775641 1796624 1818484
57242 1818484 1840874 1863534 1886777 1910819 1935130 1959134 1983207 2008120 2033712 2058937 2083277
57231 2083277 2107374 2132068 2157480 2183271 2209247 2235334 2261357 2287315 2313627 2340736 2368566
57220 2368566 2396692 2425044 2454212 2484998 2517726 2551919 2586521 2620482 2653375 2685549 2717649
57209 2717649 2749985 2782412 2814792 2847285 2880004 2912574 2944388 2975381 3006222 3037593 3069515
57198 3069515 3101519 3133160 3164051 3193663 3221663 3248454 3274971 3301840 3329024 3356291 3383595
57187 3383595 3410842 3437725 3464120 3490440 3517319 3545063 3573514 3602173 3630223 3656677 3681007
57176 3681007 3703689 3725957 3748892 3772775 3797135 3821316 3845030 3868492 3891994 3915386 3938181
57165 3938181 3960238 3982049 4004169 4026625 4049139 4071717 4094620 4117827 4140956 4163756 4186281
57154 4186281 4208289 4228800 4246588 4261146 4272980 4282985 4291726 4299330 4305899 4311816 4317715 4324269
57142 4324269 4332067 4341598 4353300 4367575 4384650 4404362 4426216 4449932 4475900 4504815 4536787 4571127
57130 4571127 4607190 4645075 4685165 4727254 4770668 4815152 4861107 4908937 4958687 5010554 5065354
57119 5065354 5124383 5189287 5262361 5346372 5443470 5554409 5679216 5818420 5973266 6145126
57109 6145126 6335507 6546836 6782888 7048661 7350569 7697045 8098653 8567699 9118506
57100 9118506 9768521 10539184 11456305 12551018 13860923 15429201 17301338 19522164 22134668
57091 22134668 25178359 28685469 32677395 37162886 42134504 47561068 53381347 59502685
57083 59502685 65794821 72067354 78044868 83378480 87714624 90789352 92487684 92836528
57075 92836528 91952314 89985866 87089230 83405492 79073753 74239620 69059756 63693905
57067 63693905 58289977 52973362 47844577 42981081 38439304 34256777 30454165 27036160
57059 27036160 23992485 21301423 18935091 16863146 15054233 13477310 12103463 10906622
57051 10906622 9863082 8951508 8153494 7453123 6835905 6289031 5802491 5368711 4980694
57042 4980694 4631376 4314774 4026590 3763241 3521267 3298064 3092253 2902816 2728579
57033 2728579 2568960 2424577 2296687 2186501 2095069 2022942 1969569 1933607 1913759 1908057 1911694
57022 1911694 1916241 1911614 1888756 1841424 1767861 1672176 1563014 1449278 1336848 1229109 1128933
57011 1128933 1038655 958892 888877 827873 775413 730570 692141 659459 632111 608915 588149
57000 588149 568950 551780 537300 525278 514710 504629 494721 485441 477429 470599 464120 457621 451959
56987 451959 448216 446258 445079 444357 444800 446820 449479 450898 449121 442545 430282 412734 391605 368969
56973 368969 346321 324544 304418 286795 272278 260961 252641 247244 244916 245605 248760 253768 260653
56960 260653 270033 282371 297527 314994 333959 352922 369714 382281 389261 389762 383315 370526
56948 370526 353315 333895 313658 293439 274423 257996 244791 234577 227236 223317 223416 227481 235036
56935 235036 245874 260152 277864 298516 321421 346021 371426 395566 415241 427461 430657 424474
56923 424474 409097 385648 357026 327214 299244 274189 251971 232276 214529 198092 183091
56912 183091 170373 160137 151383 143291 136390 131561 128489 126032 123694 121863 120811 120279 119997 119952 120234
56897 120234 121106 123054 126297 130503 135460 141647 149601 159113 169668 181312 194333 208513 223513
56884 223513 239571 256671 273015 285412 291559 291399 286334 277931 267581 256538 245745 235942 228061
56871 228061 223135 221748 224033 230240 240801 255804 274969 298247 325958 358207 394619 434674
56859 434674 477776 522780 567630 609237 643238 664343 668391 655068 628473 594696 558860 524092
56847 524092 492194 464490 442155 426256 417585 416479 423031 437607 460970 493736 535791 586205
56835 586205 643579 706551 774100 845052 916707 983592 1037806 1071124 1077785 1056727 1012121 951620
56823 951620 883235 813154 745714 684174 630660 585844 549652 522310 504281 495586 495991 505689
56811 505689 524911 552834 587639 627747 672277 720103 768914 815037 853445 878092 883668 868179
56799 868179 833936 786041 730212 671673 614701 562103 515140 474263 439844 412205 391395
56788 391395 377266 369541 367721 371214 379693 393025 410753 431894 455222 479335 502313 521579
56776 521579 534237 537574 529684 510337 481499 446707 409715 373503 339889 309427 281777 256659
56764 256659 234395 215307 199015 184878 172713 162403 153226 144406 136096 128873 122505 116189 109931
56751 109931 104619 100663 97541 94872 92943 91989 91747 91926 92245 91911 90065 86998 84028 81955 80489
56736 80489 79334 78657 78265 77559 76751 76916 78237 79440 79748 80174 81862 84203 85785 86402 86864 87446 87847
56719 87847 88302 89460 91255 92904 93966 94527 94489 93641 92473 92093 93081 94983 97004 98719 100091 101314
56703 101314 102708 104409 106144 107578 108752 109841 110699 111037 110952 110925 111385 112486 114083 115595 116167 115405
56687 115405 113886 112626 112202 112550 113296 113945 114053 113631 113271 113548 114499 115843 117371 118815 119719 119898 119814
56670 119814 120096 120857 121766 122544 123083 123409 123827 124818 126464 128245 129782 131417 133625 136158 138262 139616
56654 139616 140574 141504 142291 142514 141994 141182 140985 141969 143653 144949 145385 145480 145853 146483 147091 147667 148223 148505
56636 148505 148436 148531 149421 151064 152692 153329 152327 149837 146959 144957 144092 143583 142740 141633 140524 139393
56620 139393 138333 137710 137525 137233 136478 135358 133733 131125 127802 125043 123660 123007 122145 121230 120909 121086
56604 121086 121195 121168 121189 120921 119895 118402 117200 116624 116615 117234 118402 119516 120053 120229 120357 120093 119147 118293
56586 118293 118679 120355 122307 123687 124282 124155 123747 124042 125651 127897 129646 130832 132220 133956 135387
56571 135387 136318 137398 139129 141350 143834 146691 150037 153894 158474 164055 170578 177830 185842 194592
56557 194592 203589 212352 220948 229313 236347 240516 241198 238820 234101 228063 222304 218010 214743 211193
56543 211193 207016 202957 199305 195536 191609 188391 186438 185242 184075 182759 181344 179806 178365 177402
56529 177402 176859 176314 175770 175683 176164 176909 177963 179706 181929 183748 184703 185167 185487 185478 185000 184265 183301 181798
56511 181798 179731 177485 175204 172704 170232 168534 167898 167778 167608 167305 166838 166102 165467 165672 166776 167898
56495 167898 168343 168311 168119 167520 166338 165195 164889 165368 165807 165555 164689 163832 163678 164458 165700 166682 167221 167800
56477 167800 168929 170629 172551 174329 175861 177385 179165 180936 182081 182622 183477 185231 187170 188232 188380
56462 188380 188258 187985 187306 186534 186246 186269 186092 186055 186934 188450 189443 189601 189795 190527 191220 191307 190976 190548 190186
56443 190186 190472 192153 194900 197248 198199 198051 197448 196507 195247 193977 192910 192148 192170 193428 195293 196400
56427 196400 196304 195819 195540 195071 194022 192745 191704 191027 190939 191625 192439 192312 191221 190205 189794 189567 189429 189914
56409 189914 190895 191410 191237 191249 191666 191493 190347 189378 189543 190405 191442 193081 195449 197544 198834 200353 202948
56392 202948 205659 207173 207778 208506 209365 209808 210074 210640 211105 211026 211115 212215 213787 214775 215415 216719 218678
56375 218678 220329 221223 221614 221599 221387 221955 224061 226919 229116 230526 232011 233561 234247 233921 233542 233653 233787
56358 233787 233603 233512 233880 234515 235229 236116 237108 237934 238653 239622 240887 242178 243512 245190 247205 249217 251137
56341 251137 253209 255507 257734 259539 260821 261869 263338 265706 268630 271373 274011 277420 281755 285896
56327 285896 288975 291567 294603 298041 301520 305425 310129 314746 317829 319009 319031 318612 318138 318010 318285 318327
56311 318327 317686 316907 316665 316721 316657 317027 318688 321455 324554 327907 331836 335946 339547 342866 346688 351094
56295 351094 355691 360652 366246 371680 375854 379136 382988 387839 392722 397103 401694 407102 412960 418899
56281 418899 425400 433079 441808 450981 460174 469343 478802 489055 500284 512094 524194 537073 551461
56268 551461 567444 584676 603093 622801 643755 666337 691699 720608 752399 786099 822198
56257 822198 862264 907176 956967 1012204 1074244 1144144 1222421 1309973 1408154 1517730 1638490
56246 1638490 1769909 1911391 2061931 2220257 2385215 2555301 2727968 2899985 3068077
56237 3068077 3228446 3376260 3506762 3616708 3703981 3766349 3801772 3809573 3790194 3744185 3672700
56226 3672700 3578718 3466422 3339401 3200471 3052877 2900347 2746017 2592382 2442042 2297180
56216 2297180 2158446 2025626 1899368 1781105 1671477 1570167 1477110 1392462 1315356 1244138
56206 1244138 1177999 1117273 1062123 1012171 967301 927441 891482 857830 826174 797504 772248
56195 772248 749657 729096 710582 693867 678336 664011 651501 640805 631355 623197 616763 611415
56183 611415 605748 599624 594404 590766 587644 583856 579567 575620 572506 570422 569371 568826 568194 567829 568692
56168 568692 570883 573479 575895 578385 581190 584314 588173 593283 599194 604895 610309 616281 623108 630356
56154 630356 638148 647342 658318 670763 684693 700486 717982 736809 757586 781586 809418 841392
56142 841392 878845 923521 975727 1034613 1099913 1171592 1247944 1325931 1403368 1478960 1550358
56131 1550358 1614435 1669778 1717048 1756981 1790308 1819583 1848229 1876819 1902371 1921973 1934965
56120 1934965 1941156 1939625 1930567 1916043 1897365 1873363 1842245 1803370 1756263 1699882 1634465 1562724
56108 1562724 1488170 1413564 1341728 1275952 1218209 1168223 1125177 1089029 1059432 1035004 1014678
56097 1014678 998410 985785 975459 966819 960676 957525 956537 956885 958514 961047 963667 966724 971624 978462
56083 978462 985580 992128 999101 1007122 1015270 1023018 1031276 1040542 1050011 1059447 1069954 1081848 1093765
56070 1093765 1104860 1115945 1127615 1139372 1151564 1165910 1182949 1201054 1219019 1237428 1256519
56059 1256519 1275098 1292767 1310859 1329933 1348703 1366686 1385403 1405597 1425754 1444841 1464006
56048 1464006 1484085 1503981 1523096 1542867 1564246 1586169 1608082 1631360 1656550 1681985 1706988
56037 1706988 1733734 1763965 1796477 1829852 1865002 1902929 1942562 1982879 2024604 2067861 2110885
56026 2110885 2153085 2196628 2242957 2290681 2338935 2389564 2443593 2498763 2553247 2608847 2667917
56015 2667917 2730156 2794966 2863769 2937217 3013260 3090731 3171767 3258052 3348043 3440622 3537814
56004 3537814 3640947 3747944 3857628 3972890 4096293 4226422 4362039 4505699 4659575
55995 4659575 4821868 4991268 5170773 5363070 5566561 5780201 6007767 6252828 6513973
55986 6513973 6789597 7082848 7397375 7733257 8091894 8479451 8900351 9353268 9839096
55977 9839096 10366701 10944881 11575483 12261171 13013033 13843397 14758870 15768974 16894417
55968 16894417 18158587 19579515 21180498 23001125 25089177 27493230 30277545 33537536
55960 33537536 37392174 41977595 47467570 54090496 62109105 71795133 83439647 97362577
55952 97362577 113865792 133158431 155316520 180262036 207722081 237205405 268001846
55945 268001846 299038897 328486509 353445255 370331297 376092514 369529289 351769888
55938 351769888 325664008 294679789 261997078 230041247 200359387 173716630 150324527
55931 150324527 130079881 112719485 97903882 85282809 74540089 65396554 57597432
55924 57597432 50919995 45186589 40254405 35996977 32305055 29095151 26301449 23861721
55916 23861721 21719414 19832512 18168913 16696382 15384937 14213925 13167856 12228794
55908 12228794 11379911 10612030 9919083 9290628 8715267 8187334 7703618 7257222 6841085
55899 6841085 6454153 6097911 5769785 5465389 5183772 4924908 4685162 4460734 4252570
55890 4252570 4062644 3888294 3725317 3573729 3435337 3308360 3189469 3078630 2977100
55881 2977100 2882963 2793180 2707567 2626238 2545762 2462638 2378384 2296679 2217690 2139714 2064085
55870 2064085 1993524 1927289 1862523 1799021 1738526 1680941 1625381 1573407 1527017 1484776 1443903
55859 1443903 1404792 1369497 1337188 1305224 1273645 1244626 1218457 1193791 1170810 1150386 1130955
55848 1130955 1109902 1087308 1064939 1042460 1018124 992373 967294 943293 919689 897627 878814
55837 878814 861959 844072 824934 806942 790983 775749 760849 747263 734827 722369 710282
55826 710282 700054 691390 682586 673573 665769 659094 651841 643353 634195 624021 612097 599704 589152
55813 589152 580416 571430 561607 552361 544277 536644 529894 525649 523951 523068 522365 522883 524766 526694 528397
55798 528397 531291 535981 541215 545850 549827 552842 554155 554187 554346 554751 553988 551493 548251 544770 540261
55783 540261 534411 528141 522032 515534 508181 500073 490901 480091 468289 457186 447587 439082 431750
55770 431750 426540 423701 422481 422690 424896 428572 431552 431902 429197 423785 416153 407288 398317 389424 380178
55755 380178 370924 362553 354905 346804 337807 328621 319769 311280 303671 297766 293361 289451 285812 282952
55741 282952 280520 277431 273693 270471 268107 265760 263326 261985 262257 262959 262778 261607 259834 257550 255058
55726 255058 253005 251389 249316 246153 242141 237704 233112 228917 225711 223324 221245 219701 219198 219167 218458
55711 218458 217260 217108 218844 221911 225692 230036 234246 237165 238712 239917 240962 240597 237994 233819 228877
55696 228877 223001 216043 208823 202319 196770 192152 188667 186235 184324 182743 181886 181877 182259 182815 183888 185668
55680 185668 187886 190340 192981 195537 197923 200852 204902 209169 212095 213543 214582 215234 214156 211025
55666 211025 207599 205669 205196 205201 205352 205823 206487 207075 207559 207910 208004 207976 208057 208073 207850 207955 209056 210682 211783
55647 211783 212366 213244 214306 214593 214106 213806 213556 211904 208479 204800 201910 198818 194295 188799 183519 178715
55631 178715 174081 169761 165988 162470 159046 156229 154514 153783 153794 154352 154703 153903 152169 150662 149556 147800
55615 147800 145258 143373 142762 141850 139189 135711 133172 131564 129674 127316 125342 123972 122639 121217 120072
55600 120072 119074 117634 115702 113908 112813 112541 112853 113118 112681 111734 111195 111299 111106 109999 108840 108852 110071
55583 110071 111661 113009 113750 113609 113140 113872 116677 120543 123912 126643 129681 133449 137657 142240 147335
55568 147335 152604 157576 162410 167489 172492 176642 179590 181325 181618 180380 178192 175656 172557 168410
55554 168410 163491 158496 153582 148572 143731 139483 135703 132186 129425 127916 126941 125144 122299 119558
55540 119558 117965 117570 118023 119060 120178 120670 120378 119905 119843 120121 120262 119946 119188 118235 117315 116385 115261 114103
55522 114103 113393 113193 112851 111836 110529 109703 109482 109251 108380 106693 104508 102544 101412 100841 99768 97608
55506 97608 94970 92705 90730 88445 85896 83798 82628 82323 82676 83426 84050 84108 83800 83819 84597 85921 87202
55489 87202 87921 87990 87782 87675 87592 87370 87438 88438 90128 91486 92090 92505 92997 92951 92130 91443 91596 91869 91231
55470 91231 89963 89088 88762 88380 87842 87571 87506 87109 86321 85585 85006 84328 83670 83481 83772 84069 84076 83739 82861 81408
55450 81408 80093 79848 80618 81343 81196 80271 79098 78125 77761 78286 79445 80449 80558 79575 77910 76401 75847
55433 75847 76424 77643 78986 80291 81449 82313 83136 84457 86117 87065 86684 85661 84985 84761 84724 85171 86419
55416 86419 87825 88407 88147 87786 87647 87546 87532 87781 87981 87709 87279 87311 87635 87500 86722 85805 85017 84190 83342
55397 83342 82687 82170 81724 81803 82815 84237 85200 85729 86442 87211 87196 86234 85137 84498 84207 84190 84598 85074 84868
55378 84868 83974 83285 83278 83381 82984 82352 82192 82891 84387 86157 87241 86992 85985 85440 85661 85785 85223 84377
55360 84377 83697 83011 82248 81927 82290 82658 82347 81682 81456 81779 82125 82250 82511 83316 84581 85692 85918 85037
55342 85037 83641 82600 82244 82353 82799 83680 84802 85642 86009 86280 86771 87294 87512 87369 87014 86615 86346 86266
55324 86266 86198 85956 85597 85173 84500 83632 83240 83839 84886 85394 85253 85085 84937 84136 82590 81210 80741 81022
55306 81022 81666 82632 83759 84621 85274 86362 87962 89053 88736 87378 86021 85261 85205 85857 86841 87239 86492
55289 86492 85165 84276 84161 84567 85470 87047 88944 90276 90469 89753 88817 88245 88228 88522 88708 88623 88479 88452 88406
55270 88406 88179 87917 87884 88086 88294 88306 87996 87283 86291 85444 85227 85760 86613 87097 86884 86452 86667 87689 88635
55251 88635 88686 88238 88336 89154 89795 89671 89311 89489 90176 90749 90893 90862 91061 91575 92013 91719 90421 88735 87729
55232 87729 87882 88674 89201 88988 88224 87524 87450 88014 88736 89279 89711 89882 89133 87319 85588 85186 85683 85484 84034
55213 84034 82457 81851 82039 82398 82860 83524 84092 84342 84601 85189 85839 86100 85844 85054 83671 82090 81231 81643
55195 81643 82879 84044 84567 84257 83220 82074 81621 81958 82424 82735 83438 84862 86329 87019 86977 86671 86211
55178 86211 85722 85861 87031 88416 88700 87667 86413 86024 86644 87784 88938 89805 90310 90528 90466 90019 89325
55161 89325 88958 89483 90954 92996 95172 97115 98572 99470 99833 99649 99118 98835 99169 99499 98823 97232 95960
55144 95960 95732 95938 95827 95576 95579 95565 95239 95129 95839 96957 97588 97605 97545 97515 97116 96269 95346 94504 93563 92544
55124 92544 91775 91449 91541 92045 92905 93790 94326 94356 93730 92252 90334 89282 90233 92879 95748 97608 98145 97596
55106 97596 96402 95154 94305 93855 93598 93565 93885 94462 95183 96171 97465 98683 99465 99998 100709 101752 103138
55089 103138 104951 106903 108108 108035 107337 107080 107423 107770 107942 108323 108950 109309 109101 108602 108205 108144 108606 109510
55071 109510 110250 110234 109631 109079 108829 108811 109317 110708 112420 113123 112133 110036 107779 105821 104384 103808 104208
55054 104208 105201 106268 107055 107228 106529 105232 104093 103581 103428 103176 102860 102911 103605 104752 105821 106330 106264 106035
55036 106035 105826 105205 103759 101964 100868 100910 101540 102089 102538 103274 104435 105705 106574 106767 106572 106581 106825 106390
55018 106390 104410 101341 98754 97812 98385 99620 100790 101481 101518 101091 100681 100672 101164 102128 103416 104663 105570
55001 105570 106296 107217 108294 109047 109176 108859 108419 108080 108060 108519 109348 110335 111463 112706 113631 113717 113029 112143
54983 112143 111407 110839 110694 111452 112990 114330 114504 113384 111594 110009 109434 110148 111442 111981 111006 108976
54967 108976 106970 105758 105483 105836 106327 106724 107284 108303 109482 110227 110542 110994 111752 112338 112559 112932 113750
54950 113750 114419 114261 113470 112677 112071 111606 111661 112588 113820 114306 113927 113694 114291 115103 115167 114494 113890 113750 113733
54931 113733 113653 113998 115157 116614 117476 117674 118069 119302 121089 122935 125063 128101 132101 136388 140420 144375
54915 144375 148725 153493 158101 161880 164649 166775 168572 169720 169533 167880 165454 162996 160589 157941
54901 157941 154886 151226 146612 141179 136013 132255 129914 128150 126538 125318 124525 123780 123113 123157 124154 125389
54885 125389 126054 126240 126657 127670 128992 130107 130723 131006 131563 133064 135739 139304 143358 147662 152106 156679
54869 156679 161447 166244 170448 173372 174819 174957 173812 171281 167486 162595 156493 149363 142501 137659
54855 137659 135313 134243 133082 131589 130094 128505 126487 124154 121926 119967 118259 116977 116307 116072 115876
54840 115876 115512 114908 113932 112581 111235 110358 110036 110106 110582 111597 112880 113609 113046 111338 109579 108896 109413
54823 109413 110241 110562 110438 110406 110657 111044 111565 112243 112734 112692 112420 112484 112721 112434 111643 111310 112090 113597 115232
54804 115232 116969 118828 120308 120969 121119 121290 121419 121047 120085 118893 117876 117367 117605 118398 119116 119415 119688
54787 119688 120387 121230 121632 121673 122053 123087 124253 124789 124469 123777 123507 124149 125511 126989 128189 129101 129722
54770 129722 130046 130546 132092 134946 138363 141642 145198 149937 155873 162023 167587 172628 177490 182093 185975
54755 185975 188665 189854 189441 187635 184901 181689 178209 174462 170409 166090 161627 157145 152768 148771
54741 148771 145586 143515 142449 141965 141529 140535 138588 136131 134372 133919 133763 132489 130417 129508 130917 133594
54725 133594 135797 137131 138449 140431 143079 146215 149716 153397 157230 161539 166473 171405 175255 177354
54711 177354 177825 177267 176268 174964 172880 169443 164779 159664 154698 150048 146056 143242 141369 139316 136513
54696 136513 133879 132653 132808 133265 133252 132800 132243 131866 131757 131522 130525 128830 127375 126670 126013 124760 123646
54679 123646 123839 125055 125766 125092 123523 121875 120545 119788 119769 120157 120393 120468 120789 121333 121560 121196 120423 119389
54661 119389 118248 117574 117939 118977 119685 119653 119304 118932 118369 117695 117328 117182 116619 115580 114985 115615 117208 118963
54643 118963 120329 120992 120791 120069 119571 119580 119663 119503 119403 119639 119923 119955 119971 120253 120591 120640 120417 120069 119645 119470
54623 119470 120163 121726 123089 123213 122351 121602 121505 121730 121968 122395 123192 124145 124882 125182 125000 124503 124076 124029 124260
54604 124260 124492 124822 125699 127234 128820 129599 129232 128098 126839 125829 125041 124292 123535 122950 122868 123545 124825
54587 124825 125969 126099 125057 123666 122867 122693 122417 121665 120969 121077 121980 122812 122667 121439 119926 119093 119181
54570 119181 119606 119760 119667 119649 119674 119478 119251 119712 121342 123801 126168 127642 128054 127929 128051 128757 129704 130435
54552 130435 130958 131569 132354 133205 134064 134774 134918 134324 133544 133280 133479 133561 133408 133468 133906 134353 134595 134909 135626
54533 135626 136868 138726 141015 142842 143206 142243 141090 140275 139080 136928 134560 133159 132881 132944 132743 132241
54517 132241 131578 130924 130518 130359 130036 129278 128438 128045 128155 128536 129203 130252 131364 131950 131740 130930 129881 128967
54499 128967 128497 128440 128415 128225 128134 128330 128468 128196 127802 127839 128345 128950 129536 130181 130665 130657 130353 130291 130547 130633 130304
54478 130304 129913 129895 130372 131341 132774 134375 135748 136969 138503 140327 141606 141649 140882 140440 140961 142122 143258
54461 143258 144075 144698 145242 145500 145147 144284 143625 143815 144510 144511 143056 140742 138902 138271 138522 138913 138965 138537 137730
54442 137730 136893 136444 136499 136865 137450 138390 139598 140509 140637 140168 139665 139353 139076 138874 139022 139469 139780 139842 140156
54423 140156 141100 142301 143113 143408 143474 143448 143341 143429 144044 145010 145754 145999 145928 145648 144984 143921 142873 142316 142408
54404 142408 143048 144014 144950 145538 145841 146283 147201 148627 150489 152699 154983 156913 158295 159268 159989 160432 160569
54387 160569 160453 160077 159464 158976 159139 159971 160721 160513 159114 157032 155041 153686 153029 152829 153071 154148 156162
54370 156162 158219 159081 158625 158087 158571 159833 160884 161383 161944 163299 165596 168415 171164 173467 175363 177127
54354 177127 178914 180729 182715 185163 188161 191523 195098 198708 201660 202906 202106 200219 198574 197468
54340 197468 195996 193138 188736 183499 178377 173961 170377 167601 165667 164350 162907 160630 157709 155090
54326 155090 153353 152164 150938 149625 148611 148223 148528 149258 149806 149689 149170 148930 149078 149069 148780 148947 150138
54309 150138 151920 153519 154743 155686 156091 155662 154617 153339 151824 150100 148777 148468 148855 149001 148438 147403
54293 147403 146260 145311 145007 145626 146767 147710 148244 148663 149117 149569 150273 151629 153517 155264 156388 156955 157330
54276 157330 157931 159103 160725 162028 162280 161567 160483 159344 158293 157858 158509 159665 160064 159336 158479 158514 159355
54259 159355 160292 160931 161205 160992 160299 159656 159866 161364 163881 166599 168567 169235 168755 167664 166346 164994
54243 164994 163926 163421 163235 162730 161619 160255 159037 157883 156491 154881 153540 153083 153706 154856 155592 155512
54227 155512 155101 154948 154967 154818 154682 154980 155633 156327 157299 158976 160986 162470 163328 164154 164876 164631 163342 162222
54209 162222 162147 162525 162549 162534 163049 163558 163081 161731 160439 159447 158235 156758 155667 155197 154808 154232 154035 154809
54191 154809 156394 158176 159656 160446 160280 159373 158424 157987 158076 158511 159166 159668 159379 158138 156680 155881 155854 156237
54173 156237 157120 158990 161646 163787 164113 162673 160834 159947 160160 160497 159920 158256 156223 154690 153974 153802
54157 153802 153782 153796 153977 154488 155353 156374 157113 157123 156322 155106 153962 153062 152361 151940 151972 152424 153074 153887 155057
54138 155057 156614 158215 159512 160490 161308 162047 162791 163730 164927 166110 166895 167123 166836 166150 165305 164606 164065
54121 164065 163334 162259 161312 161145 161854 162969 163982 164605 164740 164592 164692 165433 166687 168200 170086 172421
54105 172421 174570 175584 175284 174357 173401 172472 171629 171187 171163 171114 170907 171087 172052 173276 173848 173527 172849 172440
54087 172440 172604 173379 174489 175308 175270 174430 173486 173240 174126 176097 178774 181721 184657 187424 189882 192028
54071 192028 194214 196962 200514 204769 209649 215123 220901 226490 231668 236431 240359 242567 242625 241042 238505
54056 238505 235147 230993 226680 223003 220071 217554 215595 214739 215018 215858 217000 218819 221505 224557 227519
54041 227519 230706 234657 239235 243863 248528 253892 260340 267433 274585 281844 289600 297745 305627 312791
54027 312791 319359 325526 331082 335692 339343 342195 344200 345269 345747 346306 347293 348460 349351 349598 348770 346395
54011 346395 342444 337586 332625 327708 322285 315812 308374 300690 293596 287513 282292 277514 272901 268440
53997 268440 264239 260413 257051 254150 251622 249535 248231 247958 248462 249199 249948 250927 252307 253900 255335
53982 255335 256258 256343 255377 253439 250796 247645 244157 240625 237196 233573 229529 225634 222869 221451 220669
53967 220669 220017 219754 220070 220519 220784 221298 222420 223604 224214 224751 226323 229023 231683 233272 233881 234266 235116
53950 235116 236950 240007 243877 247622 250601 252977 255362 258266 261988 266622 271936 277513 283150 288893
53936 288893 294717 300533 306596 313350 320615 327391 332933 337722 342945 349213 356339 364293 373766 385547
53922 385547 399743 415914 433813 453618 475483 499022 523243 546726 567732 584331 594897
53911 594897 598890 597339 592390 586100 579459 572447 564858 556845 548716 540576 532466 524634 517285 510093
53897 510093 502399 494085 485897 478617 472120 465537 458167 449971 441296 432433 423414 413979 403765 392790
53883 392790 381748 371577 362739 355020 347875 340767 333427 326159 319783 314814 310743 306554 301887 297224
53869 297224 292955 288881 284797 280946 277541 274272 270670 266693 262673 258914 255601 252820 250481 248429
53855 248429 246784 245868 245602 245284 244182 242056 239016 235298 231409 228046 225479 223363 221475 220240 220100
53840 220100 220680 221039 220565 219347 217980 217379 218328 220612 222801 223474 222589 221213 220125 219308 218687 218603 219292
53823 219292 220369 221156 221326 221149 221279 222295 224204 226403 228340 230103 232110 234395 236631 238843 241599
53808 241599 245307 249677 254139 258608 263565 269455 276158 283184 290239 297428 304776 311836 318126 323876
53794 323876 329798 335943 341292 344787 346457 347246 348131 349720 352196 355088 357335 358110 357499 356041 353921
53779 353921 351080 347748 344177 340006 334628 328196 321661 315700 310177 304696 299167 293633 288053 282529
53765 282529 277375 272729 268344 263935 259562 255626 252585 250588 249160 247415 244870 241916 239190 236726
53751 236726 234250 232068 230935 230977 231425 231563 231372 231041 230439 229404 228147 226960 225858 224751 223744 223017
53735 223017 222645 222737 223501 224933 226640 228198 229593 231118 232911 234690 235960 236489 236644 237137 238353 240040
53719 240040 241736 243209 244278 244674 244522 244624 245674 247417 249124 250676 252455 254373 255916 257194 259027
53704 259027 261752 264730 267333 269682 272010 274060 275671 277362 279771 282870 286197 289503 292768 295996
53690 295996 299356 303035 306567 308819 309223 308573 307976 307477 306473 305155 304566 305178 306215 306610 306057 304859
53674 304859 303241 301224 298980 296953 295591 295034 295020 295145 295195 295171 294972 294324 293167 291927 291125 290786 290441
53657 290441 289614 288178 286375 284713 283743 283676 284207 284812 285222 285542 286034 286859 287878 288637 288759 288488 288638 289721
53639 289721 291317 292537 293042 293358 294266 296096 298542 301021 303179 305190 307534 310436 313577 316385 318507
53624 318507 320016 321401 323394 326529 330637 334846 338293 340808 342896 345248 348357 352443 357524 363465
53610 363465 369957 376448 382327 387422 392226 397365 402965 408766 414608 420306 425210 428679 431138 433897
53596 433897 437562 441188 443386 443767 442813 440927 438313 435468 432954 430652 427843 424192 420220 416669 413675
53581 413675 410744 407427 403901 400866 398797 397366 395796 393755 391634 389919 388657 387651 386758 385752
53567 385752 384336 382598 381165 380566 380689 381124 381712 382509 383538 384897 386792 389123 391346 393047 394341
53552 394341 395444 396285 396867 397547 398459 399141 399255 399272 399905 401321 403541 407068 412231 418247 423898 428974
53536 428974 434145 439664 445197 450907 457504 465031 472688 480295 488914 499479 511603 524364 537496
53523 537496 551061 564588 577511 590191 603715 618711 634901 651750 669032 686796 705311
53512 705311 725130 746801 770285 794876 819792 844739 869852 895235 920674 945839 970725
53501 970725 995751 1021276 1047058 1072372 1096606 1119543 1141178 1161682 1181622 1201799 1222547
53490 1222547 1243437 1263876 1283809 1303600 1323393 1342880 1361651 1379582 1396934 1414210 1431815
53479 1431815 1449675 1467183 1483637 1498692 1512304 1524267 1533960 1540630 1543930 1544146 1541838 1537288 1530459
53466 1530459 1521496 1510941 1499265 1486411 1472142 1456656 1440516 1424106 1407546 1391024 1374653
53455 1374653 1357914 1339813 1319814 1298329 1276152 1253844 1231839 1210631 1190425 1170891 1151696
53444 1151696 1133048 1115417 1098941 1083515 1069337 1056950 1046786 1038910 1033119 1028915 1025486 1022159
53432 1022159 1019022 1016824 1016188 1017104 1019234 1022347 1026349 1031191 1037092 1044602 1054096 1065234 1077380 1090657
53418 1090657 1106150 1124686 1145694 1167751 1190189 1213580 1238563 1264921 1292277 1321133 1352424
53407 1352424 1386273 1421952 1459143 1498463 1540493 1584884 1630836 1677998 1726493 1776453 1828007
53396 1828007 1881510 1937203 1994658 2052916 2111192 2169210 2226928 2284269 2341181 2397657 2453589
53385 2453589 2508698 2562591 2614779 2664657 2711640 2755421 2796023 2833550 2867838 2898221 2923608
53374 2923608 2943056 2956498 2964809 2968915 2968833 2963672 2952471 2934787 2910587 2880017 2843490 2801832
53362 2801832 2756055 2706943 2654938 2600456 2544246 2487435 2431198 2376308 2322951 2270964 2220303
53351 2220303 2171251 2124154 2078910 2034876 1991431 1948548 1906501 1864943 1822762 1779278 1735436
53340 1735436 1693211 1653820 1616952 1581802 1548200 1516368 1486248 1457792 1431617 1408570 1388564
53329 1388564 1370436 1353086 1336244 1319935 1303830 1287572 1271356 1255633 1240392 1225247 1210207
53318 1210207 1195925 1183061 1171741 1161778 1153181 1146264 1141428 1138965 1138880 1140715 1143694 1147234 1151343 1156502
53304 1156502 1163285 1172148 1183262 1196313 1210692 1226219 1243561 1263530 1286018 1310017 1334745 1360330
53292 1360330 1387237 1415476 1444668 1474508 1504704 1534598 1563258 1590005 1614647 1637201 1657631
53281 1657631 1675758 1691332 1704246 1714786 1723369 1729754 1732775 1731367 1725776 1717314 1706909 1694414
53269 1694414 1679410 1662122 1643159 1622732 1600613 1576730 1551414 1525059 1497857 1469898 1441268
53258 1441268 1411948 1381816 1350969 1319976 1289641 1260394 1231968 1203792 1175702 1148129 1121541
53247 1121541 1095884 1070711 1045671 1020594 995204 969137 942381 915521 889439 864876 842286
53236 842286 821794 803074 785398 768120 751206 735180 720509 707055 694229 681697 669807
53225 669807 659111 649469 639877 629341 617674 605243 592227 578576 564567 550818 537533 524154
53213 524154 510067 495528 481644 469505 459388 450664 442358 433908 425511 417740 410892 404786 399115
53200 399115 393639 388035 381862 374894 367394 359976 353275 347667 343026 338751 334364 330122 326730 324343
53186 324343 322218 319514 316075 312228 308282 304601 301797 300234 299482 298724 297674 296667 295880 294956 293537
53171 293537 291759 290022 288519 287154 285713 283962 281845 279718 278162 277348 276778 275895 274766 273853 273185
53156 273185 272200 270525 268571 267136 266587 266667 266972 267307 267596 267756 267779 267677 267249 266143 264399 262716 261847
53139 261847 261789 261808 261267 260208 259161 258667 258989 259923 260796 260950 260420 259941 260174 261104 262312 263472 264353 264628
53121 264628 264162 263429 263210 263833 264983 266288 267712 269201 270345 270802 270953 271668 273287 275075 275889 275229
53105 275229 273468 271248 268984 266948 265425 264519 263992 263578 263352 263554 264052 264215 263443 261746 259758 258288
53089 258288 257827 258282 259070 259486 259152 258190 257002 255879 254821 253742 252843 252589 253211 254345 255421 256269 257028
53072 257028 257537 257365 256568 255864 255736 255852 255782 255759 256094 256232 255248 253150 250921 249242 247929 246748 245990 245891
53054 245891 246118 246255 246316 246409 246338 245984 245751 246163 247235 248561 249786 250695 251126 251158 251172 251336 251253 250449 249061
53035 249061 247644 246444 245273 244066 243137 242816 243071 243540 243741 243347 242499 241822 241850 242410 242794 242602 242223 242350
53017 242350 243184 244267 245089 245653 246339 247299 248184 248561 248377 247944 247677 248023 249306 251252 252925 253638 253796
53000 253796 254272 255112 255530 255220 254820 254844 254961 254781 254668 255123 255872 256240 256045 255531 254770 253795 253109 253336 254407
52981 254407 255604 256363 256592 256405 256132 256494 258118 260810 263758 266490 269169 271921 274426 276331 277630
52966 277630 278394 278535 278054 277291 276725 276674 277258 278405 279770 280806 281117 280739 280075 279549 279235 278758 277714 276214
52948 276214 274758 273516 272121 270359 268594 267151 265729 263921 261905 260063 258313 256590 255615 256144 257494
52933 257494 257909 256694 255077 254528 255002 255473 255518 255600 256123 256928 257626 257888 257460 256350 255019 254079 253785 254044
52915 254044 254720 255642 256379 256494 256072 255741 256007 256736 257422 257721 257611 257147 256335 255356 254692 254729 255193 255260 254437
52896 254437 253212 252570 252864 253415 253321 252463 251619 251633 252601 253836 254571 254608 254301 254058 254070 254368 254815 254969 254383
52877 254383 253265 252550 252997 254417 256001 257171 257795 257880 257581 257461 258266 260323 263302 266474 269047 270490
52861 270490 270959 271294 272247 273737 275122 276001 276425 276517 276342 275998 275365 273857 270926 266761 262116 257541 253269
52844 253269 249639 247016 245332 244265 243838 244204 244919 245192 244889 244550 244295 243500 241777 239549 237381 235467
52828 235467 234042 233505 233724 234023 234325 235557 238260 241433 243496 243870 242997 241369 239411 237858 237238 237143
52812 237143 236827 236469 237010 238730 240738 242035 242497 242682 243208 244435 246295 248199 249417 249666 249132 247998
52796 247998 246347 244454 242725 241276 239896 238432 236837 234913 232526 230162 228749 228710 229516 230391 231121
52781 231121 231943 232957 233979 234849 235617 236459 237528 238851 240264 241505 242385 242819 242693 241839 240253 238311
52765 238311 236707 236047 236376 237090 237492 237474 237431 237461 237045 235798 234211 233226 233225 233851 234675 235555 236350 236798 236864 236857
52745 236857 237068 237561 238404 239785 241722 243919 246097 248234 250375 252435 254354 256233 258076 259632 260710
52730 260710 261509 262295 262936 263052 262648 262257 262334 262717 262893 262634 262143 261595 260796 259481 257835 256482 255910 256032
52712 256032 256325 256277 255643 254447 252917 251323 249750 248079 246275 244581 243261 242294 241605 241532 242624 244794
52696 244794 246975 248009 247829 247505 248055 249509 251192 252614 253767 254717 255387 255802 256182 256534 256504 255885 255076
52679 255076 254622 254450 254035 253305 252862 253164 253915 254552 254979 255554 256524 257771 258963 259731 259847 259437 258937 258665
52661 258665 258564 258470 258417 258560 259008 259928 261489 263494 265404 267091 269231 272389 275915 278428 279404 279674 280132
52644 280132 280553 280059 278361 276021 273734 271786 270219 269041 268142 267271 266317 265539 265357 265940 267085 268483
52628 268483 269977 271533 273104 274653 276255 278019 279836 281287 281892 281401 279921 277865 275831 274340 273518
52613 273518 273031 272442 271658 270986 270736 270854 271046 271257 271878 273261 275096 276553 277146 277164 277116 277141 277256 277786 278921
52594 278921 280088 280467 280135 280015 280536 281067 280972 280598 280722 281507 282468 283157 283422 283346 283374 284113 285557 286868 287516
52575 287516 288239 290129 292988 295431 296620 297013 297172 296691 294955 292491 290774 290660 291442 291682 290764 289425
52559 289425 288779 289087 289642 289655 288868 287359 285301 283110 281365 280222 279267 278276 277683 277855 278317 278372 278196 278635
52541 278635 279975 281589 282747 283178 282824 281692 280118 278623 277448 276659 276646 277870 280027 282162 283762
52526 283762 285076 286229 286849 286944 287285 288320 289329 289409 288787 288459 288917 289980 291581 293821 296301 298266
52510 298266 299618 301173 303611 306639 309438 311610 313376 315073 316696 317848 318017 316990 315010 312459
52496 312459 309473 306117 302878 300552 299453 298955 298106 296542 294643 292955 291705 290856 290340 290078 289909 289648
52480 289648 289284 289100 289547 290905 292927 294807 295707 295518 295067 295382 296724 298485 300037 301426 303142 305421
52464 305421 308026 310559 312752 314532 316029 317501 319033 320377 321317 322039 322799 323217 322420 320041 316748
52449 316748 313513 310636 307790 304738 301551 298243 294721 291257 288582 287190 286695 286198 285269 284278 283748
52434 283748 283683 283680 283474 283052 282415 281599 280951 281014 281924 283169 284121 284670 285203 286082 287270 288349 288852 288800 288970
52415 288970 290298 292811 295533 297679 299622 302301 306046 310474 315281 320576 326559 333483 341828 351827
52401 351827 362710 372965 381490 388019 392375 394001 392579 388634 383133 376809 370098 363347 356709 350154
52387 350154 343900 338538 334444 331375 329003 327545 327402 328358 329597 330550 331416 332824 335157 338214 341431
52372 341431 344509 347797 351892 356807 361905 366749 371559 376509 380995 384130 385735 386344 386376 385830 384841
52357 384841 383982 383765 384088 384332 383860 382447 380525 379071 378955 380140 381688 382745 383453 384765 387418 391263
52341 391263 395619 400109 404979 410648 417159 424151 431207 438123 445037 452499 461296 471915 484180 497614
52327 497614 512038 527535 543990 561134 579046 598140 618532 639833 661641 683743 705700
52316 705700 726842 746992 766727 786540 806227 825454 844361 863029 880847 897157 912233
52305 912233 926986 941909 956960 972119 987236 1001491 1013954 1024738 1034744 1044211 1052420 1058970
52293 1058970 1064298 1068407 1070081 1068168 1063015 1055872 1047343 1037369 1026448 1015917 1006851 999287 992672
52280 992672 986663 981396 977354 975076 974768 976296 979723 985543 993902 1003860 1014161 1024686 1036443 1049946
52266 1049946 1064379 1078746 1093137 1108225 1123894 1139119 1153136 1166145 1178853 1191793 1205196
52255 1205196 1219033 1232944 1246327 1258814 1270602 1282149 1293482 1303805 1311889 1316937 1319139 1319275
52243 1319275 1317852 1314793 1309958 1303590 1296053 1287491 1278064 1268214 1258309 1248329 1238386 1229303 1221999 1216332
52229 1216332 1211201 1205913 1200872 1196747 1193575 1190954 1188596 1186361 1184274 1182911 1183249 1185589 1188950 1192021
52215 1192021 1194500 1197092 1200567 1205318 1211545 1219147 1227491 1235860 1244159 1252812 1262020 1271563 1281227 1290913
52201 1290913 1300333 1309047 1316842 1323737 1329642 1334478 1338675 1343114 1348464 1354767 1361571 1368198 1374028 1378970
52187 1378970 1383574 1388295 1392819 1396480 1399026 1400413 1400170 1397795 1393617 1388332 1381744 1372977 1362106 1350497
52173 1350497 1339181 1327934 1316548 1305987 1297418 1290741 1284988 1279759 1275453 1272386 1270478 1269648 1269859
52160 1269859 1270867 1272429 1274608 1277362 1280049 1281833 1282475 1282252 1281277 1279454 1276993 1274440 1272221 1270495 1269385
52145 1269385 1268944 1268970 1269209 1269658 1270332 1270912 1270997 1270597 1269974 1269130 1267818 1265993 1263958 1262276 1261839 1263680 1268177
52128 1268177 1274659 1282417 1291974 1304709 1321254 1340901 1362671 1386334 1412122 1439951 1469304 1499593
52116 1499593 1530375 1561366 1592394 1623127 1652809 1680407 1705100 1726520 1744701 1760110 1773635
52105 1773635 1786052 1797391 1807113 1814921 1821040 1825688 1828736 1830146 1830460 1830485 1830560 1830293 1828963 1826089 1821618
52090 1821618 1815601 1807786 1797649 1784943 1770089 1753953 1737364 1720931 1705092 1690110 1676182 1663771
52078 1663771 1653663 1646495 1642412 1641388 1643543 1648749 1656139 1664600 1673803 1684410 1697199 1712237 1728879
52065 1728879 1746251 1763669 1780764 1797307 1812944 1827313 1840486 1852900 1864501 1874284 1881187 1885317
52053 1885317 1887892 1890014 1891810 1892604 1891478 1887724 1881150 1872001 1860411 1846131 1829049 1809635 1788485
52040 1788485 1765755 1741570 1716680 1692050 1667923 1643981 1620353 1597839 1577177 1558672 1542414
52029 1542414 1528165 1515103 1502512 1490800 1480956 1472841 1464928 1456093 1446757 1437745 1428767 1418793 1407402
52016 1407402 1395015 1382116 1369003 1356200 1344377 1333641 1323238 1312093 1299488 1285191 1269199
52005 1269199 1251518 1232224 1211594 1189955 1167411 1143965 1120048 1096531 1073866 1051543 1028901
51994 1028901 1006176 984208 963467 944168 927078 913053 901600 890913 879726 868266 856943
51983 856943 845102 831968 818116 804944 792792 780443 766564 751087 735042 719417 704447
51972 704447 689958 676233 664176 654377 646294 638975 632480 627885 625802 625724 627089 630170 635349 642179
51958 642179 649743 657397 664565 670386 674341 676864 678564 679109 677569 673715 668246 661893 655008 648071
51944 648071 641952 637515 635329 635752 638849 644173 651065 659228 668672 679123 689857 700232 710062 719374
51930 719374 728006 735429 740801 743224 742139 737527 729693 719047 706182 691894 676875 661524 646225
51917 646225 631526 617896 605595 595007 586694 580808 576799 574127 572975 573853 576778 581260 586751
51904 586751 592609 597922 601998 604883 606884 607833 607420 606071 604752 603919 603278 602481 601307 599050 594510
51889 594510 586926 576473 563701 549189 534008 519890 508291 499511 493066 488614 486182 485717 486890
51876 486890 489297 492610 496659 501632 508053 516243 525747 535476 544405 551983 557930 561951 563829 563674
51862 563674 561812 558371 553182 546329 538712 531806 526698 523470 521517 520284 519596 519530 520238 521817 524166
51847 524166 526898 529436 531154 531515 530291 527679 524033 519513 514198 508446 502710 497004 491010 484833
51833 484833 479140 474365 470347 467073 465110 464727 465057 464921 464273 464144 465188 466905 468268 468558 467476 464970
51817 464970 461228 456744 452275 448712 446718 446260 446700 447580 448998 450981 452987 454511 455782 457191 458347
51802 458347 458384 457036 454716 451746 448326 445211 443520 443588 444642 445773 446647 447044 446449 444492 441403 437758
51786 437758 434089 430841 428258 426103 423916 421720 420090 419423 419575 420291 421423 422553 423029 422757 422521 423168
51770 423168 424847 427357 430806 435562 441858 449741 459100 469474 480161 490793 501410 511739 520870
51757 520870 528075 533447 537190 538655 536847 531789 524655 516489 507380 497141 486306 476041 467162
51744 467162 459592 452834 446774 441890 438648 436950 436350 436752 438618 442403 447967 454674 461938 469606 477833
51729 477833 486574 495065 501964 506232 507980 508285 508260 508500 509228 510379 511350 511044 508568 503876 497727 491244
51713 491244 485514 481218 478291 476024 473604 470558 466758 462341 457768 453796 451216 450624 452295 456044
51699 456044 461235 467125 473190 478940 483610 486463 487436 487161 486394 485691 485478 485901 486571 486903 486658 485748 483597
51682 483597 479403 473115 465596 457774 450347 444333 440904 440104 440476 440669 440963 442668 446399 451530 457020
51667 457020 462193 466909 471481 476431 482126 488780 496685 505766 514644 520910 522991 521323 517327 511931
51653 511931 505784 500175 496610 495617 496789 499808 504603 510637 516892 522551 526947 528905 527120 521426
51639 521426 513035 503315 492892 482012 471032 460266 449893 440286 431911 424772 418507 413213 409585
51626 409585 407951 407733 408149 408880 409763 410458 410940 411755 413174 414450 414553 413419 411914 410754 410044 409757 410033
51609 410033 410813 411687 412304 412706 413133 413695 414301 414771 414961 414979 415290 416459 418760 422156 426553 431855 437889
51592 437889 444574 452156 460831 469956 477950 483268 485330 484358 480679 474667 467269 460044 454454 451264
51578 451264 450639 452467 456443 462232 469863 479795 492356 507251 523868 541811 560832 580501 600524
51565 600524 621386 644106 669038 695295 721599 747533 773758 801314 831005 863220 897879
51554 897879 934332 971428 1007712 1041477 1070645 1092781 1105588 1107763 1099499 1082020 1056546 1023963
51542 1023963 985594 943709 900616 857458 814528 772660 733493 698228 666942 639441 616009
51531 616009 596730 580664 566398 553137 540773 529319 518846 509653 501817 494778 487997 481800
51519 481800 476893 473247 470203 467610 465969 465348 464994 464400 464072 464754 466359 468100 469353 469984 470064 469666
51503 469666 468811 467314 464757 460861 455846 450293 444812 439943 436156 433646 432176 431318 430813 430601 430606 430635
51487 430635 430462 429866 428664 426859 424772 422862 421317 419860 418010 415541 412589 409346 405842 402155 398643
51472 398643 395622 392872 389721 385806 381450 377271 373705 370977 369127 367795 366348 364616 363228 362863
51458 362863 363368 364039 364568 365289 366600 368571 371085 373939 376801 379440 382063 385207 389348 394807 401848
51443 401848 410501 420450 431494 443887 457749 472321 486328 498915 509527 517030 520000 518343
51431 518343 513976 509405 505906 503241 500529 496905 491741 484851 476517 467216 457556 448471 441008 435524
51417 435524 431422 427962 425066 423092 422231 422469 423785 425939 428373 430771 433539 437252 441696 445933 449283
51402 449283 451823 453939 455776 457301 458595 459857 461239 462824 464726 467107 470084 473620 477602 482119
51388 482119 487601 494638 503725 515339 530083 548487 570740 596948 627589 663276 704087 749567
51376 749567 799363 853259 910411 969206 1028162 1086201 1141372 1189804 1226868 1249527 1257354 1251636
51364 1251636 1234178 1206709 1170643 1127130 1077662 1024502 969970 915347 861029 807836 757517
51353 757517 711670 670707 634208 601928 574028 550566 531191 515285 502124 490948 481153 472453
51341 472453 464725 457744 451193 444900 438872 433107 427524 422145 417212 412993 409488 406418 403507 400677
51327 400677 397945 395286 392725 390417 388401 386288 383569 380367 377613 376181 375969 376081 375849 375470 375634
51312 375634 376807 378991 381979 385602 389646 393729 397472 400846 404154 407508 410437 412282 412939 412915 412623
51297 412623 411899 410367 408031 405268 402378 399285 395603 391051 385914 381131 377609 375421 373970 373060 373289
51282 373289 375123 378024 380997 383773 387022 391476 397231 403731 410004 414935 417757 418487 417769 416331 414770
51267 414770 413592 413086 413171 413681 414751 416678 419495 422955 426696 430066 432020 431835 429939 427498 425116
51252 425116 422469 419258 415897 412972 410602 408663 407130 405777 403982 401433 398815 397200 396799 396743 396133
51237 396133 394876 393422 392028 390534 388730 386734 384924 383488 382108 380320 378220 376535 375761 375456 374763
51222 374763 373509 372407 372115 372496 373015 373519 374307 375636 377548 380115 383408 387070 390294 392574 394306
51207 394306 396313 398887 401604 404008 406129 408311 410938 414369 418699 423326 427162 429557 430729 431066
51193 431066 430477 428864 426764 424848 423018 420699 417931 415500 413916 412875 411827 410529 408921 407019
51179 407019 405157 403816 403044 402493 402115 402229 402754 403088 403039 403188 403923 404821 405493 406307 407566 408667 409027 409367
51161 409367 411017 414085 417325 419791 421665 423384 424912 426139 427177 427928 428070 427816 427919 428495 428573 427399
51145 427399 425634 424544 424456 424692 424695 424371 423460 421456 418432 415367 413259 412158 411307 410049 408404 406911
51129 406911 406066 405876 405857 405456 404560 403725 403971 406129 409999 414169 417033 418292 419173 420994 423834 426888
51113 426888 429741 432689 435929 439105 441840 444265 446738 449319 451767 453911 455832 457731 459750 461830
51099 461830 463714 465196 466367 467519 468799 470057 471022 471431 471023 469679 467662 465573 463979 463170 463161 463660
51083 463660 464060 463798 462842 461601 460331 459013 457906 457688 458672 460238 461568 462730 464547 467471 471106
51068 471106 474893 478717 482732 487020 491768 497448 504479 512858 522400 533194 545547 559568 575036
51055 575036 591501 608175 623760 636934 647388 656258 665366 676099 688970 703793 719740 735324
51043 735324 748958 759897 768376 774544 777505 775861 769280 759176 747705 736304 725220 714094
51031 714094 702597 690487 677418 662971 647020 630096 613360 598028 584770 573657 564599 557584
51019 557584 552470 548897 546730 546374 548343 552575 558470 565591 573943 583468 593565 603375 612449 620979
51005 620979 629478 638329 647598 657090 666552 675865 685071 694288 703677 713424 723664 734370 745394
50992 745394 756544 767460 777494 785976 792745 798226 802927 807050 810699 814232 818152 822715 827894
50979 827894 833642 840015 847093 855056 864299 875224 887740 901187 914978 929302 945102 963461
50967 963461 985178 1010947 1041604 1077826 1119476 1165535 1214942 1267519 1323823 1384106 1447658
50956 1447658 1513260 1579973 1647164 1713892 1778674 1840035 1897163 1949993 1998817 2043869 2085207
50945 2085207 2122854 2157047 2188315 2217220 2244118 2269328 2293452 2317204 2340788 2363564 2384452
50934 2384452 2402449 2416728 2426574 2431595 2431903 2427725 2418854 2404613 2384287 2357300 2323112 2281398
50922 2281398 2232429 2176937 2115516 2048498 1976673 1901699 1825498 1749488 1674688 1602249 1533328
50911 1533328 1468560 1408174 1352661 1302762 1258624 1219392 1183872 1151396 1121860 1095227 1071273
50900 1071273 1049568 1029512 1010572 992746 976597 962499 949987 938175 926739 916219 907358
50889 907358 900394 895006 890678 887038 884075 882125 881503 882067 883213 884377 885464 886807 888863 891977 896340
50874 896340 902007 908950 917041 926068 935863 946527 958365 971497 985597 1000261 1015707 1032914
50862 1032914 1052958 1076147 1101872 1129307 1158328 1189745 1224713 1264060 1308284 1357933 1413562
50851 1413562 1475353 1543248 1617656 1699641 1790171 1889421 1996977 2112300 2234696 2363258
50841 2363258 2497360 2636874 2781338 2929067 3077527 3224271 3366870 3502239 3626985
50832 3626985 3738662 3836125 3918764 3986325 4039757 4081404 4113835 4138988 4158761 4175726 4192722
50821 4192722 4212197 4236338 4267048 4304912 4348412 4394858 4441707 4486292 4524525 4550936 4560322
50810 4560322 4549086 4515257 4458094 4377906 4275682 4152602 4010233 3851334 3680007 3500737
50800 3500737 3317511 3133844 2953216 2779085 2614537 2461902 2322407 2196125 2082530
50791 2082530 1981246 1892175 1815035 1749167 1693757 1647800 1609791 1577987 1551254 1529245 1511472
50780 1511472 1496665 1483453 1471365 1460606 1451003 1441661 1431701 1420838 1409105 1396373 1382448 1367531
50768 1367531 1352251 1337172 1322277 1307012 1290819 1273593 1255662 1237453 1219283 1201311 1183439
50757 1183439 1165380 1147232 1130095 1115668 1104884 1097101 1090944 1085773 1082011 1080318 1081033 1084449 1090980
50744 1090980 1100714 1113202 1128135 1146015 1167764 1193786 1223875 1257971 1296546 1340090 1388590
50733 1388590 1441693 1499065 1560347 1624958 1692263 1761771 1833002 1905383 1978496 2052200 2126120
50722 2126120 2199135 2269809 2337326 2401620 2462528 2519163 2570147 2614070 2649585 2675545 2691394
50711 2691394 2697357 2694310 2683912 2668955 2653008 2639148 2629153 2624064 2625046 2633126 2648283 2669289 2694387
50698 2694387 2721689 2748989 2773664 2792867 2803720 2803503 2790099 2762194 2718862 2659334 2583961 2495356
50686 2495356 2397901 2295850 2192309 2089941 1991666 1899980 1816039 1740032 1672216 1613081 1562785
50675 1562785 1521124 1488151 1464286 1449624 1443379 1444141 1450470 1461189 1475405 1492405 1511417 1531385
50663 1531385 1551134 1569867 1587361 1603635 1618626 1632351 1645154 1657571 1669990 1682717 1696247
50652 1696247 1711142 1727525 1745016 1763365 1782894 1804119 1827239 1852446 1880532 1912573 1948941
50641 1948941 1989225 2033298 2081811 2135162 2192504 2252464 2314496 2378719 2444481 2509978 2573645
50630 2573645 2635241 2695165 2753140 2808072 2858926 2905319 2947246 2984286 3014596 3034281 3038259
50619 3038259 3022808 2987991 2937918 2878963 2817710 2759664 2708454 2665539 2630916 2604391 2585967
50608 2585967 2575001 2569583 2567187 2565645 2563145 2557670 2547076 2529713 2504472 2470234 2425891 2371263
50596 2371263 2307689 2237485 2163029 2086361 2009104 1932310 1856628 1783076 1713386 1649126 1590531
50585 1590531 1536696 1486952 1441610 1401292 1365921 1334531 1305794 1278677 1252962 1229344 1208798
50574 1208798 1191719 1177817 1166738 1158395 1152708 1149556 1149156 1151947 1157800 1165800 1175175 1185994 1198581
50561 1198581 1212751 1228199 1245281 1264697 1286555 1310309 1335542 1362191 1390080 1418844 1448422
50550 1448422 1479044 1510513 1541860 1571915 1599992 1626014 1650310 1673458 1696097 1718899 1742809
50539 1742809 1769117 1798933 1832741 1870942 1914639 1965306 2023646 2089310 2161790 2241063 2327324
50528 2327324 2420793 2522031 2631840 2750386 2876756 3009659 3148107 3291061 3436776 3582988
50518 3582988 3727479 3868012 4001915 4126157 4237816 4334253 4412962 4471617 4508412 4522299
50508 4522299 4513012 4481027 4427528 4354430 4264485 4161254 4048747 3931109 3812810 3698796
50498 3698796 3593730 3500913 3422353 3359888 3315550 3290463 3283870 3293614 3317133 3351561 3393225
50487 3393225 3437512 3479065 3511959 3530237 3528997 3505055 3456689 3383562 3287587 3173357 3046654
50476 3046654 2912255 2773438 2633115 2494530 2360622 2233378 2114003 2003261 1901490
50467 1901490 1808754 1725219 1651060 1585893 1528714 1478634 1435292 1398310 1366735 1339461 1316076
50456 1316076 1297001 1282786 1273487 1268589 1267268 1268615 1271799 1276175 1281334 1287095 1293462 1300530 1308381
50443 1308381 1317081 1326751 1337571 1349567 1362331 1374987 1386631 1396942 1406257 1414897 1422502 1428291
50431 1428291 1432045 1434574 1437132 1440513 1444827 1449913 1455792 1462818 1471508 1482207 1494899 1509427 1525902
50418 1525902 1544736 1566340 1591030 1619215 1651359 1687647 1728015 1772568 1821701 1875657 1934316
50407 1934316 1997438 2064643 2134901 2206483 2277786 2347902 2416046 2480855 2540741 2594662 2642020
50396 2642020 2681885 2712766 2733087 2741499 2736831 2718176 2685199 2638348 2579026 2509772 2433920 2354610
50384 2354610 2274237 2195062 2119934 2051762 1992420 1942723 1903384 1875352 1859068 1853810 1857918 1869331
50372 1869331 1885888 1905441 1925801 1944471 1958694 1966120 1965280 1955071 1934117 1901420 1857696 1805411
50360 1805411 1747354 1685630 1622046 1558597 1497001 1438013 1381596 1327611 1276250 1228048 1183618
50349 1183618 1143157 1106171 1072060 1041050 1014102 991774 973621 958953 947778 940600 937615 938525
50337 938525 943068 951345 963541 979368 997837 1017601 1037606 1057180 1075296 1090061 1099544 1103198
50325 1103198 1102103 1097838 1091641 1084640 1078102 1073015 1069829 1068890 1070587 1074619 1079605 1083995 1087187 1089431
50311 1089431 1090890 1091346 1090633 1088927 1086724 1084834 1084128 1084795 1086045 1087080 1088253 1090702 1094856 1100013 1105588
50296 1105588 1112162 1120807 1131812 1144654 1159151 1176015 1196044 1219073 1244072 1270147 1297214 1325730
50284 1325730 1356102 1388295 1421432 1453144 1479417 1495786 1499295 1489712 1469297 1441912 1412081 1383872
50272 1383872 1359665 1339734 1323233 1309540 1298577 1290105 1283208 1276677 1269733 1262255 1254390 1246109 1237239
50259 1237239 1227948 1219017 1211441 1205685 1201450 1198160 1195563 1193890 1193640 1195257 1198843 1204152 1211013 1219811
50245 1219811 1231273 1245741 1262878 1282198 1303600 1327134 1352453 1378810 1405439 1431727 1457063
50234 1457063 1480810 1502527 1522074 1539460 1554636 1567389 1577339 1583948 1586474 1583905 1575135 1559505
50222 1559505 1537316 1509710 1478064 1443590 1407424 1370817 1335132 1301815 1272292 1247456 1227033
50211 1227033 1209694 1193955 1178785 1163296 1146330 1126854 1104669 1080498 1055461 1030626 1006871
50200 1006871 984722 964309 945613 928727 913770 900706 889417 879764 871320 863268 855004 846760
50188 846760 839193 832309 825223 817159 808339 799576 791248 783045 774637 766216 758245 750971 744351 738259
50174 738259 732489 726638 720353 713863 708074 703951 701759 700852 700064 698380 695669 692990 691908 693159 696102
50159 696102 699639 703351 707407 711831 716638 722568 730786 741538 753696 765995 778182 790541 802734
50146 802734 813737 822783 829915 835632 840348 844238 847382 849903 852009 853915 855913 858697 863470 871373
50132 871373 882774 897473 915518 937345 963088 992395 1025090 1061394 1101141 1143400 1187272
50121 1187272 1232513 1278863 1325416 1371351 1416809 1462201 1507027 1550270 1591710 1631784 1669996
50110 1669996 1704398 1732924 1754403 1767936 1772081 1765453 1747967 1721026 1686633 1646589 1602324 1555153
50098 1555153 1506595 1458461 1412445 1369540 1330039 1294111 1262085 1234148 1210103 1189694 1172915
50087 1172915 1159718 1149601 1141751 1135608 1131131 1128558 1127956 1129036 1131341 1134600 1138821 1143956 1149577 1154996
50073 1154996 1159595 1162880 1164394 1163914 1161687 1158211 1153752 1148254 1141621 1133808 1124753 1114638 1104179 1094153
50059 1094153 1084546 1074608 1063927 1053001 1042558 1032840 1023989 1016689 1011784 1009295 1008351 1008137 1008605 1010249
50045 1010249 1013509 1018514 1025126 1033028 1041873 1051475 1061857 1073146 1085441 1098701 1112584 1126433
50033 1126433 1139628 1152011 1163769 1174854 1184739 1192927 1199551 1205202 1210146 1213984 1216135 1216397 1214848
50020 1214848 1211450 1206139 1199353 1192118 1185368 1179312 1173564 1167809 1162161 1156946 1152308 1148139 1144486 1142069
50006 1142069 1142275 1146359 1154565 1166124 1180079 1195882 1213271 1232023 1252155 1274014 1297822 1323267
49994 1323267 1349797 1377078 1404736 1431710 1456179 1476066 1489397 1494420 1490029 1476252 1454079 1424741
49982 1424741 1389391 1349378 1306273 1261370 1215467 1169318 1123989 1080530 1039615 1001743 967554
49971 967554 937504 911341 888304 867853 849936 834462 820846 808306 796497 785647 776124 768018
49959 768018 761140 755216 749987 745342 741544 739226 738917 740581 743811 748417 754615 762702 772789 784732
49945 784732 797859 810790 822160 831799 840664 849244 856536 861143 862932 862967 862053 860032 856319 850329
49931 850329 841359 828816 812872 794464 774636 754350 734920 717767 703316 690667 678803 667806
49919 667806 658598 651876 647614 645247 644016 643439 643725 645417 648368 651502 653939 655959 658484 662028 666648
49904 666648 672525 679916 688702 698604 709761 722467 736367 750550 764536 778623 793077 807418
49892 807418 820644 831747 839895 844665 846435 846158 844391 840804 834867 826618 816378 804106 789706
49879 789706 773832 757722 742078 726664 711209 696225 682522 670295 659225 649280 640804 633753
49867 633753 627505 621754 617188 614747 614383 615111 616284 618279 621694 626338 631543 637288 644416 653547 664205
49852 664205 675410 686919 699449 713587 728836 743964 758005 770545 781151 789069 793799 795791
49840 795791 796218 795971 794927 792125 786590 778105 767329 755287 742747 730141 717951 706887 697542
49827 697542 690085 684409 680381 677788 676270 675673 676393 679031 683659 689673 696413 703755 712015 721483 732162
49812 732162 743796 756039 768578 781129 793296 804456 813903 821202 826492 830553 834448 838716 842682
49799 842682 844749 843656 839429 833061 825531 817360 808776 799734 789729 778077 764626 750052 735409
49786 735409 721527 708831 697483 687529 678989 671831 665895 660951 656901 653701 651050 648467 645940
49773 645940 644086 643335 643359 643871 645627 649831 656575 664632 672867 681195 689990 699273 708775 718143 726701
49758 726701 733544 738354 741754 744481 746601 747866 748363 748196 746744 742764 735243 724051 710091 695240
49744 695240 681762 671100 663015 656190 649710 643831 639406 636815 635518 634537 633359 632299 631837 631863 632028
49729 632028 632709 634868 638692 643022 646659 649766 653472 658458 664589 671585 679408 688051 697580 708366
49715 708366 720766 734538 748966 763472 777571 790238 799899 805313 806293 803609 798515 792302 785740
49702 785740 778778 771067 762836 754917 747928 741837 736468 731905 728094 724330 719570 713203 705412 696952
49688 696952 688797 681882 676920 674252 673769 674959 677267 680673 685881 693650 703956 716034 729237 743500
49674 743500 758955 775527 793182 812095 832009 851413 867837 879296 885479 887553 887074 885233
49662 885233 882915 880919 879845 879946 881454 884877 890524 897446 903101 904375 899112 886900 868846 846845
49648 846845 822843 798378 774700 753154 735022 720725 709460 700057 692138 686134 682306 680203
49636 680203 679145 678830 679198 679876 680043 678894 676238 672687 669218 666345 663565 659670 653791 646299 638654
49621 638654 632240 627275 622954 618620 614519 611218 608640 606185 603640 601402 599769 598583 597759 597565 598079
49606 598079 598869 599557 600292 601286 602321 603163 604058 605335 606758 607811 608398 608855 609506 610613 612364 614392
49590 614392 615704 615797 615546 616216 617801 619203 619909 620498 621431 622405 623298 624778 627353 630451 633125 635206
49574 635206 637183 639325 641584 644201 647835 653088 660232 669293 679969 691478 702865 713673 724164
49561 724164 734762 745260 754627 761665 765848 767449 766859 764109 759241 752838 745759 738612 731936 726624
49547 726624 723388 721751 720302 718240 716139 715003 715169 716409 718428 720768 722790 724429 726672 730610
49533 730610 736166 742278 748269 754512 761751 770323 780195 791435 804323 819063 835500 853134 871395
49520 871395 889839 907985 925103 940498 954003 965851 975966 983831 989353 993461 997485 1002192
49508 1002192 1007784 1014555 1022933 1032782 1042972 1051708 1057140 1057777 1052727 1041824 1025619 1005333 982719
49495 982719 959555 937024 915691 896099 878896 864098 850726 837823 825681 815534 808105 802927
49483 802927 799066 795961 793475 791655 790694 790735 791425 791970 791934 791765 792242 793536 795103 796432 797630 799203
49467 799203 801482 804334 807352 810258 813196 816652 820951 825745 830103 833347 835764 838253 841151 843701
49453 843701 844862 844352 842532 839528 835075 829186 822302 814649 806060 796811 788048 780861 775314 770899
49439 770899 767526 765337 763853 762285 760870 761123 764366 770476 778351 787107 796437 806330 817149 829872
49425 829872 845626 864850 887198 912214 939634 968933 999131 1029518 1060272 1091537 1121528
49414 1121528 1145979 1160216 1162266 1154133 1140268 1125131 1111887 1102438 1097608 1097142 1100137 1105954 1114613
49401 1114613 1126151 1139814 1154213 1168293 1181940 1195606 1209554 1223614 1237407 1250504 1262315
49390 1262315 1272131 1279565 1284814 1288224 1289576 1288061 1283006 1274397 1262663 1248303 1232024 1214945 1198170
49377 1198170 1182109 1166626 1151893 1138817 1128379 1120806 1115620 1112328 1110754 1110790 1112088 1114080 1116142
49364 1116142 1117727 1118516 1118473 1117510 1115083 1110386 1103227 1094506 1085491 1076683 1067678 1058148 1048539 1039629 1031713
49349 1031713 1024530 1017854 1011866 1006977 1003492 1001439 1000536 1000270 1000101 999612 998509 996625 994007 990831 987173
49334 987173 983016 978585 974311 970261 965971 961211 956594 952927 950212 947912 946036 945209 945623 946700 948010
49319 948010 949832 952493 955802 959580 964178 969894 976313 982843 989567 996959 1005000 1013202 1021412 1030040
49305 1030040 1039500 1049895 1061185 1073256 1085880 1099047 1113176 1128468 1144032 1158123 1169196
49294 1169196 1176280 1178624 1175906 1169064 1160080 1150457 1140429 1130011 1120138 1111999 1105718 1100512 1096044
49281 1096044 1092790 1091011 1090091 1089199 1088147 1087274 1086875 1087153 1088476 1091162 1095012 1099364 1103607 1107400 1110396
49266 1110396 1112206 1112829 1112850 1112849 1112759 1112118 1110854 1109393 1107940 1106175 1104086 1102779 1103933 1108470 1116172 1126650
49250 1126650 1140103 1156808 1176121 1196434 1215996 1233389 1247192 1255635 1257059 1250786 1237584 1219323
49238 1219323 1198195 1176030 1154088 1133328 1114723 1099196 1087240 1078773 1073482 1071136 1071422 1073704
49226 1073704 1077304 1082031 1088081 1095304 1102905 1110067 1116650 1123070 1129706 1136727 1144287 1152476 1161088 1169789
49212 1169789 1178644 1188210 1198937 1210624 1222534 1233979 1244770 1255246 1265981 1277432 1289787 1303090
49200 1303090 1317322 1332267 1347439 1362368 1376869 1390960 1404656 1418036 1431307 1444499 1457224
49189 1457224 1469064 1480065 1490531 1500528 1510057 1519560 1529601 1540085 1550492 1561123 1573416 1588629
49177 1588629 1606731 1627096 1649837 1675935 1706308 1741260 1780654 1824137 1871224 1921529 1974644
49166 1974644 2029302 2082555 2130091 2167574 2191954 2202305 2200290 2189834 2175691 2161676 2149922
49155 2149922 2141298 2135947 2133406 2132739 2132976 2133516 2134131 2134740 2135289 2135861 2136902 2139195 2143341 2149275 2156536 2165073
49139 2165073 2175419 2187934 2202304 2218048 2235099 2253518 2273008 2293189 2314124 2336046 2358676
49128 2358676 2381328 2403667 2426020 2448957 2472816 2497480 2522266 2546227 2569032 2591474 2614780
49117 2614780 2639444 2665085 2691256 2718011 2745942 2776272 2810886 2851690 2899811 2955767 3020287
49106 3020287 3094468 3179225 3275155 3382580 3500318 3623577 3744010 3853661 3949991 4036861
49096 4036861 4119403 4196435 4257196 4286440 4274605 4224526 4148866 4061150 3968681 3872129 3769633
49085 3769633 3660674 3547539 3434814 3327849 3231051 3147010 3076597 3019264 2973213 2935961
49075 2935961 2905286 2879685 2858108 2839756 2824105 2810578 2798041 2785290 2772166 2759583 2748131
49064 2748131 2737376 2726876 2717099 2708626 2701013 2693270 2685150 2677176 2669583 2662063 2654622 2648003 2643019
49051 2643019 2639769 2637607 2635614 2633170 2630448 2628377 2627833 2628870 2630958 2633894 2638159 2644418 2652998 2663850
49037 2663850 2676677 2690966 2706017 2720955 2734674 2746030 2754355 2759697 2762297 2762098 2759155 2754386 2749250
49024 2749250 2744452 2739370 2733018 2725276 2716895 2708541 2700281 2692021 2684094 2677190 2671817 2667992 2665375 2663521
49010 2663521 2662060 2660915 2660451 2661141 2662955 2665385 2668260 2672102 2677202 2682739 2687473 2691167 2694508 2697695
48996 2697695 2700036 2701132 2701523 2701612 2700728 2697976 2693439 2687846 2681492 2674271 2666450 2658656 2651188 2644020 2637333
48981 2637333 2631491 2626662 2623017 2621040 2620987 2622221 2623839 2625744 2628354 2631400 2634023 2636101 2638433 2641369
48967 2641369 2644230 2646557 2649017 2652398 2656372 2660065 2663391 2667104 2671842 2677738 2684799 2692968 2701837 2710822
48953 2710822 2719733 2728980 2739290 2751419 2765863 2782507 2800720 2820121 2841134 2864461 2890179 2917702
48941 2917702 2946436 2976094 3006504 3037657 3070043 3104561 3141946 3182403 3225771 3271854 3320623
48930 3320623 3372315 3427227 3485198 3545385 3606866 3669373 3733161 3798295 3864475 3931478 3999296
48919 3999296 4067795 4136680 4205870 4275411 4344831 4412991 4478847 4541988 4602233 4659124 4712216
48908 4712216 4761573 4807592 4850545 4890614 4928026 4962682 4993980 5021625 5046497 5069977 5092361
48897 5092361 5112636 5129959 5144626 5157255 5167777 5175884 5181877 5186163 5188267 5187295 5183334 5177361 5169467
48884 5169467 5158132 5141899 5121122 5097363 5071554 5043608 5013543 4981936 4949072 4914497 4877774
48873 4877774 4838967 4797902 4753534 4704804 4651885 4595930 4537769 4477531 4415529 4352656 4289609
48862 4289609 4226365 4163032 4100808 4041461 3985903 3933776 3884381 3837522 3793349 3751961 3713519
48851 3713519 3678481 3647276 3619815 3595577 3574188 3555689 3540261 3527870 3518230 3511020 3506112 3503695
48839 3503695 3504186 3507939 3514990 3525044 3537650 3552340 3568706 3586520 3605704 3626053 3647010 3667962
48827 3667962 3688828 3710194 3732680 3756245 3780197 3803866 3827124 3850230 3873294 3896044 3918189
48816 3918189 3939867 3961522 3983319 4004829 4025440 4044996 4063908 4082741 4101857 4121391 4141313
48805 4141313 4161444 4181570 4201719 4222290 4243789 4266403 4289822 4313566 4337453 4361669 4386278
48794 4386278 4410807 4434568 4457363 4479458 4500674 4519910 4536014 4548979 4559862 4569559 4578038 4584701
48782 4584701 4588921 4590015 4587050 4579055 4565300 4545337 4519039 4486830 4449650 4408460 4363818 4315979
48770 4315979 4265244 4212174 4157688 4102957 4048825 3995181 3941214 3886546 3831883 3778333 3726462
48759 3726462 3676297 3627965 3581847 3538246 3497348 3459416 3424683 3393069 3364319 3338383 3315370
48748 3315370 3295226 3277814 3263236 3251746 3243354 3237853 3235179 3235341 3238004 3242618 3248988 3257227 3267030
48735 3267030 3277492 3287815 3297697 3306767 3314252 3319732 3323795 3327340 3330439 3332538 3333678 3334771 3336542
48722 3336542 3338782 3340892 3342687 3344306 3345722 3346751 3347365 3347557 3347027 3345397 3342721 3339512 3336213 3332971 3329960
48707 3329960 3327550 3325891 3324543 3322849 3320687 3318665 3317536 3317524 3318178 3318814 3319126 3319528 3320868 3323636 3327433
48692 3327433 3331431 3335372 3339770 3344922 3350014 3353679 3355397 3355817 3355521 3354014 3350397 3344820 3338605 3332909
48678 3332909 3327791 3322770 3317750 3312844 3307476 3300218 3289740 3275750 3259000 3240522 3220865 3199904
48666 3199904 3177322 3153276 3128419 3103153 3077175 3050085 3022174 2994090 2965858 2936850 2906779
48655 2906779 2875985 2844526 2811682 2776883 2740575 2703611 2666363 2629204 2593469 2560900 2532017
48644 2532017 2505869 2481562 2459244 2439192 2420620 2402064 2382664 2362522 2341952 2320912 2299284
48633 2299284 2277350 2255751 2234971 2214919 2195072 2175087 2155167 2135682 2116511 2097025 2076765
48622 2076765 2055941 2035280 2015645 1997784 1982062 1968182 1955435 1943477 1932767 1924091 1917802 1913672
48610 1913672 1911326 1910519 1911040 1912526 1914539 1916794 1919194 1921530 1923198 1923515 1922503 1921192 1920855 1922055 1924596
48595 1924596 1928120 1932248 1936204 1938896 1939531 1937806 1933449 1926137 1916095 1904299 1891660 1878287 1863820
48582 1863820 1848331 1832569 1817414 1803271 1789894 1776758 1763786 1751720 1741526 1733356 1726491 1720374
48570 1720374 1715281 1711830 1710309 1710769 1713278 1717690 1723465 1730088 1737389 1745118 1752472 1758401 1762109 1763006
48556 1763006 1760566 1754728 1746142 1735552 1723201 1709277 1694723 1680997 1669072 1659013 1650288 1642069
48544 1642069 1633437 1623857 1613382 1602017 1589176 1574410 1558449 1542752 1528038 1513985 1500365 1487628
48532 1487628 1476168 1465904 1457047 1450563 1447269 1446952 1448932 1453032 1459388 1467671 1477296 1488200 1500531
48519 1500531 1513363 1524303 1530576 1530239 1522480 1507755 1488177 1467134 1447524 1430288 1415111 1402376
48507 1402376 1393678 1390365 1392341 1398719 1409007 1422992 1439875 1458313 1477332 1496600 1515729 1533749
48495 1533749 1549275 1560697 1566177 1564200 1554655 1539133 1519890 1498634 1476393 1454043 1432444 1412065
48483 1412065 1392797 1374244 1356168 1338724 1322287 1307074 1293050 1280268 1269036 1259527 1251455 1244445
48471 1244445 1238330 1232720 1226760 1220160 1214149 1210416 1209093 1208772 1208542 1208925 1210541 1213074 1216162 1220260 1225846
48456 1225846 1232576 1239943 1247937 1256201 1263344 1268095 1270570 1271529 1270968 1268398 1263974 1258231 1251228 1243112
48442 1243112 1235184 1229053 1224712 1220520 1215120 1208360 1200356 1190853 1179871 1168078 1156202 1144682 1134015
48429 1134015 1124667 1116461 1108780 1101581 1095557 1091106 1087805 1084985 1082157 1078766 1074316 1068944 1063238 1057332
48415 1057332 1050842 1043883 1037342 1031779 1026686 1021187 1014970 1008254 1001379 994766 988795 983414 978259 973368
48401 973368 969327 966495 964509 962725 960689 958009 954333 949826 945251 941185 937349 932956 927568 921423
48387 921423 915070 908838 902675 896580 891148 887243 884926 883183 881125 878970 877294 875802 873721 871052
48373 871052 868574 866728 865323 864187 863262 862146 860365 858151 856197 854726 853578 852985 853342 854270 854952
48358 854952 855394 856383 858126 859976 861616 863454 865643 867730 869596 871839 874865 878417 882307 886919 892744
48343 892744 900022 908880 919200 930532 942879 957195 974106 992501 1010694 1028702 1047708 1067275
48331 1067275 1084792 1098119 1107367 1113831 1118715 1123438 1129710 1138490 1149731 1163358 1179482 1197708
48319 1197708 1217694 1240378 1267054 1297188 1328941 1361972 1397830 1437441 1480428 1527260 1579780
48308 1579780 1639198 1705967 1782201 1871749 1977354 2100570 2245330 2418894 2628786 2882513
48298 2882513 3191725 3573321 4045246 4625095 5334229 6198304 7240271 8474977 9909479
48289 9909479 11540495 13348780 15303513 17370192 19487149 21504987 23154988 24119657
48281 24119657 24180512 23327005 21744025 19710188 17496467 15313134 13295301 11508089
48273 11508089 9965576 8655059 7553032 6630886 5859348 5213891 4675153 4225000 3845899
48264 3845899 3524399 3251766 3020492 2822809 2652789 2506883 2381428 2271846 2174936 2089807
48254 2089807 2015690 1950504 1892139 1839577 1792152 1749049 1709961 1675061 1644048 1616255 1591686
48243 1591686 1570667 1552495 1535772 1520189 1506618 1495339 1485520 1476770 1469908 1465700 1463880 1463742 1464821
48230 1464821 1466577 1468052 1467971 1464635 1456043 1441161 1421081 1398017 1373284 1347237 1320840 1295726 1272429
48217 1272429 1249845 1226936 1203872 1181113 1158481 1135839 1113769 1092894 1073076 1053840 1035014
48206 1035014 1016503 997956 979124 960176 941318 922516 903871 885864 868933 853203 838826
48195 838826 826140 815147 805226 795690 786418 777692 769633 762068 754820 748011 742091 737430 733735 730092
48181 730092 725923 721748 718558 716530 714800 712508 709632 706757 704368 702458 700601 698411 696086 694236
48167 694236 692985 691566 689210 686086 682938 680136 677673 675741 674583 673920 673277 672754 672731 672914 672510 671466
48151 671466 670749 671167 672540 674211 675775 677102 678166 679148 680284 681491 682527 683547 684964 686730 688333
48136 688333 689571 690698 691709 692266 692565 693581 695918 698954 701565 703352 704795 706564 709038 712195 715698
48121 715698 719326 723406 728400 733979 739085 743218 747043 751349 756030 760666 765602 771674 779093 787281
48107 787281 795685 804267 813297 823177 834381 846976 860242 873261 885887 898680 911904 925177
48095 925177 938250 951487 965228 979144 992640 1005598 1018288 1030762 1042772 1054203 1065221
48084 1065221 1075966 1086447 1096751 1106988 1117012 1126494 1135342 1143699 1151455 1158196 1163927 1169414 1175435
48071 1175435 1181939 1188353 1194435 1200285 1205758 1210557 1214929 1219638 1225083 1231015 1237232 1243923 1250918 1257102
48057 1257102 1261102 1262392 1261438 1259072 1256011 1252666 1248914 1244082 1237406 1228497 1217403 1204566 1190797
48044 1190797 1176823 1162634 1147679 1131919 1116072 1100436 1084129 1066160 1046809 1027212 1007946
48033 1007946 988889 970265 952861 937023 922159 907507 892868 878370 864024 849749 835535
48022 835535 821373 807298 793625 780826 769059 758068 747597 737697 728575 720397 713232 706921
48010 706921 701045 695271 689723 684724 680298 676251 672647 669747 667469 665410 663514 662303 662257 663224 664590
47995 664590 665761 666392 666464 666350 666622 667542 668830 669973 670693 671074 671402 671909 672607 673327 673921 674308 674255 673341
47977 673341 671348 668629 665846 663405 661242 659110 656947 655039 653749 652913 651651 649239 646138 643498
47963 643498 641550 639306 636253 633461 632274 632606 633413 634257 635345 636485 637267 638171 640327 644008 648343
47948 648343 652630 657003 661688 666662 672349 679618 688569 698113 707219 715842 724203 732047 739271 746503
47934 746503 754278 762115 769105 775037 780217 784558 787599 789363 790583 791993 793704 795163 795431 793682
47920 793682 789847 784676 778960 772830 765979 758323 750122 741737 733564 726062 719438 713357 707181 700559
47906 700559 693769 687626 683035 680302 678809 677647 676603 676171 676553 677238 677861 678947 681310 685008 689397
47891 689397 694029 699118 705150 712362 720519 728941 736777 743497 749283 754953 761454 769156 777417 785042
47877 785042 791497 797437 803623 809599 814155 816910 818517 819246 818445 815807 812193 808473 804304 798821 792013
47862 792013 784568 776778 768418 759473 750254 740905 731425 722066 713152 704643 696334 688353 680949 674039
47848 674039 667516 661799 657452 654378 652001 650143 649047 648648 648587 649023 650678 653798 657635 661327 664786
47833 664786 668365 672015 675247 677827 680148 682844 686127 689526 692324 694335 696125 698367 701151 704132
47819 704132 707147 710345 713856 717812 722720 729356 738073 748463 759908 772318 786224 802298 820839
47806 820839 841636 864247 888361 913772 939934 965797 990317 1013066 1034103 1053331 1070218
47795 1070218 1084034 1094137 1100095 1101887 1100010 1095168 1087809 1078171 1066695 1054101 1041024 1027796
47783 1027796 1014639 1001779 989300 977066 964925 952914 941278 930400 920633 911978 903912 895761
47771 895761 887363 879239 872015 865758 859929 853894 847412 840667 833964 827445 821109 814904 808692 802288
47757 802288 795817 789913 785197 781467 777854 773923 770253 767638 766097 765109 764578 765082 767185 770827 775448
47742 775448 780458 785598 791088 797438 805014 813829 823799 834990 847459 861035 875447 890454 905586
47729 905586 919995 932895 944119 954038 963098 971628 979861 987734 994695 1000030 1003343 1004581 1003749 1000871
47715 1000871 996052 989303 980527 969963 958428 946667 934595 921608 907585 893157 879064 865707
47703 865707 853320 842150 832314 823807 816716 811171 807147 804551 803472 803934 805488 807494 809921 813464
47689 813464 818758 825734 833882 842844 852680 863735 876271 889975 903866 916979 929181 941064
47677 941064 953016 964771 975847 986028 995284 1003506 1010506 1016074 1020023 1022374 1023422 1023332 1021672 1017786
47663 1017786 1011631 1003881 995138 985402 974433 962220 948984 935093 921169 907912 895593 884007
47651 884007 873040 862979 854038 846022 838697 832249 827117 823596 821740 821402 822193 823726 826105 829812
47637 829812 834882 840537 846025 851507 857714 865021 873357 882801 893694 906127 919803 934519 950491
47624 950491 968192 988184 1011139 1037522 1066932 1098000 1129210 1159770 1189458 1217777 1243548
47613 1243548 1265413 1282549 1294733 1301819 1303325 1298584 1287294 1269846 1247123 1219959 1188734 1153515
47601 1153515 1114665 1073330 1031259 990066 950691 913509 878694 846300 816251 788578 763620
47590 763620 741704 722574 705434 689745 675763 664082 654692 646699 639011 631243 623897 617694 612826
47577 612826 608888 605421 602314 599670 597518 595787 594380 593101 591661 590006 588552 587872 588108 588752 588950
47562 588950 587929 585343 581448 576948 572552 568649 565331 562461 559652 556552 553342 550600 548442 546257
47548 546257 543747 541682 540916 540953 540366 538630 536669 535459 534946 534662 534599 534889 535200 535074 534630 534400 534680 535432
47530 535432 536582 537971 539185 539892 540355 541199 542660 544298 545549 546312 546933 547686 548392 548673 548632 548995 550280
47513 550280 551963 552993 553159 553340 554187 555195 555481 555058 554791 555394 556917 558977 560936 562027 561941 561283 560979
47496 560979 561245 561581 561721 562038 562902 564140 565391 566566 567658 568434 568747 569009 569989 572110 575128 578492
47480 578492 581841 585150 588560 592243 596344 600922 605836 610745 615358 619674 623870 627917 631459 634215
47466 634215 636329 638184 639910 641242 641775 641325 640109 638782 638107 638340 638997 639484 639866 640672 641980 643213
47450 643213 644089 645330 647976 652190 657258 662772 669280 677700 688470 701551 716839 734141 753004
47437 753004 773075 794624 818305 844320 872157 901202 931169 961805 992562 1022784 1051784
47426 1051784 1078460 1101313 1119449 1133366 1144212 1152297 1156774 1156731 1152041 1143153 1130626 1115070 1097131
47413 1097131 1077263 1055808 1033425 1011067 989358 968287 947707 927807 908877 890957 874030
47402 874030 858272 843814 830486 818142 807024 797468 789360 782269 776097 771334 768660 768442 770486
47389 770486 774098 778500 783470 789509 797173 806336 816301 826485 836687 846831 856949 867489 879139
47376 879139 891937 904757 915960 924540 930487 934218 936049 936239 935119 932741 928515 921629 911991 900419
47362 900419 887724 873875 858496 841897 825133 808922 793007 776753 760053 743425 727538
47351 727538 712874 699555 687157 674917 662525 650658 640397 632125 625234 618866 612662 606801
47339 606801 601669 597707 595292 594412 594455 594586 594475 594559 595475 597344 599782 602526 605739 609639 614209 619433
47323 619433 625427 631930 637981 642621 645844 648355 650459 651781 652104 651815 651295 650436 649029 647097 644477
47308 644477 640621 635337 629345 623561 618154 612853 607919 604168 602125 601659 602392 604001 606142 608600 611535
47293 611535 615150 619163 623082 627087 632072 638650 646483 654767 662990 670986 678671 686125 693781 702141
47279 702141 711284 720828 730379 739889 749587 759648 769941 780000 789237 797207 803815 809379 814401
47266 814401 819081 823054 825868 827723 829366 831152 832664 833585 834412 835776 837417 838659 839792 842145 846485
47251 846485 851960 856867 859882 860192 857097 850281 840392 828829 816926 805625 795751 788021 782616 779057
47237 779057 776789 775758 776323 778681 782509 787184 792353 798342 805923 815599 827066 839508 852380 865863
47223 865863 880465 896305 912804 928992 944045 957613 969776 980751 990526 998683 1004623 1008052
47211 1008052 1009226 1008633 1006416 1002239 995789 987312 977517 966976 955756 943689 930908 917989 905644
47198 905644 894399 884614 876582 870347 865475 861300 857553 854596 852947 852793 854121 857069 861796 868190
47184 868190 876049 885498 896897 910376 925798 943111 962287 982945 1004532 1027000 1050763 1075732
47172 1075732 1100837 1124805 1147047 1167516 1186168 1202982 1218064 1231193 1241536 1248425 1252182 1253653
47160 1253653 1252991 1249519 1242780 1233256 1221936 1209621 1196743 1183432 1169545 1154935 1139862 1124941
47148 1124941 1110585 1096725 1083222 1070340 1058660 1048527 1039717 1031741 1024517 1018666 1014892 1013101
47136 1013101 1012536 1012876 1014680 1018375 1023313 1028440 1033558 1039195 1045360 1051192 1055902 1059353 1061563 1062255 1061210
47121 1061210 1058526 1054247 1048186 1040406 1031517 1022140 1012382 1002084 991279 980065 968361 956146 943767
47108 943767 931703 920088 908724 897445 886269 875280 864536 854038 843731 833629 823923 814783
47096 814783 806095 797666 789702 782729 776977 772217 768349 765674 764327 763852 763686 763764 764288 765248 766613 768781
47080 768781 772298 777144 782643 788035 792839 796778 799770 802081 804187 806340 808394 810009 810935 811188 811115
47065 811115 811097 810971 809959 807522 804195 801204 799347 798622 798883 800296 802942 806382 809941 813277 816545
47050 816545 820196 824723 830298 836503 842702 848838 855601 863506 872117 880565 888615 896704 905037 913183
47036 913183 920690 927614 934267 940876 947786 955547 964312 973365 981731 989166 996175 1003154 1009969 1016359
47022 1016359 1022185 1027170 1030885 1033294 1034908 1036116 1036630 1035868 1033581 1029906 1025117 1019694 1014315 1009308
47008 1009308 1004366 999247 994499 990912 988398 986098 983546 981061 978904 976825 974860 973861 974597 976675
46994 976675 979010 981200 983796 987187 990916 994448 998197 1003184 1009777 1017263 1024876 1032841 1041911 1052128
46980 1052128 1062671 1073004 1083514 1094610 1105794 1116325 1126501 1137494 1149892 1163107 1176306
46969 1176306 1189263 1201902 1213632 1223621 1231512 1237506 1242008 1245486 1248440 1251094 1253251 1254751 1255930
46956 1255930 1257248 1258570 1259218 1258871 1258167 1258243 1259758 1262427 1265487 1268509 1271697 1275442 1279797 1284580 1289808
46941 1289808 1295746 1302548 1310128 1318374 1327180 1336239 1345220 1354243 1363852 1374285 1385038 1395331 1404758
46928 1404758 1413338 1421149 1428145 1434100 1438549 1440946 1441068 1439053 1434969 1428657 1420150 1409902 1398323 1385412
46914 1385412 1371179 1356186 1341267 1326880 1313077 1300006 1288060 1277537 1268403 1260446 1253556 1247932
46902 1247932 1244120 1242738 1244087 1248231 1255412 1265973 1279659 1295469 1312578 1331074 1351457 1373778
46890 1373778 1397726 1423093 1449468 1475749 1500722 1524110 1546397 1567656 1587255 1604761 1620388
46879 1620388 1634308 1646224 1656017 1664212 1671315 1677109 1681132 1683574 1685260 1686977 1689287 1692796 1698018
46866 1698018 1704923 1713017 1722052 1732373 1744455 1758281 1773301 1788914 1804864 1821234 1838157 1855487
46854 1855487 1872760 1889432 1905139 1919693 1932854 1944189 1953248 1959894 1964417 1967136 1967938 1966433 1962692
46841 1962692 1957662 1952507 1947629 1942612 1937153 1931621 1926544 1921874 1917238 1912851 1909804 1909215 1911215 1914964
46827 1914964 1919681 1925512 1933305 1943627 1956196 1970305 1985493 2001532 2017936 2033906 2048879 2062869
46815 2062869 2076013 2087961 2098017 2105814 2111625 2115913 2118791 2120036 2119527 2117468 2114168 2109736 2104171
46802 2104171 2097646 2090593 2083388 2076144 2068920 2062064 2056095 2051154 2046750 2042244 2037569 2033356 2030318 2028691
46788 2028691 2028296 2028924 2030426 2032544 2035032 2037991 2041855 2046841 2052637 2058791 2065161 2071752 2078331 2084656
46774 2084656 2090977 2097830 2105266 2112739 2119919 2127292 2135704 2145587 2156823 2169114 2182175 2195816 2210114
46761 2210114 2225443 2242078 2259887 2278619 2298360 2319448 2342030 2365909 2390716 2416006 2441230
46750 2441230 2465906 2489833 2512964 2535131 2555987 2575066 2591712 2605244 2615521 2623299 2629614 2634830
46738 2634830 2638619 2640851 2642020 2642659 2642754 2642037 2640652 2639220 2638312 2638126 2638705 2640286 2643270 2647851 2653788 2660671
46722 2660671 2668345 2676802 2685611 2693791 2700548 2705917 2710330 2713740 2715580 2715460 2713335 2708939 2701637 2691097
46708 2691097 2677661 2661703 2642991 2621062 2595968 2568244 2538351 2506582 2473372 2439255 2404467
46697 2404467 2369005 2333137 2297518 2262663 2228588 2195106 2162254 2130352 2099818 2071031 2044084
46686 2044084 2018509 1993538 1968894 1945159 1923129 1902940 1884119 1866265 1849349 1833449 1818616
46675 1818616 1805002 1792672 1781198 1769895 1758700 1748462 1740055 1733489 1728176 1723803 1720575 1718811
46663 1718811 1718688 1720221 1723144 1726941 1731381 1736879 1743833 1751714 1759297 1765804 1771239 1775580 1778343 1779297
46649 1779297 1779104 1778700 1778263 1777165 1774842 1771431 1767635 1764149 1761232 1758860 1757410 1758019 1761848 1769053 1778987
46634 1778987 1791415 1806753 1824856 1844432 1864384 1885146 1907803 1932172 1956635 1979735 2001085
46623 2001085 2020546 2037381 2050670 2060082 2065850 2068304 2067733 2064437 2058532 2049764 2037773 2022591 2004787
46610 2004787 1985145 1964233 1942336 1919827 1897468 1876044 1855666 1835831 1816450 1798455 1782943
46599 1782943 1769928 1758392 1747456 1736970 1727071 1717767 1709087 1701082 1693473 1685766 1678019 1670985 1665108
46586 1665108 1659666 1653386 1645763 1637362 1628883 1620438 1611895 1603510 1595843 1589088 1582847 1576677 1570699 1565541
46572 1565541 1561809 1559773 1559383 1560262 1561730 1563202 1564708 1566766 1569664 1573187 1577131 1581673 1586945 1592617
46558 1592617 1598266 1603892 1609765 1615974 1622427 1629055 1635727 1642343 1649369 1657810 1668108 1679405 1690569
46545 1690569 1701656 1713615 1726783 1740615 1754927 1770386 1787412 1805405 1823595 1842188 1862164
46534 1862164 1884270 1908515 1934306 1960829 1987645 2015300 2045101 2077943 2113485 2150578 2188277
46523 2188277 2226349 2265128 2305084 2346202 2387573 2427777 2465807 2501416 2534636 2565412 2593781
46512 2593781 2619884 2643528 2664109 2681236 2695039 2705725 2713256 2717680 2719312 2718362 2714912 2709600 2703687
46499 2703687 2697907 2691757 2684538 2676646 2669020 2661562 2652994 2642329 2629773 2616004 2601199 2585092 2567571
46486 2567571 2548752 2528588 2506630 2482171 2454591 2423679 2389722 2353281 2314917 2275144 2234479
$$ [...]
##END NTUPLES=NMR SPECTRUM
##END=
