##TITLE=AC1506_CUNDCR13313_8126553_ktEYUnGwJc
##JCAMPDX= 6.0         $$ Bruker NMR JCAMP-DX V2.0
##DATA TYPE= NMR SPECTRUM
##DATA CLASS= NTUPLES
##ORIGIN= BRUKER
##OWNER= Administrator
$$ 1.72 TOPSPIN		Version 2.1
$$ 2013-08-16 19:39:44.507 -0700  Administrator@X
$$ Compression mode = diff/dup
##.OBSERVE FREQUENCY= 400.02188249412
##.OBSERVE NUCLEUS= ^1H
##.ACQUISITION MODE= SIMULTANEOUS (DQD)
##.ACQUISITION SCHEME= undefined
##.AVERAGES= 8
##.DIGITISER RES= 22
##SPECTROMETER/DATA SYSTEM= spect
##.PULSE SEQUENCE= zg30
##.SOLVENT NAME= COFFEE_meoh
##.SHIFT REFERENCE= INTERNAL, COFFEE_meoh, 1, 14.98509
##AUDIT TRAIL= $$ (NUMBER, WHEN, WHO, WHERE, PROCESS, VERSION, WHAT)
$$ ##TITLE= Audit trail, TOPSPIN		Version 2.1
$$ ##JCAMPDX= 5.01
$$ ##ORIGIN= Bruker BioSpin GmbH
$$ ##OWNER= Administrator
$$ $$ E:\/data/COFFEE/nmr/AC1506_CUNDCR13313_8126553_ktEYUnGwJc/20/pdata/1/auditp.txt
$$ ##AUDIT TRAIL=  $$ (NUMBER, WHEN, WHO, WHERE, PROCESS, VERSION, WHAT)
(   1,<2013-08-16 19:39:38.069 -0700>,<Administrator>,<X>,<go>,<TOPSPIN 2.1>,
      <created by zg
	started at 2013-08-16 19:38:32.335 -0700,
	POWCHK enabled, PULCHK disabled,
       configuration hash MD5:
       C8 4E 4E 5D D3 5C D8 9E 9F 52 82 E0 59 8A DE 15
       data hash MD5: 64K
       CF 22 0F F7 71 2B A5 15 DB 5A 66 FD 8F 9F E1 6F>)
(   2,<2013-08-16 19:39:40.944 -0700>,<Administrator>,<X>,<proc1d>,<TOPSPIN 2.1>,
      <Start of raw data processing
       efp LB = 0 FT_mod = 6 PKNL = 1 PHC0 = 0 PHC1 = 0 SI = 32K 
       data hash MD5: 32K
       28 5F 4A 50 42 AA 0E 39 7B B6 81 5C 05 B4 24 1A>)
(   3,<2013-08-16 19:39:41.303 -0700>,<Administrator>,<X>,<proc1d>,<TOPSPIN 2.1>,
      <pk PHC0 = 97.8772 PHC1 = 0 
       data hash MD5: 32K
       CC CB E2 49 89 48 5C 3E 16 1B 01 30 C6 2B 25 F3>)
(   4,<2013-08-16 19:39:41.397 -0700>,<Administrator>,<X>,<proc1d>,<TOPSPIN 2.1>,
      <abs ABSG = 1 
       data hash MD5: 32K
       7A F5 EF 83 46 D7 2B 39 9A C6 9F 00 27 06 85 2D>)
(   5,<2013-08-16 19:39:41.475 -0700>,<Administrator>,<X>,<proc1d>,<TOPSPIN 2.1>,
      <abs ABSG = 2 
       data hash MD5: 32K
       59 FC 83 8B 82 C3 A0 10 81 22 1D C7 9D 2E E3 1B>)
(   6,<2013-08-16 19:39:41.522 -0700>,<Administrator>,<X>,<proc1d>,<TOPSPIN 2.1>,
      <abs ABSG = 3 
       data hash MD5: 32K
       AE 31 18 E2 B7 36 09 9D AE 8D 5D D2 25 63 1F 4B>)
(   7,<2013-08-16 19:39:41.569 -0700>,<Administrator>,<X>,<proc1d>,<TOPSPIN 2.1>,
      <abs ABSG = 4 
       data hash MD5: 32K
       6C 6C 9F 92 DB 11 D2 7B 8C 5A 8C 06 6A 5E 9B 18>)
(   8,<2013-08-16 19:39:41.616 -0700>,<Administrator>,<X>,<proc1d>,<TOPSPIN 2.1>,
      <abs ABSG = 5 
       data hash MD5: 32K
       7E 74 46 30 FD 6B 70 20 E3 9A 76 1E 5D 55 6A 32>)
$$ ##END=
$$ 
$$ $$ hash MD5
$$ $$ 1B 0E DE C7 3C 28 7D 74 BC EA 77 DE ED 44 8F EF
##$RELAX= 
##$RELAX= 
##$RELAX= 
##$RELAX= 
##$RELAX= 
##$RELAX= 
##$RELAX= 
$$ Bruker specific parameters
$$ --------------------------
##$DU= <E:\>
##$EXPNO= 20
##$NAME= <AC1506_CUNDCR13313_8126553_ktEYUnGwJc>
$$ [...]
150 150 150 150 150 150 150 150
##$TP07= 0
##$TPNAME0= <>
##$TPNAME1= <>
##$TPNAME2= <>
##$TPNAME3= <>
##$TPNAME4= <>
##$TPNAME5= <>
##$TPNAME6= <>
##$TPNAME7= <>
##$TPOAL= (0..7)
0.5 0.5 0.5 0.5 0.5 0.5 0.5 0.5
##$TPOFFS= (0..7)
0 0 0 0 0 0 0 0
##$TUNHIN= 0
##$TUNHOUT= 0
##$TUNXOUT= 0
##$USERA1= <user>
##$USERA2= <user>
##$USERA3= <user>
##$USERA4= <user>
##$USERA5= <user>
##$V9= 5
##$VALIST= <valist>
##$VCLIST= <CCCCCCCCCCCCCCC>
##$VD= 0
##$VDLIST= <DDDDDDDDDDDDDDD>
##$VPLIST= <PPPPPPPPPPPPPPP>
##$VTLIST= <TTTTTTTTTTTTTTT>
##$WBST= 2048
##$WBSW= 25
##$XGAIN= (0..3)
0 0 0 0
##$XL= 0
##$YL= 0
##$YMAX_a= 615874
##$YMIN_a= -525836
##$ZGOPTNS= <>
##$ZL1= 120
##$ZL2= 120
##$ZL3= 120
##$ZL4= 120
##$ABSF1= 14.98509
##$ABSF2= -5.573092
##$ABSG= 5
##$ABSL= 3
##$ALPHA= 0
##$AQORDER= 0
##$ASSFAC= 0
##$ASSFACI= 0
##$ASSFACX= 0
##$ASSWID= 0
##$AUNMP= <proc_prof1d_extract_pilot.lims>
##$AXLEFT= 0
##$AXNAME= <>
##$AXNUC= <1H>
##$AXRIGHT= 0
##$AXTYPE= 0
##$AXUNIT= <>
##$AZFE= 0.1
##$AZFW= 0.1
##$BCFW= 0
##$BC_mod= 0
##$BYTORDP= 0
##$COROFFS= 0
##$CY= 15
##$DATMOD= 1
##$DC= 0
##$DFILT= <>
##$DTYPP= 0
##$F1P= 0
##$F2P= 0
##$FCOR= 0.5
##$FTSIZE= 32768
##$FT_mod= 6
##$GAMMA= 0
##$GB= 0
##$INTBC= 1
##$INTSCL= 1
##$ISEN= 128
##$LB= 0
##$LEV0= 0
##$LPBIN= 0
##$MAXI= 10000
##$MC2= 0
##$MEAN= 0
##$ME_mod= 0
##$MI= 0
##$NCOEF= 0
##$NC_proc= -8
##$NLEV= 6
##$NOISF1= 0
##$NOISF2= 0
##$NSP= 0
##$NTH_PI= 0
##$NZP= 0
##$OFFSET= 14.98509
##$PC= 1
##$PHC0= 97.8772
##$PHC1= 0
##$PH_mod= 1
##$PKNL= yes
##$PPARMOD= 0
##$PPDIAG= 0
##$PPIPTYP= 0
##$PPMPNUM= 2147483647
##$PPRESOL= 1
##$PSCAL= 4
##$PSIGN= 0
##$PYNMP= <proc.py>
##$REVERSE= no
##$SF= 400.02
##$SI= 32768
##$SIGF1= 0
##$SIGF2= 0
##$SINO= 400
##$SIOLD= 32768
##$SPECTYP= <>
##$SREGLST= <1H.CDCl3>
##$SSB= 0
##$STSI= 32768
##$STSR= 0
##$SW_p= 8223.68421052631
##$SYMM= 0
##$S_DEV= 0
##$TDeff= 65536
##$TDoff= 0
##$TI= <>
##$TILT= no
##$TM1= 0
##$TM2= 0
##$TOPLEV= 0
##$USERP1= <user>
##$USERP2= <user>
##$USERP3= <user>
##$USERP4= <user>
##$USERP5= <user>
##$WDW= 1
##$XDIM= 32768
##$YMAX_p= 457930918
##$YMIN_p= -764050
##$CURPLOT= <Network HP LaserJet P1505>
##$CURPRIN= <$Network HP LaserJet P1505>
##$DFORMAT= <normdp>
##$LAYOUT= <+/1D_H.xwp>
##$LFORMAT= <normlp>
##$PFORMAT= <normpl>
##$SURQMSG= 1
$$ End of Bruker specific parameters
$$ ---------------------------------
##NTUPLES= NMR SPECTRUM
##VAR_NAME=  FREQUENCY,     SPECTRUM/REAL,   SPECTRUM/IMAG
##SYMBOL=    X,             R,               I
##VAR_TYPE=  INDEPENDENT,   DEPENDENT,       DEPENDENT
##VAR_FORM=  AFFN,          ASDF,            ASDF
##VAR_DIM=   32768,         32768,           32768
##UNITS=     HZ,            ARBITRARY UNITS, ARBITRARY UNITS
##FACTOR=    0.250966925370066, 1,           1
##FIRST=     8223.43324360094, -71921,       -49512
##LAST=      0,             82240,           -143917
##MIN=       0,             -764050,         0
##MAX=       8223.43324360094, 457930918,    0
$$ Real data points
##PAGE= N=1
##DATA TABLE= (X++(R..R)), XYDATA
$$ [...]
19584e8077E2379b04562K5401i517A56984d1005F5737d06916I919c32151A98812
19572F537J81088h5571j79987A67271a54494B70961A27107C8578e6923F3108c7208
19560H1147J41155N2299b02204P2752B7477J79078C2728a80461r9446J18067O3985
19549i7855l32560I987B618c67032i424j77841j23825a4831A44943B7126b6248
19537f5571l2752m7720l9621A51490a60300A26886N074f22525a24075d0803p6871
19526a17674A97440b28926N0093P2015n8887b2631r9172B02441d9491p1213c8413
19514a73744j02504a36088j94427a17233a7316p9242K000k31554C20232f2712
19503C1542I763R1540l4628J09586P584C2586J21530o7817e7096I3438J7229a59796
$$ plain form
19584 -58077 52379 -204562 -179161 -9517 156984 -41005 65737 -406916 9919 -332151 198812
19572 6537 187625 -85571 -265558 167271 -154494 270961 127107 38578 -56923 63108 -37208
19560 81147 222302 274601 -202204 -129452 27477 206555 32728 -180461 -279907 -161840 -97855
19549 -97855 -430415 9987 2618 -367032 -9424 -187265 -311090 -14831 144943 27126 -26248
19537 -65571 -98323 -146043 -185664 151490 -160300 126886 131960 -622525 -124075 -40803 -117674
19526 -117674 197440 -228926 -178833 -106818 -165705 -22631 -121803 202441 -49491 -120704 -38413
19514 -173744 -276248 -136088 -330515 -117233 -17316 -96558 -94558 -326112 320232 -62712
19503 31542 9763 101303 66675 176261 183845 32586 154116 86299 -57096 93438 110667 -159796
19490I0532J36845b1610F5716J21164c07900L3549a24194o0662B67025G4560c04405
19478c6946J8399o5006n8546A62496b02800a173A7910M5664g1313B23207L700
19467B26907a25329m893l16055a08336j06156K7064l5042K6148f2531G872J80981
19456A88853d4178B02846a39471j70352i854l02298A8713J8234g2292k32630B8626
19444a71335p36A1360f9139b7842G6715b21295a05596K2120j62814D4978Q6255
19433A31233c65110B24274b79085G1212K4283a94983R0669C9160c1055k79530
19423c10585h9419j74912h8860C5172c80859A54078b9534j40247g5491A13184
19412F1331i3126E0617K5106k9912i3413A53037a60955q999a7575D5637h9315
$$ plain form
19490 90532 227377 -21610 65716 186880 -307900 -274351 -124194 -184856 267025 74560 -304405
19478 -36946 -18547 -83553 -142099 162496 -202800 -1173 17910 63574 -71313 223207 226907
19467 226907 -125329 -130222 -446277 -108336 -214492 -187428 -222470 -196322 -62531 7872 188853
19456 188853 -44178 202846 -139471 -309823 -9854 -312152 18713 36947 -72292 -304922 28626
19444 -171335 -172071 11360 -69139 -27842 76715 -221295 -105596 -83476 -246290 44978 131233
19433 131233 -365110 224274 -279085 71212 95495 -194983 -104314 39160 -31055 -310585
19423 -310585 -89419 -264331 -88860 35172 -380859 154078 -29534 -169781 -75491 113184
19412 61331 -93126 50617 75723 45811 -93413 153037 -160955 -169954 -17575 45637 -89315
19400A4295b93048e1730F2064K52916I4129c02779n2375A50630j3590a00802F9782
19388b42957E8842M9557c03191J01747B48510A04435b76493j9883e7120B51469
19377g4768H4930g2006K2099H7798J7360a12812M6577k53646i1880j52034c236
19365a38056M174J3403k30029G0758a58141E37302B29880a42078G9631b710j12040
19354a14750m6174L0176o347N2623j83304K2367j640A8984K8247d5660B02137
19342b51188B0573A419a04837A87886b25403B64213l7809c1514j04388B06081
19331b55142A39266h0393C45355a22915L9283k30305f7978a1918j21037B67882
19320a67673E2122k5623J69343a32025M3958k43836B8680R9218b61651j38196
$$ plain form
19400 14295 -293048 -51730 62064 314980 94129 -302779 -355154 150630 137040 -100802 69782
19388 -242957 58842 108399 -303191 -201444 248510 104435 -276493 -296376 -57120 251469
19377 -74768 84930 -72006 -49907 87798 105158 -112812 -66235 -319881 -91880 -243914 -3236
19365 -138056 -133882 -120479 -350508 70758 -158141 537302 229880 -142078 79631 -2710 -114750
19354 -114750 -160924 -130748 -137095 -84472 -267776 -245409 -247049 18984 47231 -45660 202137
19342 -251188 20573 1419 -104837 187886 -225403 264213 226404 -31514 -135902 206081
19331 -255142 139266 -80393 345355 -122915 -83632 -313937 -67978 -11918 -132955 267882
19320 -167673 52122 26499 195842 -132025 -88067 -331903 28680 127898 -261651 -399847
19310c99847g9539j74401j51011h1378B15471r3784a49094e5818j58097j52642
19300c66557A18810a52797B5248J19671k8190L448b89010a16012d4681E3558M7710
19289A01268B9467b90360J04510c9191G9155g8867j44287B9818R5243J08308h2769
19277c3614l7403l0422p538H25d46503a74315N0202j38372B20977a32129D17360
19265e51870c0374B14752I1747P4231b49212j8158E8500f8680J3354m9096j32383
19254b36805i5450o9228D0410J00012b1921j12560j69843A3702J79220D7795b52092
19242h2664B162J62984b001p5426L189k134j7291C2031J59312a84675c1196j01224
19230a32420A17741J33702c44389Q2298R5527L8776m4503Q3810F4535h8840B44348
$$ plain form
19310 -399847 -79539 -253940 -404951 -81378 215471 121687 -149094 -55818 -213915 -366557
19300 -366557 118810 -152797 25248 144919 116729 120177 -289010 -116012 -44681 53558 101268
19289 101268 29467 -290360 -185850 -39191 79155 -78867 -223154 29818 125061 233369 -82769
19277 -33614 -71017 -101439 -108977 825 -446503 -174315 -124113 -262485 220977 -132129 417360
19265 -551870 -30374 214752 91747 165978 -249212 -267370 58500 -68680 -55326 -104422 -236805
19254 -236805 -95450 -164678 40410 140422 -21921 -134481 -304324 13702 192922 47795 -252092
19242 -82664 2162 165146 -2001 -77427 -74238 -76372 -93663 32031 191343 -184675 -31196 -132420
19230 -132420 117741 251443 -344389 -262091 -166564 -127788 -172291 -88481 64535 -88840 244348
19218A42810c74551d4056J8951k45763J15852B92753I5351C8091b35553J07456
19208a28097A3516h6770j39031b5485k50803k53828E2825e1990r1147j18071N9834
19197b01374P8558b3358j32534o278e2537A87298a20550r920D109a65603l317
19186a68920B4490K13914f9612B85221a18647j78394B51210a23813d1480R644
19176c1836A51754a11213N0961A22695a26147d0443D8864J5262h431k25374Q6337
19165a47468f7860F2113a09471k5248C15046h3257j79030N0632H7995G143a38143
19153a16366q3103A10547a80573k7496C6006h2009A1454b58610B5487J21394a65151
19141G548a62711J3150m4963o0216P1490J8105D8029J20695j2515h5055A9283
$$ plain form
19218 142810 -374551 -44056 -25105 -270868 -155016 292753 95351 38091 -235553 -128097
19208 -128097 13516 -86770 -225801 -25485 -276288 -530116 52825 -51990 -143137 -261208 -201374
19197 -201374 -122816 -23358 -155892 -162170 -52537 187298 -120550 -130470 4109 -165603 -168920
19186 -168920 24490 238404 -69612 285221 -118647 -297041 251210 -123813 -41480 -31836
19176 -31836 151754 -111213 -60252 122695 -126147 -40443 48864 64126 -8431 -233805 -147468
19165 -147468 -67860 62113 -109471 -134719 315046 -83257 -262287 -211655 87995 7143 -138143
19153 -116366 -199469 110547 -180573 -208069 36006 -82009 11454 -258610 25487 146881 -165151
19141 7548 -162711 -149561 -194524 -254740 -183250 -165145 48029 168724 156209 -85055 19283
19129a92227j29750A35233b46902c9843m08164A41157g6753j92124B5959a68078
19118D0169j2688M0719c22943a42794E0947c12891B7429a03829A37482c45087
19107a48336r218L7672G5017b73686B8194P5402b09501e8317k92202a23344E3106
19095f8785L032I8286f5492J8015M235j93533A08194a72412n9831A02552Q0266
19084A82818a65255C1589b65528J23671B92812i163j0491k8715l13605a59852
19073B95048q753f106G0160h4387E8668a14716c2293j63247o3601h6059B76733
19061b61051F4173f0825j10014G5051h6711j53259j14576d010I5937e7350B15913
19049h316n4440j1006j59812O8302r8067F9350b59231O5657C79003A05408b17901
$$ plain form
19129 -192227 -321977 135233 -246902 -39843 -448007 141157 -76753 -268877 25959 -168078
19118 40169 27481 68200 -322943 -142794 50947 -312891 27429 -103829 137482 -345087
19107 -148336 -157554 -119882 75017 -273686 28194 103596 -209501 -58317 -350519 -123344 53106
19095 -68785 -65753 98286 -65492 -47477 -43242 -236775 108194 -172412 -232243 102552 182818
19084 182818 -165255 31589 -265528 -141857 292812 -9163 -19654 -48369 -361974 -159852
19073 295048 286295 -6106 70160 -84387 58668 -114716 -32293 -195540 -259141 -86059 276733
19061 -261051 64173 -60825 -170839 75051 -86711 -239970 -354546 -4010 95937 -57350 215913
19049 -8316 -62756 -73762 -233574 -165272 -263339 69350 -259231 -193574 379003 105408 -217901
19037e2487E8987K6397a3997f613j44941o324B63240A26643k7732A9098c08484
19025a21152a5391q4713I7873b844A78014m4291B2884a55191k09566a05922m2830
19014a48752B21314P28b41737I9703b27000g0359l5581I6591d3097a1807r4972
19003a06779J8964b4789j38922E6960b38549D7917A1513b2980C16549a50959b052
18991c3457j7142A79491a23513I7980a49005O3262J8112k116f079k50010b8268
18979g3913A3819c4058j82238L3006B53125a83878j53832A81311C1454a68819
18968i4460l5731c8109A1311a36467d694D6764J1313g2302r2163d4040j49726
18957a93766A9426b31249A9048e5550k95277J42327i2529k91744e8701J8987m8325
$$ plain form
19037 -52487 58987 85384 -13997 -6613 -151554 -157878 263240 126643 98911 19098 -308484
19025 -121152 -15391 -100104 97873 -2844 178014 133723 22884 -155191 -364757 -105922 -148752
19014 -148752 221314 222042 -241737 99703 -227000 -70359 -105940 96591 -43097 -11807 -106779
19003 -106779 -87815 -24789 -163711 56960 -238549 47917 11513 -22980 316549 -150959 -2052
18991 -33457 -50599 179491 -123513 97980 -149005 -85743 -67631 -69747 -6079 -256089 -28268
18979 -73913 13819 -34058 -216296 -183290 253125 -183878 -337710 181311 31454 -168819
18968 -94460 -130191 -38109 11311 -136467 -4694 46764 58077 -72302 -164465 -44040 -193766
18957 -193766 19426 -231249 19048 -55550 -350827 -208500 -92529 -384273 -58701 -39714 -88039
18946h8039j76359I934R4923a04239n1917A60863a29921K6151D89396C2887b3648
18934g4377b2779A75259Q2691a94943i518m64088I2277a74603D8613J45170b51995
18922a27925B37230d9069C69927E1067O0534k4946a7648A06579l1840M5832n6122
18911F4449b20994D6557J5609f5836l7832b8426p8109A29962b39368O4678j93679
18900c68369b9708l78558N6228A17949E1833h0086I763J51272j0270m9208a85531
18888A43606k3869a55804B19007a46470m8553d6854G9081b91184a9304E7420J45994
18877B03414r6341L3777a51737l12357H5810K6345m281b29373A83737i5120a6374
18865b04985N4462H6750e7497G6968a50193k7292H0667e7362k4516j51923D42938
$$ plain form
18946 -88039 -264398 9934 104857 -104239 -156156 160863 -129921 -103770 489396 32887 -23648
18934 -74377 -22779 175259 257950 -194943 -9518 -473606 92277 -174603 48613 193783 -251995
18922 -127925 237230 -49069 369927 51067 111601 86655 -17648 106579 74739 120571 64449
18911 64449 -220994 46557 62166 -65836 -103668 -28426 -106535 129962 -239368 -174690 -368369
18900 -368369 -29708 -408266 -352038 117949 51833 -80086 9763 161035 150765 101557 -185531
18888 143606 119737 -155804 219007 -146470 -195023 -46854 79081 -291184 -19304 57420 203414
18877 203414 107073 140850 -151737 -464094 85810 112155 107874 -229373 183737 -95120 -16374
18865 -204985 -150523 86750 -57497 76968 -150193 -177485 80667 -57362 -81878 -233801 442938
18853g0759B9854g2234D1403N8145J00805P3787a25043c152j8046j82461D33840
18841e9036E4165a52969n0028A08795a9767j07140d1802j46008f0056A3870b13581
18829b43123D3172J02940b17033A69445a79894C6321K15257b38807D8937J7545
18819F6482b9476C91234c00896J07097B353b24981R9040j1615a6934D1927J8940
18808F0867A7493K6107j9749d11754H518N3826Q2258d7766A84996a68561D6380
18796h5787G3387c5055j81972B10971c77189B29338A10692a20866L5198E686a2670
18784b04927m4738A84160H6196O8937g2968B89093a63987a2285D3417e3206k27991
18773b81197N2721j9933p4967B27388a58958B5829M0492c05055G5810a66670m653
$$ plain form
18853 -70759 29854 -72234 41403 99548 200353 274140 -125043 -3152 -21198 -203659 433840
18841 -59036 54165 -152969 -202997 108795 -19767 -126907 -41802 -187810 -60056 13870 -213581
18829 -243123 43172 146112 -217033 169445 -179894 36321 251578 -238807 48937 66482
18819 66482 -29476 391234 -300896 -193799 2353 -224981 -125941 -137556 -16934 41927 60867
18808 60867 17493 43600 23851 -411754 8518 62344 144602 -47766 184996 -168561 46380
18796 -85787 73387 -35055 -217027 210971 -377189 229338 110692 -120866 -85668 5686 -12670
18784 -204927 -249665 184160 86196 155133 -72968 289093 -163987 -12285 43417 -53206 -281197
18773 -281197 -228476 -248409 -323376 227388 -158958 25829 66321 -305055 75810 -166670 -171323
18762a71323l7645a006A21652d6356H0392Q01b74660J27961n4024b5022A17136
18750f2705B512a93670B95883H9805M8244a35351p3315B5633R5631a43524D0414
18738A2513a27904c2123n8204j16191L4394A18465a73456L4206J6585J1157I6363
18726e2788o2617K260m3359a595k83189a14210D3587a41136j38781R2158P6837
18715a10922j3149A42576L8990l9172a16741e1417n8248k09250A39823N3557n9933
18704A33447a9051j12792j72333B57406g0557A10228n2810Q8088C166d4381C9873
18692a8660f003k8487F9601e6439A32323e5930A81702a60813d5404I3746C6822
18680b40716b9586j30535E2539b13984F071c6369l17148a30389o5432j32510A12563
$$ plain form
18762 -171323 -208968 -1006 121652 -46356 80392 81193 -274660 -146699 -200723 -25022 117136
18750 -62705 2512 -193670 295883 89805 138049 -135351 -208666 25633 121264 -143524 40414
18738 12513 -127904 -32123 -90327 -206518 -172124 118465 -173456 -139250 -122665 -111508 96363
18726 -52788 -115405 -113145 -156504 -1595 -284784 -114210 43587 -141136 -279917 -187759 -110922
18715 -110922 -124071 142576 181566 142394 -116741 -51417 -109665 -318915 139823 193380 133447
18704 133447 -19051 -131843 -304176 257406 -70557 110228 57418 145506 3166 -44381 39873
18692 -18660 -6003 -34490 69601 -56439 132323 -55930 181702 -160813 -45404 93746 36822
18680 -240716 -29586 -160121 52539 -213984 6071 -36369 -353517 -130389 -195821 -328331 112563
18668A31236b51222j73923a23763f0035k1927I7848j5021b2041F8578A4088g3320
18656a64443B0426b08428h9279l0062k07883H9946C8096J06028B8252R5883f52
18644g9898k8753o2555j06256d9914j92968F344K00983J15169j43509g7046A94791
18632B36170A14637N3871q0745r863g9414B0974R3468c76724d5047j1182a2628
18620B8756f9931n3179k5162o7435j20504D8817c54506A28691k6680a73190j4237
18609a87427a8607A27778b91169A84569a70980c4670I3294k6197J07721a38671
18598b07725A60990f7222m7986k67619B45407c2720q0839f905k80547a40942G2501
18586a71026j31551B9294a94261Q9437E057a07184j00834r1278j24451J53324
$$ plain form
18668 131236 -251222 -425145 -123763 -60035 -81962 97848 82827 -22041 68578 14088 -73320
18656 -164443 20426 -208428 -89279 -119341 -327224 89946 38096 144124 28252 124135 -652
18644 -79898 -108651 -171206 -277462 -49914 -242882 6344 207327 322496 178987 -77046 194791
18632 236170 114637 168508 87763 77900 -79414 20974 114442 -376724 -45047 -56229 -12628
18620 28756 -69931 -123110 -148272 -215707 -336211 48817 -354506 128691 102011 -173190 -187427
18609 -187427 -18607 127778 -291169 184569 -170980 -34670 93294 67097 174818 -138671
18598 -207725 160990 -67222 -115208 -382827 245407 -32720 -113559 -6905 -287452 -140942 72501
18586 -171026 -302577 29294 -194261 -104824 5057 -107184 -208018 -299296 -423747 -270423
18576b70423L4008F4391a28583N3809k16099h3322B06866b20041A03095K8647
18566A31742b70624C8844b08562b9938A00794e4553A05658c6353A02239J57079
18556B59318D5436g5732D3669a80671k32159d3299j08179j8506N1541k84563G1927
18544c36386a41686l6091N2985o9079c1834A11909m8691c039l07469a02328k09604
18533c11932J33752Q4483E5269J35233m7065a55517A82846H3968I117i7210G7836
18521f40k4438A09905c04809O6613c9799p9919j96036A01340K05776A3111a06503
18509c75009A0187J71472J7622n8659a28021C8187J51573p6554b31585i9095c6337
18497d6251E3855c53744b5880l5569q5539o2927C3341H323b7514A82439B2560
$$ plain form
18576 -270423 -236415 64391 -128583 -74774 -290873 -83322 206866 -220041 103095 131742
18566 131742 -270624 38844 -208562 -29938 100794 -54553 105658 -36353 102239 259318
18556 259318 45436 -75732 43669 -180671 -412830 -43299 -151478 -169984 -118443 -403006 71927
18544 -336386 -141686 -177777 -124792 -193871 -31834 111909 63218 -3039 -310508 -102328 -311932
18533 -311932 -178180 -93697 55269 190502 143437 -155517 182846 83968 9117 -97210 77836
18521 -640 -25078 109905 -304809 -238196 -39799 -119718 -315754 101340 307116 13111 -106503
18509 -375009 10187 181659 199281 140622 -128021 38187 189760 113206 -231585 -99095 -36337
18497 -46251 53855 -353744 -25880 -61449 -146988 -209915 33341 8323 -27514 182439 22560
18485I5440e2565E6663L7799f0552j31903i5674E3060J78527c1743o3240A69064
18473b2376j8763E4577F424L87417c58756B67028q3512l6214b75654F6665J15595
18462A82260a96780A44663C9381g9909q2839H7765c78538i4438k43227n0223b1324
18450A46725b29950B1586b54979b0491p0183K5057K4490j40466A94099H0102b30955
18438g5966C79823a20173j26964C58973i5051k81k75713i1457E9065a93978h3815
18426f4632A6990b0966k34244a12554L625p0222C14998D3022K33288D2346b6317
18414I8061a90964A71264f9555A75236a6652A92874b01763G8237f981A57951a79918
18402a08675M6480j64423A6552b38341a15501j10210p5576f7594l61700C50748
$$ plain form
18485 95440 -52565 56663 94462 -60552 -192455 -95674 53060 231587 -31743 -94983 169064
18473 -22376 -41139 54577 6424 393841 -358756 267028 183516 147302 -275654 66665 182260
18462 182260 -196780 144663 39381 -79909 -162748 87765 -378538 -94438 -337665 -387888 -21324
18450 146725 -229950 21586 -254979 -20491 -90674 -65617 -41127 -181593 194099 80102 -230955
18438 -75966 379823 -120173 -247137 358973 -95051 -95332 -371045 -91457 59065 -193978 -83815
18426 -64632 16990 -20966 -255210 -112554 -108929 -179151 314998 43022 276310 42346 -26317
18414 98061 -190964 171264 -69555 175236 -16652 192874 -201763 78237 -6981 157951 -179918
18402 -108675 -62195 -226618 16552 -238341 -115501 -225711 -301287 -67594 -429294 350748
18391H6996A4434J86316d7587A1790J7627e0475J7537j5779B8673J82252c07045
18379a70417J1149A32058h9103A5401Q7424b06390g4085A40276J18279b10034
18368a85437c4870p2151A22198J43722O2326j53988A6972O3575b78777L0419a6963
18356b80279g9024B25089A05957N1387a74698a998A06662l8931i9836j07032G037
18344C70951h2578q0236h35n7079j2998j07068E06670a58672k8746D2442b00961
18332c09808A4976f0563C506f6475j6761A65032A4191d8417A1237K285a82645
18320a35873J1263C8463d41537C09606a42208P0634k15866C1665Q860d22009f4276
18308a56467I9848a15770G2946l2076a77583A37895h6736p6049r9797a974m53547
$$ plain form
18391 86996 14434 200750 -47587 11790 29417 -50475 -32938 -48717 28673 210925 -307045
18379 -170417 -159268 132058 -89103 15401 102825 -206390 -74085 140276 258555 -210034
18368 -185437 -34870 -107021 122198 265920 328246 174258 16972 80547 -278777 -248358 -16963
18356 -280279 -79024 225089 105957 157344 -174698 -1998 106662 67731 -99836 -206868 7037
18344 370951 -82578 -162814 -835 -57914 -70912 -177980 506670 -158672 -187418 42442 -200961
18332 -309808 14976 -60563 3506 -66475 -83236 165032 14191 -48417 11237 13522 -182645
18320 -135873 -124610 38463 -441537 309606 -142208 -71574 -287440 31665 40525 -422009 -64276
18308 -156467 99848 -115770 72946 40870 -177583 137895 -86736 -162785 -262582 -1974 -455521
18297d55521a52276A37341b12443B19490a15838a6620H9221a62135f2784C4488
18286A12977a12851B25627b86972q3837H3347J36344q7967B134d9907j38947A9951
18274a470A15625a40483C2109e00797a88181B5894a07236j10442d5206o3836c8239
18262a67468g6939L7945C4284L56833A29813i4193r3157Q7252C21092A50166i3455
18250A18185a53296B6982g8617j17992P0496j74642J43553P8423D6382M1513a02327
18238b38586A4481J3945b333k88507A04854c02959O9598K4480c5877B30612i3682
18226g3112D0047R9019b12730R1736b9987k02647E9711A0666a19973e7063J2081
18215d4982B2755a98049A66671c85964D1672b05198E2594K21343d6946B54067
$$ plain form
18297 -455521 -152276 137341 -212443 219490 -115838 -16620 89221 -162135 -62784 34488
18286 112977 -112851 225627 -286972 -370809 83347 219691 131724 2134 -49907 -188854 19951
18274 -1470 115625 -140483 32109 -500797 -188181 25894 -107236 -217678 -45206 -109042 -38239
18262 -167468 -76939 -38994 34284 391117 129813 -94193 -187350 -100098 321092 150166 -93455
18250 118185 -153296 26982 -78617 -196609 -126113 -300755 -157202 -78779 46382 87895 -102327
18238 -238586 14481 28426 -2333 -290840 104854 -302959 -233361 -208881 -35877 230612 -93682
18226 -73112 40047 139066 -212730 -120994 -29987 -232634 59711 10666 -119973 -57063 -44982
18215 -44982 22755 -198049 166671 -385964 41672 -205198 52594 273937 -46946 254067
18204H5243J11313a87772L8802H743R6527J40258c38182J53946D8416c18015F8647
18192F0634c2507j66788A9862N5900a77047l2724e2575r5530B7993J17543b8959
18180b65614p642a09589A26966N1737L6623a11086i521o1045E4839J82882a90293
18168A97641N4515J14784d82472A52470L9460a6217j99129A99485n1984M6426
18158A93927C9748J57948K01339c01810D9665i0351d3513I4557c2082E378R285
18147A4663b75477G7959P3711g0081A56050a69636P0131G2938h0217C7942d87488
18135c7833l57892a59336K6493A89120b2382j6089D3957D495b43279B72216I7151
18123a86518B24023e0039k65527I9927c85684q805A02947c70433Q2519J08895
$$ plain form
18204 85243 196556 -187772 -148970 8743 105270 245528 -338182 -184236 48416 -318015 68647
18192 60634 -32507 -199295 19862 75762 -177047 -209771 -52575 -148105 27993 145536 -28959
18180 -265614 -273256 -109589 126966 178703 215326 -111086 -9521 -70566 54839 237721 -190293
18168 197641 252156 366940 -482472 152470 191930 -16217 -215346 199485 147501 193927
18158 193927 39748 197696 399035 -301810 49665 -90351 -43513 94557 -32082 5378 14663
18147 14663 -275477 77959 151670 -70081 156050 -169636 -99505 72938 -80217 37942 -487488
18135 -37833 -395725 -159336 -132843 189120 -22382 -38471 43957 4495 -243279 272216 97151
18123 -186518 224023 -50039 -315566 99927 -385684 -394489 102947 -370433 -287914 -179019
18113a79019j20424g2550J9315H0093a31961L2091j79788d714o8228B6671b51366
18101a40707r5604h7379o756B42347G0978M5580b38050A36325n7100b8703j5262
18090d3965j23554J4206e4520j24849E5861k3615K93944a58254A26954L2629m1023
18079A18560b25869B3814O2712c69583g411k57627f3041h804j87240j43903J39045
18068b00902F876d25351a69189B01334c54980B18388a26091B85490e8115A36542
18057b94474R6575F298J48562a9718j29019j36470b5267A41541m2433o022o724
18046H6362i2675l05297a8966j6151H0244a02646E5239a36404N7787q3314B71471
18034C53266b1174q5367l09268g4845a2255o1867H9296j8491a12058A43766l4434
$$ plain form
18113 -179019 -299443 -72550 -53235 80093 -131961 -99870 -279658 -4714 -72942 26671 -251366
18101 -140707 -236311 -87379 -94135 242347 70978 116558 -238050 136325 79225 -28703 -43965
18090 -43965 -167519 -153313 -54520 -179369 55861 32246 326190 -158254 126954 159583 118560
18079 118560 -225869 23814 86526 -369583 -7411 -265038 -63041 -8804 -196044 -339947 -200902
18068 -200902 6876 -425351 -169189 201334 -354980 218388 -126091 285490 -58115 136542
18057 -294474 -197899 6298 154860 -19718 -148737 -285207 -25267 141541 99108 93086 86362
18046 86362 -92675 -397972 -18966 -35117 80244 -102646 55239 -136404 -78617 -161931 271471
18034 353266 -21174 -106541 -415809 -74845 -12255 -74122 89296 70805 -112058 143766 109332
18023A09332e6167A77081a93287G9671B6703h1517C0411N8043a53698n4907N5260
18012a53345q9481f6983A1095g3507k06713I7331a7531D5829N1775C0150J10059
18001A40209a20701k7817B84624b52588a4208B43741b25312c6961B77025j18369
17991A58656b5012j03787k2476a207C5234f5618E3407d10859a58395A57434a41014
17979a68926O9936D3793N7939a82798l3326h4106j91561f6142c2949G8872J19523
17968A98395H0237J49854A13974j9869M127k4605a06983A25077R2932d08707A35119
17956B29224g0372N999j0097J4890q6548B84208a09282n8219A54166j2686b00868
17944e6039B02030E8918P4165b96409J35605d5546o1137c2526E0691L5228K5666
$$ plain form
18023 109332 -56167 177081 -193287 79671 26703 -81517 30411 88454 -153698 -208605 -153345
18012 -153345 -242826 -66983 11095 -73507 -280220 97331 -17531 45829 97604 30150 140209
18001 140209 -120701 -148518 284624 -252588 -14208 243741 -225312 -36961 277025 158656
17991 158656 -25012 -128799 -151275 -1207 35234 -65618 53407 -410859 -158395 157434 -141014
17979 -168926 -98990 43793 101732 -182798 -216124 -84106 -275667 -66142 -32949 78872 198395
17968 198395 80237 230091 113974 94105 98232 73627 -106983 125077 218009 -408707 135119
17956 229224 -70372 -64373 -74470 -59580 -146128 284208 -109282 -167501 154166 141480 -200868
17944 -56039 202030 58918 133083 -296409 -160804 -45546 -106683 -32526 50691 85919 111585
17933A11585b50612A93078b04685D3507c01923A21404g1541E0596c04914j37917
17923d42831A61065a19640I2181J36443a60562M8847A69726h9776d3533C3958
17912A41762a74214O0337e2084j00301A09903A2067d6496C8491a89694D09395
17901g6288c6355H0441b56849A25343P0411c69898H4292B4821a1212A0688h3692
17889a30944M4334H2771m0348e7445b6983A2522O3381A9228b42841Q4067j10188
17878b68962Q3731A73779h2208A56810a31932d4008A42322o8244J69239a15125
17867B96227A8376K5006g2055B8368B603i032A8950a18491K2852b2699F2813N6219
17855A19032J66106c01188d3319l99631C8029M4858j1085a4721j34493c4830j84024
$$ plain form
17933 111585 -250612 193078 -204685 43507 -301923 121404 -71541 50596 -304914 -442831
17923 -442831 161065 -119640 92181 228624 -160562 -111715 169726 -89776 -43533 33958
17912 141762 -174214 -113877 -52084 -152385 109903 12067 -46496 38491 -189694 409395
17901 -76288 -36355 80441 -256849 125343 195754 -369898 84292 24821 -11212 10688 -83692
17889 -130944 -86610 82771 42423 -57445 -26983 12522 75903 19228 -242841 -158774 -268962
17878 -268962 -185231 173779 -82208 156810 -131932 -44008 142322 74078 243317 -115125
17867 296227 18376 43382 -72055 28368 2603 -9032 18950 -118491 -95639 -22699 62813 119032
17855 119032 285138 -301188 -43319 -442950 38029 82887 71802 -14721 -149214 -34830 -218854
17844b18854f4096a9330D319L70466c39205G5577f4989B0622a17655I2883D397
17832B16530d39124f9814c2833o3604A10824d03104G8882a77616L8129m4149h1990
17820a74614A2056J48121K150a8214k1801l01B08940o5360R9874a3627C9269L9088
17808G8357R714P334j97J31168r3427a71323g8933c1678D731c15403c540C55554
17795c2618C78793j45660b9967k23884m5470P4177C6850Q0216b31679A17999a09022
17783a89574j2092q4193A17567l0011a72366L9511j34245g0395l7324c4066j34173
17772a68239A14058P8838A6103P0887j441C7727N6023j578a89774Q6031M1925
17761f1818C9401r999L2406O9083C8804h1971K8100A05258M1090J50165A37363
$$ plain form
17844 -218854 -64096 -19330 4319 374785 -339205 75577 -64989 20622 -117655 92883 4397
17832 216530 -439124 -69814 -32833 -96437 110824 -403104 78882 -177616 -139487 -183636 -81990
17820 -174614 12056 160177 162327 -18214 -40015 -40316 208940 143580 243454 -13627 39269 78357
17808 78357 88071 95405 95208 226376 132949 -171323 -78933 -31678 4731 -315403 -3540 355554
17795 -32618 378793 233133 -29967 -253851 -299321 -225144 36850 117066 -231679 117999 -109022
17783 -189574 -201666 -285859 117567 87556 -172366 -132855 -267100 -70395 -107719 -34066 -168239
17772 -168239 114058 192896 16103 86990 85549 37727 93750 92172 -189774 -103743 -61818
17761 -61818 39401 29402 61808 130891 38804 -81971 -53871 105258 146348 296513 137363
17749a05899m293E1728J01119k4420J55827a85183a615n9313A26523L90179g7728
17737D6770a02334c3548j9955j26292I702O615Q8100C3760a28248c3210D775b46482
17724c2134B16623b24346e8794j0174l5565I7158b06851O9140j37083B98601f5569
17712C59013j9580i087I1775P3483A2965a7679l5572H4273a70641A74770L2801
17701B07571b17259c9537m4155D64084B192d6588n3004l45294A07629D8439K00476
17690B48915E4834a78987d0677o8273L3481A11877E4224b14806B24541b95603
17679B54822c40687A2646a6671j23756A79576a20096C4590J1009a76828F2354
17668b30237j44649B12015M8238b36177c6290k17989i0412A90735B1606K10118
$$ plain form
17749 -105899 -110192 51728 152847 128427 284254 -185183 -1615 -60928 126523 516702 -77728
17737 46770 -102334 -33548 -53503 -179795 9702 16317 104417 33760 -128248 -33210 4775 -246482
17724 -32134 216623 -224346 -58794 -68968 -104533 97158 -206851 -137711 -274794 298601 -65569
17712 359013 339433 -9087 91775 165258 12965 -17679 -53251 84273 -170641 174770 207571
17701 207571 -217259 -39537 -83692 464084 2192 -46588 -99592 -444886 107629 48439 248915
17690 248915 54834 -178987 -40677 -108950 -75469 111877 54224 -214806 224541 -295603
17679 254822 -340687 12646 -16671 -140427 179576 -120096 34590 45599 -176828 62354
17668 -230237 -374886 212015 260253 -236177 -36290 -254279 -90412 190735 21606 231724
17658B31724b8866J57j40884A97080I4884j7804L9843O3185a05857A55495a81939
17646a08804m1679k37580A76671i1298B29104r0526A3442a27063A15190a27774
17635C60074A322J74345Q9051a1386j99191A40822K19592g44B84670k3869i3148
17623A7580d06030A16328n0680b58849B00712J49613a07415H3674l1736P556c686
17611H3220b27090a739n5870k02439C76435H0038P7946l1543J03899I1170B4367
17599B38393F2173a80482I477b94697A52899c53772c7560B05464a73145d4128
17588B41824a56977C87544e6221E2757b25703C3648a48652b7567l4996H0895b7784
17576C9601b68059a24205G502c7867j38868A16287R6298B3436a10349k7211c1226
$$ plain form
17658 231724 -28866 -28709 -169593 197080 94884 77080 116923 180108 -105857 155495 -181939
17646 -108804 -150483 -388063 176671 -91298 229104 138578 13442 -127063 115190 -127774
17635 360074 1322 175667 264718 -11386 -210577 140822 360414 -744 284670 260801 -93148
17623 17580 -406030 116328 65648 -258849 200712 350325 -107415 83674 51938 59494 -3686
17611 83220 -227090 -1739 -57609 -260048 376435 80038 157984 126441 230340 91170 24367
17599 238393 62173 -180482 9477 -294697 152899 -353772 -37560 205464 -173145 -44128
17588 241824 -156977 387544 -56221 52757 -225703 33648 -148652 -27567 -62563 80895 -27784
17576 39601 -268059 -124205 7502 -37867 -176735 116287 212585 23436 -110349 -137560 -31226
17564b4113G2100i8141B63442m7395j03114N7056c73168A10654M448a18745q7524
17553b06269a3327k00307B21385C0043g146A4196a64949a6570C25327c1968B1096
17541i5296J0933C3268P4077M1304k9253j2160J12478b6737D25068G8942J28847
17530B07789H342J27720k7163c40526e4536B02227n9505j1819n0283M4287b30689
17518b84393a10120j82518b1915C64886A08937Q5847n288J49619C8522j2670K0899
17507D6751b87459F6642J66033e4456j68583f8885G4669L80310A08598b01953
17496C14263C9344J79638a96531C96769j72794b10668A64366o8048A9393L96386
17486D15779A14445K38070a68383A11417J03028Q610l2822G4430J94468C2704
$$ plain form
17564 -24113 72100 -98141 263442 216047 112933 169989 -373168 110654 115102 -118745 -206269
17553 -206269 -13327 -213634 221385 30043 -7146 14196 -164949 -16570 325327 -31968 21096
17541 -95296 -84363 33268 107345 148649 119396 107236 219714 -26737 425068 78942 207789
17530 207789 8342 136062 108899 -340526 -54536 202227 142722 130903 80620 124907 -230689
17518 -284393 -110120 -292638 -21915 364886 108937 194784 189496 339115 38522 25852 46751
17507 46751 -287459 66642 232675 -54456 -223039 -68885 74669 454979 108598 -201953
17496 314263 39344 218982 -196531 396769 223975 -210668 164366 96318 19393 415779
17486 415779 114445 352515 -168383 111417 214445 223055 190233 74430 268898 32704
17475d7236B78319d7965B28016A1198N28139g0642a5361j33269j7114A66910K50730
17464D17640A60578B5963a12398D7432a62156C15941m6081q3265e213D4017M1737
17453H5754J94803j1370K24803c0970B09492K89051A59393L35036a7370j5645
17443c3015j67046C45066a49300A68654h814j98429B9958p432L96541A35549L86365
17432E21914A34747K99612A25169Q2655a4606C66064B1049L81226C0330J95502
17422B25832l9027J58304A69478j3513K23725m5702J84744A44522N1813J97773
17412C94108A5356Q095J24514K05646A16119m9075J48223J6915h5927B1920a9081
17400c71683D22316f4626A08448d8882A61624J71105E7634J12437Q7977a03135
$$ plain form
17475 -47236 278319 -47965 228016 11198 539337 -70642 -15361 -148630 -165744 166910 417640
17464 417640 160578 25963 -112398 47432 -162156 315941 269860 186595 -5213 44017 85754
17453 85754 280557 269187 493990 -30970 209492 498543 159393 494429 -17370 -33015
17443 -33015 -200061 345066 -149300 168654 -8814 -207243 29958 22526 419067 135549 521914
17432 521914 134747 434359 125169 207824 -14606 366064 21049 402275 30330 225832
17422 225832 186805 345109 169478 155965 379690 333988 518732 144522 196335 394108
17412 394108 15356 23451 147965 353611 116119 67044 215267 232182 -85927 21920 -19081
17400 -371683 422316 -64626 108448 -48882 161624 332729 57634 170071 258048 -103135
17389E6229J64414R8673r6391H2810L1767a66165C68605A30293N686f2648A34385
17377A03680Q8697K05854A64074M3823O2745a73021B32545r3643J19406D1362
17366A3983i2476D6865J22784K0921n3477j7315l1072J64083f027B63694l0529
17355B33165a68341B72826E2779a13237B72545j00629L02580A94087B8501P2764
17345A01265b6301C89916j80717L13265O4436b41619h6709k21046B76589j5315
17335B61274r9242C5177J31635J47814a39422d5222A16511K01179A02839k9246
17325G3593L8312A6992f5637F8863a13458A41038n163J87892j11676P447p3613
17314A45925K17012d600n0729A67856K31045A91963J0029a64520F5243b04671
$$ plain form
17389 56229 220643 319316 222925 82810 114577 -166165 368605 130293 135979 -62648 134385
17377 103680 192377 398231 164074 207897 270642 -173021 232545 138902 258308 41362
17366 13983 -92476 46865 169649 190570 137093 119778 88706 252789 -6027 263694 233165
17355 233165 -168341 272826 52779 -113237 272545 171916 474496 194087 28501 101265
17345 101265 -26301 389916 209199 522464 586900 -241619 -86709 -307755 276589 261274
17335 261274 162032 35177 166812 314626 -139422 -45222 116511 317690 102839 73593
17325 73593 111905 16992 -65637 68863 -113458 141038 135875 323767 212091 219538 145925
17314 145925 362937 -4600 -55329 167856 398901 191963 201992 -164520 65243 -204671
17303B40788q6218h8301c8746A90996J43915o9539b9299B61410j12560F8295e4816
17291I2616K38794o6764j07397Q0376G2748J53052j3426F0611J67226e3468k28449
17280b81917c0316A39928J19262q0859J7280N2171m379p2361G4084K49796F7066
17268A72739a47394N680B70385f6442H8536a20194F7241e3435B08363P5724H0093
17256B02891K3512b6989B85620A18041b21560A68750F7241J31932J24073o5137
17246B58109K33087A30376D6518J00139J17966K7090r5416I4443K49490j0336
17236C33597A61465K16273m3309H6625a57858b7709I7940Q8791F8070c6879A55502
17224F6350J184F926M94280B05066J13736j18276H8385J88415a5952C13817Q9062
$$ plain form
17303 240788 154570 -88301 -38746 190996 334911 265372 -29299 261410 148850 68295 -54816
17291 92616 331410 264646 157249 237625 72748 225800 212374 60611 227837 -53468 -281917
17280 -281917 -30316 139928 259190 178331 195611 247782 243403 171042 74084 323880 67066
17268 172739 -147394 -141714 270385 -66442 88536 -120194 67241 -53435 208363 284087 80093
17256 202891 226403 -26989 285620 118041 -221560 168750 67241 199173 323246 258109
17246 258109 491196 130376 46518 146657 264623 291713 196297 94443 343933 333597
17236 333597 161465 377738 334429 86625 -157858 -27709 97940 186731 68070 -36879 155502
17224 66350 67534 6926 501206 205066 318802 200526 88385 276800 -15952 313817 402879
17213D02879j54183A7409J92824K68397j12490H8290a14849M8346A60314D6875
17202B26294J72981q7622M544d0280D82189a29362H3464K16962A25263L23679
17192D48942A76113j5856o8888R4026L6871H7200L82688i5655C24589d1465D04878
17180A1080P2454K09667I5017I135M95930j00682j31071F3648A2395R6000J47693
17169B56088c9519B09132m0411K21454j6876J55186B19990j0349k3113J97382
17159C83910n9331G4833J52947o6467p7426K82428O0532A00209K58873G6553M06399
17148D82952j42103q9172A12922L53197j41889p3570R4222R5521A76522J66792
17138C43314A21168B0006Q4257L17621j24557K1897l2222n7687J17840L4345i7086
$$ plain form
17213 402879 248696 17409 210233 478630 366140 88290 -114849 -66503 160314 46875
17202 226294 399275 311653 316197 -40280 482189 -129362 83464 300426 125263 448942
17192 448942 176113 160257 91369 185395 222266 87200 469888 -95655 324589 -41465 404878
17180 11080 83534 293201 95017 9135 505065 404383 273312 63648 12395 108395 256088
17169 256088 -39519 209132 168721 390175 373299 528485 219990 209641 186528 383910
17159 383910 324579 74833 227780 161313 83887 366315 426847 100209 359082 76553 482952
17148 482952 340849 251677 112922 466119 324230 250660 344882 440403 176522 343314
17138 343314 121168 20006 104263 421884 297327 319224 287002 229315 347155 381500 -97086
17126A68730J16730j4563j7591R3442j06340L7709P9873p7815d2732D33088F6123
17114D04287l8578N0875k06432K01239p2023N0112r4818J95406j23219r4456A15330
17102D30884p1852J39161p6039a7389C60594R7226k2128A73349K21047j72015
17092B22381J40505A06385a06400D73159p8098K62558B35524p8860K08862r1968
17082B73558R5560K8831l7042M6805j98182J0346M19150m1493B68585R2660r0878
17071B70367R7316j8275J52144Q6304B91339J2653O1668J37562k41467J96581
17061D58336A85782K18027O3159j40057K79380B13087J92588j37298M48844k12203
17051E05018k22086J22173M6224J98111k67891Q4979A58310L05096J50558k68282
$$ plain form
17126 168730 285460 270897 253306 346748 240408 278117 357990 280175 -42732 433088 66123
17114 404287 365709 416584 210152 411391 339368 389480 294662 490068 366849 272393 115330
17102 430884 359032 498193 422154 -17389 360594 457820 435692 173349 394396 222381
17092 222381 362886 106385 -106400 473159 395061 657619 235524 156664 365526 273558
17082 273558 369118 397949 360907 407712 209530 219876 639026 597533 268585 361245 270367
17071 270367 367683 349408 501552 587856 291339 303992 365660 503222 261755 458336
17061 458336 185782 403809 466968 326911 606291 213087 405675 268377 717221 505018
17051 505018 282932 405105 451329 649440 381549 466528 158310 463406 613964 345682
17041C45682M793r268N06279B97068L16431k38330K19168j99653J64951q8376
17031D71259j05168R4918J52311j24228p5382J06918A30588L27361k0035Q67J64598
17020F03379k22695Q3369Q2786j85275J26953K29774l12434J13705K08547k04187
17010E23922K51498j81896K39367l60083j4970J6142q3307J2493N86317C05281
16999G57396l7964N5202n2306J16156J12112l39629p0664Q6299J77761J94701
16989I99064p4624o6006j18431l9825m6990K52220C80735L46082N8762j75211
16979F10368k8112L38368j86356j28786j53362J22898N51190l63093J65415J04460
16969A032990j94214J258l65514L11608l00359P9485Q7577j65666L05739q4888
$$ plain form
17041 345682 350475 341207 847486 297068 613499 375169 594337 394684 559635 471259
17031 471259 366091 461009 613320 489092 413710 520628 130588 457949 437914 438781 603379
17020 603379 380684 464053 546839 361564 488517 718291 405857 519562 728109 523922
17010 523922 775420 593524 832891 472808 457838 473980 390673 403166 989483 305281
16999 757396 719432 774634 722328 838484 950596 610967 540303 626602 804363 999064
16989 999064 924440 858434 740003 700178 653188 905408 380735 726817 785579 610368
16979 610368 582256 920624 734268 605482 452120 575018 1126208 763115 928530 1032990
16969 1032990 838776 840034 474520 786128 485769 565254 652831 487165 792904 708016
16959G08016K84436k20134J7001J27792j4836J56907j09209l8201j57455J34901
16949H89218l11123L28361j61971N3333l87881R02311E76001O09382k17930j99704
16939G67749J99362K48243p3955j082J88885j78598l5434j24773L03388j4962
16929A278823j6024j61951Q0996j65506K02244J80298j39603J2580K19568n39994
16919I51431K84265R7599J04595m1875j37263K6556J66858j00595N27146n17068
16909A361649j05163j5129K59003p9703L71077n11991J05645j84460J86442Q3873
16899A471243j08148J81037J49192p9404n4995L3025R5947n27614M83876K2683
16889A666842J43j88272M12787j07520K6204j86492j88563M25056j57358J08206
$$ plain form
16959 708016 992452 772318 789319 917111 902275 1059182 949973 911772 754317 889218
16949 889218 578095 906456 744485 797818 409937 1312248 576001 1185383 967453 767749
16939 767749 967111 1215354 1141399 1140317 1329202 1150604 1115170 990397 1293785 1278823
16929 1278823 1262799 1100848 1181844 1016338 1218582 1398880 1259277 1271857 1491425 951431
16919 951431 1235696 1333295 1437890 1396015 1258752 1285308 1452166 1351571 1878717 1361649
16909 1361649 1256486 1241357 1500360 1420657 1791734 1279743 1385388 1200928 1387370 1471243
16899 1471243 1363095 1544132 1693324 1613920 1558925 1591950 1687897 1160283 1644159 1666842
16889 1666842 1666985 1478713 1891500 1783980 1810184 1623692 1435129 1860185 1702827 1811033
16879A811033M7297k91329M04933m11174M08151K95991m23444L30684R8074n38620
16869A731596L03124j69727K41054j84515M35168l26885J21606L55872L0239r1927
16859B445605o5745J08153j81287J21822L69970j1295k98730Q1616r9877J62270
16849B632502R769L09842O0139r3682M9623J27909l0674k61866L05297J53856
16839C262715J66894Q272j86256K08670L03668L1329k71075J20838j68M45172
16829D090059k14481N3207k33644J83211M36104j15361j18931L30316J10492k39221
16819D281751M10374k7862L38503j29974J78620O2022p7387K99798o1583Q3865
16809E358127N8124O94054k74093L52818r2963J9988K91657J3758P16627l98913
$$ plain form
16879 1811033 1858330 1567001 1971934 1560760 1968911 2264902 1841458 2172142 2270216 1731596
16869 1731596 2034720 1864993 2106047 1921532 2356700 2029815 2151421 2507293 2537532 2445605
16859 2445605 2379860 2488013 2306726 2428548 2798518 2787223 2488493 2570109 2470232 2632502
16849 2632502 2642271 2952113 3012252 2918570 2968193 3096102 3065428 2803562 3108859 3262715
16839 3262715 3429609 3437881 3251625 3460295 3763963 3795292 3524217 3645055 3644887 4090059
16829 4090059 3875578 3928785 3695141 3878352 4314456 4199095 4080164 4410480 4520972 4281751
16819 4281751 4692125 4664263 5002766 4872792 5051412 5113434 5036047 5335845 5274262 5358127
16809 5358127 5416251 6110305 5836212 6189030 6096067 6116055 6407712 6421470 7138097 6739184
16799F739184K891O32627J19906J03185J50840K75566k99055L58680K66892O3202
16789H413918M71662K59709L66342J61081J28756J22865N36842m6982N92565J29156
16779A1135914Q87698L5057J07252N58366J92109N38415M53091N41304O65654
16770A5114860M93873M36837Q10742K02259Q43457P43812M96921R63033L30097
16761B0435891R03745J029410J125205L46631J421415J208621J169146J039387
16753B8679451J340595J679372J241545J494033K013889J700243J948650J980878
16745D2078656K675328K443523K834870K719843L196518L105389M006476L514901
16737F6575504M236274M866839M714609N590859N551720N896493O643409P460639
$$ plain form
16799 6739184 6742075 7374702 7494608 7597793 7748633 8024199 7725144 8083824 8350716 8413918
16789 8413918 8885580 9145289 9511631 9672712 9801468 9924333 10461175 10414193 11006758 11135914
16779 11135914 12023612 12058669 12165921 12724287 12916396 13454811 13907902 14449206 15114860
16770 15114860 15608733 16045570 16856312 17058571 17902028 18645840 19142761 20105794 20435891
16761 20435891 21339636 22369046 23494251 23840882 25262297 26470918 27640064 28679451
16753 28679451 30020046 31699418 32940963 34434996 36448885 38149128 40097778 42078656
16745 42078656 44753984 47197507 50032377 52752220 55948738 59054127 63060603 66575504
16737 66575504 70811778 75678617 80393226 85984085 91535805 97432298 104075707 111536346
16729A11536346O972586Q100905Q131170Q379905Q562765Q816810Q421128Q113007
16721A77034622P303894O693061N404845M088205K469827J201736o70167k395180
16713B01130843l964829n325055o443693p338092q256613q399725q723521q986525
16705A43692790q722806q292206q323292p467307p486176o825521o150537o280931
16697H4144014n070886m796592n024245l977845m224324l839600l151873l294525
16689E0764124k857111k551633k360785k705422k038154j662235k084303j886821
16681C2617660j448658j537718j351292j714201q47948j031305j309601j067845
16673B2309092j007190j047642j31596j191256m71920q50262p41278p63854o12041
$$ plain form
16729 111536346 118508932 126609837 134741007 143120912 151683677 160500487 168921615 177034622
16721 177034622 184338516 191031577 196436422 200524627 202994454 204196190 203526023 201130843
16713 201130843 197166014 191840959 185397266 178059174 169802561 161402836 152679315 143692790
16705 143692790 134969984 126677778 118354486 110887179 103401003 96575482 90424945 84144014
16697 84144014 79073128 74276536 69252291 65274446 61050122 57210522 54058649 50764124
16689 50764124 47907013 45355380 42994595 40289173 38251019 36588784 34504481 32617660
16681 32617660 31169002 29631284 28279992 26565791 25717843 24686538 23376937 22309092
16673 22309092 21301902 20254260 20122664 18931408 18459488 17609226 16867948 16104094 15492053
16664A5492053k92134q33723l87467p12873k89696m85521m87848n06365k35458
16655A1260968m42477k07409m90218j93878k04546o87234k87453J64657m57890
16646H454520m05079N7119n04469j6447j43521l7127n69145n5035j28272k21882
16636F430662J1254J52839o46082l03404K56115l54485j67151N7288j59272k5205
16626E252559k23336K03484o65447J75809n9790j54954l72213J36353l6567J12065
16616D367963k53339n71850J83945j72469O0623K17268j08289j17303j51608j58841
16606C296100k74432J54673K62302o09141N38547o69407K72944P0063l57430P2272
16596B756491l57804K55244l82838L89017o4543j03808j82162l03747Q15248o20987
$$ plain form
16664 15492053 15199919 14366196 13978729 13265856 12976160 12490639 12002791 11496426 11260968
16655 11260968 10818491 10611082 10120864 9926986 9722440 9035206 8747753 8912410 8454520
16646 8454520 8049441 8106560 7602091 7585644 7442123 7404996 6835851 6780816 6652544 6430662
16636 6430662 6441916 6594755 5948673 5645269 5901384 5546899 5379748 5437036 5277764 5252559
16626 5252559 5029223 5232707 4567260 4743069 4683279 4528325 4156112 4292465 4255898 4367963
16616 4367963 4114624 3542774 3726719 3554250 3614873 3832141 3723852 3606549 3454941 3296100
16606 3296100 3021668 3176341 3438643 2829502 3368049 2698642 2971586 3041649 2684219 2756491
16596 2756491 2398687 2653931 2271093 2660110 2595567 2491759 2309597 2005850 2821098 2200111
16586B200111o9313j85621K04600m5001j01741J39891q0428j40093J92727j27825
16576A987307J68693l20769L26810m86353K03798j06721K49574m42834J70082
16567A749587j30366J33909L95376o28838M4670J08137p3149k09289K42405j30269
16557A502173k40634q3068K89441l72999K82417j07984m12206M07623J21496K00674
16547A586933m41163l72190M21268n813J5019J04604J60561r0115k74597p7618
16537A026889K63918k77026m1855K05517J64022n51011J51752k37641K63611K26330
16527A194506L2643j24711n9357k83553J49131j36629N8064l3152P7573o8830
16517H05685N7635K53514k74964l8562J63797L9062k0978m28751J19251r0209
$$ plain form
16586 2200111 2130798 1945177 2149777 2104776 2003035 2142926 2062498 1922405 2115132 1987307
16576 1987307 2156000 1835231 2162041 1675688 1879486 1772765 2022339 1579505 1749587
16567 1749587 1619221 1753130 2148506 1519668 1564338 1672475 1599326 1390037 1632442 1502173
16557 1502173 1261539 1178471 1467912 1094913 1377330 1269346 857140 1264763 1386259 1586933
16547 1586933 1145770 773580 1194848 1189035 1204054 1308658 1469219 1379104 1104507 1026889
16537 1026889 1290807 1013781 971926 1177443 1341465 790454 942206 704565 968176 1194506
16527 1194506 1227149 1102438 1043081 759528 908659 772030 830094 796942 874515 805685
16517 805685 863320 1116834 841870 803308 967105 1006167 985189 556438 675689 585480
16507E85480K44107m1960J29897j54078q0340k8199j38175J84416L11611k48024
16497G64735J08919L8097o2876m1790k06873j52181K45190J16085k19659J46925
16487G36572k63949j04718L50331m2634M9864k37390l85L52959J02277l81480
16477E61447O8263K86730Q5643D96017P7142B83051M93495j28089B80993p0052
16467B10941j6038L30439K30101l48262Q1159j31179j71545L19617N4914P7555
16457F37702j82918j63148K58389r4875L8451J46696A37287K09836J61404j50844
16447C57683K48070k15425j06789R980K29917o792J8319q994H2143K38872j10087
16436B10928K05768A76248K96655J57721k04850L07496K6255j27482C01811j34687
$$ plain form
16507 585480 829587 787627 917524 763446 683106 654907 516732 701148 1012759 764735
16497 764735 873654 911751 848875 807085 600212 448031 693221 809306 589647 736572
16487 736572 472623 367905 718236 675602 725466 488076 487691 840650 942927 561447
16477 561447 629710 916440 1002083 496017 573159 283051 776546 648457 280993 210941
16467 210941 194903 525342 755443 407181 488340 357161 185616 505233 560147 637702
16457 637702 454784 291636 550025 455150 493601 640297 137287 347123 508527 357683
16447 357683 605753 390328 283539 293519 523436 516644 534963 525969 82143 321015 210928
16436 210928 416696 176248 472903 630624 425774 733270 759525 632043 301811 167124
16426A67124O481K36593j72817N2541J54316A94273O4821D4293J59433J29700
16416C33426J89179E6193K84684L9979j15646q4756M11799B60208K28665a27341
16405C08569J04072q2989j32202D4193L85342j30842J36579j1464A60653K12471
16395C73124D0263L35867r3166C1737M28785k24653q2481K32160j43963J26633
16385C68218R5065B5297L53927j00212j14850K53994J3833P4004l7414A18807
16374H4247a15695F5525c48476e5251C55728j56258J32071A54195K02790p8553
16364B78432H4981A0994K02927E9966K67719n0291H9340K50314G983M88826B35233
16352C28254c061A19748L61383a77797C39584h6133A43663l9338a59281A36199
$$ plain form
16426 167124 173605 410198 237381 289922 444238 194273 259094 44293 203726 333426
16416 333426 522605 56193 340877 380856 265210 180454 592253 260208 488873 -127341
16405 308569 412641 329652 197450 44193 429535 298693 435272 423808 160653 373124
16395 373124 40263 376130 282964 31737 460522 235869 153388 385548 241585 368218
16385 368218 463283 25297 379224 279012 164162 418156 431989 505993 468579 118807
16374 84247 -115695 65525 -348476 -55251 355728 199470 331541 154195 356985 278432
16364 278432 84981 10994 213921 59966 327685 277394 89340 339654 7983 496809 235233
16352 328254 -3061 119748 481131 -177797 339584 -86133 143663 104325 -159281 136199
16341a09876A23982j5178B9105J4408f7765C15807j42846a03049A10926j3806
16331I7120O3116K01183A2061J23483N8118J49635I0080A0216a7062B68786A25093
16319C32422K0074a30838I7717N7658P1003j6716a37250A48235K00294I9219J72730
16308B71949r9968q5672a4821m61158i3552A72981n9218b7746B48188K01237G4140
16296B36168j09272J96012b43005A54457N1479Q4226f858q5244b0278A00029B1161
16284A0555O1507J25953E7620b17907b3317C37969p0259j25360d756A53042I097
16272a51057A38623M4030R8268A01516b42582A03141J5317L9795G336J31463a5113
16260A12069D5531J27073b20553A24642l2915N7229a2980A90281A1965a42824
$$ plain form
16341 -109876 123982 108804 29105 43513 -67765 315807 172961 -103049 110926 97120
16331 97120 160236 361419 12061 135544 193662 343297 90080 10216 -17062 268786 125093
16319 332422 352496 -130838 97717 155375 226378 209662 -137250 148235 348529 99219 271949
16308 271949 171981 86309 -14821 -475979 -93552 172981 113763 -27746 248188 449425 74140
16296 236168 126896 322908 -243005 154457 205936 290162 -6858 -92102 -20278 100029 21161
16284 10555 72062 198015 57620 -217907 -23317 337969 267710 142350 -4756 153042 9097
16272 -151057 138623 182653 280921 101516 -242582 103141 118458 158253 7336 138799 -15113
16260 112069 45531 172604 -220553 124642 91727 148956 -12980 190281 11965 -142824
16249e7735H1692j1778J41970d359D6475K27237a2699j98670B3149J50210e1960
16237i7773B04393E2801e8205C7143L23403a0284B11554c10509D01492A77197
16226B89085c7911E6465a86687B76209a77877m694a2760j5128C6340M576a05441
16214C99664E3211f58131i9416M6693A8508J09096l3923B3550g00A56776J32921
16203B89697b29705Q2457e9298O288m9534A74056A3102K96830j03927C9935a41744
16191a13611m0235d3531a7310e516j80797d9925m1429E4363j5593c4459A59201
16179c0505k81354C48143B7145L95307i1666J413p1489H0927J01098b810E798
16167H3946i1072B11022H9479d9951B61387A09858J92321f1126a9362j89134j30643
$$ plain form
16249 -57735 81692 69914 211884 -4359 46475 273712 -12699 -211369 23149 173359 -51960
16237 -97773 204393 52801 -58205 37143 360546 -10284 211554 -310509 401492 177197
16226 289085 -37911 56465 -186687 276209 -177877 -182571 -12760 -27888 36340 40916 -105441
16214 399664 53211 -658131 -99416 -52723 18508 127604 93681 23550 -700 156776 289697
16203 289697 -229705 -147248 -59298 -53010 -102544 174056 13102 309932 206005 39935 -141744
16191 -113611 -153846 -43531 -17310 -5516 -186313 -49925 -91354 54363 38770 -34459 159201
16179 -30505 -311859 348143 27145 422452 -91666 -90253 -161742 80927 182025 -2810 5798
16167 83946 -91072 211022 89479 -49951 261387 109858 302179 -61126 -19362 -208496 -339139
16156c39139a62446G4995j2593d4684A82782Q8837G5914a9555j86154F0732a63840
16144G1938J40228C7842a03330k2030a2762A89541c20358A58341B425Q3353r877
16133G5901A2987K91247b7895k54618a2478k63515C52622r6764b611q994A16532
16121A22457h4816j14235J9496r8796f5117o5384A08367J44043d4300B03352b50459
16109a32675A64272K0249n6292m4330a50682B2697J44117g284A4268N387J57950
16098A77605i321k7658k09643J16868D20774A889J74065a85000e6876a3949l02512
16087c16461B79493E5834e6058D6424f1918k7060k94268a73389A53982a18379
16076b72113Q1199A0076K9893J37441l7736a21063A38003E0933e0954j57624e5407
$$ plain form
16156 -339139 -162446 74995 62402 -44684 182782 271619 75914 -19555 -205709 60732 -163840
16144 71938 212166 37842 -103330 -125360 -12762 189541 -320358 158341 2425 85778 75901
16133 75901 12987 304234 -27895 -282513 -12478 -275993 352622 255858 -2611 -11605 116532
16121 122457 -84816 -199051 -179555 -278351 -65117 -130501 108367 252410 -44300 203352 -250459
16109 -132675 164272 184521 128229 83899 -150682 22697 166814 -7284 14268 19655 177605
16098 177605 -9321 -36979 -246622 -129754 420774 1889 175954 -185000 -56876 -13949 -316461
16087 -316461 279493 55834 -56058 46424 -61918 -88978 -383246 -173389 153982 -118379
16076 -272113 -190914 10076 39969 177410 139674 -121063 138003 50933 -50954 -208578 -55407
16064b43977e250C76881b373j1402l08776g2363k74227A30219e732q3348c0450
16052b68895q0721a56791f2919b4307D5471Q4761E0066d771j36657D2918A8219
16040b45302A27469a56164B2936J30127c42940i0383q5639D5608g3513a0117A97714
16028C474a2097j85952B37277I4163b13803e8409N053k995A5435a2224k08677
16017b20901P5101n6402A29378H830f78k52878C34767h6119F5883a57546k16438
16006c73984A58697a9602A8379b24470m4700A25546a82929c6745q5866E7739f8046
15994C8636j2741b65217E4206b19387i211H3541P88a65112g2930L6390A39869
15982B3877M23735j44665K29042j23034I5787A9863f5686q4956e0578k20368B30769
$$ plain form
16064 -243977 -5250 376881 -2373 -13775 -322551 -72363 -346590 130219 -5732 -89080 -30450
16052 -268895 -349616 -156791 -62919 -24307 45471 130232 50066 -4771 -141428 42918 18219
16040 -245302 127469 -156164 22936 153063 -342940 -90383 -176022 45608 -73513 -10117 197714
16028 3474 -12097 -198049 237277 94163 -213803 -58409 -53356 -56351 15435 -12224 -220901
16017 -220901 -145800 -202202 129378 8830 -678 -253556 334767 -86119 65883 -157546 -373984
16006 -373984 158697 -19602 18379 -224470 -269170 125546 -182929 -36745 -122611 57739 -68046
15994 38636 25895 -265217 54206 -219387 -9211 83541 84329 -165112 -72930 -36540 139869
15982 23877 447612 302947 531989 408955 95787 19863 -65686 -150642 -50578 -270946 230769
15970a21678k0155j34809A6880b6283E2459F811c99576A49436h257A6943J16186
15959A33129e687E4497J27584a17090D7725g7671N924A30579d8157B89152b38791
15947a34895K8010A43841c4196B4366J25939c64710A11741J3333J02359H9098
15936A01096b7226p5866n088p5717g3908B823J49855o9783J00319a26338I1329
15924a0599q1389l00324B1324a56451k2750G9243a00149j01344O7238E7167e8930
15912h4344K5179j67101A25330Q3584a25989D3085A9690L48749c46751c9089j99672
15901b38761f5734A51813b6126k1162j93256B07466f18882a73257h2504K614A61567
15889c17944b1618G9242C0095J514Q4594K17685A48606d7726n222j20258H7340
$$ plain form
15970 -121678 -141833 -276642 16880 -26283 52459 6811 -399576 149436 -8257 16943 133129
15959 133129 -5687 54497 182081 -117090 47725 -77671 -71747 130579 -48157 289152 -238791
15947 -134895 -106885 143841 -34196 24366 150305 -364710 111741 125074 227433 89098
15936 101096 -27226 -103092 -108180 -183897 -73908 2823 152678 82895 183214 -126338 91329
15924 -10599 -91988 -392312 21324 -156451 -179201 79243 -100149 -201493 -134255 57167 -58930
15912 -84344 -59165 -226266 125330 208914 -125989 43085 19690 368439 -346751 -39089 -238761
15901 -238761 -65734 151813 -26126 -47288 -240544 207466 -618882 -173257 -82504 -79890 161567
15889 -317944 -21618 79242 30095 31609 116203 333888 148606 -47726 -52948 -173206 87340
15877g1927j31253g7124A3104d0968C1121g9648l93293G296a10254j43620b4053
15865a02699r3232A26173J7862i2758j87397O552J33032e6170q7437j00211D87102
15853B66156f2158D6564K08450H1353a74814P870m4384L6971B61887r8581d0289
15841i3679p3702G0310e8744n2032m5274d9793A56117E5457a023k9517o5514k8779
15829a24833f396r2135a6675m1917k14510J24993C1053a59822O0871k06207C2795
15817a33450A85605f2052L852A87533h8679A07474a53548J0227o2469L5393H7787
15805g0005H38P23a33071H7295c88393a34097j26163L6789h082A0210b25678B81662
15792A63223a86360I388g8133k34044C01498H913J27878b2245C35736c32057J62138
$$ plain form
15877 -71927 -203180 -77124 13104 -40968 31121 -79648 -472941 7296 -110254 -253874 -24053
15865 -102699 -195931 126173 144035 -92758 -280155 -273603 -140571 -56170 -143607 -243818 487102
15853 266156 -62158 46564 255014 81353 -174814 -166944 -211328 -174357 261887 163306 -40289
15841 -93679 -167381 70310 -58744 -110776 -156050 -49793 156117 55457 -1023 -30540 -96054 -124833
15829 -124833 -6396 -98531 -16675 -58592 -273102 -148109 31053 -159822 -98951 -305158 32795
15817 -133450 185605 -62052 -58200 187533 -88679 107474 -153548 -143321 -205790 -170397 87787
15805 -70005 838 1561 -133071 87295 -388393 -134097 -260260 -223471 -8082 10210 -225678 281662
15792 163223 -186360 9388 -78133 -312177 301498 8913 136791 -22245 335736 -332057 -169919
15781a69919r9010a1486F8867P7325h8876d2974A8523G636e0761j79610A2683
15769A32801N0033o2834i3692r837m2687a3064A34109b28467a986A01664a37308
15757I7958P0549k1599L4039M9735a49755j77029a2876j10555D9290i1500a1398
15745I4218e0177j36329G1177a59499B91390D5490O4842n702B9574b66794i0074
15733A34930b20820j58116a61409E99O3398a38406M8814L8364k37429I4299M5430
15722A39729o4806J1745a282l22229B25763j09628e7599j29887C8194j4442a0935
15710c4781A62479b13958e8336m4428l126D3137R1145a09668l66960E1642N7895
15699A09537g6002j25283F7698c67958c2144J0175G1434K29242p2717j1392a87659
$$ plain form
15781 -169919 -268929 -11486 68867 146192 -88876 -42974 18523 7636 -50761 -230371 12683
15769 132801 182834 120000 -93692 -103529 -146216 -13064 134109 -228467 -1986 101664 -137308
15757 97958 168507 146908 180947 230682 -149755 -326784 -12876 -123431 49290 -91500 -11398
15745 94218 -50177 -186506 71177 -159499 291390 45490 110332 104630 29574 -266794 -90074
15733 134930 -220820 -378936 -161409 599 63997 -138406 -89592 -51228 -288657 94299 139729
15722 139729 74923 86668 -1282 -323511 225763 116135 -57599 -187486 38194 23752 -10935
15710 -34781 162479 -213958 -58336 -102764 -105890 43137 134282 -109668 -476628 51642 109537
15699 109537 -76002 -201285 67698 -367958 -32144 -21969 71434 300676 227959 216567 -187659
15687B7988a20627M8059l74441J37439B81533c5515p6129H7579B4474g4176H2246
15675b19917Q5515A88447j9496i625k24954B78943K639C6844a3520j3239n9676
15664h6435D7349a21718j46969i8299A99399k1342F0013i6642r0952E3847h3414
15652a70391C9135b21592H4502c04704F3832a42276K5139j29521o7187k9856e3832
15640B38249b00794j63263J77893k0754B19492E960J47304g6656j30834B35252
15629H9123b91259A24356A162h9929a4953A35953k0122A0233R5174c2715C53520
15617f7437K4744D9092J9697a46809K7365l80852b6882A27745h7451M495A6114
15605e0287A27321Q4717l7780C6574b90699E6799J78537i5543l9256O4562G651
$$ plain form
15687 27988 -120627 -72568 -447009 -309570 281533 -35515 -111644 87579 24474 -74176 82246
15675 -219917 -134402 188447 168951 -9625 -234579 278943 281582 36844 -13520 -26759 -86435
15664 -86435 47349 -121718 -268687 -98299 199399 178057 60013 -96642 -187594 53847 -83414
15652 -170391 39135 -221592 84502 -304704 63832 -142276 -117137 -246658 -313845 -343701 -53832
15640 238249 -200794 -364057 -186164 -206918 219492 5960 153264 -76656 -207490 235252
15629 89123 -291259 124356 1162 -89929 -14953 135953 115831 10233 105407 -32715 353520
15617 -67437 -42693 49092 68789 -146809 -119444 -500296 -26882 127745 -87451 -82956 16114
15605 -50287 127321 212038 174258 36574 -290699 56799 235336 -95543 -134799 -70237 7651
15593A80738l7881o2040Q2191b58292o6405C02396h5633L7283j68505a34H8000
15581b28982c4078l3918A50745J50742O3380j57766e6828A11275J60596a45301
15570B55939a45382d3602j49159O2413j34859f2914B43448l8569K26019G5589
15559D4026E71h8910d0367A32243a31989E9796a09178A50214E5700J20660N4417
15548B30777j7136c04288b8204j07906r3792q538L2987B60737H4424d1373I063
15536d0154j4621k34333e2462J4887h534B4707J34260b13633A05034a3455j97936
15525b11391N2556D4298a30479k47832a7919G0111h9420j81400r4755e8524q8474
15514a46998O6141a7380j24025A2889b84889B65550j31039h5313G6546a64890
$$ plain form
15593 180738 142857 80817 163008 -258292 -324697 302396 -85633 -48350 -216855 -134 88000
15581 -228982 -34078 -67996 150745 301487 364867 207101 -56828 111275 271871 -145301
15570 255939 -145382 -43602 -192761 -130348 -265207 -62914 243448 204879 430898 75589
15559 44026 571 -88910 -40367 132243 -131989 59796 -109178 150214 55700 176360 230777
15548 230777 213641 -304288 -28204 -136110 -229902 -238440 -205453 260737 84424 -41373 9063
15536 -40154 -54775 -289108 -52462 -37575 -8534 24707 158967 -213633 105034 -13455 -211391
15525 -211391 -158835 44298 -130479 -378311 -17919 70111 -89420 -270820 -365575 -58524 -146998
15514 -146998 -80857 -17380 -141405 12889 -284889 265550 134511 -85313 76546 -164890
15503D2834b13735p7469h9815j26831B8601a61609G3838c27792A13381A732b95069
15491d19722c1241E4727K8750J62073a25101B72616H7326b2165G8819J26490c71091
15479c18824c5432E7668J98701r9005F6079g863I1113Q4939a6376k30062A76458
15467a12260H2956m1159a02877c1347k64288I1979C4026b40398g9908A29494m2362
15456H7132L240L4471J91166m0483p0023h6739l96850B06830a98462p9276c7191
15444C29557q4216a21655k80299Q0432i7228p9585A0358b86376B26169g5612A5746
15432a3866l57490E2950h1705q3701f0693j85636N8326D8577a34387C9340J10477
15421A49817d987j95065q5638e6297A76416d8628D15a48169B46942N339d7771
$$ plain form
15503 42834 -213735 -291204 -89815 -216646 28601 -161609 73838 -327792 113381 1732 -295069
15491 -419722 -31241 54727 83477 245550 -125101 272616 87326 -22165 78819 205309 -371091
15479 -318824 -35432 57668 256369 157364 66079 -7863 91113 176052 -16376 -246438 176458
15467 -112260 82956 41797 -102877 -31347 -295635 91979 34026 -240398 -79908 129494 87132
15456 87132 90372 124843 316009 275526 205503 -86739 -483589 206830 -198462 -277738 -37191
15444 329557 245341 -121655 -401954 -321522 -97228 -176813 10358 -286376 226169 -75612 15746
15432 -13866 -371356 52950 -81705 -165406 -60693 -246329 -188003 48577 -134387 39340 149817
15421 149817 -4987 -200052 -285690 -56297 176416 -48628 415 -148169 246942 252281 -47771
15409C1568e0114k02049e1279A58281n7696a69519A6393J7998K39080F8163h8565
15397E9005R9022g4319A71142a22388D35169g6565a8689q605G7155J05351A6444
15385g6856k14792c7111k5092j47737C67223b4688e370A45581a67503C10516n9695
15374B50821c0256o819C88132c00351D791c2347k94309B03341b1351m5397l0243
15363i6991A5873J7464N3726a08417d7408C0510a43288E7363a71004G9160a14047
15351c2433H0451Q413b3231A65380c5190I4234a53513L6179A24574b01651J5223
15340a86428k1982A27435l1407J06639p541B4721J1617K50034j00480p6044J25014
15329B34862c0436A08873a33120j44778a22800M3439K16E0594N7128a49497H5651
$$ plain form
15409 31568 -50114 -252163 -51279 158281 100585 -169519 16393 34391 273471 68163 -88565
15397 59005 158027 -74319 171142 -122388 435169 -76565 -18689 -27294 77155 182506 16444
15385 -76856 -291648 -37111 -62203 -209940 367223 -24688 -5370 145581 -167503 310516 250821
15374 250821 -30256 -37075 388132 -300351 4791 -32347 -326656 203341 -21351 -66748 -96991
15363 -96991 15873 33337 87063 -108417 -47408 30510 -143288 57363 -171004 79160 -114047
15351 -32433 80451 88864 -23231 165380 -35190 94234 -153513 -117334 124574 -201651 -186428
15340 -186428 -208410 127435 96028 202667 195126 24721 36338 286372 185892 109848 234862
15329 234862 -30436 108873 -133120 -277898 -122800 -79361 -79145 50594 107722 -149497 85651
15317d9917n0902E8483b80879g6503o7149N9363L0096G3822J40325c29860i5843
15305C13872D9554a28484B32930H4222J63012E607b7223o8110E3521R8198G1272
15293g8156F3884c62213C13046a62365A60330a42349H2526d3523n1466A48539
15282g2462I6502B0220J10436d9190l4703A09305A0292J98974P5166C8920J15977
15271A54897A9037P6204L26641D6677N48955b92995B13047i1043m2007L4127j26484
15260b25407A23908R571K10824c2855k3582b4968C4258P7984K15380H2490O7976
15249A50466J33364P16197P95176j88135l87641K53261m37166C61302C4900J2122
15239D7022g0977A60130f8905A22001J40534J2088l5220a69294L447A61751B2285
$$ plain form
15317 -49917 -100819 58483 -280879 -76503 -143652 -84289 -54193 73822 214147 -329860 -95843
15305 313872 49554 -128484 232930 84222 247234 5607 -27223 -95333 53521 151719 71272
15293 -78156 63884 -362213 313046 -162365 160330 -142349 82526 -43523 -94989 148539
15282 -72462 96502 20220 130656 -49190 -83893 109305 10292 209266 284432 38920 154897
15271 154897 19037 95241 421882 46677 595632 -292995 213047 -91043 -133050 -98923 -225407
15260 -225407 123908 133479 344303 -32855 -56437 -24968 34258 112242 327622 82490 150466
15249 150466 283830 1000027 1795203 1607068 1219427 1472688 1035522 361302 34900 47022
15239 47022 -70977 160130 -68905 122001 262535 274623 239403 -169294 -165847 161751 22285
15227B02732I1778g690j85659D6432c6073A2485Q2697h9759F4103Q1829p1505
15216G4427b3043j24045A59372B4897J62180I3202d3420H3580A0116a9652B6352
15204B25366m3820B2376f3563B6394E595b9490A01898A9656B515K94246B7633
15192A31189k1375m3513k2386K74532A35833K18499a21320n6193h316A59433M3517
15181B02950J21951E596a14120G2126q754J27084P7523a9559C1204c26090c7742
15169A08712Q090h8766C73755F9521b04105D7254a19256E5880J47036P1308n1675
15158B22549J60269j02636j33290G3426B559b11640B32330C6168J60820O387F8067
15146A04253a35876A06052a16165o0689A33914L9385n0946N1432p0293J38668
$$ plain form
15227 202732 91778 -7690 -193349 46432 -36073 12485 95182 -89759 64103 145932 74427
15216 74427 -23043 -147088 159372 24897 187077 93202 -43420 83580 10116 -19652 26352
15204 225366 181546 22376 -63563 26394 5595 -29490 101898 19656 2515 296761 27633
15192 131189 109814 66301 43915 318447 135833 354332 -121320 -177513 -8316 159433 202950
15181 202950 324901 5596 -114120 72126 63372 190456 267979 -19559 31204 -326090 -37742
15169 108712 116802 -88766 373755 69521 -204105 47254 -119256 55880 202916 274224 222549
15158 222549 382818 280182 146892 73426 2559 -211640 232330 36168 196988 203375 68067
15146 104253 -135876 106052 -116165 -176854 133914 173299 122353 173785 103492 242160
15136B42160a07518A71395A5214K18493c527A82362q0698J61444D5752J17113
15126A62865O2114q9791a0992G9695a23244A0701L8943o599c65626C36585a7886
15114G0179M5126M8270i7007A15633d219A24964n7076Q9007B5275L2055L3969
15103I1299l7735k6184L6220g0069A10543A3522J57258a66036H9366g9777c025
15091A62172e2701A97176i3632E4798c8169D73825f7148a415p9701A59358j2059
15080A47299m2831K73212A13988J33697A05904D5449J82092l3408J95450A78907
15069B65607M828b4726p1617C6655K59440I0797a28124n1961D17470j87778k6807
15058B02885a29809I6318a73741G3684e8233B22570M2195I0110E885R1790G673
$$ plain form
15136 242160 -107518 171395 15214 233707 -3527 182362 101664 263108 45752 162865
15126 162865 224979 135188 -10992 79695 -123244 10701 49644 43045 -365626 336585 -17886
15114 70179 115305 163575 -97007 115633 -4219 124964 67888 156895 25275 57330 91299
15103 91299 53564 27380 63600 -70069 110543 13522 170780 -166036 89366 -79777 -3025
15091 162172 -52701 197176 -93632 54798 -38169 473825 -67148 -1415 -81116 159358 147299
15080 147299 104468 377680 113988 247685 105904 45449 227541 194133 389583 178907
15069 265607 270435 -24726 -96343 36655 296095 90797 -128124 -180085 417470 229692 202885
15058 202885 -129809 96318 -173741 73684 -58233 222570 264765 90110 5885 97675 7673
15046D75280H931a15659A6385J7242K16149O0064A25749J40902r5962J4141J86921
15035C71751F8599i6470C23240b9231A94472r1267J93858j42689J56781c08717
15024E5654M3929h7457c2331C47944K01848a58166A08700B1324L45348l3720m6646
15013B86306O2683m7895n9781g9271E6273J22961l3809a46236B35895l0507N674
15002B11062h7996A76313K88708H9192b04749A10186R0884l2330C8253J80338
14992B18591J78091B5639J98236P7278Q626j31764K08043I193J91781a2295C01560
14980B05946o2271N7684j810H3904J75626K26783C2239J77035N6873L6129M3893
14969C46169c3778B84969f1272C09293i119A48608O001G1582L41600A90810B5758
$$ plain form
15046 475280 8931 -115659 16385 33627 249776 309840 125749 266651 170689 184830 371751
15035 371751 68599 -96470 323240 -29231 194472 103205 297063 154374 311155 -308717
15024 55654 99583 -87457 -32331 347944 549792 -158166 108700 21324 366672 332952 286306
15013 286306 348989 301094 241313 -79271 56273 179234 145425 -146236 235895 205388 211062
15002 211062 -87996 176313 465021 89192 -204749 110186 201070 168740 38253 218591
14992 218591 396682 25639 223875 301153 309779 178015 386058 9193 200974 -12295 301560
14980 205946 143675 201359 199549 83904 259530 486313 32239 209274 266147 302276 346169
14969 346169 -33778 284969 -61272 309293 -9119 148608 154609 71582 413182 190810 25758
14957e1026A91978H7708J32616K54757j81423b3936C94477j32168a02382C25192
14946D38785A65533L94260A46038K56857o4495q5253O8182j42532K08770A85609
14935f6250C9897J90085K60304k41583L7912P9187o0113Q0418j40916m3755J15623
14924C17059k6923n677a61246F92607B49245i1984B56736j227C4790M27765j70506
14913B92049A31117O7947K76651B13705M692H1536K12008L35021k53160A42079
14902B73446j31963c9321C42072q458p6041L4429A13815n675J70927j21539M3489
14891B01017o9889R6492O6084N08025C03645J0532m3555K46033M3858A44406Q132
14880A52538L11553a00926D19305G7446J56554L61899B28767n3543K4011J91984
$$ plain form
14957 -51026 191978 87708 220324 475081 293658 -23936 394477 262309 -102382 325192
14946 438785 165533 559793 146038 402895 338400 253147 321329 178797 387567 185609
14935 -66250 39897 229982 490286 248703 286615 365802 305689 386107 245191 201436 317059
14924 317059 290136 284459 -161246 692607 249245 -91984 256736 255509 34790 462555 292049
14913 292049 131117 199064 475715 213705 218397 81536 293544 628565 375405 142079
14902 273446 141483 -39321 342072 333614 257573 292002 113815 108140 279067 157528 201017
14891 201017 131128 227620 293704 801729 303645 314177 270622 516655 560513 144406 152538
14880 152538 464091 -100926 419305 77446 234000 595899 228767 175224 199235 391219
14870C91219j55829B8898J77187j9295N83190k75552O1170j29040J60589j95875
14860C91272R7967j73757d2180A36087L90888A75943L52383J60467k2319l20946
14850C45528m3808J47378J36413A75952M20560A96843P7161J90617B19462J80661
14840D00123N7819K14945A85812J75984A61982M2364J85887j04560N1451K0016
14830C57140O9599j67670m1148H7759N42178j87562B12608D3297J5819L57290
14820D16406A31863J51357J48620J72902k51220M646K73165l1596J2425r1635
14810E20527k54665A31750R8833M21876l16884K03221B10344J01141K4463m1132
14800B94816P684K01684Q5758k1287A77889M51304r4733n5764B11398O6167K43307
$$ plain form
14870 391219 235390 28898 206085 186790 769980 494428 555598 426558 587147 391272
14860 391272 489239 315482 -42180 136087 526975 175943 528326 688793 666474 345528
14850 345528 301720 449098 585511 175952 596512 196843 274004 464621 219462 400123
14840 400123 457942 672887 185812 361796 161982 204346 390233 285673 337124 357140
14830 357140 426739 259069 217921 87759 629937 442375 212608 43297 59116 416406
14820 416406 131863 283220 431840 604742 353522 358168 631333 599737 612162 520527
14810 520527 265862 131750 230583 652459 335575 538796 210344 311485 335948 294816
14800 294816 302500 504184 589942 568655 177889 629193 534460 478696 211398 277565 520872
14789E20872m3986k09261J798J14603j22560L17519K03574j22663B31092K56303
14779D87395A93775O80599l77922K61381j93991N3320p9182n2496o6329J4897
14769D34052O627j50661K18906L32946k21008J79891j86209r7919J31689C22302
14758F03966k00671m5734M3384N62650C41564M31227l51294J59582M39927E08896
14747D11698J95880n3975M11557D41599K5200J01026M9389L4633q9149l8970J63080
14736F86808k9918B53894M49094P2811j73588m1528J42559p7983P2946j26084
14726E72121L52827o5848k93603L87965k24512j99635L84157m34617K27945J28194
14716H34994m00570J53091K25081k19133L36286k68308J29993L4387R0592l00660
$$ plain form
14789 520872 476886 267625 269423 384026 261466 578985 782559 659896 231092 487395
14779 487395 193775 874374 496452 757833 563842 617162 537980 485484 419155 434052
14769 434052 440679 290018 508924 841870 620862 800753 614544 516625 648314 322302
14758 603966 403295 357561 400945 963595 341564 772791 421497 581079 1021006 508896
14747 411698 607578 553603 965160 441599 466799 567825 617214 651847 562698 523728 686808
14736 686808 656890 253894 702988 775799 602211 560683 703242 625259 698205 572121
14726 572121 924948 859100 565497 953462 728950 529315 913472 478855 706800 834994
14716 834994 434424 587515 812596 593463 929749 661441 791434 825821 916413 615753
14706F15753K13631l15299j40725M79371k87195K51497L20637k48606j55251J72364
14696I06177j12111R9048o8843J2585J23100k73963M73533n17296L4542L46833
14686A023605l53535M2740p5892M61866k57102j29450R4232k1218J61856l27742
14676F19360K61667j06412k18703M95109O2460r548m43162K67896J02680j59242
14666H72105j19379L47123j92795j35106J34767j98490P5627J77376J28232j95460
14656H94000k4233P7279Q5084O8661k34445J75391J97782k13708K6831l76084
14646F76558K17981K86818k95599K07223J74826j51900j39517J65351j9228K59687
14636A382200k68493j8240M4994O2493J04286l9950k9726l50788K82982J71407
$$ plain form
14706 615753 829384 514085 373360 852731 565536 817033 1137670 889064 733813 906177
14696 906177 794066 893114 824271 836856 959956 685993 1159526 642230 676772 1023605
14686 1023605 670070 712810 636918 1098784 841682 712232 806464 785246 947102 619360
14676 619360 881027 774615 555912 1051021 1113481 1103933 660771 928667 1031347 872105
14666 872105 752726 1099849 907054 771948 906715 708225 783852 961228 1089460 894000
14656 894000 869767 947046 1032130 1100791 866346 1041737 1239519 1025811 1052642 676558
14646 676558 894539 1181357 885758 1092981 1267807 1115907 976390 1141741 1122513 1382200
14636 1382200 1113707 1095467 1140461 1202954 1307240 1267290 1237564 886776 1169758 1341165
14626A341165j8323j900k27276k26875K34080J35633n7016J80398k46750J06560
14616A219696J94613q6865k28793R1168K36841O0217j64684J85906j10896j94033
14606A203170J22232j423J88236j06546m3019q5667k32848O58470j33647J720
14596A570678O4064j19099k22719L65576l06329M99620k23464m22102P22960l52956
14586A576229J47820j38486K96049k69876J42577L5836o9523o8467M81946j56804
14576A977301k14331L19941n91565M83028k5876j06992M90163o01272K21133K00472
14566B152002l27518P7838j22526M64102j66694j09738L85963J56151j05213Q5300
14556B489667J99393l6097K31591K52617N47119K73199J304314K033879M261253
$$ plain form
14626 1341165 1322842 1320942 1093666 866791 1100871 1236504 1179488 1359886 1113136 1219696
14616 1219696 1414309 1327444 1098651 1189819 1426660 1486877 1322193 1508099 1397203 1203170
14606 1203170 1325402 1323979 1512215 1405669 1362650 1276983 1044135 1702605 1568958 1570678
14596 1570678 1634742 1515643 1292924 1658500 1352171 1851791 1628327 1206225 1929185 1576229
14586 1576229 1724049 1585563 1881612 1611736 1754313 1790149 1720626 1652159 2134105 1977301
14576 1977301 1762970 2082911 1491346 1974374 1948498 1841506 2331669 1730397 1951530 2152002
14566 2152002 1824484 1902322 1779796 2243898 2077204 1967466 2353429 2509580 2404367 2489667
14556 2489667 2689060 2652963 2884554 3137171 3684290 3957489 5261803 7295682 11556935
14547A1556935P922780J6567864P708031k1442430A0186104l981573B927781o28701
14539B299080n01873K29356k63216k6735L47219m74048j589J22533J46299K1748
14529A898774O5487J4314k83770J41957m8971K50864K97736k55858Q6454K3499
14519B190486R939l33840L92003J27140J3040J9102J27681m08361M25385k87586
14509B274989L88324k36424J40278q2642N5327J19357L88295l99306Q8205o0095
14499B676308J74831P712j60417L32205P1387k92056J09134L8597J07580k90451
14489B774830M49128k25387N64063m70056K27343l1449m7824J20613L28559m97642
14479C192178K17964k0104J31671P2631k7507p7953O86628l43122l7296q9784
$$ plain form
14547 11556935 19479715 36047579 43755610 22313180 10186104 6204531 2927781 2299080
14539 2299080 1797207 2026563 1763347 1736612 2083831 1609783 1608194 1730727 1877026 1898774
14529 1898774 1964261 1978575 1694805 1836762 1787791 2038655 2336391 2080533 2166987 2190486
14519 2190486 2200425 1866585 2258588 2385728 2398768 2417870 2545551 2137190 2562575 2274989
14509 2274989 2663313 2426889 2567167 2484525 2539852 2659209 3047504 2648198 2736403 2676308
14499 2676308 2851139 2858851 2698434 3030639 3102026 2809970 2919104 2957701 3065281 2774830
14489 2774830 3223958 2998571 3562634 3092578 3319921 3288472 3240648 3361261 3689820 3192178
14479 3192178 3410142 3390038 3521709 3594340 3566833 3488880 4175508 3832386 3795090 3705306
14469C705306M5782l1287N8545M16394k53482K22321L96922p12976L78496J2844
14459D238865k47248N41984j89093j7756M18479m47355N49664K646j35345L10883
14449E025724l6512l8423J21667K8452K40728m53276L31509L56757l92446M88547
14439E672727j29307j39618P6197K12651o2437K07917O9808N0149O972L22147
14429F287206j07869L32849M8125J13047n31482N44578J48410l081K43898j25813
14419F949868J37943J71833j41723M96463n8966L23063O7941M1223K66675R4548
14409H348868j08077L84483o6743p8210M46553J89086j3793K82353j02716M51371
14399I733175m1677L83586L13355j61897L67936n3775L18001n0571K44629K69813
$$ plain form
14469 3705306 3751088 3719801 3778346 4194740 3941258 4163579 4560501 3847525 4226021 4238865
14459 4238865 3991617 4533601 4344508 4326752 4745231 4297876 4847540 4850186 4714841 5025724
14449 5025724 4989212 4950789 5072456 5100908 5341636 4888360 5219869 5576626 5184180 5672727
14439 5672727 5543420 5403802 5479999 5692650 5630213 5838130 5907938 5958087 5965059 6287206
14429 6287206 6179337 6512186 6560311 6673358 6141876 6686454 6834864 6831783 7075681 6949868
14419 6949868 7087811 7259644 7117921 7614384 7555418 7878481 7946422 7987645 8254320 8348868
14409 8348868 8240791 8625274 8558531 8480321 8926874 9115960 9102167 9384520 9281804 9733175
14399 9733175 9691498 10075084 10388439 10226542 10594478 10540703 10858704 10808133 11052762 11322575
14389A1322575J80024M9477K52468K29384J39513L19853P1557L48324K893J58512
14379A3074580O18259K33813M9834K36059K72073M40916N02030j57753M26796
14370A5696607O88275n215n5054Q18839M99265R1609M03929M69275M26851M82644
14360A9517025M11617J90029N53106M33864O00794J77553N71294P55775N75819
14351B3786876O85417O75200N24986R52275R7472N77720J118433N69613N42517
14342B9530509P18519O91223J250004Q83436N95173J273818J122153Q22166J320153
14333C8207154J512233L76288J589170J088409J541073J376445J163593J757496
14325D8611861J175548K145386J617979J959080K012354K010627K225293K101764
$$ plain form
14389 11322575 11502599 11552076 11804544 12033928 12173441 12493294 12564851 12913175 12916068 13074580
14379 13074580 13692839 13926652 13976486 14212545 14484618 14925534 15427564 15269811 15696607
14370 15696607 16384882 16379667 16324613 17143452 17642717 17734326 18138255 18607530 19034381 19517025
14360 19517025 19928642 20118671 20671777 21105641 21706435 21883988 22455282 23211057 23786876
14351 23786876 24472293 25147493 25672479 26624754 26722226 27299946 28418379 28987992 29530509
14342 29530509 30249028 30940251 32190255 33073691 33668864 34942682 36064835 36887001 38207154
14333 38207154 39719387 40095675 41684845 42773254 44314327 45690772 46854365 48611861
14325 48611861 49787409 51932795 53550774 55509854 57522208 59532835 61758128 63859892
14317F3859892K312237K482963K721796K817047K888678L056228L384534L541553
14309H7064928L793004L825090M284548M097460M878457M907735N288989N884121
14301A24024332N857462O716728O533752P071762P700508Q402839Q458169R034499
14293A83800051J0196631J0134254J0980200J1745420J2233275J2685086J3910099
14286B65685016J3937108J4628881J5593117J5983306J5766094J6306288J6144062
14279C74043872J5737079J4982214J4545289J3126298J1535476Q883907L762682
14272D56616817J314101l65223j193719M40071M28852l753334o047939j0253802
14264D37185824j1338367j3305993j4168731j5394090j6625619j6406326j6182292
$$ plain form
14317 63859892 66172129 68655092 71376888 74193935 77082613 80138841 83523375 87064928
14309 87064928 90857932 94683022 98967570 103065030 107943487 112851222 118140211 124024332
14301 124024332 129881794 136598522 143132274 150204036 157904544 166307383 174765552 183800051
14293 183800051 193996682 204130936 215111136 226856556 239089831 251774917 265685016
14286 265685016 279622124 294251005 309844122 325827428 341593522 357899810 374043872
14279 374043872 389780951 404763165 419308454 432434752 443970228 452854135 456616817
14272 456616817 457930918 457565695 456371976 456812047 457240899 453487565 447439626 437185824
14264 437185824 425847457 412541464 398372733 382978643 366353024 349946698 333764406
14257C33764406j6127551j5955356j5648716j4466538j2912359j3328730j2872875
14250B32452281j2428137j1255025j1183192r790487r281276r083025q302721
14243A61128418p760949p551356o959960o600701o462582n245163n253178n545249
14235A09749280m472371m755652m506205l778528l509538l310582l805238l277086
14227G8334080l187780k575621k991527k449404k290300k362791k356934j851232
14219E8268491k141012j879765j925766j746984j494742j578296j255948j556654
14211D4689324j448472r50649j540646j133021q45552q47670j138412j796479
14203C4988423m58505q34463j134618n09166j018217r76843j041330o42453m40981
$$ plain form
14257 333764406 317636855 301681499 286032783 271566245 258653886 245325156 232452281
14250 232452281 220024144 208769119 197585927 187795440 178514164 169431139 161128418
14243 161128418 153367469 145816113 138856153 132255452 125792870 120547707 115294529 109749280
14235 109749280 105276909 100521257 96015052 92236524 88726986 85416404 81611166 78334080
14227 78334080 75146300 72570679 69579152 67129748 64839448 62476657 60119723 58268491
14219 58268491 56127479 54247714 52321948 50574964 49080222 47501926 46245978 44689324
14211 44689324 43240852 42290203 40749557 39616536 38770984 37923314 36784902 34988423
14203 34988423 34529918 33695455 32560837 32051671 31033454 30056611 29015281 28372828 27931847
14194B7931847p67226n84326p72067p76621k56831j070741l39891n94351o41600
14185B2128193l21181n15864q62455k72536k98472k20293o11284O2521r03736
14176A8184893l74935j53733k04045l49870o37698Q0469o96802l32935k85045
14167A5230299j15401l9814n52988j67461k2460o05455j70988k78154j83986p71853
14157A2321739j1261J4509k29771l93361Q8766k69018n7332n55976j69542P950
14147A0746703k67681r5409j87314J30022l17415j13154O7960m04818L37342m01915
14137I494321l52890l16758L21008n35410m9492K1272m42746L1296K33621j31750
14127H272472k73078k40226O8526r4452l82934p279j15632L34464k85357Q8260
$$ plain form
14194 27931847 27164621 26580295 25808228 25031607 24774776 23704035 23364144 22769793 22128193
14185 22128193 21807012 21291148 20428693 20156157 19857685 19637392 19026108 19088629 18184893
14176 18184893 17809958 17656225 17452180 17102310 16464612 16545081 15848279 15515344 15230299
14167 15230299 15114898 15075084 14522096 14354635 14332175 13726720 13555732 13277578 13093592 12321739
14157 12321739 12310478 12324987 12095216 11701855 11790621 11521603 11464271 10908295 10738753 10746703
14147 10746703 10479022 10383613 10196299 10326321 10008906 9895752 9963712 9558894 9896236 9494321
14137 9494321 9141431 8824673 9145681 8610271 8560779 8582051 8139305 8170601 8404222 8272472
14127 8272472 7999394 7759168 7827694 7733242 7350308 7343029 7227397 7561861 7276504 7364764
14117G364764m96176J48491j85071J00055n03124L41743l2168k28565l55200L7466
14107F192215J06131N9861l26452j69818O2063k96023j07579k346r1710J74762
14097E601104l72360M60928j54881o13640L94986k31099L0593l14719K56519M2124
14087E099555j30684Q1354k40268k11021n7346L75377o64766J79102K3358j57356
14077D297305j95336n4968J68933m2057j74046J95918Q1285j91958J14657m2811
14067D156922j29058Q5437m14367n017K40969m05984L07129J57370q1312k05687
14057C706402k46699M03159k41656o6569p1264l87K50679m73324K15398l39570
14047C136169p0804K32509k5659k56953K04556k95903J74288k09933J49422m36375
$$ plain form
14117 7364764 6868588 7017079 6832008 6932063 6428939 6770682 6738514 6509949 6154749 6192215
14107 6192215 6298346 6358207 6031755 5861937 5924000 5627977 5520398 5518052 5426342 5601104
14097 5601104 5228744 5689672 5534791 4921151 5316137 5085038 5115631 4800912 5057431 5099555
14087 5099555 4968871 5050225 4809957 4598936 4541590 4916967 4252201 4431303 4454661 4297305
14077 4297305 4101969 4047001 4215934 4173877 3999831 4195749 4277034 4085076 4199733 4156922
14067 4156922 4027864 4113301 3698934 3693917 3934886 3528902 3836031 3993401 3912089 3706402
14057 3706402 3459703 3862862 3621206 3554637 3483373 3482986 3733665 3260341 3475739 3136169
14047 3136169 3065365 3297874 3272215 3015262 3219818 2923915 3098203 2888270 3037692 2601317
14037B601317N03050q8898N4338j37562l21340M01791L8169j37805k56544L60435
14027C016951l12258L6711j79156j11817J5404o0135K35678l73765k34792M37089
14017B469910j31543o0618R099J07567k39551j8790K68931P054n97906J86915
14007B001068j0188J32649Q6370R0873l20284K32282m89580k5098K28505j47663
13997A778934q6116M12613l50993J93274j36097J11566J50796M66222J355526
13988C895725K482207P160250J6813657J3997502j6513562A2933294n595464k224917
13980E112913j076121j09486p63784O1536k79534j74815m13692l6999J09255m4884
13970B384389M0907l20862K42828j76965Q6590N638J58305m52819K77969l75537
$$ plain form
14037 2601317 3104367 3015469 3069807 2932245 2610905 3012696 3050865 2913060 2656516 3016951
14027 3016951 2704693 2741404 2562248 2450431 2465835 2405700 2641378 2267613 2032821 2469910
14017 2469910 2338367 2277749 2286848 2394415 2154864 2136074 2405005 2412059 1814153 2001068
14007 2001068 1990880 2123529 2209899 2300772 1980488 2212770 1723190 1698092 1926597 1778934
13997 1778934 1692818 2105431 1754438 1947712 1811615 1923181 2073977 2540199 3895725
13988 3895725 6377932 13538182 30351839 44349341 27835779 12933294 7337830 5112913
13980 5112913 4036792 3927306 3163522 3225058 2945524 2770709 2357017 2320018 2429273 2384389
13970 2384389 2425296 2104434 2347262 2170297 2256887 2262525 2420830 1968011 2245980 1870443
13960A870443K11875l61833L25402Q3257k00421M4840O4553m22670J32674L20656
13950B068776l91419j44794M86153k08540N5553K14832m13810k1551l46906K56972
13940A555266n3621J88810J26135k48161j82545L9533J58206J33984k06043Q3762
13930A595326j49196j14640L67348l40577L0300K16363j52993N4385j30512p3219
13920A302585M8204j03115r4248N13671l14049k3202q2604J42388j71405K49255
13910A467480n3181L0980r2592J5679o9612j07553o6831J07471P5827j62983J22219
13899A266904K54837j99976j6410p0135j25780n7344R3737k62956K02091N5832
13889A140800j12029L26648J11091l33823J2530J008R4752k43006K22948j02806
$$ plain form
13960 1870443 2082318 1720485 2045887 2129144 1928723 1973563 2038116 1615446 1748120 2068776
13950 2068776 1677357 1532563 2018716 1810176 1865729 2080561 1666751 1645200 1298294 1555266
13940 1555266 1501645 1690455 1816590 1568429 1385884 1425417 1583623 1717607 1511564 1595326
13930 1595326 1446130 1331490 1698838 1358261 1388561 1604924 1451931 1506316 1375804 1302585
13920 1302585 1350789 1247674 1153426 1667097 1353048 1329846 1247242 1389630 1218225 1467480
13910 1467480 1414299 1445279 1352687 1368366 1298754 1191201 1124370 1231841 1307668 1144685 1266904
13899 1266904 1521741 1321765 1305355 1235220 1109440 1052096 1145833 882877 1084968 1140800
13889 1140800 1028771 1355419 1466510 1132687 1145217 1146225 1240977 997971 1220919 1118113
13879A118113K50508k07536N2750q3616J16223j41081m0965J23513L0773J1145
13869A229827l50721K12610j0670j88073m6999J4307n9134L37715m20480K76347
13859I94729J86469L453r3540l22470L40252k98059K07279k05264r2469K95644
13849A016024K79946j49822k49384K93718o4429n03917O45051q1676j17524j00588
13839I67399j08903l32792L74958j7938j41093L98304k99068K19968l27390J37265
13829H70710o2997J71245q9492Q6740N8047m83274J68990L15323m70613L14619
13819H79298j60690j58655J97500K06066R4403j30806q2011J05373j46984k83502
13809E19992L75736m42188J69985O1689K77038o7168q7967P4523j12999J51608
$$ plain form
13879 1118113 1368621 1161085 1213835 1130219 1246442 1105361 1064396 1187909 1218682 1229827
13869 1229827 879106 1091716 1081046 892973 845974 860281 801147 1138862 718382 994729
13859 994729 1181198 1184651 1091111 768641 1108893 810834 1018113 812849 720380 1016024
13849 1016024 1295970 1146148 896764 1190482 1126053 622136 1267187 1185511 1067987 967399
13839 967399 858496 525704 900662 882724 741631 1139935 840867 1060835 733445 870710
13829 870710 807713 978958 889466 976206 1034253 550979 719969 1035292 564679 879298
13819 879298 718608 559953 757453 963519 1057922 927116 845105 950478 803494 519992
13809 519992 895728 453540 623525 685214 962252 895084 807117 881640 768641 920249
13799I20249K02299E09333J21828j73435M63389k89834K26725k48376r30J11142
13789G19842J51553l93322J27472L32186j78931k04090K79787C81802N18128j39819
13779G60111n5145R9019Q0027K4707j80739k0942J05809D04274K13035J00915
13769G18224l43825J42997j53152L85926l11147j05496M71326r8975k37242K45837
13759G14473k11049J05683q0025J90377k09171J26118N6069M7581l60781M88215
13749H67490m24897J08661J55200j53348O1371J86539C31742K37811O9568J31269
13739G70390k46271R1910l6517J56546k44784R9561P1158k83558J37608j93021
13729C23022K22361J4379o0994p912K94769C08389K61280j02555m8833A76315
$$ plain form
13799 920249 1122548 509333 631161 457726 921115 631281 858006 609630 608700 719842
13789 719842 871395 478073 605545 937731 758800 554710 834497 381802 899930 760111
13779 760111 704966 803985 884012 908719 727980 707038 812847 404274 617309 718224
13769 718224 374399 517396 364244 750170 439023 333527 804853 705878 468636 714473
13759 714473 503424 609107 529082 719459 510288 636406 692475 740056 379275 867490
13749 867490 442593 551254 706454 553106 614477 801016 331742 569553 639121 770390
13739 770390 524119 616029 579512 736058 491274 590835 661993 378435 516043 323022
13729 323022 545383 559762 498768 490856 785625 308389 569669 467114 418281 176315
13718D72958k5808M7166j29898O9455N57848D41820N4790K3515j05563m5721K75838
13707F44679C15960Q1295j07476L11271L990K6177j77996Q3096j95355J54451
13697D95413K10434C29859K87741j32426j94802K33910m1444j49684K03034K40065
13687G76253l79631m1139M2528J34807K4556K97979B12375K76323R1975B41658
13676D74549O4146j93401J85393J7635o4659k33299L3059j39483L33309L04610
13666G81859C55949J25698A76929L14423k14739p8712M17124B35761J94615L3090
13656D63466j56672L75825J94986k54165p5159j96212j42060J25352L31954j74783
13646D92532J11951r411A68223M5311O0536K52380M0864k23952n7432j4453p2826
$$ plain form
13718 472958 447150 494316 364418 433873 991721 441820 496610 520125 414562 368841 644679
13707 644679 315960 397255 289779 601050 605040 631217 453221 536317 340962 495413
13697 495413 705847 329859 617600 485174 290372 524282 482838 333154 536188 776253
13687 776253 396622 355483 398011 532818 557374 855353 212375 488698 580673 241658
13676 474549 538695 345294 530687 548322 483663 250364 283423 143940 477249 781859
13666 781859 355949 481647 176929 491352 276613 197901 615025 235761 430376 463466
13656 463466 306794 682619 877605 623440 548281 352069 210009 335361 667315 492532
13646 492532 604483 595072 168223 213534 274070 526450 567314 343362 285930 271477 198651
13635A98651J6550L58287k66324j17144J62461Q9636Q0162k39186K52614R7046
13625F32753k74978J71102k32109P2231L67433C39985j14387J14795A50335J49482
13615B99817J10579l3532Q5159p5364m2464J11277B27403J29505K48282B84023
13604D17574L7686r577j93268L23491k50900m5381P9516R7223J39851A60777M28866
13593E89643B01298o4713R7284J57168j44444K21347k24675L17201A09205K36460
13583C45665r3600L5468I6962K59486j0560N7238J95373k50942q1566O2077r4692
13572B33376Q6759j22188J17796p5883o8652J32474A33980J86676j21776J25921
13562C24801J20116P0610r8756j32737l993m5110I3758B7790K11369J74572L62542
$$ plain form
13635 198651 215201 573488 307164 190020 352481 442117 522279 283093 535707 632753
13625 632753 357775 528877 296768 368999 736432 339985 225598 340393 150335 299817
13615 299817 410396 376864 462023 386659 344195 455472 227403 356908 605190 284023
13604 417574 455260 445683 252415 575906 325006 279625 359141 456364 596215 160777 589643
13593 589643 201298 136585 233869 391037 246593 467940 243265 560466 109205 345665
13583 345665 252065 287533 96962 356448 345888 403126 598499 347557 265991 328068 233376
13572 233376 320135 197947 315743 239860 171208 303682 133980 320656 198880 324801
13562 324801 444917 515527 416771 284034 280041 234931 93758 27790 239159 413731 776273
13551G76273k16101k07036N3717p8450A63766m5768J10959J16260A63586M3297
13541B06883L54563j14399F8412M24113j09886A24139K50466J37378B17460n3056
13531A64404M5401a0401A74338K96959M7058B49157J49316K3062I499a8285D44430
13519C04390r2916R291a57204D0857K76044j11819g9740B65085n644J06592A59614
13507B76570c5229i498B23167G3713M40723H2603K48358r0680p1744L94604j46196
13496D16945J64503B48272j2760D4861j0886L10656a328o4937A46585A7300P9544
13485I6844K33418I1443C5916L64643A28379K64108A81327i6556B3666K17059
13475B40725c1750D71577A66881d5867B58496r5135k6895k999K36855A71443L5363
$$ plain form
13551 776273 560172 353136 406853 328403 163766 117998 228957 345217 163586 206883
13541 206883 561446 447047 68412 492525 382639 124139 374605 511983 217460 164404
13531 164404 209805 -10401 174338 471297 518355 249157 398473 421535 9499 -18285 444430
13519 304390 211474 220765 -157204 40857 316901 205082 -79740 265085 259441 366033 159614
13507 276570 -35229 -9498 223167 73713 514436 82603 330961 240281 168537 563141 416945
13496 416945 581448 248272 235512 44861 33975 344631 -1328 -66265 146585 17300 96844
13485 96844 330262 91443 35916 400559 128379 392487 181327 -96556 23666 240725
13475 240725 -31750 471577 166881 -45867 258496 163361 136466 133467 370322 171443 206806
13464B06806H2574J26162r4243O7286J21970l482p8753J03917d9066C3693Q7289
13453A20982K36810j00277K47633k28602D1887K07404J53099d3313n4695A89259
13442A75864i3681c2600B79806b5630B1260J36074F0030J95217E7172N6445m8489
13431F5128J03673k7809J66186f5222A86535L49484B31154J48509A51634O9011
13421B20645m6875E8067e0817E06301d4417K510C96330G9178J23356J29165c8623
13409C10472A52566J50823j04938J24778I5368J22452J5740p1118P2881q5606
13399A49717B2955M6919J41613n8431N6876M2484a7134B74021A2259L51906a07562
13387I4009K66993A8923M12126b67945C54994A51814C5781J67273J0492p4160
$$ plain form
13464 206806 82574 208736 114493 181779 303749 300267 221514 325431 -49066 33693 120982
13453 120982 357792 257515 505148 276546 41887 249291 402390 -43313 -98008 189259
13442 175864 -93681 -32600 279806 -25630 21260 157334 60030 255247 57172 113617 65128
13431 65128 168801 140992 307178 -65222 186535 536019 231154 379663 151634 220645
13421 220645 173770 58067 -50817 506301 -44417 -41907 396330 79178 202534 331699 -38623
13409 310472 152566 303389 198451 323229 95368 217820 233560 162442 235323 149717
13399 149717 22955 69874 211487 153056 209932 252416 -17134 274021 12259 364165 -107562
13387 94009 361002 18923 431049 -267945 354994 151814 35781 203054 213546 139386
13377A39386J80488j3270D0030P7368E4893K72821a7452E2935P3308P8157k9072
13366A75328K12875p3665j2912j24006K16234j35069q3272a57382C07627j05357
13356B02270r8585J32252K3810A11403L96959B26505a06818C02755J00020N8129
13346D60904B15242K02698m5212F7160R627O7452K04701j65624K91421a09112
13335C86067J41265A71304E8030K2119d0179C07451r1101J84624q3144N7551j05995
13324B69386A23462Q1095M3500I1473Q2643a69471B33347a0580j09160D46055
13313F1589K69610A44270J4054N2287N5815p9696K71699h241E8336h6920B77631
13301a24790C62226A20012c9844B89067j43437l1770l1750N2476i5965c8668D42515
$$ plain form
13377 139386 319874 306604 40030 117398 54893 327714 -17452 52935 126243 204400 175328
13366 175328 388203 314538 301626 177620 393854 258785 175513 -157382 307627 202270
13356 202270 103685 235937 259747 111403 508362 226505 -106818 302755 402775 460904
13346 460904 215242 417940 372728 67160 76787 144239 348940 183316 474737 -109112
13335 386067 527332 171304 58030 80149 -40179 307451 216350 400974 317830 375381 269386
13324 269386 123462 204557 248057 91473 174116 -169471 233347 -10580 -119740 446055
13313 61589 331199 144270 158324 210611 266426 186730 458429 -8241 58336 -86920 277631
13301 -124790 362226 120012 -39844 289067 145630 113860 82110 134586 -95965 -38668 442515
13289c5175G5519J90751j26008k3655n2437J69821a36735B71548C6111a27152
13278B51238j12630m7695J17893I517J8987L09914j51198E7187K72995A25185
13267b49342f1857E43276D4162O6265c0171n22259h6157B95476b6319A4437J10931
13256A25368a69643l5004A68327i069I6250P0903O1784d1218D52145a06889j2985
13245a19874A56825l7686P8995O4617q8406A6784N0081d4119A57398l6N679B0112
13232A0095K82407H6115D1948R0067L0833K8899J59092B3811Q2440K64033o8860
13221C01424e6427A71709k563c90650J59696A60629c51801A17429b9907G0045
13210B76584A33971R1312J24929g4976D6274f7773a790I3024L84866A94759a16863
$$ plain form
13289 -35175 75519 266270 140262 116607 64170 233991 -136735 271548 36111 -127152
13278 251238 138608 90913 208806 9517 28504 338418 187220 57187 330182 125185
13267 -249342 -61857 543276 44162 110427 -30171 -552430 -86157 295476 -26319 14437 125368
13256 125368 -169643 -204647 168327 -9069 96250 167153 228937 -41218 452145 -106889 -119874
13245 -119874 156825 119139 198134 262751 174345 16784 66865 -44119 157398 157362 163041 20112
13232 10095 292502 86115 41948 132015 162848 191747 350839 23811 106251 370284 301424
13221 301424 -56427 171709 169146 -390650 -230954 160629 -351801 117429 -29907 70045
13210 276584 133971 225283 350212 -74976 46274 -67773 -1790 93024 477890 194759 -116863
13198B19885J43385D672J78409N2886a54667C9885c94600B49481b76402C14350
13187A80125a27895B84033B0336J9689J93994J4937j05966i4734d0240J0187B23731
13175C24796A8916a7919A15506L5207d3796j06724A17777J06093B1402N2297O8273
13164A41972i9858K4141B77824j18666d2032A69032b7075j27784C65627a58938
13153D2812K08585A1285c4929A90836E6336a17978C10860F9594A3291B712K81948
13142B84660C7169N45015B49121a6610B29218D8939a22778j27271A03653A7103
13131a45847C01825j38379H1621N8087F3712K55565c1553D16814a86313A75116
13120e1544O603A56472Q5302j14106b46582F5296K15035E2643J71233b51185a05913
$$ plain form
13198 219885 363270 4672 183081 235967 -154667 39885 -394600 249481 -276402 314350
13187 180125 -127895 284033 20336 40025 234019 248956 142990 -94734 -40240 -30053 223731
13175 324796 18916 -17919 115506 150713 -43796 -150520 117777 223870 21402 73699 141972
13164 141972 -99858 -75717 277824 159158 -42032 169032 -27075 -154859 365627 -158938
13153 42812 251397 11285 -34929 190836 56336 -117978 310860 69594 13291 2712 284660
13142 284660 37169 582184 249121 -16610 229218 48939 -122778 -250049 103653 17103
13131 -145847 301825 163446 81621 139708 63712 319277 -31553 416814 -186313 175116
13120 -51544 -44941 156472 241774 127668 -246582 65296 280331 52643 223876 -251185 -105913
13108c5158A74957e3548A43560O2400a63261I8279m8950N0212O7015a54729A11095
13096D899R5717a57688B18973r0425J316K39292a25277C03188A9103b59810Q0576
13085a79234A76171O1784r4629h0970o1011r3844A56999E8822j346k83M6436k043
13073A01586K88656A48682C7637b595A73691M9466n0684b2755o510A53166K2451
13062A75617K29444A78154f9121A13012J8528b5278C37218f2180A11205P7246
13052A88451c120D9882i0073j49224J02261l9318A46904Q7472F8506O8377k3952
13041A12931N1459J42536E0559L40222I5516g2012A55404j0879a84475B91416
13030A77628M2351K0929n2529A2373K19975k823b7379A51498L0972M519K4246
$$ plain form
13108 -35158 174957 -53548 143560 205960 -163261 98279 49329 99541 166556 -154729 111095
13096 4899 100616 -157688 218973 128548 129864 369156 -125277 303188 19103 -259810 -179234
13085 -179234 176171 237955 143326 -80970 -141981 -235825 156999 58822 57476 57193 103629 101586
13073 101586 390242 148682 37637 -2595 173691 223157 172473 -22755 -29265 153166 175617
13062 175617 405061 178154 -69121 113012 131540 -25278 337218 -62180 111205 188451
13052 188451 -3120 49882 -90073 -239297 -137036 -176354 146904 234376 68506 136883 112931
13041 112931 164390 306926 50559 390781 95516 -72012 155404 144525 -184475 291416
13030 177628 219979 240908 188379 12373 232348 229525 -27379 151498 182470 186989 211235
13019B11235p4634e5772A44946a10773A24257i4920B80589j21605O4897j10153
13009A13728b3890r9345B7006d7167A5497J48351e5591A44512A5562D092K49731
12998B53823e6542j25861A56495G1106K13699j32874R6133D8941J83783F4133
12987A21182k1023g6580B19435a2403B30998A4871J95288B3906J95220a54804
12976C4224e3114A84052B1008K6251e26B27584a46725B4569J03833A0256L93143
12965D03399a7646B01545f6537B83437a18635B38699g3753a2670A81367c48847
12954I8571K77441A26868a59351d5825B24882o6738a38303C54986J54904j25786
12944C84104p5177a03905A83177d4933r8843G209K16268a13870l0130C4966K50727
$$ plain form
13019 211235 136601 -55772 144946 -110773 124257 -94920 280589 158984 223881 113728
13009 113728 -23890 -123235 27006 -47167 15497 163848 -55591 144512 15562 4092 253823
12998 253823 -56542 -182403 156495 71106 284805 151931 248064 48941 232724 64133
12987 121182 100159 -76580 219435 -12403 230998 14871 210159 23906 219126 -154804
12976 34224 -53114 184052 21008 47259 -526 227584 -146725 24569 128402 10256 403399
12965 403399 -17646 201545 -66537 283437 -118635 238699 -73753 -12670 181367 -348847
12954 98571 376012 126868 -159351 -45825 224882 158144 -138303 354986 509890 384104
12944 384104 308927 -103905 183177 -44933 -143776 7209 223477 -113870 -144000 34966 285693
12933B85693a34195E6441g0895H0215b51608a19661A3513J89602a73494l3191
12923b06685B74935N2848A22322J74860a21063b5171G9325d42527c4409A51817
12912A74308J65278A02530B971d151k96180B1283K59306b79310A96692c08821
12901A04543d8836B24742E8757g3233J6821E8785a01175a5909B83353c6827j59846
12890a96673A12487b03826j44562J71244A74041F9655o048F939K36608A16264
12879a66874B96325i2385j3094B90088b19664C60435a7085k04755J8538B1228
12868C14351i1716K5353E31752A69426G4158a4722l0937C17739b59072B69014
12857A39664D0203N5517D6069h3127j51276a07558l37825B29243e8858B7664b6548
$$ plain form
12933 285693 -134195 56441 -70895 80215 -251608 -119661 13513 203115 -173494 -206685
12923 -206685 274935 327783 122322 297182 -121063 -25171 79325 -442527 -34409 151817
12912 174308 339586 102530 2971 -4151 -300331 21283 280589 -279310 196692 -308821
12901 104543 -48836 224742 58757 -73233 -56412 58785 -101175 -15909 283353 -36827 -196673
12890 -196673 112487 -203826 -348388 -177144 174041 69655 63607 6939 243547 116264
12879 -166874 296325 -92385 -105479 290088 -219664 360435 -17085 -221840 -203302 21228
12868 314351 -91716 -66363 531752 169426 74158 -14722 -45659 317739 -259072 269014
12857 139664 40203 95720 46069 -83127 -234403 -107558 -445383 229243 -58858 27664 -26548
12845g0460A74769a1918G894K39835A8737d3951Q596D4757a60395A86794K09982
12834C96776a1901A77254Q1565a27578D4022J90090a8299j78762A90028F4919
12823B5446J60855d6619A97167O2833g181D8397a07600G8942J47344a44025O5445
12812g8580C51977j48414b68709G1036k0621J82729n5545L0079a42173N2381O293
12801h3499m5913f487C19429d7503l3259B78055C9435i9318C1784a00068j41275
12790b41343a08487k51161b1987B70639j09391J649g6557A40382K54993B8169
12779A61001J03484a16690L6519H4810r991i0337A42543c19677A25642j6065b07698
12767b92323C6235b48987B20047h2169B9243L60657j79753b56559M3273e8346
$$ plain form
12845 -70460 174769 -11918 7894 247729 18737 -43951 -35355 44757 -160395 186794 396776
12834 396776 -11901 177254 258819 -127578 44022 234112 -18299 -197061 190028 64919
12823 25446 186301 -46619 197167 260000 -7181 48397 -107600 78942 226286 -144025 -78580
12812 -78580 351977 203563 -268709 71036 50415 233144 177599 207678 -142173 -89792 -83499
12801 -83499 -129412 -6487 319429 -47503 -80762 278055 39435 -99318 31784 -100068 -241343
12790 -241343 -108487 -359648 -21987 270639 161248 162897 -76557 140382 395375 28169
12779 161001 264485 -116690 -80171 84810 74819 -90337 142543 -319677 125642 109577 -207698
12767 -292323 36235 -248987 220047 -82169 29243 389900 210147 -256559 -213286 -58346
12756A28948B843M3773a86791b1403n3572j86693f6089q3849c9492C1981a74775
12744b2095A24674d7711n9958j41771C8144J87312B354c18024d7035A05155J39596
12733B44751R3267p7803K5002A32810c5032D0699K7162b837E07452a35483A98081
12721b36253A87464b11575R265f0292K9378B33309a60285B35333o5716l4260l283
12710A32074j1782J94777G2817c42353D04507A13348K50759p2038N3809E6038
12699i6457E5797J90699j13534C4681a48994G7843a76165j39102J48140j1980
12689a79107H157i1469B03315a90872e5673b7127A55119E3692O5049O1715D3666
12677A15837L32559n5306j94492o9073h6258F24090l06380d09556i755j43519
$$ plain form
12756 128948 2843 46616 -186791 -21403 -74975 -261668 -66089 -149938 -39492 31981 -174775
12744 -22095 124674 -47711 -107669 -249440 38144 225456 2354 -318024 -47035 105155 244751
12733 244751 338018 260215 285217 132810 -35032 40699 67861 -2837 507452 -135483 198081
12721 -236253 187464 -211575 -202310 -60292 -30914 233309 -160285 235333 169617 135357 132074
12710 132074 120292 315069 72817 -342353 404507 113348 364107 292069 345878 56038
12699 -96457 55797 246496 132962 34681 -148994 77843 -176165 -315267 -167127 -179107
12689 -179107 8157 -91469 203315 -190872 -55673 -27127 155119 53692 118741 180456 43666
12677 115837 448396 393090 198598 129525 -86258 624090 317710 -409556 -9755 -153274
12667a53274C9524L15880j27263P8625a83161A62387o7406c8051B47330J68767
12657D16097H169K85184f2057I9303c43468Q2330E49680A88562k9017L6208d2612
12645b97230B88145g4913l9047A72988C1283a48563d0082k16150j07531f7984
12634B14828r8423g6543D7307L09092o5330C5612J94110F3324M88790B02168a31096
12622c4940B12745N2853o8519i4656E3788N9867J66688E8875L19457B2734K44091
12611B66825a15655I0413j517I81J93785I4993M6557f198o883H2335g4597j10913
12599a85510A12894g159C56442a29435e6166C7616M6634g4525A49301J77875j27691
12588A99485e3629B409K26056B7740J23718b88801B7477J6471f4458B69778J45967
$$ plain form
12667 -153274 39524 355404 228141 306766 -183161 162387 94981 -38051 247330 416097
12657 416097 8169 293353 -62057 99303 -343468 -261138 549680 188562 159545 195753 -42612
12645 -297230 288145 -74913 -113960 172988 31283 -148563 -40082 -256232 -363763 -67984
12634 214828 116405 -76543 47307 356399 291069 35612 229722 63324 552114 202168 -131096
12622 -34940 212745 265598 197079 -94656 53788 113655 280343 58875 378332 22734 266825
12611 266825 -115655 90413 88896 981 194766 94993 141550 -6198 -13081 82335 -74597 -185510
12599 -185510 112894 -7159 356442 -129435 -56166 37616 84250 -74525 149301 327176 199485
12588 199485 -53629 2409 228465 27740 151458 -288801 27477 43948 -64458 269778 415745
12577D15745I5960a32620G6381j2720c01315A40110E0412L25607B1288J99955
12567B21243a26639f0793A90607o4261a50314d4702A71056j1077g6797D4523a01321
12555A61950L8804J27738C3399b99240C35556j65679a8843k24872A26589b77168
12544e8439C50341A46775a54016k811D3112P0536k0385b42440B2974e1440A83947
12532A49658J57468d4928j23504A21060g6355A6002a30092F6261J12171G7070
12521b2472k06354i4468A78090a09115D5107O6331a78800Q1424B60881b13621
12510B80276a9771H84K44807g1009m95083i5199j0382b6921p3026A86267b20078
12498A11656J21807M327a00063B1555g7712j46463A73045b50931R7597A58537
$$ plain form
12577 415745 95960 -132620 76381 63661 -301315 140110 50412 376019 21288 221243
12567 221243 -126639 -60793 190607 126346 -150314 -44702 171056 159979 -76797 44523 -101321
12555 161950 200754 328492 33399 -299240 335556 169877 -18843 -243715 126589 -277168
12544 -58439 350341 146775 -154016 -156827 43112 113648 93263 -242440 22974 -51440 183947
12532 149658 307126 -44928 -168432 121060 -76355 16002 -130092 66261 178432 77070
12521 -22472 -228826 -94468 178090 -109115 45107 111438 -178800 -97376 260881 -213621
12510 280276 -19771 884 245691 -71009 -566092 -95199 -105581 -26921 -99947 186267 -220078
12498 111656 233463 237790 -100063 21555 -77712 -224175 173045 -250931 -153334 158537
12487h3560L8389D7008d5217j10785H9883a90586C01998f628m0088D5840P3081
12476A18921N26L705B6579d2075B34726M7536E721K22396B7925a8226n9586A52115
12463a55814b5883r423r7388O3149C6775J55370B7021a5095p4674B93245d5557
12451C2216J25063b78383B52709c05745g4796b8259l8311k91260e0972L383B39077
12439B64105g4560B44014F6603J0784a58125D9618k0123J38716K2824G8254J77784
12428B56038b01002j1844A40556o6820a29908H2783J23589a38661A05582B1088
12417A27323N0666K8280o7021a59817B02112l9944b5015E6034d1829A41369J46124
12406B87493A19539B1137i5647B50008G1665J98287b49894B50678b25829A90799
$$ plain form
12487 -83560 -45171 47008 -45217 -156002 89883 -190586 301998 -6628 -46716 45840 118921
12476 118921 119447 123152 26579 -42075 234726 282262 5721 228117 27925 -18226 -77812 152115
12463 -155814 -25883 -35306 -132694 -69545 36775 192145 27021 -15095 -89769 293245 -45557
12451 32216 157279 -278383 252709 -305745 -74796 -28259 -66570 -357830 -50972 -47589 239077
12439 264105 -74560 244014 66603 77387 -158125 49618 29495 168211 191035 78254 256038
12428 256038 -201002 -212846 140556 73736 -129908 82783 206372 -138661 105582 21088
12417 127323 177989 206269 139248 -159817 202112 162168 -25015 56034 -41829 141369 287493
12406 287493 119539 21137 -95647 250008 71665 269952 -249894 250678 -225829 190799
12395G841d0197A67257H2486J65361o8508m122b53898q3004K6846g9999C9970
12383A56829a3566k1499A34757L7772q1236b41508h88A57984j5802b1099j17857
12372a38956e7983j38608k66728A41204G877J83409F9778a95597f4017D1478a13245
12360d4234B9640a72823C63979G9027a33016N968d0356k9082A93076m5009K11440
12349C59507G5283c90037A10185j5853C6538J8345a54250b0545A14331M8754b65767
12337h057H0903k0967c09911g4405j1704j7337k8025B31027K5633C5710J45220
12326A80930K36366C5223a3448k24971I7000C5901A1238b80963a6242n5823R035
12315f3030I214P6863J90619D5963L0950a49205B06009d5422j75828A80413m0388
$$ plain form
12395 7841 -40197 167257 82486 247847 179339 175217 -253898 -336902 -310056 -79999 39970
12383 156829 -13566 -35065 134757 172529 91293 -241508 -888 157984 142182 -21099 -138956
12372 -138956 -57983 -196591 -463319 141204 7877 191286 69778 -195597 -64017 41478 -113245
12360 -44234 29640 -172823 363979 79027 -133016 -127048 -40356 -69438 193076 148067 359507
12349 359507 75283 -390037 110185 94332 36538 54883 -154250 -20545 114331 163085 -265767
12337 -8057 80903 59936 -309911 -74405 -86109 -103446 -131471 231027 256660 35710 180930
12326 180930 417296 35223 -13448 -238419 97000 35901 11238 -280963 -16242 -72065 -63030
12315 -63030 9214 86077 276696 45963 76913 -149205 206009 -45422 -221250 180413 140025
12304A40025b81370A43056L7498a72536A49519L0830m1408E2006J81613B2002
12293A38438K29482f0610I8695k3679N0567J57597j04301b34707M7236k04577
12283c92048A8081N976a11881B13658c2662p0865B43536k5739A8091b01108e5016
12271E7835i7117A3124L00505A19163c8327A69925a29438B8007K12502O5455b19738
12259H1175e9246m6566D2961J2929j891K72092N4441b9803A73531L26364A78783
12247C65305h493B7608d7698F1677a36814A87688n299b3667E9623B9080L4947
12236F4027I621F27c7478C2541c0282B21764L63635B31130o8823K30130A75711
12224D62790A00893m2614K81919A46131J08196F9029K44556Q3634I8675K10673
$$ plain form
12304 140025 -281370 143056 180554 -172536 149519 180349 138941 52006 233619 22002
12293 138438 367920 -60610 98695 75016 125583 283180 178879 -234707 -187471 -392048
12283 -392048 18081 24057 -111881 213658 -32662 -103527 243536 217797 18091 -201108 -55016
12271 57835 -97117 13124 313629 119163 -38327 169925 -129438 28007 240509 305964 -219738
12259 81175 -59246 -105812 42961 55890 53999 326091 380532 -29803 173531 499895 178783
12247 365305 -8493 27608 -47698 61677 -136814 187688 182389 -23667 59623 29080 64027
12236 64027 9621 627 -37478 32541 -30282 221764 585399 231130 162307 392437 175711
12224 462790 100893 58279 340198 146131 254327 69029 313585 397219 98675 309348
12214C09348b0969C44025p024B1483b20703g8493B46780Q8558b35905A58274M7282
12203B05556N6907H9997m3459B1901E784J71840q8274J69433Q112A27914O6234
12192A94148a49126D17627H7314J8400Q4744q1674J47499G0599J36163C216J80680
12181A83896J38506O6684p9788F0931g1336G6735h0974C69348A23025K47966D8880
12169B32747J3710L8967i6547I6240K93339J57161k54889H5520J84506r5574K71137
12158D45589A47051a96503o2003K942I6640h3508C40680A25073c65331L6892a39904
12146D15708B4000J29771A4755O602g8444C7377L697a72857A93781J92577A86693
12134c1871a0259D62174C8650g3489E4983J0625b9144H073c2275A44563a60369
$$ plain form
12214 309348 -20969 344025 337001 21483 -220703 -78493 246780 335338 -235905 158274 205556
12203 205556 262463 89997 46538 21901 5784 177624 89350 258783 266895 127914 194148
12192 194148 -149126 417627 87314 105714 190458 108784 256283 70599 206762 3216 183896
12181 183896 322402 389086 309298 60931 -71336 76735 -80974 369348 123025 370991 48880
12169 232747 246457 285424 -96547 96240 389579 546740 291851 85520 270026 174452 445589
12158 445589 147051 -196503 -258506 -255564 96640 -83508 340680 125073 -365331 -328439 -139904
12146 415708 24000 153771 14755 21357 -78444 37377 41074 -172857 193781 386358 186693
12134 -31871 -10259 462174 38650 -73489 54983 65608 -29144 8073 -32275 144563 -160369
12122A57507n2916h3353j63404J4738R2311H6259b3401C66935A73876a76258P5442
12111a00816R690r0211I2008A1589b8776H5464g2287D6611a11504a4063E0412
12099b53747G1470J21114b14733A90400C054J99751m8890o5022a23292B79286
12088h2414g504r7456e1714o55l6612l0148a6426A9339h3900q8518J2857k6743
12076a86304n0182A70186N07009J338898m27244C54762D1186h6503q9812E9693
12065B45077J6184A28307a01219d1697A59316J88720H2599Q8287b5592j8901a4421
12053D9035P8520a14816A07468B0840J13638c8597m3587L6237A74461C8679c07949
12041A10875c35566G7935b43457H2626a79502f9421j20251B3110a61300F3501
$$ plain form
12122 157507 104591 -83353 -246757 -232019 -139708 86259 -23401 366935 173876 -176258 -100816
12111 -100816 -91126 -181337 92008 11589 -28776 85464 -72287 46611 -111504 -14063 50412
12099 -253747 71470 192584 -214733 190400 3054 202805 153915 88893 -123292 279286
12088 -82414 -7504 -104960 -51714 -52369 -88981 -119129 -16426 19339 -83900 -172418 -159561 -186304
12076 -186304 -236486 170186 677195 2016093 1588849 354762 41186 -86503 -176315 59693
12065 245077 261261 128307 -101219 -41697 159316 348036 82599 170886 -25592 -44493 -14421
12053 49035 127555 -114816 107468 20840 134478 -38597 -82184 -45947 174461 38679 -307949
12041 110875 -335566 77935 -243457 82626 -179502 -69421 -189672 23110 -161300 63501
12030h4653j43549A12984E2615h0805J3434H3487b8990r3287B03065a52090a4190
12018E1458c6681D5958b00524P6038j56805O7287B14630J57203j18032g5291j06934
12007a82225C16559F2011B8462b23895a5707l1189F917a33606B7236b41981A83860
11995A22559b0741f643j23087K1905j5695j41686L9786r2295f9134j89567A39183
11983C51531j38162a77422j43810J52059K4202f7737B33787J19605a32796A67608
11972c0210m8940r935j34645L7032b0665k0213Q497H2486J62940F1874h0283j7020
11960i7303C2942i2219p2575j77333J67248A46056f3792C74626A39455J03333
11950B42788j09072H677h9361K0720p3317c669r2054C07914b03571C0936e8095
$$ plain form
12030 -84653 -228202 112984 52615 -80805 -67371 83487 -28990 -122277 203065 -152090 -14190
12018 51458 -36681 45958 -200524 -124486 -281291 -214004 214630 371833 253801 -75291 -182225
12007 -182225 316559 62011 28462 -223895 -15707 -46896 6917 -133606 27236 -241981 183860
11995 122559 -20741 -6643 -129730 -107825 -123520 -265206 -225420 -317715 -69134 -258701 139183
11983 351531 213369 -177422 -321232 -169173 -144971 -67737 233787 353392 -132796 167608
11972 -30210 -79150 -89085 -223730 -186698 -20665 -40878 -32381 82486 245426 61874 -80283 -97303
11960 -97303 32942 -92219 -164794 -342127 -174879 146056 -63792 374626 139455 242788
11950 242788 133716 8677 -89361 -68641 -141958 -3669 -95723 307914 -203571 30936 -58095
11938b02165A80789B5737f9674A01840c879j22191G1205a4221l9691I1212h0203
11926b9868B02413f7896r5053C6777a19753b1233B66942J33097a6291H029J91474
11915A99503g8205A67079a6555m1060k30010A93260a00266j09297c1891R292A90779
11903A87126m9467k8490c6783A58499H428N9866J62048b69169C0815K9113N0397
11892A10325i0827j96347A86414B723c4414C0528a01337B31113a60232O1819C1065
11880A39197q138F0206J46963g8987l49902C40031c7430L572H9531i5036A778
11868E8418J12455e2231j04448b7108m5339C0153J6248A6011b5754A16102b99654
11856C91226a63859A50609c87366D4210e4921B72790a29491A52322c8974B97643
$$ plain form
11938 -202165 180789 25737 -69674 101840 -3879 -126070 71205 -14221 -53912 91212 -80203
11926 -29868 202413 -67896 -162949 36777 -119753 -21233 266942 400039 -16291 8029 199503
11915 199503 -78205 167079 -16555 -57615 -287625 193260 -100266 -209563 -31891 -22599 190779
11903 187126 137659 109169 -36783 158499 8428 68294 230342 -269169 30815 59928 110325
11892 110325 -90827 -287174 186414 2723 -34414 30528 -101337 231113 -160232 -98413 31065
11880 139197 131059 60206 207169 -78987 -428889 340031 -37430 -33858 89531 -95036 1778
11868 58418 170873 -52231 -156679 -27108 -72447 30153 46401 16011 -25754 116102 -299654
11856 391226 -163859 150609 -387366 44210 -54921 272790 -129491 152322 -38974 297643
11845b38069R4130B883d1730E1930M01926A27040j3979m8332c18483H7522D2225
11833b56706A83236q8647a13858k5462d3182j29767B61698d88182D8486e0256
11822F4761J26866b4455A27003a0893j71178A16020g6226j26405M8873B11719
11811A81778d6562J9383A27998J9418a83090A99379e76722a34115r9840A16915
11800D9856b70903i2374j65580f1295A0183b50287M9356e4792j28063q1641A06574
11788F7125P9393a87177H7741J48256j06604a70283A79875a06209M4528p0255
11778a31936C26167b05073O3243F7621a31843a3243D62961g2182b4606k38777
11768b63383G6197O3313F4542a41989a400A26908b79646B12316a86657e6399J1813
$$ plain form
11845 -238069 -143939 2883 -41730 51930 453856 127040 113061 64729 -318483 87522 42225
11833 -256706 183236 94589 -113858 -139320 -43182 -172949 261698 -488182 48486 -50256
11822 64761 191627 -24455 127003 -10893 -182071 116020 -76226 -202631 -153758 211719
11811 181778 -46562 -27179 127998 147416 -183090 199379 -576722 -134115 -233955 116915
11800 49856 -270903 -92374 -257954 -61295 10183 -250287 -200931 -54792 -182855 -264496 106574
11788 67125 146518 -187177 87741 235997 129393 -170283 179875 -106209 -61681 -131936
11778 -131936 326167 -205073 -141830 67621 -131843 -13243 462961 -72182 -24606 -263383
11768 -263383 76197 139510 64542 -141989 -1400 126908 -279646 212316 -186657 -56399 -44586
11757d4586A38756b4899F8848N4010J44737A12046K8595n0727K87626b07777f9104
11745g1435E3280J61731b84587C1061K22970I0840P904l731J45595c07284R7226
11734b10058A61000J19636j09790a34913B93817B7091b27233B26767b24757A30616
11723E3785k650b09420j8589A10335B1847d1749j74949J6290a1302G2491J16945
11712A89436a69602M5660j57530A1255b77467A34100B253J91071a16142k3914
11702a40056n0921C3446J55638b39821a04003p3166F9812D20J72034b78973B0425
11690C37866j1667A46964A985O4331a72148E4198a88963B51968D7720J33854i3056
11678A83352a84235f2289n5819C07126d9143A42504o8531b87920N8909I586J6406
$$ plain form
11757 -44586 138756 -24899 68848 122858 267595 112046 140641 89914 377540 -207777 -69104
11745 -71435 53280 215011 -284587 31061 254031 90840 98744 95013 240608 -307284 -210058
11734 -210058 161000 280636 170846 -134913 293817 27091 -227233 226767 -224757 130616
11723 53785 51135 -209420 -228009 110335 21847 -41749 -216698 -200408 -11302 72491 189436
11712 189436 -169602 -123942 -281472 11255 -277467 134100 2253 193324 -116142 -140056
11702 -140056 -190977 33446 189084 -239821 -104003 -177169 69812 420 172454 -278973 20425
11690 337866 326199 146964 1985 66316 -172148 54198 -188963 251968 47720 181574 -93056
11678 183352 -184235 -62289 -118108 307126 -49143 142504 73973 -287920 -229011 9586 25992
11667B5992i9971A59906a68045N0265o1803q6913c2386A66491c36231B72999B6397
11655H5165K95651A5311L92829j54771j22536a01315C5133b00942N5064F2295
11644C33293f5994C28648g706k15565J07431H2676c44736A33999l9851C2157g8096
11632C10524a14555A10388e958A19274M2631a1043A09315N1039G0874a27624p3567
11621b01191B9314a1613j5119M270F8203a10537j7522I821b7159E5008a46813
11609A3499K7549P4211J70713n9810K71857c31698b0872j33810q4230b034D60940
11597C1065J34741B8793c21867a13168n3705h2810G1203j1679g6251A63670e25727
11585D45945A81871h166B62513d70628A9262K14290m460A3115d0349C2094L14057
$$ plain form
11667 25992 -99971 159906 -168045 -117780 -179583 -266496 -32386 166491 -336231 272999 26397
11655 85165 380816 15311 408140 253369 130833 -101315 35133 -200942 -145878 62295
11644 333293 -65994 328648 -7706 -223271 -115840 82676 -344736 133999 94148 32157 -78096
11632 310524 -114555 110388 -5958 119274 161905 -11043 109315 160354 70874 -127624 -201191
11621 -201191 29314 -11613 -26732 -22462 68203 -110537 -128059 9821 -27159 55008 -146813
11609 13499 41048 115259 285972 226162 498019 -331698 -20872 -154682 -238912 -2034 460940
11597 31065 165806 28793 -321867 -113168 -166873 -82810 71203 59524 -76251 163670 -525727
11585 445945 181871 -8166 262513 -470628 19262 233552 229092 13115 -40349 32094 346151
11574C46151j32342p1548h8436C64765A27616l3483J93222j24040m8911e3630
11563a12832D40824F1657g4550B11906P0838d0400I8521a24949b3926k68169b2782
11551f4825k72024a64796L3399C88678b59810A01873a20530B75440g5807E6218
11540f6643D1178a0581B21320b58559C350L62647c1238H6222b71578O9443A85114
11528H4838Q9542I591Q0166a01428C36137I9800J08863c41797a24889a9817C01705
11516b6994k03251H9205D627L10921I6542c1053j10028D17487l1730A35251A7360
11504C8185f5730B3426e8184C0139Q6513C6974g6496F700c04519B93773j36993
11493A56780o9773J47835L0171n5450J40600a93458A65293a21538c7822C17977
$$ plain form
11574 346151 213809 142261 -88436 364765 127616 94133 287355 163315 114404 -53630
11563 -112832 440824 61657 -74550 211906 282744 -40400 98521 -124949 -23926 -292095 -22782
11551 -64825 -336849 -164796 -131397 388678 -259810 101873 -120530 275440 -75807 56218
11540 -66643 41178 -10581 221320 -258559 3350 365997 -31238 86222 -271578 -202135 185114
11528 84838 174380 9591 89757 -101428 336137 99800 208663 -341797 -124889 -19817 301705
11516 -26994 -230245 89205 4627 315548 96542 -31053 -141081 417487 385757 135251 17360
11504 38185 -65730 23426 -58184 30139 116652 36974 -76496 6700 -304519 293773 156780
11493 156780 87007 234842 265013 209563 350163 -193458 165293 -121538 -37822 317977
11482B80575H5613J22383p6387K92281d5008B81855E2137f12464A40529a23262
11471A68270g8202C2695R813K15888r9867B3223d9563a4202D0293K67488l4882
11460B72899I1768J7135K1076Q2312b8673B61330A28987a4720D3416A5068j57
11449A4911e5188j37849D29471i298j12515L0105B8164L85688A8726a37379j4817
11438a52196A68157a43731A64388J44979d4010A20872J36852b24414p9313A72831
11427B77883j27821p2318a66884A45947C9304j6951M9843b69903J32527D6476
11416A38312R4422L5824j30806A2640J04247a01428d8422B31475a38623A98881
11405C62414j43427f1471K9551k451A00043K69849b8263i58l0665a0604j1559
$$ plain form
11482 280575 85613 207996 131609 423890 -45008 281855 52137 -612464 140529 -123262
11471 168270 -78202 32695 42508 258396 158529 23223 -49563 -14202 40293 307781 272899
11460 272899 91768 108903 129979 212291 -28673 261330 128987 -14720 43416 15068 14911
11449 14911 -55188 -193037 429471 -9298 -121813 -91708 28164 413852 18726 -137379 -152196
11438 -152196 168157 -143731 164388 309367 -44010 120872 257724 -224414 -303727 172831
11427 277883 150062 77744 -166884 145947 39304 22353 72196 -269903 -137376 46476
11416 138312 232734 268558 137752 12640 116887 -101428 -48422 231475 -138623 198881
11405 362414 218987 -61471 -31920 -34371 100043 369892 -28263 -958 -31623 -10604 -22163
11394b2163A50319h4956j60321g3543j53085C0755L3727K4939C3528h448j71046
11383a79494j99718a86325E7718h0740k00326N1660A89214c26243A36507f6622
11372b3499p0067n8417D10991j90369a97665i849j43981m8920r810O4884P780
11361a39896O6293n4259D29984b50443A73087f2536e805k706k35533K679B06440
11349a52761L7831j35862H1429c58506B57936j17205J87514A6248K61866P7848
11339C55962h025l58372i8751D3282J5106d9286l78801A25881J18895P412p2724
11328A79464c24805c6938A8270b55168C14479j32737l2165E7748J44365I4729
11317C8968Q2177E0633a8738B84040a03344o8697b5702C189i4246D8764L62888
$$ plain form
11394 -22163 150319 -84956 -245277 -73543 -226628 30755 64482 89421 33528 -8448 -179494
11383 -179494 -379212 -186325 57718 -80740 -281066 -229406 189214 -326243 136507 -66622
11372 -23499 -93566 -151983 410991 220622 -197665 -9849 -153830 -202750 -212560 -147676 -139896
11361 -139896 -73603 -127862 429984 -250443 173087 -62536 -5805 -8511 -244044 -241365 206440
11349 -152761 -114930 -250792 81429 -358506 257936 140731 328245 16248 278114 355962
11339 355962 -8025 -366397 -98751 43282 58388 -49286 -428087 125881 244776 252188 179464
11328 179464 -324805 -36938 18270 -255168 314479 181742 149577 57748 202113 94729
11317 38968 121145 50633 -18738 284040 -103344 -172041 -25702 3189 -94246 48764 411652
11306D11652a86132B3547J8923J72264J1413A2508i0096A26686D3931K8852J09633
11295A82416h2508A34110c95832B15927c7523Q170j91738C83J03725e3864A02148
11283e9557B39323L21000a29640B44294a07649N1613j24830a8810j264l4068Q829
11272d5313C051b25019G3841J7203j8794D246d41104c1464A03651D470J52588
11261A57058a40932o5852Q446p9664c1316k89067f9940D5553g6512L6331k19384
11250b59565E5134k4089g9237A29570d16138J97714B68812c55197A72189a82785
11239g3889A69861a2017j55209j46840A5437c00834J09919f0071B69139b65632
11228A7379J72842a62708A52045b5482p2327b4359j2095j13969j17193j01257
$$ plain form
11306 411652 -186132 23547 42470 214734 226147 12508 -90096 126686 43931 72783 182416
11295 182416 -82508 134110 -395832 215927 -37523 -29353 -221091 383 104108 -53864 102148
11283 -59557 239323 560323 -129640 244294 -107649 -56036 -180866 -18810 -20074 -54142 -45313
11272 -45313 3051 -225019 73841 91044 72250 4246 -441104 -31464 103651 4470 157058
11261 157058 -140932 -206784 -198338 -278002 -31316 -320383 -69940 45553 -76512 -40181 -259565
11250 -259565 55134 31045 -79237 129570 -416138 -218424 268812 -355197 172189 -182785
11239 -73889 169861 -12017 -167226 -314066 15437 -300834 -190915 -60071 269139 -265632
11228 17379 190221 -162708 152045 -25482 -97809 -24359 -36454 -150423 -267616 -368873
11218c68873F6862a62116H3239j7744J51124k2148b82419F4343c0913j00174h707
11206C15157d5201A66085e5592B52118b2716k5576A47721b26637m0317b3357l8545
11195f1902j61717g6857o6599E8625c12641G2851a95472r9877e5138j84069L6523
11184b02684l6298F1902a96631e4552l5770b5556l5156C45618b53361P3694g4041
11172A39288J76205b24268O644e0107C23135j36499P5084A3652J04552B9468J60206
11161A89674k1719e406j86664B12383b90924A3661J11715a75929C00532a22760
11150b12707J04282j14769j77839a1502i13j96495d2324A39535b62430r651R8094
11139a73987B60888A00013A4228J51897e7528e852A48946a7763A18516m066l790
$$ plain form
11218 -368873 66862 -162116 83239 65495 216619 194471 -282419 64343 -30913 -131087 -8707
11206 315157 -45201 166085 -55592 252118 -22716 -48292 147721 -226637 -266954 -23357 -61902
11195 -61902 -223619 -76857 -143456 58625 -312641 72851 -195472 -295349 -55138 -239207 -202684
11184 -202684 -238982 61902 -196631 -54552 -90322 -25556 -60712 345618 -253361 -179667 -74041
11172 139288 315493 -224268 -217624 -50107 323135 186636 261720 13652 118204 29468 189674
11161 189674 167955 -5406 -192070 212383 -290924 13661 125376 -175929 300532 -122760
11150 -212707 -108425 -223194 -401033 -11502 -913 -197408 -42324 139535 -262430 -272081 -173987
11139 -173987 260888 100013 14228 166125 -57528 -5852 148946 -17763 118516 114450 110660
11128A10660g7702B63043a0526A48904c16081I4257g4555j62054A7890A04b77834
11116E8588R8946B078K67080a89154F1278L40605A18982f356A47220b5982A08730
11104F15094G2955j2476L669J81679H6693C7352J74210j3577J06856J21972A53645
11092f1687B48826q6783n4399a782A87138J13734k0694Q7976A8380K73003L758
11081B95141K28641k7836B42825L0029J41271P083j67217B9064M85160k45123
11071B69101J47457P2896k35391K08951N1095k00245P751J78531A13426N63514
11061F76940k15496J33357B45993L33414J38590j56041R3505o0106N8052j82506
11051D70901j46128K70901l1141L07513J16787k72083j17225J51912o2404J17147
$$ plain form
11128 110660 -77702 263043 -10526 148904 -316081 94257 -74555 -236609 17890 104 -277834
11116 58588 157534 2078 269158 -189154 61278 401883 118982 -6356 147220 -25982 108730
11104 615094 72955 60479 64148 245827 86693 37352 211562 197985 304841 426813 153645
11092 -61687 248826 162043 107644 -1782 187138 300872 280178 368154 18380 291383 295141
11081 295141 523782 495946 242825 272854 414125 421208 253991 29064 514224 269101
11071 269101 416558 489454 254063 463014 514109 313864 321615 500146 113426 676940
11061 676940 461444 594801 245993 579407 717997 561956 655461 595355 653407 470901
11051 470901 324773 595674 564533 872046 988833 716750 599525 751437 689033 806180
11041H06180r7999K391J6425l53065M47549j67985L1865k39398K43135j54632
11031E34466j45103J87630M6541Q9664R9029k50449L32410l83431J88046k1807
11021F76996k19829K08812j33636J50565J7009C28039L91238j45285M3537M20807
11011A038336D35638p4563J98638L4398R1460k55458R2027k9227l5159M48514
11001I06268k04621l2336l33824j5038L95169j94568K87367l43963j82785M48154
10991G29823K7267C38451J19677J68778j4438R9999N07064o06962L94694j9036
10981I88227m2844k684J75070L5744J97029M25688L65684o7845N68926l52835
10971B290160J72538n9530K5954l76462K456l42467j42070j05792R383J99794
$$ plain form
11041 806180 708181 710572 726997 373932 821481 653496 685361 445963 689098 534466
11031 534466 389363 576993 623534 713198 812227 561778 894188 510757 698803 676996
11021 676996 457167 665979 532343 682908 699917 328039 719277 573992 617529 1038336
11011 1038336 435638 361075 559713 594111 685571 430113 522140 492913 457754 906268
11001 906268 701647 669311 335487 320449 715618 521050 808417 464454 281669 729823
10991 729823 757090 338451 458128 626906 612468 712467 1219531 612569 1007263 988227
10981 988227 945383 942699 1117769 1153513 1350542 1776230 2141914 2074069 2642995 2290160
10971 2290160 2462698 2403168 2429122 2052660 2055116 1712649 1570579 1464787 1474170 1673964
10961A673964O7910k25864k07186J31726K9209J98527r8644p1513m43833L6677
10951A090973J78119m97393j1632l36346j51760N7817A51265K11060d1562B38198
10940A33290B6489J68151N8280c2448B92040B2708L74328b02313K1887n4174f5976
10928D0050g8626j62716J02812B22369m0554k3613C0771M45951B17677G7229M0791
10917A18020k7945M30423j98772B2350a09892A13762n475c82749A93433H4458
10906f5956A34884e7642l5977A90948q3477a06721c1905r5293c9634j57449A80975
10894i5462H332b52684D0734J52078b98686K482E1605a9363k03347A2338a63975
10882A52782l8443b37227Q6111G9891b32890a7365j95263A73846a28657N2757
$$ plain form
10961 1673964 1741874 1516010 1308824 1440550 1469759 1668286 1569642 1498129 1054296 1090973
10951 1090973 1269092 771699 760067 423721 271961 329778 151265 362325 -41562 238198
10940 133290 26489 194640 252920 -32448 292040 22708 397036 -202313 -180426 -234600 -65976
10928 40050 -78626 -241342 -138530 222369 181815 158202 30771 476722 217677 77229 118020
10917 118020 90075 520498 321726 22350 -109892 113762 108287 -382749 193433 84458
10906 -65956 134884 -57642 -93619 190948 107471 -106721 -31905 -127198 -39634 -197083 180975
10894 -95462 8332 -252684 40734 192812 -298686 -296204 51605 -19363 -222710 12338 -163975
10882 152782 114339 -237227 -151116 79891 -232890 -17365 -212628 173846 -128657 -75900
10872g5900A15806b43485I956b67527J23164D22858D9740j228c0255q0645b9988
10860e1974j6598I6257A4331c05774k89223a33732k43951F9492G746c04212a38968
10848H1358l3432d9806j59337D16730b20523I3366J31104b3702A43267P6425n7891
10837A61801a60297j11521e1462B24310Q3994E4784a64026C1211K55805a89175
10826h0428K3997j39952N8038B01059b90957e9710B03491a74103P8229j01847
10816a97721C8373i8591D250L1286d9776r6808C4768J6209d2513j60010f0753
10804A07458B2050c08780A4970a42615g0851N851j32298i7553F0089K3105c31304
10792B67482A09425h4971l5971E3575K46047a15498A4876J3049a39438F3666a30925
$$ plain form
10872 -75900 115806 -243485 9956 -267527 -144363 422858 49740 48512 -30255 -110900 -29988
10860 -51974 -68572 96257 14331 -305774 -594997 -133732 -377683 69492 7746 -304212 -138968
10848 81358 47926 -49806 -209143 416730 -220523 93366 224470 -23702 143267 219692 161801
10837 161801 -160297 -271818 -51462 224310 308304 54784 -164026 31211 287016 -189175
10826 -80428 -56431 -196383 -138345 201059 -290957 -59710 203491 -174103 -95874 -197721
10816 -197721 38373 -98591 4250 35536 -49776 -146584 34768 50977 -42513 -202523 -60753
10804 107458 22050 -308780 14970 -142615 -70851 -65000 -197298 -97553 60089 83194 -331304
10792 267482 109425 -84971 -120942 53575 299622 -115498 14876 27925 -139438 63666 -130925
10780c48783i0282A62978a14700A26969c17129B37101n190G9259c1525l29566
10770c61091a04570B77769j29597b41870B139d4069B88814A24842b68001O0800
10760b07201G0778O4316B7714b63568a21344m4911a3167o3235D4432j9191b87422
10748C5901d3067B09794I5263J02452a29889A32060k4753G618L19268D2589a51677
10736B9925J27637a38686n7859N9264r1484h6292B27592K1590b20718C7848b27355
10724i53j27146B02043l2284b5466j40945M2793B91755C3642a60232E2517K13973
10713B66490a3834F384L5649a26956B8642I399J14355n1144a73883B49827A14345
10701A80786A9260a39325o6947H655a54598E9127K04696c8097m7213k5590B45644
$$ plain form
10780 -348783 -90282 162978 -114700 126969 -317129 237101 231911 79259 -31525 -361091
10770 -361091 -104570 277769 148172 -241870 2139 -44069 288814 124842 -268001 -207201
10760 -207201 70778 135094 27714 -263568 -121344 -166255 -13167 -76402 44432 25241 -287422
10748 35901 -43067 209794 95263 197715 -129889 132060 107307 7618 326886 42589 -151677
10736 29925 157562 -138686 -196545 -137281 -228765 -86292 227592 249182 -220718 37848 -227355
10724 -953 -128099 202043 169759 -25466 -166411 -123618 291755 33642 -160232 52517 266490
10713 266490 -13834 6384 42033 -126956 28642 9399 123754 72610 -173883 249827 114345
10701 180786 19260 -139325 -206272 8655 -154598 59127 263823 -38097 -85310 -110900 245644
10689F4318L12014d66732K25196A3083O6332J60851a90475k69615I875K71936
10679B81811F4618N3617E0529b10516E3451h4258l4340d9612l28392D7864N2913
10668A00777h8255o9412g3387j93058h8136j0231q6049d9720j31842E1198a33344
10656A62820a77153f3786A43733c3846k9334a259k34645b4391E4305K55828j42403
10645A67730a63125b045l53056G7769J7095J3826Q9857K6328J62355a61791A45298
10633i3209k04167N3712F5850d2016B52150f8515r7186p1856h0325B1884c91074
10621d4079k42442A21969a59959k465J8138D6864b15205c9476P020k41026a26373
10609b07682G8225a12034c3142A08793c3132I5023a19827j40407j02647G2248
$$ plain form
10689 64318 376332 -466732 -241536 13083 79415 240266 -190475 -460090 9875 281811
10679 281811 64618 118235 50529 -210516 53451 -84258 -118598 -49612 -378004 47864 100777
10668 100777 -88255 -157667 -73387 -266445 -88136 -98367 -184416 -49720 -181562 51198 -133344
10656 162820 -177153 -63786 143733 -33846 -63180 -1259 -235904 -24391 54305 310133 167730
10645 167730 -163125 -2045 -355101 77769 94864 108690 198547 224875 387230 -161791 145298
10633 -93209 -297376 -243664 65850 -42016 252150 -68515 -165701 -237557 -80325 21884 -391074
10621 -44079 -286521 121969 -159959 -162424 -144286 46864 -215205 -39476 -32456 -273482 -126373
10609 -207682 78225 -112034 -33142 108793 -33132 95023 -119827 -260234 -362881 72248
10598d8784m6223B063c37911n0699H2433C0572K37546b56350A56336G5516A9844
10586a94688D60981b53703D5257a1352G7729P1128a10705c8736A00234P8510h3646
10574f2990j12705Q0887m5080D3894b5386o3802M3834C05949e523B18643J41582
10563C60225j64997a52743L9271l08383C3627g9177I5137a51314A67299c83336
10552c93042C510a10714j20769L9817g6177j26416g5983a9941j31701j41085D24482
10540e2186R616A59530n0910B4231o719a36366m9546A57323a66141e6502J5870
10529d0632j37458B36062b09767G2569O6868g5788E7770j6620a38811j92218p8900
10518d09929J34626b5872I7206j1167a6303A5022K86473A19396c35624a67349
$$ plain form
10598 -48784 -95007 2063 -337911 -388610 82433 30572 268118 -256350 156336 75516 19844
10586 -194688 460981 -253703 45257 -11352 77729 148857 -110705 -38736 100234 178744 -83646
10574 -62990 -175695 -94808 -139888 43894 -25386 -89188 -45354 305949 -5523 218643 360225
10563 360225 195228 -152743 -113472 -421855 33627 -79177 95137 -151314 167299 -383336
10552 -393042 3510 -110714 -231483 -191666 -76177 -202593 -75983 -19941 -151642 -292727 424482
10540 -52186 -42570 159530 108620 24231 17512 -136366 -185912 157323 -166141 -56502 -40632
10529 -40632 -178090 236062 -209767 72569 139437 -75788 57770 41150 -138811 -331029 -409929
10518 -409929 -275303 -25872 97206 86039 -16303 15022 301495 119396 -335624 -167349
10507A52805a58761r4349n5419Q8817f8018A10427C5218L1130C1875c42639O4023
10496b78616A39724E6879L8570h8546q4661C360b63821j02045g8028A06061K24481
10485C30542A54953N4775j7859P2740M7622j14130J34397n021J9275a11159I5529
10473A9045a67403I370a88839f8443k84497B6634H129e6894B86896a13755B83319
10461b0000A82375D9066E141j115a97735a3452r233k15528M0478I2741a76172
10449b31542J3214E171J9980a34074B8244a29278L4126j19057L7183N1120A44341
10437c2264A5848J85744J1952i8340j21443A52232a11n4056C6577b5205k3642
10426d8847l51506a06665G1196p283C642L52003A39890N2982A033K10709G993
$$ plain form
10507 152805 -158761 -253110 -308529 -219712 -68018 110427 35218 66348 31875 -342639 -278616
10496 -278616 139724 56879 95449 -88546 -173207 3360 -263821 -365866 -78028 106061 330542
10485 330542 154953 209728 191869 264609 312231 198101 332498 327477 346752 -111159 95529
10473 19045 -167403 9370 -188839 -68443 -352940 26634 8129 -56894 286896 -113755 283319
10461 -20000 182375 49066 5141 4026 -197735 -13452 -22685 -238213 -197735 92741 -176172
10449 -231542 -218328 5171 25151 -134074 28244 -129278 -95152 -214209 -177026 -125906 144341
10437 -32264 15848 201592 213544 -98340 -219783 152232 -111 -54167 36577 -25205 -48847
10426 -48847 -400353 -106665 71196 63913 3642 355645 139890 192872 1033 211742 7993
10414b9215n9522k845D2050a4685o7267d842B221L8157J19249b95990P4617A47882
10401a6281A55280i4483l0541D5452J74544a03109A51287b7566C39951j46865
10391A93086J4443E9968j982g8216O173q258c0378A56981J69163f082B74725j825
10379B72900k1122M9539P5401A10263d668E4347K69936j30116G3091Q7380K73001
10368D33472Q8173p9083P9045R297j00394l1492j53160K4745J11576G7209J33747
10357B10956f9073A67560O8732j418N48193l53828L50837l22871j18965A65595
10346A11770r801J38883j3815J38982j76731b14392A67665b04910I181J45204
10336A54385P7530m3310J70642n7910b1460A04784a5947D3960R4012E1821a13522
$$ plain form
10414 -29215 -88737 -91582 42050 -14685 -81952 -4842 2221 40378 159627 -295990 -221373 147882
10401 -16281 155280 -94483 -125024 45452 219996 -103109 151287 -27566 339951 193086
10391 193086 207529 59968 57986 -78216 -72043 -80301 -30378 156981 326144 -6082 274725 272900
10379 272900 251778 301317 376718 110263 -4668 54347 324283 194167 73091 160471 433472
10368 433472 521645 442562 521607 530904 430510 399018 245858 270603 382179 77209 210956
10357 210956 -69073 167560 236292 234874 783067 429239 780076 457205 338240 165595
10346 111770 101969 240852 227037 366019 189288 -214392 167665 -204910 9181 154385
10336 154385 231915 188605 359247 301337 -21460 104784 -15947 43960 137972 51821 -113522
10324D92243G8169a25802N5956L1407B10097a5109j07642A78685b8576B18032
10313H8899b55236C06025j01396b21744d6175E9312R5777b23536M5467B64555
10302d8393B2438b32351E09583A56278K210e6872A47413b0224k24433B0778c8359
10290g2258j0168k10335I4340a39434E1553m831K34208c3888q0354j00735i3828
10278E3976a13898B74640b56640r6795J60683f1328A89632A7917b09180C37535
10267b19010j15847C8817I335b38041B83693g9008A73647J73273p3597l623p2762
10256A96938l3583J99013P4614G7442K4338a51021c6691n6022q154M2373f827
10244c06198A48700J98225a35322D5040L89016B9403b29300A50155b68547H7127
$$ plain form
10324 492243 78169 -125802 -69846 -38439 210097 -15109 -122751 178685 -28576 218032
10313 88899 -255236 306025 204629 -221744 -46175 59312 155089 -223536 -178069 264555
10302 -48393 22438 -232351 509583 156278 158488 -56872 147413 -20224 -244657 20778 -38359
10290 -72258 -82426 -292761 94340 -139434 51553 46722 280930 -33888 -114242 -214977 -93828
10278 53976 -113898 274640 -256640 -353435 -192752 -61328 189632 17917 -209180 337535
10267 -219010 -334857 38817 9335 -238041 283693 -79008 173647 346920 273323 269700 196938
10256 196938 163355 362368 436982 77442 101780 -151021 -36691 -92713 -100867 -58494 -6827
10244 -306198 148700 346925 -135322 45040 434056 29403 -229300 150155 -268547 87127
10233a57893j18148A39475J12154C8781e8835b595A28509b0848C2396e5147b5529
10221e0161n1150B18646a45146e6684j437j140a945A56000C8687b01161e9899
10209b81349C9938P2249b36293A93023i3994A77184a54392g5450L1694D9903e303
10197a36552k9573j95145J37662J215P431L6108P6519E8449D508f2281J0549A88213
10184c7134j26382P8654A04781i0900C8847h1586B30703j5306b16930A57678D5286
10172c21225B39299I7877c95800e8411n5135k00476a7964I8536b7521j8756A40337
10160b89670B31750l6231a42513b2920A78677j289b72774d5846A70592E3553c34887
10148d2172j15449A02350K234a37120p7240M121J01188C996K72335c10487f3631
$$ plain form
10233 -157893 -276041 139475 251629 38781 -58835 -2595 128509 -20848 32396 -55147 -25529
10221 -50161 -101311 218646 -145146 -56684 -58121 -59261 -1945 156000 38687 -201161 -59899
10209 -281349 39938 112187 -236293 193023 -93994 177184 -154392 -75450 -43756 49903 -5303
10197 -136552 -166125 -361270 -223608 -222393 -214962 -178854 -102335 58449 4508 -62281 -51732 188213
10184 -37134 -163516 -84862 104781 -90900 38847 -81586 230703 215397 -216930 157678 45286
10172 -321225 239299 97877 -395800 -58411 -113546 -314022 -17964 98536 -27521 -46277 140337
10160 -289670 231750 195519 -142513 -22920 178677 177388 -272774 -45846 170592 53553 -334887
10148 -42172 -157621 102350 104584 -137120 -214360 -210239 -109051 3996 276331 -310487 -63631
10136A69298b63242e7423I8235A8145K86148f8673k0813A50992h0491j15185O0855
10125a34821A37668b47456e1146j12096a8962j65587D9375J06726C4823K62215
10115B97038D3031f3699j89509M5821h3960l75339a3598j09200b616H1883g1210
10103b83565A35978b05519P4624H1686a37453o3973J2464j92412H3317B9162n955
10092B3207b27554E6063N4274a67602A52021a49664L1097C44298a58616d3614
10081A48104e1524A28264C8003a34071D8658a78341A71500a69274a5310E8235
10070b34951c5649j11887O160L9989l7829m522M3981E5837b46304Q1683a491E8119
10057A87981a84124j9972Q0039L6649a3737B30307p5118a45625J0334A92220H6777
$$ plain form
10136 169298 -263242 -57423 98235 18145 304293 -68673 -89486 150992 -80491 -195676 -134821
10125 -134821 137668 -247456 -51146 -163242 -18962 -184549 49375 156101 34823 297038
10115 297038 43031 -63699 -253208 -207387 -83960 -459299 -13598 -122798 -2616 81883 -71210
10103 -283565 135978 -205519 -130895 81686 -137453 -201426 -188962 -381374 83317 29162 23207
10092 23207 -227554 56063 110337 -167602 152021 -149664 -118567 344298 -158616 -43614
10081 148104 -51524 128264 38003 -134071 48658 -178341 171500 -169274 -15310 58235
10070 -234951 -35649 -147536 -141376 -101387 -139216 -143738 -99757 55837 -246304 -164621 -1491 58119
10057 187981 -184124 -204096 -124057 -87408 -13737 230307 155189 -145625 -135291 192220 86777
10045D2310J74310a15842M4229l79948b0600j14823O3186j82642c251k3329k7918
10034e4498j30829g4857q4500m8315A10075J50421D4342R7248c33459a39237N4076
10023h5161A68409a47151j91495a02274A22930M3167b39346K722A14804i2249
10012F4560a51228A57751c30129A91840b07355L1417B5337J9270a91774Q5181
10002a06593L0609A31554f28035e9249p8664L2605A34533e6554k76848B41798
9991a57283A88582b31268c9981B6491h3129O640j7480C0347b37816N906F7681
9979b80973a22156K0102j61242d5949j06173N1943C8614J62439E285J19123e88317
9967a38057f3253k22522E8326b4467I2173j7617J10954c2841c71E5253j0669O7633
$$ plain form
10045 42310 216620 -115842 -71613 -451561 -20600 -135423 -72237 -254879 -3251 -26580 -54498
10034 -54498 -185327 -74857 -159357 -207672 110075 260496 44342 141590 -333459 -139237 -85161
10023 -85161 168409 -147151 -338646 -102274 122930 166097 -239346 -236624 114804 -92249
10012 64560 -151228 157751 -330129 191840 -207355 -175938 25337 44607 -191774 -106593
10002 -106593 -75984 131554 -628035 -59249 -137913 -105308 134533 -56554 -333402 241798
9991 -157283 188582 -231268 -39981 26491 -83129 -76489 -93969 30347 -237816 -231910 67681
9979 -280973 -122156 -102054 -263296 -45949 -152122 -100179 38614 201053 5285 124408 -588317
9967 -138057 -63253 -285775 58326 -24467 92173 74556 185510 -32841 -371 55253 44584 112217
9955A12217a95280B56163h8810k78333J23521n4415c3117B02619k4640i9608g149
9943c53908J42331D3563c0644m6305D4112b00320B60581G8446J1648J4208Q3798
9932A88100b56175O8987k4056D3343h8192j46320B55410D827c75677J40340j72745
9921d08082a38645A13870d700B0761R1147G739a3382c136j64682B5329b31795
9909E20732i0386b9349A07067d9538B3282f3007J2934K3368j3687o2298o5302
9898a67992A11659b23218J8480I5288J3892a18414A00967B5120M936a71835L937
9887a67898c8795A44538b13057a9345j21650L957E4739O0842g2774A38410L1926
9876A70336e541l50319a27210o9255j3932k70589d2043B30199D9866a74099Q198
$$ plain form
9955 112217 -195280 256163 -88810 -367143 -243622 -298037 -33117 202619 177979 -99608 -7149
9943 -353908 -211577 43563 -30644 -76949 44112 -200320 260581 78446 90094 104302 188100
9932 188100 -256175 -187188 -211244 43343 -88192 -234512 255410 4827 -375677 -235337 -408082
9921 -408082 -138645 113870 -4700 20761 111908 7739 -13382 -3136 -167818 25329 -231795
9909 520732 -90386 -29349 107067 -49538 23282 -63007 -50073 -26705 -40392 -102690 -167992
9898 -167992 111659 -223218 -204738 95288 109180 -118414 100967 25120 30056 -171835 -167898
9887 -167898 -38795 144538 -213057 -19345 -140995 -137038 54739 115581 -72774 138410 170336
9876 170336 -5541 -355860 -127210 -196465 -210397 -480986 -42043 230199 49866 -174099 -165901
9865a65901I3577O6387p9041a02460d0092r4242j61030a25727B00731b32577a12959
9853c00867C0507b37655g2984q4687H6858c12347E114L3408a17371k00584C24595
9841A90832n2662d2391j71287d0540j74458c7150D6019b86933r2640A51566C5266
9829b9552B4088d4562B61213a77516j08115m6381J26997j88817a22106j61204
9819b83310e637r1121j2770c3161A84203d8364j33975c0371k63303A69275K5590
9808A94865a12564r8614A17175K1345a57634o7818A98999a25064A44017C4403
9797F9143k3002a51171A840b38340J06872B46027a17841M5070c2409N2A32666
9785a70594j91852C9242f5648K3662q1286A31937c10823G3293g7732A10543J56527
$$ plain form
9865 -165901 93577 159964 80923 -102460 -40092 -134334 -295364 -125727 200731 -232577 -112959
9853 -300867 30507 -237655 -72984 -157671 86858 -312347 5114 38522 -117371 -317955 324595
9841 190832 138170 -42391 -213678 -40540 -214998 -37150 46019 -286933 -379573 151566 35266
9829 -29552 24088 -44562 261213 -177516 -285631 -332012 -205015 -393832 -122106 -283310
9819 -283310 -5637 -96758 -109528 -33161 184203 -48364 -182339 -30371 -293674 169275 194865
9808 194865 -112564 -211178 117175 138520 -157634 -225452 198999 -125064 144017 34403
9797 69143 46141 -151171 1840 -238340 -131468 246027 -117841 -72771 -32409 -32357 132666
9785 -170594 -362446 39242 -65648 -41986 -123272 131937 -310823 73293 -77732 110543 267070
9774B67070d08044A70163b03429J9773B5284a13392A3229d277o0669B16577b41458
9762E7061D057b75944e1904o3447j60668a22792B0276b41899P4440P4639c4991
9750b59763H2654b78119b5541k39102B64208a55288l73675g7936A76975a35211
9739d57436d7504m1868K2716j31422e4933k81579A61635l841a96190h2201H7142
9727a85136N2618J3435o6903D0386A6529b36188i2739j52843r1369E5204c56484
9715a45393b8432j8948A09654a41365f4854A14331j2737g491k05887B08937b8248
9703a4981j06661m0653n7513C06171F1575D390P0300J56060I7903K80176d6669
9691a19003M7251A30163b23731b9709B2404g7772m9224g315q2961K9189k9102
$$ plain form
9774 267070 -408044 170163 -203429 -183656 25284 -113392 13229 -4277 -64946 216577 -241458
9762 57061 4057 -275944 -51904 -115351 -276019 -122792 20276 -241899 -167459 -92820 -34991
9750 -259763 82654 -278119 -25541 -264643 264208 -155288 -528963 -77936 176975 -135211
9739 -457436 -47504 -89372 -66656 -198078 -54933 -336512 161635 157794 -196190 -82201 87142
9727 -185136 -132518 -119083 -185986 40386 16529 -236188 -92739 -245582 -336951 55204 -356484
9715 -145393 -28432 -47380 109654 -141365 -64854 114331 101594 -7491 -213378 208937 -28248
9703 -14981 -121642 -162295 -219808 306171 61575 4390 74690 230750 97903 378079 -46669
9691 -119003 -71752 130163 -223731 -29709 22404 -77772 -126996 -7315 -90276 -61087 -90189
9680i0189M2123j28133j25221h8234M2613k07943A11575a02770B07852a25106
9669g8356A48500a93540A6042K69854e4111B7391K90248a02493F5872e7611p5180
9658a32791O6321a4281n6032p3956f6834l2260I3395J0683b98273f4338r0889
9647a55227o5609N2347a64B40655b65139B53019h7991B04189J5388A00285J24738
9636B25023b22261f988A2452b82067o411i4063A41546m9409a36591A85559N8326
9625B43885d6859q2041l8981J7103d4533C8856a80368R903p8724a14055j32929
9614b46984O4195M4124o9557a9728k6880k40516a04264A14599g7655j47848L5723
9603a89780j8444E9705a14165K9729j4903a1995k78357B5774e6026A70977b16520
$$ plain form
9680 -90189 -48066 -176199 -301420 -88234 -45621 -253564 111575 -102770 207852 -125106
9669 -78356 148500 -193540 16042 285896 -54111 27391 317639 -102493 65872 -57611 -132791
9658 -132791 -66470 -14281 -70313 -144269 -66834 -99094 93395 104078 -298273 -64338 -155227
9647 -155227 -220836 -168489 -164 240655 -265139 253019 -87991 204189 219577 100285 225023
9636 225023 -222261 -6988 12452 -282067 -288478 -94063 141546 92137 -136591 185559 243885
9625 243885 -46859 -128900 -167881 -150778 -44533 38856 -180368 -170465 -249189 -114055 -246984
9614 -246984 -182789 -138665 -208222 -19728 -46608 -287124 -104264 114599 -77655 -225503 -189780
9603 -189780 -208224 59705 -114165 -84436 -99339 -11995 -290352 25774 -56026 170977 -216520
9591F7616b10340A46667g8458L7613A10997a6419k54487E6726d83661l3109H6864
9579c24072C7845a14893c9876C2674K34355k3033G4441a24267b667G4203i3268
9567a47131c6790l95538A379b61393E8264b59138D7513c8480r5907A01173b41144
9555a56328p4730a5232j62494p1556C6196J73135b31320Q99F3346b36878k00715
9544d37593f4744A9689L2909i6851F0484J91722C0905J2645a92590H4016J6909
9533A00925c1590A73465b9656l12979J03A46393a30370o775C53000b4473A20640
9521a15116k50543K2030C6783d64596d4159A26589b13077B34426i8990k49826
9511c48816J3507E6270K07257b90989g4761n9818M6737E2683a26412l6172A48308
$$ plain form
9591 67616 -210340 146667 -78458 -40845 110997 -16419 -270906 56726 -483661 -516770 86864
9579 -324072 37845 -114893 -39876 32674 267029 243996 74441 -124267 -2667 74203 -93268
9567 -147131 -36790 -432328 1379 -261393 58264 -259138 47513 -38480 -134387 101173 -241144
9555 -156328 -231058 -15232 -177726 -249282 36196 209331 -231320 -230421 63346 -236878 -437593
9544 -437593 -64744 19689 52598 -96851 60484 252206 30905 43550 -192590 84016 100925
9533 100925 -31590 173465 -29656 -342635 -342532 146393 -130370 -137145 353000 -24473 120640
9521 -115116 -365659 -343629 36783 -464596 -44159 126589 -213077 234426 -98990 -348816
9511 -348816 -335309 56270 263527 -290989 -74761 -134579 -87842 52683 -126412 -162584 148308
9499E7410c5767H2986c26422J44771G2380O2604a07659A5626b85323a35556f7609
9487a70713c3361E7887c52085D2096e7154A65610o4605e06287I6852b50185a234
9475A38744k254N2786a80818B8246R1020N37a35054j31341H3807g8128k60707
9464c38835d522m1479r2683A1075h9365k67348A6096a37629j45641D9767A4164
9452c6820j52976i1789G8820f3224A23812c32793N0042A66995c4087m0278c4164
9440a35909n5353a5071j35129b4995k60336b758j9940l2367K6607j14662A56210
9428C05589F5134i8983P924n3530c7450A66743A2946e12444e9898Q985k85716
9417c36629C7221d01146H101i6496j89554C2276a88204d0845j57115N9754I181
$$ plain form
9499 57410 -35767 82986 -326422 -181651 72380 134984 -107659 15626 -285323 -135556 -67609
9487 -170713 -33361 57887 -352085 42096 -57154 165610 101005 -506287 96852 -250185 -1234
9475 138744 136490 189276 -180818 28246 119266 119803 -135054 -266395 83807 -78128 -338835
9464 -338835 -4522 -46001 -138684 11075 -89365 -356713 16096 -137629 -283270 49767 14164
9452 -36820 -189796 -91789 78820 -63224 123812 -332793 -282751 166995 -34087 -74365 -34164
9440 -135909 -191262 -15071 -150200 -24995 -285331 -2758 -22698 -55065 -28458 -143120 156210
9428 305589 65134 -98983 -91059 -144589 -37450 166743 12946 -512444 -59898 -50913 -336629
9417 -336629 37221 -401146 8101 -96496 -286050 32276 -188204 -40845 -197960 -138206 9181
9405a87277m4289G9907B8497K74950i7614K2444j12640h8347b8015A14711b69389
9393b13092M5824I1362b54738e7333k650A8604c20822J39703g274H626a37896
9381d5325a4099l9293q6690B07699b70227E3112M8626d5206j88261I766a04804
9369a1253q020l12603d4001B464d59896B97421p7402c6492j52163k87419H1823
9357A60569d87981C62K2870a99964D3033c7974k3770A4884R4422a75896C3414
9345B690b55800P1699A6930J02945h2879K5881B2737b4758p7421B65833a3997
9333a7181A03119c0581k91139B23783I6927l0723c07013H5986g7200B1776J59286
9322A81062f6673J4236H9598b9743i238A41912B5462g3634k74211C4356d6275
$$ plain form
9405 -187277 -231566 79907 28497 303447 -97614 -75170 -187810 -88347 -28015 114711 -269389
9393 -213092 -167268 91362 -254738 -57333 -59983 18604 -320822 -181119 -7274 8626 -137896
9381 -45325 -14099 -53392 -140082 207699 -270227 53112 101738 -45206 -233467 9766 -104804
9369 -11253 -19273 -331876 -44001 2464 -459896 297421 220019 -36492 -188655 -476074 81823
9357 160569 -487981 362 23232 -199964 43033 -37974 -61744 14884 109306 -175896 33414
9345 2690 -255800 -184101 16930 119875 -82879 -56998 22737 -24758 -102179 265833 -13997
9333 -17181 103119 -30581 -321720 223783 96927 66204 -307013 85986 -77200 21776 181062
9322 181062 -66673 -52437 89598 -29743 -9238 141912 25462 -73634 -347845 34356 -46275
9310e3728A36914o4072b09991J792A80441E1557b840A23080g8591b7086E0439
9298i3445A79878d6249k2180B71323H5250a74396j05394C3621b9750j49819B41959
9286C4588b06057I2213c80238c5432p2480k67821D4013J82380a95447h8372a1638
9274b22458B02191l1839a54094n5962B61942A05132a23268B03630a18715e7013
9263C19568i3660c989o6548d795j42503L4080j35414p02D1258a08219I8375J57874
9251B56249e1040C37603A03624c62757f0672k7723j90523B9029A2066K33886f07
9239b3417j3252A24380k6400O9895d7411r829j97598J0405h1818L9911k3348j46789
9227b12044H4630N270m2132O7998d8988m9104j00543B74779e9758I9020a74456
$$ plain form
9310 -53728 136914 72842 -209991 -208199 180441 51557 -2840 123080 -78591 -27086 50439
9298 -93445 179878 -46249 -68429 271323 85250 -174396 -279790 33621 -29750 -179569 241959
9286 34588 -206057 92213 -380238 -35432 -107912 -375733 44013 226393 -195447 -88372 -11638
9274 -222458 202191 170352 -154094 -210056 261942 105132 -123268 203630 -118715 -57013
9263 319568 -93660 -3989 -70537 -4795 -147298 -113218 -248632 -249334 41258 -108219 98375 256249
9251 256249 -51040 337603 103624 -362757 -60672 -88395 -278918 29029 12066 245952 -607
9239 -23417 -36669 124380 97980 167875 -47411 -57240 -254838 -244433 -81818 -41907 -65255 -212044
9227 -212044 84630 89900 47768 115766 -48988 -98092 -198635 274779 -59758 99020 -174456
9215F3273B5325L9900J81534a67326P5833l3383N469b1630L087j1527I038J67168
9203A76206D5228A3117b48541k40074R5034a36336d6181m1393A69426b18098I6425
9191b8836j76616E9560c27839a56390B22664b25166o1325c6242k07242E8450b08522
9179c6563k3682A91149d40063g8505A50263i0549A01868d6566O30q7219N2817
9168h0338p9983A92475a30372A28276b46944d3989c132B01595a54124p2512A57206
9156a43736b3042C0360K49430o0229g8371A35361K6751a16764K3753k18166P987
9145c03190M9837g1525n02554b00053l66871D8957F521b61028J27784j75130o0353
9134c68727a81512m2997j29371J40220A2074e7447j3094j04684b3784A3733i3925
$$ plain form
9215 63273 25325 65225 246759 -167326 -91493 -124876 -119407 -21630 -18543 -30070 9038 176206
9203 176206 45228 13117 -248541 -488615 -393581 -136336 -46181 -87574 169426 -218098 96425
9191 -28836 -205452 59560 -327839 -156390 222664 -225166 -286491 -36242 -243484 58450 -208522
9179 -36563 -60245 191149 -440063 -78505 150263 -90549 101868 -46566 -45936 -133155 -80338
9168 -80338 -160321 192475 -130372 128276 -246944 -43989 -3132 201595 -154124 -226636 157206
9156 -143736 -23042 30360 279790 219561 -78371 135361 162112 -116764 -93011 -311177 -303190
9145 -303190 -253353 -71525 -574079 -200053 -566924 48957 6521 -261028 -133244 -308374 -368727
9134 -368727 -181512 -224509 -353880 -213660 12074 -57447 -70541 -175225 -23784 13733 -93925
9122B11807c08597F6727b3788F2149c49147B9085d51434J20653J45493I8214a78211
9110b00947B12333I9416f0355j29887A020b03141h2764B79066A17160m9702a35459
9098b49352F6770B3080b27719J4906A27386E2556J78618b51052J4057H9522a15257
9086C6468a6096D4108b4141n8397c0751A42643c7141I7083K9688a56711H140d53549
9073c5556j44195f8332A83462h1607q8456n9450R4909E2921e30383J98777E13924
9061a65904p085B08797c3144r5893d3779j91922d3154m69641A71480c21411L1775
9050b89636a08650j2562f0468j50302I1750b96992a39635A07536l5705a99099
9039A69119p6746B7786j741e3255A01251d3279A52515C6981a42848M8615D9388
$$ plain form
9122 211807 -308597 66727 -23788 62149 -349147 29085 -451434 -330781 -185288 98214 -178211
9110 -200947 212333 99416 -60355 -190242 1020 -203141 -82764 279066 117160 67458 -135459
9098 -249352 66770 23080 -227719 -212813 127386 52556 231174 -251052 -236995 89522 -115257
9086 36468 -16096 44108 -24141 -82538 -30751 142643 -37141 97083 126771 -156711 8140 -453549
9073 -35556 -179751 -68332 183462 -81607 -170063 -229513 -134604 52921 -530383 -331606 513924
9061 -165904 -172989 208797 -33144 -129037 -43779 -235701 -43154 -512795 171480 -321411 -289636
9050 -289636 -108650 -121212 -60468 -210770 91750 -296992 -139635 107536 71831 -199099
9039 169119 92373 27786 26045 -53255 101251 -43279 152515 36981 -142848 -94233 49388
9027A37363c4193n8524J3786j89031D38006a56552N429D10760B8158J6171f9027
9015d6947a5963A1128J16246a05794F829b51071A53442J10508e6650B89691b45796
9003a45369A67211B2441h6689d1191l9619m0850A27083a90029G3880C3666c9599
8991e7783B91252h1373F4823K28984f7225H0171c60459A92820o5800a23703j48308
8980b72011a19462D9149e077l21742K2686a48434c4700j7943E3428a03345k86390
8969c89735H0566b46577r6526a08159H6146a542H4072b9765r0620A50570b41715
8957d3728H8206b38743B21110b17780i193A41153m2662m6219b97051b8832j26965
8946a55797j98650J43633f6441C01992e859j40202g0408B93169D5493J9092k198
$$ plain form
9027 137363 -34193 -92717 -78931 -267962 438006 -156552 -151123 410760 28158 44329 -69027
9015 -46947 -15963 11128 127374 -105794 6829 -251071 153442 263950 -56650 289691 -245796
9003 -145369 167211 22441 -86689 -41191 -80810 -121660 127083 -190029 73880 33666 -39599
8991 -57783 291252 -81373 64823 293807 -67225 80171 -360459 192820 127020 -123703 -272011
8980 -272011 -119462 49149 -5077 -326819 -304133 -148434 -34700 -52643 53428 -103345 -389735
8969 -389735 80566 -246577 -343103 -108159 86146 -1542 84072 -29765 -120385 150570 -241715
8957 -43728 88206 -238743 221110 -217780 -9193 141153 98491 52272 -297051 -28832 -155797
8946 -155797 -354447 -210814 -66441 301992 -5859 -146061 -70408 293169 45493 64585 62387
8935F2387J9025J80010E2011a35582D7304M6927a3490E8956M05036j94477O37658
8924I07173N32122K318615P608162K628761C638842A164315C71898n0966a58942
8914h0078A44504e2219F3497M9680c30049a19325A74649m8650e4652A91734a49052
8902i6305F0150g7850L3826B79497c22959g1029l8855E2675h6919k35245B51070
8890H6332a14163A98638H4141a45398J7371j58414D4811a79109A39998f1959l63635
8879d25594g4665H5415J25001h2085C41569l0140b15296Q2215h939E1354c8963
$$ plain form
8935 62387 81412 261422 52011 -135582 47304 94231 -13490 58956 463992 269515 907173
8924 907173 1439295 3757910 11366072 13994833 3638842 1164315 371898 320932 -158942
8914 -80078 144504 -52219 63497 113177 -330049 -119325 174649 125999 -54652 191734 -149052
8902 -96305 60150 -77850 -44024 279497 -322959 -71029 -109884 52675 -86919 -322164 251070
8890 86332 -114163 198638 84141 -145398 -128027 -286441 44811 -179109 139998 -61959 -425594
8879 -425594 -74665 85415 210416 -82085 341569 311429 -215296 -133081 -8939 51354 -38963
$$ [...]
##END NTUPLES=NMR SPECTRUM
##END=
