##TITLE=AC1507_CUNDCR13314_8126509_NYOsiGg0gN
##JCAMPDX= 6.0         $$ Bruker NMR JCAMP-DX V2.0
##DATA TYPE= NMR SPECTRUM
##DATA CLASS= NTUPLES
##ORIGIN= BRUKER
##OWNER= Administrator
$$ 1.72 TOPSPIN		Version 2.1
$$ 2013-08-16 20:13:05.241 -0700  Administrator@X
$$ Compression mode = diff/dup
##.OBSERVE FREQUENCY= 400.02188249412
##.OBSERVE NUCLEUS= ^1H
##.ACQUISITION MODE= SIMULTANEOUS (DQD)
##.ACQUISITION SCHEME= undefined
##.AVERAGES= 8
##.DIGITISER RES= 22
##SPECTROMETER/DATA SYSTEM= spect
##.PULSE SEQUENCE= zg30
##.SOLVENT NAME= COFFEE_meoh
##.SHIFT REFERENCE= INTERNAL, COFFEE_meoh, 1, 14.98509
##AUDIT TRAIL= $$ (NUMBER, WHEN, WHO, WHERE, PROCESS, VERSION, WHAT)
$$ ##TITLE= Audit trail, TOPSPIN		Version 2.1
$$ ##JCAMPDX= 5.01
$$ ##ORIGIN= Bruker BioSpin GmbH
$$ ##OWNER= Administrator
$$ $$ E:\/data/COFFEE/nmr/AC1507_CUNDCR13314_8126509_NYOsiGg0gN/20/pdata/1/auditp.txt
$$ ##AUDIT TRAIL=  $$ (NUMBER, WHEN, WHO, WHERE, PROCESS, VERSION, WHAT)
(   1,<2013-08-16 20:12:58.663 -0700>,<Administrator>,<X>,<go>,<TOPSPIN 2.1>,
      <created by zg
	started at 2013-08-16 20:11:53.132 -0700,
	POWCHK enabled, PULCHK disabled,
       configuration hash MD5:
       C8 4E 4E 5D D3 5C D8 9E 9F 52 82 E0 59 8A DE 15
       data hash MD5: 64K
       5E E4 C4 67 F6 3D F6 16 E7 41 81 10 05 5D 60 44>)
(   2,<2013-08-16 20:13:01.553 -0700>,<Administrator>,<X>,<proc1d>,<TOPSPIN 2.1>,
      <Start of raw data processing
       efp LB = 0 FT_mod = 6 PKNL = 1 PHC0 = 0 PHC1 = 0 SI = 32K 
       data hash MD5: 32K
       77 1E 1C 34 77 91 C5 E0 EE 7B 33 EE 0D 5A 53 DD>)
(   3,<2013-08-16 20:13:01.913 -0700>,<Administrator>,<X>,<proc1d>,<TOPSPIN 2.1>,
      <pk PHC0 = 99.14063 PHC1 = 0 
       data hash MD5: 32K
       6C F1 8E 85 11 EB 97 2D 7D B8 7A D2 AD 26 09 72>)
(   4,<2013-08-16 20:13:02.007 -0700>,<Administrator>,<X>,<proc1d>,<TOPSPIN 2.1>,
      <abs ABSG = 1 
       data hash MD5: 32K
       8D 99 86 2A 5D 9F 61 83 0D 45 29 37 C7 05 CD 92>)
(   5,<2013-08-16 20:13:02.069 -0700>,<Administrator>,<X>,<proc1d>,<TOPSPIN 2.1>,
      <abs ABSG = 2 
       data hash MD5: 32K
       F1 B2 68 76 5C 4B 73 75 91 B4 9D 00 E1 A7 BE B8>)
(   6,<2013-08-16 20:13:02.132 -0700>,<Administrator>,<X>,<proc1d>,<TOPSPIN 2.1>,
      <abs ABSG = 3 
       data hash MD5: 32K
       71 02 DC 00 55 DB B0 4E AF E0 EB E8 A9 21 B8 05>)
(   7,<2013-08-16 20:13:02.194 -0700>,<Administrator>,<X>,<proc1d>,<TOPSPIN 2.1>,
      <abs ABSG = 4 
       data hash MD5: 32K
       01 46 2D 91 A9 33 52 3E 88 38 4B 28 0A 9C 0D 68>)
(   8,<2013-08-16 20:13:02.241 -0700>,<Administrator>,<X>,<proc1d>,<TOPSPIN 2.1>,
      <abs ABSG = 5 
       data hash MD5: 32K
       71 BB 48 11 6D 3E C3 01 F4 37 6A DC D1 73 B1 9D>)
$$ ##END=
$$ 
$$ $$ hash MD5
$$ $$ 92 16 B4 B5 55 1A 03 B5 E0 C4 F0 5E A0 F4 FF 3E
##$RELAX= 
##$RELAX= 
##$RELAX= 
##$RELAX= 
##$RELAX= 
##$RELAX= 
##$RELAX= 
$$ Bruker specific parameters
$$ --------------------------
##$DU= <E:\>
##$EXPNO= 20
##$NAME= <AC1507_CUNDCR13314_8126509_NYOsiGg0gN>
$$ [...]
150 150 150 150 150 150 150 150
##$TP07= 0
##$TPNAME0= <>
##$TPNAME1= <>
##$TPNAME2= <>
##$TPNAME3= <>
##$TPNAME4= <>
##$TPNAME5= <>
##$TPNAME6= <>
##$TPNAME7= <>
##$TPOAL= (0..7)
0.5 0.5 0.5 0.5 0.5 0.5 0.5 0.5
##$TPOFFS= (0..7)
0 0 0 0 0 0 0 0
##$TUNHIN= 0
##$TUNHOUT= 0
##$TUNXOUT= 0
##$USERA1= <user>
##$USERA2= <user>
##$USERA3= <user>
##$USERA4= <user>
##$USERA5= <user>
##$V9= 5
##$VALIST= <valist>
##$VCLIST= <CCCCCCCCCCCCCCC>
##$VD= 0
##$VDLIST= <DDDDDDDDDDDDDDD>
##$VPLIST= <PPPPPPPPPPPPPPP>
##$VTLIST= <TTTTTTTTTTTTTTT>
##$WBST= 2048
##$WBSW= 25
##$XGAIN= (0..3)
0 0 0 0
##$XL= 0
##$YL= 0
##$YMAX_a= 655700
##$YMIN_a= -559931
##$ZGOPTNS= <>
##$ZL1= 120
##$ZL2= 120
##$ZL3= 120
##$ZL4= 120
##$ABSF1= 14.98509
##$ABSF2= -5.573092
##$ABSG= 5
##$ABSL= 3
##$ALPHA= 0
##$AQORDER= 0
##$ASSFAC= 0
##$ASSFACI= 0
##$ASSFACX= 0
##$ASSWID= 0
##$AUNMP= <proc_prof1d_extract_pilot.lims>
##$AXLEFT= 0
##$AXNAME= <>
##$AXNUC= <1H>
##$AXRIGHT= 0
##$AXTYPE= 0
##$AXUNIT= <>
##$AZFE= 0.1
##$AZFW= 0.1
##$BCFW= 0
##$BC_mod= 0
##$BYTORDP= 0
##$COROFFS= 0
##$CY= 15
##$DATMOD= 1
##$DC= 0
##$DFILT= <>
##$DTYPP= 0
##$F1P= 0
##$F2P= 0
##$FCOR= 0.5
##$FTSIZE= 32768
##$FT_mod= 6
##$GAMMA= 0
##$GB= 0
##$INTBC= 1
##$INTSCL= 1
##$ISEN= 128
##$LB= 0
##$LEV0= 0
##$LPBIN= 0
##$MAXI= 10000
##$MC2= 0
##$MEAN= 0
##$ME_mod= 0
##$MI= 0
##$NCOEF= 0
##$NC_proc= -8
##$NLEV= 6
##$NOISF1= 0
##$NOISF2= 0
##$NSP= 0
##$NTH_PI= 0
##$NZP= 0
##$OFFSET= 14.98509
##$PC= 1
##$PHC0= 99.14063
##$PHC1= 0
##$PH_mod= 1
##$PKNL= yes
##$PPARMOD= 0
##$PPDIAG= 0
##$PPIPTYP= 0
##$PPMPNUM= 2147483647
##$PPRESOL= 1
##$PSCAL= 4
##$PSIGN= 0
##$PYNMP= <proc.py>
##$REVERSE= no
##$SF= 400.02
##$SI= 32768
##$SIGF1= 0
##$SIGF2= 0
##$SINO= 400
##$SIOLD= 32768
##$SPECTYP= <>
##$SREGLST= <1H.CDCl3>
##$SSB= 0
##$STSI= 32768
##$STSR= 0
##$SW_p= 8223.68421052631
##$SYMM= 0
##$S_DEV= 0
##$TDeff= 65536
##$TDoff= 0
##$TI= <>
##$TILT= no
##$TM1= 0
##$TM2= 0
##$TOPLEV= 0
##$USERP1= <user>
##$USERP2= <user>
##$USERP3= <user>
##$USERP4= <user>
##$USERP5= <user>
##$WDW= 1
##$XDIM= 32768
##$YMAX_p= 458527139
##$YMIN_p= -732416
##$CURPLOT= <Network HP LaserJet P1505>
##$CURPRIN= <$Network HP LaserJet P1505>
##$DFORMAT= <normdp>
##$LAYOUT= <+/1D_H.xwp>
##$LFORMAT= <normlp>
##$PFORMAT= <normpl>
##$SURQMSG= 1
$$ End of Bruker specific parameters
$$ ---------------------------------
##NTUPLES= NMR SPECTRUM
##VAR_NAME=  FREQUENCY,     SPECTRUM/REAL,   SPECTRUM/IMAG
##SYMBOL=    X,             R,               I
##VAR_TYPE=  INDEPENDENT,   DEPENDENT,       DEPENDENT
##VAR_FORM=  AFFN,          ASDF,            ASDF
##VAR_DIM=   32768,         32768,           32768
##UNITS=     HZ,            ARBITRARY UNITS, ARBITRARY UNITS
##FACTOR=    0.250966925370066, 1,           1
##FIRST=     8223.43324360094, -201261,      -186399
##LAST=      0,             -51158,          -126654
##MIN=       0,             -732416,         0
##MAX=       8223.43324360094, 458527139,    0
$$ Real data points
##PAGE= N=1
##DATA TABLE= (X++(R..R)), XYDATA
$$ [...]
19537B36573a49678C3607b83530A1672a71498A25273J39406f1940B34361b1977
19526B60357c31343f4669B36824a99999B65938e7132a7061j76084d5450A32385
19515a57907m2647j33076A45783J06041h1274a139C656a78907c3262p9826p1574
19504a84662A43373b75577K6153R7074G934J5696N2004I183a97986a2070q3192
19493i5262l56821i1037k2080A65421e3293c284A21101J00570a47042H4389j8507
19482F5882a57797O1269j45601E5386Q9737a65315f0878k02932A9725a93560M0491
19471a53069J7102b0810A02168a31716N8975a6749j71537A59013d8822k08480
19461b57302i4344q4572P6766H0569J59042a08078j95776Q5702d9954r3787A03673
$$ y = [236573, -149678, 33607, -283530, 11672, -171498, 125273, 264679, -61940, 234361, -21977, 260357, -331343, -64669, 236824, -199999, 265938, -57132, -17061, -193145, -45450, 132385, -157907, -200554, -333630, 145783, 251824, -81274, -1139, 3656, -178907, -33262, -113088, -184662, 143373, -275577, -249424, -152350, 7934, 23630, 75634, 9183, -197986, -12070, -95262, -452083, -91037, -113117, 165421, -53293, -3284, 121101, 221671, -147042, 84389, 65882, -157797, -96528, -242129, 55386, 145123, -165315, -60878, -263810, 19725, -193560, -153069, -135967, -20810, 102168, -131716, -72741, -16749, -188286, 159013, -48822, -257302, -94344, -178916, -102150, 80569, 239611, -108078, -303854, -218152, -49954, -143741, 103673]
19449A37540b48279a2512B0805J72371e9196a0622p0368F957P5404a20487e0510
19437a44680l52013E4016b69063d0822D9067a10366N1033j41436R5567J0142C1461
19425b55626C5540M2399e8425j41034e059E7133b30676c4357k62112A55029b28434
19413e065p0645A65027i1274J3104a8591I1063j4009K67919a92791A23109e8703
19401a74331j5851O2825r5233b4337A00528O1865b30292E8884g5398H4819d3602
19389b32542c6093A09331d66779b10541h1513E5733O2338h2924D21562E8659b79590
19377c34248J08773j86111J60710R0391A32797b54501H4387b41369J6515J02552
19367a22302j9579k0183E9594a73713F8993a28807h772o6306F6253b87233a38457
$$ y = [137540, -248279, -12512, 20805, 193176, -59196, -10622, -80990, 6957, 82361, -120487, -50510, -144680, -496693, 54016, -269063, -40822, 49067, -110366, -59333, -200769, -105202, -95060, 31461, -255626, 35540, 77939, -58425, -199459, -5059, 57133, -230676, -34357, -296469, 155029, -228434, -5065, -75710, 165027, -91274, -78170, -18591, 91063, 77054, 344973, -192791, 123109, -58703, -174331, -190182, -127357, -222590, -24337, 100528, 162393, -230292, 58884, -75398, 84819, -43602, -232542, -36093, 109331, -466779, -210541, -81513, 55733, 118071, -82924, 421562, 58659, -279590, -334248, -225475, -411586, -250876, -160485, 132797, -254501, 84387, -241369, -224854, -122302, -141881, -162064, 59594, -173713, 68993, -128807, -8772, -75078, 66253, -287233, -138457]
19355C17550a93282B69170G7258J26338a70359D0259J19898G6827A8264N3480
19345G1744a44844N6815A01171g4508j85470C1604R1047e3792j75700H0853J07384
19334A88237q6661g0142J804k98030A96611b60502J02407F6102b00370i565k7090
19323c6655j96828A58790A1084h2499k51168A19661e21672A54376a53125D0846
19312c03582B34353a86479A39051f2230b8894j57292q1871E711a97261L8829F5895
19300G4567b50162g3818n0091F6509d8177j33592B00781a80512c5204B91440A3530
19288h7487A26501j8483Q014A8793a37328M9622m1900j72266c8906j88120M7341
19277a79685a3577F4974J12646E0463L48125a02852E8938a2909k43461Q8105a1428
$$ y = [317550, -193282, 269170, 77258, 203596, -170359, 40259, 160157, 76827, 18264, 71744, -144844, -88029, 101171, -74508, -259978, 31604, 122651, -53792, -229492, 80853, 188237, 101576, -70142, -68338, -366368, 196611, -260502, -158095, 66102, -200370, -9565, -36655, -233483, 158790, 11084, -82499, -333667, 119661, -521672, 154376, -153125, 40846, -303582, 234353, -186479, 139051, -62230, -28894, -186186, -268057, 5711, -197261, -158432, 65895, 74567, -250162, -73818, -123909, 66509, -48177, -181769, 200781, -180512, -35204, 291440, 13530, -87487, 126501, 108018, 116032, 18793, -137328, -87706, -129606, -301872, -38906, -227026, -179685, -13577, 64974, 177620, 50463, 398588, -102852, 58938, -12909, -256370, -168265, -11428]
19265a78713K8973J4644l11867J09871A02991a78888e8214I8294b39648c5487
19254A0668b04661e9114A59646J05517a79412B2141g6222I5898a12282H358K19728
19243B28086C6926d00571f2026B22223k1542b7258H9158b4628A8942b43489a5145
19231a54161A69318a97097M6428l6475C5786h9985A43045c1426q8853M004j52135
19220b68410l5248k3569d6679D28789b51093J03119A0572N4576B2637J42258g1423
19208c86952C47326a35641B50383a60388n2911A53378Q9987b23720g2978B33979
19197a09032H9476i8465M554e359m78737E7721P295a7854k95838K0761g5989C9303
19184a2484A00963b63177O4088I1224a12683M8433B42089b97488l837D5773M7707
$$ y = [-178713, -149740, -135096, -446963, -337092, 102991, -178888, -58214, 98294, -239648, -35487, 10668, -204661, -59114, 159646, 265163, -179412, 22141, -76222, 95898, -112282, 8358, 228086, 36926, -400571, -62026, 222223, 200681, -27258, 89158, -24628, 18942, -243489, -15145, -154161, 169318, -197097, -150669, -187144, 35786, -89985, 143045, -31426, -120279, -116275, -268410, -303658, -327227, -46679, 428789, -251093, -147974, 10572, 65148, 22637, 164895, -71423, -386952, 347326, -135641, 250383, -160388, -213299, 153378, 243365, -223720, -72978, 233979, -109032, 89476, -98465, -93911, -5359, -484096, 57721, 65016, -17854, -313692, -292931, -75989, 39303, -12484, 100963, -263177, -199089, 91224, -112683, -64250, 242089, -297488, -301325, 45773, 93480]
19173I3480g9958b3728A28117i7860A34307J70974a3105k11424d1133k9642A48494
19161B28786c89735A62071J00812q6778q6010m0132J23711a56596r7473L413a8480
19149h94F5279a34898H7294b3680C75949H9423b45398h972l94337g5867E8832
19137a86555L0442j01356G6182b35790i5310A51503A8966a29988A59860J98209
19127C58069a14620K9544A1295O8033d00195F0986h1463A69356f2856A05278f9421
19115g1571l5026j26199J03741A49594a56579C7368H550K21365H7231b89836A0820
19103H2004c81607a61740D9243K47369b22145J9394i8267o7593j75867P8921A47659
19091A96819b56287J0436D4614M2292b48829A30196c38214a51684C988K24598
$$ y = [93480, -79958, -23728, 128117, -97860, 134307, 305281, -13105, -224529, -41133, -70775, 148494, 228786, -389735, 162071, 262883, 176105, 90095, 49963, 173674, -156596, -254069, -250656, -18480, -894, 65279, -134898, 87294, -23680, 375949, 89423, -245398, -8972, -403309, -75867, 58832, -186555, -156113, -257469, 76182, -235790, -95310, 151503, 18966, -129988, 159860, 358069, -114620, -85076, 11295, 79328, -400195, 60986, -81463, 169356, -62856, 105278, -69421, -71571, -106597, -232796, -129055, 149594, -156579, 37368, 8550, 229915, 87231, -289836, 10820, 82004, -381607, -161740, 49243, 296612, -222145, -202751, -98267, -165860, -341727, -262806, 147659, 196819, -256287, -245851, 44614, 86906, -248829, 130196, -338214, -151684, 3988, 228586]
19081B28586B6452M71507b9329j15160G3601B1175b44770I0684J15747B5107g1039
19069G434i1211L9889C2731a02840c199B63840j0310C338b48857r6663a29166
19057A60295A84a60725m36363b92542g3996r5527D30507G4894e7646a6879A74737
19045b964n2935r1529e5740r20m4473k41564J57273A5484a02158J7644A78515
19033C56052d5190r9144I9964A6172J26313b66926A21362J37071A02710a23681
19022B67781A32855K6074a7309k17447A61894a23954d6711o455B27339b3908n5658
19011g9566j8772B70845a33697I7929a13435e0493n99206a11027B63291a64011
19000a09202b2932n5176b53j35119c0471H8359b30393c6268B21619b01065A02833
$$ y = [228586, 26452, 497959, -29329, -144489, 73601, 21175, -244770, 90684, 206431, 25107, -71039, 7434, -91211, -51322, 32731, -102840, -3199, 263840, 253530, 3338, -248857, -345520, -129166, 160295, 184, -160725, -597088, -292542, -73996, -169523, 430507, 74894, -57646, -16879, 174737, -2964, -55899, -147428, -55740, -56660, -101133, -342697, -185424, 15484, -102158, -84514, 178515, 356052, -45190, -144334, 99964, 16172, 142485, -266926, 121362, 258433, 102710, -123681, 267781, 132855, 158929, -17309, -234756, 161894, -123954, -46711, -53166, 227339, -23908, -79566, -98338, 270845, -133697, 97929, -113435, -50493, -649699, -111027, 263291, -164011, -109202, -22932, -78108, -253, -135372, -30471, 88359, -230393, -36268, 221619, -201065, 102833]
18988D3924h4208k27353B19859H4599e23966B04963l7450a5920l09160N7856d0294
18976A59382c8596q1202r4908h1821B7427Q8182b12223g9757A6080Q837O7776
18965I2693a22170m5569Q1522r9821L0219k56840K02668B62170G0390g9807q714
18954h8521r3736Q7472J3696r7981h8969j15227A92525a38974I5060a25988H7662
18942A45527e6107C53313a00115l10896e4694j91887n5778i0701k19791c1620
18931b65322B938a6859M691k58097A06328Q6353e946l56473A6413e51019A58178
18919c10371A1152d1206I0046H678b90338I6124P5006d6652k76274e6407E3145
18907a60810A43139i6524j52613e0851D1645Q3487k6799b09388j64262h0138c8192
$$ y = [43924, -84208, -311561, 219859, 84599, -523966, 204963, 167513, -15920, -325080, -267224, -40294, 159382, -38596, -119798, -214706, -81821, 27427, 115609, -212223, -79757, 16080, 24917, 92693, -122170, -167739, -86217, -186038, -155819, -412659, -209991, 262170, 70390, -79807, -88521, -182257, -94785, -81089, -179070, -88969, -204196, 192525, -138974, 95060, -125988, 87662, 145527, -56107, 353313, -100115, -411011, -54694, -246581, -302359, -90701, -310492, -31620, -265322, 2938, -16859, -12168, -270265, 106328, 192681, -5946, -362419, 16413, -551019, 158178, -310371, 11152, -41206, 90046, 8678, -290338, 96124, 171130, -46652, -322926, -56407, 53145, -160810, 143139, -96524, -249137, -50851, 41645, 125132, 98333, -209388, -373650, -80138, -38192]
18895A417a56534h552p1316A14496Q2954a37725b2942j67578A99752a63132C284
18883c41401J56915n5533E4151K9901A7201a01626j15639j7183D21795I2294g9937
18871a68787j40593h8583B61105f3060q4462A79868b03559I3006b31283c7985
18860A27354d75669a82137a6557r8303r9689A14893d36797B2645a03402l44956
18850d48358A67064b13784P1137B40190a27617m8904B37391c00890A21620e0768
18839c52966B9190a16584A16192j2872b59334O0683L6524C4141K29561a5237A34629
18827a69652B4857K16917b62669a20658M5672H0469J08692b54510B82965D4402
18816G4083J41810p4096J6194e6155B96074D9673J1023j5993b00316B5766b3555
$$ y = [1417, -156534, -8552, -79868, 114496, 197450, -137725, -22942, -190520, 199752, -163132, 3284, -341401, -184486, -240019, 54151, 84052, 17201, -101626, -217265, -234448, 421795, 92294, -79937, -168787, -309380, -88583, 261105, -63060, -147522, 179868, -203559, 93006, -231283, -37985, 127354, -475669, -182137, -16557, -114860, -214549, 114893, -436797, 22645, -103402, -448358, 167064, -213784, -142647, 240190, -127617, -176521, 237391, -300890, 121620, -50768, -352966, 29190, -116584, 116192, 103320, -259334, -198651, -162127, 34141, 263702, -15237, 134629, -169652, 24857, 241774, -262669, -120658, -74986, 80469, 189161, -254510, 282965, 44402, 74083, 215893, 141797, 157991, -56155, 296074, 49673, 60696, 44703, -200316, 25766, -23555]
18804a09016A88438H377b09685c711j38472K7872f21k12545f8315a8416A40366
18792a92431n0524g5543j43343O8549d7624A49074c10414a36328I482b10266j85288
18781c95554B26603a14392H5154N10290c22358A27468h3989c8122C6604c52171
18770b32390h8648k86729B02350d9967D7963A9859R6509a2063j97257Q9538A06863
18758C51118a37847k15505f2392B32208A6895b69324e8114E1777a67032k49307
18748d16339a32710b1831F2051j8394d7939J3275B631O7915b62166A45029b01818
18736i318l0668I7875J196f1465B72500L1888a64412m9066B13664q5989c2101
18724f8520j96249b9772l88619b8728j32829I9855a28637d3842A93360G8015b13989
$$ y = [-109016, 188438, 8377, -209685, -3711, -142183, -114311, -621, -213166, -68315, -18416, 140366, -192431, -242955, -75543, -218886, -150337, -47624, 149074, -310414, -136328, 9482, -210266, -395554, 226603, -114392, 85154, 595444, -322358, 127468, -83989, -38122, 36604, -352171, -232390, -88648, -375377, 202350, -49967, 47963, 19859, 116368, -12063, -209320, -119782, 106863, 351118, -137847, -353352, -62392, 232208, 16895, -269324, -58114, 51777, -167032, -416339, -132710, -21831, 62051, 43657, -47939, -34664, 2631, 70546, -262166, 145029, -201818, -9318, -39986, 97875, 99071, -61465, 272500, 304388, -164412, -213478, 213664, 127675, -32101, -68520, -264769, -29772, -418391, -28728, -161557, 99855, -128637, -43842, 193360, 78015, -213989]
18712A5245d2090j23184j63247a47876l5883B2902J49926g392k06572j1697C11297
18700I9833e9386j23586J6115k9947B833L24743n7275b95184Q1034A11874b18234
18688b75581a37476A2047a05512k5514c0343a43k05508j05255a05575k8526A47881
18676I9364k7396A3159d3107j25051J1644M7300l04300a45172B00164F7706k9600
18665C8106J57698b13003R9687E88772B0687d7093j65729B7165Q345h6214j08628
18654a94842j12405B32366a88331A57205G6846C293P0601e343G4229b44283M3756
18643b00527G7869K6276b2594l52588I1521C5622c47454M3165A6272a28524j88083
18632c16607O2749N6321j10785E5363d2339B1685b3853E4301L33605a35527j48803
$$ y = [15245, -42090, -165274, -328521, -147876, -183759, 22902, 172828, -7392, -213964, -225661, 311297, 99833, -59386, -182972, -166857, -196804, 2833, 327576, 270301, -295184, -214150, 111874, -218234, -275581, -137476, 12047, -105512, -131026, -30343, -143, -205651, -310906, -105575, -134101, 147881, 99364, 71968, 13159, -43107, -168158, -156514, -109214, -413514, -145172, 200164, 67706, 38106, 195804, -213003, -113316, 588772, 20687, -47093, -212822, 27165, 35510, -86214, -194842, -307247, 232366, -188331, 157205, 76846, 3293, 73894, -5343, 74229, -244283, -200527, 77869, 104145, -22594, -375182, 91521, 35622, -347454, -304289, 16272, -128524, -316607, -253858, -197537, -308322, 55363, -42339, 21685, -23853, 54301, 387906, -135527, -284330]
18621b84330e2499l91919a40398c2976o0856C3066J8046L7890Q7692b63807j15935
18610c79742B36458a87935A38170a24528B34217a6655j73006l7805j42545J23793
18600b46218O1930C33095A4163M3694c61656A8814a71487E9786R2591b71735L5527
18589b36208A16677l342Ph1823f450H2391d5513B8842C256d07932A77088a40665
18576b36528a07989k92065C18013E5870b33568g8966l61130B4273b55224a4171
18565G9526a19060N4282k9060B70425b95853a05789A53054a61554f1731k56607
18555c18338J54222I5205d22433D7878d5038A24360E3966b21210A1740K08381
18545B20121c99248J17897B6221K28261H9785a66919B0969N9843k1684g9149A40946
$$ y = [-284330, -52499, -444418, -140398, -32976, -93832, 33066, 51112, 89002, 176694, -263807, -379742, 236458, -187935, 138170, -124528, 234217, -16655, -189661, -227466, -370011, -246218, -184288, 333095, 14163, 57857, -361656, 18814, -171487, 59786, 152377, -271735, -236208, 116677, 113335, 113342, -81823, -6450, 82391, -45513, 28842, 3256, -407932, 177088, -140665, -236528, -107989, -400054, 318013, 55870, -233568, -78966, -440096, 24273, -255224, -14171, 79526, -119060, -64778, -93838, 270425, -295853, -105789, 153054, -161554, -61731, -318338, -164116, 95205, -422433, 47878, -45038, 124360, 53966, -221210, 11740, 220121, -399248, -281351, 26221, 254482, 89785, -166919, 20969, 80812, 59128, -79149, 140946]
18533a45327O2369j07788F3708d20755a8360C56379a44754N9070C5722b00689
18522h9714L0747k06704B20560n3881D129O658d4994H5805h0186B00195a75485
18510A32427a24391d0526B73220E0616c33582a14059m7429j0249M4034L6918E2516
18498A65069d6759j46978h9492l9965k07661H7556a48281A36146J46889a00130
18487c17549B5380a08172D3607K24057A28170g9928k27763i2334j7441o2447C6272
18475g1120k47493J07814A34475a1420k16229A3341a17639n376K4084J1016j48572
18464b36487A16573i5038B5630K6246g2069j20518g0088A32996l1276J75560G2813
18452e8062o2436l5239f5726p3322O0977A3764d3770D6819e74768d392A36089
$$ y = [-145327, -82958, -190746, 63708, -420755, -18360, 356379, -144754, -85684, 35722, -200689, -89714, -58967, -265671, 220560, 166679, 4129, 10787, -44994, 85805, -80186, 200195, -175485, 132427, -124391, -40526, 273220, 50616, -333582, -114059, -161488, -171737, -127703, -90785, 52516, 165069, -46759, -193737, -89492, -129457, -337118, 87556, -148281, 136146, 283035, -100130, -317549, 25380, -108172, 43607, 267664, 128170, -79928, -307691, -92334, -109775, -172222, 36272, -71120, -318613, -210799, 134475, -11420, -227649, 13341, -117639, -123015, -98931, -87915, -236487, 116573, -95038, 25630, 51876, -72069, -192587, -70088, 132996, 101720, 277280, 72813, -58062, -120498, -155737, -65726, -139048, -78071, 13764, -43770, 46819, -574768, -4392, 136089]
18440a11186c9731A23896a75578G7650P433c19438A18219A3595K2221a7402D68431
18428a56885I6943b05431H6842k9160j4135K26646J77414b07316l840j42437A54353
18416a88438A75612a10663j61350a14561d3786k89567c3520q5806E4390J79931
18406B34321j8986n4921Q1477Q9708F4492k28L7280P5821l6008F2054h1539H8843
18393d9078l7149m6811A01528a90848h6815k9630b9080B8373a40744N7141r8329
18382a81932K4169n5856B02237i9465A53642p972E6782a33423A99784h3301A51832
18370F103L45749a08688B0020L16942a68178D8355i9028A38200J89166i7880j84757
18359b82637i2038A24674b63652d6980j66166A30644J05432a55058c2170n9199
$$ y = [-111186, -39731, 123896, -175578, 77650, 85083, -319438, 118219, 13595, 35816, -17402, 468431, -156885, 96943, -205431, 86842, 57682, 43547, 270193, 447607, -207316, -211156, -353593, 154353, -188438, 175612, -110663, -272013, -114561, -43786, -333353, -33520, -119326, 54390, 234321, 215335, 160414, 241891, 331599, 64492, 64264, 101544, 177365, 141357, 62054, -81539, 88843, -49078, -86227, -133038, 101528, -190848, -86815, -116445, -29080, 28373, -140744, -83603, -181932, -157763, -213619, 202237, -99465, 153642, 145670, 56782, -133423, 199784, -83301, 151832, 6103, 351852, -108688, 20020, 336962, -168178, 48355, -99028, 138200, 327366, -97880, -282637, -92038, 124674, -263652, -46980, -213146, 130644, 236076, -155058, -32170, -91369]
18349i1369j6149K0580m922E9888b4954k4738E447b84710J40585B7201a14254
18337b2589A38685a39885N1589h705l3521E045N1476b33130f3105D5022a58043
18325A48818o3051b59181J05905O9669j58355I9323b46895g5377I4214b7076B65773
18313e3322H4437c87184J04525O1625B27058a27248m6317P4593j08715n4005B8906
18301h4840F2639r541a85496H8176c66817O0343A5736b55148j7802A27692d3198
18289c12500g3319B66923A05113A4980J00915R3520c04197B30631a19412B9018
18278f6495f394k73103J9012C1591b65095b1522C6654g6256q1685C7167a72952
18266b89996f3104B37920e3940l66080a22405D38235f8191j59407l3378J30419
$$ y = [-91369, -107518, -86938, -91860, 59888, -24954, -49692, 5447, -284710, -144125, 27201, -114254, -22589, 138685, -139885, -88296, -8705, -42226, 5045, 56521, -233130, -63105, 45022, -158043, 148818, 85767, -259181, -153276, -83607, -241962, 99323, -246895, -75377, 94214, -27076, 265773, -53322, 84437, -387184, -282659, -221034, 227058, -127248, -173565, -98972, -207687, -261692, 28906, -84840, 62639, 53098, -185496, 88176, -366817, -306474, 15736, -255148, -272950, 127692, -43198, -312500, -73319, 266923, 105113, 14980, 115895, 209415, -304197, 230631, -119412, 29018, -66495, -6394, -279497, -260485, 31591, -265095, -21522, 36654, -76256, -157941, 37167, -172952, -289996, -63104, 237920, -53940, -420020, -122405, 438235, -68191, -227598, -260976, -130557]
18256a30557m1317b9990k45140i0972M3003A1713a54036A87748B285e6817k6295
18245h3112D9911b19445d9693A23774a20293j38319M9853D5271e2587j93594A70402
18233A57345b68732G2992a61313F7757N005l2874O3818Q3821F2843a89350n3659
18222b43009K8790c7700j64407A06145b97405J05156A41689O5265A2811b03239
18211a26833K126A75163f7883J5790A05546B5577m022a58845K8184j1137B1140
18199H3430b16647g7309o5847q9319A8347P1936f5033n9174C26905D7143J54003
18188B01146a72305f7731c3430G8567b65036c0602A86559J01628j21932a7723
18177b12062A86019e9030j18899p3357b4261A1483a43974C72165a23390N3953
$$ y = [-130557, -171874, -29990, -275130, -90972, -47969, 11713, -154036, 187748, 2285, -56817, -83112, 49911, -219445, -49693, 123774, -120293, -258612, -208759, 45271, -52587, -246181, 170402, 157345, -268732, 72992, -161313, 67757, 72762, 39888, 103706, 187527, 62843, -189350, -243009, -214219, -37700, -202107, 106145, -297405, -192249, 141689, 206954, 12811, -203239, -126833, -124707, 175163, -67883, -52093, 105546, 25577, 21555, -158845, -130661, -141798, 21140, 83430, -216647, -77309, -143156, -232475, 18347, 90283, -65033, -124207, 326905, 47143, 201146, -172305, -67731, -33430, 78567, -265036, -30602, 186559, 288187, 166255, -17723, -212062, 186019, -59030, -177929, -251286, -24261, 11483, -143974, 372165, -123390, -69437]
18167f9437k5659E7967L38980o9403j05868J2086a41056E6319a3262B25037a91102
18155b98341A88221b89793B45674G8293c813j90552B58881a19622k30519e9715
18144A58198d9352A2989b97777e8568b5641j35808d2266R092j30923G3336c10476
18132e7485n8589A02519J8917a02164F1425B6003b06033b2032l3190I17d6622
18120G2334J01034A548h9803c135p3486j71169a3602B51039b16203A56907a15069
18108A95182n9558R0437G4888c9808q5137J9068B3600J59670c69127A15180a70412
18096c79066b3763B59325b44416a1252l88339B5073i2258G7098n208b48150E8271
18084a38235j02255G0004l391c60586k6856J36425J02010E8869J38158h9243A63351
$$ y = [-69437, -95096, 57967, 396947, 327544, 221676, 233762, -141056, 56319, -13262, 225037, -191102, -298341, 188221, -289793, 245674, 78293, -3813, -194365, 258881, -119622, -350141, -59715, 158198, -49352, 12989, -297777, -58568, -25641, -161449, -42266, -33174, -164097, 73336, -310476, -57485, -116074, 102519, 121436, -102164, 61425, 26003, -206033, -22032, -55222, 917, -46622, 72334, 173368, 1548, -89803, -3135, -76621, -247790, -13602, 251039, -216203, 156907, -115069, 195182, 135624, 226061, 74888, -39808, -124945, -105877, 23600, 183270, -369127, 115180, -170412, -379066, -23763, 259325, -244416, -11252, -399591, 25073, -92258, 77098, 71890, -248150, 58271, -138235, -240490, 70004, 66613, -360586, -387442, -251017, -149007, 58869, 197027, -89243, 163351]
18072a51421D0086c96798A74281a94448k9379H6736a04402d4399k15522E5262
18061h757o5909n7589D0017f3566j10630G3169a0321q403A56954A8323c6118A58091
18048B52347J2830K63668h0988j05740g1959A03446e0074B14732b76449E4900
18037e8262j6579J9758p8079A14461O3175E5889J59495A9286N8564a32002d0193
18025B87220a56956B26077K3574D2082J40044C4950I400c31327a8054A58789b16809
18013c2925C42026a84249i795j06293j20065B09443q2305b32931G2658a06927
18002a69733f065k0770A62237n2980c07605c5916k58236E3972b6523j01195O2351
17991f5367A3853a6682B6364e8726I7912e8290n5518e2253q951j1160l3061l76879
$$ y = [-151421, 40086, -396798, 174281, -194448, -223827, 86736, -104402, -44399, -259921, 55262, -8757, -74666, -132255, 40017, -63566, -174196, 73169, -10321, -18724, 156954, 18323, -36118, 158091, 252347, 265177, 528845, -80988, -186728, -71959, 103446, -50074, 214732, -276449, 54900, -58262, -74841, -55083, -133162, 114461, 177636, 55889, 215384, 19286, 77850, -132002, -40193, 287220, -156956, 226077, 249651, 42082, 182126, 34950, 9400, -331327, -18054, 158789, -216809, -32925, 342026, -184249, -9795, -116088, -236153, 209443, 127138, -232931, 72658, -106927, -169733, -6065, -26835, 162237, 109257, -307605, -35916, -294152, 53972, -26523, -127718, -65367, 13853, -16682, 26364, -58726, 97912, -58290, -113808, -52253, -61204, -72364, -105425, -482304]
17979d82304A59277k169c65294E9599a84372c9462B5420b77159a21165j02382
17969b23547L1870C8194f8150D51685a70408b5352A22612J8531l7077b65955q7379
17958c53334J01685L63E0171i8690A02207C0848P7328B2848J8011g6061a6399
17946i5029F6879a61555r170H7289D292a76954B02566b46810J22318m6533b6199
17934b60399a5802r4640k4554M0238a6143B66361N3990b29447j924i6211a0363
17922G2683d7926j0931j51839a02735F0823L6276J19147l0681Q3358g0978P526
17911f3452A6158J26153C345a70576C06537b70142r2065b4004F5840J6670J10670
17900A93180n7536b81995A51374a43437B7268N5084K82908a70029C8181J10667
$$ y = [-482304, 159277, 157108, -365294, 59599, -184372, -39462, 25420, -277159, -121165, -223547, -191677, 38194, -68150, 451685, -170408, -25352, 122612, 141143, 104066, -265955, -353334, -251649, -251286, 50171, -98690, 102207, 30848, 108176, 22848, 40859, -76061, -16399, -95029, 66879, -161555, -170725, 87289, 4292, -176954, 202566, -246810, -124492, -171025, -26199, -260399, -15802, -110442, -134996, -94758, -16143, 266361, 320351, -229447, -231371, -96211, -10363, 72683, -47926, -58857, -210696, -102735, 60823, 97099, 216246, 185565, 268923, -70978, -63452, 16158, 142311, 3345, -170576, 306537, -270142, -362207, -24004, 65840, 82510, 193180, 135644, -281995, 151374, -143437, 27268, 82352, 365260, -170029, 38181, 148848]
17890A48848f2962k6161k07035A22467K973h3230k121a6963j82598A4746N2617
17879F7363a34582B16292B3514i4319k13543A57662b775k16107J8036C2733a7587
17867d6763A19951J85881k2323G8506A1099l115i1204A54326a13187b3873o7498
17856i1371q3309B47313A00102b95676a30380A79693M0444H4136J45642j12600
17846A17178m8930b17487P7303c2801n24550a32330A3642c9097A94851c11896
17835C9195I214O1036d40180H4579K81550a94796A52728R8931j01685Q4634c73904
17823I9657e3742K6047A22245K26997r1664A9294a59569d5927n3477I1323J1614
17812A02937c30024O921B53381I9747e7813A51036j1723N9699a44215L9064A84544
$$ y = [148848, -62962, -89123, -296158, 122467, 125440, -83230, -85351, -16963, -199561, 14746, 67363, -134582, 216292, 23514, -94319, -307862, 157662, -2775, -218882, -200846, 32733, -17587, -46763, 119951, 305832, 283509, 78506, 11099, 7984, -91204, 154326, -113187, -23873, -91371, -174680, 247313, 100102, -295676, -130380, 179693, 220137, 84136, 229778, 117178, 68248, -217487, -140184, -32801, -557351, -132330, 13642, -39097, 194851, -311896, 39195, 9214, 70250, -440180, 84579, 366129, -194796, 152728, 251659, 149974, 234608, -373904, 99657, -53742, -27695, 122245, 349242, 257578, 19294, -159569, -45927, -99404, 91323, 102937, -330024, -323103, 253381, 99747, -57813, 151036, 139313, 199012, -144215, -105151, 184544]
17800b2228r5303F1385K58696a21376D9524K73919a73718j09649B50878m2544
17790B08334d3404I980b2543A8732a61363j71493Q5900j55612B5936J80617d7540
17778A56016B0241g4260B22373f3684b5137E6803c37225B509a79777J0781o9007
17767b38003A62026K5272N2883q1157B1281K08027b93082C86399a02193A46402
17756A18589P9882d4793q1965D5208a93738L7057b8683E5399d39322A18902a3543
17744d6861o4055I3590K71561a99678A18645l4085M7600J11161a68041C391K40879
17733B44270D7384K5806c52703I4718a23612C95476K0729G9412b46373G9676a14054
17721A2315J14092P4231M4509B0326g9257n7266H2291b16158e9801j19453k01486
$$ y = [-22228, -117531, 61385, 320081, -121376, 49524, 323443, -173718, -283367, 250878, 208334, -43404, 9980, -22543, 18732, -161363, -332856, -246956, -402568, 25936, 206553, -47540, 156016, 20241, -74260, 222373, -63684, -25137, 56803, -337225, 2509, -179777, -168996, -238003, 162026, 187298, 240181, 159024, 21281, 229308, -293082, 386399, -102193, 146402, 118589, 198471, -44793, -126758, 45208, -193738, -156681, -28683, 55399, -439322, 118902, -13543, -46861, -110916, 93590, 365151, -199678, 118645, 84560, 132160, 243321, -168041, 3391, 244270, 47384, 73190, -352703, 94718, -123612, 395476, 416205, 79412, -246373, 79676, -114054, 12315, 126407, 200638, 245147, 20326, -79257, -136523, 82291, -216158, -59801, -179254, -380740]
17710c80740B26682a69356M3250H6261a34473j04948d8820C8684J97553j05465
17700A30772a68178A68878l9528e7536A5198h2535A06052f0383H3405a38921D98140
17688d2519j73712F150J81465a22648B36317a33049C03144b08052G207J00410
17678A07617a5739m2172A0470K04840C202N5975J83576Q0206g9018D09496a9750
17666b18383f6720B86853E4932a68351A19758d3347A02096c00335B81662g0016
17655B06174J67294a32311A17379a18488b832A88695j5273m4773a65652C28973
17644E7023J73389c03749i7907A26786l19B2374J85022a43082M7070j03320c0146
17632B24497b7736a506A94050f2414n1703A78659c80674F0500N5115a13040r3012
$$ y = [-380740, 226682, -169356, -126106, 86261, -134473, -239421, -48820, 38684, 236237, 130772, -168178, 168878, 129350, -57536, 15198, -82535, 106052, -60383, 83405, -138921, 498140, -42519, -216231, 6150, 187615, -122648, 236317, -133049, 303144, -208052, 7207, 107617, -15739, -57911, 10470, 215310, 3202, 59177, 242753, 322959, -79018, 409496, -19750, -218383, -66720, 286853, 54932, -168351, 119758, -43347, 102096, -300335, 281662, -70016, 206174, 373468, -132311, 117379, -118488, -2832, 188695, 173422, 128649, -165652, 328973, 57023, 230412, -303749, -97907, 126786, 126467, 22374, 207396, -143082, -96012, -199332, -30146, 224497, -27736, -1506, 194050, -62414, -114117, 178659, -380674, 60500, 115615, -113040, -206052]
17621b06052A13010a72815m8315A64370a04618n55O522l2564j57168C5194e6791
17609g9636J0729K6450a4506j78448B36556b2476q6734o1867A67638C5499J73351
17598B08850G8234N338c15491H8598a23621B07147G580M04022D4544o652H89b2767
17585A99736G3058a63116k7179R2987B09278E9897g0620A16522K02937d1204j55427
17574a96631b7511a6k39484d0992A94600q3063a66997A9041K03915h1568k18522
17563c00090A35159n9821K94023h8550p3422H5569L61i4424B97101f1355C23600
17551a54525b8368B21404f9976A98728J4431b1519E7136a03511b1880C09452A20877
17539B60317a27640A32866b0153F0066K5022J13488J1954q8487J74572B1153L4813
$$ y = [-206052, 113010, -172815, -221130, 164370, -104618, -105173, -98651, -131215, -288383, 35194, -56791, -79636, -68907, -42457, -14506, -192954, 236556, -22476, -109210, -171077, 167638, 35499, 208850, 78234, 83572, -315491, 88598, -123621, 207147, 7580, 411602, 44544, 37892, 889, -22767, 199736, 73058, -163116, -190295, -97308, 209278, 59897, -70620, 116522, 319459, -41204, -196631, -27511, -16, -239500, -40992, 194600, 111537, -166997, 19041, 222956, -81568, -300090, 135159, 75338, 369361, -88550, -161972, 85569, 85930, -94424, 297101, -61355, 323600, -154525, -28368, 221404, -69976, 198728, 213159, -21519, 57136, -103511, -21880, 309452, 120877, 260317, -127640, 132866, -20153, 60066, 85088, 198576, 210530, 122043, 296615, 21153, 55966]
17528E5966Q9590p959b1146L237j3086q4382N1981A82400e3282B88616a6271C65189
17515a8155A13583J72715r2233M6419J0989j08365D5344N2101R6413c4988D5608
17503b20082B71468j17455a83090f6138A8693g9541G5266f2655G5185f3851h003
17491A23210E2281J6517N8797C1809a78694D1679Q7192J30308j15311g8754H947
17479c8708k3355D8923K02631b61364a18601B21220L1615H2306K46732j15549
17469B13489a8898A98713R431g1585D0618K79236A3207f5921B13323j05266k1795
17458H6262J77738G5406a90162D00279g1750A37518h7808C91301A90822J52923
17448C43745a07C02062L0038A36783p133J6630L06048j89127C2941a00732F16072
$$ y = [55966, 145556, 137597, -21146, -17909, -30995, -115377, -63396, 182400, -53282, 288616, -16271, 365189, -18155, 113583, 286298, 194065, 240484, 251473, 143108, 45344, 97445, 193858, -34988, 45608, -220082, 271468, 154013, -183090, -66138, 18693, -79541, 75266, -62655, 75185, -63851, -8003, 123210, 52281, 68798, 127595, 31809, -178694, 41679, 128871, 259179, 143868, -78754, 8947, -38708, -62063, 48923, 251554, -261364, -118601, 221220, 252835, 82306, 329038, 213489, -18898, 198713, 208144, -71585, 40618, 319854, 13207, -65921, 213323, 108057, 86262, 264000, 75406, -190162, 400279, -71750, 137518, -87808, 391301, 190822, 343745, -107, 302062, 332100, 136783, 129650, 146280, 452328, 263201, 32941, -100732, 616072]
17436F72870l17361i2014c6493A52863J14500P6178n9090j39962L8880G9746L13587
17425C93333C5322J72805a74404F99198B51299L1335q3039p2263J93144f0544
17414A32586i282D5175K66777c327E22058j51448j35731H772e9919k2025A85457
17402c8845q4636K4712b9619A35268l6185J75062K7309j39830J50462k0736H8555
17390B30465C6331O2961L64286A72212J24404L6945O2199A2135O0371J14796b5937
17378C03214H8234j2126M16684c2489m0305A32534Q3312J74675j7281c05215A09615
17366B74686r481r4313K7713R4133a10934B90591L6665e9855B74338H5416i1919
17354D56069b1775D08310A76947Q6921K281L2800j09679H9037K08692b3097C67601
$$ y = [672870, 355509, -92014, -36493, 152863, 267363, 343541, 284451, 144489, 183369, 79746, 393333, 35322, 208127, -174404, 699198, 251299, 282634, 199595, 127332, 320476, -60544, 132586, -9282, 45175, 311952, -3327, 522058, 370610, 234879, 8772, -59919, -81944, 185457, -38845, -123481, -98769, -29619, 135268, 99083, 274145, 301454, 161624, 312086, 291350, 88555, 230465, 36331, 99292, 463578, 172212, 296616, 333561, 395760, 12135, 72506, 187302, -25937, 303214, 88234, 76108, 492792, -32489, -72794, 132534, 215846, 390521, 373240, -305215, 109615, 274686, 265205, 170892, 198605, 292738, -110934, 290591, 327256, -59855, 274338, 85416, -91919, 456069, -21775, 408310, 176947, 263868, 266149, 298949, 189270, 89037, 297729, -23097, 367601]
17342a6459A21477l0214a02254L1827A66413h2851B70102I5672k631K4175P6150
17331A93366k4246A8960g7685B77542J32193n0335F0735N8834J02819b9881D7795
17319C34963j51822c7929B86658A23608J32001b3545k05A58558K3024J56136l0848
17308C06870K91700b43626A01604J76676a79708A94737j6385K45699f1902j4668
17298g6570A95439h4201D6955k3173L13404a28279A2496L7628L13870a52162A00904
17286B40377f9729C7262h4734E22657F1610J42212q5777N2306J96894D168J40659
17275A44827Q9345m5710J88760A34796a40348D75451I2920c4008A21602R677k6861
17264A04418J18443j08689a58280C95031j72175a0574D27845B05447E0898L30936
$$ y = [-16459, 121477, 91263, -102254, -70427, 166413, -82851, 270102, 95672, 93041, 117216, 193366, 169120, 18960, -77685, 277542, 409735, 359400, 60735, 119569, 222388, -29881, 47795, 334963, 183141, -37929, 286658, 123608, 255609, -23545, -23750, 158558, 181582, 337718, 306870, 598570, -243626, 101604, 278280, -179708, 194737, 178352, 424051, -61902, -76570, 195439, -84201, 46955, 23782, 337186, -128279, 12496, 50124, 363994, -152162, 100904, 240377, -69729, 37262, -84734, 522657, 61610, 203822, 118045, 170351, 367245, 4168, 144827, 234172, 188462, 377222, 134796, -140348, 475451, 92920, -34008, 121602, 131279, 104418, 222861, 114172, -158280, 395031, 222856, -10574, 427845, 205447, 50898, 381834]
17254C81834J2975d5225G5431a4409B3153J96373A06485P8938O9847O4423a05135
17242G2041B5526L16117m1882b9880E7975K86198i501A41491L41584j50295j62645
17231A70135m9155i5376F3239j4085J73840D3318J75954K6530j4903P7464q376
17220B99987b30830C25634l4933J55037B01169R6013j37475L79586B43571K98589
17210E42160A20168J53221A09737M86382C5114J59527P5272j4778M0289P4163
17200C69587n7471o8991N50612k86006B31080b1237A63436o0573L4601n6024M4821
17189A26261F0455O0065J79755A21383J28512n6871j3400K21788C0806M49550
17179D80356G9963K79095o5922A14739K7359j3877L14212L5723A2706M46953q2315
$$ y = [381834, 394809, -45225, 75431, -14409, 23153, 219526, 106485, 185423, 255270, 319693, -105135, 72041, 25526, 341643, 299761, -29880, 57975, 344173, -9501, 141491, 483075, 332780, 170135, 120980, -95376, 63239, 49154, 222994, 43318, 219272, 245802, 230899, 308363, 299987, -230830, 325634, 290701, 445738, 201169, 297182, 159707, 539293, 243571, 542160, 120168, 273389, 109737, 596119, 35114, 194641, 269913, 255135, 295424, 369587, 312116, 243125, 793737, 507731, 231080, -21237, 163436, 102863, 137464, 81440, 126261, 60455, 120520, 300275, 121383, 249895, 193024, 179624, 401412, 30806, 480356, 79963, 359058, 293136, 114739, 142098, 128221, 442433, 478156, 12706, 459659, 377344]
17168C77344J25831H7585r607M25186A28581O8727K85568j65575p6554J67398
17158D08145l6700J2886A06724D9157J85732J10694H3216Q2418J85677J25484
17148D76795k09135d8842E12746j95331J53383F1906J26346O8077A15060k1810
17138I3250N51297k89334A33007Q0138l7102M7977K4122J78784A45632L29261
17128D74893A34686J41239J66314J36729q9896j83658L81636C02618k1856P5339
17118C56101q4141J27340M81547k22413A85928J87693j15294K93706k31428k9587
17108B91018A32057P9620K20585A38748K43130R7826p0263J06228k28623m665
17098B82381J97105j08891R4590M8210j75307l3284M89595B83063J08241M6603
$$ y = [377344, 503175, 87585, 77978, 503164, 128581, 197308, 482876, 317301, 240747, 408145, 371445, 384331, 106724, 49157, 234889, 345583, 83216, 165634, 351311, 476795, 267660, -48842, 512746, 317415, 470798, 61906, 188252, 256329, 115060, 93250, 644547, 355213, 133007, 213145, 176043, 224020, 248142, 426926, 145632, 474893, 134686, 275925, 442239, 578968, 489072, 305414, 687050, 302618, 280762, 356101, 271960, 399300, 880847, 658434, 185928, 373621, 258327, 552033, 320605, 291018, 132057, 211677, 432262, 138748, 381878, 479704, 409441, 515669, 287046, 282381, 479486, 370595, 465185, 513395, 338088, 304804, 794399, 283063, 391304, 437907]
17088D37907A67553J62051o7525J99877J99152B98022A22063L53909H8009M1635
17078A29644K25612J10590N8981j36561J82762J64800B81837J59129p8787l9553
17068C22626J28031J69661l00559K99218M7344k81804A40809N28065l28145K57270
17058E97999k86193K19024j74664K18271k1578j21340K76985k23367J09047k0348
17048E73836B32995L65940j00066r3189K93885l30772L68689L5980l79027N4148
17038D48583L7557L46065k89877J50715p1223j00203K59057K18203m30658l0217
17028E38002j53537M15290B24676M34960J85415o0645l04434K06445J05065N610
17018G97092j16644K26339j06366r5030j03260M48225l55864j309M3588R1610
$$ y = [437907, 167553, 329604, 262079, 461956, 661108, 298022, 122063, 475972, 88009, 129644, 355256, 465846, 524827, 388266, 571028, 735828, 281837, 440966, 362179, 322626, 450657, 620318, 319759, 618977, 666321, 384517, 140809, 668874, 340729, 597999, 311806, 530830, 356166, 574437, 552859, 431519, 708504, 485137, 594184, 573836, 232995, 598935, 498869, 405680, 699565, 368793, 737482, 773462, 394435, 448583, 486140, 832205, 542328, 693043, 621820, 521617, 780674, 998877, 568219, 538002, 384465, 799755, 224676, 659636, 845051, 784406, 479972, 686417, 791482, 797092, 680448, 906787, 800421, 705391, 602131, 1050356, 694492, 693183, 736771, 828381]
17008H28381D04850R3034M15645L6024r6588j95993q6896o1044J75663n6025j1429
16997F17241j31415O8584J67206J13503j04995l391K84574m25531L16083D12078
16986I29896j35164L04321K5514o9943E14546L85571R6177j66130O7999j15190
16976G82973J2349l714J72199J12753j28311J23405k26718J78919o4027j73112
16966G86716L60083E72774L26555n4756m3257K46456o1182L2590k68086J83305
16956I34399j45390K18813M93577m72493j07222K52350j30154J48274j31430j79843
16946H80881L54163m41968L36497J18319k30501J21071P4404l68250M59923K6285
16936A330824j895k65980K48886j0326l1392Q8217O8570l27144j14155K90601
$$ y = [828381, 404850, 497884, 913529, 949553, 852965, 656972, 570076, 509032, 684695, 628670, 617241, 485826, 554410, 721616, 835119, 730124, 726733, 1011307, 585776, 901859, 412078, 929896, 794732, 1099053, 1124567, 1054624, 514546, 900117, 996294, 830164, 898163, 782973, 795322, 791608, 963807, 1076560, 948249, 1071654, 844936, 1023855, 959828, 786716, 1146799, 572774, 899329, 844573, 801316, 1047772, 986590, 1019180, 751094, 934399, 789009, 1007822, 1501399, 1028906, 921684, 1174034, 1043880, 1192154, 1060724, 880881, 1235044, 793076, 1129573, 1247892, 1017391, 1138462, 1212866, 844616, 1304539, 1330824, 1328929, 1062949, 1311835, 1301509, 1270117, 1358334, 1426904, 1099760, 985605, 1276206]
16926A276206K0162K38570l28974J78347K29040k25765P3381k8677K5349j03000
16916A354639L98625m86643K85529j06772q5234J79981n00555Q20023n82658P6002
16906A352937J69351j9878M706K70138J42341J67521j98280R0453l32608l9351
16896A607330K72710n10543N01994k42163J74500K66466r9751O5558L1376j53209
16886A914268k6298O0093J69459Q0179k9223o2993K56489R3520j91374k89588
16876A974532K85310J94389o3642j90500K91370P193k3262k76691L31726m38043
16866B092382L05551m1761J87599Q3324j82145J44793K20407k80158M21464j07062
16856B844394m8021J54546P3501J22087J43777k39792J7399J61231j59728L25105
$$ y = [1276206, 1296368, 1534938, 1205964, 1384311, 1613351, 1387586, 1460967, 1432290, 1457639, 1354639, 1753264, 1266621, 1552150, 1445378, 1360144, 1540125, 1039570, 1859593, 1276935, 1352937, 1522288, 1502410, 1507116, 1777254, 1919595, 2087116, 1888836, 1979289, 1646681, 1607330, 1880040, 1369497, 1871491, 1629328, 1803828, 2070294, 1970543, 2036101, 2067477, 1914268, 1887970, 1948063, 2117522, 2197701, 2168478, 2105485, 2361974, 2455494, 2264120, 1974532, 2259842, 2454231, 2390589, 2200089, 2491459, 2498652, 2475390, 2198699, 2530425, 2092382, 2397933, 2356172, 2543771, 2627095, 2444950, 2589743, 2810150, 2529992, 2951456, 2844394, 2796373, 2950919, 3024420, 3146507, 3290284, 3050492, 3067891, 3229122, 3069394, 3394499]
16846C394499p1043J64825J74327O3623j76279J3034m4961J90985K06984k20412
16836C695582K48665j21965J49696J91438K16106j47100K58476m19411L42000
16827D413487m50K32084J46106l83524O03733m6927O4109J56551p8459j00038
16817E006672Q37489l10928n0642L57437O7557J07386j28041J83599M14838q7531
16807F397836J14146M02494J98037o8254K81883L46982k64130K16149N52948l41722
16797G836369K54799K23976Q77414j74779n5P85015j49552K88272L02344M8105
16787A0291908N61073J66387J33051K86363L44946L66779K57823N68321N75853
16778A3552504O7601M06312N94971L48988P01820J79798R52032J25473O16154
$$ y = [3394499, 3323456, 3488281, 3662608, 3726231, 3549952, 3562986, 3518025, 3709010, 3915994, 3695582, 3944247, 3822282, 3971978, 4163416, 4379522, 4232422, 4490898, 4071487, 4413487, 4413037, 4645121, 4791227, 4407703, 5011436, 4964509, 5028618, 5185169, 5106710, 5006672, 5844161, 5533233, 5482591, 5840028, 5907585, 6014971, 5886930, 6070529, 6485367, 6397836, 6511982, 6914476, 7112513, 7044259, 7326142, 7673124, 7408994, 7625143, 8178091, 7836369, 8091168, 8315144, 9192558, 9017779, 9017724, 9802739, 9653187, 9941459, 10243803, 10291908, 10852981, 11019368, 11152419, 11438782, 11783728, 12150507, 12408330, 12976651, 13552504, 13620105, 14026417, 14621388, 14970376, 15672196, 15851994, 16804026, 16929499, 17545653]
16769A7545653N42073J022507L53549P56286J268487K86458R15266R33929Q28722
16760B4452930J260482J152183J005588J305442P66846J545468J814237J151277
16752C4454453K058371J437717J830336J977556K038713K764798K288865K449714
16744E1300523L155635K954603L708870L171054M050608M122947M302825M830048
16736H1597113N280824N795670N693829O316220O474672P642197P424518P880349
16728A34105392Q498851Q276246Q914580Q537395Q402947P993230P486151N961463
16720A98176255N364157L726010K875280P51679n52503k903360l692169n035653
16712A98709696o651067p102114p973022q644431q946244q644547q909823q639789
$$ y = [17545653, 18087726, 19110233, 19463782, 20220068, 21488555, 21775013, 22690279, 23624208, 24452930, 25713412, 26865595, 27871183, 29176625, 29943471, 31488939, 33303176, 34454453, 36512824, 37950541, 39780877, 41758433, 43797146, 46561944, 48850809, 51300523, 54456158, 57410761, 61119631, 64290685, 68341293, 72464240, 76767065, 81597113, 86877937, 92673607, 98367436, 104683656, 111158328, 118800525, 126225043, 134105392, 142604243, 150880489, 159795069, 168332464, 176735411, 184728641, 192214792, 198176255, 203540412, 207266422, 210141702, 210893381, 210340878, 207437518, 203745349, 198709696, 192058629, 184956515, 176983493, 168339062, 159392818, 150748271, 141838448, 133198659]
16704A33198659q176408q091533p194965p496589o656649o131994n631671n232769
16696G8586081m939522m415680m303107l750588l638033l518081l101917k809449
16688D8109704k362002k782977k047251k328856j780500k057674j241019j462969
16680C2046456k022849j204694j390732j239475j104953j140793r86036j120507
16672B1836417p56908r23788q69584r30649n09069o65999m87357n86993n74929
16663A5531141m59041p32773k50004p99381m44274l47679l50482n45762l69367
16654A1232378m84956j82152l31146k84815j73319m12420l06682r4916p2595m05785
16644H483592o11487K01183o36679L11241l29665l07035l08099k32629r2011L2500
$$ y = [133198659, 125022251, 116930718, 109735753, 102239164, 95582515, 89450521, 83818850, 78586081, 73646559, 69230879, 64927772, 61177184, 57539151, 54021070, 50919153, 48109704, 45747702, 42964725, 40917474, 38588618, 36808118, 34750444, 33509425, 32046456, 30023607, 28818913, 27428181, 26188706, 25083753, 23942960, 22956924, 21836417, 21079509, 20155721, 19286137, 18355488, 17846419, 17180420, 16693063, 16106070, 15531141, 15072100, 14339327, 14089323, 13289942, 12845668, 12497989, 12147507, 11601745, 11232378, 10747422, 10565270, 10234124, 9949309, 9775990, 9363570, 9056888, 8961972, 8889377, 8483592, 7872105, 8073288, 7436609, 7747850, 7418185, 7111150, 6803051, 6570422, 6478411, 6510911]
16634F510911l78882P0284j49901k07569p17911L33893k8476k10573o8778o4700
16624E088298l92588L45128j8675k54873k99881l08951K68857n67157J48876Q2661
16614D091695j95974J28070k43560N776L2502J68801n36877p7802K99676l70832
16604C301475j55482J50578L3788j92323l78925K08270K8141l65144O2506K34107
16594B926991k41757J43840q3871l35626J88443J58257k04637j77018l30563K00052
16584B244111j97270K38683m19773J21702J73397K31637m33835l1476Q2231J34352
16574B143759R3713j24648o2053l88488j4382M56363m20681J83015k22142o1482
16564A582974Q8426j44464n1693J09014p5419j8668n4534p3017K74337j42838
$$ y = [6510911, 6132029, 6202313, 6052412, 5844843, 5126932, 5460825, 5432349, 5221776, 5152998, 5088298, 4695710, 5040838, 5022163, 4767290, 4467409, 4158458, 4427315, 3860158, 4009034, 4091695, 3895721, 4023791, 3780231, 3786007, 3818509, 3987310, 3450433, 3372631, 3672307, 3301475, 3145993, 3296571, 3330359, 3138036, 2759111, 2967381, 2995522, 2630378, 2692884, 2926991, 2685234, 2829074, 2745203, 2409577, 2598020, 2756277, 2551640, 2374622, 2044059, 2244111, 2046841, 2285524, 1865751, 1987453, 2160850, 2392487, 1958652, 1927176, 2009407, 2143759, 2237472, 2112824, 2050771, 1662283, 1647901, 2104264, 1683583, 1866598, 1644456, 1582974, 1671400, 1526936, 1475243, 1584257, 1508838, 1490170, 1435636, 1362619, 1636956, 1494118]
16554A494118J88775m5046l20005j21340J15028K26407l08045L10366m57687K21129
16544A303700k4967M1683k39589J27469k13979J3462k52415N25099k17185l35097
16534G28181J34031J18647M5165L23021k98607J1727D53585N88891k6728M0684
16524A056432J06010k90154M23894n00801J06767N5420k75010m5434K37141k14369
16514F59896K24943j31645R8930k26830L28445j09579j81468K33894j98975k5629
16504F71982R9255r0015K2613K2519J48841j93319j3784l7980q2344j14567M36348
16493H69549l0989k29947J20985j08024K20237l55045k33174M73845J9614j81823
16483E65228L6206M1999j21944L73680D23076K13498q1839p5600A91474K93547
$$ y = [1494118, 1682893, 1637847, 1317842, 1196502, 1311530, 1537937, 1229892, 1540258, 1082571, 1303700, 1278733, 1320416, 1080827, 1208296, 994317, 1007779, 755364, 1280463, 1063278, 728181, 862212, 980859, 1026024, 1349045, 1050438, 1062165, 453585, 1042476, 1015748, 1056432, 1162442, 872288, 1296182, 795381, 902148, 957568, 682558, 637124, 874265, 659896, 884839, 753194, 852124, 625294, 953739, 844160, 662692, 896586, 697611, 671982, 771237, 681222, 703835, 726354, 875195, 681876, 668092, 630112, 547768, 433201, 869549, 838560, 608613, 729598, 621574, 841811, 486766, 253592, 727437, 747051, 565228, 601434, 643433, 521489, 895169, 423076, 636574, 554735, 479135, 191474, 485021]
16473D85021P9266j0362J76402q0517l9022N0511m0346j32431J75169B62486J1614
16462B74100K48033J98163k48884N13333D31753p2240k5457J69254J67192l8942
16452F31560C05181K45641A2412M75518M6059k41531N3046J80399j57856j61723
16442B06324N54916C21170J82034R0970k10997J34521A41362L77593B23887K60466
16432D84353O5906M5120k26924J28920K825j16194o0558H5768K26275j55996L48716
16421E04763k34553J913G5330K10628A39700j3208n1545M73025C6226M69625A85676
16409B72755N2006n7691P9134m8614k7708J18793L75555B9343J12130k254L1429
16398A70648R9597K12997A36363l7581K67703A62996L17945A82949c5193G7058
$$ y = [485021, 564287, 553925, 730327, 649810, 610788, 661299, 620953, 488522, 663691, 262486, 274100, 522133, 720296, 471412, 984745, 431753, 359513, 334056, 503310, 670502, 631560, 305181, 550822, 12412, 487930, 533989, 292458, 345504, 525903, 368047, 206324, 761240, 321170, 503204, 594174, 383177, 517698, 141362, 518955, 223887, 484353, 550259, 595379, 368455, 497375, 500200, 384006, 323448, 85768, 312043, 156047, 504763, 270210, 272123, 75330, 285958, 139700, 126492, 74947, 547972, 36226, 505851, 185676, 272755, 324761, 267070, 346204, 297590, 269882, 388675, 764230, 29343, 141473, 139219, 170648, 270245, 483242, 136363, 98782, 366485, 162996, 480941, 182949, -35193, 77058]
16387D34171l5475M474E9111L26066E9483M00729n8448j85503Q3369J89382A47367
16375E43498A23984M0087N2021h9206A5440P0962M6801E2470K79685K7932c0100
16363D13283A32588Q5788j01743l7723J96911F1821O6236J18691J1649j29148
16353A29249P920K164i965A25957R0645C4631j3233g3827C49060C7735b73731
16341A79180J33007n8365P0171F8607R7190G6802b1305r366I2583M23209A83988
16329B53245D8509K22129a00255A97318r2530K94887a384C20122A05953A8212
16318A65305J58898B2380J7628i819j7735j13818e3414C45482g5636F33968a72829
16306c19072A53157J839g8752B31069B0526g4536A72609H1550L4226K17879J1208
$$ y = [434171, 398696, 403170, 59111, 385177, 59483, 460212, 401764, 216261, 299630, 489012, 147367, 543498, 123984, 164071, 216092, -89206, 15440, 86402, 133203, 52470, 332155, 360087, -30100, 413283, 132588, 218376, 116633, 78910, 275821, 61821, 128057, 246748, 258397, 129249, 137169, 139333, -9965, 125957, 216602, 34631, 21398, -73827, 349060, 37735, -273731, 179180, 312187, 253822, 323993, 68607, 165797, 76802, -21305, -30671, 92583, 515792, 183988, 253245, 48509, 270638, -100255, 197318, 104788, 399675, -1384, 320122, 105953, 18212, 165305, 324203, 22380, 40008, -9819, -27554, -141372, -53414, 345482, -75636, 633968, -172829, -319072, 153157, 154996, -78752, 231069, 20526, -74536, 172609, 81550, 115776, 333655, 344863]
16295C44863p8409A01472a29860l4588I4106j8237B3240c575C28806k9809G154
16283E9635n276e18432D52J61854J77962A22502R8466a03649B55669r3788b40930
16271A10107R4024G5184l1325K16381o4995b71299D4130O9616M7950n656RJ16121
16259B72170A9895K5280b68918B0374J0029L1844J83507O3676h0636J3085l95909
16248d63460B16320F2695k6095a73756k2811e1454D2702h9842j88651C45177C1420
16236F7906J96928F4280b45265D055J2758L28312b43550H1594J2380L47753A31530
16224a38268A95376a63889C39475b3278m0785H3217k3572K04587F3199a26899
16213C2273K58378G7501g5461l87811b5160j94540e3993A00929N6610J53762b72518
$$ y = [344863, 266454, 101472, -129860, -164448, 94106, 75869, 23240, -3575, 328806, 298997, 7154, 59635, 54359, -518432, 452, 162306, 340268, 122502, 220968, -103649, 255669, 161881, -240930, 110107, 204131, 75184, 43859, 260240, 195245, -271299, 44130, 113746, 161696, 156040, 156049, 272170, 19895, 45175, -268918, 20374, 30403, 62247, 245754, 309430, -80636, -67551, -463460, 216320, 62695, 36600, -173756, -196567, -51454, 42702, -89842, -278493, 345177, 31420, 67906, 264834, 64280, -245265, 4055, 16813, 345125, -243550, 81594, 93974, 441727, 131530, -138268, 195376, -163889, 339475, -23278, -64063, 83217, 59645, 264232, 63199, -126899, 32273, 290651, 77501, -75461, -463272, -25160, -219700, -53993, 100929, 157539, 311301, -272518]
16201g1230m2265B72721b86593h5747j25583E8852a60823e5974C90301A12066
16190A51837a08514j7270b1470k002j53624e0335A25816j7791a9544l28919A15863
16178a86250A31830C727L68033I7430j939h8078E2155K94409A03875m9347P3146
16167A27674J95835B8923A1225e7055G7630k9926g5396I5424K4613J71646h2253
16155a09075C71566j70414a21337K5487B46137G375b17313A60010E5470k0770
16145C4700c36886A29070B8347J27193J46854F0376J84100b36581A94386b682
16134f4067k36962M9420j4941n0729A38855c41059Q5503B56035a44746I6999c7322
16122i958k41731C18345j54622a71973M8478I3038J47492i3895C8593J19366b93469
$$ y = [-71230, -113495, 272721, -286593, -85747, -211330, 58852, -160823, -55974, 390301, 112066, 151837, -108514, -125784, -21470, -23472, -177096, -50335, 125816, 108025, -19544, -348463, 115863, -186250, 131830, 3727, 371760, 97430, 95491, -88078, 52155, 346564, 103875, 54528, 127674, 323509, 28923, 11225, -57055, 77630, 47704, -75396, 95424, 120037, 291683, -82253, -109075, 371566, 201152, -121337, -95850, 246137, 7375, -217313, 160010, 55470, 34700, -336886, 129070, 28347, 155540, 302394, 60376, 244476, -236581, 194386, -2682, -64067, -301029, -251609, -266550, -317279, 138855, -341059, -255556, 256035, -144746, 96999, -37322, -9958, -251689, 318345, 163723, -171973, -123495, 93038, 240530, -93895, 38593, 157959, -293469]
16110B95846G5443c10058A10584b62313J00821n8587A31894E9281K99997p9582
16100B79696A05241B7606h2419j8220C0298b63596m885C6263b12973D2019h7711
16088b10054o2894k9916a39034B18767C58b9581j5565j09925j29712B42519a3411
16076a8738A11049a45491B4080J34913a60664B6607b5180k39898I9487a86417
16065A11123B5516i7605A17574L5671b51960i7877d3270j81401G6596K33258c31834
16053b8530p3221B04888p4245i2157L1663a9401j87704h0186m75263A49446a02583
16041i0699c8819A71975H0585b71174M1224g5845o3255M1794m149j7949A42235
16029a89732k9893A08630d6391b0335e194C3861c70817G7501b31185q2323A76488
$$ y = [295846, 75443, -310058, 110584, -262313, -161492, -220079, 131894, 59281, 359278, 279696, 105241, 27606, -82419, -100639, 30298, -263596, -268481, 36263, -212973, 42019, -87711, -210054, -272948, -302864, -139034, 218767, 358, -29581, -45146, -155071, -284783, 242519, -13411, -18738, 111049, -145491, 24080, 158993, -160664, 26607, -25180, -265078, 99487, -186417, 111123, 25516, -97605, 117574, 153245, -251960, -97877, -43270, -224671, 76596, 309854, -331834, -28530, -101751, 204888, 130643, -92157, -60494, -19401, -207105, -80186, -555449, 149446, -102583, -90699, -38819, 171975, 80585, -271174, -229950, -75845, -139100, -97306, -101455, -119404, 142235, -189732, -219625, 108630, -46391, -20335, -5194, 33861, -370817, 77501, -231185, -313508, 176488]
16017A01335g0961j73746j07825J35175A23608f1643A75959m7297A3751J23703
16007A37454a07243j48278A78833H2681b13989j43309H0312O6329Q4682a3375
15996d60140a59915d8502B10340a62062l28746J88197A56908n7713e8576j03622
15986a62198B76287I8339J06977Q9025a71174C40466n7684J89297j54926J2501
15976C29654j43638J24159A22914b3121j9747G4260j3959J5309J21413f1468A00821
15964c91237h8202D73073r5660a83582G2209n973j9094a54034j60582h970k90716
15953b99686A46584b16400j8969N1555O2635j12754A10849A625P7477d6881k7833
15942g4714j69037A08835h2626B27787c8134m70489B19757r6549c6629l9513j66840
$$ y = [101335, -70961, -244707, -352532, -217357, 123608, -61643, 175959, 128662, 13751, 137454, -107243, -255521, 178833, 82681, -213989, -357298, 80312, 146641, 231323, -13375, -460140, -159915, -48502, 210340, -162062, -490808, -302611, 156908, 99195, -58576, -162198, 276287, 98339, 205316, 294341, -171174, 340466, 282782, 472079, 317153, 329654, 186016, 310175, 122914, -23121, -42868, 74260, 60301, 75610, 197023, -61468, 100821, -391237, -88202, 473073, 377413, -183582, 72209, 66236, 47142, -154034, -314616, -8970, -299686, 146584, -216400, -235369, -183814, -121179, -233933, 110849, 1625, 79102, -46881, -74714, -243751, 108835, -82626, 227787, -38134, -508623, 219757, 123208, -36629, -76142, -242982]
15931b42982a14123j75755B35363q0280a97946Q9992c9549j37183g9868r4442
15921a74310k10692J72680B1880L3977a59784A64769G0721b92060A62793i8752
15910c23116B18364a07094C2884e8261j9207p6920F3204e8245I8762J08127R9118
15899C06007b58866A95656d7479A07387A8815f23k91998l4430P4783K374J08163
15888a41731d825k2415A14567f8415k13353b9683B81405c02893D692J12211c10821
15876f0577D887M2349a81799j09093i3136j31020b4370B53122E6266b13676h1466
15864B29590a4822k32535A7601N9960b48490e9206p2471J6987c2584G7170J12051
15853A89221i0947A51713q415F0737a46459b6494G7547a80972k82337A85772g6176
$$ y = [-242982, -114123, -289878, 235363, 155083, -197946, -107954, -39549, -176732, -79868, -174310, -385002, -212322, 21880, 55857, -159784, 164769, 70721, -292060, 162793, -98752, -323116, 218364, -107094, 32884, -58261, -77468, -154388, 63204, -58245, 98762, 206889, 306007, -258866, 195656, -47479, 107387, 18815, -623, -292621, -327051, -252268, -249894, -141731, -4825, -27240, 114567, -68415, -281768, -29683, 281405, -302893, 4692, 116903, -310821, -60577, 4887, 47236, -181799, -290892, -93136, -224156, -24370, 253122, 56266, -213676, -81466, 229590, -14822, -247357, 17601, 77561, -248490, -59206, -131677, -114690, -32584, 77170, 189221, -90947, 151713, 143298, 60737, -146459, -26494, 77547, -180972, -463309, 185772, -76176]
15841a94052B53746O7344A11379i1119b7262r8849F0394a63417J1874e9415A22358
15829b43667f2425B09625b67720E8512K1339d1708B5136P6333a83893A2401J78079
15818A90480q7672c5051C53998a9359A40258D4535b16852B2056c42877J1879B41338
15806a8166k48558c528D633J5910q813c10351B04725b0153j05873p14c2874j36836
15794a69710A57005a9852A06912l9813c89900E4183B3801l698b81425F437a66616
15782a7393B54399A04717b3706j37588A74636q6807a22476q9600A39918N2229
15772A92147D5643N0520b73890C13282a38219A2372c07116a36791p7811P0282
15762a44320b6945j64812K1537A69529a09281l46967A11849k9077N7533Q6281
$$ y = [-194052, 253746, 321090, 111379, -91119, -27262, -126111, 60394, -163417, -151543, -59415, 122358, -243667, -62425, 209625, -267720, 58512, 79851, -41708, 25136, 101469, -183893, 12401, 190480, 102808, -35051, 353998, -19359, 140258, 44535, -216852, 22056, -342877, -330998, 241338, -18166, -266724, -3528, 4633, 20543, 11730, -310351, 204725, -20153, -126026, -126740, -32874, -169710, 157005, -19852, 106912, 67099, -389900, 54183, 23801, 20103, -281425, 6437, -166616, -17393, 254399, 104717, -23706, -161294, 174636, 87829, -122476, -212076, 139918, 192147, 45643, 96163, -273890, 313282, -138219, 12372, -307116, -136791, -214602, -144320, -26945, -191757, -170220, 169529, -109281, -456248, 111849, 82772, 140305, 226586]
15752B26586A03781c59464g0319k7955r0187A05492A7658g1492B95726I8433a79740
15740b14128d5204G1293J71238g8980D5505K4149J6712e3022A97280q0855e0156
15728d1789j30759N2888f372H2292K46208a23908B6122a92012B21606j09279b50265
15716A52602d52042J31117a59808h633o5317A04075a01723J7196L1304c304j48747
15705a52051a5468A35294C7701O24b37763D7007J51633C8390A3215a52448I5986
15693F236O4386c0718j56562f7332A85391C8013O8064L25045b25090b7173n2007
15682g9180A41722d848j21181r5084e407k84230I2300C0853M180a40678G6536
15670a14682A15638H484K17345b4698B50861h9445e49A56645B7738a92892f8396
$$ y = [226586, 103781, -359464, -70319, -98274, -188461, 105492, 17658, -71492, 295726, 98433, -179740, -214128, -45204, 71293, 242531, -78980, 45505, 69654, 86366, -53022, 197280, 116425, -50156, -41789, -172548, -119660, -6372, 82292, 328500, -123908, 26122, -192012, 221606, 112327, -250265, 152602, -452042, -320925, -159808, -8633, -73950, 104075, -101723, -84527, -53223, -3304, -152051, -15468, 135294, 37701, 38325, -237763, 47007, 198640, 38390, 13215, -152448, 95986, 6236, 70622, -30718, -187280, -67332, 185391, 38013, 106077, 431122, -225090, -27173, -79180, 141722, -4848, -126029, -221113, -5407, -289637, 92300, 30853, 35033, -140678, 76536, -114682, 115638, 8484, 225829, -24698, 250861, -89445, -549, 156645, 27738, -192892, -68396]
15658i8298a0639l81034m0603G9537m202J4573Q4060c4829A15731a95319g6622
15646f1708B59811d2620l4839A50553D6493J79097a33963E4882c3007A95113b35279
15634a6216G1024d61536a62954p6596e9346p3880b3124G6086B9224i1666m0045
15623a31711H8556a51670C9556c39856C56113e9373o1844k52926a72172I932c03687
15611d8725j24527g677I5896b10058B24766b85318a5810A18237l6894C0109L9386
15600F9495b16095d5867C2489a52715k8437F6427k8264j1537b93949a08206C9479
15588a24760d6495F4540K08250p2861P8907a34965k36545C1069K22020i566I4896
15576a0108n1398j25814a8200p8351K3872Q051A21364n4962a90613O4222D9951
$$ y = [-98298, -10639, -391673, -432276, 79537, 75335, 89908, 173968, -34829, 115731, -195319, -76622, -61708, 259811, -42620, -77459, 150553, 46493, 225590, -133963, 54882, -33007, 195113, -235279, -16216, 71024, -461536, -162954, -239550, -59346, -133226, -23124, 76086, 29224, -91666, -131711, 88556, -151670, 39556, -339856, 356113, -59373, -121217, -374143, -172172, 9932, -303687, -48725, -173252, -7677, 95896, -210058, 224766, -285318, -15810, 118237, 81343, 30109, 69495, -216095, -45867, 32489, -152715, -181152, 66427, 38163, 26626, -293949, -108206, 39479, -124760, -46495, 64540, 272790, 199929, 278836, -134965, -371510, 31069, 253089, -9566, 94896, -10108, -61506, -187320, -18200, -96551, -72679, -64628, 121364, 66402, -190613, -126391, 49951]
15564A02411M4561a76995H126a37980C65K6423M98732b11841i6184A26056c38118
15552B7651g286A94370F1842g6588A64648h034C9451C619O5995L3560a14391M7147
15540f7244k27724B89705E4461J9025P9587a23831o9130B03493b19938l7273M0226
15529b16985A88585F0021N7516J21320c45196H2028K9677c6296F2033K89708A13603
15517b92240J03341Q6954B08978H1805a4526l3804C82330A85825a00208J2494
15507h7714C58725a07844j5675A52281b63009A25558a04316j7662l4781A53279
15496c6706j66122N8717l5808B00914H583M3415b58186m110k99361D4016b9391
15484D7188N8562E1972a20032e2410k34477A54164B8414c72727a66206k8463F6590
$$ y = [102411, 146972, -176995, 8126, -137980, 365, 26788, 525520, -211841, -96184, 126056, -338118, 27651, -7286, 194370, 61842, -76588, 164648, -8034, 39451, 3619, 69614, 103174, -114391, -67244, -294968, 289705, 54461, 73486, 153073, -123831, -192961, 203493, -219938, -257211, -216985, 188585, 60021, 117537, 238857, -345196, 82028, 111705, -36296, 62033, 351741, 113603, -292240, -188899, -101945, 208978, 81805, -14526, -48330, 382330, 185825, -100208, -87714, 358725, -107844, -123519, 152281, -263009, 125558, -104316, -121978, -156759, 153279, -36706, -202828, -144111, -179919, 200914, 8583, 51998, -258186, -262296, -561657, 44016, -29391, 47188, 105750, 51972, -120032, -52410, -286887, 154164, 28414, -372727, -166206, -194669, 66590]
15472G2914J23326E9812J8972K22433b5959C111a34019A25931A6767Q6733b63747
15460A20489j1628j7100b58127A51260J06752B257a984j79772H678c32769a33832
15448a67471c8904p8626j70554a10369G6974Q1059h2377J0106A41962b5100A67696
15436a69671h1240A16541i5014A08878Q3123b99204C5660Q4689K185J51772a57950
15424a36960L2620k04658D16229d4048C03782H3995R342C7741N6442R1982f8570
15412b82817R5027o241A34130b48365R8778E2520b38446B23429a52272f5875m23888
15401d89763K36086B7453J17822R4851h1204q1958A16447a41140B40705h0781
15390a72837G4067K43722h6808C17149E2393a27692A24023j9737b526A43657J14833
$$ y = [72914, 196240, 59812, 78784, 301217, -25959, 3111, -134019, 125931, 16767, 103500, -263747, 120489, 108861, 91761, -258127, 151260, 258012, 2257, -1984, -181756, 8678, -332769, -133832, -167471, -38904, -117530, -288084, -110369, 76974, 158033, -82377, -72271, 141962, -25100, 167696, -169671, -81240, 116541, -95014, 108878, 192001, -299204, 35660, 120349, 122534, 274306, -157950, -136960, -104340, -308998, 416229, -44048, 303782, 83995, 93337, 37741, 94183, 186165, -68570, -282817, -187790, -194031, 134130, -248365, -149587, 52520, -238446, 223429, -152272, -65875, -489763, -253677, 27453, 145275, 240126, -81204, -163162, 116447, -141140, 240705, -80781, -172837, 74067, 317789, -86808, 317149, 52393, -127692, 124023, 104286, -2526, 143657, 258490]
15379B58490a08852R754L5084A44926Q9259E3633O9013H360a5623p933A42723
15367a63249A26244h2976I6081e1189j32650G6903a26964l42847b16176f9752
15356c89276i670B66018b17238A03611j7839J14145F9797c5968j11353C343M2827
15345D6170R5185J7695b32383B17748A05864d1421j7628j6392C7484J35777J36445
15334C09706A27357H981K86442A43618a47332P1808C29906b45091a12083A49887
15323A11520N2262h8914A05631K5161K4611p6123k1713a86331N5536m0297C38332
15311B16646g9154n9608A84913a15431k3508q1562j35311B4435M0761K3475J94846
15300B83517b0249P876C83423C1669e188k58180m945G8461f8543A68817J0702
$$ y = [258490, -108852, -99098, -64014, 144926, 234185, 53633, 122646, 8360, -15623, -23556, 142723, -163249, 126244, -82976, 96081, -51189, -183839, 76903, -126964, -469811, -216176, -69752, -389276, -9670, 266018, -217238, 103611, 85772, 199917, 69797, -35968, -147321, 3343, 46170, 141355, 159050, -232383, 217748, 105864, -41421, -59049, -75441, 37484, 173261, 309706, 127357, 8981, 295423, 143618, -147332, -75524, 329906, -245091, -112083, 149887, 111520, 163782, -88914, 105631, 130792, 155403, 79280, 57567, -186331, -130795, -171092, 338332, 216646, -79154, -138762, 184913, -115431, -138939, -220501, -355812, 24435, 65196, 88671, 283517, -20249, -12373, 383423, 31669, -5188, -263368, -268313, 78461, -68543, 168817, 179519]
15289A79519I786b4877B9545a0452k64185F2183K3478c3616l25066a26194j0709
15278a36903N9104B31190J35233A9024J73061A7785L20527b54621j22321a38888
15267f1032A1657f972j16019j380A83669o9520B9119q664L00099l8652o3698k6298
15255A91906o6715B3816L09055J63614B27610O7484M11052L12824K93244k05869
15245A106345L58705k65871D24317I0420K36485a31514e9258F8295J87522I8478
15234a6228D77515B37822n4157f7832j47361A51216J21880C2938a57100C6983
15223a69309I6894M4792i8063B02006A3412b07958C41750E538K10095a0498j6416
15212b6914I759P6487f8927J3811A89927o1120J00016a50786D4793r134R4715
$$ y = [179519, 9786, -24877, 29545, -10452, -274637, 62183, 85661, -33616, -358682, -126194, -136903, -77799, 231190, 366423, 19024, 192085, 17785, 338312, -254621, -376942, -138888, -61032, 11657, -6972, -122991, -124371, 183669, 114149, 29119, 20455, 320554, 281902, 218204, 191906, 125191, 23816, 332871, 496485, 227610, 295094, 706146, 1018970, 1312214, 1106345, 1465050, 1199179, 424317, 90420, 326905, -131514, -59258, 68295, 255817, 98478, -16228, 477515, 237822, 183665, -67832, -215193, 151216, 273096, 32938, -157100, 36983, -169309, 96894, 141686, -98063, 202006, 13412, -207958, 341750, 5538, 215633, -10498, -26914, 9759, 86246, -68927, -55116, 189927, 128807, 228823, -150786, 44793, 35659, 130374]
15201A30374a15820B44474C3874K17925p1222q6291a61164l511B27813Q5571A48363
15189F4643L91920m0873a61295E6361a99565A32901J60049k7193r9142F9045L715
15178G2760b23204B78682F0898J18683j9999b3974j37392A66167P2328o9700O7230
15167B36025P0912f6350A58016c7181j05701C30577g5327A80726K45277j63642
15157B62361a0879D47977B9364c41596B49113d0470C03671p0387K86812H6381
15146C30635F2145a26524L0235D94881I0514N4658o8687K09546G4220K5720J60125
15135B60065r4057h3066B27593r1270p034b5577H0361K16351a23543f0469l1883
15124i2352A78747B3347o359M29288i9231A86989J81011m0933o3027r2726D3392
$$ y = [130374, -115820, 244474, 33874, 251799, 180577, 94286, -161164, -164675, 227813, 313384, 148363, 64643, 456563, 415690, -161295, 56361, -199565, 132901, 292950, 265757, 166615, 69045, 72760, -223204, 278682, 60898, 179581, 159582, -23974, -161366, 166167, 238495, 168795, 236025, 306937, -66350, 158016, -37181, -142882, 330577, -75327, 180726, 426003, 262361, -10879, 447977, 29364, -341596, 249113, -40470, 303671, 233284, 520096, 86381, 330635, 62145, -126524, -96289, 494881, 90514, 145172, 76485, 286031, 74220, 99940, 260065, 166008, -83066, 227593, 136323, 129289, -25577, 80361, 296712, -123543, -60469, -92352, 178747, 23347, 16988, 446276, -99231, 186989, 368000, 327067, 264040, 171314, 43392]
15112d6773A83833Q0293B4203d9123o7918A4686J25763E2120a13178b4144f102
15100C47558A50770l597J24612H2361c27222J56378a6861b910C39969q8630M1175
15089B92514b029H2151N93220A33452L12094a17950A39725L01378A16745e1333
15078F4251c5506E2405J93790c4792A70155J4069J49488J77694k38443D7176J47929
15067A95105j992m5046J60843A49222C0657J35029o5181K89110J2379A87991J9768
15056B07759p4516e6657k1763A01790K45524J2884G3466M03809o2253C0420l959
15045B6461h238j60573F6175J26721J2179K00322F0105N48354B87041I8989i645
15033i424B98074A41184K55413F646K49254Q324D1688K00520l3701h3017A81682
$$ y = [-46773, 183833, 264126, 24203, -49123, -117041, 14686, 140449, 52120, -113178, -24144, -6102, 347558, 150770, 147173, 271785, 82361, -327222, -170844, -16861, -2910, 339969, 251339, 292514, -2029, 82151, 675371, 133452, 445546, -117950, 139725, 441103, 116745, -51333, 64251, -35506, 52405, 246195, -34792, 170155, 184224, 333712, 511406, 272963, 47176, 195105, 193113, 148067, 308910, 149222, 30657, 165686, 100505, 389615, 401994, 187991, 207759, 133243, -56657, -78420, 101790, 347314, 360198, 73466, 477275, 415022, 30420, 26461, -8238, -168811, 66175, 192896, 205075, 405397, 60105, 608459, 287041, 98989, -9645, -9424, 298074, 141184, 396597, 6646, 255900, 264224, 41688, 242208, 208507, -83017, 181682]
15021B87534j35905k2168J13357K2100F122R7910O9436J69840E4023J49984l00
15010B03707d4381D0070L3375k3158J75140d0247l9452C38010J5355A21201Q8537
14999B09738J7482m9329O8876j20329J05881N8964J78333A65581M28681B9151
14988C43165J3815a20504F03646F9895M88585m6714A75025L19J47942j0719j49821
14977A62746P6605r6832K28129j48047I3446b8608B65163R8401j07510C5333J3605
14966D8938L15691j71153M1323Q4358m2768k170r2311l3448G3077N9172M0441
14955A72690K22970j85859J62785N1178L4659j78644k9748K28382J49978A37083
14944C80512o1897L0937A32769K92284O9539j67802j2596j28186J02010j12247
$$ y = [287534, 151629, 129461, 242818, 264918, 6122, 104032, 173468, 343308, 54023, 204007, 203707, -44381, 40070, 73445, 50287, 225427, -40247, -79699, 338010, 353365, 121201, 209738, 227220, 177891, 246767, 126438, 232319, 291283, 469616, 165581, 594262, 29151, 343165, 356980, -120504, 603646, 69895, 558480, 511766, 175025, 175344, 323286, 312567, 162746, 239351, 142519, 370648, 222601, 93446, -28608, 265163, 363564, 256054, 35333, 48938, 364629, 193476, 234799, 319157, 276389, 274219, 181908, 148460, 73077, 132249, 172690, 395660, 209801, 372586, 423764, 458423, 279779, 250031, 478413, 628391, 137083, 380512, 318615, 349552, 132769, 425053, 494592, 326790, 314194, 186008, 288018, 175771]
14934A75771L46327B35695J59613I3789h394C45092A28111N1616j5879J9946J12464
14923B96258R1343a11715A66519J66151L8687j29061j15648K64209A6324L72152
14913C88476j13867K5599L60362C07282J93455j65007O4053c7017C67475m3100
14903C24375R1686K15922b8863B97359n5739K23352p0064K69319C01078A36023
14892E66302B25492K59003j16205l3306J18705J64319k00176A83966J89338J24696
14882D98000Q546j13612J13272O7249P2962E4684L93874k17397J01684N7253J18704
14871E08802j76218L5838j33668r7331J48275N2041J28281j55591L5079q6308
14861B59200M4118J42808j01401J11432N0788o4931B17097K78504q5244J074L2295
$$ y = [175771, 522098, 235695, 395308, 93789, -8394, 345092, 128111, 179727, 163848, 183794, 296258, 387601, -111715, 166519, 332670, 371357, 242296, 126648, 390857, 16324, 388476, 274609, 300208, 660570, 307282, 500737, 335730, 399783, -37017, 367475, 324375, 416061, 631983, -28863, 297359, 241620, 464972, 394908, 664227, 301078, 136023, 566302, 225492, 484495, 368290, 334984, 453689, 618008, 417832, 183966, 373304, 498000, 506546, 392934, 506206, 573455, 646417, 54684, 448558, 231161, 332845, 390098, 508802, 332584, 368422, 234754, 137423, 285698, 337739, 466020, 310429, 345508, 259200, 303318, 446126, 344725, 456157, 506945, 442014, 217097, 495601, 410357, 411431, 443726]
14850D43726l5022M71673l56458o8849j31946L7906J16327A46929K79524n6146
14840C70307j08097J32721L15388l9450k22969K05875j23691O9607j43596r4935
14830C61160j20208L02183B09677M12048m615B63752L63197j45588k8630K27593
14820F80324A20490L46764m1965K000M69303D00242j8580j9277K97631r1587k20505
14809C47924R7150o9594O0700E2014M44674K38813B26292K34068P95K6649j5949
14798D71855j78718J09582M09911l73404J69916L5617o9062k0349k15049M84055
14788H24354l05035k44392K42619J37087B02041N26023q1735k65694J93304J14883
14778F88822C05039J92908K46875K76930m69250L21857j80899k1709J49667C34802
$$ y = [443726, 408704, 880377, 523919, 455070, 323124, 361030, 477357, 146929, 426453, 370307, 262210, 394931, 710319, 670869, 447900, 653775, 530084, 599691, 456095, 361160, 240952, 543135, 209677, 621725, 617110, 263752, 626949, 481361, 452731, 680324, 120490, 467254, 425289, 427289, 896592, 400242, 381662, 362385, 660016, 568429, 347924, 445074, 375480, 436180, 52014, 496688, 735501, 226292, 460360, 461155, 487804, 471855, 293137, 402719, 812630, 439226, 609142, 644759, 575697, 555348, 340299, 824354, 519319, 274927, 517546, 654633, 202041, 728064, 646329, 380635, 573939, 688822, 305039, 497947, 744822, 1021752, 552502, 874359, 693460, 671751, 821418, 334802]
14767C93059j03753M16233j71420K64643l58291N3923M9450J53985J3823q0699
14757F30953L40754k63584L26936j92363J19666j16535j21946K4177n5201l40578
14747C52279N09754j23883C32386L23422N8646C28200L34864j71742J66606K5751
14737F83679K82990k16704J73013j67412r7891K11904m29P9913j96180J78278
14727I31161j31558p5099j39692R9449K9505J15331o6664l869K8785N0823K85687
14716A123859j18696m96580K30967K44326J17534j89984l14642J28842L14598
14707A040224p0334J2971j8090l90127L04135p8269J98507L9983j59652j2846
14697H66502l73174O34954p7220k50201P3358L95338l16227m2279N2561J39564
$$ y = [393059, 289306, 705539, 534119, 798762, 440471, 494394, 543844, 697829, 711652, 630953, 971707, 708123, 1035059, 842696, 962362, 845827, 723881, 748058, 692857, 352279, 862033, 738150, 332386, 655808, 714454, 328200, 663064, 491322, 657928, 683679, 966669, 749965, 922978, 755566, 657675, 869579, 869150, 949063, 752883, 931161, 799603, 724504, 584812, 684261, 713766, 829097, 762433, 758564, 787349, 838172, 1123859, 1005163, 508583, 739550, 983876, 1101410, 911426, 596784, 725626, 1040224, 969890, 982861, 964771, 574644, 878779, 800510, 999017, 1039000, 879348, 866502, 493328, 1128282, 1051062, 800861, 874219, 1269557, 953330, 911051, 963612, 1103176]
14687A103176J50685n52831K01104M3162p3211K31165R9500n29219N65084l86312
14677H52303K78367l52442M78852k932m09853L2637L2491k96264P03900k77817
14667A039242k34076M45138m58059M37757L25j35504K1258J6039R8946L5163J27612
14656A393841k52963n2482L8440N1640L17323n51514L53388j20866k21052N24081
14646A479836j20304k23213j74677J92911j12683L46954L28712n20213R253K93637
14636A500213j94625k6921L0346k84263J90693K41822n5184k30968M06290l67379
14626A210024K26887j58356K96092j81059N5036o00J6355N9112j11676j42879
14616A268936L86880j75374j00961L2181Q4359J53715m28176N60415n07713J88187
$$ y = [1103176, 1253861, 701030, 902134, 945296, 872085, 1103250, 1202750, 673531, 1238615, 852303, 1130670, 778228, 1257080, 1254148, 844295, 876932, 909423, 613159, 1317059, 1039242, 805166, 1250304, 792245, 1230002, 1230327, 1094823, 1116081, 1132120, 1231066, 1266229, 1393841, 1140878, 1088396, 1126836, 1178476, 1495799, 944285, 1297673, 1176807, 955755, 1479836, 1359532, 1136319, 961642, 1154553, 1041870, 1388824, 1717536, 1197323, 1206576, 1500213, 1305588, 1278667, 1309013, 1024750, 1215443, 1457265, 1402081, 1171113, 1577403, 1210024, 1436911, 1278555, 1574647, 1393588, 1448624, 1448024, 1464379, 1523491, 1411815, 1268936, 1655816, 1480442, 1379481, 1411662, 1496021, 1649736, 1221560, 1781975, 1274262, 1462449]
14606A462449O5516K14014J5528k77825J85662O3485k30100M51230m22378K20031
14596A747612j45751L22040J65431l45368p8969L51825j45315j82447J94897J0344
14586A894299K12321j01578j20990K62637l44512J66452m6928o2352J23947L14326
14576B297622j94874p2273J31687O3316J49808J98483j32557j66856j47623K58877
14566B385610M29895k98652j30223J02209o744J79095R3810K76333J51931j39304
14556C043960J98240p2642J20992M79262L72443O76731N57641J807446M605122
14547A1789195R243039J6141985N565874j8266376A2044916E996191k448360p47628
14539B800203n33875n2585K90975k82647k52636j60211L59887m6341j03048j46227
$$ y = [1462449, 1527965, 1741979, 1757507, 1479682, 1665344, 1728829, 1498729, 1949959, 1527581, 1747612, 1601861, 1923901, 2089332, 1743964, 1664995, 2016820, 1871505, 1689058, 1883955, 1894299, 2106620, 2005042, 1884052, 2146689, 1802177, 1968629, 1921701, 1859349, 1983296, 2297622, 2102748, 2030475, 2162162, 2225478, 2375286, 2573769, 2441212, 2274356, 2126733, 2385610, 2815505, 2516853, 2386630, 2488839, 2482095, 2661190, 2755000, 3031333, 3183264, 3043960, 3242200, 3169558, 3290550, 3769812, 4142255, 4818986, 5376627, 7184073, 11789195, 21032234, 37174219, 42740093, 24473717, 12044916, 5996191, 3547831, 2800203, 2266328, 2213743, 2504718, 2222071, 1969435, 1809224, 2169111, 2122770, 2019722, 1873495]
14529A873495M48886K12982O6898k72461q1341L80302J9910m40679K22270N0024
14519B480286J45963j15873o2196L79988n9792N5434J2472j7850k92211K50952
14509B777173j59946J89495J06357K73222l55497J52385L00042n09484K17696
14500B991443R3389J03175m5035J89005J2162o2747J03004j57453M74770q8685
14490C613028p1770J61055K17706k06721P1607O9815M82191m59682j43810L94882
14480D128301k25464N2263K04278o675j90550P14642l13391j61396j27673P5858
14470D150193L95109J18251J9613J49105o29769O32577l42041N85256m20068N68629
14460E226855k36599r7989J80470J47084O805J33492j75418J68316L53657m09736
$$ y = [1873495, 2322381, 2535363, 2602261, 2329800, 2248459, 2628761, 2648671, 2207992, 2430262, 2480286, 2626249, 2510376, 2448180, 2828168, 2768376, 2823810, 2836282, 2818432, 2526221, 2777173, 2617227, 2806722, 2913079, 3186301, 2830804, 2983189, 3283231, 2773747, 2991443, 3084832, 3188007, 3142972, 3331977, 3344139, 3281392, 3384396, 3226943, 3701713, 3613028, 3541258, 3702313, 3920019, 3713298, 3784905, 3854720, 4336911, 3877229, 3733419, 4128301, 3902837, 3955100, 4159378, 4152703, 3962153, 4676795, 4363404, 4202008, 4074335, 4150193, 4545302, 4663553, 4683166, 4832271, 4202502, 4835079, 4493038, 5078294, 4658226, 5226855, 4990256, 4892267, 5072737, 5219821, 5226626, 5360118, 5184700, 5353016, 5706673, 5296937]
14450E296937K22510K06257j2355J48439J07376n696J34066n8699J19611j01826
14440F056620J25620L30965l0212J14285n8680L02016J28111R079J33779k63519
14430F848064O05047J1675k58455L01417K30632q3793M7624J3370M27661n1620
14420H091622R6941j15630L63949R605J12386N0226Q1885L39637K38556q5107
14410I184070K28100o4802L81375m44701N94601K57429j59923P77249l9064L514
14400A0717848K40932L16765q2661J12941K00508R0555J79644L35150K46561L57820
14390A2716063k4381R1753N27609J85736K34605M26904K48002j7744L45073J9166
14380A4752786j4965Q03582K49488N63426j77397L28164M15113M02085K53351
$$ y = [5296937, 5519447, 5725704, 5713349, 5861788, 5969164, 5963468, 6097534, 6038835, 6158446, 6056620, 6182240, 6513205, 6482993, 6597278, 6538598, 6840614, 6968725, 6977804, 7111583, 6848064, 7453111, 7464786, 7206331, 7507748, 7738380, 7654587, 7702211, 7715581, 8143242, 8091622, 8188563, 8072933, 8436882, 8446487, 8558873, 8609099, 8690984, 9030621, 9269177, 9184070, 9412170, 9347368, 9728743, 9284042, 9878643, 10136072, 9976149, 10753398, 10714334, 10717848, 10958780, 11275545, 11192884, 11305825, 11506333, 11596888, 11776532, 12111682, 12358243, 12716063, 12691682, 12783435, 13311044, 13496780, 13731385, 14158289, 14406291, 14388547, 14733620, 14752786, 14737821, 15541403, 15790891, 16354317, 16176920, 16505084, 16920197, 17322282, 17575633]
14371A7575633L75349Q20457j0012N30287j67950O78435M53589P11744k44425
14362B0723107Q47245N68893L81513K66901R72591L64986N72739N22866O54397
14353B5875238M06276R35804K74496P11978Q93107O43704N73060P26660P90954
14344C1831277Q27101P38973J004268P44841J018719J114752R57111J129056M98839
14335C9864937J470083J221587J189915J205821J629336J417451J234551J530441
14327E0764122J732786J640784J563656K228300J749850K250278K069215K182473
14319F6181464K501242K290759K844195K817248K497499L241751L251517L146278
14311H8771953L460636M112392L780081L975173M875135M276220N040057N073845
$$ y = [17575633, 17950982, 18771439, 18761427, 19291714, 19123764, 19802199, 20255788, 20967532, 20723107, 21570352, 22139245, 22520758, 22787659, 23760250, 24125236, 24697975, 25220841, 25875238, 26281514, 27217318, 27491814, 28203792, 29096899, 29740603, 30313663, 31040323, 31831277, 32658378, 33397351, 34401619, 35146460, 36165179, 37279931, 38237042, 39366098, 39864937, 41335020, 42556607, 43746522, 44952343, 46581679, 47999130, 49233681, 50764122, 52496908, 54137692, 55701348, 57929648, 59679498, 61929776, 63998991, 66181464, 68682706, 70973465, 73817660, 76634908, 79132407, 82374158, 85625675, 88771953, 92232589, 96344981, 100125062, 104100235, 108975370, 113251590, 118291647, 123365492]
14303A23365492N731316N654098O263816O144412P128709P242525P666289Q461735
14295A77658392Q485104R424270R734854J0280675J0446720J1254880J2030895
14288B49315790J1904854J2864361J3178795J3830439J4073413J4323299J4537809
14281C44028760J4726383J4809029J4226531J4103385J3153999J2782472J1076293
14274D38906852R733955P294344K103453M728n62998J046805l350397k461473
14266D52715269l473460n466231r056009j1301295j2758967j3603682j4870473
14259C82185152j4932924j5610263j5564105j5516221j5141136j3638263j3864734
14252B77917506j3696089j2834885j2601547j1743620j1310125j0576422j0307755
$$ y = [123365492, 129096808, 134750906, 141014722, 147159134, 154287843, 161530368, 169196657, 177658392, 186143496, 195567766, 205302620, 215583295, 226030015, 237284895, 249315790, 261220644, 274085005, 287263800, 301094239, 315167652, 329490951, 344028760, 358755143, 373564172, 387790703, 401894088, 415048087, 427830559, 438906852, 448640807, 455935151, 458038604, 458043332, 457480334, 458527139, 455176742, 452715269, 449241809, 443775578, 434719569, 423418274, 410659307, 397055625, 382185152, 367252228, 351641965, 336077860, 320561639, 305420503, 291782240, 277917506, 264221417, 251386532, 238784985, 227041365, 215731240, 205154818, 194847063]
14245A94847063q955718q440227q495777p877789p608983p237072o660208o152831
14237A33418458n355615n837941n644163m499287m816882m575585l740921l529208
14229I5418856m125875l610940l861336k805967k858447k901773k661795k913031
14221F9679692k176066k605058j992609k241217k039416k014260j600788j793234
14213E3217044j405392j332425k102428j506581j318336j529843l11938j171975
14205D2538126j763196j003216j442876j110380m14542p42756j374760q59938
14197C3826462r93792r90128q23953n94577o80932o18774q47345r70953m00453
14188B6905555p98663l05689j007231n07633l33201n09122n32654m81868m38704
$$ y = [194847063, 185891345, 177451118, 168955341, 161077552, 153468569, 146231497, 139571289, 133418458, 128062843, 122224902, 116580739, 112081452, 107264570, 102688985, 98948064, 95418856, 91292981, 87682041, 83820705, 81014738, 78156291, 75254518, 72592723, 69679692, 67503626, 64898568, 62905959, 60664742, 58625326, 56611066, 55010278, 53217044, 51811652, 50479227, 48376799, 46870218, 45551882, 44022039, 43710101, 42538126, 40774930, 39771714, 38328838, 37218458, 36803916, 36061160, 34686400, 33826462, 32832670, 31842542, 31018589, 30424012, 29743080, 29124306, 28276961, 27306008, 26905555, 26106892, 25801203, 24793972, 24286339, 23953138, 23444016, 22911362, 22429494, 21990790]
14179B1990790q26261o7589l46217q21357l09543m11322j50032o63005l91954
14170A8003510K2782k65431o14962j59125l79464l83524m36362J19176m20979
14161A5485621p14093l6278q1201n65036l24379L63989p74103j93279k36213j46014
14151A2779014k60749k7603m13368J07855m33520J40392l31648k05532k48989
14142A1105852k98209l0508k54802j85111J0854K744p8402l54307j27741o16209
14132I174161K92018N3060m94392n9785k58252O264l25511J07279j48067m60o3185
14121H283130k22017k8394k46411j43796r5011r004k98098K15108j58747J09486
14111G406246j05476l88838k86154L62734j26516n0812n7098R016o30640L44780
$$ y = [21990790, 21164529, 21096940, 20750723, 19929366, 19619823, 19208501, 19058469, 18395464, 18003510, 18026292, 17760861, 17145899, 16986774, 16607310, 16223786, 15787424, 15906600, 15485621, 14771528, 14735250, 14654049, 14089013, 13764634, 14128623, 13354520, 13161241, 12925028, 12779014, 12518265, 12490662, 12077294, 12185149, 11751629, 11892021, 11560373, 11354841, 11105852, 10807643, 10777135, 10522333, 10337222, 10348076, 10350820, 10272418, 9918111, 9790370, 9174161, 9466179, 9519239, 9024847, 8965062, 8706810, 8713074, 8387563, 8494842, 8346775, 8346315, 8283130, 8061113, 8032719, 7786308, 7642512, 7547501, 7538497, 7240399, 7455507, 7296760, 7406246, 7300770, 6911932, 6625778, 6988512, 6861996, 6811184, 6754086, 6763102, 6132462, 6477242]
14101F477242o8709N5639N7239p22632K81102J23908m10778j64683j14106P2267
14091E586489j69553l1105Q7269q1453Q4069k76647J23620j8372l17642J18849
14081E105524q4918n3467N0978m34154M5590J31277k84814M15338k72795N2000
14071D670559l32410j28698M20119m88628K03523m9655Q6112j58866J16117p0745
14061D267428j14577J0968j59865L1338q4575M2994k58628M23202n29928n8783
14051C569574L07032l21189K331K22031L4947j18087k35966L8285K17559o16141
14041C100376L40050L07847o76427K44239l59959K99860M6000J57881m10451K83960
14031C333376j30206m54632M02301k25140k49094K57734J49233j76581O0894j95571
$$ y = [6477242, 6408533, 6464172, 6521411, 5798779, 6079881, 6203789, 5793011, 5628328, 5514222, 5586489, 5416936, 5385831, 5473100, 5391647, 5475716, 5199069, 5322689, 5304317, 4986675, 5105524, 5020606, 4967139, 5018117, 4583963, 4629553, 4760830, 4476016, 4891354, 4618559, 4670559, 4338149, 4209451, 4629570, 4140942, 4344465, 4294810, 4380922, 4222056, 4338173, 4267428, 4152851, 4163819, 4003954, 4035292, 3950717, 3993711, 3735083, 4158285, 3628357, 3569574, 3876606, 3555417, 3557748, 3779779, 3814726, 3696639, 3460673, 3498958, 3716517, 3100376, 3440426, 3748273, 3071846, 3316085, 2956126, 3255986, 3301986, 3459867, 3049416, 3333376, 3203170, 2748538, 3150839, 2925699, 2676605, 2934339, 3083572, 2906991, 2967885, 2772314]
14021B772314l57891O13081m83316L08436k19602j32300M3844q1255L82145l17085
14011B528371l61753J36195M8476L9271J65295j70452Q7163j90065K5504k47486
14001B060519J74672K13352k56216j67457p5334j50271K43508l78389M04878k01361
13991A867901N15301L37809Q21167K834126P973961J6411042J2743156j5004091
13983B8500372j3002907o224099k742893j591955l21458j001216K74599m25875
13975C464568j16375k07711l58584M1475j86704r5256J5256j49488K59443m01270
13965B265354J58056l2909l09072L19994l12377o07J67344j5237N4495l92923
13955A902118N8584m5065J88834J09050k18297o958Q8764J11337l62084r6038
$$ y = [2772314, 2414423, 3027504, 2544188, 2852624, 2633022, 2500722, 2544566, 2463311, 2845456, 2528371, 2166618, 2302813, 2351289, 2390560, 2555855, 2385403, 2472566, 2282501, 2308005, 2060519, 2235191, 2448543, 2192327, 2024870, 1949536, 1799265, 2042773, 1664384, 2069262, 1867901, 2383202, 2721011, 3542178, 6376304, 14350265, 30761307, 43504463, 28500372, 15497465, 9273366, 6530473, 4938518, 4617060, 3615844, 3890443, 3464568, 3348193, 3140482, 2781898, 2823373, 2636669, 2541413, 2556669, 2407181, 2666624, 2265354, 2423410, 2390501, 2081429, 2401423, 2089046, 2088439, 2255783, 2240546, 2295041, 1902118, 1960702, 1915637, 2104471, 2213521, 1995224, 1988266, 2077030, 2188367, 1826283, 1730245]
13945A730245K82392k72957J7155n4338L23826k43649j86696J43753o2379J43305
13935A820657p110M3095m36560L95424M19145q75380J49112r1231M76550k73413
13925A620289l6012J70844m43539L92186L3102p4778O9368J40567j95052m13245
13915A263730K82039j81302J79754M1427k97258K25494J3471k34226M24656k12588
13905A505197q8829L4927J58405k79151j7590j33900L6168J54893q7741J87932
13895A470311r771k63267J34965j40418j96915L47099J84230J11012n03511J84079
13885A317814j42299J19768n4338Q5195k00232n5708J39905R7469l51984O35517
13875A591107n80472j3002K16610K5630l5135n7257K7915k16903l5038P1289O24066
$$ y = [1730245, 2012637, 1739680, 1756835, 1702497, 2026323, 1782674, 1595978, 1739731, 1677352, 1820657, 1813547, 1856642, 1420082, 1815506, 2234651, 1359271, 1508383, 1417152, 1893702, 1620289, 1584277, 1755121, 1311582, 1703768, 1736870, 1662092, 1731460, 1872027, 1676975, 1263730, 1545769, 1364467, 1544221, 1585648, 1288390, 1513884, 1527355, 1293129, 1717785, 1505197, 1416368, 1451295, 1609700, 1330549, 1312959, 1179059, 1215227, 1370120, 1282379, 1470311, 1460540, 1197273, 1332238, 1191820, 994905, 1342004, 1526234, 1637246, 1133735, 1317814, 1175515, 1295283, 1240945, 1326140, 1125908, 1070200, 1210105, 1307574, 955590, 1591107, 1010635, 997633, 1214243, 1239873, 1204738, 1147481, 1175396, 958493, 923455, 994744, 1618810]
13864A618810l41007j83568J39575O0823O2152o38005K64833L0206j01125r013
13854I03681J59849k7289k56j48698K20470J05810j35773J69446l94414L57244
13844A210070j28946k11411N8382J50114m7713j11860M10495k56985o0134K86159
13834A298171k07829j66164C80289K92939K08096o1665K36629l19710K30584k70113
13824F97049J94417P7439l11790K10503k22237L32788k32859K42234j53786K68513
13814A102271p1551l98644K73898j45839j8187L33038j92253p1288J53139q6616
13804H77968l9528J52361D73822L99071k46291L06967j66858J14791k24872J58649
13794H15279l01227K33670O4491K4494k00595C03687M89835n7851J33520q8555
$$ y = [1618810, 1277803, 1094235, 1233810, 1294633, 1356785, 718780, 983613, 1013819, 912694, 903681, 1063530, 1036241, 1035985, 887287, 1107757, 1213567, 1077794, 1247240, 852826, 1210070, 1081124, 869713, 928095, 1078209, 1030496, 918636, 1329131, 1072146, 1012012, 1298171, 1090342, 924178, 380289, 673228, 881324, 819659, 1056288, 736578, 967162, 697049, 891466, 968905, 657115, 867618, 645381, 978169, 745310, 987544, 833758, 1102271, 1030720, 632076, 905974, 760135, 741948, 1074986, 882733, 811445, 964584, 877968, 838440, 990801, 473822, 872893, 626602, 933569, 766711, 881502, 656630, 815279, 514052, 747722, 812213, 836707, 636112, 303687, 793522, 735671, 869191, 780636]
13784G80636L13091j53922j53642m4903J26969l01434M30906j42482j47301J08649
13774H16567l14130L13017k60858P9183j5170Q3908J31140j34342j61379J54852
13764F92788j83364j9320K67104A56921O97143B04453L14408N02558l64704O400
13754F63115P2813l25229L29610o5332j58399K49415C01316M06964j94976K88359
13744H01663l20971K33565C44419R7150K50841J8132K33312l91688K19456n4059
13734G17563j49208j40346L25974C56424M5215K3236K43834O6573J74549l4827
13724H75004j95826j00176j28711j36518L95737j05790j4310J67963j25971K3953
13714F55355j27149p1574J79008j53904L3200n0869l604j18171L60407m1171B83103
$$ y = [780636, 1093727, 939805, 786163, 741260, 868229, 566795, 997701, 855219, 707918, 816567, 502437, 815454, 554596, 633779, 618609, 702517, 833657, 699315, 537936, 692788, 509424, 490104, 757208, 156921, 854064, 204453, 518861, 1021419, 656715, 663115, 735928, 410699, 740309, 674977, 516578, 765993, 301316, 708280, 513304, 801663, 480692, 714257, 344419, 441569, 692410, 710542, 943854, 552166, 771622, 717563, 568355, 428009, 753983, 356424, 401639, 424875, 668709, 735282, 909831, 875004, 679178, 579002, 450291, 313773, 709510, 603720, 589410, 757373, 631402, 655355, 528206, 456632, 635640, 481736, 514936, 464067, 460463, 342292, 702699, 661528, 283103]
13702E97981J49555k43459Q4065L7955K90051l57954j91832K70674r3167K65224
13692H09093J17444C25180J00365j56654J75067J50390m2171k52045Q7307J71268
13682E58707r0386Q2360N9943j65388K42561j25008k18628L89647B35988N38165
13672G74153k43032k32701M14993j41180j83956Q6201Q9509p2161O0991K24853
13662G77670k57387L2031J49226l21882J25239A61398N26541j42347A29983N16557
13652F46540j34009J40864l00959J85531q8456O3328k01833J62041m5211n0196
13642C77640J74996B70682L5955j11167K60756A96361L10280E3312K80031K40044
13632E73387j32094J34642o2835r1565j44577J78729k2758A12093J72656O1960
$$ y = [597981, 747536, 504077, 588142, 626097, 916148, 558194, 366362, 637036, 543869, 809093, 926537, 325180, 425545, 268891, 443958, 594348, 552177, 300132, 387439, 558707, 468321, 550681, 610624, 445236, 687797, 562789, 344161, 733808, 235988, 774153, 531121, 298420, 713413, 572233, 388277, 474478, 563987, 491826, 552817, 777670, 520283, 552314, 701540, 379658, 504897, 161398, 687939, 545592, 129983, 646540, 512531, 653395, 352436, 537967, 449511, 512839, 311006, 473047, 427836, 377640, 552636, 270682, 306637, 195470, 456226, 196361, 506641, 53312, 333343, 573387, 441293, 575935, 513100, 421535, 276958, 455687, 432929, 112093, 284749, 346709]
13622C46709L09631A87288N71008l25529M4092m8793k08195P8405I6875K03644
13612C00519J88074P2961B55522R5965j5181J66200o6814q7375j19492j0601K49183
13601D67407j08622n6660J94069j33006A40201J99951o4539j17004J54320L5067
13591C47996q3166O6163q5714K86317k37263K44237K76363j29260B91932F5114
13580F21240j60821J15742o0042k41759L59096A32472O6064L6760J31318q9520
13570B77094L34328L575A37201k6844K33592J7399j62567K32508j96514L31341
13560E66116A34425K48052r0412f8747A79762L61755j48398K00523A94008k7719
13550A66289J24494k4019o9558L0373J53193q712q0229n0773J62389A64660K14388
$$ y = [346709, 656340, 187288, 758296, 432767, 476859, 428066, 219871, 298276, 96875, 300519, 488593, 561554, 255522, 351487, 336306, 502506, 435692, 348317, 228825, 218224, 467407, 358785, 302125, 496194, 363188, 140201, 340152, 275613, 158609, 312929, 347996, 264830, 330993, 245279, 531596, 294333, 538570, 814933, 685673, 291932, 65114, 621240, 460419, 576161, 516119, 274360, 633456, 132472, 198536, 235296, 366614, 277094, 611422, 614997, 137201, 110357, 343949, 361348, 198781, 431289, 234775, 566116, 134425, 382477, 292065, -68747, 179762, 541517, 393119, 593642, 194008, 166289, 290783, 266764, 197206, 227579, 380772, 372060, 291831, 241058, 403447, 164660, 379048]
13539C79048l8545B7033M89463j17245J17721L4717l2285A01016K66876K19631
13529E87523j13042j32803q1011j27978K12142j39175L04847B31264F346n16K94424
13518C00254K27636j87666L62912B76555J44610B03039N6116l0887e188l1379
13508c6567B54306P2337A46899A9151O0271K82526J47758j35390m8876I1720L25200
13497D16920a567B97751J99588H182L46125O1227q0680A18874B1490O5988M56976
13486E44454B71156J27059K7642q2751j09883J6065K83834k04348q1728q8617
13476A58429F3141K00322k6606r4363P7076n1192K99654B16006J472J3608J14742
13465C45828A29862J33945j01390J08412b8753D25467K8932A75376O1890D7873
$$ y = [379048, 340503, 27033, 516496, 399251, 516972, 551689, 519404, 101016, 367892, 587523, 474481, 341678, 260667, 132689, 344831, 205656, 510503, 231264, 6346, 5830, 300254, 527890, 340224, 703136, 276555, 421165, 203039, 259155, 228268, -5188, -36567, 254306, 326643, 146899, 19151, 79422, 361948, 509706, 374316, 325440, 91720, 416920, -1567, 297751, 497339, 8182, 354307, 415534, 334854, 118874, 21490, 87478, 544454, 271156, 398215, 425857, 343106, 233223, 249288, 533122, 328774, 247046, 158429, 63141, 263463, 236857, 142494, 219570, 168378, 468032, 216006, 217478, 231086, 345828, 129862, 263807, 162417, 270829, -28753, 425467, 454399, 175376, 237266, 47873]
13454C71765I6848P9210K8699l9259K00761j67212J66186j7771L2047a516A98552
13442A55305J11238j16246J03960j01876K41401A215J50268L23297r5691j70583
13432B08506l9638Q7296J16825K11842j96505d2207B90199A20749E8727K81099
13422C39826J09504a55229B65534R7632j07627q7030q1300o146D019L6575N9279
13411I9873J15256J08910j24729o0213m215J33878O1409N7143j45027b3470E74474
13399C57495D4359K11189p8891F9948J68961N3445G6176K64822D1210J26210n7170
13388A10250a66601C12642m0562E9980L19874j55734L11923b85555A3592J56062
13378A69654C9075K05380r6945l6425K82506A21666J55527J1595J98946j32524
$$ y = [371765, 96848, 176058, 204757, 165498, 366259, 199047, 365233, 347462, 379509, -1516, 198552, 155305, 266543, 150297, 254257, 152381, 393782, 1215, 151483, 474780, 379089, 208506, 168868, 256164, 372989, 584831, 388326, -42207, 290199, 120749, 58727, 339826, 449330, -155229, 265534, 363166, 255539, 168509, 87209, 81063, 4019, 40594, 99873, 215129, 324039, 199310, 139097, 134882, 268760, 330169, 387312, 242285, -23470, 574474, 357495, 44359, 255548, 176657, 69948, 238909, 292354, 76176, 340998, 41210, 167420, 110250, -166601, 312642, 272080, 59980, 379854, 224120, 536043, -285555, 13592, 169654, 39075, 244455, 147510, 111085, 393591, 121666, 277193, 288788, 487734, 355210]
13368C55210J3060a20169B49999j10930j1172E9996J01543K46062I4263R8552
13358A92815M59052k11140G2030K72342A71324J01147m836J26782A19152J73936
13348B93088A15788a26744G4980J55767K6745B9449J98034J6465J38958j49686
13338B33220f1527E80531B28761a20720D03933r2122N3527m9849j21549k9919
13328A64021N7820I5406Q0338P3918J89773A92207K24837L9545A43057R585J17977
13317B70619n8686h7144D41908E3059K09762p3968J14803m2599m1602p403g2308
13305C04950E3199K22403A01635K35688J16372B05391p9569K08740I8970L20989
13295D19959n9093A47727Q3150b4324A58875h5449D68408B28427c150j52940q6931
$$ y = [355210, 368270, -120169, 249999, 139069, 127897, 59996, 161539, 407601, 94263, 192815, 651867, 440727, 72030, 344372, 171324, 272471, 267635, 394417, 119152, 293088, 115788, -126744, 74980, 230747, 257492, 29449, 227483, 243948, 382906, 233220, -61527, 580531, 228761, -120720, 403933, 311811, 365338, 315489, 193940, 164021, 221841, 95406, 175744, 249662, 439435, 192207, 417044, 456589, 143057, 152642, 270619, 211933, -87144, 441908, 53059, 262821, 188853, 303656, 261057, 219455, 212052, -72308, 304950, 53199, 275602, 101635, 337323, 453695, 205391, 125822, 334562, 98970, 419959, 360866, 147727, 230877, -24324, 158875, -85449, 468408, 228427, -3150, -156090, -243021]
13284b43021H3092K54147c15385F0949a16336B10141J71736A03304m0436k7980
13274C4888b02960G235b6644A05393J25042i020l3888B42114r5058J52678O7125
13263C66859A18049a858C43838A02576f6624G0421K40001A46354C024J47975C7951
13251B63715A16219K28030A52260K75832f4748A72943G9985i9214A12179J16956
13241B29135r0054g6647A39505l2541D8436b1539q3870A09151J53628A26483a48388
13229E54941A99785m6736M9453G0089M3005L67836A92444b02018D3692K34204
13219B77896A20867a62441C14617A11134M614j1968L4081d3734B1052K27863a53819
13207a0915A15337a4751B09027p633J29379A28753J94751j03090R1666A04017
$$ y = [-243021, 83092, 337239, -315385, 60949, -116336, 210141, 381877, 103304, 62868, 34888, -202960, 7235, -26644, 105393, 230435, -9020, -42908, 242114, 147056, 299734, 366859, 118049, -1858, 343838, 102576, -66624, 70421, 310422, 146354, 3024, 150999, 37951, 263715, 116219, 344249, 152260, 428092, -64748, 172943, 79985, -99214, 112179, 229135, 139081, -76647, 139505, 106964, 48436, -21539, -105409, 109151, 262779, 126483, -148388, 554941, 199785, 153049, 202502, 70089, 113094, 480930, 192444, -202018, 43692, 277896, 120867, -162441, 314617, 111134, 115748, 103780, 137861, -43734, 21052, 248915, -153819, -10915, 115337, -14751, 209027, 201394, 330773, 128753, 323504, 220414, 312080, 104017]
13196B89516O7972A01700N7105j3286M267J83261B3528e345A4093K41461E2444
13184b59472A7106K57344N052d7730r8386C16221g8036A08112e6081J7493j1710
13173e0298G8698J46703B3196K9951J54942h3974A41079K55731F2007r14O0265
13162A21358g9339B53608R2843a74401g8250I593L8666P2468C840K45697L332
13151B52869l2252l8742D2955j7658J24808o6648e9667A86502J21181R701r2630
13140B24754o2274j2941b476n3395A17040b7407B54988a40300B23953a20516b1353
13128c21831B79081F1311A0640b14630B7025g1579A46389R8557G8154l125b8390
13116c2612A84771l6339a1788A2938a83218B07878F2808I97K64663j03121d6538
$$ y = [289516, 357488, 101700, 158805, 145519, 149786, 333047, 23528, -5345, 14093, 255554, 52444, -259472, 17106, 274450, 279502, -47730, -146116, 316221, -78036, 108112, -56081, -38588, -50298, 78698, 225401, 23196, 53147, 208089, -83974, 141079, 396810, 62007, 61093, 121358, -79339, 253608, 346451, -174401, -78250, 9593, 48259, 120727, 3840, 249537, 252869, 220617, 181875, 42955, 25297, 150105, 83457, -59667, 186502, 307683, 317384, 224754, 162480, 149539, -2476, -55871, 117040, -27407, 254988, -140300, 223953, -120516, -21353, -321831, 279081, 61311, 10640, -214630, 27025, -71579, 146389, 244946, 78154, 75029, -28390, -32612, 184771, 148432, -11788, 12938, -183218, 207878, 62808, 997, 265660, 162539, -46538]
13104F2059O4293l4914L92071a78544D80374j38876a64629k3889C02326k929E0810
13092f2349G2425c23607C72489F9759K3204i1961a2989E1920K44102j07224n8982
13081A29816b3899l2906C08084j7069a8093B99016a34597F48620f287B64530l8649
13070B25881G3541k8180J81945I450c6880A05382a25906r4318e2027D22549f9087
13058A17237b09663a0022B23709J00177j3394j51982G6236J66475C2138Q1540
13048A13678b8327C01682a7967A12949H191L57164j40670b35197P2470C02705
13037e234A26928i6361B690J213J67440b5217C49130a09912m3878A1800J45323
13026A57123D8465d7389A55323F2328O1874a04496A01061M2023J12155A20081
$$ y = [62059, 126352, 91438, 483509, -178544, 480374, 341498, -164629, -188518, 302326, 299397, 50810, -62349, 72425, -323607, 372489, 69759, 92963, -91961, -12989, 51920, 296022, 188798, 129816, -23899, -56805, 308084, 291015, -18093, 299016, -134597, 648620, -6287, 264530, 225881, 73541, 45361, 227306, 9450, -36880, 105382, -125906, -220224, -52027, 422549, -69087, 117237, -209663, -10022, 223709, 323886, 310492, 158510, 76236, 242711, 32138, 113678, -28327, 301682, -17967, 112949, 8191, 365355, 224685, -235197, -162727, 302705, -5234, 126928, -96361, 2690, 3903, 171343, -25217, 349130, -109912, -153790, 11800, 157123, 48465, -47389, 155323, 62328, 124202, -104496, 101061, 143084, 255239, 120081]
13015A48340M5998F9783M3588K4679J92888p324A55909K23419I4089F786L1094
13004C7880O7101c5294n1035K5766C54321B8072Q2507B7547g2646B26011A8213
12992C2611K25146O6274a1620B2269c5855A87420H516M0197P5662i1129H6838
12980D85473E8360K2029f7087E9151g2727A40889g8446C31886a00697A47303J64635
12969C11938g9997A63799a18839A04635N4661D8625O405c1118A42646a29845B79546
12957a00704B61404q2753a06178B13589D9738Q7153c9354j37321j06826A14461
12946A81240d3005I668a33029A66216c7240A21381J52846a09976j04076A09177
12935I1173e6101j0764l5599A73561d9086A66812J04038F6705K14008C1023J69000
$$ y = [148340, 194338, 69783, 113371, 138050, 330938, 323614, 155909, 379328, 94089, 6786, 37880, 104981, -35294, -86329, -60563, 354321, 28072, 110579, 27547, -72646, 226011, 18213, 32611, 257757, 324031, -11620, 22269, -35855, 187420, 8516, 48713, 124375, -91129, 86838, 485473, 58360, 80389, -67087, 59151, -72727, 140889, -78446, 331886, -100697, 147303, 311938, -79997, 163799, -118839, 104635, 159296, 48625, 55030, -31118, 142646, -129845, 279546, -100704, 261404, 178651, -106178, 213589, 49738, 136891, -39354, -176675, -283501, 114461, 181240, -43005, 9668, -133029, 166216, -37240, 121381, 274227, -109976, -214052, 109177, 91173, -56101, -66865, -102464, 173561, -49086, 166812, 270850, 66705, 280713, 31023, 200023]
12924B00023G8490d3216A54072b74894H8003a74995j50637A45329D4768j191J52360
12913A95937M1475O0946A25453a06586A12273e5268a0132p7351C88476b30114
12902A0980K58455J80693I3546R041C4631M4561b13704B2617b83859a22884H2854
12890A0358m254P5678L94766e7985A86220n5330c2956A02105D5442e3853A3292
12878B97111j23030a98758E643e1552A18111b7719I2831Q8610C2246J12095n9655
12867H4686J75543a48154j65092G1239e8930n9978m8302F2833c4892j24268j45043
12856c04203A28789J11931a16911k7358H5898a71239A3438b12286A49183p1818
12846G7365b49749B92202q9931N6215I5454d2053l4347A09244O6142m4724g8691
$$ y = [200023, 78490, -43216, 154072, -274894, 88003, -174995, -325632, 145329, 44768, 43577, 195937, 237412, 298358, 125453, -106586, 112273, -55268, -10132, -87483, 388476, -230114, 10980, 269435, 450128, 93546, 102587, 34631, 79192, -213704, 22617, -283859, -122884, 82854, 10358, 6104, 81782, 476548, -57985, 186220, 130890, -32956, 102105, 45442, -53853, 13292, 297111, 174081, -198758, 5643, -51552, 118111, -27719, 92831, 181441, 32246, 144341, 84686, 260229, -148154, -313246, 71239, -58930, -118908, -167210, 62833, -34892, -159160, -304203, 128789, 240720, -116911, -144269, 85898, -171239, 13438, -212286, 149183, 77365, -249749, 292202, 202271, 258486, 95454, -42053, -76400, 109244, 175386, 130662, -78691]
12834A20261c0244k91406C37065d5232n6245j6249A43881a96043j01618E5102
12823d5947C54716b7352n848k4777m2217B48565a26607A36427K2260h7842F4077
12811A86404r905d647C06231A4414b27141h2103k97630D3085i5158k19056B05312
12799b3184j60976B21796a6814B68842a96259A25761O0630E4375a32350k13395
12789c45745C08813i1280g788F6304I93R1386m1508b47162C37300I212J19707
12778A28919a42580c4941F131a93030A68372m3242L41a3532C62554j20262b19292
12766D7093b57405A35722n4727J28508E4323J24069b85719e1221k22362j32425
12756d06008B1379J14921c43649d6939A1424M3992M1581b07068A1595L02151b07619
$$ y = [120261, -30244, -321650, 337065, -45232, -101477, -117726, 143881, -196043, -297661, 55102, -45947, 354716, -27352, -33200, -57977, -100194, 248565, -126607, 136427, 158687, -87842, 64077, 186404, 176499, -4647, 306231, 14414, -227141, -82103, -379733, 43085, -95158, -314214, 205312, -23184, -184160, 221796, -16814, 268842, -196259, 125761, 186391, 54375, -132350, -345745, 308813, -91280, -7788, 66304, 993, 92379, 50871, -247162, 337300, 9212, 128919, -142580, -34941, 6131, -193030, 168372, 125130, 125471, -13532, 362554, 242292, -219292, 47093, -257405, 135722, 80995, 209503, 54323, 178392, -285719, -51221, -273583, -406008, 21379, 136300, -343649, -46939, 11424, 55416, 96997, -207068, 11595, 313746, -207619]
12744a88476q9101B66044f8485j6034B17138b0417E1772K56396p4931J05452A09240
12732a41865D2200a02496C40940b62739B60624A05747k9107K1286a84095B79402
12721I9340B6440b18711M1962G8938Q4753b03002A6998K22678P2691A37908f272
12709C526J90319L25087e5031A16916l8520A2865p47L86941A80093B307a26368
12697e2997D28552a67250C00575j31502l8484Q9687k5388G1438P6203E45b15880
12685H7772e4350A59418h7323A61648d1769j50875F2680M1462J350J72053b4530
12673B38649A06989J37280A01568D899R2195f4562j3743H8154a50156a3591B65071
12661A76580o0577B7250J04005J26497J86763a20014B88622q4491H5188N9263
$$ y = [-188476, -277577, 266044, -68485, -84519, 217138, -20417, 51772, 308168, 233237, 338689, 109240, -141865, 42200, -102496, 340940, -262739, 260624, 105747, 76640, 97926, -184095, 279402, 99340, 26440, -218711, -176749, 78938, 163691, -203002, 16998, 239676, 312367, 137908, -6272, 3526, 193845, 518932, -55031, 116916, 78396, 12865, 12118, 399059, 180093, 2307, -126368, -52997, 428552, -167250, 300575, 169073, 130589, 220276, 194888, 71438, 147641, 545, -215880, 87772, -54350, 159418, -87323, 161648, -41769, -192644, 62680, 104142, 105492, 277545, -24530, 238649, 106989, 244269, 101568, 4899, 97094, -64562, -78305, 88154, -150156, -13591, 265071, 176580, 116003, 27250, 131255, 257752, 444515, -120014, 288622, 204131, 85188, 144451]
12651A44451c0797I5965G71J32751b04968E7578N4563J24020L1106B8023a2532
12639H4862f9517L635n3479A88176o2953J27204c33661A19060n4907K74318I9781
12627A79553o4526J34608G6791L74139A6358O0574J9149b73081A9119l312O2045
12616G7852a46425P1636A7947a05883d513A24879J94686j00411b00233D5263a0627
12604I7988d4879B75505F9040h1351I7268m7321M0648K27031d4062A3218a48311
12592F1434c9886l7843l5914A83624l5071M9113f6085j49479c2551m3151j14676
12581a90378e8116H8417a13064B17108b60483B34983j10914b32543A30011i6377
12570A01587J51265q8086d1769m816F00193B66610a0313l9894A71855f3756A38123
$$ y = [144451, -30797, 95965, 771, 133522, -204968, 57578, 112141, 236161, 267267, 28023, -12532, 84862, -69517, -65882, -119361, 188176, 125223, 252427, -333661, 119060, 64153, 338471, 99781, 179553, 115027, 249635, 76791, 450930, 16358, 76932, 96081, -273081, 19119, 15807, 77852, -146425, -74789, 17947, -105883, -4513, 124879, 319565, 219154, -200233, 45263, -10627, 97988, -44879, 275505, 69040, -81351, 97268, 49947, 90595, 317626, -44062, 13218, -148311, 61434, -39886, -77729, -113643, 183624, 148553, 197666, -66085, -215564, -32551, -75702, -190378, -58116, 88417, -113064, 217108, -260483, 234983, 124069, -232543, 130011, -96377, 101587, 252852, 164766, -41769, -46585, 600193, 266610, -10313, -50207, 171855, -63756, 138123]
12558d1880E9181b43575a7804j09775J6231d7950D7846K23904F7237J85330a16328
12546B26765P6048j29089a29996K9524j5633e2142A2983a57363n1940h0968A62326
12534g4672E895J66245a28931E7655J97086j23083D4975K69404e5325B96074D0576
12522A29144o1967b95647A85924e5908B02545b21612O9793B3169a82385j21183
12512c03568f8703o992j85500H6167m1914b65077F1099K16598e1747b3251A06850
12500D14697a79581G4416a01768A78300p2617o594J01730b1905A2437i4967j80335
12489b75302J18144r9211M6614p770g0947B0238c2833A35812l100a29178C30652
12477D619a9121A1965K2840J11464R1839f4281G2181b79071A00937b39542A67306
$$ y = [-41880, 59181, -243575, -17804, -127579, -111348, -47950, 47846, 271750, 67237, 252567, -116328, 226765, 302813, 173724, -129996, -100472, -116105, -52142, 12983, -157363, -209303, -80968, 162326, -74672, 5895, 172140, -128931, 57655, 254741, 131658, 44975, 314379, -55325, 296074, 40576, 129144, 67177, -295647, 185924, -55908, 202545, -221612, -151819, 23169, -182385, -303568, -68703, -75695, -261195, 86167, 44253, -265077, 61099, 277697, -51747, -23251, 106850, 414697, -179581, 74416, -101768, 178300, 105683, 99089, 200819, -21905, 12437, -94967, -275302, -157158, -256369, -209755, -217525, -70947, 20238, -32833, 135812, 132712, -129178, 330652, 4619, -19121, 11965, 34805, 146269, 238108, -64281, 72181, -279071, 100937, -239542, 167306]
12465A7660L4196R8886b08987A60937b46199C02136a73496B94920A15588b26748
12454b26198M0590m6111A92088a29725A03568K27699a98205E6124e3880A84611
12443D6795a09988n7363Q3063A58698d91120a51234A24798D9964e8998K1147j56001
12432a93852B22566q7468l7654f2577B5621f0666I574L0899e2657E4149a30507
12420D1880R1288P3033b571D4123A795J41825C9997a31066C60966f5252B19107
12408a49633B57264r4785b43956A18974b39346B59422h1861p9746f7992F9247
12397e5635j26540A36348d6857A2704b39699m0709a36594k51368a91951A69895
12386a3557n4807E4595a93567P052A90873l213b68490d6254r567l7161F9197R8195
$$ y = [17660, 51856, 150742, -208987, 160937, -246199, 302136, -173496, 294920, 115588, -226748, -226198, -185608, -231719, 192088, -129725, 103568, 331267, -198205, 56124, -53880, 184611, 46795, -109988, -167351, -84288, 158698, -491120, -151234, 124798, 49964, -58998, -37851, -193852, 222566, 135098, 97444, -62577, 25621, -60666, 9574, 40473, -52657, 54149, -130507, 41880, 133168, 206201, -2571, 44123, 1795, 143620, 39997, -131066, 360966, -65252, 219107, -149633, 257264, 162479, -243956, 118974, -239346, 259422, -81861, -161607, -67992, 69247, -55635, -182175, 136348, -46857, 12704, -239699, -280408, -136594, -387962, -191951, 169895, -13557, -68364, 54595, -193567, -186515, 190873, 187660, -268490, -46254, -55821, -92982, 69197, 167392]
12374A67392O8424j09683J85002a78740M1221A34739P9954b0938j19475m11093
12364e51506A55241g296C641J85582q1594a42905A57735a73974f2281A51499b14784
12352A63249k057L1077k7327j5718J14386C1907L9186f3662K4882o7900k33043
12341c39723C50570j46404E5876b3164A85501G9083a38435A91862a4012l6376
12331e0388b2166l35191f8552B61150K3501a86844r764A56489A4531K60277A09441
12319e8298n3112K0378D3618Q3642d04938M8416A25579c15592A92286H6215b30569
12307a87906B05252a28651j560A4303a07636L7398L1709p4272A58965p9109b08690
12295a85622o1940B50091n4750a49525F5350Q0743o3228K9794B1736K60222f8049
$$ y = [167392, 235816, 126133, 311135, -178740, -137519, 134739, 214693, -20938, -140413, -551506, 155241, -7296, 3641, 189223, 107629, -142905, 157735, -173974, -62281, 151499, -214784, 163249, 161192, 192269, 164942, 149224, 263610, 31907, 71093, -63662, -38780, -106680, -339723, 350570, 204166, 55876, -23164, 185501, 79083, -138435, 191862, -14012, -50388, -22166, -357357, -68552, 261150, 284651, -186844, -196608, 156489, 14531, 274808, 109441, -58298, -111410, -91032, 43618, 127260, -404938, -356522, 125579, -315592, 192286, 86215, -230569, -187906, 205252, -128651, -130211, 14303, -107636, -70238, -38529, -112801, 158965, 79856, -208690, -185622, -247562, 250091, 195341, -149525, 65350, 146093, 82865, 112659, 21736, 281958, -68049]
12283A70520p117b94705A12388c2551B65796A18222l618L11934j91872I351e0977
12271B03512l7896Q8659j08144m9230C8855j5379K90603H6375b8274A3863J95407
12260B09270p9567J46585K21427c2750A99277J51238g0717B27194r1450E1675
12249f3557j82682G5368a16866Q113B56478A18881g3917A97407I3178K06432j27581
12238A72029F8555d4781J7500A39352J36884c5455B82431Q3380a62257C07951
12227e901C59910Q0834C3989b40A28262K74691K1124l2881N0347M5523b1182C0725
12214a63438P8647E9617J03814b7220D09272j75497Q9470H3302A4711L00972G1728
12202C01151P9660K5590A16184K10025a66690B37941K1477Q759B6988J3822O6980
$$ y = [170520, 163403, -294705, 112388, -32551, 265796, 118222, 114604, 426538, 234666, 9351, -50977, 203512, 165616, 254275, 146131, 96901, 38855, 23476, 314079, 86375, -28274, 13863, 209270, 129703, 276288, 497715, -32750, 199277, 350515, -70717, 227194, 135744, 51675, -63557, -246239, 75368, -116866, -108753, 256478, 118881, -73917, 197407, 93178, 299610, 172029, 68555, -44781, -27281, 139352, 276236, -35455, 282431, 365811, -162257, 307951, -5901, 359910, 440744, 33989, -240, 128262, 402953, 424077, 391196, 441543, 487066, -21182, 30725, -163438, -84791, 59617, 163431, -27220, 409272, 233775, 323245, 83302, 14711, 315683, 71728, 301151, 380811, 406401, 116184, 326209, -166690, 237941, 259418, 268177, 26988, 40810, 107790]
12191A07790a71424B58837I7756K31882D3663d0388A40523N4737q4737C6276J61971
12180A98247J32655m7009C9488b3271C15392A23174j368h2780R890L1859A49220
12168c13814B8586b40583A05913i7684C91765f3498A2525a49628A53428K9723
12158A83151a42881D03786a37908A79343l5595L4331l1409a11366A3414K26773
12148B40187a56748G477c90571d2301A66722a60064C16315e8989J5878B48843
12137D6545a18403B2586b80810a11200F3027J34858a32453A85797A4761K90303
12127C05064i0446B16816a02960C8011a8463C56695d3255A50247d6755c350q075
12116a1425j72313A28275b59489A34594l6741a46817E08062a27488l28314H5853
$$ y = [107790, -171424, 258837, 97756, 329638, 43663, -40388, 140523, 195260, 110523, 36276, 198247, 330902, 283893, 39488, -23271, 315392, 123174, 121806, -82780, -72890, -41031, 149220, -313814, 28586, -240583, 105913, -97684, 391765, -63498, 12525, -149628, 153428, 183151, -142881, 403786, -137908, 179343, 143748, 178079, 146670, -111366, 13414, 240187, -156748, 7477, -390571, -42301, 166722, -160064, 316315, -58989, -43111, 248843, 46545, -118403, 22586, -280810, -111200, 63027, 197885, -132453, 185797, 14761, 305064, -90446, 216816, -102960, 38011, -18463, 356695, -43255, 150247, -46755, -3350, -11425, -183738, 128275, -259489, 134594, 97853, -146817, 508062, -127488, -455802, 85853]
12105B94726a757C63951a11295L8234j80732a01611k40819B01988C2841a36097
12094D1961j5856M25654C3470c40951f1833j68286A50772J74525I46K31892a46668
12082d50161f9948A08034b0586k00251H4346K56709Q25259P47006G83729A55882
12071A71336L1634g0689E3436A1568a1052B2443k442a7793F7237k6300c61222
12059F3963P6404D0673O6773m509b06383C47918a01810G5913e05680g5759F0442
12047b187k31705R7585G6153g5006k66704B37121D6252a10794A92852C8019a71876
12035c24720C2778e0552J4753A94604b80393A8416M3640a00392C8677d0158P114
12024c3044I4566d41081A79832a20551A38277c9872A12419a36015f3615A80062
$$ y = [294726, -1757, 363951, -111295, -73061, -253793, -101611, -342430, 201988, 32841, -136097, 41961, 26105, 451759, 33470, -340951, -61833, -230119, 150772, 325297, 946, 232838, -146668, -450161, -69948, 108034, -20586, -220837, 84346, 341055, 1166314, 1913320, 783729, 155882, 171336, 202970, -70689, 53436, 11568, -11052, 22443, 20001, -17793, 67237, 40937, -361222, 63963, 140367, 40673, 107446, 102937, -206383, 347918, -101810, 75913, -505680, -75759, 60442, -2187, -233892, -136307, 76153, -75006, -341710, 237121, 46252, -110794, 192852, 38019, -171876, -324720, 32778, -50552, -35799, 194604, -280393, 18416, 62056, -100392, 38677, -40158, -33044, 94566, -441081, 179832, -120551, 138277, -39872, 112419, -136015, -63615, 180062]
12013E691L48088c33409E0132K34629d2469a2668B37434E6293c23596J30771R1237
12002a01588j04155H1852a15758q596e8208j37314j67593B72320a70167A74022
11991B6686b26940N6154C77977b51021J10874e5334D9916C469a53466E0991J31832
11980A82823k090c04542A40152b885j73451c5787m9238B7020c5924F6773J87205
11969B53978L1449d8158m1755R292o2042c5428j3513l3184k01906L4651D82370
11957H8720c98298D0885j03a7091j30708c7343k10791f6504k24718A39438b25140
11945c6457k89926C8949O5188a55598m0422A85836f3680C5444N3484d1018m1690
11934h2708j02747P6598c6672A81064c75611H4630a2474A89768r4842d7419k02029
$$ y = [5691, 353779, -333409, 50132, 284761, -42469, -12668, 237434, 56293, -323596, -192825, -101588, -205743, 81852, -115758, -124354, -58208, -195522, -363115, 272320, -170167, 174022, 26686, -226940, -170786, 377977, -251021, -140147, -55334, 49916, 3469, -153466, 50991, 182823, 180733, -304542, 140152, -2885, -176336, -35787, -85025, 27020, -35924, 66773, 253978, 285427, -48158, -89913, -80621, -142663, -35428, -48941, -82125, -284031, -249380, 482370, 88720, -398298, 40885, 40782, -17091, -147799, -37343, -248134, -66504, -291222, 139438, -225140, -36457, -326383, 38949, 104137, -155598, -196020, 185836, -63680, 35444, 88928, -41018, -82708, -185455, -108857, -36672, 181064, -375611, 84630, -12474, 189768, 94926, -47419, -249448]
11923b49448h1504C0546b2728p7205G5088L7786J42845p2396G991O6213e65388
11911A32196b40384H255K44541i1284A96344a7549I0655h2468B01913L4034p9702
11900A56245O7534a84978A66953C3141c81953J65748A89827i8780L3647A21997
11889a15936E4114a19735I819a45166J6873A29371b88947B81937D3606i414A22074
11877c4772j20119n8203O5945A21672c5526A8118h1132o9013O1446r4786D27345
11865a49469j72753c5228j11288j63799O3965g2142q4118k95591b5812k61176
11855b86988d2642J509A7606a12665k1531A91627H113K18661b24924A81738b3853
11843I5310g5897b1951A00518h9822A03605C0192b86532g5647C3138a51962e0956
$$ y = [-249448, -81504, 30546, -22728, -99933, 75088, 112874, 255719, 183323, 7991, 74204, -565388, 132196, -240384, 8255, 252796, -91284, 196344, -17549, 90655, -82468, 201913, 235947, 156245, 223779, -184978, 166953, 33141, -381953, -216205, 189827, -98780, -65133, 121997, -115936, 54114, -119735, 9819, -145166, -128293, 129371, -288947, 281937, 43606, -9414, 122074, -34772, -154891, -213094, -147149, 121672, -35526, 18118, -81132, -150145, -88699, -183485, 427345, -149469, -322222, -35228, -146516, -310315, -246350, -72142, -156260, -451851, -25812, -286988, -42642, -41133, 17606, -112665, -134196, 191627, 8113, 226774, -224924, 181738, -23853, 95310, -75897, -21951, 100518, -89822, 103605, 30192, -286532, -75647, 33138, -151962, -50956]
11831a43976A50787c7916B1058a29925n9825A07631P3423e6322j19586f1923A54476
11819F8378J30419G3853O9344a48790H6234J10567e0156r0978f2542a2561l759
11808a6320j0248B6017O2628f7829A29482b14999A27562c13551h0068E4020J65786
11797B19806a0948k99570A22816d98232K47526E0057f3184A15907a78234h465
11786a45435A25920B250c7055o3572j36967d6250q3906d8875K0216N815C09022
11774a11120m9160O6186L814r8037g6251j82174a02120A12402b53684A1469N2669
11763F4138A0273J41648f0255j82055C569J41070b6985B5684K22914p6000n4400
11752A18198E0283a37965d5403C50314A69995f71503B04546a3161j9441j47842
$$ y = [-143976, 150787, -37916, 21058, -129925, -189750, 107631, 181054, -56322, -175908, -61923, 154476, 68378, 198797, 73853, 143197, -148790, 86234, 196801, -50156, -141134, -62542, -12561, -16320, -26568, 26017, 88645, -67829, 129482, -214999, 127562, -313551, -80068, 54020, 219806, -10948, -310518, 122816, -498232, -250706, 50057, -63184, 115907, -178234, -8465, -145435, 125920, 2250, -37055, -100627, -237594, -46250, -130156, -48875, -28659, -22844, 309022, -111120, -160280, -94094, -90280, -188317, -76251, -258425, -102120, 112402, -253684, 11469, 64138, 10273, 151921, -60255, -242310, 3569, 144639, -26985, 25684, 248598, 172598, 118198, 50283, -137965, -45403, 350314, 169995, -671503, 204546, -13161, -32602, -180444]
11742a80444m4566i4315A0368b29118R7455j32886e9338r4271l6770D0705P0368
11731A11073P843b43372a3517p9650L8476G1399J17546a4054k40029A48296g3713
11719B62915K3980b66186A13595a49786f9970B58711B2089N27460b9230D21016
11708B06527i3636F1633J83009j01581a0826A49752J01395j21057E2844d0165
11697a06156c2406C5627b04476D7063R4285c81363B52066c64617E0627A3285K31532
11686B44817N959a20207B09332k3183R8616B0272L6516d309A84492k6897m5607
11675A11988A0223a12783l7414A75293j7601E6141G100c38630D8696a59320B75481
11663a64145c9674A09832d05452d2994b1112j45390g7884D4630d4706n5233B10135
$$ y = [-180444, -225010, -94315, 10368, -229118, -131663, -264549, -59338, -153609, -190379, 40705, 111073, 118916, -243372, -13517, -93167, -54691, 71399, 188945, -14054, -254083, 148296, -73713, 262915, 286895, -266186, 113595, -149786, -69970, 258711, 22089, 549549, -29230, 421016, 206527, -93636, 61633, 244642, 143061, -10826, 149752, 251147, 130090, 52844, -40165, -106156, -32406, 35627, -204476, 47063, 141348, -381363, 252066, -364617, 50627, 13285, 244817, 250776, -120207, 209332, 186149, 284765, 20272, 56788, -4309, 184492, 157595, 111988, 10223, -112783, -150197, 175293, 157692, 56141, 7100, -338630, 48696, -159320, 275481, -164145, -39674, 109832, -405452, -42994, -21112, -166502, -77884, 44630, -44706, -99939, 210135]
11651h68l5899K689r2169A10891a35828M1991b1198B67576A10501b67691B6821
11639b11625C3189C5N5674J00783I410O7237J17272a74304I7893c65971h2111
11627E4252k066J79491a06275l4042j09188B47236G4935C0538A501h0932k33125
11616c14057B23730P3376a5180p711H7492a4732k0661m5584B2933a24683A02296
11604a37136B97821r3126m5366G4880g8509e801E9846P5036a6058A86311e2285
11592g3468o1928C15621J4868r4411j09771P2069B6735C991J86470m2458O5504
11581B13507j1147H4616J24852f7333G7787F604g3901C34934e3541k1969A71089
11569B24738H4435c11776b3739j500O718m0813D2988N9365Q6073K23955j65642
$$ y = [-868, -36767, -34078, -126247, 110891, -135828, -93837, -21198, 267576, 110501, -267691, 26821, -211625, 33189, 35, 55709, 156492, 9410, 76647, 193919, -174304, 97893, -365971, -82111, 54252, 52186, 231677, -106275, -140317, -249505, 247236, 74935, 30538, 1501, -80932, -314057, 223730, 297106, -15180, -22891, 87492, -14732, -35393, -80977, 22933, -124683, 102296, -137136, 297821, 204695, 159329, 74880, -78509, -5801, 59846, 134882, -16058, 186311, -52285, -73468, -135396, 315621, 330489, 236078, 126307, 198376, 26735, 3991, 190461, 148003, 213507, 202360, 84616, 209468, -67333, 77787, 6604, -73901, 334934, -53541, -75510, 171089, 224738, 84435, -311776, -23739, -25239, -18521, -59334, 42988, 102353, 188426, 412381, 246739]
11558B46739g2231c597A56925a97870B01331I1478J98437b955C13329H9615J93169
11547B82784E4172M9487a4412k1999l9286G7996b29973A99391a1800j86767B7414
11535a76739A54680a88943c9652k22119A33359C941f8771b3400B26805D488c5080
11523C2072P0239A2746M6528A1670a5688I9848i7273B43065R2848H5105a5535
11511a60921A21459j0998k3501g2914A66591g305G2228j2599J81409F5954c512
11499C9371a93482N4085C36320A52657C3778J79775c3759A27408K9717e4826A72311
11487E2802L58423j27333A33998d727C15708d3462B5567J00022J55317b02336
11476A10862M11195a36250A65975b9176A83620P0173k4282o68E0577J07913J46871
$$ y = [246739, -72231, -3597, 156925, -197870, 201331, 91478, 289915, -2955, 313329, 89615, 282784, 54172, 103659, -14412, -36411, -75697, 77996, -229973, 199391, -11800, -198567, 27414, -176739, 154680, -188943, -39652, -261771, 133359, 3941, -68771, -23400, 226805, 4488, -35080, 32072, 102311, 12746, 59274, 11670, -15688, 99848, -97273, 243065, 335913, 85105, -15535, -160921, 121459, 110461, 86960, -72914, 166591, -7305, 72228, 59629, 241038, 65954, -3512, 39371, -193482, -139397, 336320, 152657, 33778, 213553, -33759, 127408, 157125, -54826, 172311, 52802, 411225, 283892, 133998, -4727, 315708, -43462, 25567, 125589, 280906, -202336, 110862, 522057, -136250, 165975, -29176, 183620, 253793, 229511, 228843, 50577, 158490, 305361]
11465C05361H5511P0474g3388k16802B876J4422J34067c77211a87914I9183J53110
11454B52293J14629r3220J46849m728A70850o5993c7033k77813A11297A877a59953
11442A26493J23924c254F5802k6302a01986b6026H0382O6902n412o0311B0547
11430I9685O2469a02615j69397h4799B9698L55980P1653a95140K2601c8639j70522
11419b09161N9422H1113J78077q6913J07220o6498a51443C10352B2758a14093
11408c88844h9522a1784p7331q4731P6923q6322F3150H625K60433J1814I6509
11396a47590A8635J90748G217a63053m3731A80600k7257a80959q324A45329P3030
11385B18359A9899R8757M8650C8866a17075o976n3730O7197G8374a63157C7361
$$ y = [305361, 85511, 155985, -73388, -290190, 2876, 17298, 151365, -377211, -187914, 99183, 252293, 366922, 273702, 420551, 415823, 170850, 104857, -37033, -314846, 111297, 1877, -159953, 126493, 250417, -3254, 65802, 39500, -101986, -26026, 80382, 147284, 141872, 81561, 20547, 99685, 162154, -102615, -272012, -84799, 29698, 385678, 457331, -195140, -172539, -38639, -209161, -149739, 81113, 259190, 172277, 279497, 212999, -151443, 310352, 22758, -114093, -388844, -89522, -11784, -89115, -173846, -96923, -183245, 63150, 8625, 269058, 280872, 96509, -147590, 18635, 209383, 7217, -163053, -206784, 180600, 153343, -180959, -189283, 145329, 218359, 19899, 118656, 167306, 38866, -117075, -124051, -177781, -110584, 78374, -163157, 37361]
11373F7190c30756B39337f8097j9145D74041g2388k0195G5847L4121b36664A34846
11361d50776J56105R1181J00506k00731i3910L3097j6673D2221i0403j3861C9187
11349B98917A13084d2387j13414c32B86482j26930f4100l20082H0955M0739m5347
11338G6347b7488C0947R9867K8609a32511k740I268e4628p0754A64401b06857
11326a1776m55810J93888D36657d68903a94998k07098B9643a717l14203g3364
11315g3904A46722g9050B0917g4319C9831a41999d308A92696a06031D31706D8922
11303E8327R165b24372G7344j8098J44068a33823A75793i6794m3980C94363D3293
11291B6422K16449c8145A5331J56618c25132D2179m361P2031B2298i2185p9630
$$ y = [67190, -330756, 239337, -68097, -87242, 474041, -72388, -92583, 75847, 109968, -236664, 134846, -450776, -294671, -203490, -102984, -303715, -93910, -60813, -77486, 42221, -90403, -104264, 39187, 298917, 113084, -42387, -155801, -332, 286482, 159552, -64100, -384182, 80955, 121694, 76347, -27488, 30947, 130814, 159423, -132511, -135251, 9268, -54628, -125382, 164401, -206857, -11776, -467586, -273698, 436657, -468903, -194998, -402096, 29643, -1717, -315920, -73364, -73904, 146722, -79050, 20917, -74319, 39831, -141999, -4308, 192696, -106031, 431706, 48922, 58327, 67492, -224372, 77344, 59246, 203314, -133823, 175793, -96794, -140774, 394363, 43293, 26422, 242871, -38145, 15331, 171949, -325132, 42179, 37818, 109849, 22298, -92185, -171815]
11280a71815b2337F8764a30512B71954b41819e5706A04644g0773o4517p5927c0035
11268a60394m7052b7049q793k15606a21419c7175k35390i9673g173k37145C3103
11256a8514k20547j18702a12720B6026g5747A13493i5487a7432G0167L11639a06251
11244A36452a2821r0833h508j06874A31200n9805R0838M7162b39557a3445C2268
11232B82420g4338j81573B04710h4355j09915L36H4494O8627J51168a40551O1678
11221g8873k24199J41616j4970C1056R7649J05322A7755K44029b78935D4182a42220
11209a38738j5522A92119B5010R214a72467I2150A0921Q2317a16563e8281A12075
11197D00539a84421G6979J44418D5863c50618J49956b9611r1463R103A0736b33336
$$ y = [-171815, -22337, 68764, -130512, 271954, -241819, -55706, 104644, -70773, -135290, -211217, -30035, -160394, -207446, -27049, -35842, -251448, -121419, -37175, -272565, -99673, -7173, -244318, 33103, -18514, -239061, -357763, -112720, 26026, -75747, 113493, -95487, -17432, 70167, 381806, -106251, 136452, -12821, -103654, -8508, -115382, 131200, 71395, 162233, 209395, -239557, -13445, 32268, 282420, -74338, -255911, 204710, -84355, -194270, -193934, 84494, 153121, 304289, -140551, -78873, -303072, -161456, -176426, 31056, 128705, 234027, 17755, 261784, -278935, 44182, -142220, -138738, -154260, 192119, 25010, 34224, -172467, 92150, 10921, 93238, -116563, -58281, 112075, 400539, -184421, 76979, 221397, 45863, -350618, -200662, -29611, -121074, -111971, 10736, -233336]
11185e0591D1633N9119i7343A01547e1548B26916a00814q5662A80543c88565A6160
11173a17755B29143b60279d42D3436a45788D0417b18133E2218J6206i4591B4233
11161B68635A452a92009B3192K75661G7386O8853c84305E1250f1773B91759h6224
11149a81399r8745h645B50893A18024k3030f0890r9363A92692a36331A07465K89450
11138C96915A47344o164b1863B45475g2433A40011l1571J13967p8740j8710o0150
11127F4807R1833b20162m9668C93177d4873B99302j41192b58049a15820m3145
11117a58965C17420j01833J87992j90483c43422b5764o7446F1421N9725a62206
11106A8713g9707G0153J7373A0158b3756C44014B2661R7576J68054j41432J96271
$$ y = [-50591, 41633, 100752, -97343, 101547, -51548, 226916, -100814, -186476, 180543, -388565, 16160, -117755, 229143, -260279, -442, 43436, -145788, 40417, -218133, 52218, 68424, -94591, 24233, 268635, 1452, -192009, 23192, 298853, 77386, 146239, -384305, 51250, -61773, 291759, -86224, -181399, -280144, -8645, 250893, 118024, 94994, -60890, -160253, 192692, -136331, 107465, 396915, 147344, 141180, -21863, 245475, -72433, 140011, 108440, 222407, 143667, 124957, 64807, 156640, -220162, -269830, 393177, -44873, 299302, 158110, -258049, -115820, -158965, 317420, 215587, 403579, 213096, -343422, -25764, -93210, 61421, 121146, -162206, 18713, -79707, 70153, 87526, 10158, -23756, 344014, 22661, 120237, 288291, 146859, 343130]
11095C43130a84289B39498C8571j0189e6154D70467n0271B03874M5429m886f2088
11083D76182B28063k0724C3918q079N52066B76444A01033J83655l6954p1908K94149
11072D69975o8635A28842a9321C42319j0535P1642m4240A71005L04702r7114m458
11061C74135J22916Q0774L0785k76045P2667J58809j5370K47340N2539B85570
11050F87609j70509R7332q4115L9226L10662j59168J20216M9425l07958K07791
11040G90511p7379J45857r7509P2241o6856C55941L04176k5363Q1566j77402k22691
11029C16227O44348k21475j11683j01973R1428K029J19779C27058K99009J03906
11019G29973J58035j01500l28554n9527L22852N0641j26042j78079J6788J27778
$$ y = [343130, -184289, 239498, 38571, 28382, -56154, 470467, 420196, 203874, 249303, 244417, -62088, 476182, 228063, 207339, 33918, 25839, 577905, 276444, 101033, 284688, 247734, 175826, 469975, 401340, 128842, -19321, 342319, 331784, 403426, 359186, 171005, 475707, 378593, 374135, 497051, 577825, 608610, 332565, 405232, 564041, 548671, 796011, 848550, 285570, 687609, 517100, 614432, 530317, 569543, 880205, 721037, 841253, 890678, 582720, 790511, 713132, 858989, 761480, 833721, 766865, 355941, 660117, 634754, 716320, 538918, 316227, 960575, 739100, 627417, 525444, 616872, 618901, 738680, 327058, 626067, 729973, 888008, 786508, 457954, 398427, 721279, 771920, 645878, 467799, 484587, 612365]
11009F12365j53398Q5217q130J30996m2611m6477Q3502r3432L0933M55920k24652
10998H30233n9201k52592K88447C69936N4086P6925J94479R0408L4989l84467
10988D36356J35661J02151L89783j63866P7376J10951j31166Q4862O6663J05792
10978A214563P10627k78720N34341r0201J97362M41350P5257q103j23137j08801
10968B564538K00675p46739j51529M7879k58189L93177k47909k68081K53370l29028
10958A458164K60696q075k22001M85738n94424J65859j20081m37069O9249l28480
10948G29576k30304r5728n0821J24041j54431J47435o4647j82825J61917g2504
10937B50737l3416I2396M4801J34206A24122B5474Q6300C702L9177J29629H2297
$$ y = [612365, 458967, 544184, 536054, 667050, 624439, 577962, 661464, 568032, 598965, 1054885, 830233, 771032, 518440, 806887, 369936, 424022, 500947, 695426, 785834, 820823, 436356, 572017, 674168, 1063951, 900085, 977461, 1088412, 957246, 1042108, 1108771, 1214563, 1925190, 1646470, 2180811, 2090610, 2287972, 2729322, 2804579, 2796476, 2673339, 2564538, 2765213, 2018474, 1866945, 1914824, 1656635, 2049812, 1801903, 1533822, 1787192, 1458164, 1718860, 1710785, 1488784, 1974522, 1380098, 1545957, 1425876, 988807, 1058056, 729576, 499272, 403544, 352723, 476764, 322333, 469768, 405121, 222296, 384213, -72504, 250737, 217321, 92396, 137197, 271403, 124122, 25474, 111774, 3702, 42879, 172508, 82297]
10925h7832j0851d1652A6620a13170A35644e04657C2229K3237a97020j0439k9637
10914b37096J06360B27784b3768l39290E5171J84488A4974L24759j50613a44519
10903A08184A8990K2243i6616A76737i3035o7952f3703a0062A94752f7349B0149
10891A39707F4971a87882B3255K38755D4082A2391a60158k5941d4178A09147B8669
10879C13405P2200A4740i6099j06785B90151a87265b8266J3653j14521G7014b19399
10867b218n0836B59053a61728A55583J78b26095c6082j08247A4440N8823a87858
10855a39937L4866E2636a59283A82209a39309l93089A68987f2364C43698b10966
10844c0701J1666m6927j38999j3307A97620p6467a35454I8053f2866E9383K32620
$$ y = [-87832, -98683, -41652, 16620, -113170, 135644, -504657, 32229, 55466, -197020, -207459, -237096, -130736, 227784, -23768, -363058, 55171, 239659, 14974, 339733, 189120, -144519, 108184, 18990, 41233, -96616, 176737, -93035, -160987, -63703, -10062, 194752, -67349, 20149, 139707, 64971, -187882, 23255, 262010, 44082, 12391, -160158, -186099, -44178, 109147, 28669, 313405, 385605, 14740, -96099, -202884, 290151, -187265, -28266, -14613, -129134, 77014, -219399, -2218, -53054, 259053, -161728, 155583, 155761, -226095, -36082, -144329, 14440, 73263, -187858, -139937, -105071, 52636, -159283, 182209, -139309, -532398, 168987, -62364, 343698, -210966, -30701, -19035, -65962, -204961, -218268, 197620, 121153, -135454, 98053, -62866, 59383, 292003]
10833B92003f2116E8857a1487E722d03777B34515a44597B6352K96P4103b11578
10821I3326M0475b14k49424f9371m64K5025m903k1752A62563C1639J96070J6187
10809B43896b5751B25707b06782o9817a12517i439B28450d215l5391G897a14254
10797A90568a39790J3181A28505b56074A0436O4325b60106c5937k57368a009n0551
10786e1560m72777a67792p0370J18745A48365a43655f3401A73084a2350B49823
10775b07037C12789a6242n6390l0877r8236p8317A67332d0990a9637n3130C1330
10763D8290c16730a10194j46700b3756B3445J99441F3196a13006r2583E5357M4091
10752I9448b92196J27740l5629L2326r3756K5163B10030F7407a66350g4015j38346
$$ y = [292003, -62116, 58857, -11487, 5722, -403777, 234515, -144597, 26352, 26648, 100751, -211578, 93326, 133801, -214, -249638, -69371, -69835, -44810, -49713, -71465, 162563, 31639, 227709, 243896, -25751, 225707, -206782, -276599, -112517, -9439, 228450, -4215, -39606, 7897, -114254, 190568, -139790, -126609, 128505, -256074, 10436, 74761, -260106, -35937, -293305, -1009, -51560, -524337, -167792, -238162, -119417, 148365, -143655, -63401, 173084, -12350, 249823, -207037, 312789, -16242, -72632, -103509, -201745, -280062, 167332, -40990, -19637, -72767, 31330, 48290, -316730, -110194, -256894, -23756, 23445, 222886, 63196, -113006, -205589, 55357, 99448, -292196, -164456, -200085, -167759, -261515, -236352, 210030, 67407, -166350, -74015, -212361]
10741b12361E9852c57006B8588d8810j25147C30899c87253A63676a15592C30039
10730B64165g6247q0352O5900A56483J54907F5081b58243a26748E5298a27578
10719b20k25804q3881O0052e2671F0353b91775P2842c0460m1601q9251A00257
10707H2886J51683b71192B09857M7139i9718A13512a1645F3632J84636D1955O920
10696D8875a49364G2293Q7742f9853A16321E6668a64069b6435G4388E48a65695
10684f0751l42825A26942J01722F6490Q7357o829r182R9003f6823A79900H3048
10672b3193l30507Q3872A71182H280c4811Q069A06246a98430f2296b6143j3476
10661c9619j01695L7072q9307D6512b15065N3887P0471b7167m71101D8596d2229
$$ y = [-212361, 59852, -357006, 28588, -48810, -173957, 330899, -387253, 163676, -115592, 330039, 264165, -76247, -156599, -90699, 156483, 311390, 65081, -258243, -126748, 55298, -127578, -220, -226024, -309905, -249853, -52671, 60353, -291775, -218933, -30460, -72061, -161312, 100257, 82886, 234569, -271192, 209857, 256996, -99718, 113512, -11645, 63632, 248268, 41955, 48875, -149364, 72293, 160035, -69853, 116321, 56668, -164069, -26435, 74388, 548, -165695, -60751, -403576, 126942, 228664, 66490, 153847, 147018, 137836, 236839, -66823, 179900, 83048, -23193, -353700, -269828, 171182, 8280, -34811, -26742, 106246, -198430, -62296, -26143, -39619, -141314, -104242, -193549, 46512, -215065, -161178, -90707, -27167, -498268, 48596, -42229]
10649A3038J13871h2663A42748a90975k62154B4218c5062C0270J604b36811k7626
10638b64437b6016j8626I5049a84747j7846B25708c4865B0873a7772j51187B18440
10626D7593M4527c27599a37500j5880l5869E9920J36288c10341H1930d14873G9752
10614d30816e5021k5177H2644b27833o2416a09681q6993C56902g8188A1054K1573
10603C2627O8663e0960a3205r6830I1962Q8305G4769c20954H8634O4892j511a9016
10590d1218C4034a88637j60234P8526E3469a89404I3289L26689F3840c23529A1789
10578f0787m637A32208C3982N4419C1762b66442G3712b19303k7526c47m04150
10567d04497B09842K2772c3778A13115a9855G1293a00155A0789a38285A20548
$$ y = [13038, 126909, -82663, 142748, -190975, -453129, 24218, -35062, 30270, 31874, -236811, -264437, -26016, -44642, 95049, -184747, -202593, 225708, -34865, 20873, -17772, -168959, 218440, 47593, 92120, -327599, -137500, -153380, -189249, 59920, 196208, -310341, 81930, -414873, 79752, -430816, -55021, -80198, 82644, -227833, -290249, -109681, -196674, 356902, -78188, 11054, 32627, 101290, -50960, -13205, -110035, 91962, 180267, 74769, -320954, 88634, 153526, 152015, -19016, -41218, 34034, -188637, -348871, -270345, 53469, -189404, 93289, 419978, 63840, -323529, 11789, -60787, -65424, 132208, 33982, 88401, 31762, -266442, 73712, -219303, -246829, -347, -404497, 209842, 232614, -33778, 113115, -19855, 71293, -100155, 10789, -138285, 120548]
10556a31307A69737d4656j27318n1850c097k86183J39637k14277a71771d7297
10545B2711L19838f7139b8308C87215a23755H4464k7415J14218a73812b2821b993
10533a1849F7766j4792K14191H4607h3047I8550C3821b59817A92024E3205c14013
10521b68777A09545i3065A23365a30234k81142b0930A87486f1150l72676d629
10510c33014a65703c3708G5090J94755E6513d24947a26376p687N4930A69050l5912
10499A33138l0973R424c0122p5416G1734f680E7713c86238A43394i3287j64223
10488b57510N3829e952A72457a34937D31294c6830k14467D98093L10012A87109
10477B39239Q3723j59064n0027b7666B20512e4160I255b81401h5306I0435J14847
$$ y = [-131307, 169737, -44656, -171974, -223824, -3097, -289280, -149643, -363920, -171771, -47297, 22711, 342549, -67139, -28308, 387215, -123755, 84464, 57049, 171267, -173812, -22821, -2993, -11849, 67766, 52974, 267165, 84607, -83047, 98550, 33821, -259817, 192024, 53205, -314013, -268777, 109545, -93065, 123365, -130234, -411376, -20930, 187486, -61150, -433826, -4629, -333014, -165703, -33708, 75090, 269845, 56513, -424947, -126376, -134063, -79133, 169050, 133138, 102165, 111589, -30122, -105538, 71734, -6680, 57713, -386238, 143394, -93287, -257510, -203681, -5952, 172457, -134937, 431294, -36830, -251297, 498093, 808105, 187109, 239239, 322962, 163898, 113871, -27666, 220512, -54160, 9255, -281401, -85306, 90435, 205282]
10466B05282c9233D8343P2500d25624a62914B61661A02084e9344C53741C8350
10455g2703G1361b25486Q119b7735B12491f0919B08637G2503e1389C7822a17208
10443A3947O1273K74762E9566d2037k36772G678b54681c2423k40306E2028i3621
10431e5207A52181J08009j05444k4091b50873j2972B07343f244A33420d4297A76627
10419A02383b21591A18895a07496J4679j41133Q8953C5758a58297P2213B15909
10408A01946b80435i2621A26504i477k79005a40487L1002j74084J10747A04456
10397A14044a11288A44452h1263A62493D4496b8474j52737J6074A83330c3481
10386F7385a250j56839J6296d1572B67127l3134a51023F8471L3614m1430L00614
$$ y = [205282, -39233, 48343, 120843, -425624, -162914, 261661, 102084, -59344, 353741, 38350, -72703, 71361, -225486, -217367, -27735, 212491, -60919, 208637, 72503, -51389, 37822, -117208, 13947, 75220, 349982, 59566, -42037, -278809, 7678, -254681, -32423, -272729, 52028, -93621, -55207, 152181, 260190, 154746, 130655, -250873, -263845, 207343, -6244, 133420, -44297, 176627, 102383, -221591, 118895, -107496, -92817, -233950, -144997, 35758, -158297, -86084, 215909, 101946, -280435, -92621, 126504, -9477, -288482, -140487, -109485, -283569, -172822, 104456, 114044, -111288, 144452, -81263, 162493, 44496, -28474, -181211, -165137, 183330, -33481, 67385, -1250, -158089, -141793, -41572, 267127, 233993, -151023, 68471, 102085, 60655, 361269]
10375C61269A04299J87775K7535A26324J09294A469L12181J43086J34560B68668
10364C54215n4818n2103D3369P1562L19807B03602N9902A13391f9096B00825l2319
10353A68506J56632k4775M4052J01327m1832E0999K22616Q3002A23484K29079
10343C52563O924J05686k02342j08282K88412J29182k62637A01255K23562H6889
10332A40299K55912J8596a88390E9231J32870G0611b16818a9654D68622i8700
10321A78840q178B4090L6581a41795P0648C33878A19428e1886F8822b85951A2039
10309c4430A54277C7930B125a36676E3089J69095a7809l39603a46505N3117A88392
10297a01818j68793B31314I6779h20I0836b0884j23089O5593I2291K95221a8981
$$ y = [361269, 104299, 292074, 319609, 126324, 235618, 1469, 313650, 456736, 591296, 268668, 354215, 299397, 247294, 43369, 114931, 434738, 203602, 263504, 113391, -69096, 200825, 168506, 325138, 300363, 344415, 445742, 403910, 50999, 273615, 356617, 123484, 352563, 359487, 465173, 262831, 154549, 442961, 572143, 309506, 101255, 324817, 86889, 140299, 396211, 414807, -188390, 59231, 192101, 70611, -216818, -19654, 468622, -98700, 178840, 170662, 24090, 60671, -141795, -71147, 333878, 119428, -51886, 68822, -285951, 12039, -34430, 154277, 37930, 2125, -136676, 53089, 222184, -17809, -357412, -146505, -93388, 188392, -101818, -270611, 231314, 96779, -820, 90836, -20884, -143973, -78380, 92291, 387512, -18981]
10285a584l4666o8676H2897a3360I0087J7106a18293J8353A42620b00599E1064
10273a13472d2837D17792b98148h8206a7520n0596A48205a56654M5400L2691m0362
10262a18925b3184C15529h671E70478I7969P4831a72798N166F04872H3989J64511
10251B48500j20343b17385A0899J18027a00036b2990j30909H0476g5508k14419
10241b89927F3938f0082p1817A11300d9091B01820d3904j51988h1350o5384n9831
10230b06565C6758b4805q5259B08746i2687b5411D7028b98688K1614B9869i9009
10218a59343h342E7001i8557k55447a47594O4419j1812j72464A29787j5914C8036
10206d0805j07449e0192o2223j40680a12463A74987d1922l6182h591C640a08815
$$ y = [-1584, -36250, -104926, 82897, -13360, 90087, 107193, -118293, -99940, 142620, -200599, 51064, -113472, -42837, 417792, -298148, -88206, -17520, -68116, 148205, -156654, -111254, -78563, -118925, -23184, 315529, -8671, 570478, 97969, 172800, -172798, -167632, 604872, 83989, 248500, 128157, -217385, 10899, 128926, -100036, -22990, -153899, 80476, -75508, -289927, 63938, -60082, -131899, 111300, -49091, 201820, -43904, -195892, -81350, -146734, -206565, 36758, -24805, -110064, 208746, -92687, -25411, 47028, -298688, -277074, 29869, -99009, -159343, -8342, 57001, -98557, -354004, -147594, -83175, -94987, -267451, 129787, 113873, 38036, -40805, -148254, -50192, -112415, -253095, -112463, 174987, -41922, -78104, -8591, 3640, -108815]
10194d7948q0548L7120m2788d4182E4844j2146K45460g8753G9217c18986J46401
10183a72585n7547h8215l41231H3268Q1411i7769b1369k14042c4546q6901K7279
10172i4168H4837H948O143K36048a27087i916k55074B24670b11320E2939a96896
10160a09250b2404A07214d57493B65233J16499b09372c8339B90434j03679n0123
10150A36632J10842a41440B3769b31402F5342R0674C5105a1608j41869A25363
10139A7191e58891b26534j07433d1582o1809G7582d9624J6124j7584A16974C607
10127F6598a53294I5225b14518d0844l15651a22972A39372K8760a30845F9271
10116a34309a0901I2089a13886H0948a06450B12827a10727k39534p4188a63134
$$ y = [-47948, -128496, -91376, -134164, -44182, 54844, 42698, 288158, -78753, 79217, -318986, -172585, -230132, -88215, -429446, 83268, 164679, -97769, -21369, -235411, -34546, -121447, -94168, 84837, 8948, 15091, 251139, -127087, -9916, -264990, 224670, -211320, 52939, -196896, -109250, -22404, 107214, -457493, 265233, 381732, -209372, -38339, 290434, 186755, 136632, 247474, -141440, 23769, -231402, 65342, 156016, 35105, -11608, -153477, 125363, 17191, -558891, -226534, -333967, -41582, -103391, 77582, -49624, -33500, -51084, 116974, 3607, 66598, -153294, 95225, -214518, -40844, -356495, -122972, 139372, 168132, -130845, 69271, -134309, -10901, 92089, -113886, 80948, -106450, 212827, -110727, -350261, -424449, -163134]
10105A4444a11679a4047A99755a50844g1687j80582I9417R036a0679k87966f8807
10093C9229O4733m4750c10279J4524N6920b5503j67717d3034A59932b06688d4589
10081b7463j26917d5858B76443D6971b69686f9229A8594b96587r4219f5490F8760
10069c43476b117I5905a47099O3842j12874l457A4583c96124A65878p3476a44796
10057b04448c0229j65064k1641j54359J51592Q5687A35260g3069A61181p6188
10047H4993j3192A8432P0894e2732l5897I897c07660A4018D939Q6789J37675a1865
10034f22A40089b8923o1883A48256b26889A12669b30852B9832a96728l486B57745
10022I9565m4238a01084D5169O0678Q4191a38164j59028a10312C8024J68661G1104
$$ y = [14444, -111679, -14047, 199755, -150844, -71687, -252269, 99417, 108453, -10679, -298645, -68807, 39229, 103962, 59212, -310279, -295755, -238835, -25503, -193220, -43034, 159932, -206688, -44589, -27463, -154380, -45858, 276443, 46971, -269686, -69229, 18594, -296587, -390806, -65490, 68760, -343476, -2117, 95905, -147099, -83257, -196131, -199588, 14583, -396124, 165878, 92402, -144796, -204448, -30229, -195293, -216934, -371293, -219701, -134014, 135260, -73069, 161181, 84993, 71801, 18432, 89326, -52732, -88629, 9897, -307660, 14018, 4939, 91728, 229403, -11865, -622, 140089, -28923, -90806, 148256, -226889, 112669, -230852, 29832, -196728, -200214, 257745, 99565, 55327, -101084, 45169, 105847, 190038, -138164, -297192, -110312, 38024, 206685, 71104]
10010a74334N3805A36036a84596K4372b0372B655b7187m337o7510m189m8690n7763
9998b09676R7618B5904b65878E6840J23317b71477a17513A6274a22330F7317e2203
9986h7765j88862f1837j97360b1235k03926A13680d0990E1915g5767F5654J9283
9975H4937a51984A18299Q534D8893a69103A98398e32120F1348a75168B50398b63739
9963A92751M5604I7092a26131G1030b68747J5860k83472H0435K62686c1614e685
9951a21676G2688h2327G2223J46525g3128j19929k32444a13223A05346b17366
9940H2411c28286i2529j84902c3023B35423A8934c48838a73879Q0409q4688O0919
9929a17239G7202M00342D1105a32182k69469a82071L6597A69408D1623i6715j98190
$$ y = [-174334, -120529, 136036, -184596, -160224, -20372, 2655, -27187, -31524, -99034, -103223, -151913, -209676, -112058, 25904, -265878, 56840, 180157, -271477, -117513, 16274, -122330, 67317, -52203, -87765, -276627, -61837, -259197, -21235, -225161, 113680, -40990, 51915, -75767, 65654, 84937, -151984, 118299, 126833, 48893, -169103, 198398, -532120, 61348, -175168, 250398, -263739, 192751, 238355, 97092, -126131, 71030, -268747, -252887, -536359, 80435, 343121, -31614, -5685, -121676, 72688, -82327, 72223, 218748, -73128, -193057, -425501, -113223, 105346, -217366, 82411, -328286, -92529, -277431, -33023, 235423, 18934, -348838, -173879, -93470, -178158, -117239, 77202, 477544, 41105, -132182, -401651, -182071, -145474, 169408, 41623, -96715, -294905]
9918b94905i174k23790M941a01889J8961F0454a55455q8104O8054I9150m697K3159
9906A17612Q3888b46233F1115b01950k5695j57204c6339A17728a85920m8237o7029
9895c01186I4795h2656A85994G7439b69013J3691e205j94431g2440c0474C04877
9883g3473A42421a77304f8374b0191l06618i0858k69665i2526j18853I540K8238
9872C7778e7143A41422l0739b69863B55588j05619c43301P041J0041a0929q5173
9861i6102A44206D2365h8905b5278k1594j7913j98102a2562A57844a24632B38750
9849a42064A53965c13246J48498B21554e9701A40710a18067I3032b66656J18450
9839a48206J3971C7369K39806a63358E8330a3241k2543p7460G2687b28231B7864
$$ y = [-294905, -9174, -232964, -228023, -101889, -82928, 60454, -155455, -243559, -175505, 99150, 94453, 117612, 201500, -246233, 61115, -201950, -227645, -384849, -36339, 117728, -185920, -234157, -301186, 94795, -82656, 185994, 77439, -269013, -255322, -5205, -199636, -72440, -30474, 304877, -73473, 142421, -177304, -68374, -20191, -326809, -90858, -360523, -92526, -211379, 9540, 37778, -57143, 141422, 110683, -269863, 255588, 149969, -343301, -336260, -326219, -10929, -96102, 144206, 42365, -88905, -25278, -46872, -64785, -262887, -12562, 157844, -124632, 238750, -142064, 153965, -313246, -164748, 221554, -59701, 140710, -118067, 93032, -266656, -148206, -134235, 37369, 277175, -163358, 58330, -13241, -35784, -113244, 72687, -228231, 27864]
9827A97217i387o4956A00669a17984B98616a19026M9959o7827K0992I5500C1255
9815d4696l7687k4544L440d7029B22944a40973d5705q2211a4135j40827d7892
9803c69653c2394j54109D8735b03635A53572k525d86607J66318P7085A26900k6980
9792I9920L27308f7734j96592a30146k28802J50363G9844a05444B55534d50105
9781D4432b029k88053J26297d812j18828K7098j2778B0295i8964o7577B09290
9769C2697a32020N8471C5640b1447k44877P6189h819k40594Q9809F2834b08782
9757a32641D5757I917J06928b77989l487P3841B14541b54181B7109i1865k32149
9746c24014C0972c4617j30811A79704d0860B55606j02443a28505L419L2128o8630
$$ y = [197217, -9387, -74343, 100669, -117984, 298616, -119026, -69067, -136894, -115902, 95500, 31255, -44696, -82383, -106927, -103487, -47029, 222944, -140973, -45705, -127916, -14135, -154962, -47892, -369653, -32394, -186503, 48735, -203635, 153572, 151047, -486607, -320289, -243204, 126900, 99920, 427228, -67734, -264326, -130146, -358948, -208585, 79844, -105444, 255534, -450105, 44432, -2029, -290082, -163785, -4812, -123640, -96542, -109320, 20295, -98964, -166541, 209290, 32697, -132020, -73549, 35640, -21447, -266324, -190135, -8819, -249413, -159604, 62834, -208782, -132641, 45757, 9917, 116845, -277989, -281476, -207635, 214541, -254181, 27109, -91865, -324014, 30972, -34617, -165428, 179704, -40860, 255606, 153163, -128505, -125086, -92958, -161588]
9735a61588B7970b10205j62024A31976J15362F787a83259k36372J04076O9442
9725b46113A53519a53129A2e36256a47749f1416j11372k924Q6312A18451b98669
9713D3311A6460J46490c8686j1398j02585A16521A4026b20500R2093j51291f2271
9701a4104B65768D963b24524P2883a9860q68m946A68366b49232Q7643m4596B86316
9688b21412j29330a21573A14780E662K78562a78931b9285l6089K4730m14059G6427
9676c3035n0832j6187m36528A24280a12683k1932B14625a7891j58776g9808I8825
9664b47471R4721E7324c23116a3498p8692B868J95155b45440a05768k01651B8110
9652a28728I5836Q60K6685b93261a03884l3549m223o6570l3083C02347e4335q1138
$$ y = [-161588, 27970, -210205, -372229, 131976, 247338, 6787, -183259, -419631, -315555, -246113, 153519, -153129, 12, -536256, -147749, -61416, -172788, -175712, -89400, 118451, -298669, 43311, 16460, 162950, -38686, -50084, -152669, 116521, 14026, -220500, -128407, -279698, -62271, -14104, 265768, 4963, -224524, -151641, -19860, -20728, -25674, 168366, -249232, -161589, -206185, 286316, -221412, -350742, -121573, 114780, 5662, 284224, -178931, -29285, -65374, -40644, -454703, 76427, -33035, -83867, -100054, -536582, 124280, -112683, -134615, 214625, -17891, -176667, -79808, 98825, -247471, -152750, 57324, -323116, -13498, -92190, 2868, 198023, -245440, -105768, -307419, 28110, -128728, 95836, 96696, 123381, -293261, -103884, -137433, -141656, -208226, -241309, 302347, -54335, -135473]
9640a35473D6041f023H4178a26076K0061A35108a69996e9257A16289b25161c4489
9628e8724q9327r0564d9632l23541c3714C48470a50587q1405c6641p0523B18637
9616c65849j6336a70604C9364e2869l8003J6024B21378a40883A35574b28764C3965
9604A89558a10451m5199B6761a9377k07812C59094a43067j04158f408A89997b11118
9592e4196j31575f8086K1550A43666b14265A26571c1838n07367B3879e530A5789
9580c06652J53237A07073e8646A11697h395I3345H006c6255j13457j17810O7233
9569b00289a7865D4317g2609p6444j57574L4474A94019e9276l37599A76904c2545
9557B27418e1883n7380A04151b51889b017k52534M3882N6410A48508N2149a6343
$$ y = [-135473, 46041, -6023, 84178, -126076, -106015, 135108, -169996, -59257, 116289, -225161, -34489, -58724, -148051, -238615, -49632, -373173, -33714, 348470, -150587, -231992, -36641, -107164, 218637, -365849, -382185, -170604, 39364, -52869, -90872, -74848, 221378, -140883, 135574, -228764, 33965, 189558, -110451, -155650, 26761, -19377, -227189, 359094, -143067, -247225, -6408, 189997, -211118, -54196, -185771, -68086, -46536, 143666, -214265, 126571, -31838, -539205, 23879, -5530, 15789, -306652, -153415, 107073, -58646, 111697, -8395, 93345, 8006, -36255, -149712, -267522, -200289, -17865, 44317, -72609, -149053, -306627, -272153, 194019, -59276, -396875, 176904, -32545, 227418, -51883, -109263, 104151, -251889, -2017, -254551, -210669, -154259, 148508, 200657, -16343]
9545c56982J72397H3091C6376d2271j50177j89937A6430d33700g1525F5699c6011
9533a81590g3431a4142D1716a90078e267k57942B00174a38428j02378A96621c53618
9521D10178A42174m5665L7813a94697m0477i3479B7985b50834c4215l1372a4741
9509C25244a71853k05698A9918G161b20485L0606A3274b15699K6049l3259h1347
9497A08642a93254A41034b07959J8794D0887J8288K5156k0217J04848b00156F861
9485a44508j54580A6444b53302a2225A08341a0325C95642b87615B843R3148b18816
9473B435a0845j2485C7921a66955k58755c3660B7703a50653q2930b9341m07345
9462d36686a66649J4489M9291K7789j60306h2004D8606a99179j78278g3332B59103
$$ y = [-356982, -184585, 83091, 36376, -42271, -192448, -382385, 16430, -433700, -71525, 65699, -36011, -181590, -73431, -14142, 41716, -190078, -5267, -263209, 200174, -138428, -240806, 196621, -353618, 410178, 142174, 96509, 134322, -194697, -235174, -93479, 27985, -250834, -34215, -65587, -14741, 325244, -171853, -377551, 19918, 7161, -220485, -189879, 13274, -215699, -189650, -222909, -81347, 108642, -193254, 141034, -207959, -189165, 40887, 59175, 84331, 64114, 168962, -200156, 6861, -144508, -299088, 16444, -253302, -12225, 108341, -10325, 395642, -287615, 2843, 95991, -218816, 2435, -10845, -23330, 37921, -166955, -425710, -33660, 27703, -150653, -233583, -29341, -436686, -166649, -152160, -102869, -75080, -235386, -82004, 48606, -199179, -377457, -73332, 259103]
9450A32803b99954N9195I7949J30289g1175A79554E8664a18059q8637P5897H4609
9438b20826D2423b21147A05134a42004F0354a71177b0134A7194a45198H929D100
9426a43884b3977k45262G1779K1277b73843a18735M8936B11157f8868r317c4178
9414a05662l6412p3209i8343k971B45794D3693j2647e523j5570k51551A50230
9402G1430N2715d376B20958a18895j35611i4127D3485O4745D6222a43859e4041
9390b23379a05070B1675L4905b48165N2372I626K5759K56911a47071C1621a04403
9378c18017i9223k57148i9991j11910B54847c09231a11142j00400O5451j04895
9368b50986a4297k5622A37577A1769a17317i381l00179J10493C8657O45N2289
$$ y = [132803, -299954, -240759, 97949, 228238, -71175, 179554, 58664, -118059, -206696, -130799, 84609, -220826, 42423, -221147, 105134, -142004, 60354, -171177, -20134, 17194, -145198, 8929, 4100, -143884, -23977, -269239, 71779, 93056, -273843, -118735, -69799, 211157, -68868, -78185, -34178, -105662, -142074, -215283, -98343, -101314, 245794, 43693, 31046, -5523, -21093, -272644, 150230, 71430, 124145, -4376, 220958, -118895, -254506, -94127, 43485, 108230, 46222, -143859, -54041, -223379, -105070, 21675, 56580, -248165, -195793, 9626, 35385, 292296, -147071, 31621, -104403, -318017, -99223, -356371, -99991, -211901, 254847, -309231, -111142, -211542, -146091, -250986, -14297, -39919, 137577, 11769, -117317, -9381, -309560, -199067, 38657, 39302, 91591]
9357I1591b7466k64404A03719i8143K682J0883k38517i1655b7589k71501l7233
9346c36323I2355b03499A71477c3324k25228j32111J26180A6269J37579b01887
9335e8105k70688M0650g6815m7874B47913Q9119E9649i9549H1872h1237k1636
9324a02873p8487j45356J47578B7802a93167f5920A89802g1957j28688f6803j65837
9313b32640h8887r1273M3613j83233J31756J7271E1745a70907N0496A56470K2881
9302A79351a87914C5316a30131A55603b11909H5175a75768q5943a630j10681N1098
9291f1213m7796B04102q9535N6143a96782R1468A93015a76091E4840j1056b18438
9279a10593L342d8052A8050J75654e7089k42037f6812q1087N0474M7860b4160
$$ y = [91591, -27466, -291870, 103719, -98143, -95461, -84578, -323095, -91655, -27589, -299090, -336323, 92355, -203499, 171477, -33324, -258552, -390663, -264483, 16269, 153848, -201887, -58105, -328793, -288143, -76815, -124689, 247913, 337032, 59649, -99549, 81872, -81237, -102873, -181360, -326716, -179138, 27802, -193167, -65920, 189802, -71957, -200645, -66803, -232640, -88887, -180160, -136547, -319780, -188024, -170753, 51745, -170907, -120411, 156470, 179351, -187914, 35316, -130131, 155603, -211909, 85175, -175768, -261711, -1630, -112311, -61213, -109009, 204102, 114567, 170710, -196782, -105314, 193015, -176091, 54840, 43784, -218438, -110593, -107251, -48052, 18050, 193704, -57089, -299126, -66812, -147899, -97425, -49565, -24160]
9267b66467B34319I8981J7822C1171b70317J04356A14789b7855j93930j0973G5
9255b86325p3649a02759C45635D3115d3028I1681a63230m4598C0863M5237a76850
9243g3180k50461A5643E419a47700Q189C078g5915B4251a15616j01582P4891l78163
9231e20470a57257B12593e4870k25074A54058e0738A23789O5174p6056g0600c2810
9219d5250j83556A93757G2153b42548c3371k71178A13439J24445b54391D6430
9208C5821a20365k7594I8857e4228j35170O3801B2917c93444H1595b30494B22674
9196b67789O8235B19668c06670a7926G310c75586i1758A61255a85788f651E686
9184E6664b64439i1287m939H5288a70373A9721i198p838j59316A2626a54720d756
$$ y = [-266467, 234319, 98981, 116803, 31171, -270317, -165961, 114789, -27855, -221785, -232758, 75, -286325, -359974, -102759, 345635, 43115, -43028, 91681, -163230, -207828, 30863, 76100, -176850, -73180, -323641, 15643, 5419, -147700, -139511, 3078, -75915, 24251, -115616, -217198, -142307, -520470, -157257, 212593, -54870, -279944, 154058, -50738, 123789, 188963, 112907, -70600, -32810, -45250, -228806, 193757, 72153, -242548, -33371, -304549, 113439, 237884, -254391, 46430, 35821, -120365, -147959, 98857, -54228, -189398, -125597, 22917, -393444, 81595, -230494, 222674, -267789, -199554, 219668, -306670, -17926, 7310, -375586, -91758, 161255, -185788, -6651, 5686, 56664, -264439, -91287, -96226, 85288, -170373, 19721, -9198, -17036, -176352, 12626, -154720, -4756]
9171A74905b84568a0673A82384b6136L897k51473A7298c37591F7268k5685a58649
9159D7251K38725C0211c17644a50670n4117F0010L898k1993R9758b108j11067
9148a13175I8203k5244d76216a82440c2682j16209C8682A7329b02120h7436B43127
9136i754p0759H494c25819J48928A04921d8737G7314f0892n4134N1538G0039b17102
9123a44389M5694p0875M9916d6308k69773m2689J36473A16887C4700e11o4754
9112f5265j01507B59431a47773l08879a21808j489K7052n6939M8444K6399B71755
9100b99465e3948H5156J72301I3958B312K9209a22490n3821A71862f6945K3815
9089d3130B74087m2100a12774I3790N5849b6616B67791j06423l7141a82054F9233
$$ y = [174905, -284568, -10673, 182384, -26136, -22239, -273712, 17298, -337591, 67268, 41583, -158649, 47251, 285976, 30211, -317644, -150670, -204787, 60010, 63908, 41915, 141673, -2108, -113175, 98203, 72959, -476216, -182440, -32682, -148891, 38682, 17329, -202120, -87436, 243127, -9754, -80513, 8494, -325819, -176891, 104921, -48737, 77314, -60892, -115026, -63488, 70039, -217102, -144389, -98695, -169570, -119654, -46308, -316081, -358770, -222297, 116887, 34700, -511, -65265, -166772, 259431, -147773, -456652, -121808, -123297, -96245, -153184, -104740, -78341, 271755, -299465, -53948, 85156, 257457, 93958, 2312, 31521, -122490, -176311, 171862, -66945, -43130, 274087, 231987, -112774, 93790, 149639, -26616, 267791, 161368, 124227, -182054, 69233]
9077a1691j89828b7448n3542j6190d4568C07367B402M97965b94645J26972e9696
9065b54196h709j73651D3983c28079a6182j82079j5548p8892J32952k61316a02290
9053F9388a97211A25374k4513g6273A2985J9539b8701n9741H6545a09013C7845
9041a05039A4402K6980P3669a78054G0770b04707H4006e9164D8694R1264m6826
9030I3132b15389A5331a57033j53082J35342L7673j10552N60k37807a30628q6567
9019b17195B24911a85858j11595C07969A20078k7386h5130r8809d112l44869J60212
9008a88769K9330j9183G3205a37042r4885B99900E6990a18258j40647B3878P5045
8997I8923n726D2147J21646O9162a35750C3693b678n1534b1202A89253h2989D937
$$ y = [-11691, -201519, -27448, -80990, -97180, -44568, 307367, 2402, 500367, -294645, -167673, -59696, -254196, -8709, -182360, 43983, -328079, -16182, -198261, -213809, -292701, -159749, -421065, -102290, 69388, -197211, 125374, 100861, -76273, 12985, 32524, -28701, -88442, 86545, -109013, 37845, -105039, 14402, 41382, 115051, -178054, 70770, -204707, 84006, -59164, 48694, 139958, 93132, -215389, 15331, -157033, -310115, -174773, -137100, -247652, -247092, -484899, -130628, -217195, 224911, -185858, -297453, 307969, 120078, 92692, -85130, -183939, -4112, -348981, -188769, -159439, -178622, 73205, -137042, -231927, 299900, 56990, -118258, -258905, 23878, 98923, 93197, 42147, 163793, 232955, -135750, 33693, -2678, -54212, -21202, 189253, -82989, 4937]
8984e46237b23385a09922k33049o9249A01344k2262a89142b1788I2508b04413
8973A19191d254j75340k62676A9501a69233J6992A2609a9363D5835e6959j06094
8962a63053O6344F1220a33025j24737H7389j5759c09868B8832h7532A00006L422
8951A03428b95711A57246j58J27984I7293b50301Q4010m08836A77397R4052b60680
8939G7832A5867J46324J26744J6623j11440J23063e2757b4583j4320l64984J73565
8928b30322j1359B94960K45024J46251R76440L646671Q490006k732535D192283
8918A810048H88003m05407A44656J32017K860O0863A61828k297N5528J35353A74635
8906C48311G5350L2922b22542B32713G9655R8063a43601a71B29629q4793G0251
$$ y = [-546237, -223385, -109922, -342971, -412220, 101344, 79082, -189142, -21788, 92508, -204413, 119191, -4254, -179594, -442270, 19501, -169233, -152241, 12609, -19363, 45835, -56959, -163053, -96709, 61220, -133025, -257762, 87389, 71630, -309868, 28832, -87532, 100006, 103428, -295711, 157246, 157088, 285072, 97293, -250301, -166291, -575127, 177397, 271449, -260680, 77832, 15867, 162191, 288935, 305558, 194118, 317181, -52757, -24583, -38903, -403887, -230322, -241681, 294960, 539984, 686235, 1662675, 5309346, 13799352, 11066817, 4192283, 1810048, 888003, 482596, 144656, 276673, 279533, 340396, 161828, 159531, 215059, 350412, 174635, 348311, 75350, 108272, -222542, 232713, 79655, 177718, -143601, -171, 229629, 144836, 70251]
8894h4916j44718q3554K0485B5441J85713C6157j3883a7905n5374A1172f3876
8882a23038k79873a45076c7633q9782B01444g015l4573l3644A48192D1419a77033
8870g8404I3174J52172c74617f658l54098J53591j10448A46302b21492j05374
8860c26866a21769B40483a34812e720j86924A28519b7945A54957E8325b4728B45178
$$ y = [-84916, -229634, -313188, -292703, 25441, 211154, 36157, 22274, -17905, -73279, 11172, -63876, -123038, -402911, -145076, -37633, -127415, 201444, -7015, -41588, -75232, 148192, 41419, -177033, -78404, 93174, 245346, -374617, -6658, -360756, -207165, -317613, 146302, -221492, -326866, -121769, 240483, -134812, -5720, -192644, 128519, -27945, 154957, 58325, -24728, 245178]
$$ [...]
##END NTUPLES=NMR SPECTRUM
##END=
