##TITLE=AC1508_CUNDCR13315_8126600_pgbkpb7KZe
##JCAMPDX= 6.0         $$ Bruker NMR JCAMP-DX V2.0
##DATA TYPE= NMR SPECTRUM
##DATA CLASS= NTUPLES
##ORIGIN= BRUKER
##OWNER= Administrator
$$ 1.72 TOPSPIN		Version 2.1
$$ 2013-08-16 20:46:18.210 -0700  Administrator@X
$$ Compression mode = diff/dup
##.OBSERVE FREQUENCY= 400.02188249412
##.OBSERVE NUCLEUS= ^1H
##.ACQUISITION MODE= SIMULTANEOUS (DQD)
##.ACQUISITION SCHEME= undefined
##.AVERAGES= 8
##.DIGITISER RES= 22
##SPECTROMETER/DATA SYSTEM= spect
##.PULSE SEQUENCE= zg30
##.SOLVENT NAME= COFFEE_meoh
##.SHIFT REFERENCE= INTERNAL, COFFEE_meoh, 1, 14.98509
##AUDIT TRAIL= $$ (NUMBER, WHEN, WHO, WHERE, PROCESS, VERSION, WHAT)
$$ ##TITLE= Audit trail, TOPSPIN		Version 2.1
$$ ##JCAMPDX= 5.01
$$ ##ORIGIN= Bruker BioSpin GmbH
$$ ##OWNER= Administrator
$$ $$ E:\/data/COFFEE/nmr/AC1508_CUNDCR13315_8126600_pgbkpb7KZe/20/pdata/1/auditp.txt
$$ ##AUDIT TRAIL=  $$ (NUMBER, WHEN, WHO, WHERE, PROCESS, VERSION, WHAT)
(   1,<2013-08-16 20:46:11.710 -0700>,<Administrator>,<X>,<go>,<TOPSPIN 2.1>,
      <created by zg
	started at 2013-08-16 20:45:05.303 -0700,
	POWCHK enabled, PULCHK disabled,
       configuration hash MD5:
       C8 4E 4E 5D D3 5C D8 9E 9F 52 82 E0 59 8A DE 15
       data hash MD5: 64K
       9F 4E 75 4D 86 A7 71 E0 E8 D8 43 BF 2F 2E E4 46>)
(   2,<2013-08-16 20:46:14.616 -0700>,<Administrator>,<X>,<proc1d>,<TOPSPIN 2.1>,
      <Start of raw data processing
       efp LB = 0 FT_mod = 6 PKNL = 1 PHC0 = 0 PHC1 = 0 SI = 32K 
       data hash MD5: 32K
       01 CC 22 CB 3E EC 16 15 23 C8 31 A7 15 F4 9D 13>)
(   3,<2013-08-16 20:46:14.928 -0700>,<Administrator>,<X>,<proc1d>,<TOPSPIN 2.1>,
      <pk PHC0 = 101.5521 PHC1 = 0 
       data hash MD5: 32K
       EB 6C D7 2A 6F A9 07 1B 65 3D 99 68 42 B0 E3 40>)
(   4,<2013-08-16 20:46:15.053 -0700>,<Administrator>,<X>,<proc1d>,<TOPSPIN 2.1>,
      <abs ABSG = 1 
       data hash MD5: 32K
       B9 D0 00 08 54 7A C5 B7 FE 60 6E 10 8E 11 AB 5C>)
(   5,<2013-08-16 20:46:15.132 -0700>,<Administrator>,<X>,<proc1d>,<TOPSPIN 2.1>,
      <abs ABSG = 2 
       data hash MD5: 32K
       90 01 EE 2C E0 C5 FB F0 B7 03 72 94 A0 EF E6 76>)
(   6,<2013-08-16 20:46:15.194 -0700>,<Administrator>,<X>,<proc1d>,<TOPSPIN 2.1>,
      <abs ABSG = 3 
       data hash MD5: 32K
       B0 7C 74 62 39 0A B8 65 3E 3F C3 F7 FD E5 91 77>)
(   7,<2013-08-16 20:46:15.257 -0700>,<Administrator>,<X>,<proc1d>,<TOPSPIN 2.1>,
      <abs ABSG = 4 
       data hash MD5: 32K
       5A E3 A9 7C F8 51 F6 BA 3A 58 DC EB D4 A7 88 A8>)
(   8,<2013-08-16 20:46:15.288 -0700>,<Administrator>,<X>,<proc1d>,<TOPSPIN 2.1>,
      <abs ABSG = 5 
       data hash MD5: 32K
       C6 65 11 19 02 E4 9E 55 EF 2A 8C 4E 44 6C 7D CF>)
$$ ##END=
$$ 
$$ $$ hash MD5
$$ $$ 2D 81 B2 93 61 C7 F2 F0 F3 69 6F 67 F8 27 E6 29
##$RELAX= 
##$RELAX= 
##$RELAX= 
##$RELAX= 
##$RELAX= 
##$RELAX= 
##$RELAX= 
$$ Bruker specific parameters
$$ --------------------------
##$DU= <E:\>
##$EXPNO= 20
##$NAME= <AC1508_CUNDCR13315_8126600_pgbkpb7KZe>
$$ [...]
150 150 150 150 150 150 150 150
##$TP07= 0
##$TPNAME0= <>
##$TPNAME1= <>
##$TPNAME2= <>
##$TPNAME3= <>
##$TPNAME4= <>
##$TPNAME5= <>
##$TPNAME6= <>
##$TPNAME7= <>
##$TPOAL= (0..7)
0.5 0.5 0.5 0.5 0.5 0.5 0.5 0.5
##$TPOFFS= (0..7)
0 0 0 0 0 0 0 0
##$TUNHIN= 0
##$TUNHOUT= 0
##$TUNXOUT= 0
##$USERA1= <user>
##$USERA2= <user>
##$USERA3= <user>
##$USERA4= <user>
##$USERA5= <user>
##$V9= 5
##$VALIST= <valist>
##$VCLIST= <CCCCCCCCCCCCCCC>
##$VD= 0
##$VDLIST= <DDDDDDDDDDDDDDD>
##$VPLIST= <PPPPPPPPPPPPPPP>
##$VTLIST= <TTTTTTTTTTTTTTT>
##$WBST= 2048
##$WBSW= 25
##$XGAIN= (0..3)
0 0 0 0
##$XL= 0
##$YL= 0
##$YMAX_a= 632047
##$YMIN_a= -540325
##$ZGOPTNS= <>
##$ZL1= 120
##$ZL2= 120
##$ZL3= 120
##$ZL4= 120
##$ABSF1= 14.98509
##$ABSF2= -5.573092
##$ABSG= 5
##$ABSL= 3
##$ALPHA= 0
##$AQORDER= 0
##$ASSFAC= 0
##$ASSFACI= 0
##$ASSFACX= 0
##$ASSWID= 0
##$AUNMP= <proc_prof1d_extract_pilot.lims>
##$AXLEFT= 0
##$AXNAME= <>
##$AXNUC= <1H>
##$AXRIGHT= 0
##$AXTYPE= 0
##$AXUNIT= <>
##$AZFE= 0.1
##$AZFW= 0.1
##$BCFW= 0
##$BC_mod= 0
##$BYTORDP= 0
##$COROFFS= 0
##$CY= 15
##$DATMOD= 1
##$DC= 0
##$DFILT= <>
##$DTYPP= 0
##$F1P= 0
##$F2P= 0
##$FCOR= 0.5
##$FTSIZE= 32768
##$FT_mod= 6
##$GAMMA= 0
##$GB= 0
##$INTBC= 1
##$INTSCL= 1
##$ISEN= 128
##$LB= 0
##$LEV0= 0
##$LPBIN= 0
##$MAXI= 10000
##$MC2= 0
##$MEAN= 0
##$ME_mod= 0
##$MI= 0
##$NCOEF= 0
##$NC_proc= -8
##$NLEV= 6
##$NOISF1= 0
##$NOISF2= 0
##$NSP= 0
##$NTH_PI= 0
##$NZP= 0
##$OFFSET= 14.98509
##$PC= 1
##$PHC0= 101.5521
##$PHC1= 0
##$PH_mod= 1
##$PKNL= yes
##$PPARMOD= 0
##$PPDIAG= 0
##$PPIPTYP= 0
##$PPMPNUM= 2147483647
##$PPRESOL= 1
##$PSCAL= 4
##$PSIGN= 0
##$PYNMP= <proc.py>
##$REVERSE= no
##$SF= 400.02
##$SI= 32768
##$SIGF1= 0
##$SIGF2= 0
##$SINO= 400
##$SIOLD= 32768
##$SPECTYP= <>
##$SREGLST= <1H.CDCl3>
##$SSB= 0
##$STSI= 32768
##$STSR= 0
##$SW_p= 8223.68421052631
##$SYMM= 0
##$S_DEV= 0
##$TDeff= 65536
##$TDoff= 0
##$TI= <>
##$TILT= no
##$TM1= 0
##$TM2= 0
##$TOPLEV= 0
##$USERP1= <user>
##$USERP2= <user>
##$USERP3= <user>
##$USERP4= <user>
##$USERP5= <user>
##$WDW= 1
##$XDIM= 32768
##$YMAX_p= 433713539
##$YMIN_p= -721187
##$CURPLOT= <Network HP LaserJet P1505>
##$CURPRIN= <$Network HP LaserJet P1505>
##$DFORMAT= <normdp>
##$LAYOUT= <+/1D_H.xwp>
##$LFORMAT= <normlp>
##$PFORMAT= <normpl>
##$SURQMSG= 1
$$ End of Bruker specific parameters
$$ ---------------------------------
##NTUPLES= NMR SPECTRUM
##VAR_NAME=  FREQUENCY,     SPECTRUM/REAL,   SPECTRUM/IMAG
##SYMBOL=    X,             R,               I
##VAR_TYPE=  INDEPENDENT,   DEPENDENT,       DEPENDENT
##VAR_FORM=  AFFN,          ASDF,            ASDF
##VAR_DIM=   32768,         32768,           32768
##UNITS=     HZ,            ARBITRARY UNITS, ARBITRARY UNITS
##FACTOR=    0.250966925370066, 1,           1
##FIRST=     8223.43324360094, -150949,      -235553
##LAST=      0,             -8102,           -166617
##MIN=       0,             -721187,         0
##MAX=       8223.43324360094, 433713539,    0
$$ Real data points
##PAGE= N=1
##DATA TABLE= (X++(R..R)), XYDATA
$$ [...]
19543b3126F292d2595m8679B8868m968R2855a47561j76588A65395g2832K2273
$$ -23126 6292 -42595 -91274 28868 23900 116755 -147561 -324149 165395 -72832 -50559
19532e0559k3527k58399a26380I4002b35368K2316B8662j0642J68156i8237A97048
$$ -50559 -74086 -332485 -126380 94002 -235368 -213052 28662 18020 186176 -98237 197048
19520a79017b680A78060h6882j63215B72467a31206B89622K3362h1793c2412H159
$$ -179017 -2680 178060 -86882 -250097 272467 -131206 289622 312984 -81793 -32412 8159
19508c14899C2603e608k62843e2586j36160b2554A94388i6477e019r9415q4519
$$ -314899 32603 -5608 -268451 -52586 -188746 -22554 194388 -96477 -5019 -104434 -188953
19497a88953l1066c3954B5074J9298g8605A06721a259j44034j07066A97840b15870
$$ -188953 -220019 -33954 25074 44372 -78605 106721 -1259 -145293 -252359 197840 -215870
19485e1693c409k13390G2888b48183a2800F1261g361k06472O8041o6114A80103
$$ -51693 -3409 -216799 72888 -248183 -12800 61261 -7361 -213833 -145792 -211906 180103
19473A98051b87360A39149e2920C09278f3627j80717g7235j90896C4656d0766
$$ 198051 -287360 139149 -52920 309278 -63627 -244344 -77235 -268131 34656 -40766
19462a41218L8586k03153C70062A09542E0397a38658L181H5831b29558C65556
$$ -141218 -102632 -305785 370062 109542 50397 -138658 -135477 85831 -229558 365556
19451f669j40949N5688J3783k38146a05714G3700d9673r5397m276O8655C1356
$$ -6669 -147618 -91930 -78147 -316293 -105714 73700 -49673 -145070 -149346 -80691 31356
19439a90614A60945a95539H6303g3901C84063a28001m3796G4085c7682j11356
$$ -190614 160945 -195539 86303 -73901 384063 -128001 -171797 74085 -37682 -149038
19429a49038B99135b39928A27977f2524j6208n4738J9936C00975C395J65756b06090
$$ -149038 299135 -239928 127977 -62524 -78732 -133470 -113534 300975 3395 169151 -206090
19417b0664B9962J05392D9316a96664C18645j39757J30443d00729a9197o9770
$$ -20664 29962 135354 49316 -196664 318645 178888 309331 -400729 -19197 -88967
19407h8967A35190C9604h4640j30706j5864R1588A48179a92398A37830a07366
$$ -88967 135190 39604 -84640 -215346 -231210 -139622 148179 -192398 137830 -107366
19396a24591j77276A30664J3516O2404f9016r6301M5116A75005b52302R932M2743
$$ -124591 -301867 130664 144180 206584 -69016 -165317 -120201 175005 -252302 -242370 -199627
19385a99627P5631A36820f5636g422k4562o89203I8053d25833D6289a37342h5
$$ -199627 -123996 136820 -65636 -7422 -31984 -721187 98053 -425833 46289 -137342 -85
19373E0151a74489A09105b98573D5392J42520a14156b4158l98358h8346o5833
$$ 50151 -174489 109105 -298573 45392 187912 -114156 -24158 -422516 -88346 -154179
19363a54179f4394k47721A13640d4430j08594l9926a0698j09537e9544D02236
$$ -154179 -64394 -312115 113640 -44430 -153024 -192950 -10698 -120235 -59544 402236
19352h6261j93983h6538k72145J11946a09502A8303b34294A85256n4141b96931
$$ -86261 -280244 -86538 -358683 -246737 -109502 18303 -234294 185256 131115 -296931
19341F3550c8527j0235A22913a88686L150g0130k94603R8230F7870J0634L3647
$$ 63550 -38527 -48762 122913 -188686 -185536 -70130 -364733 -266503 67870 78504 112151
19330A12151k8570h1010l88891a5528q6265j95919J42718b8299j09794k8986K9272
$$ 112151 83581 -81010 -469901 -15528 -101793 -297712 -154994 -28299 -138093 -167079 -137807
19319a37807B09745r7523D2898b02348O0613B15578b45467N5226A60644D2380
$$ -137807 209745 112222 42898 -202348 -141735 215578 -245467 -190241 160644 42380
19308b65570J04199e5232l22020B67455e4045a0134D09383H5931b1330j89332
$$ -265570 -161371 -55232 -377252 267455 -54045 -10134 409383 85931 -21330 -210662
19298b10662R9736a7778j43378l7800b6122l2252C5102a52760n2951A7126J0305
$$ -210662 -110926 -17778 -161156 -198956 -26122 -58374 35102 -152760 -205711 17126 27431
19287B7431O1139b21037A05088a20101B15796a44527I8915d9470I5435k7078a53935
$$ 27431 88570 -221037 105088 -120101 215796 -144527 98915 -49470 95435 68357 -153935
19275A10459Q3965A5207O5368A147K04871o7402a58819j746P4176D8228a44481
$$ 110459 194424 15207 80575 1147 206018 138616 -158819 -160565 -86389 48228 -144481
19263b24159n6760A29987l6253e6663A880J69706a88306e9252p9974N1961B27568
$$ -224159 -280919 129987 93734 -56663 1880 171586 -188306 -59252 -139226 -87265 227568
19251A61061Q4921B0359a29517M9922C81159a48790c0260m9878l5422j41896O659
$$ 161061 245982 20359 -129517 -79595 381159 -148790 -30260 -80138 -115560 -257456 -250797
19240b50797m8965h9810j710n5620p2278A80916b29570a087l59628J70644j55768
$$ -250797 -299762 -89810 -91520 -147140 -219418 180916 -229570 -1087 -360715 -190071 -345839
19229c45839A68725b7025l65700J74251A13917a0390B06735q2369c13653J17660
$$ -345839 168725 -27025 -392725 -218474 113917 -10390 206735 124366 -313653 -195993
19219a95993A19962b11813j48970J28476A74850i3933A6995b00939F8797O034
$$ -195993 119962 -211813 -360783 -232307 174850 -93933 16995 -200939 68797 74831
19209G4831J78066b76399j23320C8839g7639c7900k61686O0656A05606a96944
$$ 74831 252897 -276399 -399719 38839 -77639 -37900 -299586 -238930 105606 -196944
19198b89226A4961a57445a1702D6030a30512l09940h6737p9396c9009j81607B58213
$$ -289226 14961 -157445 -11702 46030 -130512 -440452 -86737 -166133 -39009 -220616 258213
19186A08202O1049E1046a19211J8189j24752L3308r4204J08044M1786A43099f2179
$$ 108202 169251 51046 -119211 -101022 -225774 -192466 -286670 -178626 -136840 143099 -62179
19174C5147o075a3527B86407a69713A13221a94041A73186j2022l7158k0326c05350
$$ 35147 29072 -13527 286407 -169713 113221 -194041 173186 161164 124006 103680 -305350
19162b21031C25580b24914a549A43144j7053k4064a72892b6743k53185I5985P5324
$$ -221031 325580 -224914 -1549 143144 126091 102027 -172892 -26743 -279928 95985 171309
19151A71309a07987I7485h1732G5242b99379J21257G52d97061A71147R3083b23020
$$ 171309 -107987 97485 -81732 75242 -299379 -178122 752 -497061 171147 264230 -223020
19139d181B66431j16647b0691k21300B31507e007C44236A1915b76666B51175L8625
$$ -4181 266431 149784 -20691 -241991 231507 -5007 344236 11915 -276666 251175 289800
19128B89800b84512r9150c6490o628j34022j36987f7245L1965A447J15492a80015
$$ 289800 -284512 -383662 -36490 -43118 -177140 -314127 -67245 -35280 1447 116939 -180015
19116b40976m6811a25350q5502B81931B6760c5115G4668f6076A39813F2708J8638
$$ -240976 -287787 -125350 -210852 281931 26760 -35115 74668 -66076 139813 62708 81346
19105H1346J112e701k84940A47256m5171o94a93442P0685A81996b01426D2595
$$ 81346 82458 -5701 -290641 147256 102085 101391 -193442 -122757 181996 -201426 42595
19093e6993a6382k30103c6821B17340a59574F6366J55065i2168B41782a67297
$$ -56993 -16382 -246485 -36821 217340 -159574 66366 221431 -92168 241782 -167297
19082c12575B44833A6808b54103a09543j00929R7879N248l5557c6952B4029A329
$$ -312575 244833 16808 -254103 -109543 -210472 -112593 -107345 -142902 -36952 24029 1329
19070B17910a62616f7551j15836k92649g1564C3326c48813J54831C2862a11316
$$ 217910 -162616 -67551 -183387 -476036 -71564 33326 -348813 -193982 32862 -111316
19059F3895d08765F9782A8751J74071h9412C6225f5494A72427B7146M0911h2880
$$ 63895 -408765 69782 18751 192822 -89412 36225 -65494 172427 27146 68057 -82880
19047B3112b80212a048B32926d1685B3857O7859b45796b7733A63898p9056c498
$$ 23112 -280212 -1048 232926 -41685 23857 91716 -245796 -27733 163898 84842 -3498
19035b09552f5488J2830q9628H0190P540b08773A69024c15087F8354L29110E3299
$$ -209552 -65488 -52658 -142286 80190 87730 -208773 169024 -315087 68354 397464 53299
19023a38042O989A97553M8402q0025a59198j49624d2738l495o2465j13604A9155
$$ -138042 -131053 197553 245955 165930 -159198 -308822 -42738 -46233 -108698 -222302 19155
19011a75006e3129j48331J8014k5420C07686E0344a20336e2977j21781l999M5474
$$ -175006 -53129 -201460 -183446 -208866 307686 50344 -120336 -52977 -174758 -178757 -133283
19000a33283J9619j12198K0345e1082j11604C47528a38151A56034c87537g4296
$$ -133283 -113664 -225862 -205517 -51082 -162686 347528 -138151 156034 -387537 -74296
18989a04661C84235b24082P6042p01F8877A5087N3851K99514c2833C16265h625
$$ -104661 384235 -224082 -148040 -148741 68877 15087 68938 368452 -32833 316265 -8625
18977C45977E3235b2034G9869a79587M9261J8084H3455b18006J5180a7494q2169
$$ 345977 53235 -22034 79869 -179587 -130326 -112242 83455 -218006 -202826 -17494 -99663
18966i9663M6592j69222g8092j04528F5621a95653J3747A47330e779A63555F3910
$$ -99663 -53071 -222293 -78092 -182620 65621 -195653 -181906 147330 -5779 163555 63910
18954G8046b23634A7248O1839j7205c17823J42857j99215a07252D939K51988a20432
$$ 78046 -223634 17248 79087 61882 -317823 -174966 -374181 -107252 4939 256927 -120432
18942c03611C0760L09L1740a76126A78696j111h9257B9503h4415A62941b19846
$$ -303611 30760 31069 62809 -176126 178696 177585 -89257 29503 -84415 162941 -219846
18930a19810r2243L8864c5201A20659M586K70576a30143M7679c9434l3018A73809
$$ -119810 -212053 -173189 -35201 120659 125245 395821 -130143 -82464 -39434 -72452 173809
18918c27977J11493b2058l87202R8806i96k84298E3710J37254b35955f2267r9099
$$ -327977 -216484 -22058 -409260 -310454 -996 -285294 53710 190964 -235955 -62267 -161366
18907a61366O4890C17651d0997G2616f4143a8511m11705A66905M3440g3836j29415
$$ -161366 -96476 317651 -40997 72616 -64143 -18511 -430216 166905 210345 -73836 -203251
18896b03251i555j25577A60411a76936A23121J08222N5521d2953H2820O4927J01826
$$ -203251 -9555 -135132 160411 -176936 123121 231343 286864 -42953 82820 147747 249573
18885B49573J11797i2747k72474C0504b30582C11185d2101H3345b89647a28021
$$ 249573 361370 -92747 -365221 30504 -230582 311185 -42101 83345 -289647 -128021
18874a98958D7276a8432l20632B21335b55962B50914A24109m0453R1421h7669
$$ -198958 47276 -18432 -339064 221335 -255962 250914 124109 83656 175077 -87669
18863h0056I0412M6775F5373B6725d6568E2230b36689d8338r8976j61736M2141
$$ -80056 90412 137187 65373 26725 -46568 52230 -236689 -48338 -147314 -309050 -266909
18852b66909B22061l4245L6974b32858B1842N1465a0481A02413a52832c706k1578
$$ -266909 222061 187816 224790 -232858 21842 73307 -10481 102413 -152832 -3706 -25284
18841b5284B45999c12241e7601d695m8004k63141a11474C3749K9007c1235D68777
$$ -25284 245999 -312241 -57601 -4695 -52699 -315840 -111474 33749 62756 -31235 468777
18829A46778O35K1082E902a20047C41437A48757b38577P7297p3333N337A04349
$$ 146778 147413 168495 5902 -120047 341437 148757 -238577 -161280 -234613 -229276 104349
18817H6447K8485d32412c729j17729j11953D1213b6477C44149M7677a19067L8334
$$ 86447 114932 -432412 -3729 -121458 -233411 41213 -26477 344149 391826 -119067 -80733
18806h0733H9139D3937a16885P672B53947g8766n0256q7380P2954A75372a41419
$$ -80733 89139 43937 -116885 -109213 253947 -78766 -129022 -216402 -143448 175372 -141419
18794e5687p0035F2536L6764K367a0514j71887I5501b70155k75576c1855D6487
$$ -55687 -125722 62536 99300 101667 -10514 -182401 95501 -270155 -545731 -31855 46487
18782a37897L4149m9627C999a19487p125l6586j19599A16415C7882J27462F0980
$$ -137897 -103748 -153375 3999 -119487 -126612 -163198 -282797 116415 37882 165344 60980
18770D4752b3671D290b5181n1286A82504p2090g9084j48560R6988A48659B9441
$$ 44752 -23671 4290 -25181 -76467 182504 110414 -79084 -227644 -130656 148659 29441
18758a36634A07224a44372m1868A61628a9613q5826j69920J23369C0979b40934
$$ -136634 107224 -144372 -186240 161628 -19613 -105439 -275359 -151990 30979 -240934
18747d8131k68003J10395b8212l03257c1708m5601A06243a60342j0833l0329b6021
$$ -48131 -316134 -205739 -28212 -331469 -31708 -77309 106243 -160342 -171175 -201504 -26021
18735A04235c41358h4851o2544B08463b2599K729j85090f7784k84433a48962l2351
$$ 104235 -341358 -84851 -147395 208463 -22599 -19870 -204960 -67784 -352217 -148962 -181313
18724a81313B37551a57905f8295m5325k4329D6903Q0614R2715i3186b7273j20198
$$ -181313 237551 -157905 -68295 -113620 -137949 46903 127517 220232 -93186 -27273 -147471
18713a47471a8618k70743B11012g4404A7427P4465b63537c1299B1837c52365D47180
$$ -147471 -18618 -289361 211012 -74404 17427 91892 -263537 -31299 21837 -352365 447180
18701D2307c5619j41143B44372B3027a43563N4243m23392G2289b63103B91198
$$ 42307 -35619 -176762 244372 23027 -143563 -89320 -512712 72289 -263103 291198
18690c67173C8136D132a02527A92082r944q310E9000i2726j31106Q6234k56238
$$ -367173 38136 4132 -102527 192082 182138 173828 59000 -92726 -223832 -137598 -393836
18679c93836A72624b72755A66351c70521I0189L687b94447A70326j6496C6463
$$ -393836 172624 -272755 166351 -370521 90189 93876 -294447 170326 153830 36463
18668a10715j9285N3150A01432j529i8875p7734n5842O6243A5127h0899c6706
$$ -110715 -130000 -76850 101432 99903 -98875 -176609 -232451 -166208 15127 -80899 -36706
18656b10467l60146A71666q3218A4284d2157k52682a8186m7565B43446A0289M8816
$$ -210467 -570613 171666 88448 14284 -42157 -294839 -18186 -65751 243446 10289 59105
18645E9105a8328j16445H6961A9506b32542E7764L2852j7449f1841p5009A46973
$$ 59105 -18328 -134773 86961 19506 -232542 57764 90616 73167 -61841 -136850 146973
18633e24640I0350b72506A40563o0230h3986m8533k3514l1731h7041C07975A17731
$$ -524640 90350 -272506 140563 80333 -83986 -132519 -156033 -187764 -87041 307975 117731
18621A24913b18938J03164j75526A21161a40238O7644n8126j4037M6992n7075
$$ 124913 -218938 -115774 -291300 121161 -140238 -72594 -130720 -144757 -97765 -154840
18611a54840p8762b6782j5807F0429a00263b0192l75389J54266K4832a6561j20456
$$ -154840 -233602 -26782 -42589 60429 -100263 -20192 -395581 -241315 -216483 -16561 -137017
18600a37017C3678a83297O5683L1154m4454j09121G8481K72055A56603c29424
$$ -137017 33678 -183297 -117614 -86460 -130914 -240035 78481 350536 156603 -329424
18589c16735J21347O1683J0618I4988b32462F7161a05152A0884a39328L7818p1888
$$ -316735 -195388 -133705 -123087 94988 -232462 67161 -105152 10884 -139328 -101510 -173398
18578a73398C3066j1110J82544a74844H3139i2754a7573B8922K25469A15074m2623
$$ -173398 33066 21956 204500 -174844 83139 -92754 -17573 28922 254391 115074 72451
18567G2451N0570h7572C7289J4624b04994l7457f5099A24953E0715a32573B0663
$$ 72451 123021 -87572 37289 51913 -204994 -242451 -65099 124953 50715 -132573 20663
18555a10688k4240o6145F7735b6283G6568a32681A24317a84204Q8044K318j47823
$$ -110688 -134928 -201073 67735 -26283 76568 -132681 124317 -184204 -96160 -93842 -241665
18544b41665r9073a38517n4325n0983q8160A39002d64914A06825M5182a16963
$$ -241665 -340738 -138517 -192842 -243825 -331985 139002 -464914 106825 152007 -116963
18533h9228d0771m05537D930a18451J2340E1226G487e4819F2834e1089F8395f5846
$$ -89228 -40771 -446308 4930 -118451 -106111 51226 7487 -54819 62834 -51089 68395 -65846
18520C3795b6257B18040a69276k3360A17679a64305B44876a37373A69890c3718
$$ 33795 -26257 218040 -169276 -192636 117679 -164305 244876 -137373 169890 -33718
18509d7637j45406j51006a15039D2341J9706J61192a13837o8504H382M7806c0535
$$ -47637 -193043 -344049 -115039 42341 62047 223239 -113837 -182341 8382 56188 -30535
18497c53783m1775A23259c69141a54920e8587H6830A1041g1294A80059b12881
$$ -353783 -395558 123259 -369141 -154920 -58587 86830 11041 -71294 180059 -212881
18486A26303g4888C1589a36185A68612J96a23125l7426A30002R464E3703d335
$$ 126303 -74888 31589 -136185 168612 168808 -123125 -160551 130002 139466 53703 -4335
18474a62065A80542i8139B20993f0059j09050e9592a4459l66539m3201e7983b3924
$$ -162065 180542 -98139 220993 -60059 -169109 -59592 -14459 -380998 -424199 -57983 -23924
18462f7516A06896a29199o6872B6822r472K49808G8966B4189b0042A9627O7921
$$ -67516 106896 -129199 -196071 26822 17350 267158 78966 24189 -20042 19627 87548
18451H7548i0315k78909G1821a40757Q715C9927o612R3721A2581J51132a7187
$$ 87548 -90315 -369224 71821 -140757 -132042 39927 33315 127036 12581 163713 -17187
18439B04577a22295A30828b48881f8600m3711q8110Q2087C0539h2351A25329J00854
$$ 204577 -122295 130828 -248881 -68600 -112311 -200421 -118334 30539 -82351 125329 226183
18428B26183G3879H152O298b0544o8830j78l0985B31553B6934j1429J33284b0392
$$ 226183 73879 8152 14450 -20544 -89374 -89552 -120537 231553 26934 15505 148789 -20392
18415B4629O9409J00410l4617d2438l78884R2509g1428I6675O3371b16936A39327
$$ 24629 94038 194448 159831 -42438 -421322 -328813 -71428 96675 160046 -216936 139327
18403c02856N9641B21387b37764a04550d3402A29675F294a78741j8083P4826r7539
$$ -302856 -243215 221387 -237764 -104550 -43402 129675 6294 -178741 -196824 -121998 -219537
18392b19537A12863c5184j74864A02204a6173m88551G7383b39998A70115e16302
$$ -219537 112863 -35184 -210048 102204 -16173 -504724 77383 -239998 170115 -516302
18381F9710Q5257J24028g3728n9988C2151J06732b46284b072j55187j06043c8460
$$ 69710 154967 278995 -73728 -133716 32151 138883 -246284 -2072 -157259 -263302 -38460
18369a01932E1447c8382j80567I7484b52763a10177H039Q5435O5870k894l3295
$$ -101932 51447 -38382 -218949 97484 -252763 -110177 8039 93474 159344 156450 123155
18358A23155R861i8767c5078D1918f9890B6750L3331c2450l382A60987l3011l1125
$$ 123155 133016 -98767 -35078 41918 -69890 26750 60081 -32450 -35832 160987 127976 96851
18346I6851d40529J24631a04819B08524a32176A2239c88422A74734a15352K603
$$ 96851 -440529 -315898 -104819 208524 -132176 12239 -388422 174734 -115352 -112749
18336a12749c3584B39379F0905a79915A18757j9425a21457N9719l21537A09376
$$ -112749 -33584 239379 60905 -179915 118757 99332 -121457 -61738 -383275 109376
18325a41610a3529E7674J56219a03473A71909a52172l6160j16847E154d9761m2128
$$ -141610 -13529 57674 213893 -103473 171909 -152172 -188332 -305179 5154 -49761 -91889
18314i1889B8003J5044c4200k98865a0720m8610A50622o3390J05144f6377k23
$$ -91889 28003 43047 -34200 -333065 -10720 -59330 150622 87232 192376 -66377 -66600
18303f6600K1589m9470A5828i8702d5435B9863a85658d8262a1829C52008f9441
$$ -66600 -45011 -94481 15828 -98702 -45435 29863 -185658 -48262 -11829 352008 -69441
18291b49349a20187C07676j49830i592H1020a57531m97711c7243B05111a7441
$$ -249349 -120187 307676 157846 -9592 81020 -157531 -655242 -37243 205111 -17441
18280b99538C5891N3457j4445j6137k1214K31399K9461b73243C5546b88090D7064
$$ -299538 35891 89348 74903 58766 37552 268951 298412 -273243 35546 -288090 47064
18268d2974j43730m8600A28689a25346j48412a10376i689j42758E4917j9764a88239
$$ -42974 -186704 -235304 128689 -125346 -273758 -110376 -9689 -152447 54917 35153 -188239
18256a0824A87559D3566g0964j4262j09702A80425b74498k422c3853j6145j55900
$$ -10824 187559 43566 -70964 -85226 -194928 180425 -274498 -276920 -33853 -49998 -205898
18245b05898B00940I1996g2437q2205j16882E3925a80084B5937E685b06347B46547
$$ -205898 200940 91996 -72437 -154642 -271524 53925 -180084 25937 5685 -206347 246547
18233H6511C2402E818b37860a9041A47601l3531R5207d3535A73948a43169j25493
$$ 86511 32402 5818 -237860 -19041 147601 114070 209277 -43535 173948 -143169 -268662
18222b68662A26860d4858I565c19378a112l9159k3024b4855I7312b92772I7106
$$ -268662 126860 -44858 9565 -319378 -1112 -40271 -63295 -24855 97312 -292772 97106
18210b23327B02361i7419e995B38694e7720F7125d2346A602M2321j3460g1724
$$ -223327 202361 -97419 -5995 238694 -57720 67125 -42346 1602 43923 30463 -71724
18198d0361j74780e6341k98492B3812M1013a59565A9658J63121M1532I1544l5853
$$ -40361 -215141 -56341 -354833 23812 64825 -159565 19658 182779 224311 91544 55691
18187E5691e304j07907j88952F8658e3278A61165j3389a73131q347a0308j68884
$$ 55691 -5304 -113211 -302163 68658 -53278 161165 147776 -173131 -181478 -10308 -179192
18176a79192j56327P2890A40979K2665I97a2101l63391N8137E3886h4196K7774
$$ -179192 -335519 -262629 140979 163644 997 -12101 -375492 -317355 53886 -84196 -56422
18165e6422r9111F4521a0332A55069J363b49786j92419D9517a06785k24727Q9989
$$ -56422 -155533 64521 -10332 155069 156432 -249786 -442205 49517 -106785 -331512 -241523
18154b41523i0161l6018a5486j61313A36148a22296B30685A11703h4105B44971
$$ -241523 -90161 -126179 -15486 -176799 136148 -122296 230685 111703 -84105 244971
18143h8965n3958f9329B13284D015a35299A88368G7572g0470G5488c75558D4997
$$ -88965 -142923 -69329 213284 4015 -135299 188368 77572 -70470 75488 -375558 44997
18131a39270F5694c15031Q7768A27321c01009a31955D3291a35087A51494a5314
$$ -139270 65694 -315031 -227263 127321 -301009 -131955 43291 -135087 151494 -15314
18120c40625B4859K6279J01018d4572j40653J982O6849N7230j04021a1713k546
$$ -340625 24859 51138 152156 -44572 -185225 -183243 -116394 -59164 -163185 -11713 -14259
18109a4259B55388a30035k28888A9601i6536l09329J48848m9435B27017b15486
$$ -14259 255388 -130035 -358923 19601 -96536 -405865 -257017 -306452 227017 -215486
18098B43253b0681j97568k1543A50498B3586N665c02059F1876c8519J6766c540
$$ 243253 -20681 -218249 -239792 150498 23586 29251 -302059 61876 -38519 -21753 -3540
18086a57663P0874A81773c12271A0230K00558a29520E0656K3733g0268J60C99268
$$ -157663 -86789 181773 -312271 10230 210788 -129520 50656 74389 -70268 -70108 399268
18074a09838f630o5195F8238b1653j10208d1200j51885B7719a25970k057d2116
$$ -109838 -6630 -71825 68238 -21653 -131861 -41200 -193085 27719 -125970 -128027 -42116
18062A65806R3177h2511j05165A09999K84885a07508N1290B55639l0175M4427
$$ 165806 258983 -82511 -187676 109999 394884 -107508 -56218 255639 225464 269891
18052B69891a17657r2289Q8129n630G9839f9268B13606K4709b15041I5471a56114
$$ 269891 -117657 -209946 -121817 -127447 79839 -69268 213606 238315 -215041 95471 -156114
18040A04080M0241b11476m993h6412o4007L6242b1549A95451A0513c23170a59047
$$ 104080 144321 -211476 -216469 -86412 -150419 -114177 -21549 195451 10513 -323170 -159047
18028a42510C61927A27359E9847J70092b9060k07743C04179B3617O7597f294j15469
$$ -142510 361927 127359 59847 229939 -29060 -236803 304179 23617 91214 -6294 -121763
18017a21763G0605k2173a10850B44945i428m9712r9674o0761L5822r5174c1332
$$ -121763 70605 48432 -110850 244945 -9428 -59140 -158814 -219575 -183753 -278927 -31332
18005c7838A11002d5612l33238J66351B0312O7896B9008d13j59854C487d6567
$$ -37838 111002 -45612 -378850 -212499 20312 88208 29008 -413 -160267 3487 -46567
17993B21747r2051j2533K7202g9566B38395f8169l37767I0161b07557h464k6424
$$ 221747 129696 117163 144365 -79566 238395 -68169 -405936 90161 -207557 -8464 -34888
17982c4888m8012B7671L12911A17953i6290A03834J85049j42584B095b43440c0803
$$ -34888 -82900 27671 340582 117953 -96290 103834 288883 146299 2095 -243440 -30803
17970B41985c795k03475H7216l9517h608r0879j49282C0993i2726H5676b61794
$$ 241985 -3795 -207270 87216 47699 -8608 -99487 -248769 30993 -92726 85676 -261794
17958a89800F0666c38144a50933A681O2244A5771c9772I6499C0637q202L28845
$$ -189800 60666 -338144 -150933 1681 63925 15771 -39772 96499 30637 22435 351280
17947C51280g1069A9689i1463k0089A18722g3234I0812A9887b30326M8639k79447
$$ 351280 -71069 19689 -91463 -111552 118722 -73234 90812 19887 -230326 -181687 -461134
17936d61134A54182C7551K78576a87838j8715h0705o467j35841F6708P5812F5633
$$ -461134 154182 37551 316127 -187838 -206553 -80705 -87172 -223013 66708 142520 65633
17924a44769A8088M8530a22025A3954b17558D34631j90218L7046F4942R9513C077
$$ -144769 18088 66618 -122025 13954 -217558 434631 244413 281459 64942 164455 3077
17912E5239L40451D2252b82351A47130g3812A85250M4571D9301a16558A9241h8801
$$ 55239 395690 42252 -282351 147130 -73812 185250 229821 49301 -116558 19241 -88801
17900A22137M368o2947J50877i0925i441A87151b5200A12104C6654J5731N3164
$$ 122137 126505 63558 214435 -90925 -9441 187151 -25200 112104 36654 52385 105549
17889A05549K078c44277J1390a33251L9354p4345d3636C66487J60660b5696B39819
$$ 105549 107627 -344277 -332887 -133251 -93897 -168242 -43636 366487 527147 -25696 239819
17877B59801g7296K3826B79904H0407a27268c0816A4719O3760a73682L9546D7298
$$ 259801 -77296 -53470 279904 80407 -127268 -30816 14719 78479 -173682 -134136 47298
17865D0879j0843J39347b66484A53759d44924F1117B6796b99146A62636a91173
$$ 40879 30036 169383 -266484 153759 -444924 61117 26796 -299146 162636 -191173
17854b74544G297O13J92485a1458A07098M551a07963E3397L03773A42578K70P079
$$ -274544 7297 7910 200395 -11458 107098 111649 -107963 53397 357170 142578 142848 149927
17842A49927i5082C51345j21513i386j68984A18606a65792A75893B7919J7283
$$ 149927 -95082 351345 229832 -9386 -178370 118606 -165792 175893 27919 45202
17832D5202c49663e4063j9652c4612k113e552K55j3166H3808a04992k5658A83700
$$ 45202 -349663 -54063 -73715 -34612 -36725 -5552 -5297 -18463 83808 -104992 -130650 183700
17819b65881l3339A75204B9488b14310A71564R4684c38925A74775n3641N0108
$$ -265881 -299220 175204 29488 -214310 171564 266248 -338925 174775 121134 171242
17809A71242c3434G0628f0057D34389a5938A23242h5967c9215A11150M347i6815
$$ 171242 -33434 70628 -60057 434389 -15938 123242 -85967 -39215 111150 115497 -96815
17797b45351N3195g0326k49550c667D1281J73526J12326g6533q0168j09494B67750
$$ -245351 -192156 -70326 -319876 -3667 41281 214807 327133 -76533 -156701 -266195 267750
17785b12662E6391L5248a26254l2102B14269i6771m0270k9757A56046o2041b21613
$$ -212662 56391 91639 -126254 -158356 214269 -96771 -137041 -166798 156046 94005 -221613
17773E9177h2731A89198q3826g1910p915B8568b0662j16704j26338B04186d5055
$$ 59177 -82731 189198 105372 -71910 -79825 28568 -20662 -137366 -263704 204186 -45055
17761c45663O3613D6526h1721B56354H9637b31633g9409r3270A30323c3857G1035
$$ -345663 -282050 46526 -81721 256354 89637 -231633 -79409 -172679 130323 -33857 71035
17749a20829B777M7407O3319b99435d9465A35638E8159a67392D9078a66549A40230
$$ -120829 2777 50184 113503 -299435 -49465 135638 58159 -167392 49078 -166549 140230
17737F3237d3262C889K49609A23813k0042A5315a01114b7385I6522a50802g33
$$ 63237 -43262 3889 253498 123813 103771 15315 -101114 -27385 96522 -150802 -733
17725a05265m42237f2356A4439K66934c5935D5471b07229c4397l60463A35577
$$ -105265 -547502 -62356 14439 281373 -35935 45471 -207229 -34397 -394860 135577
17714a84914r6700f8274p5256l2798b213j77784C04044a46332j75257A69319a71049
$$ -184914 -281614 -68274 -143530 -176328 -2213 -179997 304044 -146332 -321589 169319 -171049
17702b3644B47140f3487A59620R6757g4518k2211K1380A21072k1701a57502D26027
$$ -23644 247140 -63487 159620 256377 -74518 -96729 -75349 121072 99371 -157502 426027
17690b38227d6629i144r7351H8597o298a06134H5529l9012b05951H3608Q8531
$$ -238227 -46629 -9144 -106495 88597 82299 -106134 85529 46517 -205951 83608 172139
17679A72139m2142C3958K02892I1231a8590H2375i1006k9800A1424L99711f8381
$$ 172139 129997 33958 236850 91231 -18590 82375 -91006 -120806 11424 411135 -68381
17667E8891d1246j35742A00969b55017B14357J96867E2995a60995H8864b5638
$$ 58891 -41246 -176988 100969 -255017 214357 411224 52995 -160995 88864 -25638
17656c684j260A20323e5517B27961J07674a08019j48614g6818I2321b8448C28796
$$ -3684 -4944 120323 -55517 227961 335635 -108019 -256633 -76818 92321 -28448 328796
17644b4541H5453d6043R689m1232k7634M5813k7782B70131F874O9194K48706d8462
$$ -24541 85453 -46043 -36354 -77586 -105220 -59407 -87189 270131 6874 76068 324774 -48462
17631b35474h1719A95323P019C8111N770M876J33982b44024P9253E2095i9460
$$ -235474 -81719 195323 202342 38111 43881 48757 182739 -244024 -164771 52095 -99460
17619E1724b05853Q9933k6689M4144b5595A13949C2090a59636G94J53725i0026
$$ 51724 -205853 -115920 -142609 -98465 -25595 113949 32090 -159636 794 154519 -90026
17607C90234h2791j53481B58027F4627L33494a66630A17323C5725b67788A41862
$$ 390234 -82791 -236272 258027 64627 398121 -166630 117323 35725 -267788 141862
17596F0657A3665d4127F9789L820l4282f9628I9807J43483n8228P5745j5705r9224
$$ 60657 13665 -44127 69789 73609 39327 -69628 99807 243290 185062 260807 245102 145878
17584A45878a04544H448K08028P6208n3843J58650G7329a24109A33195B9243K23090
$$ 145878 -104544 8448 216476 292684 238841 397491 77329 -124109 133195 29243 252333
17573B52333G4881J5620l368A5444L45256a7066r1378d8306B9639b5052A3534
$$ 252333 74881 90501 87133 15444 360700 -17066 -108444 -48306 29639 -25052 13534
17561A17734c8699A22235i0609B49464c4708A37419J22232L3109f6764A48939
$$ 117734 -38699 122235 -90609 249464 -34708 137419 259651 292760 -66764 148939
17550a05942J6585M2869B69118d9900K0511A28668A53P6686c4609J2468C8449
$$ -105942 -89357 -46488 269118 -49900 -29389 128668 153 76839 -34609 -22141 38449
17538a66000A5516a83585M5560A15387J351b44510J8349h5773A79663R7851m2025
$$ -166000 15516 -183585 -138025 115387 116738 -244510 -226161 -85773 179663 277514 235489
17527B35489k3017C4983Q4581f8949P136l2051m6963A83417F3430K9524K71626
$$ 235489 212472 34983 119564 -68949 -61813 -93864 -140827 183417 63430 92954 364580
17516C64580A47258O9536a6793A45666p015J1079k0914N2516c37313D4655K71252
$$ 364580 147258 216794 -16793 145666 138651 149730 128816 181332 -337313 44655 315907
17505C15907B6033J25185D9802N190O6603a33218C323f4938k5421G5912a14024
$$ 315907 26033 151218 49802 54992 121595 -133218 3323 -64938 -90359 75912 -114024
17493g1660H6568a990A79607n6091D5445Q5168K6520Q9569o3484A8492O6474J84279
$$ -71660 86568 -1990 179607 123516 45445 130613 157133 246702 183218 18492 84966 269245
17481B69245a36411C47440A54837f3291B44865m7110H7559R5715a0046A5765K32609
$$ 269245 -136411 347440 154837 -63291 244865 197755 87559 183274 -10046 15765 248374
17470B48374o7920F07J73582A3989J08231M07928C3773d1942B27397D4632j4644
$$ 248374 180454 607 174189 13989 122220 530148 33773 -41942 227397 44632 29988
17459B9988a85174B14915a72089D41398c4591B74934J75582A41613K18718l4332
$$ 29988 -185174 214915 -172089 441398 -34591 274934 450516 141613 360331 325999
17449C25999D5014L61630r9632J50996j67979J48132j79899a01199D7845L87489
$$ 325999 45014 406644 307012 458008 290029 438161 258262 -101199 47845 435334
17439D35334j61166j32638J92465f5826A39653R6836A14333j0468e5849A93139
$$ 435334 274168 141530 333995 -65826 139653 236489 114333 103865 -55849 193139
17428C1726Q0916Q9676f1037C5964f7546B78807F1402L18675A67740O4883p6607
$$ 31726 112642 202318 -61037 35964 -67546 278807 61402 380077 167740 232623 156016
17417A56016F0315M4549J58643k8704n1559d81977B45028K07848A79858K45337
$$ 156016 60315 104864 263507 234803 183244 -481977 245028 452876 179858 425195
17407D25195k01327a79357B23820a23247B40079o4402p7216R0774G2362i2767
$$ 425195 223868 -179357 223820 -123247 240079 175677 98461 189235 72362 -92767
17396A26758a7684A91845J56079k0502A9245R7946Q8556p7124F931J6417M64501
$$ 126758 -17684 191845 347924 327422 19245 117191 205747 128623 6931 23348 487849
17385D87849j72303H2566a22585h566A11218h0715E53620A65479K1680J20162
$$ 487849 315546 82566 -122585 -8566 111218 -80715 553620 165479 187159 307321
17375C07321b4509B58706a22841H9648K30223E9265e2523A65462r622O654Q8232
$$ 307321 -24509 258706 -122841 89648 319871 59265 -52523 165462 155840 162494 250726
17364B50726L84158A49842E1767K43013F0496L8535n021R3593K04205r5631B0319
$$ 250726 634884 149842 51767 294780 60496 99031 94010 187603 391808 296177 20319
17352B8385K8521j860L2124L81057B24493b0180B750L07372h7593E9190d148F69679
$$ 28385 56906 55046 87170 468227 224493 -20180 2750 310122 -87593 59190 -4148 669679
17339A96606a40174C01652A16874J5545n4642d5901I3391J05827E1814e5408k2999
$$ 196606 -140174 301652 116874 132419 77777 -45901 93391 199218 51814 -55408 -78407
17328g8407p6618B35147i4906j4817C84214A01913j9668K1273L8911a1803k6000
$$ -78407 -155025 235147 -94906 -109723 384214 101913 82245 103518 142429 -11803 -37803
17317c7803F330J77248l0437J52616P5560R6122B8417K59603a61193H5693J63674
$$ -37803 6330 183578 153141 305757 381317 477439 28417 288020 -161193 85693 249367
17306B49367G2946L72548h024B15046A6735a71251A55169J97495j07093j22208
$$ 249367 72946 445494 -8024 215046 16735 -171251 155169 352664 245571 123363
17296A23363d1627D973Q2060P9011F9467R8319P189a91231B33010a59039D7591
$$ 123363 -41627 4973 87033 166044 69467 167786 174975 -191231 233010 -159039 47591
17284A12186M2190J00922b40132I8324h8937B72814H5161L41892j64759j18093
$$ 112186 154376 255298 -240132 98324 -88937 272814 85161 427053 262294 144201
17274A44201L72709A90104J38554a20015F1081M4932k5531J53830O6873l5850
$$ 144201 516910 190104 328658 -120015 61081 106013 80482 234312 301185 265335
17264B65335l8047A05371N1298L968K00528j3192e6764C44516i583A16384M59512
$$ 265335 227288 105371 156669 160637 361165 347973 -56764 344516 -9583 116384 575896
17253E75896B34531b62019B90752A08231O7159A2386J67837g1968A76638l1336
$$ 575896 234531 -262019 290752 108231 175390 12386 180223 -71968 176638 145302
17243A45302J65492Q2047i1048A67071O051b31074B29269J24597J62989A81595
$$ 145302 310794 392841 -91048 167071 173122 -231074 229269 353866 516855 181595
17232B14529q1080J89394H946J35989N0085a40101B94331R0578O7330j14263j39869
$$ 214529 133449 322843 8946 144935 195020 -140101 294331 384909 452239 337976 198107
17221A98107J54095J54851A22603L83211j29088N440j46167A8060Q9130D6581
$$ 198107 352202 507053 122603 505814 376726 382166 235999 18060 107190 46581
17210D0769K45076f1394F53515B99524A45167i1k9497D04535E7018N2030M3184
$$ 40769 285845 -61394 653515 299524 145167 -91 -29588 404535 57018 109048 152232
17199A52232J11235r562b093B22145k5608L526N0347L1393J6357p8823o8157N5979
$$ 152232 263467 253905 -2093 222145 196537 200063 250410 281803 298160 219337 151180 207159
17187B07159K55046M6095j43618h6170A78384q728m9857b3317B96401p519Q9004
$$ 207159 462205 508300 364682 -86170 178384 169656 119799 -23317 296401 288882 377886
17176C77886l0357o9492K85213k14662F9457P7644K27219j84663b820E47552a57160
$$ 377886 347529 278037 563250 348588 69457 147101 374320 189657 -2820 547552 -157160
17164C54973J70690b4174A99892P4433L4301A22573J40283K93925j16739j68155
$$ 354973 525663 -24174 199892 274325 308626 122573 262856 556781 440042 271887
17154B71887J46619I3721M26650j49010P9070j0066J7454k26482Q5932l594f3862
$$ 271887 418506 93721 520371 371361 450431 440365 457819 231337 317269 313675 -63862
17142A40569Q8285q0358L23985K6489B05624L68498B83650O69j491j41293J51598
$$ 140569 228854 148496 472481 498970 205624 574122 283650 284319 282828 141535 293133
17131B93133J23581j81995K71396I2240K20117r0209J41724g0223C11535J18691
$$ 293133 416714 234719 506115 92240 312357 222148 363872 -70223 311535 430226
17121D30226D1073J19673J082O6482J65518K59384B59282J955A01389M21026j31663
$$ 430226 41073 160746 161828 228310 393828 653212 259282 261237 101389 522415 390752
17110C90752m7175K51639G7066M03633L1820E5877K98519j0311J00345r4897G5596
$$ 390752 343577 595216 77066 480699 512519 55877 354396 344085 444430 349533 75596
17098F00106k26580o3940L8177M44000C25283J02734j68638p9341K49537A99413
$$ 600106 373526 309586 347763 791763 325283 428017 259379 180038 429575 199413
17087C99773a28432B77959q5849N6784K04683J2143J90407k28011l0540o3918
$$ 399773 -128432 277959 192110 248894 453577 465720 656127 428116 397576 333658
17077C33658j47528O70416C69422M5803L18959A80198L15621j46554M05442B27447
$$ 333658 186130 856546 369422 415225 734184 180198 495819 349265 754707 227447
17066H00877A28037L88920L4179F0794Q7536M55687r0650N03216l66102k67483
$$ 800877 128037 516957 551136 60794 148330 604017 513367 1016583 650481 382998
17056C82998L6517O4862n2520J23556B46033J11775P3830q462Q3990L8148j75374
$$ 382998 419515 484377 431857 555413 246033 357808 431638 423176 507166 545314 369940
17045C69940j47505L85511j00032J90927j52147j63512P4430K0741J07264k15513
$$ 369940 222435 607946 507914 698841 546694 383182 457612 478353 585617 370104
17035C70104K22420J6962Q4227n0777p4410j65251K51331m7367J04371j97863
$$ 370104 592524 609486 693713 642936 568526 403275 654606 607239 711610 513747
17025E13747J62709k52107J15118r0041J49851n0163K7124K54184l50246L91524
$$ 513747 676456 424349 539467 449426 599277 549114 576238 830422 480176 871700
17015H71700k04550M3944j07058K55043j79603P3483j78754J15250o3362J57817
$$ 871700 667150 711094 604036 859079 679476 752959 574205 689455 626093 783910
17005G83910k75578M24069j08896k22750j70946K84859P4825l19499R0462K79201
$$ 783910 508332 932401 823505 600755 429809 714668 789493 469994 560456 839657
16995H39657J29612l7658k85162L19873k03725C21999L26362L09873j99443K01289
$$ 839657 969269 931611 646449 966322 762597 321999 648361 958234 758791 960080
16985I60080N2559k43995O2079Q9453O7506l32507K36096O650k86783L34541J85011
$$ 960080 1012639 768644 830723 920176 987682 655175 891271 897921 611138 945679 1130690
16974A130690k02520l68419K69693L58558D81178K5579n2566N33966D33477K76793
$$ 1130690 928170 559751 829444 1188002 481178 506757 454191 988157 433477 710270
16964G10270n397M98715j71010J05118m07608J87858l14537N96971k16124l1491
$$ 710270 704873 1203588 1032578 1137696 730088 917946 603409 1200380 984256 952765
16954I52765j12229K39467K3712l7955K82130k07202k88918K97659j6677J05663
$$ 952765 840536 1080003 1103715 1065760 1347890 1140688 851770 1149429 1132752 1238415
16944A238415j92019n5710j37437J36251N7470j8916J48125k92075L57876j7100
$$ 1238415 1046396 990686 853249 989500 1046970 1028054 1176179 884104 1241980 1224880
16934A224880o2858L6180l0702q8120L34095l63103k413J91057l50222o0711L30195
$$ 1224880 1162022 1198202 1167500 1079380 1413475 1050372 1047959 1239016 888794 828083 1158278
16923A158278J70633k51796M13785r8743O4867k14923M6692r8102J44034J03922
$$ 1158278 1328911 1077115 1490900 1392157 1457024 1242101 1288793 1190691 1334725 1438647
16913A438647J0223j50731k396R7009K383K94621R7017l77765O74381o18578M03448
$$ 1438647 1448870 1298139 1295743 1392752 1395135 1689756 1786773 1409008 2083389 1464811 1868259
16902A868259o6288l0274n00500M79390o4139J83578j77404l3658j80604K74543
$$ 1868259 1801971 1771697 1271197 1750587 1686448 1870026 1692622 1658964 1478360 1752903
16892A752903l04515N86050j18868K4941j17808k49387K95082j20327K69385O5450
$$ 1752903 1448388 2034438 1915570 1940511 1822703 1573316 1868398 1748071 2017456 2082906
16882B082906J77646k56298J91828k57663J82817J04841r7233J25790j77085L56482
$$ 2082906 2260552 2004254 2196082 1938419 2121236 2226077 2128844 2254634 2077549 2434031
16872B434031m65885K48324K6617r5457J16056J16467J29458K36172k88462Q8307
$$ 2434031 1968146 2216470 2243087 2147630 2263686 2380153 2509611 2745783 2457321 2545628
16862B545628L16305k11740k27653q595M76264n2880R9654j78238l8802L90285
$$ 2545628 2861933 2650193 2422540 2413945 2890209 2837329 2936983 2758745 2719943 3110228
16852C110228j83475M8161O660M9140M6358J48226n1591k3423J95345j03447K43055
$$ 3110228 2926753 2974914 2981574 3030714 3077072 3225298 3173707 3150284 3345629 3242182 3485237
16841C485237J9717L45724k0593j86455L2066J85744o6868k06659M65094k33362
$$ 3485237 3504954 3850678 3830085 3643630 3675696 3861440 3794572 3587913 4053007 3819645
16831C819645J88177L20110q1293J82686K99321m00753K51354L8530J06205K56219
$$ 3819645 4007822 4327932 4246639 4429325 4728646 4327893 4579247 4617777 4723982 4980201
16821D980201l93707N28139J08787j7097K36718o1228L67293l87185M98673j87301
$$ 4980201 4586494 5114633 5223420 5206323 5443041 5381813 5749106 5361921 5860594 5673293
16811E673293K17977L61808j15845K86883M9519L92068l2967K65912L6276L25097
$$ 5673293 5891270 6253078 6137233 6424116 6473635 6865703 6832736 7098648 7134924 7460021
16801G460021j37303l3907O38604L2037N27131l79254L60287K27494K6721M06056
$$ 7460021 7322718 7288811 7927415 7959452 8486583 8107329 8467616 8695110 8721831 9127887
16791I127887J30482L66641K81322K10391N34798L36881L72964J9694l6440O33185
$$ 9127887 9258369 9625010 9906332 10116723 10651521 10988402 11361366 11381060 11344620 11977805
16781A1977805N51783M16298K83209N6096Q94987M48546L85017L3059J254755
$$ 11977805 12529588 12945886 13229095 13285191 14180178 14628724 15013741 15046800 16301555
16772A6301555M38448K79373Q93134M28211M16568Q95325P21944N73670O96698
$$ 16301555 16740003 17019376 17912510 18340721 18757289 19652614 20374558 20948228 21644926
16763B1644926J131267O16410J330896P48330Q49205Q88691J651734J338423J298738
$$ 21644926 22776193 23392603 24723499 25471829 26321034 27209725 28861459 30199882 31498620
16754C1498620J445806J480526J457901J993222J597950J976553K598754K090103
$$ 31498620 32944426 34424952 35882853 37876075 39474025 41450578 44049332 46139435
16746D6139435K383128K828136K621371K874599L370320L190794M323700L698986
$$ 46139435 48522563 51350699 53972070 56846669 60216989 63407783 67731483 71430469
16738G1430469M474680M659469M866348N299888N717662O079164O335273O853093
$$ 71430469 75905149 80564618 85430966 90730854 96448516 102527680 108862953 115716046
16730A15716046O817404P490600P646891P596838P838830P155569P508456O763394
$$ 115716046 122533450 130024050 137670941 145267779 153106609 160262178 167770634 174534028
16722A74534028O015339N261446L942402K921661K004079K83020j397611k663886
$$ 174534028 180549367 185810813 189753215 192674876 194678955 194961975 193564364 190900478
16714A90900478l588970m545733n958924o859596p371823p762223p471208p858684
$$ 190900478 187311508 182765775 176806851 169947255 162575432 154813209 147342001 139483317
16706A39483317q256387p553477p189218p011709o778542o135035n908262n463964
$$ 139483317 131226930 123673453 116484235 109472526 102693984 96558949 90650687 85186723
16698H5186723n235403m830387m895120l814540l635039l807569l524875k939433
$$ 85186723 79951320 75120933 70225813 66411273 62776234 58968665 55443790 52504357
16690E2504357k933253k344298k569466k477153j694677k693392j444567j715977
$$ 52504357 49571104 47226806 44657340 42180187 40485510 37792118 36347551 34631574
16682C4631574k128824j172157j520806j780888r33113j234482r21561j168130
$$ 34631574 32502750 31330593 29809787 28028899 27095786 25861304 24939743 23771613
16674B3771613r00755r45186j050342q12177n60115r67854n98043l38801j135053
$$ 23771613 22870858 21925672 20875330 20063153 19503038 18535184 17937141 17598340 16463287
16665A6463287n30949o18794m59995o82213m10746k46069n05312l84256m74814
$$ 16463287 15932338 15313544 14853549 14171336 13760590 13514521 13009209 12624953 12150139
16656A2150139k32726m41201o29230q0093l32650k85684k45865j42731n11730
$$ 12150139 11917413 11476212 10846982 10766889 10434239 10148555 9902690 9759959 9248229
16647I248229k74775N0614o56625j49241j10104j42678l03812k5184l76860j83594
$$ 9248229 8973454 9024068 8367443 8218202 8108098 7965420 7661608 7636424 7259564 7075970
16637G075970j41192j73850n3449m43048j04401k26543J20835J87489k11833m20454
$$ 7075970 6934778 6760928 6707479 6264431 6160030 5933487 6054322 6241811 6029978 5609524
16627E609524m19759K29545l19908K40531k56368j15078k23503m18225J91496
$$ 5609524 5189765 5419310 5099402 5339933 5083565 4968487 4744984 4326759 4518255
16618D518255j70068K40067q726p62739O72692k02985m33565k4860o9586J3089
$$ 4518255 4348187 4588254 4579528 3816789 4489481 4286496 3852931 3828071 3758485 3771574
16608C771574l01454J81652k23652K60286k01442k38430P3120k01802j1065o0969
$$ 3771574 3470120 3651772 3428120 3688406 3486964 3248534 3321654 3119852 3108787 3047818
16598C047818k2073o8576k88514P2700r1867M1690k07975K65727j47851Q0319
$$ 3047818 3025745 2957169 2668655 2741355 2649488 2691178 2483203 2748930 2601079 2681398
16588B681398R5131l11616k05138K41453j76447J62174l28646J95932K2402o2624
$$ 2681398 2776529 2464913 2259775 2501228 2324781 2486955 2158309 2354241 2376643 2314019
16578B314019R1233j91099k42370L5187K41372m55594K58605L06713m49918P8886
$$ 2314019 2405252 2214153 1971783 2006970 2248342 1792748 2051353 2358066 1908148 1987034
16568A987034j85826L40599k59384Q7344l86671L27742j0062q8332J21976k45558
$$ 1987034 1801208 2141807 1882423 1969767 1583096 1910838 1900776 1812444 1934420 1688862
16558A688862M7644q043J4996J75332l11689n4214k12917j8213k0457K1550N41250
$$ 1688862 1736506 1728463 1743459 1918791 1607102 1552888 1339971 1321758 1301301 1322851 1864101
16547A864101l13986P4230m60968O7742J30341k65467K81201k92450K62971j51658
$$ 1864101 1550115 1624345 1163377 1231119 1361460 1095993 1377194 1084744 1347715 1196057
16537A196057O8316J75250P7685n09137R430J48499o4108j97965L68845r5488
$$ 1196057 1264373 1439623 1517308 1008171 1017601 1166100 1101992 904027 1272872 1177384
16527A177384j46949o4265j76477K96311p8504L07365k92066L21557j82406j77391
$$ 1177384 1030435 966170 789693 1086004 1007500 1314865 1022799 1344356 1161950 984559
16517I84559J39931L0924j12303j63962J87984J2170l69224R6710j02911J78251
$$ 984559 1124490 1155414 1043111 879149 1067133 1079303 710079 806789 703878 882129
16507H82129l7625K17953L1986k67527J24853j2844j88778k23245K03401M5728
$$ 882129 844504 1062457 1094443 826916 951769 938925 750147 526902 730303 776031
16497G76031J35779o7174K8930j59687K22403j30416K33423l72193k60432K10143
$$ 776031 911810 844636 873566 713879 936282 805866 1039289 667096 406664 616807
16487F16807J42348k98046O01603D48226L20375j79615K396N3038M922M5582M23540
$$ 616807 759155 461109 1062712 448226 768601 588986 591382 644420 649342 694924 1118464
16476A118464C76494J02592K16353j34J31847k24629j48776M45928k11043j47850
$$ 1118464 376494 479086 695439 695305 827152 602523 453747 899675 688632 540782
16466E40782K80113C40609K8744J79318k29718K65532j99165P7499K3425P9757
$$ 540782 820895 340609 369353 548671 318953 584485 385320 462819 486244 566001
16456E66001B81857K1365K31474j15546J01699J77281j34532k79923o0972K17118
$$ 566001 281857 303222 534696 419150 520849 698130 563598 283675 222703 439821
16446D39821p1842A43335O60214l84321M335n7647j44611M03116A37642M27493
$$ 439821 367979 143335 803549 419228 423563 365916 221305 624421 137642 565135
16436E65135B32605K56191j47969M65145j98433j75006J9095B10714K15441K73037
$$ 565135 232605 488796 340827 805972 607539 432533 451628 210714 426155 699192
16426F99192j80003l6829p0725N7695k24501J48852A84468p6008J97913K49991
$$ 699192 519189 482360 411635 469330 244829 393681 184468 108460 306373 556364
16416E56364B26684J85505J14248A07319K30414K47982B90298H0670f384G21483
$$ 556364 226684 412189 526437 107319 337733 585715 290298 80670 -6384 721483
16405D05978J88525B15676M6221K20185a10086L2391A88459k204M11518B06463
$$ 405978 594503 215676 261897 482082 -110086 -77695 188459 186255 597773 206463
16394C53068k4467j6964A23589J33535J31642K72358H4865J81412D1126K08379
$$ 353068 328601 311637 123589 257124 388766 661124 84865 266277 41126 249505
16384B49505p7809J09860K6029r8316L93476r4316j09450j9821j29512J05844
$$ 249505 171696 281556 307585 209269 602745 508429 398979 379158 249646 355490
16374C55490r3352P917Q3812K08683A01796J38407l1466A8572K14056A03722J71513
$$ 355490 262138 270055 353867 562550 101796 240203 208737 18572 232628 103722 275235
16363B75235I8412M22124k25016q0820l0764F5501J74074A15032J94464A39577
$$ 275235 98412 520536 295520 214700 183936 65501 239575 115032 309496 139577
16352B97658K14522A7071L45574j77226J10734m0656J22433E7783L03269j66052
$$ 297658 512180 17071 362645 185419 296153 255497 377930 57783 361052 195000
16342A95000d016B91126j10628O9102b72366A63809B3648J74493b45212I0086
$$ 195000 -4016 291126 180498 249600 -272366 163809 23648 198141 -245212 90086
16331A50135J58318r0037l5027b98452B20382M1597a38276f340A95957f2322D23091
$$ 150135 308453 218416 183389 -298452 220382 261979 -138276 -6340 195957 -62322 423091
16319C047L57664b4657C50671B5341j512g4573B25968J34118j77025o9658N6935
$$ 3047 360711 -24657 350671 25341 23829 -74573 225968 360086 183061 113403 170338
16308A70338R1179J0321J36775a44312j16284C0479J40439J76134G9693g3099
$$ 170338 261517 271838 408613 -144312 -260596 30479 170918 347052 79693 -73099
16297a6536A99293o4183a04339C12895h6207r2226H274K5023L45832j06297r399
$$ -16536 199293 135110 -104339 312895 -86207 -178433 8274 33297 379129 272832 263433
16286B63433b42405B30503A01645b43079D70719A53148J29480H1943a72367A20989
$$ 263433 -242405 230503 101645 -243079 470719 153148 282628 81943 -172367 120989
16275B12255L4528q7963J07022K3626q3863R4581a01197A81546J24758j22170
$$ 212255 246783 158820 265842 289468 205605 300186 -101197 181546 306304 184134
16265A84134k4825O9579O567F3535f331A77558c3249A01340K22502A58168J12304
$$ 184134 159309 228888 235455 63535 -6331 177558 -33249 101340 323842 158168 270472
16254B70472q9884o9556a90857B34169r5579D1858L0831e2285A83370b7993A07083
$$ 270472 180588 111032 -190857 234169 138590 41858 72689 -52285 183370 -27993 107083
16242b23613A75246l392g0200D7241h2870G7923C5639J82893f9469A1273J08955
$$ -223613 175246 171854 -70200 47241 -82870 77923 35639 218532 -69469 11273 120228
16231A20228B9496K77328A29208A6578b02491R9447b0567B34269a35059L0427
$$ 120228 29496 306824 129208 16578 -202491 -103044 -20567 234269 -135059 -104632
16221a04632K0585k6504D33946h9801k0710C7786e0625k22016J08147L3998B17851
$$ -104632 -84047 -110551 433946 -89801 -110511 37786 -50625 -272641 -164494 -130496 217851
16209B7055b23310Q4214a3190A28168b21667a8346j16144B99655A5585J66008
$$ 27055 -223310 -139096 -13190 128168 -221667 -18346 -134490 299655 15585 181593
16199A81593l1698b86303C47301a0101j63716M0787A50722E912c5349H8526a62837
$$ 181593 149895 -286303 347301 -10101 -173817 -133030 150722 5912 -35349 88526 -162837
16187a49466L8931B55708p884r31A8633K47752B6751j3313K38823a584j83533
$$ -149466 -110535 255708 247824 246893 18633 266385 26751 13438 252261 -1584 -185117
16176a85117A29917J98212C3369a48532c2850F6398h7465o9034A84931k6706g2267
$$ -185117 129917 328129 33369 -148532 -32850 66398 -87465 -156499 184931 158225 -72267
16164i0658B43041a29598l5787b9675I1304h2660A07370g3728A17881b33538B40019
$$ -90658 243041 -129598 -165385 -29675 91304 -82660 107370 -73728 117881 -233538 240019
16152B23650D8850a27168j4349A94148G1711o319g4871C29935b0454B9267L9721
$$ 223650 48850 -127168 -141517 194148 71711 65392 -74871 329935 -20454 29267 68988
16141F8988J58249f6080q8705M2354G6331A7306d722B45780b50556a01265c5620
$$ 68988 227237 -66080 -154785 -112431 76331 17306 -4722 245780 -250556 -101265 -35620
16129g6816k7067j07544P4578r3769A70185M4719a41589H0156i6997p645o5924
$$ -76816 -103883 -211427 -136849 -230618 170185 214904 -141589 80156 -96997 -104642 -170566
16118a70566A60339L4845M9629a84230b1162j13257H8708A0423a46519A17475
$$ -170566 160339 195184 244813 -184230 -21162 -134419 88708 10423 -146519 117475
16107c81296E4930b2534A14365f1476l5374L8546n2545C42635L5448a50879k8050
$$ -381296 54930 -22534 114365 -61476 -96850 -58304 -110849 342635 378083 -150879 -178929
16096a78929B30390b0553m14A82430b072D21050F3431B9811Q8397g0816l29361
$$ -178929 230390 -20553 -20967 182430 -2072 421050 63431 29811 118208 -70816 -400177
16085d00177B3280b29292A4069J14500i2682C11060b9852p4952j058B65902e38679
$$ -400177 23280 -229292 14069 128569 -92682 311060 -29852 -104804 -105862 265902 -538679
16073a39489D7704b30203J7707A42388a41482J701k7251N3338D32605h707r6542
$$ -139489 47704 -230203 -212496 142388 -141482 -139781 -167032 -113694 432605 -8707 -105249
16062a05249j6481F8172c1059H1429a17432a0144B23418J1712c5858o6293c9017
$$ -105249 -121730 68172 -31059 81429 -117432 -10144 223418 235130 -35858 -102151 -39017
16050a3818m06669i7526d867C54998j48258a07131B59353a16691C7432b10733
$$ -13818 -420487 -97526 -4867 354998 206740 -107131 259353 -116691 37432 -210733
16039a65960A99149h086l6967B36388j5375c62225a32959M0113A63701a06229
$$ -165960 199149 -8086 -45053 236388 221013 -362225 -132959 -92846 163701 -106229
16028a1663H5045G270K88829j7144H3439L2633L81930G8321a96090r143E6708
$$ -11663 85045 7270 296099 278955 83439 116072 498002 78321 -196090 -205233 56708
16016a07691F03a80370d3035F9894K4608h7806B05476C0694h4391l683b6544j10605
$$ -107691 603 -180370 -43035 69894 94502 -87806 205476 30694 -84391 -88074 -26544 -137149
16004a37149N9977B79735H5361J3810a9847j37063H2637J36908c03747c5807k27469
$$ -137149 -77172 279735 85361 99171 -19847 -156910 82637 219545 -303747 -35807 -263276
15993b63276h2738l5145B86933a89083n8577F7090K3820f5893B17238G2888B4763
$$ -263276 -82738 -117883 286933 -189083 -247660 67090 90910 -65893 217238 72888 24763
15981e7849B71845D1719K97522A45704A5813a04577j60046C0474N8686J6306k0264
$$ -57849 271845 41719 339241 145704 15813 -104577 -264623 30474 89160 105466 85202
15970H5202j3758d0532H1433f6816p1190I423b27867O4435A31817a01093o1089
$$ 85202 71444 -40532 81433 -66816 -138006 9423 -227867 -163432 131817 -101093 -162182
15959a62182O4914h539k61602E6376N5270b8423K411r3099I340a55850h048j21148
$$ -162182 -97268 -8539 -270141 56376 111646 -28423 -26012 -119111 9340 -155850 -8048 -129196
15947a29196n4982m7554c6142m9100F4277j7828e658k45992C202J72538a15544
$$ -129196 -184178 -231732 -36142 -85242 64277 46449 -5658 -251650 3202 175740 -115544
15935B68913I8465b53032B10580D3261a42771F5243j6395R4215I648a92023B11761
$$ 268913 98465 -253032 210580 43261 -142771 65243 48848 143063 9648 -192023 211761
15923b28612r4365J14959D35534A7645a50055J1477G4668b44342f7611r1989e5987
$$ -228612 -322977 -208018 435534 17645 -150055 -138578 74668 -244342 -67611 -159600 -55987
15911I6667a03732m0994E7352J64743a77984k4432M0976B83163C7889Q6642g5186
$$ 96667 -103732 -144726 57352 222095 -177984 -202416 -161440 283163 37889 124531 -75186
15899a03219a8216A3549b31550D3703f7498o4220D8753a47529f6114r2397e1282
$$ -103219 -18216 13549 -231550 43703 -67498 -131718 48753 -147529 -66114 -158511 -51282
15887H9904a9041m7854L0850j423o7878m7210j33752d5598o6776m5740A68247
$$ 89904 -19041 -66895 -36045 -37468 -105346 -152556 -286308 -45598 -112374 -158114 168247
15875a25762A28288d12774a08529C25093g9430l6925k30022F0148J08756c70962
$$ -125762 128288 -412774 -108529 325093 -79430 -116355 -346377 60148 168904 -370962
15864a68659l3966n4860c7666k14914R3014O3044C7243M8245J09183p0394a79789
$$ -168659 -202625 -257485 -37666 -252580 -159566 -96522 37243 85488 194671 124277 -179789
15852a11600C7426A2344K53752i9952A28777d1265j22001a6694A17408J0747e4303
$$ -111600 37426 12344 266096 -99952 128777 -41265 -163266 -16694 117408 128155 -54303
15840a52328O7277E0117N5772e7755i802p051q168j90050C57132i7531d3350o985
$$ -152328 -85051 50117 105889 -57755 -9802 -16853 -25021 -215071 357132 -97531 -43350 -50335
15828e0335l18523a42379A29628A4920b26275J07306A51298i7167l96669A05070
$$ -50335 -368858 -142379 129628 14920 -226275 -118969 151298 -97167 -493836 105070
15817A25040b20164P2283C5574b27677H1068b67114K4712K6653A90314i3896j5977
$$ 125040 -220164 -147881 35574 -227677 81068 -267114 -242402 -215749 190314 -93896 -109873
15806a09873m1567A4689J86749d16590a23082B05494G0359a70866O0357o2152
$$ -109873 -151440 14689 201438 -416590 -123082 205494 70359 -170866 -110509 -172661
15796a72661A58030j8037l3091a94650B39480b79432A26699a56703F3279M4329
$$ -172661 158030 139993 106902 -194650 239480 -279432 126699 -156703 63279 107608
15786A07608l8443K8013a15224A48046a12999G3869Q9635C773c74603b6129j30112
$$ 107608 69165 97178 -115224 148046 -112999 73869 163504 3773 -374603 -26129 -156241
15775a56241K119C1713b10965A99800a73717B3268b3079j29547A51169d25043
$$ -156241 -154122 31713 -210965 199800 -173717 23268 -23079 -152626 151169 -425043
15764b46458N6670a0499A98526D3406a55545d5799m3428m5748A09479C7253J95741
$$ -246458 -189788 -10499 198526 43406 -155545 -45799 -89227 -134975 109479 37253 232994
15753B32994c15252A42105b10955H0687a2822k95271F585M55296c78887A30073
$$ 232994 -315252 142105 -210955 80687 -12822 -308093 6585 461881 -378887 130073
15742b86322A10085a4719o5400E6816d1810m09360r1413A82143j5732e034j44167
$$ -286322 110085 -14719 -80119 56816 -41810 -451170 -542583 182143 166411 -5034 -149201
15731a49201A43852N7133g8215A29779n0969E409a842H1447b67319g5294j12266
$$ -149201 143852 200985 -78215 129779 78810 5409 -1842 81447 -267319 -75294 -187560
15720a87560r6546G9471a97810e6106f989p8592j36019A19961a94506j3806A49665
$$ -187560 -284106 79471 -197810 -56106 -6989 -85581 -221600 119961 -194506 -208312 149665
15708A55814c29466G4494b46959O4167n1202G4831b9659G0174L85848A28466R8556
$$ 155814 -329466 74494 -246959 -182792 -233994 74831 -29659 70174 456022 128466 227022
15697B27022I9404a2172A9356a91452a1724E42070A08785J25553I7310D4543a24593
$$ 227022 99404 -12172 19356 -191452 -11724 542070 108785 234338 97310 44543 -124593
15685A43204d3034m2077C5201b4209B51535a30444m6212P1446D9598j0088A7823
$$ 143204 -43034 -85111 35201 -24209 251535 -130444 -176656 -105210 49598 39510 17823
15673B70724a43077F5309M1839b58838C82362a98951A01025Q937G879L6660a18021
$$ 270724 -143077 65309 107148 -258838 382362 -198951 101025 109962 7879 44539 -118021
15661a93171J355Q2340E485K02923h6575j3009l0644D1544b43065h4229C4874
$$ -193171 -191816 -109476 5485 208408 -86575 -99584 -130228 41544 -243065 -84229 34874
15649a41554H9920k4870g2809A69799c11073g6147A81187m0802a98638Q5285A3957
$$ -141554 89920 65050 -72809 169799 -311073 -76147 181187 140385 -198638 -113353 13957
15637A77363a19531n5262f9385I681K55172i4223F9137d48974a47280k34589J68624
$$ 177363 -119531 -174793 -69385 9681 264853 -94223 69137 -448974 -147280 -381869 -213245
15626b13245g3570B89212j37472K74257g9183A24182m2558n760C2835R410a81753
$$ -213245 -73570 289212 151740 425997 -79183 124182 81624 75864 32835 42245 -181753
15614c48903L5201d8875k76016D7442B199a46748f1649p3015a1938q8251j11559
$$ -348903 -313702 -48875 -324891 47442 2199 -146748 -61649 -134664 -11938 -100189 -211748
15603b11748m27503b21721f8742j38047a5783A42330F8555a52053j82414A45950
$$ -211748 -639251 -221721 -68742 -206789 -15783 142330 68555 -152053 -334467 145950
15592a21789k24330d0991G9638b4511l2442a3950D76243A24375J8706a20570l8040
$$ -121789 -346119 -40991 79638 -24511 -56953 -13950 476243 124375 143081 -120570 -158610
15581a58610f4425a1394j63145H9347f5727M515B41115a78671L2922B04500j7285
$$ -158610 -64425 -11394 -174539 89347 -65727 -61212 241115 -178671 -145749 204500 187215
15570A87215a4060A3214J28356a5138A15407b2160k63646C9575a57169f359A66847
$$ 187215 -14060 13214 141570 -15138 115407 -22160 -285806 39575 -157169 -6359 166847
15558e36224D01994A5207b7802j86145C45215g7783m4282b4083j48364n3865A68892
$$ -536224 401994 15207 -27802 -213947 345215 -77783 -122065 -24083 -172447 -226312 168892
15546a19270A27245a60675o5493B8452d4065F6063n62a58242C61245A0819J80830
$$ -119270 127245 -160675 -226168 28452 -44065 66063 65501 -158242 361245 10819 191649
15535A91649D8188Q1737B5191J03689J2210a6442m415q2355G3745O4486J60852
$$ 191649 48188 129925 25191 128880 141090 -16442 -20857 -103212 73745 138231 299083
15524B99083e6775k5851k4178D26128b16502K4280r8490E9844J08122n2204a85182
$$ 299083 -56775 -82626 -106804 426128 -216502 -192222 -290712 59844 167966 115762 -185182
15512B05177a29389C18185F3482a12671D4668f4504A48836D9771R858a29058D4236
$$ 205177 -129389 318185 63482 -112671 44668 -64504 148836 49771 59629 -129058 44236
15500b6308r5818l2635j47857E593L29140I9504C7702K13373b77302c8762A75532
$$ -26308 -122126 -154761 -302618 5593 334733 99504 37702 251075 -277302 -38762 175532
15488C6111a8416k31989j200F3061b83708A06634b36571L5925A37366b33851b887
$$ 36111 -18416 -250405 -251605 63061 -283708 106634 -236571 -200646 137366 -233851 -2887
15476A449a75321B62704I0252K48791f7348B426a6115j26457D7218b45225A42484
$$ 1449 -175321 262704 90252 339043 -67348 2426 -16115 -142572 47218 -245225 142484
15464a7932m42218J09188C55916b13876A4325J13659a53495n5475B91166k4187
$$ -17932 -460150 -350962 355916 -213876 14325 127984 -153495 -208970 291166 266979
15454B66979e4261C8904b4249o7971B2904J2776H821K04205F5775P5339a48681
$$ 266979 -54261 38904 -24249 -92220 22904 35680 8821 213026 65775 141114 -148681
15442e22266a68342G3633e3082k003j23122B60526D8864L69883d2508K134j48484
$$ -522266 -168342 73633 -53082 -55085 -178207 260526 48864 418747 -42508 -40374 -188858
15431a88858e067k80972A21199a51540p3835B10611b63354R2345i253q9437B3090
$$ -188858 -5067 -286039 121199 -151540 -225375 210611 -263354 -171009 -9253 -98690 23090
15419A42085b63367D2493e6618J9618m2946m773H4246d4565I0053b06651B31893
$$ 142085 -263367 42493 -56618 -37000 -79946 -84719 84246 -44565 90053 -206651 231893
15407a19465e0286B6130P13a56720J7128k08936b7776k24947H9741m1673i279
$$ -119465 -50286 26130 26843 -156720 -139592 -348528 -27776 -252723 89741 48068 -9279
15395d41749a84959D19715b02821o1332B30916A8830J57477b54186K3735F3536
$$ -441749 -184959 419715 -202821 -264153 230916 18830 176307 -254186 -230451 63536
15384B3790J4069a47480a1690F8399i112p0991A26687C6405K48068b79498h9947
$$ 23790 37859 -147480 -11690 68399 -9112 -80103 126687 36405 284473 -279498 -89947
15372H9276l0730K05566e6169r8196O3149A41360g0041A5617L2637q757J79480
$$ 89276 58546 264112 -56169 -154365 -91216 141360 -70041 15617 48254 39497 218977
15361B18977A7181R9566A1411d8615j56254E6226J1053L13391a49136n6026a1809
$$ 218977 17181 116747 11411 -48615 -204869 56226 67279 380670 -149136 -205162 -11809
15349b2762j70706f4868l7151H6019H991L5217J31114I643c6581B28789j05570
$$ -22762 -193468 -64868 -102019 86019 8991 44208 175322 9643 -36581 228789 123219
15338A23219m1766a60998f2691J828k3360A80728J04886g2486D29223a50174C3365
$$ 123219 81453 -160998 -62691 -60863 -84223 180728 285614 -72486 429223 -150174 33365
15326a9805B27577b73732h1111B13843a01003A40147J67874p4629O9512e2529
$$ -19805 227577 -273732 -81111 213843 -101003 140147 308021 233392 302904 -52529
15315A73021b901l18870A58387E1810g3685p0250p9941c1918A26663J73973e0845
$$ 173021 -2901 -321771 158387 51810 -73685 -143935 -223876 -31918 126663 300636 -50845
15303E9583G879M7566O5874D8521L26887A23577a36971A09625l1072a90442A18827
$$ 59583 7879 55445 121319 48521 375408 123577 -136971 109625 78553 -190442 118827
15291I1519R0168P1646A09528K17974j07779M2472a67907I5103C9453R5049K1139
$$ 91519 181687 253333 109528 327502 219723 262195 -167907 95103 39453 134502 155641
15280A55641h8790e777r0752B1495a81672F5228J96050j24836a63233e7006B47180
$$ 155641 -88790 -5777 -96529 21495 -181672 65228 261278 136442 -163233 -57006 247180
15268A81785b43120I8083J91478a77594a2690p3869k9976A3457f7954p7774E6854
$$ 181785 -243120 98083 289561 -177594 -12690 -86559 -116535 13457 -67954 -145728 56854
15256B86493k0918a69607B19021r7661b77033A64226K32814M0461L81345P11245
$$ 286493 265575 -169607 219021 121360 -277033 164226 397040 437501 818846 1530091
15246A530091n84807M42585j64974B85018c6103k5499b6184G2494N537a8261l0336
$$ 1530091 945284 1387869 1222895 285018 -36103 -61602 -26184 72494 78031 -18261 -48597
15235d8597A21670L46000A40868b64099A92673e1659H9923K49078F6973e854C51141
$$ -48597 121670 467670 140868 -264099 192673 -51659 89923 339001 66973 -5854 351141
15223b3960o5371C19760c7400C6721J27889h9806A0396K47618n1852D799f6363
$$ -23960 -89331 319760 -37400 36721 164610 -89806 10396 258014 206162 4799 -66363
15211A43139B3026J33267j4199m3523k88b48523a7155A36754a06385B72470P7729
$$ 143139 23026 156293 142094 98571 98283 -248523 -17155 136754 -106385 272470 350199
15200C50199A5491K7782K36911l4013C3828a06813p994e3358o6451N0892A99164
$$ 350199 15491 43273 280184 246171 33828 -106813 -114807 -53358 -119809 -68917 199164
15188a60827E0430a9039B2540J03132a75568A15160e9345C88076a07025j42378
$$ -160827 50430 -19039 22540 125672 -175568 115160 -59345 388076 -107025 -249403
15178b49403e7026j97168E21412G8107a97206P3200F6161h450A23595K92429b82157
$$ -249403 -57026 -254194 521412 78107 -197206 -124006 66161 -8450 123595 416024 -282157
15166a2254I4823J22168F6785K49567j22047J35962q1482a24070A16939r374K73165
$$ -12254 94823 216991 66785 316352 194305 330267 248785 -124070 116939 107565 380730
15155C80730C358L80652b0933G3048a43571L075A72545B2806H937b0715j72766
$$ 380730 3358 384010 -20933 73048 -143571 -140496 172545 22806 8937 -20715 -193481
15144a93481A4612k730B621L9657J99710i4304p2505A8921P1909J82665A11721
$$ -193481 14612 11882 2621 42278 241988 -94304 -166809 18921 90830 273495 111721
15132a10270E1320J78519j10232a42553G9154L8015c7797C55561l6069b94703
$$ -110270 51320 229839 119607 -142553 79154 117169 -37797 355561 319492 -294703
15121D0398J10642K91786j67036A19700k5199J29678c3330A11746k7631L0771
$$ 40398 151040 442826 275790 119700 94501 224179 -33330 111746 84115 114886
15111A14886h1738D00572h6265A59044c4318C0079L0872O3920c77466A45015g9994
$$ 114886 -81738 400572 -86265 159044 -34318 30079 60951 124871 -377466 145015 -79994
15099b83614J32877B68448o287j12254N6605K38728G5769J06226K36527A81868
$$ -283614 -150737 268448 262161 149907 206512 445240 75769 181995 418522 181868
15088a4622E3560R4771B5723K70133l4123J2712b26787B08941D8520K06892A08075
$$ -14622 53560 148331 25723 295856 261733 274445 -226787 208941 48520 255412 108075
15076D1750N2156M12709j57748A46549m815g3985A60878C8441J19657J01475A29600
$$ 41750 93906 506615 348867 146549 141734 -73985 160878 38441 158098 259573 129600
15064f2878C28473j05546l4148k5423J27332p0345l9294h1463C78347o0700L3417
$$ -62878 328473 222927 188779 163356 290688 220343 181049 -81463 378347 317647 351064
15053C51064p2549J11354j64058G3708e1899B76721H8482K34242A8478L53971
$$ 351064 278515 389869 225811 73708 -51899 276721 88482 322724 18478 372449
15043C72449j57558a86397I3473L28875j82509l0525J34880e975A98028M132E9621
$$ 372449 214891 -186397 93473 422348 239839 209314 344194 -5975 198028 202160 59621
15031e2177B28130M7518R7505F0494B1366J04825A7931R4779K10599l5873F8792
$$ -52177 228130 275648 373153 60494 21366 126191 17931 112710 323309 287436 68792
15019D05621g148B89280m8262g5360H1134L0218A6562L01495a7641A62610L0841
$$ 405621 -7148 289280 241018 -75360 81134 111352 16562 318057 -17641 162610 193451
15008A93451p00q5025L25148G1468L8681b36284B09706J39543D4593J35452L12958
$$ 193451 192751 107726 432874 71468 110149 -236284 209706 349249 44593 180045 493003
14997D93003j74359K7396A41046K34087L2763A29110P3746J53196A72316B966
$$ 493003 318644 346040 141046 375133 407896 129110 202856 356052 172316 2966
14986A33597L31269C6078K00951o4579J67692j17307K92602A48244n7573Q7792
$$ 133597 464866 36078 237029 172450 340142 222835 515437 148244 90671 178463
14976A78463l5512L62164B10075Q8822j40988J57711a13397D57328a21775d7880
$$ 178463 142951 505115 210075 298897 157909 315620 -113397 457328 -121775 -47880
14965g7219D03173A44191E4608J79236R9047d2565C25037N2082J36046B5117J64988
$$ -77219 403173 144191 54608 233844 332891 -42565 325037 377119 513165 25117 190105
14954A90105L33355n426B33489N5724j01021J24529r3384J42568m4755d2712C96498
$$ 190105 523460 518034 233489 289213 188192 312721 219337 361905 317150 -42712 396498
14942D87440C6809L88958m8515D6177J09713L0048o1219K21916A56317J54752
$$ 487440 36809 425767 377252 46177 155890 185938 124719 346635 156317 311069
14932C11069H7600K28080q5742J85483p9323o6078I8794L05541j89671I6565J00067
$$ 311069 87600 315680 229938 415421 336098 270020 98794 404335 214664 96565 196632
14921A96632R3698L64128B68027F2204J27843J35992I8318K76207J57139j13026
$$ 196632 290330 654458 268027 62204 190047 326039 98318 374525 531664 418638
14911D18638p3084j52093j6944m5251L54819I5957L32012k00304E2319R1960K62607
$$ 418638 345554 193461 176517 131266 486085 95957 427969 227665 52319 144279 406886
14900D06886I7036M74878j77724J9097p9722q5716N70834k45403k0662j08371
$$ 406886 97036 571914 394190 413287 333565 247849 818683 573280 552618 444247
14890D44247j26910k0986A07624n0878K03826k6588B1310L39671A2646K99500
$$ 444247 317337 296351 107624 56746 260572 233984 21310 360981 12646 312146
14880C12146J44659K3383D2271N1297J70089J61161q5779L11522A29904L22244
$$ 312146 456805 480188 42271 93568 263657 424818 339039 650561 129904 452148
14870D52148k02900j16337e2903D21931K58375j80093k5835r9694K18932O9367
$$ 452148 249248 132911 -52903 421931 680306 500213 474378 374684 593616 662983
14860F62983l04165j36039K1360Q3014L13894j38078J4549j45687J57325j47524
$$ 662983 358818 222779 244139 327153 641047 502969 517518 371831 529156 381632
14850C81632j37883L10541A92195K07438K6911J30293B34053J19142J60659R0193
$$ 381632 243749 554290 192195 399633 426544 556837 234053 353195 513854 604047
14840F04047J02724B63976L73957j98353m8616J44267K12769j52244j79593L34607
$$ 604047 706771 263976 637933 439580 390964 535231 748000 595756 416163 750770
14830G50770k78434J20999k55116A03856K3560N80231l28408M31808j82286j35238
$$ 750770 472336 593335 338219 103856 127416 707647 379239 811047 628761 493523
14820D93523j38905J36464j60082L77720j81880j80758O1979A75978N27110l24488
$$ 493523 354618 491082 331000 708720 526840 346082 408061 175978 703088 378600
14810C78600A84958J55152j02586K17981j9148j56581A16541K29441L34747r5493
$$ 378600 184958 340110 237524 455505 436357 279776 116541 345982 680729 585236
14800E85236j58133k6193K79952k55785L1204L04453j37558K09696k47192j28917
$$ 585236 427103 400910 680862 425077 456281 760734 623176 832872 585680 456763
14790D56763K41947q7785O074j57390L1449j30262L58903n6366k36866J46333
$$ 456763 698710 610925 616999 459609 491058 360796 719699 663333 426467 572800
14780E72800j85933K10105J6288j32458k34215J22709O5631N90643J07148E34407
$$ 572800 386867 596972 613260 480802 246587 369296 434927 1025570 1132718 534407
14769A004571B89804P54529m46157j69934P5407j70781J35397J50865L84174k68656
$$ 1004571 289804 1044333 598176 428242 503649 332868 468265 619130 1003304 734648
14759G34648j08551J91465k35277q3813J08332k71277K82526m63j03810j2432
$$ 734648 626097 817562 582285 498472 606804 335527 618053 617590 513780 501348
14749E01348J57466j4503K45826j45733k60843M01731D42269J47777P8228P9481
$$ 501348 658814 644311 890137 744404 483561 885292 442269 590046 668274 747755
14739G47755m7976C06910K19756M35784j37312n43o3839p7974J47846l46498K93802
$$ 747755 699779 306910 526666 962450 825138 824595 760756 682782 830628 484130 777932
14728G77932k89895L22311R4679n7498J04691k17572k26571k8997M56100L688
$$ 777932 488037 810348 905027 847529 952220 734648 508077 479080 935180 938868
14718I38868l2109J83824n28545J87965l26202L96855q7078M3325J80153k77780
$$ 938868 906759 1090583 562038 750003 423801 820656 733578 776903 957056 679276
14708F79276K03396D22737N74440j99077j10327L05398l30881M96420l14544k17695
$$ 679276 882672 422737 997177 798100 687773 993171 662290 1158710 844166 626471
14698F26471K44994J62527m31828L15284k72856q3783M07785k60495L17858k88837
$$ 626471 871465 1033992 602164 917448 644592 560809 968594 708099 1025957 737120
14688G37120j6304L78070m1251l19645O9930L7399J47768O1398l51364k154L29638
$$ 737120 720816 1098886 1057635 737990 807920 845319 993087 1054485 703121 700967 1030605
14677A030605N6200k93888K54224m02788M81789J51734l26865J83212j48397k79934
$$ 1030605 1086805 792917 1047141 644353 1126142 1277876 951011 1134223 985826 705892
14667G05892J90034L2388J91930k92045k3998K10281L4003j96015K43133r9730
$$ 705892 895926 928314 1120244 828199 804201 1014482 1048485 852470 1095603 995873
14657I95873K25933j91951o2719L18992j14599l06856K65204o3282Q7039j57541
$$ 995873 1221806 1029855 967136 1286128 1171529 864673 1129877 1066595 1153634 996093
14647I96093N23791j03808q5929k1430l6168j55050p519L97586k22502j62627
$$ 996093 1519884 1416076 1330147 1308717 1272549 1117499 1109980 1507566 1285064 1122437
14637A122437L93128k42554J9628l958J73074n34561L66203j69120J10942M67996
$$ 1122437 1515565 1273011 1292639 1288681 1461755 927194 1293397 1124277 1235219 1703215
14627A703215o78816J27984O8078j3006J00148J54605k15754m1603O40155J03941
$$ 1703215 1024399 1152383 1220461 1207455 1307603 1462208 1246454 1204851 1845006 1948947
14617A948947n25935N5401N0710L5369k94990K39905P6913j84326j3526K16256
$$ 1948947 1423012 1478413 1529123 1564492 1269502 1509407 1586320 1401994 1388468 1604724
14607A604724O3076k75020J24631K24346J6992m34059J88223j17484j19992M08717
$$ 1604724 1667800 1392780 1517411 1741757 1758749 1324690 1512913 1395429 1275437 1684154
14597A684154l3486J82450K05739l56590J41995j80880J52683k58955J67413l1483
$$ 1684154 1650668 1833118 2038857 1682267 1824262 1643382 1796065 1537110 1704523 1673040
14587A673040L66857m52206J98027K18002k79951J69287L45242j95337m9388L87203
$$ 1673040 2039897 1587691 1785718 2003720 1723769 1893056 2238298 2042961 1993573 2380776
14577B380776k98787k72694K26121o9618J5100P2759k33444K21673J69257K86254
$$ 2380776 2081989 1809295 2035416 1965798 1980898 2053657 1820213 2041886 2211143 2497397
14567B497397l87233L15695K76446m19146K50193J87980j44333m7502L14331K4346
$$ 2497397 2110164 2425859 2702305 2283159 2533352 2721332 2576999 2529497 2843828 2868174
14557B868174K09565J35110o8545j45478M60771M84740K80505J217891J652133
$$ 2868174 3077739 3212849 3144304 2998826 3459597 3944337 4224842 5442733 7094866
14548G094866L700042R461619J9773616M66341j8711909A0848998n371446k078501
$$ 7094866 10794908 20256527 40030143 40496484 21784575 10848998 5477552 3399051
14540C399051r00409n24360K47698m02056J96215J21246j42421l5665M92948m26413
$$ 3399051 2498642 1974282 2221980 1819924 2016139 2137385 1994964 1959299 2452247 2025834
14530B025834J77401j2498J55303n06648J05062L53673k29747M96249m49961J14828
$$ 2025834 2203235 2190737 2346040 1839392 1944454 2298127 2068380 2564629 2114668 2229496
14520B229496L40738j27878n6027K29809L9394J28660m44886N55269k98871n5499
$$ 2229496 2570234 2442356 2386329 2616138 2655532 2784192 2339306 2894575 2595704 2540205
14510B540205J65835j37627N01067j32669Q1065l57630L83207K7020O5756l71560
$$ 2540205 2706040 2568413 3069480 2936811 3017876 2660246 3043453 3070473 3136229 2764669
14500B764669J56571n2289K05723j2721L34076j73172p2237N76565m26734M6119
$$ 2764669 2921240 2868951 3074674 3061953 3396029 3222857 3150620 3727185 3300451 3346570
14490C346570m4090n1232K54371J87923l64632L1312M20752J8843k8404J19752
$$ 3346570 3302480 3251248 3505619 3693542 3328910 3360222 3780974 3799817 3771413 3891165
14480C891165K25827l77443O069j28878N66860o10070M06554k68259K53885K28060
$$ 3891165 4116992 3739549 3745618 3616740 4183600 3573530 3980084 3711825 3965710 4193770
14470D193770J93596m92960N16542l4991j35467L63408r4692J48972n3980l15835
$$ 4193770 4387366 3894406 4410948 4375957 4240490 4603898 4509206 4658178 4604198 4288363
14460D288363K83774M5943M23102m68575O6148q4368K91481J64868J33723k29494
$$ 4288363 4572137 4618080 5041182 4572607 4638755 4554387 4845868 5010736 5144459 4914965
14450D914965L81675K64152j47037J69405q3835N05151m94423J35846K91351j54938
$$ 4914965 5296640 5560792 5413755 5583160 5499325 6004476 5510053 5645899 5937250 5782312
14440E782312J06758l9454M14978l43668M18905j86242K41635K03326l1111r7306
$$ 5782312 5889070 5849616 6264594 5920926 6339831 6153589 6395224 6598550 6567439 6470133
14430F470133N51365P3028j21739J80485K77640J07833R632l62854N2706M49199
$$ 6470133 7021498 7094526 6972787 7153272 7430912 7538745 7548377 7185523 7238229 7687428
14420G687428k6316N13796l201J67202j42026M85626l19601j52122O56363K21531
$$ 7687428 7661112 8174908 8171707 8338909 8196883 8682509 8362908 8210786 8867149 9088680
14410I088680K3964J77281j34235N55244n75788R83515k50073L18475J25680k56147
$$ 9088680 9112644 9289925 9155690 9710934 9135146 10118661 9868588 10187063 10312743 10056596
14400A0056596J73974K36212N19137p0577N16171m41181L30439N51006K92477
$$ 10056596 10230570 10466782 10985919 10915342 11431513 10990332 11320771 11871777 12164254
14391A2164254k6606M46643O2411n8816M54814J83189L16998j60875M81069L93716
$$ 12164254 12137648 12584291 12646702 12587886 13042700 13225889 13542887 13382012 13863081 14256797
14381A4256797r0911M72814K22766J24604L96717L77592K68429L99476N7970L64730
$$ 14256797 14165886 14638700 14861466 14986070 15382787 15760379 16028808 16428284 16486254 16850984
14371A6850984K78019P33038K02987K8188Q14041J73963O04749M35238K35993
$$ 16850984 17129003 17862041 18065028 18093216 18907257 19081220 19685969 20121207 20357200
14362B0357200K99293L17723O55937L22773P56716L95614N79404K08512O65304
$$ 20357200 20656493 20974216 21630153 21952926 22709642 23105256 23684660 23893172 24558476
14353B4558476R48502O00346M14163P39916N72877K04006J272500O86231P49489
$$ 24558476 25506978 26107324 26521487 27261403 27834280 28038286 29310786 29997017 30746506
14344C0746506O19432R61680Q50076Q26047P56338J015795J006354J191932J187143
$$ 30746506 31365938 32327618 33177694 34003741 34760079 35775874 36782228 37974160 39161303
14335C9161303Q09690J342994J061690J315561J140026J454912J587605J489231
$$ 39161303 39970993 41313987 42375677 43691238 44831264 46286176 47873781 49363012
14327D9363012J670987J171282J876712J945750J699494J720435K437553J762203
$$ 49363012 51033999 52205281 54081993 56027743 57727237 59447672 61885225 63647428
14319F3647428K541530K188628K671940K449454K594418L187257K787766L425653
$$ 63647428 66188958 68377586 71049526 73498980 76093398 79280655 82068421 85494074
14311H5494074L247256L726151L884754L946594L712628M886607M382900N361483
$$ 85494074 88741330 92467481 96352235 100298829 104011457 108898064 113280964 118642447
14303A18642447N217355N097634O040584O080054O615532P252855P148443P828809
$$ 118642447 123859802 128957436 134998020 141078074 147693606 154946461 162094904 169923713
14295A69923713Q037116Q892963R044401R577294J0141679J0712882J1128784
$$ 169923713 177960829 186853792 195898193 205475487 215617166 226330048 237458832
14288B37458832J1454023J2137485J2404180J2764045J3445834J3378941J3338519
$$ 237458832 248912855 261050340 273454520 286218565 299664399 313043340 326381859
14281C26381859J3963403J3645214J3545982J2764789J2602992J1307825J0642625
$$ 326381859 340345262 353990476 367536458 380301247 392904239 404212064 414854689
14274D14854689Q977840O509107K857410N14493r10855J96637l753114l114980
$$ 414854689 423832529 430341636 433199046 433713539 432802684 432999321 429246207 426131227
14266D26131227l432960n284509p847509r795417j0797920j2465029j3233751
$$ 426131227 422698267 417413758 409566249 399770832 388972912 376507883 363274132
14259C63274132j4055234j4139548j4267949j4661804j3883937j2759015j3000082
$$ 363274132 349218898 335079350 320811401 306149597 292265660 279506645 266506563
14252B66506563j2582734j2145152j1726488j1199231j0671362r912184r644255
$$ 266506563 253923829 241778677 230052189 218852958 208181596 198269412 188625157
14245A88625157q731194q251704p824607p657357p131699o773117o198944n734874
$$ 188625157 179893963 171642259 163817652 156160295 149028596 142255479 136056535 130321661
14237A30321661n450245n707973n141606m657930m475118m179752l620940l763976
$$ 130321661 124871416 119163443 114021837 109363907 104888789 100709037 97088097 93324121
14229I3324121l779468l687500l294517l055881k780418k635640k659596l121334
$$ 93324121 89544653 85857153 82562636 79506755 76726337 74090697 71431101 68309767
14221F8309767k140912k328318j982130k160959j653970k327795j684866j837151
$$ 68309767 66168855 63840537 61858407 59697448 58043478 55715683 54030817 52193666
14213E2193666r75099j527410k092493j043318j514943j296806n50026j504606
$$ 52193666 51218567 49691157 47598664 46555346 45040403 43743597 43193571 41688965
14205D1688965j295625j305241j441340p13372r58568n53563j087189r57243q99389
$$ 41688965 40393340 39088099 37646759 36933387 35974819 35421256 34334067 33376824 32477435
14196C2477435j168210m67170o52032n93693q66532j037733j94760j075226l96407
$$ 32477435 31309225 30842055 30190023 29596330 28729798 27692065 27497305 26422079 26025672
14187B6025672l53619r43701o15637l37816p95791J12926r13926m45895k88976
$$ 26025672 25672053 24728352 24112715 23774899 22979108 23092034 22178108 21732213 21443237
14178B1443237m12418o67136j95203o31108m39046k34944m49783k42072k52550
$$ 21443237 21030819 20363683 20168480 19537372 19098326 18863382 18413599 18171527 17918977
14169A7918977o56832k70698m98474k14225p9830j20790n22712k84602k49687
$$ 17918977 17262145 16991447 16492973 16278748 16198918 16078128 15555416 15270814 15021127
14160A5021127n94812K77458j33129m62997n25686L09869j004476j0283k51981
$$ 15021127 14426315 14703773 14570644 14107647 13581961 13891830 12887354 12877071 12625090
14151A2625090R402j06771j81198m42278m4790q3833o8767l94457M95n05380l8183
$$ 12625090 12634492 12527721 12346523 11904245 11859455 11775622 11706855 11312398 11312893 10807513 10769330
14140A0769330k19533l05458L66273l29469j42888k45517j42161o8436j15705
$$ 10769330 10549797 10244339 10610612 10281143 10138255 9892738 9750577 9682141 9566436
14131I566436l71944m36602M16866J22634m07959k09002p9604k71231R7349j19516
$$ 9566436 9194492 8757890 9174756 9297390 8889431 8680429 8600825 8329594 8426943 8307427
14121H307427o3261K90644l67546N814o55387j06183L60898k86034j58494K3653
$$ 8307427 8244166 8534810 8167264 8173078 7517691 7411508 7772406 7486372 7327878 7351531
14111G351531j82073j43876N01300n74510M9850j36780m1018K1200k05614l31313
$$ 7351531 7169458 7025582 7526882 6952372 7002222 6865442 6824424 6845624 6640010 6308697
14101F308697j79848J32319J30944l21568l31918J84339J03919k97094J87543
$$ 6308697 6128849 6261168 6392112 6070544 5738626 5922965 6026884 5729790 5917333
14092E917333k08139k15408J4143k02702Q1650J52438j94893j3171q1398o2865
$$ 5917333 5709194 5493786 5507929 5305227 5386877 5539315 5344422 5331251 5249853 5186988
14082E186988k10855J05792j21161j25313L34343k06813l67961K83756L2605K44826
$$ 5186988 4976133 5081925 4960764 4835451 5169794 4962981 4595020 4878776 4911381 5156207
14072E156207o82178r5657J37042J4123m26228L7571Q6970K17741k71973P9658
$$ 5156207 4474029 4378372 4515414 4529537 4103309 4140880 4227850 4445591 4173618 4253276
14062D253276K2721j29048K36083M9849m35177L74744m07448P7304j40192k54920
$$ 4253276 4275997 4146949 4383032 4432881 3997704 4372448 3965000 4042304 3902112 3647192
14052C647192L64974l84742L45362m23150K4571J8429J59315l61818k20760M67445
$$ 3647192 4012166 3627424 3972786 3549636 3574207 3592636 3751951 3390133 3169373 3636818
14042C636818j29444j37511m9821m1976l7762M5032j9607k72770j56406M40287
$$ 3636818 3507374 3369863 3320042 3278066 3240304 3285336 3265729 2992959 2836553 3276840
14032C276840k54938K35224l7232J84425k82044l26533J57561l67835M7578J52500
$$ 3276840 3021902 3257126 3219894 3404319 3122275 2795742 2953303 2585468 2633046 2785546
14022B785546k33995J67871Q7960j94591N9017J48217j1825k10241K16735l05374
$$ 2785546 2551551 2719422 2807382 2612791 2671808 2820025 2808200 2597959 2814694 2509320
14012B509320m8758L07276m9472k08207J45357l29423N47802l82328k72621J24975
$$ 2509320 2460562 2767838 2718366 2510159 2655516 2326093 2873895 2491567 2218946 2343921
14002B343921o8397J48304l51313J45550J35765k27854j07171J99856k35509K07771
$$ 2343921 2275524 2423828 2072515 2218065 2353830 2125976 2018805 2218661 1983152 2190923
13992B190923K36006k29194O07971O12954K199473P727377K0413618R034481j7226859
$$ 2190923 2426929 2197735 2805706 3418660 5618133 13345510 33759128 42793609 25566750
13983B5566750j1284604n575615k337916j471659p08355m09543l60224M9842o69173
$$ 25566750 14282146 8706531 6368615 4896956 4188601 3779058 3418834 3468676 2799503
13974B799503J5345j66835J74274k20535K05062k48462q1293m7780l6464j39293
$$ 2799503 2814848 2648013 2822287 2601752 2806814 2558352 2477059 2429279 2392815 2253522
13964B253522K27869m84075J43854k87873N01540o187j10733q3615M46658p49083
$$ 2253522 2481391 1997316 2141170 1853297 2354837 2348650 2237917 2154302 2600960 1851877
13954A851877K43673K150l80134k2728M54257N3104k7657j0958o18067N93399
$$ 1851877 2095550 2097700 1717566 1694838 2149095 2202199 2174542 2163584 1545517 2138916
13944B138916K3767n00815L95901j20478m9878J49027l31480K49256j61040j00693
$$ 2138916 2162683 1661868 2057769 1937291 1887413 2036440 1704960 1954216 1793176 1692483
13934A692483k62864K79414J28039P1762l5561k70266M5434j93903L48982m50889
$$ 1692483 1429619 1709033 1837072 1908834 1873273 1603007 1648441 1454538 1803520 1352631
13924A352631K28083o4679j01924K958L21743r0899j1085l23338K67740J13633
$$ 1352631 1580714 1516035 1414111 1417069 1738812 1647913 1636828 1313490 1581230 1694863
13914A694863j12972l61216N64318k78492k29552j29763M82602p2522n1602j12805
$$ 1694863 1581891 1220675 1784993 1506501 1276949 1147186 1629788 1557266 1505664 1392859
13904A392859j27753j9788j8366L98024j92026m8659L02959l51108K40672p18635
$$ 1392859 1265106 1245318 1226952 1624976 1432950 1384291 1687250 1336142 1576814 858179
13894H58179P96272l20081K42771m20285j76412L00764J02027k01309K24367P0579
$$ 858179 1654451 1334370 1577141 1156856 980444 1281208 1383235 1181926 1406293 1476872
13884A476872k55134R9404k00554N346L01407Q4822p9406m7774l7270P3897j01434
$$ 1476872 1221738 1321142 1120588 1125934 1427341 1512163 1432757 1384983 1347713 1421610 1320176
13873A320176j44826Q9339J40361j29824o6371R8320L4013j3013r636j15959j11709
$$ 1320176 1175350 1264689 1405050 1275226 1208855 1307175 1341188 1328175 1318539 1202580 1090871
13862A090871j49752l7771J15546O3046K67400l58305M19257l61630L76321m94615
$$ 1090871 941119 903348 1018894 1081940 1349340 991035 1410292 1048662 1424983 930368
13852I30368K43493j32967M5284K60511m92154K70382L55527l51193o3149k59469
$$ 930368 1173861 1040894 1086178 1346689 854535 1124917 1480444 1129251 1066102 806633
13842H06633J24503K38894l2549l83466J21550L0275L89971m71443K54946l53555
$$ 806633 931136 1170030 1137481 754015 875565 905840 1295811 824368 1079314 725759
13832G25759M38209r2041J81531m04032K49245l46372o4143J49536O0561j77799
$$ 725759 1163968 1071927 1253458 849426 1098671 752299 688156 837692 898253 720454
13822G20454L27383j39483J47958K3667j73238j11052J15864l4282L3869j59012
$$ 720454 1047837 908354 1056312 1079979 906741 795689 911553 877271 911140 752128
13812G52128O2305N2196L74275n02413M2871Q3040P4185j18864J28383J434k29885
$$ 752128 814433 866629 1240904 738491 781362 864402 938587 819723 948106 949540 719655
13801G19655J69287O4821k66423J47058l17107n5342N80148n3295l26692L60308
$$ 719655 888942 953763 687340 834398 517291 461949 1042097 988802 662110 1022418
13791A022418k41224j11910J54075K01959l98848k89271O82275j11816J26559
$$ 1022418 781194 669284 823359 1025318 626470 337199 1019474 907658 1034217
13782A034217P5072m21963P3999j63209J09345P9352K60985k31263k5076j22871
$$ 1034217 1109289 687326 761325 598116 707461 786813 1047798 816535 791459 668588
13772F68588K72537o2789m28762J86620J58522n3785l3156j78958K29893R3257
$$ 668588 941125 878336 449574 636194 794716 740931 707775 528817 758710 851967
13762H51967j34691l998B38637O78727k12574K48090l89374M92322m11874K59660
$$ 851967 717276 713278 238637 917364 704790 952880 563506 1055828 643954 903614
13752I03614k68587P8299j20323K04124k928l90413L54911C66883J64475K06298
$$ 903614 635027 713326 593003 797127 794199 403786 758697 366883 531358 737656
13742G37656J10699j69761j53043j32868J14278J5626j7324J30354k06966J72689
$$ 737656 848355 678594 525551 392683 506961 522587 505263 635617 428651 601340
13732F01340K15285k44052O2029k23075L06054l8214P7138O2681j63274k325r3865
$$ 601340 816625 572573 634602 411527 717581 679367 756505 819186 655912 653587 559722
13721E59722J56513C27366l1418N00261l75450K06513O5756J53012C45558K28896
$$ 559722 716235 327366 295948 796209 420759 627272 693028 846040 345558 574454
13711E74454L6261q5250J36421k24768A35625N35707l01624J28593K97677C39974
$$ 574454 610715 525465 661886 437118 135625 671332 369708 498301 795978 339974
13700F01673j2681B74587L12579j25760K68561m0637j16369J4307j17357j679
$$ 601673 588992 274587 587166 461406 729967 689330 572961 587268 469911 468232
13690D68232J07736J08363C36992D9184N81754j10809P9425k15289j17082K37589
$$ 468232 575968 684331 336992 49184 630938 520129 599554 384265 267183 504772
13680E04772r596N0687K5453K1917O1453l7213k81501k4702L47346B70186J09100
$$ 504772 495176 545863 571316 593233 654686 617473 335972 311270 658616 270186 379286
13669C79286K8137A15886L4114P66362l92014A63556K81122J41310j26107j91817
$$ 379286 407423 115886 150000 916362 524348 163556 444678 585988 459881 268064
13659B68064L44494A15299L90439A53987J20379m3255l9169N08856R4717l65013
$$ 268064 612558 115299 505738 153987 274366 231111 191942 700798 795515 430502
13649D30502J41568K9171j4866k24648J42355L15247l14739a84206F72095j9667
$$ 430502 572070 601241 586375 361727 504082 819329 504590 -184206 672095 652428
13639F52428B87181J81227j71185P4337L04951C32293M7073K34721j86964j33662
$$ 652428 287181 468408 297223 371560 676511 332293 379366 614087 427123 293461
13629B93461m1533K36195j2324k19688J84157p2302A26262N32365j11581k02440
$$ 293461 251928 488123 475799 256111 440268 367966 126262 658627 547046 344606
13619C44606A25709L10741k04914J73713N2313A89065g4534B14492L66214j56118
$$ 344606 125709 436450 231536 405249 457562 189065 -74534 214492 580706 424588
13609D24588A53773K84739j47746M7041K2113l3301r7965K9822n0778L83181j92615
$$ 424588 153773 438512 290766 337807 359920 326619 228654 258476 207698 590879 398264
13598C98264j98251E3656L89507D1676J81405M28400k82529O5516n0967j68330
$$ 398264 200013 53656 443163 41676 223081 651481 368952 434468 383501 215171
13588B15171J76828L567Q8420k29833k3279b74653E81119k20026j675l3587K84829
$$ 215171 391999 395566 483986 254153 230874 -274653 581119 361093 359418 325831 610660
13577F10660p2086k49786j24842J25748K52560B17769J40769b0941n9582F00611
$$ 610660 538574 288788 163946 289694 542254 217769 358538 -20941 -80523 600611
13566B55986L37897k51432K97378A18999K24552K76814A55726L86858A32419L10085
$$ 255986 593883 342451 639829 118999 343551 620365 155726 542584 132419 442504
13556D42504j56154J86901q1352e8142F02471j00287A97857J70369L52013C48735
$$ 442504 286350 473251 391899 -58142 602471 502184 197857 368226 720239 348735
13545A88799K99772j31029A78149N08599l06243K1481A0491e365D61357B23246
$$ 188799 488571 357542 178149 686748 380505 401986 10491 -5365 461357 223246
13534B41685O9999m4421j125I0458J2361L64637J76497B39946J96228o9576j24921
$$ 241685 311684 267263 266138 90458 102819 467456 643953 239946 436174 366598 241677
13523B41677K44407p3645m7746L43986B48411K53775A61672L52243j48228k9670
$$ 241677 486084 412439 364693 708679 248411 502186 161672 513915 365687 336017
13513C36017A01402O5957M03338B51721m0452J75354j88072o9683K09629O0115
$$ 336017 101402 167359 570697 251721 211269 386623 198551 128868 338497 398612
13503C98612E0127Q6790K94018A93001R82F8237M39149A97482M7251Q0745G4831
$$ 398612 50127 136917 430935 193001 193983 68237 507386 197482 244733 325478 74831
13491E06760j66128p6574j10121K56212I0494J71805J95201k19038K18480j36787
$$ 506760 340632 264058 153937 410149 90494 262299 457500 238462 456942 320155
13481C20155a7382A71716K37936j91426O7915J60057A37292l2115Q0902H3166
$$ 320155 -17382 171716 409652 218226 286141 446198 137292 105177 186079 83166
13470A39856J08405o6288J99788j54100K91929j72567A32699K6718L4541L00670
$$ 139856 248261 181973 381761 227661 519590 347023 132699 159417 193958 494628
13460D94628j94142A34701K10588E5458M40064j23923A25528g1886B26581G0367
$$ 494628 300486 134701 345289 55458 495522 371599 125528 -71886 226581 70367
13449H1288N9562M3570G7865j9015J73957i2921A89685G8446L04639A34847K46624
$$ 81288 140850 184420 77865 58850 232807 -92921 189685 78446 383085 134847 381471
13438C81471q8002o8028O3395N3240A27946K2937J05378O6536O8827G1035J54439
$$ 381471 293469 225441 288836 342076 127946 150883 256261 322797 391624 71035 225474
13427B25474n7090c4114C33518r4275J46241g282B76946p0579A00761L7814R6299
$$ 225474 168384 -34114 333518 239243 385484 -7282 276946 206367 100761 138575 234874
13416B34874J36003j76433b7536l1374B03128j4210K63674c0779B60010b99533
$$ 234874 370877 194444 -27536 -58910 203128 188918 452592 -30779 260010 -299533
13405B08673j5223L60484A58106m9460B1234J59100E6217K45731h0142C66486
$$ 208673 193450 553934 158106 108646 21234 180334 56217 301948 -80142 366486
13394A53201J36149a39763D01926H3646c3587I765L42658p5371E6696K58525j12854
$$ 153201 289350 -139763 401926 83646 -33587 9765 352423 277052 56696 315221 202367
13383B02367J31096m2395J80532k33461E0141M93991k12555j07106J08719J78343
$$ 202367 333463 291068 471600 238139 50141 544132 331577 224471 333190 511533
13373E11533H9723L9987E9363N80485A08626L60533A7830K15372K18570j88628
$$ 511533 89723 129710 59363 639848 108626 469159 17830 233202 451772 263144
13363B63144M027j02235O1360b1965C78056K964C6304J1699K60343b6570C13016
$$ 263144 267171 164936 226296 -21965 378056 381020 36304 48003 308346 -26570 313016
13351a0262q6372A63321J30045R5080A28118N22622B82192o5536J91326r922j88308
$$ -10262 -96634 163321 293366 388446 128118 650740 282192 216656 407982 398060 209752
13340B09752L73081A30028L57468J19983A05010L24016j6401A97301r4338J2862
$$ 209752 582833 130028 487496 607479 105010 429026 412625 197301 102963 115825
13330A15825L09040j10998P8157a1845C06147j34247m6380K04475L31409H6027
$$ 115825 424865 313867 392024 -11845 306147 171900 125520 329995 661404 86027
13319C16560Q8995m8031P8146a0481C47223r3947B4009M46670C1776J52972J80175
$$ 316560 405555 357524 435670 -10481 347223 253276 24009 470679 31776 184748 364923
13308C64923b3048C24776j21021K82319A71683J26084P9363j00325J94100C8413
$$ 364923 -23048 324776 203755 486074 171683 297767 377130 276805 470905 38413
13297a61133E2611Q5292L1282R6122j1331b5555A11408C375N97192k41183r1008
$$ -161133 52611 137903 169185 265307 253976 -25555 111408 3375 600567 359384 268376
13286B68376G4199L48839j75414O5969a15025C10759a29119E9940a43727d1633
$$ 268376 74199 423038 247624 313593 -115025 310759 -129119 59940 -143727 -41633
13275c87606A00890l351C1168J5735L87M23731K9524A48730J73768e6873I8331
$$ -387606 100890 97539 31168 46903 47290 471021 500545 148730 322498 -56873 98331
13263B07073Q8802c1633C86222a11212B30758G066N8046c0983J914F2159J72035
$$ 207073 295875 -31633 386222 -111212 230758 7066 65112 -30983 -29069 62159 234194
13252B34194b44005a3386k00954B51987j04332b34112b561l7116G8707j5419O4183
$$ 234194 -244005 -13386 -214340 251987 147655 -234112 -2561 -39677 78707 63288 127471
13241A27471N1944a65594B94483q8299K17469c1853C39486a05064b5533B91956
$$ 127471 179415 -165594 294483 206184 423653 -31853 339486 -105064 -25533 291956
13230a32734B68211G3888J02423K53900a62624B25307g4944B80588A6805a36586
$$ -132734 268211 73888 176311 430211 -162624 225307 -74944 280588 16805 -136586
13219B78806K76133H4344J3058K074l9153Q8236o256a32079G5505a70590C79452
$$ 278806 554939 84344 97402 99476 60323 148559 142303 -132079 75505 -170590 379452
13207b10587A64092a3531C37292a42466C9708a7365B35976G6065Q3055J26677
$$ -210587 164092 -13531 337292 -142466 39708 -17365 235976 76065 159120 285797
13197B85797M426n4264C7272Q9540K42243j29988D9226a98242A14025Q1477I3314
$$ 285797 290223 235959 37272 126812 369055 239067 49226 -198242 114025 195502 93314
13185C13478H0783L9869K16513F7335K28286F6526k3347M57598D5841J00897a06593
$$ 313478 80783 120652 337165 67335 295621 66526 43179 500777 45841 146738 -106593
13173i8640A46608a11700C96280C3238b08940Q2289F2761a73854E39178a1697
$$ -98640 146608 -111700 396280 33238 -208940 -126651 62761 -173854 539178 -11697
13162g1320K6998B06290c9447A69197K12885A35110J28905A19804J3727c4646
$$ -71320 -44322 206290 -39447 169197 382082 135110 264015 119804 133531 -34646
13151C1524L05832H421b59495J09826B6175K14238B8827L15647b94041A59373
$$ 31524 337356 8421 -259495 -149669 26175 240413 28827 344474 -294041 159373
13140B7646b03252I4159J46226L07571j99288A0921f0175P429F7305L58187a64077
$$ 27646 -203252 94159 240385 547956 348668 10921 -60175 -52746 67305 425492 -164077
13128b3165B99923A01258m3642K75409n2874G3683K0979a7745A58783N6241J12727
$$ -23165 299923 101258 57616 333025 280151 73683 94662 -17745 158783 215024 327751
13117C27751B5884J28183R3471A9199K13252j05920K24008q758H5905M0994L3752
$$ 327751 25884 154067 247538 19199 232451 126531 350539 341781 85905 126899 160651
13106A60651K13215A60514m4100b26549c1774J4503C19860P308A28432D888a6650
$$ 160651 373866 160514 116414 -226549 -31774 -17271 319860 327168 128432 4888 -16650
13094a09952B90634N255n9471J18450C8103J46260g9346A12536P8424E1847d5007
$$ -109952 290634 295889 236418 354868 38103 184363 -79346 112536 190960 51847 -45007
13082b84955O9934P5562C98267A75015b16483I2964C1881J69760Q2822M1900A47402
$$ -284955 -215021 -139459 398267 175015 -216483 92964 31881 201641 284463 326363 147402
13070I1419b6253C73260o062j46388C3398a09840A70311K06771a87454d159A93694
$$ 91419 -26253 373260 367198 220810 33398 -109840 170311 377082 -187454 -4159 193694
13058E6068O21058E5555b12904C19451a77457G510N2258b15934I0845J5121D8583
$$ 56068 677126 55555 -212904 319451 -177457 7510 59768 -215934 90845 105966 48583
13046A38192o6531Q4268R4787l7335h0885c307m729k14114C11206j23000m6336
$$ 138192 71661 155929 250716 213381 -80885 -3307 -8036 -222150 311206 188206 141870
13035A41870c7734A505J92454D9336K3750a24238H9287h131l980B99274p9253
$$ 141870 -37734 1505 193959 49336 73086 -124238 89287 -8131 -12111 299274 220021
13024B20021a61074c9882D80698B07564q1632N1996R1138q71f4562A11538B9457
$$ 220021 -161074 -39882 480698 207564 125932 177928 269066 268195 -64562 111538 29457
13012C27505C8393J04778K4283J45517a23908D19953i7231A85445q2617J13785
$$ 327505 38393 143171 167454 312971 -123908 419953 -97231 185445 102828 216613
13002B16613a21339r698B76323j27918b7292k16296C3637P4137a40056B929O9043
$$ 216613 -121339 -131037 276323 148405 -27292 -243588 33637 107774 -140056 2929 71972
12991G1972k1981K80052b0360m3530d795p8405j66239A70769g5286E1814a68376
$$ 71972 49991 330043 -20360 -63890 -4795 -83200 -249439 170769 -75286 51814 -168376
12979d3470A69692a18886k60920A06502g3703k43912A07872n1909J53182a585
$$ -43470 169692 -118886 -379806 106502 -73703 -317615 107872 55963 209145 -1585
12968B51491a60825b3867E8064L9897J62056a268l189I1756g7669l5513A19096
$$ 251491 -160825 -23867 58064 97961 260017 -1268 -4457 91756 -77669 -113182 119096
12956a36345d1698k57360A98503B6462K8608L1629d72841F23P025c10597i5244
$$ -136345 -41698 -299058 198503 26462 55070 86699 -472841 623 7648 -310597 -95244
12944d75177A54858k1470C0509J32323J21093h7814A67662H2569e1262j69672
$$ -475177 154858 133388 30509 162832 283925 -87814 167662 82569 -51262 -220934
12934b20934A73279a24516A58162m4599A0830P7550b80115I7921g4336B76643
$$ -220934 173279 -124516 158162 113563 10830 88380 -280115 97921 -74336 276643
12923A7437P0804J75724b95415B85046j30918b68948B5163c63679a5166k12949
$$ 17437 88241 263965 -295415 285046 154128 -268948 25163 -363679 -15166 -228115
12913b28115E46257B37249c87204a59264B68760C7183q602L45364b23928G814
$$ -228115 546257 237249 -387204 -159264 268760 37183 28581 373945 -223928 7814
12902A5043J03593a64989F2129O6498L6723B4051J5015J26377a17127D63186k01772
$$ 15043 118636 -164989 62129 128627 165350 24051 39066 165443 -117127 463186 261414
12891B61414A08885a66374q1853E63175A73529f6214A72097g8189p7171o747A7776
$$ 261414 108885 -166374 -248227 563175 173529 -66214 172097 -78189 -155360 -162107 17776
12879B57283F7859i1686C1958f1541a5674D6854c22933I7773Q2336K65130b71334
$$ 257283 67859 -91686 31958 -61541 -15674 46854 -322933 97773 180109 445239 -271334
12867A44812F9251P3545F5351b73190A02776e4152B31327K02608d4949I2087j1480
$$ 144812 69251 142796 65351 -273190 102776 -54152 231327 433935 -44949 92087 80607
12856H0607b8265A34580N86716a36582B51712g7238e962r6186b4805B68458C1450
$$ 80607 -28265 134580 721296 -136582 251712 -77238 -5962 -102148 -24805 268458 31450
12844B9943J07218e2502B21770D745a5610A51780N6629F1442k3529h3454j8998
$$ 29943 137161 -52502 221770 4745 -15610 151780 208409 61442 37913 -83454 -102452
12833a02452l18342a15349o8342A09824e366I9852b7790a0294B32885g5265B44956
$$ -102452 -420794 -115349 -183691 109824 -5366 99852 -27790 -10294 232885 -75265 244956
12821d21966B21285G078b2746A49719p2033b49645I5194a56016A22848L9156k7369
$$ -421966 221285 7078 -22746 149719 77686 -249645 95194 -156016 122848 162004 134635
12810A34635D240M7985M7891l8129a17693A02787a88711A55998K16525A19750
$$ 134635 4240 52225 100116 61987 -117693 102787 -188711 155998 372523 119750
12799h354E3207Q0013f1651k3391j2660I2143c26095D6265e6504r2198j5217A51161
$$ -8354 53207 133220 -61651 -85042 -97702 92143 -326095 46265 -56504 -148702 -163919 151161
12786C08138a15529j04866A38728G620a26032A88463J2405G0761k2866L15101
$$ 308138 -115529 -220395 138728 7620 -126032 188463 200868 70761 47895 362996
12776C62996a3039A76289a35819A20864J69594i2223F5860a62228p7811J07855
$$ 362996 -13039 176289 -135819 120864 290458 -92223 65860 -162228 -240039 -132184
12766a32184B02160J45077A20100b7943A45632i3277c3771D3166i3003H5954J91386
$$ -132184 202160 347237 120100 -27943 145632 -93277 -33771 43166 -93003 85954 277340
12755B77340a35374c0876A95855a12699A5854K7290j1980b04440m4272g7263c104
$$ 277340 -135374 -30876 195855 -112699 15854 43144 31164 -204440 -248712 -77263 -3104
12743a29611D50153B03076c093j5834H4818c07820B08630a23289H5753J0711k7811
$$ -129611 450153 203076 -3093 -18927 84818 -307820 208630 -123289 85753 96464 68653
12732F8653K52064j08398I5092N2195d2778k173A96534b02022A09659B1941L51865
$$ 68653 320717 212319 95092 147287 -42778 -44951 196534 -202022 109659 21941 373806
12721C73806a78614F0616K52451d6453j0447J1660k30237B07387K5032J35844
$$ 373806 -178614 60616 313067 -46453 -56900 -45240 -275477 207387 232419 368263
12711C68263c92753c9525o0655C54645G3613k6801L29234q2605A35173J91542
$$ 368263 -392753 -39525 -100180 354645 73613 46812 376046 293441 135173 326715
12701C26715A45103F8332Q8861j759j3324Q6628a15349A91620a47360B10360p3123
$$ 326715 145103 68332 157193 155434 142110 228738 -115349 191620 -147360 210360 137237
12690A37237a10345A17760C2470K71458b6950k86288g1772j5964c0631h020B5408
$$ 137237 -110345 117760 32470 303928 -26950 -313238 -71772 -87736 -30631 -8020 25408
12678E34449I162e959D20985A83186R3326d7406B33391I4105m5577j9444i6962
$$ 534449 9162 -5959 420985 183186 276512 -47406 233391 94105 48528 29084 -96962
12666B01309a75374I9096g3700A96185p7696M0998R66P3018k3769J06152B2111
$$ 201309 -175374 99096 -73700 196185 118489 159487 160453 233471 209702 315854 22111
12654B07280J28839j47088K76026I5308O5407n2847p1a3725A18598R9833b6917
$$ 207280 336119 189031 465057 95308 160715 107868 107797 -13725 118598 218431 -26917
12642e03474B80890B2993a17591A02662J24153j02437l2256a44536A7190K35850
$$ -503474 280890 22993 -117591 102662 226815 124378 92122 -144536 17190 253040
12632B53040e761A71648J8147e7982B20023d5845B66004A46K2751K61842E7666
$$ 253040 -5761 171648 189795 -57982 220023 -45845 266004 146 22897 284739 57666
12620B94281A17311J45304k1376M6075a5358I927J97757B898K53123b59588g8882
$$ 294281 117311 262615 241239 287314 -15358 9927 207684 2898 256021 -259588 -78882
12608A68693D449i9243c8613G289K89433d2956C159M6973P432B038J06711J53723
$$ 168693 4449 -99243 -38613 7289 296722 -42956 3159 50132 57564 2038 108749 262472
12596B62472a4116j46632B9629i757H7745M9775o7742a39119A82568m2109b9872
$$ 262472 -14116 -160748 29629 -9757 87745 137520 69778 -139119 182568 140459 -29872
12584A85135j4626a06552C6626h4897r0584A41343K0518p5101j9851J77055i0429
$$ 185135 170509 -106552 36626 -84897 -175481 141343 161861 86760 66909 243964 -90429
12572h5040j4777a0535A32016j2455J83755b0340A65537J86399A37799D1032c50011
$$ -85040 -99817 -10535 132016 119561 303316 -20340 165537 351936 137799 41032 -350011
12560a50024k62873a45790A65295b73193J8555O6651A04085b75678A83448D5235
$$ -150024 -412897 -145790 165295 -273193 -254638 -187987 104085 -275678 183448 45235
12549e2439E1633a84726G6998g5822k4826B65588J60737g4550a9497j17756C8939
$$ -52439 51633 -184726 76998 -75822 -100648 265588 426325 -74550 -19497 -137253 38939
12537h0033A51025l4723a57438I4541L5232a67253P444k2030C96516i1843m8992
$$ -80033 151025 116302 -157438 94541 129773 -167253 -159809 -181839 396516 -91843 -140835
12526a40835I3394b59833p1878C5997P3115a17063A32784a12242m584C95033G0834
$$ -140835 93394 -259833 -331711 35997 109112 -117063 132784 -112242 -116826 395033 70834
12514d4459k41161a31209C5437A3440g2061b2205A55830B8826a5245A39363C3996
$$ -44459 -285620 -131209 35437 13440 -72061 -22205 155830 28826 -15245 139363 33996
12502b46933B17647i9787B51487b01808f7162j5469N132l0111o4081C4307J12586
$$ -246933 217647 -99787 251487 -201808 -67162 -82631 -77499 -107610 -171691 34307 146893
12491A46893F7797b7935B7735J63543p3225K00757n9643a14637B92247d0790l27545
$$ 146893 67797 -27935 27735 191278 118053 318810 259167 -114637 292247 -40790 -368335
12480c68335J60249J03221j88497O545k8668a05285B48232c85525B71538d2823
$$ -368335 -208086 -104865 -293362 -286817 -315485 -105285 248232 -385525 271538 -42823
12469d410H6289j2605g0839B41352a70727b8147n5890G8390N0120b21032G0515
$$ -4410 86289 73684 -70839 241352 -170727 -28147 -84037 78390 128510 -221032 70515
12457b7410B9367K1728O7310i4478C25219a45859G1342i5357o1692A49112b45111
$$ -27410 29367 51095 118405 -94478 325219 -145859 71342 -95357 -157049 149112 -245111
12445a1403l10781A4141c07327L4823N0951a0690C51209D4492L4127i7489A86145
$$ -11403 -322184 14141 -307327 -272504 -221553 -10690 351209 44492 78619 -97489 186145
12433b08666Q2405k07734A90871p034G0754a91345g5475K093A79227E7762J16876
$$ -208666 -126261 -333995 190871 183837 70754 -191345 -75475 -73382 179227 57762 174638
12422A74638b36259A65165h0195C4409L22648N3735j37878j28561n3451b13859
$$ 174638 -236259 165165 -80195 34409 357057 410792 272914 144353 90902 -213859
12411B36741f436k81154I3024a68023A74184l8087M551a04372D3010M2817J25285
$$ 236741 -6436 -287590 93024 -168023 174184 136097 140648 -104372 43010 85827 211112
12400B11112a36797j45193C8886f1027o3999n695C46770c59811b6258F5032f0239
$$ 211112 -136797 -281990 38886 -61027 -125026 -130721 346770 -359811 -26258 65032 -60239
12388B91085h0744A14094a62884B39957a77700B7425K02971a13957B77201R4443
$$ 291085 -80744 114094 -162884 239957 -177700 27425 230396 -113957 277201 371644
12378C71644a52686k512A79437h9092r8420j6306A62871a70802l458A13218L11421
$$ 371644 -152686 -155198 179437 -89092 -187512 -203818 162871 -170802 -174260 113218 424639
12367D24639A85875Q4188a71261j84486a5390B60086E9415J64412H2968a22868
$$ 424639 185875 270063 -171261 -355747 -15390 260086 59415 223827 82968 -122868
12356G2654O7642a15446q4587R6604A72164i4670B9778a70472d6848D8881c07582
$$ 72654 140296 -115446 -200033 -103429 172164 -94670 29778 -170472 -46848 48881 -307582
12344I9297J94067G100g1660o7698J0057C72446A50895J46245b25019k20968e550
$$ 99297 293364 7100 -71660 -139358 -129301 372446 150895 297140 -225019 -445987 -5550
12332g2146l350m9966L7577J5490b3471B30339h7142A9865b81362G6182P2634
$$ -72146 -75496 -125462 -87885 -72395 -23471 230339 -87142 19865 -281362 76182 148816
12321A48816Q4341d932q4289o6643d1662j01864H3387i9181a3201j83416B72103
$$ 148816 233157 -4932 -89221 -155864 -41662 -143526 83387 -99181 -13201 -196617 272103
12309C04321A12757J57209O0180b25379G6060J34601f6055k31020b5580A96101
$$ 304321 112757 269966 330146 -225379 76060 210661 -66055 -297075 -25580 196101
12298a40127B6268g9622D6799a96395m6690P7474A09584a66849A0185K593M6794
$$ -140127 26268 -79622 46799 -196395 -243085 -165611 109584 -166849 10185 12778 59572
12287E9572i3331F6484b3382m542C8057a14929C17851j87G3578l017Q8360a24924
$$ 59572 -93331 66484 -23382 -27924 38057 -114929 317851 317664 73578 70561 158921 -124924
12274e2149C85243A57759e1276B75944F3829e2043A79829J9161c3321j0539D64773
$$ -52149 385243 157759 -51276 275944 63829 -52043 179829 198990 -33321 -43860 464773
12262C96099a17117I2437C6694b2414A52811J80874o3020a9266B65758R8274i8438
$$ 396099 -117117 92437 36694 -22414 152811 333685 270665 -19266 265758 364032 -98438
12250d6076j13703O7400F0857M3683J50579m3821a81657e3642J7518A18876J3654
$$ -46076 -159779 -92379 60857 104540 255119 211298 -181657 -53642 -36124 118876 132530
12239A32530D8336a3126A80129b5100D56880a12644A69863b6109p2833R788o0969
$$ 132530 48336 -13126 180129 -25100 456880 -112644 169863 -26109 -98942 -89154 -150123
12228a50123B65442K6505j20802M42Q8905a9080A26653J16556l7808J21199j16546
$$ -150123 265442 291947 171145 171587 260492 -19080 126653 243209 205401 326600 210054
12217B10054J19977Q4435k05213b00056B8160b12873A02601J91558j35446K02557
$$ 210054 330031 414466 209253 -200056 28160 -212873 102601 294159 158713 361270
12207C61270g9412B53352R0905b3598D5556J78225j02114R8311K77614j68493
$$ 361270 -79412 253352 344257 -23598 45556 223781 121667 219978 497592 329099
12197C29099j08227q1300c9016C10624k6228A29404M1665C6729K63975n2849K23729
$$ 329099 220872 139572 -39016 310624 284396 129404 171069 36729 300704 247855 471584
12186D71584A8277a28466d9765A47261P2816n8002J76539F2527k4133L4669d09304
$$ 471584 18277 -128466 -49765 147261 220077 162075 338614 62527 38394 73063 -409304
12174C7094a10197B89617A0259M4006M4042C8083J36990E7570K12543M4857A11681
$$ 37094 -110197 289617 10259 54265 98307 38083 175073 57570 270113 314970 111681
12162A264K45243A15843Q8079j4681J62894c25780d2677F0335a76361f9069n4040
$$ 1264 246507 115843 203922 189241 352135 -325780 -42677 60335 -176361 -69069 -123109
12151a23109I4462J83772b6272C6544Q8682K17673A14462f7631A28367A2211J17728
$$ -123109 94462 278234 -26272 36544 125226 342899 114462 -67631 128367 12211 129939
12140A29939J23490n962m2744f4375j5840A46622l7790P5555a36552k02024J05839
$$ 129939 253429 247467 204723 -64375 -80215 146622 108832 184387 -136552 -338576 -232737
12129b32737A00510A6136L19589A34523C8360J61668r9786D0073a28158N0277
$$ -232737 100510 16136 335725 134523 38360 200028 100242 40073 -128158 -77881
12119g7881B44659r8593E9776K9441a27778A78675a52730n6034D0477J00975b20197
$$ -77881 244659 146066 59776 89217 -127778 178675 -152730 -208764 40477 141452 -220197
12107A92842h3650A36490l1492c02581K3180I798e4112I4387c00442D211R3451
$$ 192842 -83650 136490 104998 -302581 -279401 9798 -54112 94387 -300442 4211 97662
12096I7662L515K75198F9476f2683G4545k5638g7867L1171C851a08718K7669r3996
$$ 97662 101177 376375 69476 -62683 74545 48907 -77867 -46696 3851 -108718 -81049 -175045
12084a75045A84567m153j9727c07416J41719A84312R9898N0946Q60603M74671
$$ -175045 184567 180414 160687 -307416 -165697 184312 284210 335156 1195759 1670430
12074A670430D00842p8593e5056B11491a27473H8253R3130B7016a56994k05483
$$ 1670430 400842 322249 -55056 211491 -127473 88253 181383 27016 -156994 -362477
12064c62477a02570B45965F6492J20287A25M22095b22966A26184f0882B92209
$$ -362477 -102570 245965 66492 186779 125 422220 -222966 126184 -60882 292209
12053a61676o8352B04874b73595a01930H4479b0910E6250R005a89544J5829I9739
$$ -161676 -230028 204874 -273595 -101930 84479 -20910 56250 65255 -189544 -173715 99739
12041c55483A26628b38231h2346a3299l0209A34349a92743g5094o8086E076h7109
$$ -355483 126628 -238231 -82346 -13299 -43508 134349 -192743 -75094 -143180 5076 -87109
12029f6619f148j78532N6865f3809B01662b97887J18659g3041o3459a2849n69
$$ -66619 -6148 -184680 -127815 -63809 201662 -297887 -179228 -73041 -136500 -12849 -13418
12018a3418r4690n0120A67237m8097R0458a32518A12192J4000J57730O1172g3777
$$ -13418 -108108 -158228 167237 119140 209598 -132518 112192 126192 283922 345094 -73777
12006B2528g7039C16636a61330J5553N025C6273e6528C70741j38899a61338B10756
$$ 22528 -77039 316636 -161330 -145777 -140752 36273 -56528 370741 231842 -161338 210756
11994b78394G8149c3001I7979e0020j82729M5290A66637a06777H7117a34573N6350
$$ -278394 78149 -33001 97979 -50020 -232749 -187459 166637 -106777 87117 -134573 -78223
11983g8223j12573I8056d5877A56789d6916q4535D6405d4443G5566K41087H9752
$$ -78223 -190796 98056 -45877 156789 -46916 -131451 46405 -44443 75566 316653 89752
11971B70112a93760L7788O2427D8906b53108c8072I4179J7899A2031b90944C615
$$ 270112 -193760 -155972 -93545 48906 -253108 -38072 94179 112078 12031 -290944 3615
11959c3320D2238a09143J3921B05809b7225A20023f0755e719A08240O955O8583
$$ -33320 42238 -109143 -95222 205809 -27225 120023 -60755 -5719 108240 115195 183778
11948A83778P5467b86572d4032A02597d24924A7419c1035H7831b27752o6905D5478
$$ 183778 259245 -286572 -44032 102597 -424924 17419 -31035 87831 -227752 -294657 45478
11936F0257c35356J32866f5480A37767c19478C2845L74479b15825j44017f1359
$$ 60257 -335356 -202490 -65480 137767 -319478 32845 407324 -215825 -359842 -61359
11925c829H7337h4502j19112F230b31231j08628D5690d61790B78833E3589a69219
$$ -3829 87337 -84502 -203614 6230 -231231 -339859 45690 -461790 278833 53589 -169219
11913i7180q1607M8209m3698F3114K03697c65270D102J55151G8624a15893B70165
$$ -97180 -178787 -130578 -174276 63114 266811 -365270 4102 159253 78624 -115893 270165
11901b67059I581J91498r0932b06426K4626q3554G6653a4091j25663B40410a2858
$$ -267059 9581 201079 110147 -206426 -181800 -265354 76653 -14091 -139754 240410 -12858
11889C0240a6361H0288L2693B6286a65414a4557j47763A5123a71133l3573c9142
$$ 30240 -16361 80288 112981 26286 -165414 -14557 -162320 15123 -171133 -204706 -39142
11877f7983a4383D2093c3501j0514o0359H5117a38369E1183d8028j50012a6044
$$ -67983 -14383 42093 -33501 -44015 -104374 85117 -138369 51183 -48028 -198040 -16044
11865A85086c53754a75459f4420j22783A46535J77811A21610K6129o2283e9756
$$ 185086 -353754 -175459 -64420 -187203 146535 324346 121610 147739 85456 -59756
11854A98530r427D1373b13314a0862j86015A41834C3683J76397a785I7555a40358
$$ 198530 189103 41373 -213314 -10862 -196877 141834 33683 210080 -1785 97555 -140358
11842e8707A024g5950H2310M09431b03387j30384A5311a94868A38123a37527F13
$$ -58707 1024 -75950 82310 491741 -203387 -333771 15311 -194868 138123 -137527 613
11830d4419K0513B8316f7313m4612p1014D6573L4694d30266J75409g0374B6639
$$ -44419 -23906 28316 -67313 -111925 -182939 46573 81267 -430266 -254857 -70374 26639
11818e1136A03546b28962B33155I3288b51128I0333N1910b48474P1010h5863A36584
$$ -51136 103546 -228962 233155 93288 -251128 90333 142243 -248474 -177464 -85863 136584
11806f6314m6883f584r1970j25499D1671a68301D8786N921b97466A47624a19696
$$ -66314 -113197 -6584 -98554 -224053 41671 -168301 48786 54707 -297466 147624 -119696
11794i5905A05238j3918J08459e0177B9192a60570F6911c9120j26147A58P5667
$$ -95905 105238 91320 199779 -50177 29192 -160570 66911 -39120 -165267 158 75825
11783G5825q735A4366P3709L13064h7694m35228a20083A06003Q3322a11170o1735
$$ 75825 67090 14366 88075 401139 -87694 -522922 -120083 106003 189325 -111170 -172905
11772a72905H8900J6030b63175J22092r3736q177F2207b45641K0643e5407E3054
$$ -172905 88900 104930 -263175 -141083 -234819 -242996 62207 -245641 -224998 -55407 53054
11760A60612E3735g8678k37831C62086A23070K95866B9982g6078k93811A41003
$$ 160612 53735 -78678 -316509 362086 123070 418936 29982 -76078 -369889 141003
11749c45155a59622E2325J00095b02037k42083D4222A9117K4784J24445a44838
$$ -345155 -159622 52325 152420 -202037 -444120 44222 19117 43901 168346 -144838
11738d4273O99j95083e24k47169g627q6609A40260f0306j8449j78059E4132b87546
$$ -44273 -43574 -238657 -524 -247693 -7627 -94236 140260 -60306 -78755 -256814 54132 -287546
11725a99926M3138D2320A8967a23603C7965H187L50870c7473j19309m2662d2137
$$ -199926 -156788 42320 18967 -123603 37965 8187 359057 -37473 -156782 -199444 -42137
11713A10698L8178E8213c6895k2334B74542p0445K03891e6662k20858A70723a73232
$$ 110698 148876 58213 -36895 -59229 274542 204097 407988 -56662 -277520 170723 -173232
11701A02168A0437g6848A47081K9744B2424b2553A18159M4461o3392q726E795
$$ 102168 10437 -76848 147081 176825 22424 -22553 118159 162620 99228 90502 5795
11689A83029I0831a59856C75621D3664B910b8491B41105a72293E6319A8020a09782
$$ 183029 90831 -159856 375621 43664 2910 -28491 241105 -172293 56319 18020 -109782
11677B16540H9561i3497A61408p4761J04462c18098C52350i6310C30104A49188
$$ 216540 89561 -93497 161408 86647 191109 -318098 352350 -96310 330104 149188
11666d79453i670A28450L7100c65956H0552a78151J5053l6054e6399j03884B13224
$$ -479453 -9670 128450 165550 -365956 80552 -178151 -163098 -199152 -56399 -160283 213224
11654A51529b20540A95974D6389H041J66621M65616I1961J19964L682j06069J70024
$$ 151529 -220540 195974 46389 8041 174662 640278 91961 211925 215607 109538 279562
11643B79562H6602N3814a51336j59975A4754J41301g6017a9611A45176d4497b1959
$$ 279562 86602 140416 -151336 -311311 14754 156055 -76017 -19611 145176 -44497 -21959
11631i1064K8834K4234j02388b1654B19971d12837a21797a4287E040J04863C64
$$ -91064 -62230 -37996 -140384 -21654 219971 -412837 -121797 -14287 5040 109903 364
11619d4182k0563A08822Q5835a1456l4822A04245g8393i62q0504I1697a3814C0949
$$ -44182 -64745 108822 194657 -11456 -46278 104245 -78393 -962 -81466 91697 -13814 30949
11606a50072A54922a221m9242K2999C1693R6678J3970o5483a32431A04139l2319
$$ -150072 154922 -1221 -50463 -27464 31693 128371 142341 76858 -132431 104139 71820
11595G1820R319L0903b5041A23301c93739J20228d2617B8593O2191J81768B5408
$$ 71820 81139 112042 -25041 123301 -393739 -273511 -42617 28593 90784 272552 25408
11583F7272K00461I1128R3553o2294K4731l9719J40949j23927L2742l8878O2715
$$ 67272 267733 91128 184681 122387 147118 107399 248348 124421 157163 118285 181000
11572A81000J20219B4022b10387f8095B53065j02596e3071H0374J20166a75473
$$ 181000 301219 24022 -210387 -68095 253065 150469 -53071 80374 200540 -175473
11561B70844l8207n2375a10259G9640j8303L0662L2635b73334g1368a598B05960
$$ 270844 232637 180262 -110259 79640 61337 91999 124634 -273334 -71368 -1598 205960
11549A64652D1111n113a24907A65188c41726J57825A23267b36691H8223J2308
$$ 164652 41111 35998 -124907 165188 -341726 -183901 123267 -236691 88223 100531
11539A00531D8631M01056n1821r6529i7684d5578A26168h4960B66984A08595l0133
$$ 100531 48631 449687 397866 301337 -97684 -45578 126168 -84960 266984 108595 78462
11528G8462J48749J8055a05953C21828q5111m3416C5016L30742j53231D182J38995
$$ 78462 227211 245266 -105953 321828 236717 193301 35016 365758 212527 4182 143177
11517A43177g6701D52053a05767M9593k23843C35685K272b54489B13037R2486
$$ 143177 -76701 452053 -105767 -56174 -280017 335685 337957 -254489 213037 305523
11507C05523e2653J4223B49452a736A2349L21207A36992P8991J32753b3420m7723
$$ 305523 -52653 -38430 249452 -1736 12349 333556 136992 215983 348736 -23420 -71143
11496g1143F070a8754B76413J31606j92683r7462K6326N4560O9791J5617I8550
$$ -71143 6070 -18754 276413 408019 215336 117874 144200 198760 268551 284168 98550
11484b00930A59972a18862A61041G114J47392a57425B09007m4319b06011A07693
$$ -200930 159972 -118862 161041 7114 154506 -157425 209007 164688 -206011 107693
11473H2851h9113A93284H1036J4694l0059M47388E8691a79346C45849F2677J02385
$$ 82851 -89113 193284 81036 95730 65671 513059 58691 -179346 345849 62677 165062
11462A65062o7744L8533K6348n4864J10359j4852b6736j80941A96501q2254D0580
$$ 165062 97318 135851 162199 107335 217694 202842 -26736 -207677 196501 114247 40580
11450a05834L2070D83783B2737e5006B7551h2272H4810d0154A9162a44321A30589
$$ -105834 -73764 483783 22737 -55006 27551 -82272 84810 -40154 19162 -144321 130589
11438B32523n8518e0671B42303f270I9894c10337a13692D8899K1659Q1395m6448
$$ 232523 174005 -50671 242303 -6270 99894 -310337 -113692 48899 70558 151953 105505
11427A05505a5215j73003D1661K1816J85679i6208D193h4785B2722h7104A28055
$$ 105505 -15215 -188218 41661 63477 249156 -96208 4193 -84785 22722 -87104 128055
11415a08105E348a61408A56252a54826c9688I4072a67504B81619G4152a59211
$$ -108105 5348 -161408 156252 -154826 -39688 94072 -167504 281619 74152 -159211
11404B5235H991J68103p9509m1495c942B02360K4518H8202J81080F6794f1013
$$ 25235 8991 177094 97585 56090 -3942 202360 226878 88202 269282 66794 -61013
11392C1962a22500E7212A6865a45331O5073j1985l03521C41247c22962a14345
$$ 31962 -122500 57212 16865 -145331 -80258 -92243 -395764 341247 -322962 -114345
11381I6245j6459b89974C4746M8187D521b0289o5209C66014j56475a79052C15983
$$ 96245 79786 -289974 34746 82933 4521 -20289 -85498 366014 209539 -179052 315983
11369F2546f2602C18931a39639d1412p7956a7085j01537A36191a50669L30C2808
$$ 62546 -62602 318931 -139639 -41412 -119368 -17085 -118622 136191 -150669 -150339 32808
11357d3257q741J927a7166k65273p5f2895C38736d209j03312A41383J00061l5500
$$ -43257 -51998 -50071 -17166 -282439 -282514 -62895 338736 -4209 -107521 141383 241444 205944
11345B05944b52314A65849n0250A1680d6269B25328D1469b22064J2465h2308d0269
$$ 205944 -252314 165849 115599 11680 -46269 225328 41469 -222064 -209599 -82308 -40269
11333a86526B78926a03953j10235e6542k0934D4300g1155k5257B10275c8546B23683
$$ -186526 278926 -103953 -214188 -56542 -77476 44300 -71155 -96412 210275 -38546 223683
11321b120k00035C00481e9304I0796a10555K5754A16072J8759B1983H254c40214
$$ -2120 -202155 300481 -59304 90796 -110555 -84801 116072 134831 21983 8254 -340214
11309i0622C84402A09605i2316F1683e2087k27264F1368R5189a47542A8185b48719
$$ -90622 384402 109605 -92316 61683 -52087 -279351 61368 156557 -147542 18185 -248719
11297E13396A54618R4038g24j86809m6980D382i7367B30765a59486f397p06453
$$ 513396 154618 248656 -724 -187533 -234513 4382 -97367 230765 -159486 -6397 -712850
11286g12850D6499d7557B09519f650j29296e4637C10626i3381M3195j98452a05615
$$ -712850 46499 -47557 209519 -6650 -135946 -54637 310626 -93381 -50186 -248638 -105615
11274d0817A02481b92839A30093Q4186d20598I3849J7723a44059r766K2110A31183
$$ -40817 102481 -292839 130093 214279 -420598 93849 111572 -144059 -153825 -131715 131183
11262a79798l0357j03820G7571M938b8399A52752a13207D1881a28926j0423j91852
$$ -179798 -210155 -313975 77571 82509 -28399 152752 -113207 41881 -128926 -139349 -331201
11251c31201a16423A90811F1047b05614F6332b38615C21992a90466B69335Q2868
$$ -331201 -116423 190811 61047 -205614 66332 -238615 321992 -190466 269335 352203
11241C52203b66668C6294b09412i7544d5127k23054B54101a59485A4159M21069
$$ 352203 -266668 36294 -209412 -97544 -45127 -268181 254101 -159485 14159 435228
11231D35228a61931B08518a78429h0597j04925B06022a71958q5185h672F5626
$$ 435228 -161931 208518 -178429 -80597 -185522 206022 -171958 -257143 -8672 65626
11220a38371a4897o7457I833a5199A02132J61349b39753n1900j05418A26752a58131
$$ -138371 -14897 -82354 9833 -15199 102132 263481 -239753 -291653 -397071 126752 -158131
11208b85712B4088a53087B08350b39305b3051D47682b35112K5975j27779e5228
$$ -285712 24088 -153087 208350 -239305 -23051 447682 -235112 -209137 -336916 -55228
11197c8299n2435l38255d2596j47775f6713A61156i7002m458A27163e391k33813
$$ -38299 -90734 -428989 -42596 -190371 -66713 161156 -97002 -101460 127163 -5391 -239204
11186b39204h3051h299G7555J63312d3114l82685d7055C58737j54897a2249k62345
$$ -239204 -83051 -8299 77555 240867 -43114 -425799 -47055 358737 203840 -12249 -274594
11175b74594A89284D0015d6422q5127B21830r5391K69941i0563J7159j26155B8882
$$ -274594 189284 40015 -46422 -131549 221830 126439 396380 -90563 -73404 -199559 28882
11163A0224J19354A2501i6231A33981a25635c4762C50932a60133q793A57232m7024
$$ 10224 129578 12501 -96231 133981 -125635 -34762 350932 -160133 -168926 157232 110208
11152A10208K7563M4126a53218N9765b5427A48446O8129F4373a00555I832M1424
$$ 110208 137771 181897 -153218 -93453 -25427 148446 216575 64373 -100555 9832 51256
11141E1256a06654d3070j80988A19975n846f9696C62178j77156q6273B595c2860
$$ 51256 -106654 -43070 -224058 119975 114129 -69696 362178 185022 98749 2595 -32860
11129G370e9596q2476B41511D3294a74641C6029J26093a56189A04687J86151Q3922
$$ 7370 -59596 -142072 241511 43294 -174641 36029 162122 -156189 104687 290838 374760
11118C74760b47484J01567g1437B2401K89975b22680l7759F3860A6007K23464
$$ 374760 -247484 -145917 -71437 22401 312376 -222680 -260439 63860 16007 239471
11108B39471j10806a03944C39361K18015a5561B02167l3034g5128k027E96062
$$ 239471 128665 -103944 339361 557376 -15561 202167 169133 -75128 -77155 596062
11097c0054B72756H0186Q2373E8415L78173j13976l9085E9604a4381B3169J38844
$$ -30054 272756 80186 162559 58415 436588 322612 283527 59604 -14381 23169 162013
11086A62013J15176H504J66196b20912A73893f0859F4108J3617N2262J8009n3394
$$ 162013 277189 8504 174700 -220912 173893 -60859 64108 77725 129987 147996 94602
11075I4602J19809k4512a9826B50049F0728k8708J38016d2598H0205J69703R955
$$ 94602 214411 189899 -19826 250049 60728 32020 170036 -42598 80205 249908 259863
11064B59863L84139k57253j35942M67186k67521o6356R8841K12673P651B56405
$$ 259863 644002 386749 250807 717993 450472 384116 482957 695630 703281 256405
11053F31479L89R5217l31586K03152K00785r5953R9288N1223D23489M61752m23470
$$ 631479 631868 727085 395499 598651 799436 703483 802771 853994 423489 885241 461771
11042D61771M1524K29958k64874J20661K44884j12957N8224k01606q2204j03778
$$ 461771 503295 733253 468379 589040 833924 720967 779191 577585 495381 391603
11032C91603K68660k68499L00503n3386K94633j30365K28799M5803j71749D10487
$$ 391603 660263 391764 692267 638881 933514 803149 1031948 1077751 906002 410487
11021C24263M27871j18662L2903J9086j30746L30598j35209o6682o5119j23612
$$ 324263 752134 633472 666375 685461 554715 885313 750104 683422 618303 494691
11011D94691o1511K24539k90118J40112R3120B11011O54897A28458M08214L9865
$$ 494691 433180 657719 367601 507713 600833 211011 865908 128458 536672 576537
11001E76537O9249J24115j0651m3850K6835j68635n8085J96312M2029J74806p8715
$$ 576537 645786 769901 759250 715400 742235 573600 515515 711827 753856 928662 849947
10990H49947p2424O6799J41302l43346N03198k26847j27406L81727j54792J71463
$$ 849947 777523 844322 985624 642278 1145476 918629 791223 1172950 1018158 1189621
10980A189621J33518N744q4924M07833j62550J43832N84069j02440Q47567j36039
$$ 1189621 1323139 1328883 1243959 1651792 1489242 1633074 2217143 2114703 2962270 2826231
10970B826231l47000J04085j96368R583l88674l28189M7575n66113L05065L98206
$$ 2826231 2479231 2583316 2386948 2396531 2007857 1679668 1727243 1161130 1466195 1864401
10960A864401j00253Q7817p7107j00416J90979j79293m6448k06706J0931l05278
$$ 1864401 1764148 1851965 1774858 1674442 1865421 1686128 1639680 1432974 1443905 1138627
10950A138627l95258l2295k83206p1323K66543o4046j36725P9820b9616E22389
$$ 1138627 743369 711074 427868 356545 623088 559042 422317 502137 -29616 522389
10939C25773F3599J08482g699j80356B17640i9049B29095C6162L71112a44335
$$ 325773 63599 172081 -7699 -188055 217640 -99049 229095 36162 407274 -144335
10928B42038J75861C9788K30713B5738J02163m9903L0546N0216a3863C2860F028
$$ 242038 417899 39788 270501 25738 127901 77998 108544 158760 -13863 32860 6028
10916a29570A54758a30051A34639m5410R3397J11373A18090G076a47718C3954
$$ -129570 154758 -130051 134639 89229 182626 293999 118090 7076 -147718 33954
10905C9961d8405H9702c1169A11270a50934A99169B7867g1344j06938C49303i0883
$$ 39961 -48405 89702 -31169 111270 -150934 199169 27867 -71344 -178282 349303 -90883
10893A36167o4802j3615b78821G6891k5872h345j70792j12283B69354l5054b70406
$$ 136167 71365 57750 -278821 76891 51019 -8345 -179137 -291420 269354 234300 -270406
10881c20752B18914d5191I8518K9037O291a78344H7032i9341k3269l585A77405
$$ -320752 218914 -45191 98518 127555 133846 -178344 87032 -99341 -122610 -126195 177405
10869a8555l9810N028n8240J3807m1289r3935G0970B2368a87343A74886g8881
$$ -18555 -58365 -53337 -111577 -97770 -139059 -232994 70970 22368 -187343 174886 -78881
10857A60484b4748j04521A63224a85184f2534j46215o8262a30498f2377l994D1427
$$ 160484 -24748 -129269 163224 -185184 -62534 -208749 -277011 -130498 -62377 -66371 41427
10845D3317a43016r9194i7426c053j23891N3275A16337j2180K58874b25058C4408
$$ 43317 -143016 -242210 -97426 -3053 -126944 -73669 116337 104157 363031 -225058 34408
10833b9631A12257J77945a32402A20122N9478G0135b83774P1651b1167k13359
$$ -29631 112257 290202 -132402 120122 179600 70135 -283774 -212123 -21167 -234526
10823b34526A07774a49813a6257A03385a50865r6899n8124A06010a76055c1937
$$ -234526 107774 -149813 -16257 103385 -150865 -247764 -305888 106010 -176055 -31937
10812i2307M181q6172H6084a51824j88787b5801j0076k53427b7631A17361g0529
$$ -92307 -88126 -174298 86084 -151824 -340611 -25801 -35877 -289304 -27631 117361 -70529
10800B91109j10066J87708A27539a68175B53722C4491O5051d30146H3906a46517
$$ 291109 181043 368751 127539 -168175 253722 34491 99542 -430146 83906 -146517
10789A23796J11043c5507q389j05246d5426G3910C2966J8817b46246g1882k05153
$$ 123796 234839 -35507 -43896 -149142 -45426 73910 32966 51783 -246246 -71882 -277035
10778b77035C9188c01323A34280a87727N1245C7926e7296A90752p1721l4663M628
$$ -277035 39188 -301323 134280 -187727 -136482 37926 -57296 190752 119031 84368 88996
10767H8996f3438A70522l1831a25021b1444m1375o4272c1564j99175J0733e373
$$ 88996 -63438 170522 138691 -125021 -21444 -62819 -127091 -31564 -230739 -220006 -5373
10755a63917N7240L3353k55060d6639l4043o8504A96036O4379a40170A32551i9694
$$ -163917 -106677 -73324 -328384 -46639 -80682 -149186 196036 260415 -140170 132551 -99694
10743a76041H0881N5539b30939q7857I0397g3836A42093a93215N6633A8461a35120
$$ -176041 80881 136420 -230939 -318796 90397 -73836 142093 -193215 -136582 18461 -135120
10731b14526f1040B53606a515p845l78426P2661i0696C8843a76272H3750K3829
$$ -214526 -61040 253606 -1515 -9360 -387786 -315125 -90696 38843 -176272 83750 107579
10720A07579A4031c5829j1233B98652H5082a54024E7009Q4426n8732a2042k64946
$$ 107579 14031 -35829 -47062 298652 85082 -154024 57009 141435 82703 -12042 -276988
10709b76988g5392j0381j6881c0919k46799r9272a43402A86218f6274J9962b2598
$$ -276988 -75392 -85773 -102654 -30919 -277718 -376990 -143402 186218 -66274 -46312 -22598
10697A44276e3485B33911j00287J36680e3757k38650B77627i4011a1933j0006
$$ 144276 -53485 233911 133624 270304 -53757 -292407 277627 -94011 -11933 -21939
10687b1939D8202f0725A11233M0833F3910N4689b34472c9094A10434g9250a9243
$$ -21939 48202 -60725 111233 152066 63910 118599 -234472 -39094 110434 -79250 -19243
10675i1272A10639R8340b22435D06211d4318A08274a45386B0726c6684j95233
$$ -91272 110639 208979 -222435 406211 -44318 108274 -145386 20726 -36684 -231917
10665b31917G3257a47865o3036j6453b8606E1344a68253A43710g6471C22453b15075
$$ -231917 73257 -147865 -210901 -227354 -28606 51344 -168253 143710 -76471 322453 -215075
10653B16118b10636A08778H355b1528k14760A36429g6419j30028i5999j83929
$$ 216118 -210636 108778 8355 -21528 -236288 136429 -76419 -206447 -95999 -279928
10643b79928J19684c6883C28064b06594f5219D5487j401i5146B04217f8492j58020
$$ -279928 -160244 -36883 328064 -206594 -65219 45487 44086 -95146 204217 -68492 -226512
10632b26512O7213L2203k6975k60873A91321a06367c4489j72843A39141a84603
$$ -226512 -159299 -127096 -154071 -414944 191321 -106367 -34489 -207332 139141 -184603
10621i486j05077B13977c63337a3590k3895E9793b41628Q6349P579N1197G7491
$$ -9486 -114563 213977 -363337 -13590 -37485 59793 -241628 -155279 -147700 -96503 77491
10609I9597a10159q9705P869l09553B13950p4023a94214f9695a3620l29873A81208
$$ 99597 -110159 -199864 -191995 -501548 213950 139927 -194214 -69695 -13620 -343493 181208
10597c7020G2457a62616j53294C35641a7498B2426e2731A10159m0933a49065N6077
$$ -37020 72457 -162616 -315910 335641 -17498 22426 -52731 110159 69226 -149065 -92988
10586i2988m2012a4233E9215b20122d5170n3731c5276n4424F2141e5921j85494
$$ -92988 -135000 -14233 59215 -220122 -45170 -98901 -35276 -89700 62141 -55921 -241415
10575b41415E9528a32705L3450B44835I6636k0186a49826A05987C0854J0650b60435
$$ -241415 59528 -132705 -99255 244835 96636 76450 -149826 105987 30854 41504 -260435
10563c91736F3369k3828b27930A27607b04081C3072J96637A5946L260b34858C16403
$$ -391736 63369 39541 -227930 127607 -204081 33072 229709 15946 19206 -234858 316403
10551b06205h1282b839j02191D04381a159n4881J4404A45929a43512C661b41426
$$ -206205 -81282 -2839 -105030 404381 -1159 -56040 -41636 145929 -143512 3661 -241426
10539B69643g28n2516j64021g7661A78572c3311A87107a14970B39801J02119a02675
$$ 269643 -728 -53244 -217265 -77661 178572 -33311 187107 -114970 239801 341920 -102675
10527a80842c5538r0680D16199b107j6305A95874q8517R1308a51419F222R4131
$$ -180842 -35538 -126218 416199 -2107 -18412 195874 107357 198665 -151419 6222 100353
10516A00353J10882a72076A27442E2450f7029j65743a01866A49638D9712J83987
$$ 100353 211235 -172076 127442 52450 -67029 -232772 -101866 149638 49712 233699
10506B33699a03910A5665c0546k96921M7441E7818c53330F1209a26527A4491a89834
$$ 233699 -103910 15665 -30546 -327467 -280026 57818 -353330 61209 -126527 14491 -189834
10494F3154d27342J46621i9238B86005E4472c41765M2553A7135K002J48346m0108
$$ 63154 -427342 -280721 -99238 286005 54472 -341765 -299212 17135 19137 167483 127375
10483A27375e3198C24374J8854q6669j01867m7435J24017d0676C01478A8313J75470
$$ 127375 -53198 324374 343228 256559 154692 107257 231274 -40676 301478 18313 193783
10472A93783d5066D2813b1125k72554a03677A30817d9564k72849d0666C75460
$$ 193783 -45066 42813 -21125 -293679 -103677 130817 -49564 -322413 -40666 375460
10461c6458m2986F6060L5918G763a29362E3990a0226A00016B7387a24278K0160
$$ -36458 -79444 66060 101978 7763 -129362 53990 -10226 100016 27387 -124278 -104118
10450a04118l8952K7309J6769F9742J36759P6434a89120k2263A24473a591l46598
$$ -104118 -143070 -115761 -98992 69742 206501 282935 -189120 -211383 124473 -1591 -348189
10439c48189b0574k83450O7964M3993g0322l09473c6250A32527N1570m6823b1854
$$ -348189 -20574 -304024 -236060 -192067 -70322 -379795 -36250 132527 184097 137274 -21854
10427B52383a2023j4051A11381a13044C21298B0355J38515C9419j9310b56635
$$ 252383 -12023 -26074 111381 -113044 321298 20355 158870 39419 20109 -256635
10416d5763j5060Q960p4765M3010B4054i3563A35189a87434j63129B03178a09714
$$ -45763 -60823 -51863 -126628 -83618 24054 -93563 135189 -187434 -350563 203178 -109714
10404a42910A38141h446C2085Q4263a54033k08327A64865I67K83817f8188B76321
$$ -142910 138141 -8446 32085 116348 -154033 -362360 164865 967 284784 -68188 276321
10392c00234e5054B87839d077a622B65099A29539E9884B0518J59812D7143g8882
$$ -300234 -55054 287839 -4077 -1622 265099 129539 59884 20518 180330 47143 -78882
10380H9872K11786p2615K9427G5791L31736j95763k4060N3125r1664g8266C28098
$$ 89872 301658 229043 258470 75791 407527 211764 187704 240829 149165 -78266 328098
10368D59337j91819Q8805P7138m1213A82222D1995N5821o043k9461q638K69791
$$ 459337 267518 356323 433461 392248 182222 41995 97816 91773 62312 53674 323465
10357C23465j02631q514a64967A40163L04375A75862F6544J67964O28361C69323
$$ 323465 220834 212320 -164967 140163 444538 175862 66544 234508 862869 369323
10346A57560J87053A15747K82698M7755j25686l018j44822g8465E4768K03039
$$ 157560 344613 115747 398445 446200 320514 317496 172674 -78465 54768 257807
10336B57807R7768q5502A17246J7228K95321H5075C1633R7798O8531o6765M1798
$$ 257807 355575 270073 117246 134474 429795 85075 31633 129431 197962 131197 172995
10325A72995b3274j18249D25942k02369J64351p7365e6010A10868b66608C38742
$$ 172995 -23274 -141523 425942 223573 387924 310559 -56010 110868 -266608 338742
10314C23488q1687J14549g2989B3301K6432h4102B63386A06516a19506l2998A21915
$$ 323488 241801 356350 -72989 23301 49733 -84102 263386 106516 -119506 -152504 121915
10302A48690l193H512a85930L2035B94898j00958c83197a82559B2879b31886A13277
$$ 148690 145497 8512 -185930 -153895 294898 193940 -383197 -182559 22879 -231886 113277
10290a42960j79064g598m51984a75760g5806A57615b07303j3800a09189L4999
$$ -142960 -322024 -7598 -459582 -175760 -75806 157615 -207303 -221103 -109189 -74190
10280g4190B16383B5822f9179j95833e6590B14899D1927a72787p3486D70150g0685
$$ -74190 216383 25822 -69179 -265012 -56590 214899 41927 -172787 -246273 470150 -70685
10268B3450L55929h4008D9127P3743g8739I2705I643P70800B89480P0938J91526
$$ 23450 379379 -84008 49127 122870 -78739 92705 9643 780443 289480 360418 551944
10257E51944k68631R1393b18390e7747j50070C30104o9867C4873b09650j48003
$$ 551944 283313 374706 -218390 -57747 -207817 330104 260237 34873 -209650 -357653
10247c57653i5311k30365B9853a00408l2570k33857O5084C2619b34961d832k38429
$$ -357653 -95311 -325676 29853 -100408 -132978 -366835 -301751 32619 -234961 -4832 -243261
10236b43261c6193C0737g2220k07714I3409h8222j4353F1019g1121E6988a21560
$$ -243261 -36193 30737 -72220 -279934 93409 -88222 -102575 61019 -71121 56988 -121560
10224f8756o3437a8850l53579a7849C86918A86123b452A12134M765c2764j09864
$$ -68756 -132193 -18850 -372429 -17849 386918 186123 -2452 112134 116899 -32764 -142628
10213a42628A26189E1147b82885m304H176i0838N214B50620j01976B8089J32593
$$ -142628 126189 51147 -282885 -287189 8176 -90838 -85624 250620 148644 28089 160682
10202A60682D8438b8214j76335A3289J23608d1814J966D55678F5842c0665r5498
$$ 160682 48438 -28214 -204549 13289 136897 -41814 -39848 455678 65842 -30665 -126163
10191a26163e4574A2307b77344b4464B12847a30219L6191A01309A503a96124F0711
$$ -126163 -54574 12307 -277344 -24464 212847 -130219 -94028 101309 1503 -196124 60711
10179B8748d27983J66813P2177j04247J17102C1604b59810a06487A38281a12255
$$ 28748 -427983 -261170 -188993 -293240 -176138 31604 -259810 -106487 138281 -112255
10168A24347B6736c48077a02495j4718p655f0170O579j0885j50051A44181L9347
$$ 124347 26736 -348077 -102495 -117213 -124868 -60170 -53591 -64476 -214527 144181 183528
10157A83528b44347J17377B78705A4114a73277B59311d2907A81246I736a27609
$$ 183528 -244347 -126970 278705 14114 -173277 259311 -42907 181246 9736 -127609
10146c03829c972n5876J9008C3278a7019r4434B13028a80871I1564M70258c65529
$$ -303829 -3972 -59848 -40840 33278 -17019 -111453 213028 -180871 91564 561822 -365529
10134a74371A75927a41483q4714F6748p108f9529r7613C9518P8203a03186r401
$$ -174371 175927 -141483 -226197 66748 59640 -69529 -167142 39518 117721 -103186 -112587
10123a12587A13622K46840C0066A4377J12793b17242c8797C636h4725B10751d0581
$$ -112587 113622 360462 30066 14377 127170 -217242 -38797 3636 -84725 210751 -40581
10111a19765A9076c3582m2328F3556d77390f4839j40663A0425a79032j7021q8018
$$ -119765 19076 -33582 -75910 63556 -477390 -64839 -205502 10425 -179032 -196053 -284071
10100b84071B75725c92412a45779A86815J45287g5636l51455k7406A35192b6903
$$ -284071 275725 -392412 -145779 186815 332102 -75636 -427091 -454497 135192 -26903
10089C56376b8318r1219p5576e6298J8203A4450a61005p2709e6377j07047k92918
$$ 356376 -28318 -119537 -195113 -56298 -38095 14450 -161005 -233714 -56377 -163424 -456342
10078d56342A55303b28251B61422b89484c2048J1638B58507H1065K096a28255
$$ -456342 155303 -228251 261422 -289484 -32048 -20410 258507 81065 83161 -128255
10067C5292a80186B112a26874e1956A92541b76244N2726A57644Q6787h5209E2866
$$ 35292 -180186 2112 -126874 -51956 192541 -276244 -223518 157644 244431 -85209 52866
10055e4424b0894C1212b51631J1575i4525l09461D9741J65074a76067A69352b13460
$$ -54424 -20894 31212 -251631 -240056 -94525 -403986 49741 214815 -176067 169352 -213460
10043c65077f1360G1533C3691A1311a30428A06774c32578a53371G353J80138a33897
$$ -365077 -61360 71533 33691 11311 -130428 106774 -332578 -153371 7353 187491 -133897
10031h2357J4297l9181A45693D1753f9500q9684n6230A31296n4074h1025A6560
$$ -82357 -68060 -107241 145693 41753 -69500 -159184 -215414 131296 77222 -81025 16560
10019A34688f8355l8218j39664H4971e5351B21126h3291n6537c9068C1132d88098
$$ 134688 -68355 -106573 -246237 84971 -55351 221126 -83291 -139828 -39068 31132 -488098
10007A96269A4713f1455p4655A64051G6347b06682A36728b33264c1541k57951
$$ 196269 14713 -61455 -136110 164051 76347 -206682 136728 -233264 -31541 -289492
9997b89492A1513a88541J9214M9987c7953D4168f8090A633K2665Q3391b1847B73744
$$ -289492 11513 -188541 -169327 -119340 -37953 44168 -68090 1633 24298 107689 -21847 273744
9984a01990o0952M9125d2789m48469c6485j67134A89773D8386a82307r110M1910
$$ -101990 -162942 -113817 -42789 -491258 -36485 -203619 189773 48386 -182307 -191417 -149507
9973a49507r5368d7053o3444m3768k68961c8366r4831A25301a55106M9281M1451
$$ -149507 -244875 -47053 -110497 -154265 -423226 -38366 -133197 125301 -155106 -105825 -64374
9962f4374D4847M6502J04167R021d8440j96329M0863j10409J54088B6301a43958
$$ -64374 44847 91349 195516 204537 -48440 -244769 -203906 -314315 -160227 26301 -143958
9950a51798k98547J46796a19381d5108k16473J09711o883G098a71141m299M9942
$$ -151798 -450345 -303549 -119381 -45108 -261581 -151870 -158753 7098 -171141 -175440 -125498
9939a25498e7315k883j27338j37541Q3503A30759c90136a5266p7736m8572q2264
$$ -125498 -57315 -60198 -187536 -325077 -241574 130759 -390136 -15266 -93002 -141574 -223838
9928b23838E317a78332H950a978k57354h0256d383C46347A09614J18697d1314
$$ -223838 5317 -178332 8950 -1978 -259332 -80256 -4383 346347 109614 228311 -41314
9916B34926G9833K44970a09112o8205P6638A05160b83077J746a09952N1977k92813
$$ 234926 79833 324803 -109112 -177317 -100679 105160 -283077 -281331 -109952 -57975 -350788
9905c50788J23536a3270o1767E0755f6392a1702j98925a7841j19557I7862n553
$$ -350788 -227252 -13270 -75037 50755 -66392 -11702 -210627 -17841 -137398 97862 92309
9894I2309P3845J62056a4451B9968M6561b22011B96310a66738B84291f9095J5021
$$ 92309 166154 328210 -14451 29968 76529 -222011 296310 -166738 284291 -69095 -54074
9883e4074M114r0831c2291B66641b43153B96139a96735o7079M4484i2480k15692
$$ -54074 -49960 -140791 -32291 266641 -243153 296139 -196735 -263814 -219330 -92480 -308172
9872c08172a11069j5532J1880F3195B1295a66050j03392C10952b02965C0662J98217
$$ -308172 -111069 -126601 -114721 63195 21295 -166050 -269442 310952 -202965 30662 228879
9861B28879a44716h58l25352C25685a6789k87729k7364J33945A8402d7898k30347
$$ 228879 -144716 -858 -326210 325685 -16789 -304518 -331882 -197937 18402 -47898 -278245
9850b78245B6609R3965N1686a42044A03265J5850a93604l960B31171G4304j4942
$$ -278245 26609 120574 172260 -142044 103265 119115 -193604 -197564 231171 74304 59362
9839E9362i3511B72834b23304k0211J7124F9008a90626a0948j61300A06772J11371
$$ 59362 -93511 272834 -223304 -243515 -226391 69008 -190626 -10948 -172248 106772 218143
9828B18143a25547D5374a29483j126C4539K8190j1779K30681a50843C8949b71161
$$ 218143 -125547 45374 -129483 -130609 34539 62729 50950 281631 -150843 38949 -271161
9816b22534b3277j1987k07550C21816I2584a05032r6119B19014a15694A93251
$$ -222534 -23277 -35264 -242814 321816 92584 -105032 -201151 219014 -115694 193251
9805F8537n528a2494j4395B7274g7571j59839A83797B8442a6690j28095I2101
$$ 68537 63009 -12494 -26889 27274 -77571 -237410 183797 28442 -16690 -144785 92101
9793a22640a3332j30888C7983O6045b15199g2316C5797P9868b69548f8998k06677
$$ -122640 -13332 -144220 37983 104028 -215199 -72316 35797 115665 -269548 -68998 -275675
9782b75675A14896A5589a81202D3852J1269L48333A09271J77743b12899G298b11521
$$ -275675 114896 15589 -181202 43852 55121 403454 109271 287014 -212899 7298 -211521
9770E2214J17883C5084B130Q539c16824J7353e1302l6523q9009O9084A09606c5131
$$ 52214 170097 35084 2130 10669 -316824 -299471 -51302 -87825 -176834 -107750 109606 -35131
9757e9214D4743c51844D6987b61770O9574j3303G5041J16407d6596m20677G4610
$$ -59214 44743 -351844 46987 -261770 -192196 -205499 75041 191448 -46596 -467273 74610
9745A0795K6986J80715b8120A8521M9764P558b24137N8239o994a1291o897l6391
$$ 10795 37781 218496 -28120 18521 68285 75843 -224137 -165898 -172892 -11291 -18188 -54579
9733e4579l00483J22755h698l92376B31917D1060b89249J22598E2574L156h1900
$$ -54579 -355062 -232307 -8698 -401074 231917 41060 -289249 -166651 52574 55730 -81900
9721g424B83283a30590k45913h043p7401j24213j89970g8679j04992A82536a67950
$$ -7424 283283 -130590 -376503 -8043 -85444 -209657 -399627 -78679 -183671 182536 -167950
9709i9297F8956d1039n2681K5476B0685Q9268b9347k82840f0484B1176K59630
$$ -99297 68956 -41039 -93720 -68244 20685 109953 -29347 -312187 -60484 21176 280806
9698B80806h4634J7129E1435b68135l2652Q0889N6188E6268A5645a94404h6337
$$ 280806 -84634 -67505 51435 -268135 -300787 -219898 -163710 56268 15645 -194404 -86337
9686e249k9132D1882c51782h8144d465k26903M2553g9265m1474r0374c0621G4959
$$ -5249 -34381 41882 -351782 -88144 -4465 -231368 -188815 -79265 -120739 -211113 -30621 74959
9673E7141J558a03913o7681k02634a33416L3547C47566a27825o3722N3410A12377
$$ 57141 58699 -103913 -171594 -374228 -133416 -99869 347566 -127825 -191547 -138137 112377
9661B57361F905b79732j28455a59724N5874k2833C6810O1443J15228f6892A63513
$$ 257361 6905 -279732 -408187 -159724 -103850 -126683 36810 98253 213481 -66892 163513
9649A05805P2348A2436h3383A07130I696J53805d1364A38381m4787a7529k27233
$$ 105805 178153 12436 -83383 107130 9696 163501 -41364 138381 93594 -17529 -244762
9638b44762f278n3247n860r6090d9312r2012A51196d24486f3400H8793b56409
$$ -244762 -6278 -59525 -65385 -161475 -49312 -141324 151196 -424486 -63400 88793 -256409
9626b24353f7194B08173k4298g0158A00639J47473P0659b39554O9034c3036G9468
$$ -224353 -67194 208173 183875 -70158 100639 248112 318771 -239554 -170520 -33036 79468
9614b05187J4681P3703H040b40934O3947A64782B5762P6022a61654F7566g9365
$$ -205187 -190506 -116803 8040 -240934 -176987 164782 25762 101784 -161654 67566 -79365
9602c04283c6259B37203e1163k49500I0011C1998J13261a2224H0033J99078b19269
$$ -304283 -36259 237203 -51163 -300663 90011 31998 145259 -12224 80033 279111 -219269
9590b34717A2961b56041h8203l8153K4660L4335A67007a66393N7213B8366J18835
$$ -234717 12961 -256041 -88203 -126356 -101696 -67361 167007 -166393 -109180 28366 147201
9579A47201b0756G4783b48572k1380F1231c67872E4287k4936N8870d13090J93631
$$ 147201 -20756 74783 -248572 -269952 61231 -367872 54287 29351 88221 -413090 -219459
9568b19459c9062f989k57921a23649C980Q9396c5279a3540A84b13444I1060a77673
$$ -219459 -39062 -6989 -264910 -123649 3980 93376 -35279 -13540 184 -213444 91060 -177673
9555G7115e5342j31095p739p5000H3105J36272R6668a2417q0460A21447e7200
$$ 77115 -55342 -186437 -194176 -269176 83105 219377 316045 -12417 -92877 121447 -57200
9543E3711a82991H612c27072G8496J10529j0479b26005r5892B19994a19621k18367
$$ 53711 -182991 8612 -327072 78496 189025 178546 -226005 -321897 219994 -119621 -337988
9532c37988a20353r772A99201p6990l7441K5345j8756C0866c8652k9665j22915
$$ -337988 -120353 -130125 199201 122211 84770 110115 91359 30866 -38652 -68317 -191232
9521a91232e9404A15620a06254n9997n396r534G0458b30914d6204B5477f1047
$$ -191232 -59404 115620 -106254 -166251 -171647 -181181 70458 -230914 -46204 25477 -61047
9509I4614J05913d42670A71463a56103g5330j0445o9569e4073d594I232a47913
$$ 94614 200527 -442670 171463 -156103 -75330 -85775 -155344 -54073 -4594 9232 -147913
9497A61742a25054A77318g6090a8687A38099c177l27396E1493m530R1142D4306
$$ 161742 -125054 177318 -76090 -18687 138099 -3177 -330573 51493 46963 138105 44306
9485A4109g2569I7233j3618c239j99072C7842g4491j86814I2043R2399a51504
$$ 14109 -72569 97233 83615 -3239 -202311 37842 -74491 -261305 92043 184442 -151504
9473a42151l723o7942B78830c4017l87037a27219A72738a49293C06339c8060k11214
$$ -142151 -145874 -213816 278830 -34017 -421054 -127219 172738 -149293 306339 -38060 -249274
9462b49274B9508d5916H0453J14989F1833b52079a11984r0302B16701a30847B14335
$$ -249274 29508 -45916 80453 195442 61833 -252079 -111984 -202286 216701 -130847 214335
9450A47591a11294j16261l3974J2218J12628D3984e4584k41476l8829e1256b3078
$$ 147591 -111294 -227555 -261529 -249311 -136683 43984 -54584 -296060 -334889 -51256 -23078
9438B5108b47133a08127j5928B36452h2674k30800Q0595A71588J30674p6726H8367
$$ 25108 -247133 -108127 -124055 236452 -82674 -313474 -232879 171588 302262 225536 88367
9426B72763r3589b01487j97985A38916A8073J70265i6332K0873l7334j52173G0515
$$ 272763 179174 -201487 -399472 138916 18073 188338 -96332 -75459 -112793 -264966 70515
9414A41107n2361a70322o8428d9850n0293B90645E8891J15765a55126g335B30292
$$ 141107 88746 -170322 -238750 -49850 -100143 290645 58891 174656 -155126 -7335 230292
9402h6066B29168g3950L439k65289a44973L475N5736J7928K6060p711k42546C8344
$$ -86066 229168 -73950 -70511 -335800 -144973 -141498 -85762 -67834 -41774 -49485 -292031 38344
9389b70934A18849b81531A19338J5315b27368A0663h1142m72175e1188j03631
$$ -270934 118849 -281531 119338 134653 -227368 10663 -81142 -553317 -51188 -154819
9379a54819N4439c0136A97623b66292r2678e6457k49083A20788C0296g599B8874
$$ -154819 -100380 -30136 197623 -266292 -358970 -56457 -305540 120788 30296 -7599 28874
9367c37899g5332G3276a50051J5218q4916O7648k3403o4222g7393j42771E566
$$ -337899 -75332 73276 -150051 -134833 -219749 -152101 -175504 -239726 -77393 -220164 5566
9355A09049b4140A90763R3101i92I3597L02816b10376a01124B12499a71774A92094
$$ 109049 -24140 190763 283864 -992 93597 396413 -210376 -101124 212499 -171774 192094
9343a83094e80k0824k91597E6696B3306A1541e0315B19494C3894f2947C14902
$$ -183094 -580 -21404 -313001 56696 23306 11541 -50315 219494 33894 -62947 314902
9331e4015k97456a38742m8421O4116D2596L084J8138a32017l2635A11166L3696
$$ -54015 -351471 -138742 -187163 -123047 42596 45680 63818 -132017 -164652 111166 144862
9320A44862e5751K2274E8242f9010j17316b5843D6860J95751b19620A65426D6286
$$ 144862 -55751 -33477 58242 -69010 -186326 -25843 46860 242611 -219620 165426 46286
9308b0477f923I7022b42520A43728h3112L1259A7633c15090A83692E8836c7093
$$ -20477 -6923 97022 -242520 143728 -83112 -51853 17633 -315090 183692 58836 -37093
9296b25569Q4337G2527b13843Q8090D2074N1298c16373R0973j95373J19215A7574
$$ -225569 -141232 72527 -213843 -125753 42074 93372 -316373 -225400 -420773 -301558 17574
9284b14194L4833j44415i1282j43471Q7777k30488e288j58222A55400C3981J88045
$$ -214194 -179361 -323776 -91282 -234753 -146976 -377464 -5288 -163510 155400 33981 222026
9273B22026e26604K38970p7322A59625j5625J53997A2546J2425F15M8748c11015
$$ 222026 -526604 -287634 -364956 159625 144000 297997 12546 24971 615 49363 -311015
9261c15795A76310D9170a41270B52143g0378B11320D1107B0426d113A19896h8303
$$ -315795 176310 49170 -141270 252143 -70378 211320 41107 20426 -4113 119896 -88303
9249b12347E184j994J558J96519b06897C6704K5334N4407a73307O0759j78325
$$ -212347 5184 3190 4748 201267 -206897 36704 62038 116445 -173307 -112548 -290873
9238b90873A17919a02379E4806J93216b67280N8608A01873d9127E6387O0255a74120
$$ -290873 117919 -102379 54806 248022 -267280 -208672 101873 -49127 56387 116642 -174120
9226d9393m736l11562M8990C635J57423b00918B7068a47525h801j20923a8360
$$ -49393 -54129 -365691 -316701 3635 161058 -200918 27068 -147525 -8801 -129724 -18360
9214e4660m6442o4451A00077K74424a43448a3336j12403d837A1970b30010K7750
$$ -54660 -101102 -165553 100077 374501 -143448 -13336 -125739 -4837 11970 -230010 -202260
9203b02260n6823A2405c89318B00282i7918E1743R853a18873A3346a64662A07395
$$ -202260 -259083 12405 -389318 200282 -97918 51743 61596 -118873 13346 -164662 107395
9191a21310A44979c79438C249c1214j59384B21325i6336B48307b42338L4000p172
$$ -121310 144979 -379438 3249 -31214 -190598 221325 -96336 248307 -242338 -208338 -215510
9180b15510a766q0791l7524j03209C68744b36605B68502q6398P7709a15358B7220
$$ -215510 -1766 -82557 -120081 -223290 368744 -236605 268502 182104 259813 -115358 27220
9168A0687a34184p0602A08505b91766G2275J35057a95410A59412D1401A5262M6313
$$ 10687 -134184 -204786 108505 -291766 72275 207332 -195410 159412 41401 15262 61575
9157F1575M2396e2163K3992B21034H8243c22415a32198j66943I6081b04826k38126
$$ 61575 103971 -52163 -28171 221034 88243 -322415 -132198 -299141 96081 -204826 -442952
9146d42952e3081j13070d4594k09765O2834B59449F1533j2438a4495p0577q8706
$$ -442952 -53081 -166151 -44594 -254359 -191525 259449 61533 49095 -14495 -85072 -173778
9135a73778B58207a81021j23534a24214B48757h6800j9054j85015A73285a71861
$$ -173778 258207 -181021 -304555 -124214 248757 -86800 -105854 -290869 173285 -171861
9124c56566h6143j59475a19829I4839A9952a22419A83150h7938G9380M0731a18736
$$ -356566 -86143 -245618 -119829 94839 19952 -122419 183150 -87938 79380 120111 -118736
9112A06363a21690I0518a42421i835A63001a91616A2396a96384A15689C6604J85718
$$ 106363 -121690 90518 -142421 -9835 163001 -191616 12396 -196384 115689 36604 222322
9101B22322B2957b61078a19757A4052a91653q7358k9999J21566B82047b70177
$$ 222322 22957 -261078 -119757 14052 -191653 -279011 -309010 -187444 282047 -270177
9090a3866D5933E573L274e17636a22507J1646o6459h8046m1594j86717J17107
$$ -13866 45933 5573 8847 -517636 -122507 -110861 -177320 -88046 -129640 -316357 -199250
9079a99250B0028R6105L4817c35090A63133p0879b96387A0786h2286L7015C04703
$$ -199250 20028 116133 150950 -335090 163133 92254 -296387 10786 -82286 -45271 304703
9067b19676F0918K67406C0968J18670p4352D391a47493A59136K2553h0346C18254
$$ -219676 60918 328324 30968 149638 75286 4391 -147493 159136 181689 -80346 318254
9055g9069I9245g4204j13040A92538b32718P4408P0443d3439p3333l80035A81564
$$ -79069 99245 -74204 -187244 192538 -232718 -158310 -87867 -43439 -116772 -496807 181564
9043b30941F0146k7107O4368K28701e4423j24110g6580B24166b79084F5401g5924
$$ -230941 60146 33039 97407 326108 -54423 -178533 -76580 224166 -279084 65401 -75924
9031a16810g835k21590o672G5955c03218A07098b400m467k81936f3784H0701c85
$$ -116810 -7835 -229425 -236097 75955 -303218 107098 -2400 -6867 -288803 -63784 80701 -385
9018b5828A93672f2326j48282E1487a54376B94436f6591E3817J82692D2782a07608
$$ -25828 193672 -62326 -210608 51487 -154376 294436 -66591 53817 236509 42782 -107608
9006C2510J568d9743n1029A22934b24400J4962f1102A35705C8401J89941a11622
$$ 32510 34078 -49743 -100772 122934 -224400 -209438 -61102 135705 38401 228342 -111622
8994e2925b012m08595C73244c76398A83835N8148g3831b9528E1711c70390A68473
$$ -52925 -2012 -410607 373244 -376398 183835 241983 -73831 -29528 51711 -370390 168473
8982D4856Q0718h6762K5942J0379l92890A79155q8770b67785b2745p1969o027
$$ 44856 125574 -86762 -60820 -50441 -443331 179155 90385 -267785 -22745 -94714 -100741
8971a00741j37996B50060a85909h1772C14173c5348A27662b65475k8027c7420
$$ -100741 -238737 250060 -185909 -81772 314173 -35348 127662 -265475 -293502 -37420
8960c62922h8301j65450Q1929c8628J5630j6513j61768B33200C5843L51535A23749
$$ -362922 -88301 -253751 -171822 -38628 -22998 -39511 -201279 233200 35843 387378 123749
8948b3018k52696A04315b79623A00545B5895c8366A44974K17051c44855J33118
$$ -23018 -275714 104315 -279623 100545 25895 -38366 144974 362025 -344855 -211737
8938b11737j108C1524J3103L46127K74660A18810g8951F9270b7857k404A40201
$$ -211737 -212845 31524 44627 390754 665414 118810 -78951 69270 -27857 -30261 140201
8926B7809J75257J22042M38382J897800O884136L082838D448251A750388G84149
$$ 27809 203066 325108 763490 2661290 9545426 12628264 4448251 1750388 784149
8916E25496A83734K50369A07742M2150b3374j53430r4874J31161B95577k26i8343
$$ 525496 183734 434103 107742 149892 -23374 -176804 -271678 -140517 295577 295351 -98343
8904a5407j09269c3315k15841B05180g6613b6790j15237G3831J56819H6433J1774
$$ -15407 -124676 -33315 -249156 205180 -76613 -26790 -142027 73831 230650 86433 98207
8893I8207k5919a66254g5612L4718A28390J14326a44030e5970B29652f6430j94820
$$ 98207 72288 -166254 -75612 -40894 128390 242716 -144030 -55970 229652 -66430 -261250
8882b61250G7324b29196O9431B50542a58302E8452N4112g2025k24778a1302B7034
$$ -261250 77324 -229196 -159765 250542 -158302 58452 112564 -72025 -296803 -11302 27034
8870A33824a58691A21854B4216c27633i2191a7201A05322a75A6640b77600B55121
$$ 133824 -158691 121854 24216 -327633 -92191 -17201 105322 -175 16640 -277600 255121
8858A14621b90690B07257b83790k02819B1014P4635e3935r5530B04727a13938
$$ 114621 -290690 207257 -283790 -486609 21014 95649 -53935 -149465 204727 -113938
$$ [...]
##END NTUPLES=NMR SPECTRUM
##END=
