##TITLE=AC1508_CUNDCR13315_8126600_pgbkpb7KZe
##JCAMPDX= 6.0         $$ Bruker NMR JCAMP-DX V2.0
##DATA TYPE= NMR SPECTRUM
##DATA CLASS= NTUPLES
##ORIGIN= BRUKER
##OWNER= Administrator
$$ 1.72 TOPSPIN		Version 2.1
$$ 2013-08-16 20:59:15.975 -0700  Administrator@X
$$ Compression mode = diff/dup
##.OBSERVE FREQUENCY= 400.02188249412
##.OBSERVE NUCLEUS= ^1H
##.ACQUISITION MODE= SIMULTANEOUS (DQD)
##.ACQUISITION SCHEME= undefined
##.AVERAGES= 64
##.DIGITISER RES= 22
##SPECTROMETER/DATA SYSTEM= spect
##.PULSE SEQUENCE= noesygpps1d.comp
##.SOLVENT NAME= COFFEE_meoh
##.SHIFT REFERENCE= INTERNAL, COFFEE_meoh, 1, 14.96097
##AUDIT TRAIL= $$ (NUMBER, WHEN, WHO, WHERE, PROCESS, VERSION, WHAT)
$$ ##TITLE= Audit trail, TOPSPIN		Version 2.1
$$ ##JCAMPDX= 5.01
$$ ##ORIGIN= Bruker BioSpin GmbH
$$ ##OWNER= Administrator
$$ $$ E:\/data/COFFEE/nmr/AC1508_CUNDCR13315_8126600_pgbkpb7KZe/22/pdata/1/auditp.txt
$$ ##AUDIT TRAIL=  $$ (NUMBER, WHEN, WHO, WHERE, PROCESS, VERSION, WHAT)
(   1,<2013-08-16 20:59:11.116 -0700>,<Administrator>,<X>,<go>,<TOPSPIN 2.1>,
      <created by zg
	started at 2013-08-16 20:47:41.913 -0700,
	POWCHK enabled, PULCHK disabled,
       configuration hash MD5:
       C8 4E 4E 5D D3 5C D8 9E 9F 52 82 E0 59 8A DE 15
       data hash MD5: 64K
       5E 76 FF AB 6C 8F A1 CD 34 C5 D1 6B 82 90 4D E7>)
(   2,<2013-08-16 20:59:14.069 -0700>,<Administrator>,<X>,<proc1d>,<TOPSPIN 2.1>,
      <Start of raw data processing
       efp LB = 0.3 FT_mod = 6 PKNL = 1 PHC0 = 0 PHC1 = 0 SI = 128K 
       data hash MD5: 128K
       62 39 B0 23 29 06 2C 68 C5 55 4F BF E9 58 A7 A3>)
(   3,<2013-08-16 20:59:15.085 -0700>,<Administrator>,<X>,<proc1d>,<TOPSPIN 2.1>,
      <pk PHC0 = -78.0304 PHC1 = 0 
       data hash MD5: 128K
       0F 89 9D D9 47 A2 71 A0 62 CB F1 5A 06 5B 3C 5D>)
(   4,<2013-08-16 20:59:15.491 -0700>,<Administrator>,<X>,<proc1d>,<TOPSPIN 2.1>,
      <abs ABSG = 1 
       data hash MD5: 128K
       7E 00 E7 28 0B 0E 88 05 99 96 C5 F1 70 8C BD 9C>)
(   5,<2013-08-16 20:59:15.585 -0700>,<Administrator>,<X>,<proc1d>,<TOPSPIN 2.1>,
      <abs ABSG = 2 
       data hash MD5: 128K
       4D 98 98 A5 E8 D4 91 67 74 F7 3A 1E 70 79 D6 35>)
(   6,<2013-08-16 20:59:15.663 -0700>,<Administrator>,<X>,<proc1d>,<TOPSPIN 2.1>,
      <abs ABSG = 3 
       data hash MD5: 128K
       A8 15 38 95 4C B9 4A F0 42 B1 EA 07 1C E9 60 83>)
(   7,<2013-08-16 20:59:15.757 -0700>,<Administrator>,<X>,<proc1d>,<TOPSPIN 2.1>,
      <abs ABSG = 4 
       data hash MD5: 128K
       55 99 E9 5D 34 8E B3 21 87 44 4D 24 F3 DF 06 A3>)
(   8,<2013-08-16 20:59:15.819 -0700>,<Administrator>,<X>,<proc1d>,<TOPSPIN 2.1>,
      <abs ABSG = 5 
       data hash MD5: 128K
       D5 DF F2 C9 38 84 47 BC 33 3E C2 CA FA AF E9 DC>)
$$ ##END=
$$ 
$$ $$ hash MD5
$$ $$ 67 D9 78 30 F5 80 96 1E 70 F2 B2 B6 DA 0A 7E 67
##$RELAX= 
##$RELAX= 
##$RELAX= 
##$RELAX= 
##$RELAX= 
##$RELAX= 
##$RELAX= 
##$RELAX= 
$$ Bruker specific parameters
$$ --------------------------
##$DU= <E:\>
##$EXPNO= 22
$$ [...]
##$TP07= 0
##$TPNAME0= <>
##$TPNAME1= <>
##$TPNAME2= <>
##$TPNAME3= <>
##$TPNAME4= <>
##$TPNAME5= <>
##$TPNAME6= <>
##$TPNAME7= <>
##$TPOAL= (0..7)
0.5 0.5 0.5 0.5 0.5 0.5 0.5 0.5
##$TPOFFS= (0..7)
0 0 0 0 0 0 0 0
##$TUNHIN= 0
##$TUNHOUT= 0
##$TUNXOUT= 0
##$USERA1= <user>
##$USERA2= <user>
##$USERA3= <user>
##$USERA4= <user>
##$USERA5= <user>
##$V9= 5
##$VALIST= <valist>
##$VCLIST= <CCCCCCCCCCCCCCC>
##$VD= 0
##$VDLIST= <DDDDDDDDDDDDDDD>
##$VPLIST= <PPPPPPPPPPPPPPP>
##$VTLIST= <TTTTTTTTTTTTTTT>
##$WBST= 2048
##$WBSW= 25
##$XGAIN= (0..3)
0 0 0 0
##$XL= 0
##$YL= 0
##$YMAX_a= 6075273
##$YMIN_a= -13599722
##$ZGOPTNS= <>
##$ZL1= 120
##$ZL2= 120
##$ZL3= 120
##$ZL4= 120
##$ABSF1= 14.96097
##$ABSF2= -5.597212
##$ABSG= 5
##$ABSL= 3
##$ALPHA= 0
##$AQORDER= 0
##$ASSFAC= 0
##$ASSFACI= 0
##$ASSFACX= 0
##$ASSWID= 0
##$AUNMP= <proc_prof1d_extract.lims>
##$AXLEFT= 0
##$AXNAME= <>
##$AXNUC= <1H>
##$AXRIGHT= 0
##$AXTYPE= 0
##$AXUNIT= <>
##$AZFE= 0.1
##$AZFW= 0.1
##$BCFW= 0
##$BC_mod= 0
##$BYTORDP= 0
##$COROFFS= 0
##$CY= 15
##$DATMOD= 1
##$DC= 0
##$DFILT= <>
##$DTYPP= 0
##$F1P= 0
##$F2P= 0
##$FCOR= 0.5
##$FTSIZE= 131072
##$FT_mod= 6
##$GAMMA= 0
##$GB= 0
##$INTBC= 1
##$INTSCL= 1
##$ISEN= 128
##$LB= 0.3
##$LEV0= 0
##$LPBIN= 0
##$MAXI= 10000
##$MC2= 0
##$MEAN= 0
##$ME_mod= 0
##$MI= 0
##$NCOEF= 0
##$NC_proc= -2
##$NLEV= 6
##$NOISF1= 0
##$NOISF2= 0
##$NSP= 0
##$NTH_PI= 0
##$NZP= 0
##$OFFSET= 14.96097
##$PC= 1
##$PHC0= -78.0304
##$PHC1= 0
##$PH_mod= 1
##$PKNL= yes
##$PPARMOD= 0
##$PPDIAG= 0
##$PPIPTYP= 0
##$PPMPNUM= 2147483647
##$PPRESOL= 1
##$PSCAL= 4
##$PSIGN= 0
##$PYNMP= <proc.py>
##$REVERSE= no
##$SF= 400.020009647028
##$SI= 131072
##$SIGF1= 0
##$SIGF2= 0
##$SINO= 400
##$SIOLD= 131072
##$SPECTYP= <>
##$SREGLST= <1H.CDCl3>
##$SSB= 0
##$STSI= 131072
##$STSR= 0
##$SW_p= 8223.68421052631
##$SYMM= 0
##$S_DEV= 0
##$TDeff= 65536
##$TDoff= 0
##$TI= <>
##$TILT= no
##$TM1= 0
##$TM2= 0
##$TOPLEV= 0
##$USERP1= <user>
##$USERP2= <user>
##$USERP3= <user>
##$USERP4= <user>
##$USERP5= <user>
##$WDW= 1
##$XDIM= 131072
##$YMAX_p= 436360035
##$YMIN_p= -16585
##$CURPLOT= <Network HP LaserJet P1505>
##$CURPRIN= <$Network HP LaserJet P1505>
##$DFORMAT= <normdp>
##$LAYOUT= <+/1D_H.xwp>
##$LFORMAT= <normlp>
##$PFORMAT= <normpl>
##$SURQMSG= 1
$$ End of Bruker specific parameters
$$ ---------------------------------
##NTUPLES= NMR SPECTRUM
##VAR_NAME=  FREQUENCY,     SPECTRUM/REAL,   SPECTRUM/IMAG
##SYMBOL=    X,             R,               I
##VAR_TYPE=  INDEPENDENT,   DEPENDENT,       DEPENDENT
##VAR_FORM=  AFFN,          ASDF,            ASDF
##VAR_DIM=   131072,        131072,          131072
##UNITS=     HZ,            ARBITRARY UNITS, ARBITRARY UNITS
##FACTOR=    0.0627417313425164, 1,          1
##FIRST=     8223.62146879497, -1305,        -62785
##LAST=      0,             -236,            -63368
##MIN=       0,             -16585,          0
##MAX=       8223.62146879497, 436360035,    0
$$ Real data points
##PAGE= N=1
##DATA TABLE= (X++(R..R)), XYDATA
$$ [...]
63923E131604r634m7946q6686j24291j58870j89011k13460k31079k41704k46457
$$ 5131604 5121970 5074024 4987338 4863047 4704177 4515166 4301706 4070627 3828923 3582466
63913C582466k46743k43443k37171k28427k17080k02593j85414j67381j50043
$$ 3582466 3335723 3092280 2855109 2626682 2409602 2207009 2021595 1854214 1704171
63904A704171j33328j16679j00793q7131p6008o6329n7237m9024m2213l6578l1554
$$ 1704171 1570843 1454164 1353371 1266240 1190232 1123903 1066666 1017642 975429 938851 907297
63893I07297k7144k3933k2228k1540k1003k0283j9818k0030k0481k0302j9297
$$ 907297 880153 856220 833992 812452 791449 771166 751348 731318 710837 690535 671238
63882F71238j8066j7013j5886j4486j3080j1725r859p169m278j949l5K085M435
$$ 671238 653172 636159 620273 605787 592707 580982 571123 563954 559676 557727 557692 559777 564212
63869E64212O535Q337J0275J2409J4191J5243J5880J6623J7509J8046J7840J7141
$$ 564212 570747 579084 589359 601768 615959 631202 647082 663705 681214 699260 717100 734241
63857G34241J6643J6518J5904J3864J0831Q297O956N901M088J728m24k345m445
$$ 734241 750884 767402 783306 797170 808001 816298 823254 829155 833243 834971 834547 832202 827757
63844H27757o570q356j0214j2912j6195j8847k0259k1143k2435k4193k5820k6809
$$ 827757 821187 812831 802617 789705 773510 754663 734404 713261 690826 666633 640813 614004
63832F14004k6921k6093k4536k2754k1186j9967j9016j8234j7510j6708j5726
$$ 614004 587083 560990 536454 513700 492514 472547 453531 435297 417787 401079 385353
63821C85353j4552j3279j2025j0755r257p592o364o041o078n476m324l892m689
$$ 385353 370801 357522 345497 334742 325485 317893 311529 305488 299410 293934 289610 285718 281029
63808B81029n394m515k455q91n10m73JN75N29k71j384k266k575k383k193k414
$$ 281029 275635 271120 268665 267774 267264 266791 266792 267367 267896 267625 266241 263975 261400 259017 256824 254410
63792B54410k877l167l244l277l122k538j781j357j256j047o63m80n67n60m00
$$ 254410 251533 248366 245122 241845 238723 236185 234404 233047 231791 230744 230081 229601 229034 228474 228074
63777B28074n62j293k072k149j383l28L37L89K06K96O04N65k5n80n29j71j56n40
$$ 228074 227512 226219 224147 221998 220615 220287 220624 221013 221219 221515 222119 222684 222659 222079 221550 221379 221223 220683
63759B20683q86j082j341j526j215m48K07L39Mn67j046r54j13J000J860K620L536
$$ 220683 219797 218715 217374 215848 214633 214185 214392 214731 214735 214168 213122 212168 212055 213055 214915 217535 221071
63742B21071L955K951R09n49m41O23J631K280K561K186J184L99O28J615K454K685
$$ 221071 225026 227977 228886 228337 227896 228519 230150 232430 234991 237177 238361 238760 239388 241003 243457 246142
63726B46142K523K330K354K793L604M381M742M755M744M777M620M085L286K569
$$ 246142 248665 250995 253349 256142 259746 264127 268869 273624 278368 283145 287765 291850 295136 297705
63712B97705K223K125J786R08j78r44j406j989k691k930k386j519r41o75l22K56
$$ 297705 299928 302053 303839 304747 304569 303625 302219 300230 297539 294609 292223 290704 289763 289088 288766 289022
63696B89022Q02J073J146J343J944K895L733L973L553K870K397K300K347K072
$$ 289022 289824 290897 292043 293386 295330 298225 301958 305931 309484 312354 314751 317051 319398 321470
63682C21470J221J38n15n34l45k39M6O46R51L23r14j806j844j120J79J737K772
$$ 321470 322691 322829 322314 321780 321435 321196 321242 321888 322839 323162 322248 320442 318598 317478 317657 319394 322166
63665C22166K624J695J084J271J736J794J131l25k280l890m449m320m411m876
$$ 322166 324790 326485 327569 328840 330576 332370 333501 333176 330896 327006 322557 318237 313826 308950
63651C08950n119m999m961m929m222k812j644j286j279j180j192j292p19Q78K644
$$ 308950 303831 298832 293871 288942 284720 281908 280264 278978 277699 276519 275327 274035 273316 274194 276838
63636B76838L592L816L946M089M071M103M420M716M681M632M964N423N626N943
$$ 276838 280430 284246 288192 292281 296352 300455 304875 309591 314272 318904 323868 329291 334917 340860
63622C40860O961Q378R241R231R040R485J0782J2601J4369J5569J6191J6955J8760
$$ 340860 347821 356199 365440 374671 383711 393196 403978 416579 430948 446517 462708 479663 498423
63609D98423K1828K5519K8914L1477L3442L5577L8246M0574M0957L8576L3978
$$ 498423 520251 545770 574684 606161 639603 675180 713426 754000 794957 833533 867511
63598H67511K8072K1263J3893O818Q30l977p710r951j0322r462q712q911j0064
$$ 867511 895583 916846 930739 937557 938387 934410 926700 916749 906427 896965 888253 879342 869278
63585H69278j2076j5152j9298k3862k7799l0304l1163l0690k9315k7351k5113
$$ 869278 857202 842050 822752 798890 771091 740787 709624 678934 649619 622268 597155
63574E97155k3000k1045j8628j5284j1716r160p693o067l484o10J625L365N192
$$ 597155 574155 553110 534482 519198 507482 498322 490629 484562 481078 480468 482093 485458 490650
63561D90650O980Q159Q716R037R189R067Q911R094R610J0357J1585J3477J5781
$$ 490650 497630 505789 514505 523542 532731 541798 550709 559803 569413 579770 591355 604832 620613
63548F20613J8390K1830K6477L1682L6392M0354M3935M7037M8720M7648M2533
$$ 620613 639003 660833 687310 718992 755384 795738 839673 886710 935430 983078 1025611
63537A025611L2858K0003P119l074j0013j4314j5927j4625j1609r075q110q273
$$ 1025611 1058469 1078472 1085591 1082517 1072504 1058190 1042263 1027638 1016029 1006954 998844 990571
63525I90571r318j1895j6327k1826k7395l2486l6568l9037l9965m0004l9224l7023
$$ 990571 981253 969358 953031 931205 903810 871324 834756 795719 755754 715750 676526 639503
63513F39503l3534l0077k7582k5474k2854j9947j7589j5884j4290j2601j1062
$$ 639503 605969 575892 548310 522836 499982 480035 462446 446562 432272 419671 408609
63502D08609r729q474p436o872o635o231n447m487l613k971k616k387j817n96
$$ 408609 398880 390406 382970 376098 369463 363232 357785 353298 349685 346714 344098 341711 339894 339298
63488C39298Q47J542R48l70j176p01O12J656J902J837K101K612K921L053L371
$$ 339298 340145 341687 342635 342265 341089 340388 341000 342656 344558 346395 348496 351108 354029 357082 360453
63473C60453L851M076L914L570L000J944N66o65j774l187m666n225m515l516l242
$$ 360453 364304 368380 372294 375864 378864 380808 381374 380709 378935 375748 371082 365857 361342 357826 354584
63458C54584l429l116k079r53k68J6J74M60J027J712K092K164K618L927N515O431
$$ 354584 351155 348039 345960 345007 344739 344755 344929 345389 346416 348128 350220 352384 355002 358929 364444 370875
63442C70875O650O997P930R029R819J0409J1178J2325J3992J6424J9695K3462
$$ 370875 377525 384522 392452 401481 411300 421709 432887 445212 459204 475628 495323 518785
63430E18785K7180L0250L1918L1362K8296K3387J7914J3080R668Q122Q585J0776
$$ 518785 545965 576215 608133 639495 667791 691178 709092 722172 731840 739962 748547 759323
63418G59323J4084J7991K2470K7786L3784L9477M3645M5875M6618M5979M2952
$$ 759323 773407 791398 813868 841654 875438 914915 958560 1004435 1051053 1097032 1139984
63407A139984L6406K6730J5929O003k256q791j3252j5126j4664j3139j2079j2457
$$ 1139984 1176390 1203120 1219049 1225052 1222796 1214005 1200753 1185627 1170963 1157824 1145745 1133288
63395A133288j4493j7935k2328k7232l2253l6895m0520m2687m3407m2885m1143
$$ 1133288 1118795 1100860 1078532 1051300 1019047 982152 941632 898945 855538 812653 771510
63384G71510l8248l4804l1713k9273k6922k4021k0575j6972j3412r978o959m677
$$ 771510 733262 698458 666745 637472 610550 586529 565954 548982 535570 525592 518633 513956
63372E13956l036j557J90K402N047P811J0195J2001J3533J5116J6712J8346K0423
$$ 513956 510920 509363 509553 511955 517002 524813 535008 547009 560542 575658 592370 610716 631139
63359F31139K3067K5549K7245K8869L1789L6070M0233M3146M5119M6664M7133
$$ 631139 654206 679755 707000 735869 767658 803728 843961 887107 932226 978890 1026023
63348A026023M5355M0950L4272K5651J5603N425l299r752j3953j6023j6098j4906
$$ 1026023 1071378 1112328 1146600 1172251 1187854 1193279 1189980 1180228 1166275 1150252 1134154 1119248
63336A119248j3711j3539j4753j7297k0916k5152k9505l3644l7229l9728m0691
$$ 1119248 1105537 1091998 1077245 1059948 1039032 1013880 984375 950731 913502 873774 833083
63325H33083m0115l8241l5203l1195k6785k2578j8743j5121j1625q214m964k681
$$ 833083 792968 754727 719524 688329 661544 638966 620223 605102 593477 585263 580299 577618
63313E77618k896o446j2126j7438k0639k1469k0363j7954j5362j3753j3127j2292
$$ 577618 574722 568276 556150 538712 518073 496604 476241 458287 442925 429172 416045 403753
63301D03753j0433q111o364n443m900m374l786l167k728k792l300l684l602l385
$$ 403753 393320 385209 378845 373402 368502 364128 360342 357175 354447 351655 348355 344671 341069 337684
63287C37684l416l472l142k606k393k574k727k630k468k323j993j380p24l05j67
$$ 337684 334268 330796 327654 325048 322655 320081 317354 314724 312256 309933 307940 306560 305836 305531 305364
63272C05364k27l85m17k3P93J608J988J964J832J670J329R40R92J648K326K378
$$ 305364 305137 304752 304335 304312 305105 306713 308701 310665 312497 314167 315496 316436 317428 319076 321402 323780
63256C23780K031K115K856L561L743L914M768O004O678O568O400O632O828O566
$$ 323780 325811 327926 330782 334343 338086 342000 346768 352772 359450 366018 372418 379050 385878 392444
63242C92444O435P450R613J1687J2571J2577J3037J4731J7028J8716J9396J9760
$$ 392444 398879 406329 415942 427629 440200 452777 465814 480545 497573 516289 535685 555445
63230E55445K0560K1760K2856K3659K4377K5063K5378K4998K4085K3270K3120
$$ 555445 576005 597765 620621 644280 668657 693720 719098 744096 768181 791451 814571
63219H14571K3616K4206K4512K4845K5744K7049K7819K7241K5239K2049J7759
$$ 814571 838187 862393 886905 911750 937494 964543 992362 1019603 1044842 1066891 1084650
63208A084650J2526O821J059m780j0852j6975k2709k7511l0712l1892l1615l1126
$$ 1084650 1097176 1103997 1105056 1100276 1089424 1072449 1049740 1022229 991517 959625 928010 896884
63196H96884l0910l0092k7780k4376k0812j7213j3256r335o214l708q56K673O318
$$ 896884 865974 835882 808102 783726 762914 745701 732445 723110 716896 713188 712332 715005 721323
63183G21323R712J2928J5667J7372J8373J9751K1718K3203K3521K3374K3552K3641
$$ 721323 731035 743963 759630 777002 795375 815126 836844 860047 883568 906942 930494 954135
63171I54135K2929K1839K1388K1599K1385J9876J7135J3600R472M704p58o799
$$ 954135 977064 998903 1020291 1041890 1063275 1083151 1100286 1113886 1123358 1128062 1127304 1120505
63159A120505j2919j8380k2853k6756l0682l4544l7576l9067l8989l7893l6381
$$ 1120505 1107586 1089206 1066353 1039597 1008915 974371 936795 897728 858739 820846 784465
63148G84465l4641l2459k9750k6846k4117k1483j8750j6178j4211j2736j1243
$$ 784465 749824 717365 687615 660769 636652 615169 596419 580241 566030 553294 542051
63137E42051r702q562p787o748n305m139l602l026j801l38O90J429K345L206L502
$$ 542051 532349 523787 516000 509252 503947 499808 496206 493180 491379 491041 491731 493160 495505 498711 502213
63122E02213L531M021M850N182M953N138O224P257P078N869M820M537M438L709
$$ 502213 505744 509765 514615 519797 524750 529888 536112 543369 550447 556316 561136 565673 570111 573820
63108E73820K344J111P93J567K822L464K681Q02p79q32L58J229O78p27j530j144
$$ 573820 576164 577275 578068 579635 582457 585921 588602 589404 588625 587793 588151 589380 590058 589331 587801 586657
63092E86657m15m29j184j712j283k55M22M05L61R63J815J935J254Q88J644K932
$$ 586657 586242 585813 584629 582917 581634 581379 581801 582206 582567 583530 585345 587280 588534 589422 591066 593998
63076E93998L711L872M059M565N178N826O605P412Q172R191J0552J1557J1699
$$ 593998 597709 601581 605640 610205 615383 621209 627814 635226 643398 652589 663141 674698 686397
63063F86397J1788J3062J5322J7238J8433J9900K2204K4711K7073L0030L3914
$$ 686397 698185 711247 726569 743807 762240 782140 804344 829055 856128 886158 920072
63052I20072L7655M0312M2645M5929M9973N3416N5591N6982N8149N9150N9930
$$ 920072 957727 998039 1040684 1086613 1136586 1190002 1245593 1302575 1360724 1419874 1479804
63041A479804O0422O0293N9336N8071N7417N7702N8414N8808N8501N7656N6850
$$ 1479804 1540226 1600519 1659855 1717926 1775343 1833045 1891459 1950267 2008768 2066424 2123274
63030B123274N6369N5343N2051M5535L6474K6037J4437J339j2868k7058m0409
$$ 2123274 2179643 2234986 2287037 2332572 2369046 2395083 2409520 2410859 2397991 2370933 2330524
63019B330524n2603o3169p1378p6911p9975q0742p9209p5576p0283o3606n5724
$$ 2330524 2277921 2214752 2143374 2066463 1986488 1905746 1826537 1750961 1680678 1617072 1561348
63008A561348m7192l8856l1140k3694j5891p511J042R047J5969K1732K6441L0054
$$ 1561348 1514156 1475300 1444160 1420466 1404575 1397064 1398106 1407153 1423122 1444854 1471295 1501349
62996A501349L2591L4550L6504L8208L8886L8605L8523L9322M0183L9950L8685
$$ 1501349 1533940 1568490 1604994 1643202 1682088 1720693 1759216 1798538 1838721 1878671 1917356
62985A917356L7166L5440L2805K8899K3899J7767J0137R60r367k0402l1583m1990
$$ 1917356 1954522 1989962 2022767 2051666 2075565 2093332 2103469 2104429 2095062 2074660 2043077 2001087
62973B001087n0839n8161o4389o9409p2599p3655p2722p0026o6043o1830n8236
$$ 2001087 1950248 1892087 1827698 1758289 1685690 1612035 1539313 1469287 1403244 1341414 1283178
62962A283178n4810n0414m5011l9976l6430l3990l1617k8951k6437k4547k3363
$$ 1283178 1228368 1177954 1132943 1092967 1056537 1022547 990930 961979 935542 910995 887632
62951H87632k2675k2138k1461k0629j9857j9290j8851j8355j7608j6597j5618
$$ 887632 864957 842819 821358 800729 780872 761582 742731 724376 706768 690171 674553
62940F74553j4983j4439j3285j1397r638q787q501p934o903n810m765l680k926
$$ 674553 659570 645131 631846 620449 610811 602024 593523 585589 578686 572876 568111 564431 561505
62927E61505k906l164k810j892j305j351j337q62m52n18o30l81k66j003k406l565
$$ 561505 558599 555435 552625 550733 549428 548077 546740 545878 545426 544908 544278 543897 543631 542628 540222 536657
62911E36657l837l338k671k518l153m069m376l804l018k733k897l041l040l076
$$ 536657 532820 529482 526811 524293 521140 517071 512695 508891 505873 503140 500243 497202 494162 491086
62897D91086l077k630j487O5J369J907J708J246Q60M27k64j057j654k012k131
$$ 491086 488009 485379 483892 483957 485326 487233 488941 490187 491047 491474 491210 490153 488499 486487 484356
62882D84356j681m97P11Q85k5r15r23l53M2N8n6j67k74k88k57n54j357k153k214
$$ 484356 482675 482178 482889 483774 483749 482834 481911 481558 481600 481658 481602 481435 481161 480873 480616 480062 478705 476552 474338
62863D74338j508p77o77j091j397j181o03l1M15Q86J384J669J643J541J551J535
$$ 474338 472830 472053 471376 470285 468888 467707 467104 467073 467488 468374 469758 471427 473070 474611 476162 477697
62847D77697J358J193J134Q95L02j98j26J92J3p10j296j402j383j509j492j112
$$ 477697 479055 480248 481382 482277 482579 482381 482255 482447 482460 481750 480454 479052 477669 476160 474668 473556
62831D73556p03p04j057j314j104l92M26P14K54l17j52P44J585J958K231K748
$$ 473556 472853 472149 471092 469778 468674 468282 468708 469422 469676 469359 469207 469951 471536 473494 475725 478473
62815D78473L266L506L647L944M328M685N056N299N040M315L846M234N241O219
$$ 478473 481739 485245 488892 492836 497164 501849 506905 512204 517244 521559 525405 529639 534880 541099
62801E41099O881P297P506P572P817Q510R456J0272J0914J1614J2438J3330J4532
$$ 541099 547980 555277 562783 570355 578172 586682 596138 606410 617324 628938 641376 654706 669238
62788F69238J6605J9840K3796K7593L0769L3834L7856M3365M9785N6216O2494
$$ 669238 685843 705683 729479 757072 787841 821675 859531 902896 952681 1008897 1071391
62777A071391O9047P5860Q2227Q7692R2560R7046J00381J01363R9508R5143Q8442
$$ 1071391 1140438 1216298 1298525 1386217 1478777 1575823 1676204 1777567 1877075 1972218 2060660
62766B060660P8974O6350N0969L3844J5896k281k0043l6431n0648o2617p2737
$$ 2060660 2139634 2205984 2256953 2290797 2306693 2304412 2284369 2247938 2197290 2134673 2061936
62755B061936q1084q7189r0800r2362r2491r1299q8666q4865q0431p5598p0347
$$ 2061936 1980852 1893663 1802863 1710501 1618010 1526711 1438045 1353180 1272749 1197151 1126804
62744A126804o4878n9552n4454m9514m4934m0968l7306l3353k9164k5481k2658
$$ 1126804 1061926 1002374 947920 898406 853472 812504 775198 741845 712681 687200 664542
62733F64542k0177j7498j4881j2876j1389r811p938o249n198m502l433j778k20
$$ 664542 644365 626867 611986 599110 587721 577910 569972 563723 558525 554023 550590 548812 548592
62720E48592M21K32J75J024K659M465N980P030P723Q576J0187J2536J5028J7496
$$ 548592 549013 549245 549420 550444 553103 557568 563548 570578 578301 586877 597064 609600 624628 642124
62706F42124K0420K3871K7074K9660L2545L6683M1652M6502N1326N6799O2644
$$ 642124 662544 686415 713489 743149 775694 812377 854029 900531 951857 1008656 1071300
62695A071300O7876P2324P6594Q0667Q3805Q5771Q6774Q6234Q2947P6686O8263
$$ 1071300 1139176 1211500 1288094 1368761 1452566 1538337 1625111 1711345 1794292 1870978 1939241
62684A939241N7841M4616K8630J1499n279k1524l7195n1280o2730p1563p8291
$$ 1939241 1997082 2041698 2070328 2081827 2076548 2055024 2017829 1966549 1903819 1832256 1753965
62673A753965q3029q5855q7149q6944q4744q0690p6009p1571o6791o0863n4301
$$ 1753965 1670936 1585081 1497932 1410988 1326244 1245554 1169545 1097974 1031183 970320 916019
62662I16019m8402m3723l9904l6511l3303l0115k7074k4561k2441j9991j7023
$$ 916019 867617 823894 783990 747479 714176 684061 656987 632426 609985 589994 572971
62651E72971j4328j2486j1034r532q555q758r602j0038r803r233q324o952n501
$$ 572971 558643 546157 535123 525591 517036 508278 498676 488638 478835 469602 461278 454326 448825
62638D48825m371l272j857n64K5K10O09J074J074P16L43l36j654k876k950k153
$$ 448825 444454 441182 439325 438761 438786 438996 439605 440679 441753 442469 442812 442476 440822 437946 434996 432843
62622D32843j720j926j830r69q9J92L14R12J855K700L443M271N042N487N653N829
$$ 432843 431123 429197 427367 426398 426309 426501 426815 427727 429582 432282 435725 439996 445038 450525 456178 462007
62606D62007O237O966Q023R236J0355J1277J2157J3293J4992J7417K0413K3654
$$ 462007 468244 475210 483233 492469 502824 514101 526258 539551 554543 571960 592373 616027
62594F16027K7015L0617L4380L7950M1175M4262M7180M9358N0175M9362M6709
$$ 616027 643042 673659 708039 745989 787164 831426 878606 927964 978139 1027501 1074210
62583A074210M2010L5600K8315K0502J1749K032p545j5872k2989k9451l5110l9352
$$ 1074210 1116220 1151820 1180135 1200637 1212386 1214418 1206873 1191001 1168012 1138561 1103451 1064099
62571A064099m2123m3790m4339m3465m1379l8859l6630l5000l3714l1935k8993
$$ 1064099 1021976 978186 933847 890382 849003 810144 773514 738514 704800 672865 643872
62560F43872k5520k2980k1571j9666j6170j2307r867q716p442n747m512m029l815
$$ 643872 618352 595372 573801 554135 537965 525658 515791 507075 499633 493886 489374 485345 481530
62547D81530l869m498n034m391k888j953j905j598n32L98O46R56J882K715K712
$$ 481530 477661 473163 468129 463738 460850 458897 456992 455394 454862 455260 455906 456862 458744 461459 464171
62532D64171K247J982J802J415J195J649K658L853N169O562P836R176J1204J3980
$$ 464171 466418 468400 470202 471617 472812 474461 477119 480972 486141 492703 500539 509715 520919 534899
62518E34899J6601J8380J9887K2249K5831L0051L4157L7782M1049M4421M8083
$$ 534899 551500 569880 589767 612016 637847 667898 702055 739837 780886 825307 873390
62507H73390N1329N3049N2878N1412M9149M5876M1224L5179K7797J9101R656O30
$$ 873390 924719 977768 1030646 1082058 1131207 1177083 1218307 1253486 1281283 1300384 1310040 1310670
62495A310670p125j3565j8839k2722k4919k5420k4189k1055j6243j0614n083m4
$$ 1310670 1303545 1289980 1271141 1248419 1223500 1198080 1173891 1152836 1136593 1125979 1120896 1120852
62483A120852M607R311J4670K0821K6916L1777L5093L7278L8181L6822L2599K6009
$$ 1120852 1125459 1134770 1149440 1170261 1197177 1228954 1264047 1301325 1339506 1376328 1408927 1434936
62471A434936J8029R494J199o413j3981k2697l2593m2135m9776n5145n8417n9657
$$ 1434936 1452965 1462459 1463658 1457245 1443264 1420567 1387974 1345839 1296063 1240918 1182501 1122844
62459A122844n9345n8490n7423n5279n1393m6450m1518l6725l1771k6976k2825
$$ 1122844 1063499 1005009 947586 892307 840914 794464 752946 716221 684450 657474 634649
62448F34649j9016j5005j1162q363o647n121l204j171N49J983L473N222P020Q258
$$ 634649 615633 600628 589466 581103 574456 569335 566131 564960 565509 567492 570965 576187 583207 591465
62434E91465Q500Q167Q183Q654Q504O855M137J325j358m270p367j0133j2168j3226
$$ 591465 599965 608132 616315 624969 633473 640328 644465 645790 644432 640162 632795 622662 610494 597268
62420E97268j3059j1934j0957j1022j1619j1482j0243q725p715p238p056p097
$$ 597268 584209 572275 561318 550296 538677 527195 516952 508227 500512 493274 486218 479121
62408D79121p184o892n959m569l155k133j748j862j988j777j380j123j043r92
$$ 479121 471937 465045 459086 454517 451362 449229 447481 445619 443631 441854 440474 439351 438308 437316
62394D37316q70m26P37K458L694L602K659K079K276K594K487K202K198K566L156
$$ 437316 436446 436020 436757 439215 442909 446511 449170 451249 453525 456119 458606 460808 463006 465572 468728
62379D68728L813M282M329M150M298N080O270P432Q281Q722Q972R616J1144J3282
$$ 468728 472541 476823 481152 485302 489600 494680 500950 508382 516663 525385 534357 543973 555117 568399
62365E68399J5176J6326J7058J8026J9587K1765K4506K7783L1664L6382M2072
$$ 568399 583575 599901 616959 634985 654572 676337 700843 728626 760290 796672 838744
62354H38744M8361N4492N9974O4788O8793P1224P1102O8042O2337N4415M4522
$$ 838744 887105 941597 1001571 1066359 1135152 1206376 1277478 1345520 1407857 1462272 1506794
62343A506794L3132K1317J0376R86p127j4686k2165k9551l6460m2297m6553m9260
$$ 1506794 1539926 1561243 1571619 1572605 1565478 1550792 1528627 1499076 1462616 1420319 1373766 1324506
62331A324506n1033n2264n2449n0689m6813m1673l6267l1145k6685k3375k1408
$$ 1324506 1273473 1221209 1168760 1118071 1071258 1029585 993318 962173 935488 912113 890705
62320H90705k0361j9650j9114j8923j9117j9556k0136k0782k1279k1333k0775
$$ 890705 870344 850694 831580 812657 793540 773984 753848 733066 711787 690454 669679
62309F69679j9669j8272j6887j5596j4133j2249j0136q262o818n644m631l799
$$ 669679 650010 631738 614851 599255 585122 572873 562737 554475 547657 542013 537382 533583
62297E33583k982j992j060n81k91O51K530M594O091P119Q032Q619Q532Q165Q326
$$ 533583 530601 528609 527549 526968 526677 527328 529858 534452 540543 547662 555694 564313 572845 581010 589336
62282E89336R208J0253J0891J0924J0287R077P848P267P312P144O087M438L107
$$ 589336 598544 608797 619688 630612 640899 649976 657824 665091 672403 679547 685634 690072 693179
62269F93179K628K752L000L329M084N377O939Q588J0595J3253J6444J9939K3936
$$ 693179 695807 698559 701559 704888 708972 714349 721288 729876 740471 753724 770168 790107 814043
62256H14043K8843L4731M1372M8591N6034O2871O8343P2384P4973P5191P1911
$$ 814043 842886 877617 918989 967580 1023614 1086485 1154828 1227212 1302185 1377376 1449287
62245A449287O5344N6802M6925L5465K2995J1317J436p582j6878k6097l4478m2530
$$ 1449287 1514631 1571433 1618358 1653823 1676818 1688135 1689571 1681989 1665111 1639014 1604536 1562006
62233A562006n1130n9575o5998o9430p0314o9230o6347o2059n7043n1522m5399
$$ 1562006 1510876 1451301 1385303 1315873 1245559 1176329 1109982 1047923 990880 939358 893959
62222H93959l9160l3816k9801k6635k3734k0888j8008j5178j2911j1698j1201
$$ 893959 854799 820983 791182 764547 740813 719925 701917 686739 673828 662130 650929
62211F50929j0582r528q325p059n617m415m126m546m586l665k295j090n7Q37J297
$$ 650929 640347 630819 622494 615435 609818 605403 601277 596731 592145 588480 586185 585095 585038 585875 587172
62196E87172J350J671K662L847M677N362O306P266P724P737P707P690P613P907
$$ 587172 588522 590193 592855 596702 601379 606741 613047 620313 628037 635774 643481 651171 658784 666691
62182F66691R115J0899J2161J2318J1818J1249J0585R620Q627P982P523O905O466
$$ 666691 675806 686705 698866 711184 723002 734251 744836 754456 763083 771065 778588 785493 791959
62169G91959P094R166J2172J5620J9691K4644L0135L5630M1111M6623N1424N4336
$$ 791959 799053 808219 820391 836011 855702 880346 910481 946111 987222 1033845 1085269 1139605
62157A139605N4932N3533N0091M4064L5628K6168J6963Q257R2o750j1698j5766
$$ 1139605 1194537 1248070 1298161 1342225 1377853 1404021 1420984 1429241 1429333 1422583 1410885 1395119
62145A395119k0846k7543l4504l9892m2929m3920m3523m2316m0633l8343l4976
$$ 1395119 1374273 1346730 1312226 1272334 1229405 1185485 1141962 1099646 1059013 1020670 985694
62134I85694l0403k5312k0847j7619j5113j2322r080o523n826o668p508p450p030
$$ 985694 955291 929979 909132 891513 876400 864078 854998 848475 842649 835981 828473 821023 813993
62121H13993p032p239o837n485l399q92J622L473M139L578J851j055m566p257
$$ 813993 806961 799722 792885 787400 784001 783109 784731 788204 792343 795921 797772 796717 792151 784894
62107G84894p982p057n723m787m311m229m579n306o416q008r676j0275r109o934
$$ 784894 776912 769855 764132 759345 755034 750805 746226 740920 734504 726496 716820 706545 697436 690502
62093F90502n042l628j968K9J506J956J919K203L077M342N657O625P086P369P904
$$ 690502 685460 681832 679864 679893 681399 683355 685274 687477 690554 694896 700553 707178 714264 721633 729537
62078G29537Q715R726J1275J3600J6130J7991J9140K0125K0888K0708J9508J8259
$$ 729537 738252 747978 759253 772853 788983 806974 826114 846239 867127 887835 907343 925602
62066I25602J7855J8301J9246K0737K3077K6322L0088L3602L6072L7385L8071
$$ 925602 943457 961758 981004 1001741 1024818 1051140 1081228 1114830 1150902 1188287 1226358
62055A226358L8054L5930L0460K2513J4433P551J413m615j0379j5865k1789k8471
$$ 1226358 1264412 1300342 1330802 1353315 1367748 1375299 1376712 1372097 1361718 1345853 1324064 1295593
62043A295593l5087m0644m4978m8257n0281n0970n0797n0067m8283m4984m0723
$$ 1295593 1260506 1219862 1174884 1126627 1076346 1025376 974579 924512 876229 831245 790522
62032G90522l6544l2871k9444k6039k2685j9444j6494j4179j2602j1345r978q538
$$ 790522 753978 721107 691663 665624 642939 623495 607001 592822 580220 568875 558897 550359
62020E50359p283o305n704n697o161o451o117n478n128n117n087m889m655m352
$$ 550359 543076 536771 531067 525370 519209 512758 506641 501163 496035 490918 485831 480942 476287 471935
62006D71935l802l035k327j782j143p1J385K710L369L425L474L774L808L122K269
$$ 471935 468133 465098 462771 460989 459846 459775 461160 463870 467239 470664 474138 477912 481720 484842 487111
61991D87111K145K614K610J630K89q20j904l229m469n280n929o790p718q390q803
$$ 487111 489256 491870 494480 496110 496399 495579 493675 490446 485977 480697 474768 467978 460260 451870 443067
61976D43067q966q600p654o611n783m762l195j659j043j358j808j918j903k004
$$ 443067 434101 425501 417847 411236 405453 400691 397496 395837 394794 393436 391628 389710 387807 385803
61962C85803k089j986j761j558j425j335j181q28l66j42k65k57M64J813L075L713
$$ 385803 383714 381728 379967 378409 376984 375649 374468 373640 373274 373132 372867 372610 373074 374887 377962 381675
61946C81675L898M190M917N985P140Q272R352J0238J0773J1114J1636J2367J2843
$$ 381675 385573 389763 394680 400665 407805 416077 425429 435667 446440 457554 469190 481557 494400
61933D94400J2869J2991J3689J4389J4021J2420J0544R212Q352P494O314M584
$$ 494400 507269 520260 533949 548338 562359 574779 585323 594535 602887 610381 616695 621279
61921F21279K271q7j725k643l617n046o435p269p656p736p107n366k714L71L555
$$ 621279 623550 623463 621738 619095 615478 610432 603997 596728 589072 581336 574229 568863 566149 566520 570075
61906E70075O382Q277R258J0152J1500J2724J2856J1708R767P382M630J701j151
$$ 570075 576457 584734 593992 604144 615644 628368 641224 652932 662699 670081 674711 676412 675261
61893F75261l811o170p949r030r621r864r661r123q671q340p538o003m477l936
$$ 675261 671450 665280 657331 648301 638680 628816 619155 610032 601361 593021 585483 579480 575003 571067
61879E71067m490n540o613p513q043q148q048p804p122o009n166n130n476n353
$$ 571067 566577 561037 554424 546911 538868 530720 522672 514868 507746 501737 496571 491441 485965 480612
61865D80612m536l283j634M50K487L777M254M474M862N445O208P214Q458J0007
$$ 480612 476076 472793 471159 471609 474096 477873 482127 486601 491463 496908 503116 510330 518788 528795
61851E28795J2097J4756J7515J9818K1465K2369K2401K1804K1255K0971K0306
$$ 528795 540892 555648 573163 592981 614446 636815 659216 681020 702275 723246 743552
61840G43552J8787J6879J5029J2581Q678L788p56m442p685j0417j1741j1181r274
$$ 743552 762339 779218 794247 806828 815506 819294 818538 814096 806411 795994 784253 773072 763798
61827G63798o742l926j203J039L069N568Q333J0170J0481J0125J0012R567P469
$$ 763798 757056 753130 751927 752966 756035 761603 769936 780106 790587 800712 810724 820291 827760
61814H27760L484j214n455r017j2197j5031j7271j8783j9594j9650j8774j7022
$$ 827760 831244 830030 824575 815558 803361 788330 771059 752276 732682 713032 694258 677236
61802F77236j4935j3219j2159j1500j0943j0487j0190r879r355q669p958p200
$$ 677236 662301 649082 636923 625423 614480 603993 593803 583924 574569 565900 557942 550742
61790E50742o350n537m896m397m040l974m180m274l993l564l344l295l131k773
$$ 550742 544392 538855 533959 529562 525522 521548 517368 513094 509101 505537 502193 498898 495767 492994
61776D92994k374k109k193k711l220l003k022j119q06m83M66J480J604J035Q04
$$ 492994 490620 488511 486318 483607 480387 477384 475362 474243 473437 472954 473420 474900 476504 477539 478343
61761D78343J142J279R34Q77J681K741L051K411J498J110J479K045J901P65n29
$$ 478343 479485 480764 481698 482575 484256 486997 490048 492459 493957 495067 496546 498591 500492 501257 500728
61746E00728j069j095j534k509l169l047k649k513k543k581k764k906k355j062
$$ 500728 499659 498564 497030 494521 491352 488305 485656 483143 480600 478019 475255 472349 469994 468932
61732D68932o6k04r41j166o79j47J04M06J006J711K354L017L638L835L282K103
$$ 468932 468866 468662 467721 466555 465876 465729 465833 466239 467245 468956 471310 474327 477965 481800 485082 487185
61716D87185Q40J24K74R52J342R15j6p44j018j205j619k114k461k764l231l733
$$ 487185 488025 488149 488423 489375 490717 491632 491616 490872 489854 488649 487030 484916 482455 479691 476460 472727
61700D72727l888l583l168l054l316l759m188m450m441m252m209m451m563m049
$$ 472727 468839 465256 462088 459034 455718 451959 447771 443321 438880 434628 430419 425968 421405 417356
61686D17356l118k590k845l360l442l040k479j890j233o58l90m90j021k099l384
$$ 417356 414238 411648 408803 405443 402001 398961 396482 394592 393359 392701 392311 391821 390800 388701 385317
61671C85317l875k814o86J211K064J962J287M04j64%O00P97K66m36o52l14K50
$$ 385317 381442 378628 377942 379153 381217 383179 384466 384870 384706 384706 385306 386103 386369 385933 385281 384967 385217
61654C85217P53R79Q40O61R79J820K542K667K480K486K628K525K201K044K092
$$ 385217 385970 386949 387789 388450 389429 391249 393791 396458 398938 401424 404052 406577 408778 410822 412914
61639D12914J884J147K90q0Q6K83Q7l79o99o92n83p23j237j896k292k179j808
$$ 412914 414798 415945 416235 416155 416241 416524 416611 416232 415533 414841 414258 413535 412298 410402 408110 405931 404123
61622D04123j739k218k839k994k583j988j522j261j298j696k127k071j513j029
$$ 404123 402384 400166 397327 394333 391750 389762 388240 386979 385681 383985 381858 379787 378274 377245
61608C77245j011j275j581k064k900l874m574m709m150l069k118j953k375k540
$$ 377245 376234 374959 373378 371314 368414 364540 359966 355257 351107 348038 345920 343967 341592 339052
61594C39052k197j993k292k494k037j380j274j698k157k506k777k726k294j973
$$ 339052 336855 334862 332570 330076 328039 326659 325385 323687 321530 319024 316247 313521 311227 309254
61580C09254k034j841q39L45P14L64J70K74J9q01j588j852j657j188o39l91n42
$$ 309254 307220 305379 304540 304885 305599 305963 306133 306407 306426 305625 304037 302185 300528 299340 298701 298310 297768
61563B97768n01J60Q69R63R88J839K946K848J548P33J330K247K200J482J149J384
$$ 297768 297267 297427 298296 299259 300247 302086 305032 307880 309428 310161 311491 313738 315938 317420 318569 319953
61547C19953J563J293O95J17k2M30R52Q16J64j33J61L23n8l44L6P17J138J471
$$ 319953 321516 322809 323504 323621 323599 324029 324981 325797 325961 325828 325989 326312 326254 325910 325946 326663 327801 329272
61529C29272K037K474K217J369N13j8k23k01k11o08j362j994k224k206k019j508
$$ 329272 331309 333783 336000 337369 337882 337864 337641 337440 337229 336621 335259 333265 331041 328835 326816 325308
61513C25308q02l57k29l1K12Pn19m76L92J081P49j51p84j144j474j457r29o21
$$ 325308 324506 324149 323920 323889 324101 324108 323589 323113 323505 324586 325335 325184 324400 323256 321782 320325 319396 318775
61495C18775j059j378m11J414K523K297J505P86j6q39j008k80N93R06Q88J079
$$ 318775 317716 316338 315927 317341 319864 322161 323666 324452 324436 323597 322589 322309 322902 323808 324696 325775
61479C25775J368J339J176J555K616L594L652K848K010J748J861J870J663J401
$$ 325775 327143 328482 329658 331213 333829 337423 341075 343923 345933 347681 349542 351412 353075 354476
61465C54476J051N85M00Q67J451J090l76j857k362k055j627j347j211j335j515
$$ 354476 355527 356112 356512 357379 358830 359920 359544 357687 355325 353270 351643 350296 349085 347750 346235
61450C46235j095N5R08M97o52j149n52L46Q56J052J090P85K20nM86J266J656J519
$$ 346235 345140 345195 346103 346600 345948 344799 344247 344593 345449 346501 347591 348376 348596 348591 349077 350343 351999 353518
61432C53518J230J080J026R06O55L57J81K40M80P06P29N14K20J67O01J491K491
$$ 353518 354748 355828 356854 357760 358415 358772 358953 359193 359673 360379 361108 361622 361842 362009 362610 364101 366592
61415C66592L118K989K070Q80J85K69O42P46O61P01O63J27p19j237j334j466j680
$$ 366592 369710 372699 374769 375649 375834 376103 376745 377491 378152 378853 379516 379643 378924 377687 376353 374887 373207
61398C73207j434n99K39O57Q69R78O87J06jO11J105P89J94J91O76R29P80N35K46
$$ 373207 371773 371174 371413 372070 372939 373917 374604 374710 374709 375320 376425 377214 377408 377599 378275 379204 379984 380519 380765
61379C80765j74l42K06J253K164K740L165L403L198K579J764Q50J36L00J607L146
$$ 380765 380591 380249 380455 381708 383872 386612 389777 393180 396378 398957 400721 401571 401707 402007 403614 406760
61363D06760L655K912J735Q61N01P03J359J937K045K137K972M306M983M417L344
$$ 406760 410415 413327 415062 415923 416424 417127 418486 420423 422468 424605 427577 431883 436866 441283 444627
61348D44627K835L141L694L826L300K378J554J091R24J070J730K701L185K714
$$ 444627 447462 450603 454297 458123 461423 463801 465355 466446 467370 468440 470170 472871 476056 478770
61334D78770J884J540J620J458R08L39j87q49j385j395j240j604k181j874n10
$$ 478770 480654 482194 483814 485272 486180 486519 486332 485483 484098 482703 481463 479859 477678 475804 475294
61319D75294O77P88M46P13J636K596L466M578N965P318Q557R805J0987J1900J2625
$$ 475294 475971 476759 477205 477918 479554 482150 485616 490194 496159 503477 512034 521839 532826 544726 557351
61304E57351J3437J4403J5346J6113J6475J6012J4454J2122R569O935M048J206
$$ 557351 570788 585191 600537 616650 633125 649137 663591 675713 685282 692217 696265 697471
61292F97471q66k002l050m807o890q307q924r624j0843j1773j1529j0520r907
$$ 697471 696605 694603 691553 686746 679856 671549 662625 653001 642158 630385 618856 608336 598429
61279E98429r999r973r160p845o651n718m785l671k418j221l74MK51Q40J708K299
$$ 598429 588430 578457 569297 561452 554801 549083 544298 540627 538209 536988 536614 536618 536869 537709 539417 541716
61263E41716K246J733J222J241K228L984N445N778N534N773O219N568L753K398
$$ 541716 543962 545695 546917 548158 550386 554370 559815 565593 571127 576900 583119 588687 592440 594838
61249E94838K424K668J816M76M6M80N79j10j019j772k457k857k629k085j927k204
$$ 594838 597262 599930 601746 602222 602268 602748 603327 603217 602198 600426 597969 595112 592483 590398 588471 586267
61233E86267k384k217j804j055M3R60J359J957L637N955P601Q211Q552R016R184
$$ 586267 583883 581666 579862 578807 578850 579810 581169 583126 586763 592718 600319 608530 617082 626098 635282
61218F35282R004R223J0271J1564J2265J2101J1280J0273R660R512Q955P235N024
$$ 635282 644286 653509 663780 675344 687609 699710 710990 721263 730923 740435 749390 756625 761649
61205G61649L763L765M053M066M246M779N111N126N636P100Q850J0258J1597J3118
$$ 761649 765412 769177 773230 777296 781542 786321 791432 796558 802194 809294 818144 828402 839999 853117
61191H53117J4213J4346J3957J3569J2713J0675P865N341L487J865K36j200k417
$$ 853117 867330 881676 895633 909202 921915 932590 940455 945796 949283 951148 951384 950184 947767
61178I47767l676n027o260p325q310r020r161q882q738r034r583j0170j0881j1833
$$ 947767 944091 939064 932804 925479 917169 908149 898988 890106 881368 872334 862751 852581 841700 829867
61164H29867j2815j3398j3403j3145j3140j3513j3794j3471j2632j1829j1340
$$ 829867 817052 803654 790251 777106 763966 750453 736659 723188 710556 698727 687387
61153F87387j0876j0032q695o998n221l770k924k383j459J5J197R48r66l506n190
$$ 687387 676511 666479 657784 650786 645565 641795 638871 636488 635029 635044 636241 637189 636223 632717 627527
61138F27527n280m261l223k764k575k095j207j58R65K267L768N407P167Q879J0126
$$ 627527 622247 617986 614763 611999 609424 607329 606122 605964 606929 609196 612964 618371 625538 634417 644543
61123F44543J0821J1668J3501J6218J8877K0855K2418K4086K5893K7479K8567
$$ 644543 655364 667032 680533 696751 715628 736483 758901 782987 808880 836359 864926
61112H64926K9235K9812L0543L1180L1117L0136K8801K7755K6856K5446K3312
$$ 864926 894161 923973 954516 985696 1016813 1046949 1075750 1103505 1130361 1155807 1179119
61101A179119K0864J8451J5962J3105R679N688J504k273n426q397j1544j4468
$$ 1179119 1199983 1218434 1234396 1247501 1257180 1262868 1264372 1262099 1256673 1248276 1236732 1222264
61089A222264j6623j8192j9709k1017k1440k0889k0001j9150j8066j6575j5004
$$ 1222264 1205641 1187449 1167740 1146723 1125283 1104394 1084393 1065243 1047177 1030602 1015598
61078A015598j3576j1940r588o500l219n07J187K231L562N653P929R614J0780
$$ 1015598 1002022 990082 980494 973994 970775 970268 971455 973686 977248 982901 990830 1000444 1011224
61065A011224J2036J3517J4920J6260J7829J9484K0717K1388K1822K2225K2565
$$ 1011224 1023260 1036777 1051697 1067957 1085786 1105270 1125987 1147375 1169197 1191422 1213987
61054A213987K2856K3046K2832K2077K1150K0293J9199J7805J6881J6951J7185
$$ 1213987 1236843 1259889 1282721 1304798 1325948 1346241 1365440 1383245 1400126 1417077 1434262
61043A434262J6472J5091J4138J3785J3389J3015J3305J3974J3945J3123J2632
$$ 1434262 1450734 1465825 1479963 1493748 1507137 1520152 1533457 1547431 1561376 1574499 1587131
61032A587131J3066J3810J4356J5044J6153J7443J8937K0997K3292K4812K5231
$$ 1587131 1600197 1614007 1628363 1643407 1659560 1677003 1695940 1716937 1740229 1765041 1790272
61021A790272K5360K5999K7311K9550L3387L9263M7154N6848O7624P8038Q7335
$$ 1790272 1815632 1841631 1868942 1898492 1931879 1971142 2018296 2075144 2142768 2220806 2308141
61010B308141R6809J08727J24524J45571J74642K14396K65048L26109L99813M90468
$$ 2308141 2404950 2513677 2638201 2783772 2958414 3172810 3437858 3763967 4163780 4654248
61000D654248O02028P40467R16679J139284J401805J680742J943345K142926K201867
$$ 4654248 5256276 5996743 6913422 8052706 9454511 11135253 13078598 15221524 17423391
60991A7423391K024428J566362R09939K53710j98996l57158k62113j9025K63879
$$ 17423391 19447819 21014181 21924120 22177830 21978834 21621676 21359563 21340538 21604417
60982B1604417M74604M85968K02471l57324j038586j633080j999115k115574k044895
$$ 21604417 22079021 22564989 22767460 22410136 21371550 19738470 17739355 15623781 13578886
60973A3578886j866202j639868j406180j190014j001172q38731o99847n83303
$$ 13578886 11712684 10072816 8666636 7476622 6475450 5636719 4936872 4353569
60965D353569m86682m05506l36730k80183k35650k00967j73652j52206j35102
$$ 4353569 3866887 3461381 3124651 2844468 2608818 2407851 2234199 2081993 1946891
60956A946891j20325j06735r4491q3606p3324o3240n3825m5600l8838l4048l1549
$$ 1946891 1826566 1719831 1625340 1541734 1468410 1405170 1351345 1305745 1266907 1232859 1201310
60945A201310l0601l0092k9956l0543l0945k9621k6776k4414k3718k3844k3669
$$ 1201310 1170709 1140617 1110661 1080118 1049173 1019552 992776 968362 944644 920800 897131
60934H97131k3206k2774k2143k1120j9990j8830j7391j5920j5042j4561j3513
$$ 897131 873925 851151 829008 807888 787898 769068 751677 735757 720715 706154 692641
60923F92641j1773j0370r813r285q137o992o573o435n773m711l951l615l248k636
$$ 692641 680868 670498 660685 651400 643263 636271 629698 623263 617490 612779 608828 605213 601965 599329
60909E99329j937j253n80k6K79L81M59P04J228J834J991J399M34l69j055j967
$$ 599329 597392 596139 595559 595533 595812 596193 596652 597356 598584 600418 602409 603808 604242 603873 602818 600851
60893F00851k999l821m596n721o931p506p337p088p240p658q101q429q383p844
$$ 600851 597852 594031 589435 583714 576783 569277 561940 554852 547612 539954 531853 523424 515041 507197
60879E07197p251p047o897o196n159m487m161l595k860k583k609k005o62L34L50
$$ 507197 499946 492899 486002 479806 474647 470160 465999 462404 459544 456961 454352 452347 451685 452019 452369
60864D52369R5L67R35J289J677K607L899M920N341N253M850M261L532K591J639
$$ 452369 452464 452831 453766 455055 456732 459339 463238 468158 473499 478752 483602 487863 491395 493986 495625
60849D95625J404K422M028M847M349L264K386J738J106N01j71j239k724m261n608
$$ 495625 497029 499451 503479 508326 512675 515939 518325 520063 521169 521670 521499 520260 517536 513275 507667
60834E07667o731p286o881n933n442n639n690n040m240m028m306m482m257l714
$$ 507667 500936 493650 486769 480836 475394 469755 464065 459025 454785 450757 446451 441969 437712 433998
60820D33998l084k749l010l665m199m464m661m702m334l812l686l854l628k890
$$ 433998 430914 428165 425155 421490 417291 412827 408166 403464 399130 395318 391632 387778 384150 381260
60806C81260k281k195k387k699l158l252k206l59Q70Q66O11J042J640J479P45
$$ 381260 378979 376784 374397 371698 368540 365288 363082 362723 363593 364459 365070 366112 367752 369231 369976
60791C69976L28M69O24M34J53K93J160K475L335L099K299K050K477K636K040J282
$$ 369976 370304 370773 371397 371831 371984 372277 373437 375912 379247 382346 384645 386695 389172 391808 393848 395130
60775C95130Q33L22m75r99q32m04j28K60Q15Q69J57m36j47L57m3j241k125k023
$$ 395130 395963 396285 395810 394811 393979 393575 393447 393707 394522 395391 395548 395112 394965 395322 395279 394038 391913 389890
60757C89890j158o4O47M22o25j546j648j369j452j771j646q98J28J175K045K319
$$ 389890 388732 388668 389315 389737 389112 387566 385918 384549 383097 381326 379680 378782 378910 380085 382130 384449
60741C84449J772P01n55k000l417m099l827l504l926m568m415l499k643k068j349
$$ 384449 386221 386922 386367 384367 380950 376851 373024 369520 365594 361026 356611 353112 350469 348401 347052
60726C47052n07j29l40n77m22m9K62M19L86K27K40N87R78J084J061J219J474J689
$$ 347052 346545 346416 346076 345499 345077 345028 345290 345709 346095 346322 346562 347149 348127 349211 350272 351491 352965 354654
60708C54654K117K885L414L061K144J563J655K010K297K461K268J428J81q63j486
$$ 354654 356771 359656 363070 366131 368275 369838 371493 373503 375800 378261 380529 381957 382138 381275 379789
60693C79789j940k348k554k472k045j083K44R95L34j176j991j385j38O68Q65R09
$$ 379789 377849 375501 372947 370475 368430 367347 367591 368586 368920 367744 365753 364368 364230 364898 365763 366672
60677C66672J038J175J326J628K123K659K968K825K226J420O30j34q80j431j664
$$ 366672 367710 368885 370211 371839 373962 376621 379589 382414 384640 386060 386690 386556 385676 384245 382581
60662C82581j746j891k071k216k409k563k234j214q5L45P5q9M49J485K395K806
$$ 382581 380835 378944 376873 374657 372248 369685 367451 366237 366152 366497 366572 366483 366932 368417 370812 373618
60646C73618K754K498K250J971J516R08K96m10j457k669l442l543l424l430l182
$$ 373618 376372 378870 381120 383091 384607 385515 385811 385401 383944 381275 377833 374290 370866 367436 364254
60631C64254k276j113m48m42o48p00n06j00K24Nn87n48O77K071K157R81L0J72
$$ 364254 361978 360865 360417 359975 359327 358627 358121 358021 358245 358250 357663 357115 357792 359863 362020 363001 363031 363203
60613C63203O84N39k21q10p86l34J91O07R19J179J282J022M88J72L66O74N36K5
$$ 363203 363887 364426 364205 363395 362609 362275 362466 363073 363992 365171 366453 367475 367963 368135 368501 369175 369711 369736
60595C69736l21k27K70J248K639L731L751L015K666L139L541K897J359k23j269
$$ 369736 369415 369188 369458 370706 373345 377076 380827 383842 386508 389647 393188 396085 397444 397221 395952
60580C95952j658j416p50j04K85O05J004J263J366J961L587N663O935P021O913
$$ 395952 394294 392878 392128 392024 392309 392914 393918 395181 396547 398508 402095 407758 414693 421714 428627
60565D28627P671R158J0438J1052J1338J1535J1214R808P373M495J649j055l618
$$ 428627 436298 445456 455894 466946 478284 489819 501033 510841 518214 522709 524358 523303 519685
60552E19685n879p469p925p061n355l728k618j584j50J360K357L064M177N651
$$ 519685 513806 506337 498412 491351 485996 482268 479650 478066 477916 479276 481633 484697 488874 494525
60538D94525O705P164P899R562J1686J3497J4959J6377J7570J8019J7517J6129
$$ 494525 501230 508394 516293 525855 537541 551038 565997 582374 599944 617963 635480 651609
60526F51609J3839J0642O802K639j556n245p761r096r998j0815j0887r637p767
$$ 651609 665448 676090 682892 685531 683975 678730 670969 661873 651875 641060 630173 620536 612769
60513F12769o484n924n194l810k284j299r26q08n70Q7J380L361N926Q815J1616
$$ 612769 606285 600361 595167 591357 589073 587774 586848 586040 585470 585557 586937 590298 596224 605039 616655
60498F16655J4166J7030K1027K6042L0936L4938L8384M1575M3764M4143M3103
$$ 616655 630821 647851 668878 694920 725856 760794 799178 840753 884517 928660 971763
60487I71763M1399L8631L3858K7429K0817J4561P686m97r195j7265k4552l1437
$$ 971763 1013162 1051793 1085651 1113080 1133897 1148458 1156144 1155647 1146452 1129187 1104635 1073198
60475A073198l7771m2968m6725m8960m9395m7863m4811m1060l7057l2822k8579
$$ 1073198 1035427 992459 945734 896774 847379 799516 754705 713645 676588 643766 615187
60464F15187k4934k2209j9897j7181j4050j1505j0353j0112r589q371p137o446
$$ 615187 590253 568044 548147 530966 516916 505411 495058 484946 475357 466986 459849 453403
60452D53403o039n557n187n041m642l673k710k458k677k667k393k306k373k212
$$ 453403 447364 441807 436620 431579 426937 423264 420554 418096 415419 412752 410359 408053 405680 403468
60438D03468j982k131k363j914r25m92j094j902k020j543r74l91K43N80M34K97
$$ 403468 401486 399355 396992 395078 394153 393661 392567 390665 388645 387102 386128 385737 385980 386560 386994 387291
60422C87291O63J077O48n54j318o42J118K681L132K562J619Q27L50J97L00M78
$$ 387291 387954 389031 389679 389125 387807 387165 388283 390964 394096 396658 398277 399104 399454 399651 399951 400429
60406D00429N63O07Q19J274J833K349K693K705K374K073K182K470K342J687J056
$$ 400429 400992 401599 402418 403692 405525 407874 410567 413272 415646 417719 419901 422371 424713 426400 427456
60391D27456Q33Q83J102J640K297K381J643P98O39J128J776K383K898L102K979
$$ 427456 428289 429172 430274 431914 434211 436592 438235 439033 439672 440800 442576 444959 447857 450959 453938
60376D53938K911L005K805K104J473J331J209O48K25P39J904K724K804K458J923
$$ 453938 456849 459854 462659 464763 466236 467567 468776 469424 469649 470388 472292 475016 477820 480278 482201
60361D82201J320J014J208J557J890K725M163N074M605L887M738O973Q565Q464
$$ 482201 483521 484535 485743 487300 489190 491915 496078 501152 505757 509644 514382 521355 529920 538384
60347E38384P707P556P877P762O649M462J618q93k376l444n157p177q033p344
$$ 538384 546091 553647 561524 569286 575935 580397 582015 581122 578746 575302 570145 562968 554935 547591
60333E47591o356n932n465m416l459l247l231k756k353k787l621l859l487l267
$$ 547591 541235 535303 529838 525422 521963 518716 515485 512729 510376 507589 503968 500109 496622 493355
60319D93355l291k832j552K4J289K142K723L104L420L940M848O152P822R811J1872
$$ 493355 490064 487232 485680 485704 486993 489135 491858 494962 498382 502322 507170 513322 521144 530955 542827
60304E42827J3511J4276J4177J3778J3612J3482J2519J0149O699K919p74m272
$$ 542827 556338 570614 584791 598569 612181 625663 638182 648331 655030 657949 657175 652903
60292F52903p429j0169j2631j4718j5797j5349j3649j1408r058o862n191m126
$$ 652903 645474 635305 622674 607956 592159 576810 563161 551753 542695 535833 530642 526516
60280E26516l185k125j534j866k493k622k535k940l597l794l674l831l996l534
$$ 526516 523331 521206 519672 517806 515313 512691 510156 507216 503619 499825 496151 492320 488324 484790
60266D84790k922l141l849l782k945k613l117l371k973k835l257l169k081j080
$$ 484790 481868 478727 474878 471096 468151 465538 462421 459050 456077 453242 449985 446816 444735 443655
60252D43655r63q93o6P65N99j35l79RO43J467K248K157J070L18R33J964J838O80
$$ 443655 442692 441799 441733 442498 443097 442962 442583 442592 443235 444702 446950 449107 450177 450495 451428 453392 455230 455910
60234D55910p0J35N47O34P23J101J552J884K180K460K630K673K557K154J629J516
$$ 455910 455840 455975 456522 457156 457879 458980 460532 462416 464596 467056 469686 472359 474916 477070 478699 480215
60218D80215K092L043M024N042O019O646P034P684Q498Q659Q049P783Q630R796
$$ 480215 482307 485350 489374 494416 500435 507081 514115 521799 530297 538956 547005 554788 563418 573214
60204E73214J0105R554Q832Q111P265O663O661O830O545N848M998L855K456J492
$$ 573214 583319 592873 601705 609816 617081 623744 630405 637235 643780 649628 654626 658481 660937 662429
60190F62429J267R67p0j195j693k268l939o048p009o665o399p011p942q525q723
$$ 662429 663696 664663 664593 663398 661705 659437 655498 649450 642441 635776 629377 622366 614424 605899 597176
60175E97176q521p775o814o133n499m355l003k300k229j986j484j472j978k039
$$ 597176 588655 580880 574066 567933 562434 558079 555076 552776 550547 548561 547077 545605 543627 541588
60161E41588j326q17j215j791j573q22m53o52q38o64k81K07R28J891K752L040
$$ 541588 540262 539445 538230 536439 534866 534044 533591 532939 532101 531437 531156 531363 532291 534182 536934 539974
60145E39974K541J599R80J236K134K969L353L448L525L705M135M996O229P487
$$ 539974 542515 544114 545094 546330 548464 551433 554786 558234 561759 565464 569599 574595 580824 588311
60131E88311Q474R136R467R328Q500O902M923L390K850K842K442J635J459K417
$$ 588311 596785 605921 615388 624716 633216 640118 645041 648431 651281 654123 656565 658200 659659 662076
60117F62076L542L739L330L357L877M015L504K994K803K408J466M82l6l61j016
$$ 662076 665618 669357 672687 676044 679921 683936 687440 690434 693237 695645 697111 697593 697557 697196 696180
60102F96180j931k642l137l932n268o553o854n922m496l474l042k831k661k509
$$ 696180 694249 691607 688470 684538 679270 672717 665863 659941 655445 651971 648929 646098 643437 640928
60088F40928j993p02Q24J362O14k91l85m7l7j76L4J81n48j971l069l445l711m424
$$ 640928 638935 638233 639057 640419 641033 640742 640357 640310 640273 640097 640131 640312 639764 637793 634724 631279 627568 623144
60070F23144n479o592p710q769r514r672r111p966o794o220o132n684m505l325
$$ 623144 617665 611073 603363 594594 585080 575408 566297 558331 551537 545317 539185 533501 528996 525671
60056E25671k899k857k427j675j241j172r70n04o6L31R79J919K983M226N670O934
$$ 525671 522772 519915 517488 515813 514572 513400 512430 511926 511860 512191 513170 515089 518072 522298 527968 534902
60040E34902P624P839P774P288O484O057O311O381N397L849K776K186J413N23
$$ 534902 542526 550365 558139 565427 571911 577968 584279 590660 596057 599906 602682 604868 606281 606804
60026F06804k7p25k531n129p140q100q860r910j0678j0841j0920j1150j0934r959
$$ 606804 606777 606052 603521 598392 591252 583152 574292 564382 553704 542863 531943 520793 509859 499900
60012D99900q815p965p076n894m883m395l980l123k033j247r31r46j052q17Q4
$$ 499900 491085 483120 476044 470150 465267 460872 456892 453769 451736 450489 449558 448612 447560 446743 446827
59997D46827J261J909J866J682J579J204O08N38J318K273K723K882L280L939M549
$$ 446827 448088 449997 451863 453545 455124 456328 456936 457474 458792 461065 463788 466670 469950 473889 478438
59982D78438M896M717L723K163Q14O0m94j193j833k310l048m240n279n476m883
$$ 478438 483334 488051 491774 493937 494751 494811 494317 493124 491291 488981 485933 481693 476414 470938 466055
59967D66055l950k913j973j491j456j175r7J381K490L083L567M023L968K988J293
$$ 466055 462105 459192 457219 455728 454272 453097 453000 454381 456871 459954 463521 467544 471512 474500 475793
59952D75793l21j015o72j58m74j458j873j023L09R08O66M63Q30J378J525J164
$$ 475793 475472 474457 473785 473627 473153 471695 469822 468799 469108 470016 470682 471145 471975 473353 474878 476042
59936D76042N20k53j037j587j619j089j81R37K185L376M169M480M699N187N609
$$ 476042 476562 476309 475272 473685 472066 470977 470796 471733 473918 477294 481463 485943 490642 495829 501438
59921E01438N266M048K533J093m11j869k640k542k330k539k522j442L21J666K283
$$ 501438 506704 510752 513285 514378 513967 512098 509458 506916 504586 502047 499525 498083 498404 500070 502353
59906E02353K718L173L240K790K237J866J503R72L48j60k50L52J338J858J675
$$ 502353 505071 508244 511484 514274 516511 518377 519880 520852 521200 521040 520790 521142 522480 524338 526013
59891E26013J701K676L969M578M771N523O765P548P702P950Q420Q363P575O779
$$ 526013 527714 530390 534359 538937 543708 549231 555996 563544 571246 579196 587616 595979 603554 610333
59877F10333O428O269O245O628O981O187L999J575j7r61k025l511n159o351o286
$$ 610333 616761 623030 629275 635903 642884 649071 653070 654645 654628 653667 651642 648131 642972 636621 630335
59862F30335m800l091k681l556m357m411m327m376l825k414j154q20p14J96J769
$$ 630335 625535 622444 619763 616207 611850 607439 603112 598736 594911 592497 591343 590523 589809 590005 591774
59847E91774L197M279N363O531P501P970P535N754K839r0j751j586Q6K241L593
$$ 591774 594971 599250 604613 611144 618645 626615 634150 639904 642743 642653 640902 639316 639402 641643 645236
59832F45236L588K936K568K266J196m70j694k238k832l600l772l212k882l369
$$ 645236 648824 651760 654328 656594 657790 657320 655626 653388 650556 646956 643184 639972 637090 633721
59818F33721m255n295o769q227q413p139n817n384n070m094l069k731k656k348
$$ 633721 629466 624171 617402 609175 600762 593623 587806 582422 577352 573258 570189 567458 564802 562454
59804E62454k387l234m048l887l189k814k592k063j711k222l223l920m304m560
$$ 562454 560067 556833 552785 548898 545709 542895 540303 538240 536529 534307 531084 527164 522860 518300
59790E18300m148k721j305j148j946k415k098j447o31L77R64N00l90m13O27J665
$$ 518300 514152 511431 510126 508978 507032 504617 502519 501072 500441 500818 501782 502282 501892 501479 502106 503771
59774E03771J956J780J640J613J611J641J772K143K889L746M195M228M315M422
$$ 503771 505727 507507 509147 510760 512371 514012 515784 517927 520816 524562 528757 532985 537300 541722
59760E41722L918K852K252K557K925K920L505N188O493N861M182L689M863O171
$$ 541722 545640 548492 550744 553301 556226 559146 562651 567839 574332 580193 584375 588064 592927 599098
59746E99098O531O405O425O411O058N482M875M283L794L371K719J801J036N13
$$ 599098 605629 612034 618459 624870 630928 636410 641285 645568 649362 652733 655452 657253 658289 658802
59732F58802k73j213j163K59J510J071k69o39Q3L95k50p85m30K80N44J46p88j889
$$ 658802 658529 657316 656153 656412 657922 658993 658724 658085 658168 658563 658313 657528 657098 657378 657922 658068 657280 655391
59714F55391k427k078j614j840k270j980j296j294j944k279k093j999j931j152
$$ 655391 652964 650886 649272 647432 645162 643182 641886 640592 638648 636369 634276 632277 630346 629194
59700F29194J91J046J072R57J061J138J376K276L422L807L454L225L094K177O94
$$ 629194 629385 630431 631503 632460 633521 634659 636035 638311 641733 645540 648994 652219 655313 657490 658184
59685F58184l5J84o8j401k549k484j988k108k529k632k885l992n568o742p303
$$ 658184 658149 658333 658265 656864 654315 651831 649843 647735 645206 642574 639689 635697 630129 623387 616084
59670F16084p356o656n193l754l079k957k861k758k664k161j143l21k42l75M1
$$ 616084 608728 602072 596879 593125 590046 587089 584228 581470 578806 576645 575502 575181 574939 574564 574605
59655E74605Q39J379J623K020K661L265L686L912L831L362K534J186p97k791l720
$$ 574605 575444 576823 578446 580466 583127 586392 590078 593990 597821 601183 603717 604903 604106 601315 597595
59640E97595l492l315m043m970m911l843k655j862j399j292j641k104k137j658
$$ 597595 594103 590788 586745 581775 576864 573021 570366 568504 567105 565813 564172 562068 559931 558273
59626E58273j049o57p19j471k780l896m066l366k567k268k432k604k390j860j542
$$ 558273 557224 556567 555848 554377 551597 547701 543635 540269 537702 535434 533002 530398 528008 526148 524606
59611E24606j784k061j487o7J123J298R34R79J615K287K530K272J633Q76L36L1
$$ 524606 522822 520761 519274 519207 520330 521628 522562 523541 525156 527443 529973 532245 533878 534754 535090 535121
59595E35121l83r47j034j62J117J728J373Q52R72J530J607P35n16j272j477j837
$$ 535121 534738 533791 532757 532595 533712 535440 536813 537665 538637 540167 541774 542509 541993 540721 539244 537407
59579E37407k664l319l230k858k940l266l048k297j806j833j829j525j274j133
$$ 537407 534743 531424 528194 525336 522396 519130 516082 513785 511979 510146 508317 506792 505518 504385
59565E04385o31J60M24p0m10L6N64K99l63m09K50P67N52k27j046j343p35N19J606
$$ 504385 503754 503914 504338 504268 503858 503894 504458 504757 504394 503985 504235 505002 505554 505327 504281 502938 502203 502722 504328
59546E04328K122K452K831K772K157K066L473N668P220Q168R982J3345J7263K0463
$$ 504328 506450 508902 511733 514505 516662 518728 522201 527869 535089 543257 553239 566584 583847 604310
59532F04310K2326K1995J8054J0263R90o265r636r692p895n316k707q46r4l7L0
$$ 604310 626636 648631 666685 676948 677938 671673 662037 652345 644450 639134 636427 635581 635487 635450 635480
59517F35480L16M86J69o85j888l203m437n539o565p472q022q067p863p842q048
$$ 635480 635796 636282 636451 635766 633878 630675 626238 620699 614134 606662 598640 590573 582710 574868 566820
59502E66820q035p406o302n172m293l574k775j763o38K95P76Q30O80M80L24L95
$$ 566820 558785 551379 545077 539905 535612 532038 529263 527500 526862 527157 527933 528763 529443 529923 530247 530642
59486E30642Q02J286J460J390J547K147K955L833M889N941O363N916N219M998
$$ 530642 531444 532730 534190 535580 537127 539274 542229 546062 550951 556892 563255 569171 574390 579388
59472E79388N287N707O106O395O188N177L653K233J221N39O6l45q03j117q86q0
$$ 579388 584675 590382 596488 602883 609071 614248 617901 620134 621355 621894 621960 621615 620812 619695 618809 618729
59456F18729R50K181L955O024P389P679P765Q351Q856Q547P852P378O517M414
$$ 618729 619679 621860 625815 631839 639228 646907 654672 663023 671879 680426 688278 695656 702173 706587
59442G06587J747n6j044k576n027p230q379q918r177q585o919n106m041l521k976
$$ 706587 708334 708278 707234 704658 699631 692401 684022 675104 665927 657342 650423 645317 641276 637755 634779
59427F34779k425k011j319P5J879L492M853O346Q217J0432J2816J5027J6638J7590
$$ 634779 632354 630343 629024 629099 630978 634470 639323 645669 653886 664318 677134 692161 708799 726389
59413G26389J8416J9820K2152K5233K8460L0946L1643K9294K2626J1393k326j4522
$$ 726389 744805 764625 786777 812010 840470 871416 903059 932353 954979 966372 964046 949524
59401I49524k1675k2713j8654j1375l164L798Q831J2764J5297J3434M598r003
$$ 949524 927849 905136 886482 875107 871943 875741 884572 897336 912633 926067 930665 921662
59389I21662k1269k7748k8786k7105k4354k0908j7297j4303j2165j0536q960p071
$$ 921662 900393 872645 843859 816754 792400 771492 754195 739892 727727 717191 708231 701160
59377G01160m934l263k691k794k617k078j851j973j727r93m36k03K76R28R09K22
$$ 701160 696226 692963 690272 687478 684861 682783 680932 678959 677232 676239 675803 675600 675876 676804 677713 677935
59361F77935R1J175K698L894N011O258P114P448Q058R226R953R688R663J1310
$$ 677935 678026 679201 681899 685793 690804 697062 704176 711624 719682 728908 738861 748549 758212 769522
59347G69522J4146J6404J7220J7117J6817J6553J6239J5572J4168J2044R651P190
$$ 769522 783668 800072 817292 834409 851226 867779 884018 899590 913758 925802 935453 942643
59335I42643M446J466j326l991p117j0637j3553j5360j6727j8229j9320j9364
$$ 942643 947089 948555 947229 943238 936121 925484 911931 896571 879844 861615 842295 822931
59323H22931j8731j8063j7264j6058j4871j4203j3626j2239r915p507o051n966
$$ 822931 804200 786137 768873 752815 737944 723741 710115 697876 687961 680454 674403 668437
59311F68437o697p042o351n382n195n428m754l013j471o68M06K511N044P410J0062
$$ 668437 661740 654698 648347 642965 637770 632342 627588 624575 623104 622436 622842 625353 630397 637807 647869
59296F47869J3189J5583J5796J3400Q462J219o829j2919j5484j5566j4865j3597
$$ 647869 661058 676641 692437 705837 714299 715518 708689 695770 680286 664720 649855 636258
59284F36258j1410q996p247n790l827j631J41J766L726N508O565P640R662J2025
$$ 636258 624848 615852 608605 602815 598988 597357 597498 599264 602990 608498 615063 622703 632365 644390
59270F44390J3496J4190J5074J6064J6177J5256J4010J2552J0401P775N508L680
$$ 644390 657886 672076 687150 703214 719391 734647 748657 761209 771610 779385 784893 788573
59258G88573J504j327m189o365p555p713p137o542o286n879m838l508k347j121
$$ 788573 790077 788750 784561 778196 770641 762928 755791 749249 742963 737084 732246 728738 726391 725270
59244G25270M11J748K526L265M304M862M333L591L750M476M870N119N629N444
$$ 725270 725681 727429 729955 733220 737524 742386 746719 750310 754060 758536 763406 768525 774154 779598
59230G79598L381K26k166l544n194p399q995r545j0036j1023j1728j1514j0842
$$ 779598 782979 783205 781039 777495 772301 764902 755907 746362 736326 725303 713575 702061 691219
59217F91219j0349j0055r886r889r613q402o489m886m021l481l077l041l026k165
$$ 691219 680870 670815 660929 651040 641427 633025 626536 621650 617629 614148 611071 608030 605004 602839
59203F02839m91Q09R51M99L17M54M80L36L78R01J802K553K643K305K327K776K652
$$ 602839 602348 603157 604108 604607 604924 605378 605858 606194 606572 607473 609275 611828 614471 616776 619103 621879 624531
59186F24531J472L79O27J702K183J892J767J960J646P26J78N63J320J811J994
$$ 624531 626003 626382 627009 628711 630894 632786 634553 636513 638159 638885 639063 639626 640946 642757 644751
59171F44751J936J582J219J273J575J657J623J933K420K519K270K174K089J371
$$ 644751 646687 648269 649488 650761 652336 653993 655616 657549 659969 662488 664758 666932 669021 670392
59157F70392j8j485k826m308n791o789p305p795q335q675q887r145r110q431p495
$$ 670392 670374 668889 666063 661755 655964 649175 641870 634075 625740 617065 608178 599033 589923 581492 573997
59142E73997o830o205n297m655m819n118m611l675l202k888j981j159j681k943
$$ 573997 567167 560962 555665 551010 546191 541073 536462 532787 529585 526697 524716 523557 521876 518933
59128E18933k958j280N10J456K259L348L920L646L622M650O076P027P598Q070
$$ 518933 515975 514695 515205 516661 518920 522268 526188 529834 533456 538106 544182 551209 558807 566877
59114E66877Q185P954Q074Q781R326R180Q809Q623Q115O746M953L708L564M364
$$ 566877 575062 583016 591090 599871 609197 618377 627186 635809 643924 650670 655623 659331 662895 667259
59100F67259N276N075L221P42p89j142j335j842k060j609r17l12L20Q84J074J116
$$ 667259 672535 677610 680831 681573 680784 679642 678307 676465 674405 672796 671879 671567 671887 672771 673845 674961
59084F74961J363J305J42j710l081l832m741n776o162o186o990q363q715p685
$$ 674961 676324 677629 677771 676061 672980 669148 664407 658631 652469 646283 639293 630930 622215 614530
59070F14530o871p188p417o297m462l208k711k496k412k250j500l73L7o43j454
$$ 614530 607659 600471 593054 586757 582295 579087 576376 573880 571468 569218 567718 567345 567382 566739 565285
59055E65285j647j684j999k112j762j650k205k730k574k039j454n92L03K52p50
$$ 565285 563638 561954 559955 557843 556081 554431 552226 549496 546922 544883 543429 542837 543140 543392 542642
59040E42642j196k11J001R68L9n59n61l52K31J410K536K900K929L526M710N937
$$ 542642 541446 541235 542236 543204 543243 542684 542123 541771 542002 543412 545948 548848 551777 555303 560013 565950
59024E65950P118Q452R706J0636J1590J2912J4094J4333J3497J1942R772O927
$$ 565950 573068 581520 591226 601862 613452 626364 640458 654791 668288 680230 690002 696929
59012F96929L648M06k306l961m312l921l705l767l435k482j415m23Q87K463L699
$$ 696929 700577 700983 698677 694716 690404 686483 682778 679011 675576 673094 671679 671256 672143 674606 678305
58997F78305M535N506O406O271N005L716K993K273J455J420K218K382J054o44
$$ 678305 682840 688346 694752 701023 706028 709744 712737 715010 716465 717885 720103 722485 723539 722895
58983G22895j449j773k451k936k246p79K42N81J100K495M730P321R544J0923J1910
$$ 722895 721446 719673 717222 714286 712040 711261 711503 712084 713184 715679 720409 727730 737274 748197 760107
58968G60107J3384J5219J6337J6393J6181J6065J5495J4505J4029J4017J2934
$$ 760107 773491 788710 805047 821440 837621 853686 869181 883686 897715 911732 924666
58957I24666J0029O482L374J96l529o938r465j2075j5311j7714j7954j7100j6916
$$ 924666 934695 941177 944551 944747 941218 934280 924815 912740 897429 879715 861761 844661 827745
58944H27745j7160j6522j5188j4384j4049j2991j0931q707o805n137l892l223
$$ 827745 810585 794063 778875 764491 750442 737451 726520 717813 711008 705871 701979 698756
58932F98756k533j281j4N47P01R20P19k49r29k52R52J076Q0q25j241j585j689
$$ 698756 696223 694942 694928 695475 696176 697096 697815 697566 696637 696385 697337 698413 698493 697668 696427 694842 693153
58915F93153j064k69l04q93r01k24K95N60J313K589L639M332N282O597P797Q952
$$ 693153 692089 691820 691516 690623 689722 689498 689793 690353 691666 694255 697894 702226 707508 714105 721902 730854
58899G30854J0654J2776J4421J5184J5454J5528J5326J4985J4813J4759J4759
$$ 730854 741508 754284 768705 783889 799343 814871 830197 845182 859995 874754 889513
58888H89513J5312J6844J8759K0063K0661K1103K1248K0284J7908J4679J1219
$$ 889513 904825 921669 940428 960491 981152 1002255 1023503 1043787 1061695 1076374 1087593
58877A087593P804M527J293k133n544q283j0181j1849j3521j4397j3911j2710
$$ 1087593 1095397 1099924 1101217 1099084 1093540 1085257 1075076 1063227 1049706 1035309 1021398 1008688
58865A008688j1588j0373q791p476p015o928o704o938q251r895j0831j1284j1937
$$ 1008688 997100 986727 977936 970460 963445 956517 949813 942875 934624 924729 913898 902614 890677
58852H90677j2402j2034j1440j1597j2046j1545j0099q842q280q055q073q481
$$ 890677 878275 866241 854801 843204 831158 819613 809514 800672 792392 784337 776264 767783
58840G67783q843q713q658r428j0448j0511r584q680q184p639o847n983m932l616
$$ 767783 758940 750227 741569 732141 721693 711182 701598 692918 684734 677095 670248 664265 659333 655717
58826F55717k607k291j942p39Q97K088K929L894M572M487M427N363O673P049O591
$$ 655717 653110 650819 648877 648138 649035 651123 654052 657946 662518 667005 671432 676795 683468 690517 697108
58811F97108O354O263N379L911L110L223L227K570J745J052J82r47k094l401n077
$$ 697108 703462 709725 715104 719015 722125 725348 728575 731145 732890 733942 734124 733177 731083 727682 722605
58796G22605o622p437p873q594r345r496r216q939q300o892n377m475l601j926
$$ 722605 715983 708546 700673 692079 682734 673238 664022 655083 646783 639891 634514 630039 626438 624512
58782F24512l1J077J746K739L396K680J418J420K739L791L739K837R17k363n976
$$ 624512 624481 625558 627304 630043 633439 636119 637537 638957 641696 645487 649226 652063 652980 650617 644641
58767F44641q298r286j0017j0447r643p949o760o208n216l711k700k179j124L98
$$ 644641 636343 627057 617040 606593 596950 589001 582241 576033 570817 567106 564406 562227 561103 561501
58753E61501J225J281J683K476K466J450O55O09N74L81Q31J933K640K716L093
$$ 561501 562726 564007 565690 568166 570632 572082 572737 573346 573920 574301 575132 577065 579705 582421 585514
58738E85514M145N276O382P787Q713P833N555L802L323L171L048L825N446O524
$$ 585514 589659 594935 601317 609104 617817 625650 631205 635007 638330 641501 644549 648374 653820 660344
58724F60344O599O763P538Q109Q191Q597R378R490Q941R225J0822J2261J2450
$$ 660344 666943 673706 681244 689353 697544 706141 715519 725009 733950 743175 753997 766258 778708
58711G78708J2085J1941J1544J0382Q769O713L547n89m416p341j0082j3007j5446
$$ 778708 790793 802734 814278 824660 833429 840142 843689 843100 838684 831343 821261 808254 792808
58698G92808j7135j8708k0274k1136k1265k1314k0869j8702j5223j2616j1827
$$ 792808 775673 756965 736691 715555 694290 672976 652107 633405 618182 605566 593739
58687E93739j1406j0068q425p312o319n037m139m183m676n022n136m665l131j252
$$ 593739 582333 572265 563840 556528 550209 545172 541033 536850 532174 527152 522016 517351 514220 512968
58673E12968m56p14m77R20K503L495M116M427M323M796O892R382R901Q593P865
$$ 512968 512512 511798 511321 512241 514744 518239 522355 526782 531105 535901 542793 552175 562076 570669 578534
58658E78534Q148P022L371o54l075m595o166o909o156n156m981m883m297m211
$$ 578534 586682 593704 597075 596421 593346 588751 582585 575676 569520 564364 559383 554500 550203 545992
58644E45992m980n037l532k099k200k780k369j441q74k9J627K887K736K227K556
$$ 545992 541012 535975 532443 530344 528144 525364 522995 521554 520680 520651 522278 525165 527901 530128 532684
58629E32684K975K449J685J583J365K37p38m43J04m55j330r26M53J442K008L013
$$ 532684 535659 538108 539793 541376 542741 542978 542240 541797 541901 541446 540116 539190 539643 541085 543093 546106
58613E46106M344N304O065O998P413O591N209M279L564K422J240O98N54L64K61
$$ 546106 550450 555754 561819 568817 576230 582821 588030 592309 595873 598295 599535 600233 600787 601151 601412
58598F01412N5j072k848l452k154p50r09j744j636q00j78O38K367M209N092N654
$$ 601412 601467 600395 597547 594095 591941 591191 590282 588538 586902 586102 585924 586562 588929 593138 598230 603884
58582F03884P075Q908R923J0173J0436J0471R596Q254P458P333P478P968Q835
$$ 603884 610959 619867 629790 639963 650399 660870 670466 678720 686178 693511 700989 708957 717792
58569G17792R571J0224J1847J4819J7994K0571K3279K6598K9476L1206L2717L4451
$$ 717792 727363 737587 749434 764253 782247 802818 826097 852695 882171 913377 946094 980545
58557I80545L4755L2185K7737K2967J7537J0666L459k356o698j0217j2362j2369
$$ 980545 1015300 1047485 1075222 1098189 1115726 1126392 1129851 1127495 1120797 1110580 1098218 1085849
58545A085849j1008r402p408n010l982n958r952j3781j6932k0121k3156k5236
$$ 1085849 1074841 1065439 1058031 1053021 1049039 1043081 1033129 1019348 1002416 982295 959139 933903
58533I33903k6428k7005k6329k4009k1140j8672j5919j2334r272q037p633o563
$$ 933903 907475 880470 854141 830132 808992 790320 774401 762067 752795 744758 737125 730562
58521G30562n371n234n365m299k630k054k549k744k355k108k012j631j374j695
$$ 730562 725191 719957 714592 710293 707663 705609 703060 700316 697961 695853 693841 692210 690836 689141
58507F89141j889j342q95j357j865j429p43o73n27K87N48o17j565m95J464K085
$$ 689141 687252 685910 685015 683658 681793 680364 679621 678948 678421 678708 679256 678639 677074 676579 678043 680128
58491F80128J539J496K025K114K165L307N139O599Q098J0384J2383J2749J2499
$$ 680128 681667 683163 685188 687302 689467 692774 697913 704512 712610 722994 735377 748126 760625
58478G60625J3540J5586J7123J8264J9906K0958J9332J5108J0128N148j17m840
$$ 760625 774165 789751 806874 825138 845044 866002 885334 900442 910570 915718 915601 910761
58466I10761p669q930r912j0513r855q357p002n396k838k09J516L500P182J1361
$$ 910761 903092 894162 884250 873737 863882 855525 848523 843127 840289 840080 841596 845096 852278 863639
58452H63639J3802J4644J5445J5893J4354J0883O865K436l015q522j2416j4733
$$ 863639 877441 892085 907530 923423 937777 948660 955525 957961 954946 946424 934008 919275
58440I19275j6384j6854j5335j2961j1236r457o475l629k868l206k242p4J592
$$ 919275 902891 886037 870702 857741 846505 837048 830573 826944 824076 820870 818628 818554 820146
58427H20146K957N241P400P516O664P615J0193J1535J0604Q890O973L932P7l062
$$ 820146 823103 828344 835744 843260 849924 857539 867732 879267 889871 898761 905734 909666 909743 906681
58413I06681n351p696r451r290q168q227r222r192q070p483p462o675n344m704
$$ 906681 901330 893634 884183 874893 866725 858498 849276 840084 832014 824531 817069 810394 805050 800346
58399H00346m181k399k35M95N28J829L713M019L297L806N054M524K431J469K103
$$ 800346 796165 793766 793531 794026 794554 796383 800096 804115 807412 811218 816272 820796 823227 824696 826799
58384H26799K218J395J446K597L016K283J724J420N11J04K108N459P319P622Q554
$$ 826799 829017 830412 831858 834455 837471 839754 841478 842898 843409 843513 845621 851080 858399 866021 874575
58369H74575J0071J0178R188R387J0743J1287J1361J3045J5641J6366J5419J5664
$$ 874575 884646 894824 904012 913399 924142 935429 946790 959835 975476 991842 1007261 1022925
58357A022925J7314J7680J6198J4885J3765J0704O094K868J536l0j693r67J812
$$ 1022925 1040239 1057919 1074117 1089002 1102767 1113471 1119565 1122433 1123969 1123939 1122246 1121279 1123091
58344A123091L307K770K853M292M840M171M794P169Q856R348J0962J4082J6256
$$ 1123091 1126398 1129168 1132021 1136313 1141153 1145324 1150118 1157287 1166143 1175491 1186453 1200535 1216791
58331A216791J6828J7768J9274J9339J8176J8078J8506J6469J2275R528Q890P319
$$ 1216791 1233619 1251387 1270661 1290000 1308176 1326254 1344760 1361229 1373504 1383032 1391922 1399241
58319A399241M198K543L205L468K500K720M736O244O791Q263J0149R920Q582R865
$$ 1399241 1403439 1405982 1409187 1412655 1415155 1417875 1422611 1428855 1435646 1443909 1454058 1463978 1472560 1482425
58305A482425J3462J5297J4924J5990J8777J9401J7427J7087J9477K0679J9275
$$ 1482425 1495887 1511184 1526108 1542098 1560875 1580276 1597703 1614790 1634267 1654946 1674221
58294A674221J8688K0283K1139K0391K0903K2936K3175K1574K2039K4876K6063
$$ 1674221 1692909 1713192 1734331 1754722 1775625 1798561 1821736 1843310 1865349 1890225 1916288
58283A916288K5332K7015L1377L3534L2818L4443L9600M2806M1670M0488M1340
$$ 1916288 1941620 1968635 2000012 2033546 2066364 2100807 2140407 2183213 2224883 2265371 2306711
58272B306711M0695L7872L7659M1182M3313M2532M4018M9439N3268N3250N4727
$$ 2306711 2347406 2385278 2422937 2464119 2507432 2549964 2593982 2643421 2696689 2749939 2804666
58261B804666O0418O5453O6977O8979P3238P5292P3906P4453P8461Q0105P7584
$$ 2804666 2865084 2930537 2997514 3066493 3139731 3215023 3288929 3363382 3441843 3521948 3599532
58250C599532P7151Q1179Q3662Q2643Q5115R3934J01978J05499J10800J21132
$$ 3599532 3676683 3757862 3841524 3924167 4009282 4103216 4205194 4310693 4421493 4542625
58240D542625J29818J33610J39873J52670J64750J71502J79719J94010K07880
$$ 4542625 4672443 4806053 4945926 5098596 5263346 5434848 5614567 5808577 6016457
58231F016457K17107K28396K45641K61673K73064K88546L12910L37617L57638
$$ 6016457 6233564 6461960 6707601 6969274 7242338 7530884 7843794 8181411 8539049
58222H539049L81792M15505M49980M80153N16245N65104O17922O69595P31381
$$ 8539049 8920841 9336346 9786326 10266479 10782724 11347828 11965750 12635345 13366726
58213A3366726Q10347Q96079R82965J085147J213587J360379J522732J718864
$$ 13366726 14177073 15073152 16056117 17141264 18354851 19715230 21237962 22956826
58205B2956826J962083K245062K570034K967048L461102M052645M755726N622241
$$ 22956826 24918909 27163971 29734005 32701053 36162155 40214800 44970526 50592767
58197E0592767O702669Q022539R629690J1623409J4106778J7163114K0900605
$$ 50592767 57295436 65317975 74947665 86571074 100677852 117840966 138741571
58190A38741571K5403186L0517245L5718916M0231027M3110279M3063609L8456635
$$ 138741571 164144757 194662002 230380918 270611945 313722224 356785833 395242468
58183C95242468K8173187J2944380m259023j9544964l0148735l5512655l6805640
$$ 395242468 423415655 436360035 432101012 412556048 382407313 346894658 310089018
58176C10089018l5714974l3550350l0980332k8189041k5188437k2068269j9026333
$$ 310089018 274374044 240823694 209843362 181654321 156465884 134397615 115371282
58169A15371282j6232433j3745421j1569178r714517q174100o895082n820583
$$ 115371282 99138849 85393428 73824250 64109733 55935633 49040551 43219968
58162D3219968m927613m199301l595665l080207k646359k292421j996246j737395
$$ 43219968 38292355 34093054 30497389 27417182 24770823 22478402 20482156 18744761
58154A8744761j519542j348130j207301j079694r68981q82645q10571p39664o73168
$$ 18744761 17225219 15877089 14669788 13590094 12621113 11738468 10927897 10188233 9515065
58145I515065o17641n66031n10604m58472m18130l83558l46521l12079k87555
$$ 9515065 8897424 8331393 7820789 7362317 6944187 6560629 6214108 5902029 5614474
58136E614474k68085k46957k28923k19782k13385k01806j88558j79648j71288
$$ 5614474 5346389 5099432 4870509 4650727 4437342 4235536 4046978 3867330 3696042
58127C696042j58270j45166j37653j31602j21646j11874j07378j03797r5862q7932
$$ 3696042 3537772 3392606 3254953 3123351 3001705 2889831 2782453 2678656 2582794 2494862
58117B494862q5500q4220p7934p0078o6725o5294o0445n4604n2675n2298m8955
$$ 2494862 2409362 2325142 2247208 2177130 2110405 2045111 1984666 1930062 1877387 1825089 1776134
58106A776134m5004m4609m5246m2994m0765m2700m5765m5258m3389m4211m5320
$$ 1776134 1731130 1686521 1641275 1598281 1557516 1514816 1469051 1423793 1380404 1336193 1290873
58095A290873m2629l8343l6209l3888k7940k1447j8839j7929j4815j1874j3028
$$ 1290873 1248244 1209901 1173692 1139804 1111864 1090417 1071578 1053649 1038834 1026960 1013932
58084A013932j5723j5522j4358j6287j9314j9247j7711j8506j9798j7775j4531
$$ 1013932 998209 982687 968329 952042 932728 913481 895770 877264 857466 839691 825160
58073H25160j4455j6041j4996j2447j2379j3730j2635j0108r965j1338j0478q102
$$ 825160 810705 794664 779668 767221 754842 741112 728477 718369 708404 697066 686588 678486
58061F78486p834r156q676o864o925q459q533p628q427j0100r727p996p756q389
$$ 678486 670652 661496 652820 645956 639031 630572 622039 614411 605984 595884 586157 578161 570405 562016
58047E62016p282n365n488o705n864l511k771l541l297k413l295n260n573m561
$$ 562016 554734 549369 543881 537176 531312 527801 525030 521489 518192 515779 512484 507224 501651 497090
58033D97090m649n459m871l844n083p876r199q944r305j0036r203p567p415q030
$$ 497090 492441 486982 482111 478267 473184 465308 456109 447165 437860 427824 418621 411054 403639 395609
58019C95609p073n361n430o424n475l190k638l608l089j046n20k029k805j769
$$ 395609 388536 383175 377745 371321 365846 362656 360018 356410 353321 352275 351755 349726 346921 345152
58005C45152p89p04l62K29k25j124n03J296K079J668J722K138J370p7k95K71n16
$$ 345152 344363 343659 343297 343526 343301 342177 341674 342970 345049 346717 348439 350577 351947 351870 351575 351846 351330
57988C51330k371k932j927j329j624j531j129j712k788k754k075k420l192k586
$$ 351330 348959 346027 344100 342771 341147 339616 338487 336775 333987 331233 329158 326738 323546 320960
57974C20960j387j852l395l340j578n06n89n3J190J313K98O6P26N27m08k4J707
$$ 320960 319573 317721 314326 310986 309408 308902 308313 308260 309450 310763 311061 311127 311853 312380 311972 311948 313655
57957C13655K520J759J009O10q18l002l814k916k259k586k644k186k377k961k315
$$ 313655 316175 317934 318943 319553 318735 315733 311919 309003 306744 304158 301514 299328 296951 293990 291675
57942B91675o26K25J36R09K696L735L793M452N683N639M287L812M834N546N123
$$ 291675 291049 291274 291410 292319 295015 298750 302543 306995 312678 318317 322604 326416 331250 336796 341919
57927C41919M633M114K188p71k487k471k703l976m926n277o543q669r374p925
$$ 341919 346552 350666 352854 352083 349596 347125 344422 340446 335520 330243 323700 315031 305657 297732
57913B97732o332n778n074l680k978l301k924j297k42n82n82P27J681J007q8m40
$$ 297732 291400 285622 280548 276868 273890 270589 267665 266368 266126 265544 264962 265689 267370 268377 268289 267849
57897B67849r30k163k654j185J026K253K532K695K831K963L540M214L862K554
$$ 267849 266919 264756 262102 260917 261943 264196 266728 269423 272254 275217 278757 282971 286833 289387
57883B89387J797K143K556K647L270M326M330K966J754J436J038K38J40P52L56
$$ 289387 291184 293327 295883 298530 301800 306126 310456 313422 315176 316612 317650 317888 318028 318780 319136
57868C19136j409k455j547l24o16j915k938l620m086l616k061o11K4N68J366J595
$$ 319136 317727 315272 313725 313401 312785 310870 307932 304312 300226 296610 294549 293938 293962 294530 295896 297491
57852B97491J164J394K729L760L532K890K541J918R32P08J454J726R37L88P14
$$ 297491 298655 300049 302778 306538 310070 312960 315501 317419 318351 319059 320513 322239 323176 323564 324278
57837C24278O15n55j287m81O92J055J383K429L095K429J512J549J787J223O45
$$ 324278 324893 324338 323051 322570 323262 324317 325700 328129 331224 333653 335165 336714 338501 339724 340369
57822C40369J070J670J061m74j757k465k674k017p32j68r20j782j913k429m342
$$ 340369 341439 343109 344170 343696 341939 339474 336800 334783 334051 333883 332963 331181 329268 326839 322497
57807C22497o514p357p253p515q201q600q725q772q077o289m478l704l437k771
$$ 322497 315983 308626 301373 293858 285657 277057 268332 259560 251483 245194 240716 237012 233575 230804
57793B30804k044j845j592o21K89O8q34j294j307j496j562p05R83K674L889M462
$$ 230804 228760 226915 225323 224702 224991 225059 224225 222931 221624 220128 218566 217861 218844 221518 225407 229869
57777B29869M197L407L099L747M614M922M803M494L788K920K693L027K713J358
$$ 229869 234066 237473 240572 244319 248933 253855 258658 263152 266940 269860 272553 275580 278293 279651
57763B79651J12l57r33k092k562j346M75J344J327J227R75L80K70J329K766L430
$$ 279651 279763 279406 278473 276381 273819 272473 272948 274292 275619 276846 277821 278201 278471 279800 282566 285996
57747B85996L328K984K446J937K174K913K644R85k19L92J479J154j85r89j149
$$ 285996 289324 292308 294754 296691 298865 301778 304422 305407 305188 305580 307059 308213 308028 307039 305890
57732C05890j479j793j470j007j117j155k90O23K64q50j127l72L46O96J126J392
$$ 305890 304411 302618 301148 300141 299024 297869 297579 298202 298466 297616 296489 296117 296463 297159 298285 299677
57716B99677Q53n6k49L00O92N88L22l0m35l00O28J304O58p00j381j195r37p94
$$ 299677 300530 300474 300225 300525 301217 301805 302127 302097 301662 301362 301990 303294 303952 303252 301871 300676 299739 298945
57698B98945l67J94M90Q08J503J948J384K67m89j033k048l296m021m302m670m950
$$ 298945 298578 298772 299262 300070 301573 303521 304905 305172 304683 303650 301602 298306 294285 289983 285313 280363
57682B80363m772m592m808m564k871m46J220K094L455N808Q519J1300J4648J8894
$$ 280363 275591 270999 266191 261627 258756 258310 259530 261624 265079 270887 279406 290706 305354 324248
57668C24248K3961K9935L6724M3272M7983M9454M6133L6177J9272j693k1893l7383
$$ 324248 348209 378144 414868 458140 506123 555577 601710 637887 657159 655466 633573 596190
57656E96190m6271m8417m5428m0256l5148l0179k4646j9082j4750j1923j0044
$$ 596190 549919 501502 456074 415818 380670 350491 325845 306763 292013 280090 270046
57645B70046q840q056o866m972l508l453l929l526k386j449n81P72J964K077J727
$$ 270046 261206 253150 246284 241312 237804 234351 230422 226896 224510 223061 222480 223252 225216 227293 229020
57630B29020K038K542K107J268J363J912J121j125l031l576l375k917k012j104
$$ 229020 231058 233600 235707 236975 238338 240250 241371 240246 237215 233639 230264 227347 225335 224231
57616B24231j040j402r39K32P15K50K3L85K85o25j256j003o84r45j333j419j436
$$ 224231 223191 221789 220850 221082 221797 222047 222070 222455 222740 222115 220859 219856 219172 218227 216894 215475 214039
57599B14039j305n91K60P9j148k066k009j841k251k671k481j966j526j096q04
$$ 214039 212734 212143 212403 212482 211334 209268 207259 205418 203167 200496 198015 196049 194523 193427 192623
57584A92623j073j699j918j619j406j388j122q09j123j743j609q21p08j694k646
$$ 192623 191550 189851 187933 186314 184908 183520 182398 181589 180466 178723 177114 176293 175585 173891 171245
57569A71245k779k644k673k307j269l28p9j81k87o12j085j139p85o89q03k47J071
$$ 171245 168466 165822 163149 160842 159573 159245 159166 158985 158698 158086 157001 155862 155077 154388 153585 153338 154409
57552A54409K087K267K280K520K467K011J941K430K470J527L82l52j100j983k146
$$ 154409 156496 158763 161043 163563 166030 168041 169982 172412 174882 176409 176791 176439 175339 173356 171210
57537A71210j244k51K22Q98K119K662J566j31q90q32r79j343j225p04l35K1P68
$$ 171210 169966 169715 169937 170835 172954 175616 177182 177051 176161 175329 174350 173007 171782 171078 170743 170764 171532
57520A71532J453J389R96J281K199K756K594K352K444K489K136J659J465J513
$$ 171532 172985 174374 175370 176651 178850 181606 184200 186552 188996 191485 193621 195280 196745 198258
57506A98258J473J153O42J43k74p33j240j476j276j075j315j616j247m68m56j692
$$ 198258 199731 200884 201526 201669 201395 200662 199422 197946 196670 195595 194280 192664 191417 190949 190493 188801
57490A88801l185l688k977j660l76M16N01J08k75m70n37k72N32J442J792J734
$$ 188801 185616 181928 178951 177291 176915 177331 177832 177940 177665 177195 176658 176386 176918 178360 180152 181886
57474A81886J941K256J766L16j136j971k576l163l136k187r91j76N26J474K249
$$ 181886 183827 186083 187849 188165 187029 185058 182482 179319 176183 173996 173005 172829 173355 174829 177078
57459A77078K325J895J443J056O66M38M57N53O51Q05P90L89J35Q37K218L012K670
$$ 177078 179403 181298 182741 183797 184463 184901 185358 185911 186562 187367 188157 188546 188681 189518 191736 194748 197418
57442A97418J918J359P44l1m04k16j48m64m13M03J199J273J126J440J863J761
$$ 197418 199336 200695 201439 201408 201004 200788 200640 200176 199763 200166 201365 202638 203764 205204 207067 208828
57426B08828J382J323J496J441J131P72L02k18l21J41N74N33M36Q67J697K438
$$ 208828 210210 211533 213029 214470 215601 216373 216675 216457 216136 216277 216851 217384 217820 218687 220384 222822
57410B22822K840K760K107J312J176J787K370K489K515K593K249J559J451K146
$$ 222822 225662 228422 230529 231841 233017 234804 237174 239663 242178 244771 247020 248579 250030 252176
57396B52176K447J567N32O85J666K082J560J027J266K202L328M117M269M099M334
$$ 252176 254623 256190 256722 257407 259073 261155 262715 263742 265008 267210 270538 274655 278924 283023 287357
57381B87357N169N947O121N777N023L685K095J153J102J118O96M30P66J102Q47
$$ 287357 292526 298473 304594 310371 315394 319079 321174 322327 323429 324547 325243 325673 326439 327541 328388
57366C28388L79J20k38p49n29Q49K298K641K226K071K230K207K175K578L136L340
$$ 328388 328767 328887 328649 327900 327371 328220 330518 333159 335385 337456 339686 341893 344068 346646 349782 353122
57350C53122L363L520L467K995K819L516M402M554M235M176M162L625K960K919
$$ 353122 356485 360005 363472 366467 369286 372802 377204 381758 385993 390169 394331 397956 400916 403835
57336D03835L241L140K736K721L045L160L187L609M205M406M363M516M540L901
$$ 403835 407076 410216 412952 415673 418718 421878 425065 428674 432879 437285 441648 446164 450704 454605
57322D54605L060K896L297L554L726M393N313N689N484N255M915M029L123L327
$$ 454605 457665 460561 463858 467412 471138 475531 480844 486533 492017 497272 502187 506216 509339 512666
57308E12666M673N991O485O338N840N157M850N464O503O919O621O452O729O928
$$ 512666 517339 523330 529815 536153 541993 547150 552000 557464 563967 570886 577507 583959 590688 597616
57294E97616O880P088P706Q250Q482Q688Q947Q992Q864Q827Q731Q303Q014Q634
$$ 597616 604496 611584 619290 627540 636022 644710 653657 662649 671513 680340 689071 697374 705388 714022
57280G14022R961J1038J1635J2414J3506J4068J3546J2443J1576J1362J2047J3723
$$ 714022 723983 735021 746656 759070 772576 786644 800190 812633 824209 835571 847618 861341
57268H61341J5694J6714J6255J5094J4384J4572J5314J5948J5976J5517J5306
$$ 861341 877035 893749 910004 925098 939482 954054 969368 985316 1001292 1016809 1032115
57257A032115J5853J6790J7430J7715J7980J8228J8300J8514J9292K0357K1080
$$ 1032115 1047968 1064758 1082188 1099903 1117883 1136111 1154411 1172925 1192217 1212574 1233654
57246A233654K1481K2051K2743K2936K2384K1509K0773K0289J9961J9610J9231
$$ 1233654 1255135 1277186 1299929 1322865 1345249 1366758 1387531 1407820 1427781 1447391 1466622
57235A466622J9449K1050K3623K5433K5505K4960K5319K6352K6831K6632K6508
$$ 1466622 1486071 1507121 1530744 1556177 1581682 1606642 1631961 1658313 1685144 1711776 1738284
57224A738284K6348K5352K3670K2304K1389K0197J8806J8243J8764J9441J9810
$$ 1738284 1764632 1789984 1813654 1835958 1857347 1877544 1896350 1914593 1933357 1952798 1972608
57213A972608K0545K2133K4058K5713K7058K8061K8469K8537K9056L0336L1894
$$ 1972608 1993153 2015286 2039344 2065057 2092115 2120176 2148645 2177182 2206238 2236574 2268468
57202B268468L3191L3948L3795L2700L1650L1791L2810L3295L2777L2172L2135
$$ 2268468 2301659 2335607 2369402 2402102 2433752 2465543 2498353 2531648 2564425 2596597 2628732
57191B628732L2205L1945L1616L1302L0496K9103K7880K7358K7148K6718K6157
$$ 2628732 2660937 2692882 2724498 2755800 2786296 2815399 2843279 2870637 2897785 2924503 2950660
57180B950660K5818K5945K6821K8503L0292L1297L1702L2585L4430L6619L8449
$$ 2950660 2976478 3002423 3029244 3057747 3088039 3119336 3151038 3183623 3218053 3254672 3293121
57169C293121L9594L9552L7857L5136L2874L1759L1161L0500K9915K9348K8155
$$ 3293121 3332715 3372267 3410124 3445260 3478134 3509893 3541054 3571554 3601469 3630817 3658972
57158C658972K6256K4654K4207K4654K5320K5931K6332K6241K5840K5861K6505
$$ 3658972 3685228 3709882 3734089 3758743 3784063 3809994 3836326 3862567 3888407 3914268 3940773
57147C940773K6989K6604K5639K4818K4368K4138K4118K4458K5313K6838K8932
$$ 3940773 3967762 3994366 4020005 4044823 4069191 4093329 4117447 4141905 4167218 4194056 4222988
57136D222988L0975L2274L2807L3103L3476L3972L4868L6483L8551M0524M2410
$$ 4222988 4253963 4286237 4319044 4352147 4385623 4419595 4454463 4490946 4529497 4570021 4612431
57125D612431M4690M7456N0409N3573N7308O1654O6313P1200P6431Q2072Q8472
$$ 4612431 4657121 4704577 4754986 4808559 4865867 4927521 4993834 5065034 5141465 5223537 5312009
57114E312009R6508J06819J19315J34122J52435J75543K03616K36356K74255L18327
$$ 5312009 5408517 5515336 5634651 5768773 5921208 6096751 6300367 6536723 6810978 7129305
57104G129305L69489M29480N01981N91823P03680Q42420J013769J223732J478233
$$ 7129305 7498794 7928274 8430255 9022078 9725758 10568178 11581947 12805679 14283912
57095A4283912J783980K147796K573442L059876L602725M194686M822564N465650
$$ 14283912 16067892 18215688 20789130 23849006 27451731 31646417 36468981 41934631
57087D1934631O097238O684044P184028P551404P745017P719014P396332O668937
$$ 41934631 48031869 54715913 61899941 69451345 77196362 84915376 92311708 98980645
57079I8980645N460020L807754J884265p8227j886708l432596m676257n617170
$$ 98980645 104440665 108248419 110132684 110054457 108167749 104735153 100058896 94441726
57071I4441726o277198o689483o886877o897979o751487o477759o104598n656012
$$ 94441726 88164528 81475045 74588168 67690189 60938702 54460943 48356345 42700333
57063D2700333n156356m631771m106183l598567l123977k693467k311942j978807
$$ 42700333 37543977 32912206 28806023 25207456 22083479 19390012 17078070 15099263
57055A5099263j691691j447700j241789j067539r20386p97849o96460o11252n38622
$$ 15099263 13407572 11959872 10718083 9650544 8730158 7932309 7235849 6624597 6085975
57046F085975m77122m25002l79546l39418l05152k76500k51466k28576k08014
$$ 6085975 5608853 5183851 4804305 4464887 4159735 3883235 3631769 3403193 3195179
57037C195179j89696j72250j54819j38026j22413j07494r3044p9502o6286n1348
$$ 3195179 3005483 2833233 2678414 2540388 2417975 2310481 2217437 2137935 2071649 2020301
57027B020301l3471j3737O172K5600M3173N4041N0638K7715j2323n8725r8065
$$ 2020301 1986830 1973093 1979265 2004865 2048038 2102079 2152717 2180432 2168109 2109384 2011319
57016B011319j22150j31077j29346j20752j07783r3482q0805p0380o1025n2346
$$ 2011319 1889169 1758092 1628746 1507994 1400211 1306729 1225924 1155544 1094519 1042173
57006A042173m5098l9280l3938k8873k4778k1617j8713j6347j5501j5873j5976
$$ 1042173 997075 957795 923857 894984 870206 848589 829876 813529 798028 782155 766179
56995G66179j5445j5378j6131j6597j6079j5185j4359j3046j0911q410n645k070
$$ 766179 750734 735356 719225 702628 686549 671364 657005 643959 633048 624638 618993 616923
56983F16923K082N206N706L062k451r832j7010k1896k4158k4927k4784k3342k0771
$$ 616923 619005 624211 629917 632979 630528 620696 603686 581790 557632 532705 507921 484579 463808
56970D63808j8057j5563j2817r865p313m808j201L426P559J0565J3511J7102K0497
$$ 463808 445751 430188 417371 407506 400193 395385 394184 397610 405169 415734 429245 446347 466844
56957D66844K2844K4317K4591K1804J4449L517q077j7589k3575k6015k5993k4635
$$ 466844 489688 514005 538596 560400 574849 578366 570289 552700 529125 503110 477117 452482
56945D52482k2024j7929j3397j0203q505o601l434K03L513P138J1825J7066K2095
$$ 452482 430458 412529 399132 388929 380424 373823 370389 370592 374105 381243 393068 410134 432229
56932D32229K7066L2083L5863L6343L2068K2614Q658p485k2209l2563l7686l8339
$$ 432229 459295 491378 527241 563584 595652 618266 626924 619439 597230 564667 526981 488642
56920D88642l5888l2023k8305k5236k2309j9231j6389j4027j1963j0299r312q491
$$ 488642 452754 420731 392426 367190 344881 325650 309261 295234 283271 272972 263660 255169
56908B55169o951n002l948l982l749k510j226p31m00N04J444J742J903K741M117
$$ 255169 248218 243216 239268 235286 231537 229027 227801 227070 226670 227174 228618 230360 232263 235004 239121
56893B39121N550P212R359J1616J3676J5933J8608K1029K2453K2662K1086J6541
$$ 239121 244671 251883 261242 272858 286534 302467 321075 342104 364557 387219 408305 424846
56881D24846Q915K12p161j2388j5732j7125j6491j4635j2507j0056o881l386k14
$$ 424846 433761 433973 426812 414424 398692 381567 365076 350441 337934 327878 320997 317611 317397
56868C17397L017P155J2092J7048K2019K7792L4540M1398M7474N2239N4602N2343
$$ 317397 320414 327569 339661 356709 378728 406520 441060 482458 529932 582171 636773 689116
56856F89116M3275K7220O926j2978k8391l7598m1193m0659l7366l2407k6435j9558
$$ 689116 732391 759611 766537 753559 725168 687570 646377 605718 568352 535945 509510 489952
56844D89952j1975m629J617P326J4027K2319L1458M0890N1019O2032P2971Q2169
$$ 489952 477977 473348 474965 482291 496318 518637 550095 590985 642004 704036 777007 859176
56832H59176Q7467Q5620P3123M8977J6506j7967m7920o8730p8858q0098p5867
$$ 859176 946643 1032263 1105386 1154363 1170869 1152902 1104982 1036252 957394 877296 801429
56821H01429o8634n9325m8911l8995l0327k2164j3809n611K208J0408J9541K9042
$$ 801429 732795 673470 624559 585564 555237 533073 519264 513653 515861 526269 545810 574852
56809E74852L8334M7606N6385O2282O2176N4128L7750J4274j2548l6910n4057
$$ 574852 613186 660792 717177 779459 841635 895763 933513 947787 935239 898329 844272
56798H44272o2913o5115o2496n6439m8624m0729l3521k7072k1365j6005j0124
$$ 844272 781359 716244 653748 597309 548685 507956 474435 447363 425998 409993 399869
56787C99869l527K747P883J2575J7891K3523K8168L0976L1464K8520K0907Q827
$$ 399869 396342 399089 406972 419547 437438 460961 489129 520105 551569 580089 600996 609823
56775F09823n648j9613l0487l6866l9009l8312l5901l2218k8065k4791k2841k1073
$$ 609823 604175 584562 554075 517209 478200 439888 403987 371769 343704 318913 296072 274999
56763B74999j8377j5117j2258j0083q585q095q406q250o797m932l913l544k808
$$ 274999 256622 241505 229247 219164 210579 202484 194078 185828 179031 174099 170186 166642 163834
56750A63834j643q21o65r40j558k307k472j778j121j384k052k066j472j085r88
$$ 163834 162191 161370 160705 159765 158207 155900 153428 151650 150529 149145 147093 145027 143555 142470 141482
56735A41482n86K55J067J496J398O54k82l34P77J774J404J87m74k69P4J95L66
$$ 141482 140896 141151 142218 143714 145112 145766 145484 145150 145927 147701 149105 149292 148818 148549 148623 148818 149184
56718A49184P22J252K079K930K905J761O64O34J007O12k70m78J01O14Q46J309
$$ 149184 149906 151158 153237 156167 159072 160833 161497 162131 163138 163750 163480 163002 163103 163717 164563 165872
56702A65872J982K214J776J024K63k33m9O63Q65J3r34q90k28J23L10Q98J394J000
$$ 165872 167854 170068 171844 172868 173131 172898 172849 173512 174377 174390 173456 172566 172338 172461 172771 173669 175063 176063
56684A76063K28J47N68N35K33O11J482J714J203R79J333J418Q02l8q17j671k220
$$ 176063 176291 176438 177006 177541 177774 178385 179867 181581 182784 183763 185096 186514 187316 187278 186461 184790 182570
56667A82570j780o30J95M02N56P25L71l84p08m36k80n16o61n07m06l39R7P00P46
$$ 182570 180790 180160 180355 180757 181313 182038 182409 182025 181317 180881 180601 180085 179424 178917 178511 178172 178269 178969 179715
56648A79715K02k21k60l83p85j124j335j679k004j829j214o51k31K70O70O89O30
$$ 179715 179917 179696 179436 179053 178268 177144 175809 174130 172126 170297 169083 168432 168201 168471 169141 169830 170460
56631A70460Q67J014P21O83J588K558K181P72r0m1k40j137j749j418p54l28Q9
$$ 170460 171327 172341 173062 173745 175333 177891 180072 180844 180754 180713 180473 179336 177587 176169 175415 175087 175176
56614A75176N02K50q34j875k100j681j110o01l28l33j44O40J417J182O8q00r49
$$ 175176 175678 175928 175094 173219 171119 169438 168328 167727 167399 167066 166922 167562 168979 170161 170229 169429 168480
56597A68480r29j062j007o77m18j79M47J273J654J613J746K014J792J127Q01J022
$$ 168480 167551 166489 165482 164805 164387 164208 164655 165928 167582 169195 170941 172955 174747 175874 176675 177697
56581A77697J233J195J216J267J063R22J294J586Q87k31k03J124K157J981J528
$$ 177697 178930 180125 181341 182608 183671 184593 185887 187473 188360 188129 187926 189050 191207 193188 194716
56566A94716J851K696L457M325N679P222Q512R638J1025J2869J4954J6485J6311
$$ 194716 196567 199263 202720 207045 212724 219946 228458 238096 249121 261990 276944 293429 309740
56553C09740J3997J0489O973L544p1l104m411m200l735l590l434l233l222k998
$$ 309740 323737 334226 341199 344743 344672 341568 337157 332957 329222 325632 322198 318965 315743 312745
56539C12745k183j636k441l967m618m280m210m682m736m269m312m985n155m474
$$ 312745 310562 308926 306485 302518 297900 293620 289410 284728 279992 275723 271411 266426 261271 256797
56525B56797l950m060m074l624l256l003k164r08l82q32j251j280j650k421k630
$$ 256797 252847 248787 244713 241089 237833 234830 232666 231758 231376 230544 229293 228013 226363 223942 221312
56510B21312k166k100k663k640j470j77M43Q22J244J135M04j42k56n36q84n19
$$ 221312 219146 217046 214383 211743 210273 210096 210539 211361 212605 213740 214144 214002 213746 213210 212326 211807
56494B11807J50l11j745k185r30L18L06n4J34M8r46j628p81Q39J823K016J815
$$ 211807 211957 211646 209901 207716 206786 207104 207410 207356 207490 207538 206592 204964 204183 205022 206845 208861 210676
56477B10676J047k31j066r20m78k28M01J582K255J724P31O0m82r21o17K09K28
$$ 210676 211723 211492 210426 209506 209028 208800 209201 210783 213038 214762 215493 215553 215071 214150 213533 213742 213970
56460B13970p81j253m20L29q4n41K18J410J681J253R73O56j0j92Q48K276K831
$$ 213970 213189 211936 211516 211845 211761 211220 211438 212848 214529 215782 216755 217411 217401 217209 218057 220333 223164
56443B23164K533K123J846J759K038K120R35j188k438k168j813k196k013m20R93
$$ 223164 225697 227820 229666 231425 233463 235583 236518 235330 232892 230724 228911 226715 224702 224282 225275
56428B25275O32n63q39l16o1M3N87J111J094J262K209K958K497J490R16L30q29
$$ 225275 225907 225344 224505 224189 224128 224171 224758 225869 226963 228225 230434 233392 235889 237379 238295 238625 237796
56411B37796j663j324p21r10j143l76O85Q95P78J252J580O75o61r23l37l4J85
$$ 237796 236133 234809 234088 233178 232035 231659 232344 233239 234017 235269 236849 237524 236863 235940 235603 235569 235754
56394B35754J092J957J488K33j02P49J538J564J129M68j32J68J604K847K693J852
$$ 235754 236846 238803 240291 240524 240422 241171 242709 244273 245402 245870 245738 245906 247510 250357 253050 254902
56378B54902J567J477O30m28m19N45J419J993K508K343R49o44r80k43M20Q25J456
$$ 254902 256469 257946 258576 258148 257729 258274 259693 261686 264194 266537 267486 266842 265862 265619 266039 266864 268320
56361B68320K051K141K110K307K041R73K76P90J333P14K7Q22K301K583J769J295
$$ 268320 270371 272512 274622 276929 278970 279943 280219 281009 282342 283056 283083 283905 286206 288789 290558 291853
56345B91853J254P36M0J30N26J56l64L39J758K236J849K137L221L689L219L063
$$ 291853 293107 293843 293883 294013 294539 294695 294331 294670 296428 298664 300513 302650 305871 309560 312779 315842
56329C15842L739M350M311M078L973L851L878M285M534L952K803J593J22j559
$$ 315842 319581 323931 328242 332320 336293 340144 344022 348307 352841 356793 359596 361189 361311 359752
56315C59752k283j436m20p04j478j040L95J301J328J282J424J606K271L565M431
$$ 359752 357469 356033 355613 354909 353431 352391 352786 354087 355415 356697 358121 359727 361998 365563 369994
56300C69994M232M113N044N950N741N519O476P289O247M495M286N320N815N869
$$ 369994 374226 378339 383383 389333 395074 400593 407069 414358 420605 425100 429386 434706 440521 446390
56286D46390O691P591P054N981O509Q332R418R711J0722J2017J1685J0101R745
$$ 446390 453081 460672 467726 473707 480216 488548 497966 507677 518399 530416 542101 552202 561947
56273E61947J1186J2521J2938J3652J5103J6280J7107J8656K0784K2327K3699
$$ 561947 573133 585654 598592 612244 627347 643627 660734 679390 700174 722501 746200
56262G46200K6447L0218L3050L4849L7590M1929M6539N1102N7034O4765P3146
$$ 746200 772647 802865 835915 870764 908354 950283 996822 1047924 1104958 1169723 1242869
56251A242869Q2047R2885J06030J20022J33855J47762J61639J74831J87401J99435
$$ 1242869 1324916 1417801 1523831 1643853 1777708 1925470 2087109 2261940 2449341 2648776
56241B648776K09358K15392K18034K18434K14925K04358J86491J63746J36996
$$ 2648776 2858134 3073526 3291560 3509994 3724919 3929277 4115768 4279514 4416510
56232D416510J05122O8778L0984o351m3125p7982j08128j32719j53253j70006
$$ 4416510 4521632 4590410 4621394 4615043 4571918 4493936 4385808 4253089 4099836 3929830
56222C929830j81386j87364j90190j90981j88732j83417j76800j69488j60243
$$ 3929830 3748444 3561080 3370890 3179909 2991177 2807760 2630960 2461472 2301229
56213B301229j49084j38060j28066j17910j07326r7927r0332q3153p5696o8922
$$ 2301229 2152145 2014085 1886019 1768109 1660783 1562856 1472524 1389371 1313675 1244753
56203A244753o3104n7251n1412m6835m3349l9413l5031l1703k9274k5981k1889
$$ 1244753 1181649 1124398 1072986 1026151 982802 943389 908358 876655 847381 821400 799511
56192G99511j9004j7668j6149j4151j3170j3033j1745r366q241q681q234o138
$$ 799511 780507 762839 746690 732539 719369 706336 694591 685225 676984 668303 660069 653931
56180F53931m647m901n208m542m132m395l843k193j162j035j0K071K926J853R62
$$ 653931 649284 644383 639175 634633 630501 626106 622263 620070 618908 617873 617863 619934 622860 624713 625675
56165F25675J354J740J842L321O065P495O828O277O827O756N666N885Q236J0367
$$ 625675 627029 628769 630611 633932 639997 647492 654320 660597 667424 674180 679846 685731 693967 704334
56151G04334J0936J1658J3630J5487J6744J9085K2710K5411K6839K9639L4831
$$ 704334 715270 726928 740558 756045 772789 791874 814584 839995 866834 896473 931304
56140I31304M0170M4684N0437N7922O4118O7207O8910P0018O8015O1601N3493
$$ 931304 971474 1016158 1066595 1124517 1188635 1255842 1324752 1394770 1462785 1524386 1577879
56129A577879M6357L9955L4339L1564L1680L1134K7629K2686J7459J0513K016
$$ 1577879 1624236 1664191 1698530 1730094 1761774 1792908 1820537 1843223 1860682 1871195 1873211
56118A873211m513p492j0019j4823k0800k7064l5613m6976n7597o4683o9473p2888
$$ 1873211 1868698 1861206 1851187 1836364 1815564 1788500 1752887 1705911 1648314 1583631 1514158 1441270
56106A441270p2490o6959n9268n2225m4952l6711k9748k5238k0786j5108j0775
$$ 1441270 1368780 1301821 1242553 1190328 1145376 1108665 1078917 1053679 1032893 1017785 1007010
56095A007010r243p777m448j567q20R1K675M392L762L703O067P880O934O086P901
$$ 1007010 997767 989990 985542 983975 983155 983246 985921 990313 994075 997778 1003845 1011725 1018659 1024745 1032646
56080A032646R967R863R689J1389J2424J0750R269J0728J2833J2964J2938J4581
$$ 1032646 1042613 1052476 1062165 1073554 1085978 1096728 1105997 1116725 1129558 1142522 1155460 1170041
56068A170041J5478J3906J3060J5505J8246J8189J7571J9064K0475J9483J8581
$$ 1170041 1185519 1199425 1212485 1227990 1246236 1264425 1281996 1301060 1321535 1341018 1359599
56057A359599K0046K1035J9022J7073J8316K0113J9271J7932J8819J9740J8465
$$ 1359599 1379645 1400680 1419702 1436775 1455091 1475204 1494475 1512407 1531226 1550966 1569431
56046A569431J7765J9999K1989K1041K0507K3563K7243K8487L0048L4102L6482
$$ 1569431 1587196 1607195 1629184 1650225 1670732 1694295 1721538 1750025 1780073 1814175 1850657
56035A850657L4058L1484L3403L6281L5410L3665L5432L8166L8014L7783M1046
$$ 1850657 1884715 1916199 1949602 1985883 2021293 2054958 2090390 2128556 2166570 2204353 2245399
56024B245399M4464M4282M4247M8619N3599N4469N4770N9313O4661O5969O6712
$$ 2245399 2289863 2334145 2378392 2427011 2480610 2535079 2589849 2649162 2713823 2779792 2846504
56013B846504P1804P7637P9019P9510Q4557R0865R3164R4820J00918J07587J09375
$$ 2846504 2918308 2995945 3074964 3154474 3239031 3329896 3423060 3517880 3618798 3726385 3835760
56002C835760J10485J17184J26001J31062J35951J46275J57959J65273J72724
$$ 3835760 3946245 4063429 4189430 4320492 4456443 4602718 4760677 4925950 5098674
55993E098674J86200K00547K09273K17925K33772K51345K63157K75303K96551
$$ 5098674 5284874 5485421 5694694 5912619 6146391 6397736 6660893 6936196 7232747
55984G232747L21550L41652L62499L93137M27924M58021M90387N35626N87750
$$ 7232747 7554297 7895949 8258448 8651585 9079509 9537530 10027917 10563543 11151293
55975A1151293O36843O90560P61021Q42261R24360J017557J137244J278201J430751
$$ 11151293 11788136 12478696 13239717 14081978 15006338 16023895 17161139 18439340 19870091
55966A9870091J608568J831744K097784K401479K767501L229193L793555M465949
$$ 19870091 21478659 23310403 25408187 27809666 30577167 33806360 37599915 42065864
55958D2065864N290265O323025P591403R126278J1013977J3366215J6273450J9837970
$$ 42065864 47356129 53679154 61270557 70396835 81410812 94777027 111050477 130888447
55950A30888447K4167624K9189660L4465043L9253709M2640059M3373427L9745228
$$ 130888447 155056071 184245731 218710774 257964483 300604542 343977969 383723197
55943C83723197L0294473J5250784k702703j9499444l1859091l8663645m0656426
$$ 383723197 414017670 429268454 426565751 407066307 375207216 336543571 295887145
55936B95887145l9302696l5990075l1806180k7501578k3472102j9859086j6712354
$$ 295887145 256584449 220594374 188788194 161286616 137814514 117955428 101243074
55929A01243074j4046633j1813541r929297q343168p034249n959436n058508m300618
$$ 101243074 87196441 75382900 65453603 57110435 50076186 44116750 39058242 34757624
55921C4757624l679496l171429k739003k368143k063558j813959j595373j402259
$$ 34757624 31078128 27906699 25167696 22799553 20735995 18922036 17326663 15924404
55913A5924404j243650j113959r96161q88538q01106p30397o62738n97829n45448
$$ 15924404 14680754 13566795 12570634 11682096 10880990 10150593 9487855 8890026 8344578
55904H344578n03249m60198m17659l85594l61753l35053l05838k83225k66026
$$ 8344578 7841329 7381131 6963472 6577878 6216125 5881072 5575234 5292009 5025983
55895E025983k45246k22189k05822j95060j81178j64992j54638j48846j39028
$$ 5025983 4780737 4558548 4352726 4157666 3976488 3811496 3656858 3508012 3368984
55886C368984j25737j17016j12328j03733r1502q3418p9971p4793o8641o8592
$$ 3368984 3243247 3126231 3013903 2910170 2818668 2735250 2655279 2580486 2511845 2443253
55876B443253p3914p6419p4519p3946p5006p2024o5379o1744o1983o0397n6154
$$ 2443253 2369339 2292920 2218401 2144455 2069449 1997425 1932046 1870302 1808319 1747922 1691768
55865A691768n4252n4959n3156m8564m6232m6541m4731m0530l8566l9022l7298
$$ 1691768 1637516 1582557 1529401 1480837 1434605 1388064 1343333 1302803 1264237 1225215 1187917
55854A187917l3092l0582k9588k5718j9410j6015j6599j7127j6715j8274k1112
$$ 1187917 1154825 1124243 1094655 1068937 1049527 1033512 1016913 999786 983071 964797 943685
55843I43685k1310j9468j9888k2205k1945j9146j8162j9098j7813j4450j3582
$$ 943685 922375 902907 883019 860814 838869 819723 801561 782463 764650 750200 736618
55832G36618j5455j5311j2048r669r521q658o625o402p913p838o450p465j0586
$$ 736618 721163 705852 693804 684135 674614 665956 659331 652929 645016 637178 630728 623263 612677
55819F12677j1504r875r955j2560j3601j1671r986r697q125m889l126l375k639
$$ 612677 601173 591298 581343 568783 555182 543511 533525 523828 515703 510814 507688 504313 501674
55806E01674n76k22j546p90K630M929M868N528P896Q977P793P097P612O443K917
$$ 501674 501098 500876 499330 498540 501170 506099 510967 516495 524391 533368 541161 548258 555870 562313 565230
55791E65230J63o87k257n349p275p264p967r901r950p176m790m660n045n359p721
$$ 565230 565393 564706 562449 557100 549825 542561 534594 524693 514743 507567 502777 498117 493072 487713 479992
55776D79992j1936j4199j2871j0636r085o182j005L962P334J0863J4772J5766
$$ 479992 468056 453857 440986 430350 421265 415083 414078 418040 425374 436237 451009 466775
55764D66775J1865N150k071r492j5734j7880j6100j4388j4623j4226j1479q658
$$ 466775 478640 483790 481719 472227 456493 438613 422513 408125 393502 379276 367797 359139
55752C59139p678p093n740n258o554p682p455p475q516q671p103n811n737m920
$$ 359139 351461 344368 338628 333370 326816 319134 311679 304204 295688 287017 279914 274103 268366 263446
55738B63446k569j031j564k008q47J87j78l15O02K86k605n503n871m933m802m917
$$ 263446 260877 259846 258282 256274 255427 255614 255436 255121 255723 256009 253404 247901 242030 237097 232295 227378
55722B27378m124l374l687l843k715j558j636j807o52J137K469L710N145N765
$$ 227378 223254 219880 216193 212350 209635 208077 206441 204634 203982 205119 207588 211298 216443 222208
55708B22208N366N481O697P288O010L853J695j157m659p009p524p882r017r455
$$ 222208 227574 233055 239752 247040 253050 256903 258598 257441 252782 245773 238249 230367 221350 211895
55694B11895q277o991o758o467n171l818k932j435O99J442J89o78M58J956K113
$$ 211895 203618 196627 189869 183402 178231 174413 171481 170046 170745 172187 172376 171698 172156 174112 176225
55679A76225K001K989M130M161L747L557K549K36j677j912j667k200k709k401
$$ 176225 178226 181215 185345 189506 193253 196810 199359 199595 197918 196006 194339 192139 189430 187029
55665A87029k208k613k222m49Q94O05K13J066J961J737J600K608L311K426J404
$$ 187029 184821 182208 179986 179537 180431 181036 181249 182315 184276 186013 187613 190221 193532 195958 197362
55650A97362J899K929L026K917L527L590J978K56J83N78m50k065k386j993k742
$$ 197362 199261 202190 205216 208133 211660 215250 217228 217484 217667 218245 217795 215730 213344 211351 208609
55635B08609m472n666o246p015p384o320m623l854l850l453k776k597k520j783
$$ 208609 204137 198471 192225 185210 177826 171506 166883 163029 159179 155726 152950 150353 147833 146050
55621A46050r97r93j048k40M65l37j909k389j641j045j159j409j583j900k096
$$ 146050 145053 144060 143012 142772 143237 142900 140991 138602 136961 135916 134757 133348 131765 129865 127769
55606A27769j888j705j860j814j337j237j816k030j360r84j689k271j609o39n92
$$ 127769 125881 124176 122316 120502 119165 117928 116112 114082 112722 111738 110049 107778 106169 105530 104938
55591A04938q52m38j3m28p40J66J296J081N8j08P27J509K019K587K682J741O25
$$ 104938 104086 103648 103635 103207 102467 102633 103929 105010 105068 104960 105687 107196 109215 111802 114484 116225 116850
55574A16850M75R51J241J775L259M998N999O652P612Q054O934M934L274J635q10
$$ 116850 117325 118276 119517 121292 124551 129549 135548 142200 149812 157866 164800 169734 173008 174643 173833
55559A73833l296m473m638n008n512n304m704m712n100m849l949l128k418j588
$$ 173833 170537 166064 161426 156418 150906 145602 140898 136186 131086 126237 122288 119160 116742 115154
55545A15154j209j660j960j217l18m15p79j22R21P95j61k16Q69J577J037j05j070
$$ 115154 113945 112285 110325 109108 108790 108375 107596 107474 108395 109190 109029 108813 109682 111259 112296 112191 111121
55528A11121j584j371n68k70j212k392k428j640j344j690j881j799j787j398j82
$$ 111121 109537 108166 107598 107328 106116 103724 101296 99656 98312 96622 94741 92942 91155 89757 89575
55513H9575Q58M17r38j494r61n35o89o82j78K41K16lk89o57q35p28q40j230r12
$$ 89575 90433 90850 89912 88418 87457 86922 86233 85551 85373 85614 85830 85827 85538 84881 84046 83318 82478 81248 80336
55494H0336N86J976J904J008P43R83N41n86j278j112o04J9P71J094N92K7L10R76
$$ 80336 80922 82898 84802 85810 86553 87536 88077 87491 86213 85101 84497 84516 85287 86381 86973 87000 87310 88286
55476H8286J054O81N02K35n74j122m47P28R51K56k93o32j404k147j729m04L29
$$ 88286 89340 90021 90523 90758 90184 89062 88615 89343 90294 90550 90257 89625 88221 86074 84345 83941 84270
55459H4270j47j051j613j610q35N69J568J289K73m79r62j441j231J87J655J695
$$ 84270 84123 83072 81459 79849 79014 79583 81151 82440 82713 82234 81272 79831 78600 78787 80442 82137
55443H2137P21J56J67J1j03M75J087O08m51o74j20J1k99m6O27N64k13m98p1M5
$$ 82137 82858 83014 83181 83192 83089 83564 84651 85259 84808 84134 84014 84025 83726 83680 84307 84871 84658 84160 84089 84134
55423H4134l89m05M16J277J409P19n96j809j634J39J634J173k09m37L50M33l17
$$ 84134 83745 83340 83756 85033 86442 87161 86565 84756 83122 83261 84895 86068 85859 85422 85772 86205 85888
55406H5888m72P1op67p46L31R94N78Q3J01l2n65p80n72o78j056p82N9L08j45j04
$$ 85888 85416 85487 85481 84714 83968 84299 85293 85871 85954 86055 86023 85458 84678 84106 83428 82372 81590 81649 81957 81812 81708
55385H1708P78J399J216R48R48N93k11o23l85j40m8K96M71l53j512j377J3Q94
$$ 81708 82486 83885 85101 86049 86997 87590 87379 86756 86371 86231 86183 86479 86950 86597 85085 83708 83721 84615
55367H4615O50N19J035J017r2j010o94J10M05K98J03m24j134j294r15q90j302
$$ 84615 85265 85784 86819 87836 87744 86734 86040 86150 86555 86853 86956 86532 85398 84104 83189 82299 80997
55350H0997j206m45l1k24q2O26Q53K33k42j03p6l08J24J200J447L61o30n98n28
$$ 80997 79791 79346 79315 79091 79009 79635 80488 80721 80479 80376 80300 79992 80116 81316 82763 83124 82494 81896 81368
55331H1368j193j591q55L9k5m06l5P04Q06K60l48q98j257q38L87J403J531J276
$$ 81368 80175 78584 77729 77768 77743 77337 77302 78006 78812 79072 78724 77826 76569 75731 76118 77521 79052 80328
55313H0328J144Q34K61L5J71k30j207j437l85O42O08K95N33N55m38j496j278r6
$$ 80328 81472 82306 82567 82602 82773 82543 81336 79899 79514 80156 80764 81059 81592 82147 81709 80213 78935 78839
55295G8839Q72J415J931K207J882J317Q73J80q23j151k35R14J136P25M45Q8o87
$$ 78839 79711 81126 83057 85264 87146 88463 89336 89516 88693 87542 87307 88221 89357 90082 90527 90615 89928
55278H9928j157o38J08N8k77J96J136J216K06q56j302j367j256q40k24K66N51
$$ 89928 88771 88133 88241 88299 88022 88218 89354 90570 90776 89920 88618 87251 85995 85155 84931 85197 85748
55261H5748O75N05J00q6J30L05J36j12l66r89j715j349N18K517L124K483J655
$$ 85748 86423 86928 87028 86942 87072 87377 87513 87401 87035 86046 84331 82982 83500 86017 89141 91624 93279
55244I3279R55J59l87j15O69J035N88k94j037j171n96k6m53j725k437j751m97
$$ 93279 94234 94393 94006 93891 94560 95595 96183 95889 94852 93681 93085 93059 92606 90881 88444 86693 86196
55227H6196J49J01j46m77q26q12m73m25o58j88J260K365J990Q05J38J74L54N75
$$ 86196 86345 86446 86300 85823 84997 84185 83712 83287 82629 82441 83701 86066 88056 88861 88999 89173 89527 90102
55209I0102Q72Q04K26j37J04J73n11j109p11J02K94O8J69L69L2n27n83k79j43
$$ 90102 90974 91778 92004 91867 91971 92144 91633 90524 89813 89915 90209 90277 90446 90815 90847 90320 89737 89458 89315
55190H9315K4N18P51J88m50l22l7n86j439j319l72J51J5J15O92J043R38Q33O85
$$ 89315 89339 89857 90608 90796 90346 90024 89987 89401 87962 86643 86271 86422 86437 86552 87244 88287 89225 90058 90743
55171I0743K6p90p98l4L69q9o69o70k20L71J019J372R63M3m81k17L89R07J350
$$ 90743 90769 89979 89181 89147 89516 89427 88758 88088 87868 88239 89258 90630 91593 91636 91155 90938 91327 92234 93584
55152I3584J616J366O28r8n17p59q93p06j48M65P54N85J67l8K31N92M16k23o70
$$ 93584 95200 96566 97194 97096 96579 95820 94927 94221 94073 94538 95292 95877 96044 96006 96237 96829 97245 97022 96352
55133I6352q14j230j871j712l09J276J835J398N90m08j322j349l17O18N36J35
$$ 96352 95538 94308 92437 90725 90416 91692 93527 94925 95515 95107 93785 92436 92119 92737 93273 93408
55117I3408L77P52K66p02j029p09n16m25J01P22O54K08L45R53J069O14M25O89
$$ 93408 93785 94537 94803 94101 93072 92363 91847 91422 91523 92245 92899 93107 93452 94405 95474 96088 96513 97202
55099I7202P52M88M68P26O42J24k24j14K60Q93J791K299J808Q81M61L16l93j328
$$ 97202 97954 98442 98910 99636 100278 100402 100178 100064 100324 101217 103008 105307 107115 107996 108457 108773 108380 107052
55081A07052j350m93O3K2K68R75J141M80J16P34J362Q84l06r71o16K50Q45P12
$$ 107052 105702 105209 105272 105294 105562 106537 107678 108158 108274 109008 110370 111254 110948 109977 109361 109611 110456 111168
55063A11168J5n38n54n72j186j871j627n97J48L01N44J033J013K20n51o89n27
$$ 111168 111183 110645 110091 109519 108333 106462 104835 104238 104386 104687 105231 106264 107277 107497 106946 106257 105730
55046A05730m62l11L2J99Pk41l80o03q23p06l89m11p39q00n13m19o17n82j97P3
$$ 105730 105268 104957 104989 105188 105195 104954 104574 103971 103148 102442 102053 101642 100903 100103 99590 99171 98554 97972 97775 97848
55026I7848J68N53J071Q63j92r77n93N19J354J442Q11l13j350j588r60m0P82J472
$$ 97848 98016 98569 99640 100503 100311 99334 98741 99260 100614 102056 102867 102554 101204 99616 98656 98616 99398 100870
55008A00870J741J231L76Q6L90M30p1m28l25k93n54n07J27O99P42O12N83L04k48
$$ 100870 102611 103842 104218 104304 104694 105124 105053 104625 104300 104007 103453 102946 103073 103772 104514 105126 105709 106013 105765
54989A05765l99M8K70j87m75K15J273J597J177Q08P42O22L58J78P3j62m71o54
$$ 105765 105366 105414 105684 105497 105022 105237 106510 108107 109284 110092 110834 111456 111814 111992 112065 111903 111432 110778
54971A10778q05j125j476j506j031j46Q14J307R34o3r69j310j039k15R42J747
$$ 110778 109973 108848 107372 105866 104835 104689 105503 106810 107744 107681 106712 105402 104363 104148 105090 106837
54955A06837J620R75P41J015J081Q01Q12J161J013J67l42P6L87n51k135k795k111
$$ 106837 108457 109432 110173 111188 112269 113070 113882 115043 116056 116223 115881 115957 116344 115793 113658 110863 108752
54938A08752j056m39r0L52O77M82p8k45M88J568J825R01j63l10J95N34R03K049
$$ 108752 107696 107257 107167 107519 108196 108678 108600 108355 108843 110411 112236 113137 112974 112664 112859 113393 114296 116345
54920A16345L555M101L525L198L955N076N668N766N453M354K791J996K190J718
$$ 116345 119900 124001 127526 130724 134679 139755 145423 151189 156642 160996 163787 165783 167973 169691
54906A69691o73l776n497n531n127m902m433l619k959k588k161j677j456j426
$$ 169691 169018 165242 159745 154214 149087 144185 139752 136133 133174 130586 128425 126748 125292 123866
54892A23866j242j016j088j234r20j76N02R69J381J552J174N85N07J086J811K344
$$ 123866 122624 121608 120520 119286 118366 118190 118692 119661 121042 122594 123768 124353 124860 125946 127757 130101
54876A30101K775L153L402L662M055M265L977L586L693M000L507J928J41j048
$$ 130101 132876 136029 139431 143093 147148 151413 155390 158976 162669 166669 170176 172104 172245 171197
54862A71197j878l000m446n615o001n505m341k988k109k130k782l315l241k748
$$ 171197 169319 166319 161873 156258 150257 144752 140411 137423 135314 133184 130402 127087 123846 121098
54848A21098k267j829j210n78n33j165j642j168p1O65P37O49O96N84J46l06n07
$$ 121098 118831 117002 115792 115214 114681 113516 111874 110706 110635 111300 112037 112686 113382 113966 114112 113806 113299
54831A13299n38m63k49o8j30j48K99R04R53N05L10M96M02k6P6R47J517R88L1m26
$$ 113299 112761 112298 112049 111981 111851 111703 112002 112906 113859 114364 114674 115170 115572 115546 115622 116569 118086 119074 119105 118679
54811A18679n53r08j232j023n39k26K30J134J770J286K41lP84J460J131Q7q51
$$ 118679 118126 117218 115986 114963 114424 114198 114428 115562 117332 118618 118859 118856 119640 121100 122231 122318 121467
54794A21467j145p06N1M42K67M8P9j81j016j487o52P50J153M45lM81R73O29r7
$$ 121467 120322 119616 119667 120109 120376 120424 120503 120322 119306 117819 117167 117917 119070 119515 119512 119993 120966 121595 121498
54775A21498l51q4L23P68J236J487J463J592K184K922L375L626M020M532M832
$$ 121498 121147 121063 121386 122154 123390 124877 126340 127932 130116 133038 136413 140039 144059 148591 153423
54760A53423M829M791M983N329N374M566K719K84j973l534m381m808n150n488
$$ 153423 158252 163043 168026 173355 178729 183295 186014 186298 184325 180791 176410 171602 166452 160964
54746A60964n471m662l281k298k389l022l094k347j579j513j908j965j271k10
$$ 160964 155493 150831 147550 145252 142863 139841 136747 134400 132821 131308 129400 127435 126164 125954
54732A25954M25K22m05o04n8O96J064J119J237J402J409J451J916K731L483M090
$$ 125954 126379 126601 126196 125592 125534 126230 127294 128413 129650 131052 132461 133912 135828 138559 142042 146132
54716A46132M754N298N143M143K851J776P82n17k078l362l896l753l492l624m001
$$ 146132 150886 156184 161327 165470 168321 170097 170879 170362 168284 164922 161026 157273 153781 150157 146156
54701A46156l961l146k028j333j182j124q87o54o75r18j172j196q58l37j13m48
$$ 146156 142195 139049 137021 135688 134506 133382 132495 131841 131166 130248 129076 127880 127022 126685 126572 126124
54685A26124r25q52j63M53L36l95j033r98l32M76R93J141J008N68j00n70m80k11
$$ 126124 125199 124347 124184 124637 124973 124578 123545 122547 122215 122691 123684 124825 125833 126401 126301 125731 125251 125040
54667A25040n56j571k254j732l08R98J544J295M13p50j509j307l49N83R39P21
$$ 125040 124484 122913 120659 118927 118619 119617 121161 122456 122869 122119 120610 119303 118954 119537 120476 121197
54651A21197K22k37l79p9N08J048J218Q32J8p18q99o28l75k60k5K73K23j56k80
$$ 121197 121419 121182 120803 120724 121232 122280 123498 124330 124348 123630 122731 122103 121728 121468 121443 121716 121939 121783 121503
54632A21503M7K97J69R8L21K43o18j687k039j487l64J082K313K336Q69q63j496
$$ 121503 121550 121847 122016 122114 122435 122678 122060 120373 118334 116847 116483 117565 119878 122214 123083 122220 120724
54615A20724j184q97p17n3Q02Q42J8n79l61N4M8k14m37o45o71j22P87J205Q45
$$ 120724 119540 118643 117926 117873 118675 119517 119535 118956 118595 118649 118697 118483 118046 117401 116730 116608 117395 118600 119445
54596A19445L91L84M89L53L16P43J243J179N54j36n49o25m00p6M3p3j53j12j96
$$ 119445 119836 120220 120709 121062 121378 122121 123364 124543 125097 124961 124412 123787 123387 123311 123354 123281 123128 123016 122820
54577A22820m51n18k04K43N64P78Q30M42l20q85r04o45l66J47R52J423J047L61
$$ 122820 122369 121851 121647 121890 122454 123232 124062 124504 124184 123299 122395 121750 121384 121531 122483 123906 124953 125314
54559A25314L31R65J338R72M58M32O40M04l53r92r64l35L68N75M5q32j105j52
$$ 125314 125645 126610 127948 128920 129378 129810 130450 130854 130501 129509 128545 128210 128578 129153 129198 128366 127261 127109
54541A27109J438K240J623N46L69J165J806J520O25k19p48r11o55k03p6m36q74
$$ 127109 128547 130787 132410 132956 133325 134490 136296 137816 138441 138222 137474 136563 135908 135705 135629 135193 134319
54524A34319j059j132j207j028n19j41k25m49l50M4M82R18J221J045L99j25k27
$$ 134319 133260 132128 130921 129893 129374 129233 129008 128559 128209 128253 128735 129653 130874 131919 132318 132193 131966
54507A31966l49p18p71k24L0p75j749j363K68J456J199J84n68q91r69p14j39L35
$$ 131966 131617 130899 130128 129904 129934 129159 127410 126047 126315 127771 128970 129154 128586 127695 126726 126012 125873 126208
54489A26208M02K70K24K73M16P69J217J325Q11r3q49r93m44L73Q54Q78Q64R62
$$ 126208 126610 126880 127104 127377 127793 128562 129779 131104 131915 131822 130973 129980 129536 129909 130763 131641 132505 133467
54471A33467P85K96K29R41J558J189M18M69J362K030K012J743J396O79k04o08
$$ 133467 134252 134548 134777 135718 137276 138465 138883 139352 140714 142744 144756 146499 147895 148574 148370 147762
54455A47762n27n34o41l87m4l86j160j235n13j78o50p95P1R27P70L11O92J459
$$ 147762 147235 146701 146060 145673 145629 145243 144083 142848 142335 142157 141507 140712 140783 141710 142480 142791 143483 144942
54437A44942J188l95k095k742k140p92N38J115P64N6l75m24k35J64O02O92M38
$$ 144942 146130 145735 143640 140898 138758 137966 138504 139619 140383 140439 140064 139640 139405 139569 140171 140863 141301
54420A41301M29R63J485J357P25J50j64l18l32k71l84o96p85l73K63P51J092J387
$$ 141301 141730 142693 144178 145535 146260 146410 146246 145928 145596 145325 144941 144245 143460 143087 143350 144101 145193 146580
54402A46580J520J395J078N20l26r63o91K88Q24L55l16k84J96L43J19J15N61J118
$$ 146580 148100 149495 150573 151093 150767 149804 149113 149401 150225 150580 150264 149980 150176 150519 150638 150753 151314 152432
54384A52432J367J130O10M58J137J986J731K90q28n23L94N65N7n8M71Q54O54L81
$$ 152432 153799 154929 155539 155997 157134 159120 160851 161141 160313 159790 160184 160749 160806 160748 161219 162073 162727 163108
54366A63108O69J585K759L712M104M049L947L796L086J672J43j044k089l055l334
$$ 163108 163777 165362 168121 171833 175937 179986 183933 187729 190815 192487 192630 191586 189497 186442 183108
54351A83108k652j808j570j594j323j242j997k930k883k064j697j963j774p77
$$ 183108 180456 178648 177078 175484 174161 172919 170922 167992 165109 163045 161348 159385 157611 156834
54337A56834q2n35j404j529r31n19o65q09l35N97J190Q61l8n49k47K87L48L5j02
$$ 156834 156752 156217 154813 153284 152353 151834 151169 150360 150025 150622 151812 152673 152635 152086 151839 152126 152474 152509 152407
54318A52407J7O5n8k18m66q25r15m29J93K31l04q57j212j576j838j581q27o8M32
$$ 152407 152424 152489 152431 152213 151747 150922 150007 149578 149771 150002 149698 148841 147629 146053 144215 142634 141807 141739 142171
54299A42171Q06J032Q73L97pj15N9N45J181J338N65n45q86j85Q37J563J948J992
$$ 142171 142977 144009 144882 145279 145272 145157 145216 145761 146942 148280 148845 148300 147414 147229 148066 149629 151577 153569
54281A53569J608J109R80J042N79n04j440j648j330q76l59O3R7r2J10Q16J341
$$ 153569 155177 156286 157266 158308 158887 158383 156943 155295 153965 153089 152730 152793 152890 152798 152908 153724 155065
54264A55065J149N45R9RL39J226K365K847K081N57o22p38J78J476K159J555R3
$$ 155065 156214 156759 156858 156867 157206 158432 160797 163644 165725 166282 165660 164922 165100 166576 168735 170290 170383
54247A70383r80r24j99L60M80L35J1m49q43j039j116j074p74l43j45j94r7K04
$$ 170383 169403 168479 168280 168640 169120 169455 169466 169017 168174 167135 166019 164945 164171 163828 163683 163489 163392 163596
54229A63596K69J1l3L06L53k68p50k02R32J473J152O68L69j15q44j186p22J39
$$ 163596 163865 163876 163843 164149 164502 164234 163484 163282 164214 165687 166839 167507 167876 167761 166917 165731 165009 165148
54211A65148P27P80L56l64j005j191j011q97r31p65l92l68q96j263o72O39J703
$$ 165148 165875 166655 167011 166647 165642 164451 163440 162543 161612 160847 160455 160087 159191 157928 157256 157895 159598
54194A59598J944J505O28n57j647k019j560r00n94m12J74J071J601J352N92j54
$$ 159598 161542 163047 163675 163118 161471 159452 157892 156992 156398 155986 156160 157231 158832 160184 160776 160622
54178A60622n66m99O7Q65J397J416J170J003Q53M15l02q95j050q93q16r74j063
$$ 160622 160056 159557 159624 160489 161886 163302 164472 165475 166328 166743 166441 165546 164496 163603 162787 161813 160750
54161A60750o55K18Q94P93J87j21Q5J07n59j347j397q58o77j158j479q79L20J283
$$ 160750 160095 160313 161207 162000 162187 162066 162151 162258 161699 160352 158955 158097 157420 156262 154783 153904 154224 155507
54143A55507J735J997K146J810Q11l59r87r02n62m66n93n06N7Q07J147P78L0m17
$$ 155507 157242 159239 161385 163195 164006 163647 162660 161758 161196 160730 160137 159631 159688 160495 161642 162420 162450 162033
54125A62033j88M01O48K00n24p80k71O24J315J491J139M82l8N2P91J675K168K186
$$ 162033 161845 162246 162894 163094 162570 161790 161519 162143 163458 164949 166088 166570 166532 166584 167375 169050 171218 173404
54107A73404J937J580J195R29Q75R24Q99Q28Q78J169J755K634L530L894L335K021
$$ 173404 175341 176921 178116 179045 179920 180844 181743 182571 183449 184618 186373 189007 192537 196431 199766 201787
54091B01787M36j077k314k995k915k286j623j262j127r53n65Q4Q92J554J706J248
$$ 201787 202223 201146 198832 195837 192922 190636 189013 187751 186624 185671 185106 185190 186082 187636 189342 190590
54075A90590N49L32J092K469L273K528O11r87j156j79Q27J056M41o07j528j958
$$ 190590 191139 191471 192563 195032 198305 200833 201444 200457 199301 199122 199949 201005 201446 200839 199311 197353
54059A97353k039k179k364k093j200k20L94R27J753K501K530J991J691K004K532
$$ 197353 195314 193135 190771 188678 187478 187258 187652 188579 190332 192833 195363 197354 199045 201049 203581
54044B03581K837K922K960L026L168L426L657L735L812M176M831N530O094O492
$$ 203581 206418 209340 212300 215326 218494 221920 225577 229312 233124 237300 242131 247661 253755 260247
54030B60247O718O847O929O709N736M122K778K445K839L221L355L399L252K756
$$ 260247 266965 273812 280741 287450 293186 297308 300086 302531 305370 308591 311946 315345 318597 321353
54016C21353K153J582N04j498l602m539m379m430n338o307o467n963n346m768
$$ 321353 323506 325088 325592 324094 320492 315953 311574 307144 301806 295499 289032 283069 277723 272955
54002B72955m275m169m461m600m154l317k470j762j397j663k314k564k132j694
$$ 272955 268680 264511 260050 255450 251296 247979 245509 243747 242350 240687 238373 235809 233677 231983
53988B31983j894k462k775k738k508j962j056l44m14j013j337j050n11j26J0k1
$$ 231983 230089 227627 224852 222114 219606 217644 216588 216244 215830 214817 213480 212430 211919 211793 211803 211782
53972B11782k1L01R49J430J254O68M77J216K662M187N335O087O751P622Q584R107
$$ 211782 211761 212062 213011 214441 215695 216363 216840 218056 220718 224905 230240 236327 243078 250700 259284 268391
53956B68391Q574O659L492k40l404n075n250m739m285m016l722l254k513j460
$$ 268391 276965 283624 287116 286876 283472 278397 273147 268408 264123 260107 256385 253131 250618 249158
53942B49158k63Q24J825K883L737L948L672L681M287M876M814M229L504K644J700
$$ 249158 248895 249719 251544 254427 258164 262112 265784 269465 273752 278628 283442 287671 291175 293819 295519
53927B95519J338K120L567M643N018N214N574N854N871N865N993O024N828N772
$$ 295519 296857 298977 302544 307187 312205 317419 322993 328847 334718 340583 346576 352600 358428 364200
53913C64200O239P054P783Q331Q847R115Q540O949M987L434K296J033m30j469
$$ 364200 370439 377493 385276 393607 402454 411569 420109 427058 432045 435479 437775 438808 438378 436909
53899D36909j710j708k235l236l985m105l942l968m301m860n561o284o898p397
$$ 436909 435199 433491 431256 428020 424035 419930 415988 412020 407719 402859 397298 391014 384116 376719
53885C76719p815q053q050p977p956p758p188o532o169n930n372m542l820l184
$$ 376719 368904 360851 352801 344824 336868 329110 321922 315390 309221 303291 297919 293377 289557 286373
53871B86373k332j574j669k676l736m201m258m125l560k612k032k350l061l335
$$ 286373 284041 282467 280798 278122 274386 270185 265927 261802 258242 255630 253598 251248 248187 244852
53857B44852l091k801k674k574k420k211j867j468j343j578j717j348o32OL68
$$ 244852 241761 238960 236286 233712 231292 229081 227214 225746 224403 222825 221108 219760 219128 219134 219502
53842B19502L87l6p24j146j037p20m86j74L29O68N47K43R1k7k11j06M42P81K90
$$ 219502 219889 219853 219129 217983 216946 216226 215740 215566 215895 216563 217110 217353 217444 217417 217206 217100 217542 218323 218613
53823B18613n35o31J81J062J361J266J173J035O06n4n52n02R7Q13J261J612K352
$$ 218613 218078 217447 217628 218690 220051 221317 222490 223525 224131 224077 223525 223023 223120 223933 225194 226806 229158
53806B29158L481M473N101N676O290O478O039N517N352N248M926M773N023N032
$$ 229158 232639 237112 242213 247889 254179 260657 266696 272213 277565 282813 287739 292512 297535 302567
53792C02567M238L300L217L780L941L428K886K606K230J690J335J027J67j190
$$ 302567 306805 310105 313322 317102 321043 324471 327357 329963 332193 333883 335218 336245 336412 335222
53778C35222k191k470k662l403m535n634o562p103o800n657m482m079m362m620
$$ 335222 333031 330561 327899 324496 319961 314327 307765 300662 293862 288205 283723 279644 275282 270662
53764B70662m254l171j846j169j739l071l930l695k931k462k420k428k244j797
$$ 270662 266408 263237 261391 260222 258483 255412 251482 247787 244856 242394 239974 237546 235302 233505
53750B33505j067l38j92p75j348j029J09J078J043J07r63j522j501j201p44L8
$$ 233505 232438 232100 231908 231133 229785 228756 228865 229943 230986 231093 230130 228608 227107 225906 225162 225200
53734B25200J095J762J298j24j420j753j381j126j218j082j95J126K035K063J551
$$ 225200 226295 228057 229355 229231 227811 226058 224677 223551 222333 221251 221056 222182 224217 226280 227831
53719B27831J121R95J020J127J382J644J651J526J670K053K169J948K083K979
$$ 227831 228952 229947 230967 232094 233476 235120 236771 238297 239967 242020 244189 246137 248220 251199
53705B51199L971M181L660L052K582K118J906K386L380M231M688M942M941M421
$$ 251199 255170 259351 263011 266063 268645 270763 272669 275055 278435 282666 287354 292296 297237 301658
53691C01658L567K852K262J376K84m43o86r46j361j415q20lN83Q55O10n07k179
$$ 301658 305225 308077 310339 311715 311999 311556 310870 309924 308563 307148 306328 306325 306908 307763 308373 307866 305687
53674C05687l269l106k325j887j819j466n90L91R75R11K50n91j021q99o73o53
$$ 305687 302418 299312 296987 295100 293281 291815 291225 291616 292591 293502 293752 293161 292140 291241 290568 289915
53658B89915n39l9N10N85K93J78L96O02N24K59pj87k04k3K46M47O08Q44J170J529
$$ 289915 289376 289337 289847 290432 290725 290903 291299 291901 292425 292684 292677 292490 292286 292263 292509 292956 293564 294408 295578 297107
53638B97107J960K523L078L300K963K211J550J447J909K482K835L127L658M346
$$ 297107 299067 301590 304668 307968 310931 313142 314692 316139 318048 320530 323365 326492 330150 334496
53624C34496M886N197N339N119M321L196K284J727J337J259J885K976L620L338
$$ 334496 339382 344579 349918 355037 359358 362554 364838 366565 367902 369161 371046 374022 377642 380980
53610C80980K649K236K148K174K423L048L759M082L820L073K175J720K079K656
$$ 380980 383629 385865 388013 390187 392610 395658 399417 403499 407319 410392 412567 414287 416366 419022
53596D19022K326J028O0K66P28K13q24q87K12R45J46j582k804k852k089j327j310
$$ 419022 421348 422376 422436 422702 423430 423643 422819 421932 422144 423089 423235 421653 418849 415997 413908 412581 411271
53579D11271k232l370l670k956k220k292k808k822k120j331j013j154j502j857
$$ 411271 409039 405669 401999 399043 396823 394531 391723 388901 386781 385450 384437 383283 381781 379924
53565C79924j980j648r36k20K07L14J38k83o56m84L58J317J685J366Q51N60N18
$$ 379924 377944 376296 375360 375140 375347 375661 375799 375516 374860 374376 374734 376051 377736 379102 379953 380513 381031
53548C81031O10P66Q90R25J053J542K295K903L266L757M575N353N689N631N407
$$ 381031 381641 382407 383297 384222 385275 386817 389112 392015 395281 399038 403613 408966 414655 420286 425693
53533D25693N027M691N037O387Q024Q896Q937R046R842J1109J2381J3408J3973
$$ 425693 430720 435411 440448 446835 454859 463755 472692 481738 491580 502689 515070 528478 542451
53520E42451J4005J4006J4670J5922J6879J7074J7037J7452J8401J9786K1751
$$ 542451 556456 570462 585132 601054 617933 635007 652044 669496 687897 707683 729434
53509G29434K4182K6293K7421K7807K8091K8335K8196K7724K7341K7111K6645
$$ 729434 753616 779909 807330 835137 863228 891563 919759 947483 974824 1001935 1028580
53498A028580K5768K4703K3610K2410K1193K0300J9806J9323J8593J8017J8199
$$ 1028580 1054348 1079051 1102661 1125071 1146264 1166564 1186370 1205693 1224286 1242303 1260502
53487A260502J9107K0036K0417K0364K0236J9964J9241J8205J7462J7327J7449
$$ 1260502 1279609 1299645 1320062 1340426 1360662 1380626 1399867 1418072 1435534 1452861 1470310
53476A470310J7374J6950J5939J3807J0501O962M168J955m93l318n982q471j1323
$$ 1470310 1487684 1504634 1520573 1534380 1544881 1551843 1556011 1557966 1557473 1554155 1548173 1539702 1528379
53463A528379j4361j6506j7290j7543j8102j8607j8381j7721j7546j8172j9166
$$ 1528379 1514018 1497512 1480222 1462679 1444577 1425970 1407589 1389868 1372322 1354150 1334984
53452A334984k0131k0937k1469k1754k2114k2631k2755k2005k0868k0250k0118
$$ 1334984 1314853 1293916 1272447 1250693 1228579 1205948 1183193 1161188 1140320 1120070 1099952
53441A099952j9389j7301j4391j1827j0081q518o285l479j262o10j057j146j32
$$ 1099952 1080563 1063262 1048871 1037044 1026963 1018445 1012160 1008681 1007419 1006809 1005752 1004606 1004474
53428A004474J383K663L942N776P899R494J0303J0778J1361J2273J3802J6073
$$ 1004474 1005857 1008520 1012462 1018238 1026137 1035631 1045934 1056712 1068073 1080346 1094148 1110221
53416A110221J8489K0150K1008K2011K3892K6263K8184K9346L0397L2194L4879
$$ 1110221 1128710 1148860 1169868 1191879 1215771 1242034 1270218 1299564 1329961 1362155 1397034
53405A397034L7641L9485M0313M1139M3038M5964M8815N0599N1312N1808N2973
$$ 1397034 1434675 1474160 1514473 1555612 1598650 1644614 1693429 1744028 1795340 1847148 1900121
53394A900121N5057N7550N9659O0973O1616O1859O1767O1321O0583N9638N8474
$$ 1900121 1955178 2012728 2072387 2133360 2194976 2256835 2318602 2379923 2440506 2500144 2558618
53383B558618N7072N5329N2979M9925M6631M3676M0777L6852L1331K4926J8767
$$ 2558618 2615690 2671019 2723998 2773923 2820554 2864230 2905007 2941859 2973190 2998116 3016883
53372C016883J3262Q199L370j427o599j2418j8756k5517l2872m0501m7207n1993
$$ 3016883 3030145 3038344 3041714 3040287 3033688 3021270 3002514 2976997 2944125 2903624 2856417 2804424
53360B804424n5118n7386n8807n8938n8273n8129n8941n9595n8812n6541n3718
$$ 2804424 2749306 2691920 2633113 2574175 2515902 2457773 2398832 2339237 2280425 2223884 2170166
53349B170166n1154m9075m7423m6199m5434m4995m4465m3450m2125m1054m0305
$$ 2170166 2119012 2069937 2022514 1976315 1930881 1885886 1841421 1797971 1755846 1714792 1674487
53338A674487l9102l6763l3628l0596k8125k6179k4741k3591k1887j8876j5105
$$ 1674487 1635385 1598622 1564994 1534398 1506273 1480094 1455353 1431762 1409875 1390999 1375894
53327A375894j2205j1324j2195j3709j4890j5328j5286j5362j5680j5518j4186
$$ 1375894 1363689 1352365 1340170 1326461 1311571 1296243 1280957 1265595 1249915 1234397 1220211
53316A220211j2086j0286r205q384p362o019m234k011R8J469K303L285M438N254
$$ 1220211 1208125 1197839 1188634 1180250 1172888 1166869 1162635 1160624 1160722 1162191 1164494 1167779 1172217 1177471
53302A177471N896P230R478J1926J4178J6655J9416K1662K3004K4209K5944K7650
$$ 1177471 1183367 1190597 1200075 1212001 1226179 1242834 1262250 1283912 1306916 1331125 1357069 1384719
53290A384719K8576K9124L0147L1415L1821L0899K9173K7164K4835K2153J9440
$$ 1384719 1413295 1442419 1472566 1503981 1535802 1566701 1595874 1623038 1647873 1670026 1689466
53279A689466J6985J4695J2255R325N635J190l516p731j0985j3389j5442j7584
$$ 1689466 1706451 1721146 1733401 1742726 1748361 1749551 1746035 1738304 1727319 1713930 1698488 1680904
53267A680904j9801k1707k3147k4539k6260k7926k8844k9067k9315k9838l0222
$$ 1680904 1661103 1639396 1616249 1591710 1565450 1537524 1508680 1479613 1450298 1420460 1390238
53256A390238l0361l0720l1292l1295l0460k9716k9836l0212k9854k8940k8331
$$ 1390238 1359877 1329157 1297865 1266570 1236110 1206394 1176558 1146346 1116492 1087552 1059221
53245A059221k8060k7467k6595k6243k6550k6641k5875k4609k3364k2001k0219
$$ 1059221 1031161 1003694 977099 950856 924306 897665 871790 847181 823817 801816 781597
53234G81597j8294j6793j5828j4913j3559j1705r721q054o917o335o450p454r095
$$ 781597 763303 746510 730682 715769 702210 690505 680784 672730 665813 659478 653028 645574 636479
53221F36479j0653j1664j2330j2830j2807j2132j1745j2732j4650j5710j4788
$$ 636479 625826 614162 601832 589002 576195 564063 552318 539586 524936 509226 494438
53210D94438j2581j0569r490r149r006q526p416n990n001m839n177n578n989o417
$$ 494438 481857 471288 461798 452649 443643 435117 427701 421711 416710 411871 406694 401116 395127 388710
53196C88710o661o712o994p641q048p663o869o394o097n223l810k909l168l907
$$ 388710 382049 375337 368343 360702 352654 344991 338122 331728 325631 320408 316598 313689 310521 306614
53182C06614m116l801l765m282m707m333l167j754o63k66p00j673k517k657k099
$$ 306614 302498 298697 294932 290650 285943 281610 278443 276689 276026 275760 275060 273387 270870 268213 266114
53167B66114j337q23o36n97n75o54r72j433j650j307o16j66k19l37P7R34J515
$$ 266114 264777 263954 263318 262721 262146 261492 260520 259087 257437 256130 255514 255348 255129 254792 254869 255803 257318
53150B57318J244K76p74j421j540j275q52m68k18j16j44j80j2L99P20N40l9l89
$$ 257318 258562 258838 258064 256643 255103 253828 252976 252508 252290 252174 252030 251850 251838 252237 252957 253497 253458 253069
53132B53069o6O37J067R94Q06R23J230J293J024Q90J272J805J728R81M39P70J449
$$ 253069 253003 253640 254707 255701 256507 257430 258660 259953 260977 261867 263139 264944 266672 267653 268092 268862 270311
53115B70311J484Q72N66R79J331Q57o8n50m48l07l82m28m38q11j639k440k764
$$ 270311 271795 272667 273233 274212 275543 276400 276332 275782 275334 275027 274645 274217 273779 272968 271329 268889 266125
53098B66125k659k290j535l67P26J142P99Q2o71j275j503j244q26p14q37o63n0
$$ 266125 263466 261176 259641 259274 260000 261142 261941 262023 261352 260077 258574 257330 256504 255790 254953 254290 254240
53081B54240M73M41K6m58j075j834k202j747r82q02j172j203n62P5J76O9R2j20
$$ 254240 254713 255154 255180 254722 253647 251813 249611 247864 246882 246080 244908 243705 243143 243218 243394 243463 243555 243435
53063B43435q56j547j549j170j037r52l23N96R05N01K62O73J203J201O80m2p13
$$ 243435 242579 241032 239483 238313 237276 236324 236001 236597 237502 238003 238265 238938 240141 241342 242022 241980 241267
53046B41267r23k89P75J273R10M82N39N22k07j169j441j012o32o52p70p70p40
$$ 241267 240344 240055 240830 242103 243013 243495 244034 244556 244349 243180 241739 240727 240095 239443 238673 237903 237163
53029B37163o61l85k6J45J95M16P93J000R17P36N94M91M63M55J65n22j058p98
$$ 237163 236502 236117 236091 236236 236431 236847 237640 238640 239557 240293 240887 241378 241841 242296 242461 241939 240881 240083
53011B40083K3M93K79P2N16J263J492R91L03k6J6O3j66n80p70m58J59N79N95N16
$$ 240083 240106 240599 240878 240950 241466 242729 244221 245212 245515 245489 245505 245568 245402 244822 244052 243594 243753 244332 244927 245443
52991B45443O62Q33N45k70j015r51R5J558K652K961K614K017J594J664K244K880
$$ 245443 246105 246938 247483 247213 246198 245247 245342 246900 249552 252513 255127 257144 258738 260402 262646 265526
52975B65526K895J968M70r04j673j718j154k52N94J074J121Q27L32p4k3N43J131
$$ 265526 268421 270389 270859 269955 268282 266564 265410 265158 265752 266826 267947 268774 269106 269032 269009 269552 270683
52958B70683J168O48Q7k03m87j155k081k644k387j582r61r33j212j334j275j244
$$ 270683 271851 272499 272586 272383 271896 270741 268660 266016 263629 262047 261086 260153 258941 257607 256332 255088
52942B55088j159p78l36l84q79j066n70J9L2l50o07p77j080j133m77L38K17q72
$$ 255088 253929 253151 252815 252431 251552 250486 249916 249935 249967 249617 249010 248233 247153 246020 245543 245881 246098 245226
52924B45226j720j561r59n82o1J151K440K572J388R0k70J29M61L50J5k26j51M05
$$ 245226 243506 241945 240986 240404 240343 241494 243934 246506 247894 247984 247714 247843 248304 248654 248669 248443 248292 248697
52906B48697J251J655R41n09j382q64L33P89R9p97r55n10j94l09o36r83j256j208
$$ 248697 249948 251603 252544 252035 250653 249789 250122 250911 251010 250213 249258 248748 248554 248245 247609 246626 245370 244162
52888B44162o29K34R21J336J640J649R87q6o84l96J48K31O3L14R90J485J583J767
$$ 244162 243533 243767 244688 246024 247664 249313 250300 250214 249530 249134 249282 249513 249576 249890 250880 252365 253948 255715
52870B55715K359K975L063K612J979J345P51M57Q10J682K454K644K330J772R36
$$ 255715 258074 261049 264112 266724 268703 270048 270799 271256 272066 273748 276202 278846 281176 282948 283884
52855B83884l07j748k872l397l452l265k885k379k083k403l316m239m447l710
$$ 283884 283577 281829 278957 275560 272108 268843 265958 263579 261496 259093 255777 251538 247091 243381
52841B43381k461j313n03N1K54j73j070j618j212l16O3l48q65q55m51k6M30J099
$$ 243381 240920 239607 239104 239155 239409 239236 238166 236548 235336 235020 235083 234735 233870 233015 232564 232538 232968 234067
52823B34067J785J993J423K38j022j733j654j163q44p50m83N3M34M22L26M03M43
$$ 234067 235852 237845 239268 239506 238484 236751 235097 233934 233090 232340 231857 231910 232344 232766 233092 233495 233938
52806B33938K71K39P01J401J779J584Q38l87j656k105j357k75r7r52j839j958
$$ 233938 234209 234448 235149 236550 238329 239913 240751 240364 238708 236603 235246 234971 234874 233922 232083 230125
52790B30125j494j096j128j495j779j502o37K73P99J189J790K171J597K65o63
$$ 230125 228631 227535 226407 224912 223133 221631 220994 221267 222066 223255 225045 227216 228813 229078 228415
52775B28415m00O84J664J903J218j12j270j424o11K90N92L82L7k63l61j32J24
$$ 228415 228015 228699 230363 232266 233484 233372 232102 230678 230067 230357 230949 231331 231368 231105 230744 230612 230736
52758B30736j67r07j181n18K89J97n57p53J33J239J522J091R31J530K280K362
$$ 230736 230569 229662 228481 227963 228252 228449 227892 227139 227272 228511 230033 231124 232055 233585 235865 238227
52742B38227J818J338J172R23N31O87J692K582K190Q08j56m8M37N70M62M11L05
$$ 238227 240045 241383 242555 243478 244009 244696 246388 248970 251160 251968 251812 251764 252201 252771 253233 253644 253949
52725B53949J17J83M83L31o14j658j952j593j221j022p66m35j60J69N89O45m4
$$ 253949 254066 254249 254732 255063 254449 252791 250839 249246 248025 247003 246237 245802 245642 245811 246400 247045 247001
52708B47001j018j412j041n19l03k86k48k09k25j87M9M99R59R98L25o50r97l85
$$ 247001 245983 244571 243530 243011 242708 242422 242174 241965 241740 241553 241602 242101 243060 244058 244383 243733 242736 242351
52690B42351M17N93L43L24M25M0p06r51l99K32L45K12L05M78L02k61q50j122q76
$$ 242351 242768 243361 243704 244028 244453 244493 243787 242836 242437 242669 243014 243226 243531 244009 244311 244050 243200 242078 241202
52671B41202j34O80R96P67N03M60K96j33j88P59K233L041K682J812J235J047R50
$$ 241202 241068 241748 242744 243511 244014 244474 244770 244637 244449 245208 247441 250482 253164 254976 256211 257258 258208
52654B58208R39J287J990K675L054L136K900K033L29j761l323l835l579l055k350
$$ 258208 259147 260434 262424 265099 268153 271289 274189 276222 276551 274790 271467 267632 264053 260998 258648
52639B58648j380m08J46L39N95R63R74M58q7j36J96N30Q63J424K119K597K695
$$ 258648 257268 256860 257006 257345 257940 258903 259877 260335 260248 260112 260308 260838 261701 263125 265244 267841 270536
52622B70536K401J544N1j578k564k688k383j988j435q08n77q87j104n62N20J330
$$ 270536 272937 274481 274532 272954 270390 267702 265319 263331 261896 261088 260511 259624 258520 257958 258478 259808
52606B59808J461J069L66m87r99o16N02J411J467R91O59N38K09m21q39n48K93
$$ 259808 261269 262338 262704 262217 261218 260602 261104 262515 263982 264973 265632 266170 266379 265958 265119 264571 264864
52589B64864R83R89N37L83Q90J510J467Q67N31Q18J188J241J413K093K650K086
$$ 264864 265847 266836 267373 267756 268646 270156 271623 272490 273021 273839 275027 276268 277681 279774 282424 284510
52573B84510M90r93j525j310q98m99j34Q5O0j50m83q28q98n63k09l60q36r33m92
$$ 284510 285000 284007 282482 281172 280274 279775 279641 279726 279786 279636 279153 278325 277427 276864 276655 276295 275459 274526 274034
52554B74034j65m15q33q44n77m98o25n43m2O86J279J375P78k48j046j168p37l3
$$ 274034 273869 273454 272621 271777 271200 270702 270077 269534 269492 270178 271457 272832 273610 273362 272316 271148 270411 270378
52536B70378Q87J817K109J315p3r87q64n2P68J176J091O69K14j3N8L55P19Q61
$$ 270378 271265 273082 275191 276506 276433 275446 274582 274530 275298 276474 277565 278234 278448 278435 278493 278848 279567 280428
52518B80428N72R5m3K31L84J50R2Q19K026K846K944K686K475K482K821L358L445
$$ 280428 281000 281095 281052 281283 281667 281817 281909 282728 284754 287600 290544 293230 295705 298187 301008 304366 307811
52501C07811K535R87l72j432k733m153m648l719k347j831k203k418j843q99l24
$$ 307811 310346 311333 310961 309529 306796 302643 297995 294276 291929 290098 287895 285477 283634 282735 282411
52486B82411l11m81l98m8J47j69p30q80l84K85O67R39J419J847J643Q36K21M41
$$ 282411 282100 281619 281221 281173 281320 281151 280421 279541 279157 279442 280109 281048 282467 284314 285957 286793 287014 287455
52468B87455J236J719J305K92l60J27J640L232M025L956L615L421L220K599J392
$$ 287455 288691 290410 291715 292007 291647 291774 293414 296646 300671 304627 308242 311663 314883 317482 318874
52453C18874j43j600k742l633m389m845m608l580k287j480j457j887k222k085
$$ 318874 318731 317131 314389 310756 306367 301522 296914 293334 291047 289567 288110 286223 284001 281916
52439B81916j386l99K82J76o22j556k205k419j986o65J111K126J589K31m41Q5
$$ 281916 280530 280131 280413 280589 279967 278411 276206 273787 271801 271136 272247 274373 275962 276193 275752 275837
52423B75837R36J256J201J190R37P0p74m65R55K036J728P40N28J454K674L584
$$ 275837 276773 278029 279230 280420 281357 281427 280653 280188 281143 283179 284907 285647 286175 287629 290303 293887
52407B93887M558O087P884R319J0398J1666J3201J4098J3228J0248N713M58m696
$$ 293887 298445 304532 312416 321735 332133 343799 357000 371098 384326 394574 400287 400745 396049
52394C96049q744j0660j0166q246o413n488n161m720l872k842k005j612j634j722
$$ 396049 387305 376645 366479 358233 351820 346332 341171 336451 332579 329737 327732 326120 324486 322764
52380C22764j421n89M38J156J318J089R68J538K994M765N854N781N092M716M977
$$ 322764 321343 320754 321192 322348 323666 324755 325723 327261 330255 335020 340874 346655 351747 356463 361440
52365C61440N380N257M336K764R46o01j474j744j957k546l195l007j574L15J342
$$ 361440 366820 372077 376413 379177 380123 379522 378048 376304 374347 371801 368606 365599 364025 364340 365682
52350C65682J095N00N87J271J691J500J144J046J173J555K520L986N114N236M812
$$ 365682 366777 367277 367864 369135 370826 372326 373470 374516 375689 377244 379764 383750 388864 394100 398912
52335C98912M922N895O988P410P295P510Q712J0702J2574J3521J3629J3811J4994
$$ 398912 403834 409729 416717 424127 431422 438932 447644 458346 470920 484441 498070 511881 526875
52322E26875J7288J9998K2162K3125K2827K1824K0871K0313J9981J9671J9457
$$ 526875 544163 564161 586323 609448 632275 654099 674970 695283 715264 734935 754392
52311G54392J9426J9394J9124J8604J7942J7245J6727J6655J6929J6977J6400
$$ 754392 773818 793212 812336 830940 848882 866127 882854 899509 916438 933415 949815
52300I49815J5390J4385J3540J2796J2082J1120R477P175M851K836N66k537n902
$$ 949815 965205 979590 993130 1005926 1018008 1029128 1038605 1045780 1050631 1053467 1054033 1051496 1045594
52287A045594q341r494j0020j0484j0810j0818j0518r729q165o078m205k827j470
$$ 1045594 1037253 1027759 1017739 1007255 996445 985627 975109 965380 957215 951137 946932 944105 942635
52274I42635K73K171L863N405O957Q421R774J1249J2884J4186J4678J4499J4171
$$ 942635 942908 945079 948942 954347 961304 969725 979499 990748 1003632 1017818 1032496 1046995 1061166
52261A061166J4005J4001J4077J4076J3816J3414J3297J3702J4311J4650J4553
$$ 1061166 1075171 1089172 1103249 1117325 1131141 1144555 1157852 1171554 1185865 1200515 1215068
52250A215068J4005J2901J1286R566Q007O181L367m98m662q312j1141j3128j4165
$$ 1215068 1229073 1241974 1253260 1262826 1270833 1277014 1280381 1279883 1275221 1266909 1255768 1242640 1228475
52237A228475j4165j3430j2661j2476j2905j3375j3266j2535j1683j1127j0778
$$ 1228475 1214310 1200880 1188219 1175743 1162838 1149463 1136197 1123662 1111979 1100852 1090074
52226A090074j0267r440q463p605p012o662o297n574m349k907j810j398j434j242
$$ 1090074 1079807 1070367 1061904 1054299 1047287 1040625 1034328 1028754 1024405 1021498 1019688 1018290 1016856 1015614
52212A015614k64J491L533N371O720P378P238O636O270O391O364N481M058L135
$$ 1015614 1015350 1016841 1020374 1025745 1032465 1039843 1047081 1053717 1059987 1066378 1072742 1078223 1082281 1085416
52198A085416L169L596L846M124M841N737O057N493M584M156M527N312N894O039
$$ 1085416 1088585 1092181 1096027 1100151 1104992 1110729 1116786 1122279 1126863 1131019 1135546 1140858 1146752 1152791
52184A152791N885N332L870J368j323l162m258n674p818r757j0461j0083r561
$$ 1152791 1158676 1164008 1167878 1169246 1167923 1164761 1160503 1154829 1147011 1137254 1126793 1116710 1107149
52171A107149r384r275q776p628n815l700k074j540j774j692m82J589L440M216
$$ 1107149 1097765 1088490 1079714 1072086 1066271 1062571 1060497 1058957 1057183 1055491 1055009 1056598 1060038 1064254
52157A064254M098M016M458M772M005K238N52l38o94r79j107r55q70j085j035
$$ 1064254 1068352 1072368 1076826 1081598 1085603 1087841 1088393 1088055 1087361 1086382 1085275 1084320 1083450 1082365 1081330
52142A081330k8J693L116L597L294K615J736P57j36o56m39Q17K952N311P458R667
$$ 1081330 1081302 1082995 1086111 1089708 1093002 1095617 1097353 1098110 1097974 1097318 1096879 1097696 1100648 1105959 1113417 1123084
52126A123084J2363J5263J7679J9519K1439K3946K6791K9399L1500L3111L4097
$$ 1123084 1135447 1150710 1168389 1187908 1209347 1233293 1260084 1289483 1320983 1354094 1388191
52115A388191L3991L2375K9555K6685K4854K3905K2642K0335J7455J4605J1590
$$ 1388191 1422182 1454557 1484112 1510797 1535651 1559556 1582198 1602533 1619988 1634593 1646183
52104A646183Q224N338L867L332K458J179O74J277J658O57j216k878m349o370
$$ 1646183 1654407 1659745 1663612 1666944 1669402 1670581 1671255 1672532 1674190 1674847 1673631 1670753 1666404 1660034
$$ [...]
##END NTUPLES=NMR SPECTRUM
##END=
