##TITLE=AC1509_ROEFFECT0001_8201573_8txOuqAMOm
##JCAMPDX= 6.0         $$ Bruker NMR JCAMP-DX V2.0
##DATA TYPE= NMR SPECTRUM
##DATA CLASS= NTUPLES
##ORIGIN= BRUKER
##OWNER= Administrator
$$ 1.72 TOPSPIN		Version 2.1
$$ 2013-09-26 16:36:51.597 -0700  Administrator@X
$$ Compression mode = diff/dup
##.OBSERVE FREQUENCY= 400.02188249412
##.OBSERVE NUCLEUS= ^1H
##.ACQUISITION MODE= SIMULTANEOUS (DQD)
##.ACQUISITION SCHEME= undefined
##.AVERAGES= 8
##.DIGITISER RES= 22
##SPECTROMETER/DATA SYSTEM= spect
##.PULSE SEQUENCE= zg30
##.SOLVENT NAME= COFFEE_meoh
##.SHIFT REFERENCE= INTERNAL, COFFEE_meoh, 1, 14.98509
##AUDIT TRAIL= $$ (NUMBER, WHEN, WHO, WHERE, PROCESS, VERSION, WHAT)
$$ ##TITLE= Audit trail, TOPSPIN		Version 2.1
$$ ##JCAMPDX= 5.01
$$ ##ORIGIN= Bruker BioSpin GmbH
$$ ##OWNER= Administrator
$$ $$ E:\/data/COFFEE/nmr/AC1509_ROEFFECT0001_8201573_8txOuqAMOm/10/pdata/1/auditp.txt
$$ ##AUDIT TRAIL=  $$ (NUMBER, WHEN, WHO, WHERE, PROCESS, VERSION, WHAT)
(   1,<2013-09-26 16:36:44.053 -0700>,<Administrator>,<X>,<go>,<TOPSPIN 2.1>,
      <created by zg
	started at 2013-09-26 16:35:38.097 -0700,
	POWCHK enabled, PULCHK disabled,
       configuration hash MD5:
       C8 4E 4E 5D D3 5C D8 9E 9F 52 82 E0 59 8A DE 15
       data hash MD5: 64K
       09 4C 0C DF 7A 14 04 B2 BE 54 8E 98 99 DA 0D 6C>)
(   2,<2013-09-26 16:36:47.537 -0700>,<Administrator>,<X>,<proc1d>,<TOPSPIN 2.1>,
      <Start of raw data processing
       efp LB = 0 FT_mod = 6 PKNL = 1 PHC0 = 0 PHC1 = 0 SI = 32K 
       data hash MD5: 32K
       6D F5 64 DC 20 4C E3 DE B3 18 0D A9 6D 43 E9 4B>)
(   3,<2013-09-26 16:36:47.874 -0700>,<Administrator>,<X>,<proc1d>,<TOPSPIN 2.1>,
      <pk PHC0 = 92.05994 PHC1 = 0 
       data hash MD5: 32K
       83 22 DD 3A 88 31 53 5D 23 F4 70 9A E9 0E 13 0D>)
(   4,<2013-09-26 16:36:47.992 -0700>,<Administrator>,<X>,<proc1d>,<TOPSPIN 2.1>,
      <abs ABSG = 1 
       data hash MD5: 32K
       39 E1 01 6F E7 22 FE 98 6B 88 2F 3B 19 10 55 8F>)
(   5,<2013-09-26 16:36:48.076 -0700>,<Administrator>,<X>,<proc1d>,<TOPSPIN 2.1>,
      <abs ABSG = 2 
       data hash MD5: 32K
       23 3D A9 4B 45 52 C5 B8 37 9C 7D 6E 5F 6B 31 77>)
(   6,<2013-09-26 16:36:48.127 -0700>,<Administrator>,<X>,<proc1d>,<TOPSPIN 2.1>,
      <abs ABSG = 3 
       data hash MD5: 32K
       BE 6F 20 FD C1 17 B7 FA 7B FF 99 51 A1 DD 19 38>)
(   7,<2013-09-26 16:36:48.194 -0700>,<Administrator>,<X>,<proc1d>,<TOPSPIN 2.1>,
      <abs ABSG = 4 
       data hash MD5: 32K
       43 87 16 56 CE B0 CD E7 55 A5 A0 C0 E1 69 89 B9>)
(   8,<2013-09-26 16:36:48.261 -0700>,<Administrator>,<X>,<proc1d>,<TOPSPIN 2.1>,
      <abs ABSG = 5 
       data hash MD5: 32K
       F8 A2 D4 EB 29 C1 EF 73 4B 74 4A 33 26 CC 22 F6>)
$$ ##END=
$$ 
$$ $$ hash MD5
$$ $$ F2 BE 09 B6 58 71 EC 33 D1 37 9F A9 3E B2 D6 BB
##$RELAX= 
##$RELAX= 
##$RELAX= 
##$RELAX= 
##$RELAX= 
##$RELAX= 
##$RELAX= 
$$ Bruker specific parameters
$$ --------------------------
##$DU= <E:\>
##$EXPNO= 10
$$ [...]
150 150 150 150 150 150 150 150
##$TP07= 0
##$TPNAME0= <>
##$TPNAME1= <>
##$TPNAME2= <>
##$TPNAME3= <>
##$TPNAME4= <>
##$TPNAME5= <>
##$TPNAME6= <>
##$TPNAME7= <>
##$TPOAL= (0..7)
0.5 0.5 0.5 0.5 0.5 0.5 0.5 0.5
##$TPOFFS= (0..7)
0 0 0 0 0 0 0 0
##$TUNHIN= 0
##$TUNHOUT= 0
##$TUNXOUT= 0
##$USERA1= <user>
##$USERA2= <user>
##$USERA3= <user>
##$USERA4= <user>
##$USERA5= <user>
##$V9= 5
##$VALIST= <valist>
##$VCLIST= <CCCCCCCCCCCCCCC>
##$VD= 0
##$VDLIST= <DDDDDDDDDDDDDDD>
##$VPLIST= <PPPPPPPPPPPPPPP>
##$VTLIST= <TTTTTTTTTTTTTTT>
##$WBST= 1024
##$WBSW= 4
##$XGAIN= (0..3)
0 0 0 0
##$XL= 0
##$YL= 0
##$YMAX_a= 653380
##$YMIN_a= -555996
##$ZGOPTNS= <>
##$ZL1= 120
##$ZL2= 120
##$ZL3= 120
##$ZL4= 120
##$ABSF1= 14.98509
##$ABSF2= -5.573092
##$ABSG= 5
##$ABSL= 3
##$ALPHA= 0
##$AQORDER= 0
##$ASSFAC= 0
##$ASSFACI= 0
##$ASSFACX= 0
##$ASSWID= 0
##$AUNMP= <proc_prof1d_extract_pilot.lims>
##$AXLEFT= 0
##$AXNAME= <>
##$AXNUC= <1H>
##$AXRIGHT= 0
##$AXTYPE= 0
##$AXUNIT= <>
##$AZFE= 0.1
##$AZFW= 0.1
##$BCFW= 0
##$BC_mod= 0
##$BYTORDP= 0
##$COROFFS= 0
##$CY= 15
##$DATMOD= 1
##$DC= 0
##$DFILT= <>
##$DTYPP= 0
##$F1P= 0
##$F2P= 0
##$FCOR= 0.5
##$FTSIZE= 32768
##$FT_mod= 6
##$GAMMA= 0
##$GB= 0
##$INTBC= 1
##$INTSCL= 1
##$ISEN= 128
##$LB= 0
##$LEV0= 0
##$LPBIN= 0
##$MAXI= 10000
##$MC2= 0
##$MEAN= 0
##$ME_mod= 0
##$MI= 0
##$NCOEF= 0
##$NC_proc= -8
##$NLEV= 6
##$NOISF1= 0
##$NOISF2= 0
##$NSP= 0
##$NTH_PI= 0
##$NZP= 0
##$OFFSET= 14.98509
##$PC= 1
##$PHC0= 92.05994
##$PHC1= 0
##$PH_mod= 1
##$PKNL= yes
##$PPARMOD= 0
##$PPDIAG= 0
##$PPIPTYP= 0
##$PPMPNUM= 2147483647
##$PPRESOL= 1
##$PSCAL= 4
##$PSIGN= 0
##$PYNMP= <proc.py>
##$REVERSE= no
##$SF= 400.02
##$SI= 32768
##$SIGF1= 0
##$SIGF2= 0
##$SINO= 400
##$SIOLD= 32768
##$SPECTYP= <>
##$SREGLST= <1H.CDCl3>
##$SSB= 0
##$STSI= 32768
##$STSR= 0
##$SW_p= 8223.68421052631
##$SYMM= 0
##$S_DEV= 0
##$TDeff= 65536
##$TDoff= 0
##$TI= <>
##$TILT= no
##$TM1= 0
##$TM2= 0
##$TOPLEV= 0
##$USERP1= <user>
##$USERP2= <user>
##$USERP3= <user>
##$USERP4= <user>
##$USERP5= <user>
##$WDW= 1
##$XDIM= 32768
##$YMAX_p= 485989384
##$YMIN_p= -730343
##$CURPLOT= <Network HP LaserJet P1505>
##$CURPRIN= <$Network HP LaserJet P1505>
##$DFORMAT= <normdp>
##$LAYOUT= <+/1D_H.xwp>
##$LFORMAT= <normlp>
##$PFORMAT= <normpl>
##$SURQMSG= 1
$$ End of Bruker specific parameters
$$ ---------------------------------
##NTUPLES= NMR SPECTRUM
##VAR_NAME=  FREQUENCY,     SPECTRUM/REAL,   SPECTRUM/IMAG
##SYMBOL=    X,             R,               I
##VAR_TYPE=  INDEPENDENT,   DEPENDENT,       DEPENDENT
##VAR_FORM=  AFFN,          ASDF,            ASDF
##VAR_DIM=   32768,         32768,           32768
##UNITS=     HZ,            ARBITRARY UNITS, ARBITRARY UNITS
##FACTOR=    0.250966925370066, 1,           1
##FIRST=     8223.43324360094, -40274,       -68291
##LAST=      0,             29486,           -338130
##MIN=       0,             -730343,         0
##MAX=       8223.43324360094, 485989384,    0
$$ Real data points
##PAGE= N=1
##DATA TABLE= (X++(R..R)), XYDATA
$$ [...]
23783 162002 -71953 -391503 190776 -304149 183225 -76457 63793 422609 41556 142617
23773 142617 -180326 105681 56390 25057 -227876 -237284 -12643 1229 -115223 -3719 -53610
23762 -53610 -191000 -109280 235141 250203 -238179 159939 145497 109415 -264377 82854 510717
23751 510717 125696 144144 -42020 41407 -127503 225459 142994 152101 -144506 57706 -77110
23739 306679 210438 134511 103641 60693 125138 -31736 130368 186136 -293241 30026 -140575
23727 -156057 17509 227089 -74071 -276746 98991 172115 -172559 167434 128438 451977
23717 451977 59838 18355 -69496 -12816 74858 -293760 -153533 -229880 164903 -91607 87190
23705 32863 24703 142095 68316 108175 -20705 46970 -72525 -6959 -106426 90572 91644 139320
23693 139320 46529 -118726 -56980 29434 -21888 -94536 -511652 424637 -173094 -344278
23683 -344278 235455 19585 3172 -75454 -316279 -44214 -342616 185534 306599 -218031
23672 276372 251589 139745 293000 124071 61529 -144928 -102209 83841 -1630 -99122 -92978
23661 -92978 -170321 116379 -31496 -64093 121587 10881 -122117 -132637 -77208 -215557 -466686
23650 -466686 -308467 153921 -270948 65532 179862 16170 221509 -150568 -264158 -89758
23639 83093 173743 -265587 -85863 -390089 -39439 -357686 -64932 -156084 -74181 -275938 -248724
23628 -248724 146055 54640 -152180 -54882 42271 62294 55768 45367 65406 -265668 115637
23616 -114044 -62952 -299280 -115780 -130141 7548 72654 -178418 -63165 170481 -40835 40880
23604 47902 -77704 139617 -304165 -180059 279111 471849 -98378 -76602 -376010 12859
23593 -139628 -165663 327735 266693 -49731 -115795 107867 -57885 -72507 -122457 -145229 18603
23581 -217493 6151 -77667 -150974 -133177 79709 361610 -37555 -90257 -227677 -17408 18604
23569 -721 -255637 190513 -216514 -70918 -70491 256913 181884 -132673 -146453 92325 147461
23558 147461 -146850 -149640 155754 123964 15574 84333 -89381 -52594 90862 -26337 68217
23546 51739 -186574 -208412 -9024 90292 -16936 54806 -48056 31470 7838 -82441 210073 307958
23534 307958 -17989 93600 22620 32583 100387 189421 310892 -111332 -352091 59012 170168
23523 170168 -127328 18765 20357 -18307 -11613 -72552 -119675 150364 262248 -1761 165184
23511 -192268 104412 -72169 37854 25191 59243 343902 -69408 -34428 -20895 -374367 -139802
23499 -208845 -74765 -33044 -137470 24260 155867 337421 25014 41628 -206695 -98629 98440
23487 -86724 -9994 227646 -221125 -181247 146480 196533 98508 61689 -240433 -240977 166077
23475 208367 -28046 -130469 -211392 352138 -22302 140524 143773 21042 175086 -260742 -24056
23463 78905 -75147 -141170 -102329 -246016 5469 13283 301657 -145863 37255 -75926 -286633
23452 -286633 347035 242738 -262140 -229140 2516 -230172 -189437 -133453 -458184 90290 -160043
23440 90030 -49941 -117394 -309864 164409 -259495 -167909 -184177 -17581 -1688 99275 42171
23428 -73026 56137 -295777 -254046 -27980 -159026 -14081 123446 145897 -336423 -40694 -55948
23417 -55948 142205 -27783 -241691 45836 50394 240658 -149137 -123438 -331096 -131582 -26581
23405 385016 -122832 -371778 33885 60814 54879 111140 316131 179930 272799 -100935 -168771
23394 -168771 -106850 -65411 -80295 -58207 59740 83844 -996 -135730 113029 -174202 -12288
23382 -57255 375759 -87703 171875 -42927 88818 163956 174507 -148035 201907 194592 -106607
23370 -140419 -84452 -132428 -34742 -231145 -254963 122904 103898 -180932 -127496 -134890 -165812
23359 -165812 194560 74125 191105 57107 -129202 -177968 -144789 414832 63260 52180 249753
23348 249753 -129980 186411 -270349 108864 -77023 119988 407282 108238 4337 108552
23338 108552 11330 -54372 136265 117652 -14122 46546 139093 -95320 177047 -60327 -59967
23327 -59967 76857 -174428 -237340 -131477 -152006 286423 130247 -300796 -9347 148198 -77803
23315 -329957 32513 -187035 15113 180676 -132519 -295196 -33263 220937 -287279 126645
23304 -194370 -31170 101874 -79500 -637009 -89045 -272461 69391 16827 -218778 33387 200346
23293 200346 317267 -253004 155350 117780 -268300 158189 -116575 -32882 -270524 274401
23282 -167107 -112418 -105051 -151776 7244 -9153 220853 -116118 -78676 60870 -141666 -86922
23271 -86922 -48988 -54348 -114814 254460 -53246 120898 3246 -71851 132647 153068 -57853
23259 85415 132146 252887 -74462 46548 -68102 -288434 -77593 93393 -120695 -72084 365116
23247 133835 -252793 -136684 -197675 -44833 294394 178721 42492 -158691 -179044 -265420
23237 -265420 177865 -100423 -93797 277460 -71333 208330 -175339 -17112 -138128 -269156
23227 -269156 172156 -51030 13223 13092 284556 32627 134165 9210 -45919 -94928 134511
23215 205367 -301636 -300756 44002 84264 -185655 -287057 -86621 -543362 145151 25347 84288
23204 84288 24668 -67810 203126 117133 -314028 -210005 28783 -197093 97339 3420 128362
23193 128362 -122294 -176431 -321835 5136 -77377 311434 -128730 -21928 -44047 -251827 -287308
23182 -287308 38200 -326 -196030 -39288 93230 150532 292500 -22800 188180 95392 163792
23171 163792 -116139 -351255 188592 3984 55612 -318749 88653 90535 116630 201664 -71138
23159 -128389 144323 -67499 117719 189756 80959 -180504 -71819 211589 72858 -57173 57767
23147 -186566 -292879 -313674 -254672 1924 -369472 -235005 -142497 103473 193621 143899 119280
23136 119280 -101681 -12023 -360553 30925 -47327 168768 -299069 -139832 -35622 159314
23125 -33812 145068 -168645 -169964 -104171 -101358 104947 239208 118892 7540 -268803 -359195
23114 -359195 -116295 241817 -155119 143520 -210809 -388101 -372650 27031 124958 -270509
23103 78251 -113716 -195294 -418244 182907 -359437 -258440 55695 -180723 -525 -364392 -29648
23091 158332 -154947 -358859 13681 46298 -20158 269780 401140 95170 36478 82128 44082
23080 44082 96908 30290 112958 51007 -247829 25619 -26487 -210058 -2123 -252843 202455
23068 -69282 -154432 231489 10263 74745 67246 -148421 46705 -90424 64521 -454646 177950
23056 -59870 23252 5566 -331051 256567 -51535 -171009 -229793 -117922 -300070 436053 -187763
23044 120104 88566 200561 -25260 -227966 -18909 -21989 -135934 -34992 -94252 -64658 -128689
23033 -128689 40677 221510 -130876 168703 34540 -113164 -93154 -119299 -149444 458040
23022 -107084 -103433 -310835 37443 -49115 272171 -64219 -64486 -240769 -205984 -505195 134779
23010 51183 52432 172155 -35962 -28372 -145614 -98945 93114 -273299 -235794 -62496 -422039
22999 -422039 240358 210797 20995 -58628 55086 -12075 -43856 245910 -96487 58150 45377
22988 45377 4231 -162917 -139302 -100320 -48055 -154713 -54529 262907 199579 31097 -70247
22976 162261 -173902 -257840 14679 -173680 99694 -114087 212075 105042 -149355 86062
22965 -193094 121748 44863 -23303 -132688 -20921 182160 77982 125952 -270432 109834
22954 71052 -69335 126907 -105206 104989 -165778 178915 -34443 -85423 108079 -69972
22943 335502 -20440 -105574 -355358 70257 147894 128485 12075 -220043 -177366 198918 86433
22931 19856 -167934 90752 87669 -165664 -354976 -391635 -130866 -120607 52407 18703 -206868
22919 -214423 -344854 139061 261383 -196308 -99086 87606 220858 -73014 -95929 139466
22908 -8590 -259332 -47217 -68407 80074 -157136 -154082 -54928 112188 -45016 -62622 347610
22896 221331 92765 -27336 -162439 92330 -67636 -299458 149975 -261378 -105764 -192028
22886 -192028 12305 -192615 -70006 23181 125090 31495 -110532 -147027 -177204 72429 46104
22875 46104 -387852 108082 -1272 -68820 286276 -62560 -53600 -50387 -240832 206874 -343021
22863 -161574 -10261 -24285 70347 228510 7478 126156 262230 -314624 -277670 221205 146541
22852 146541 77324 -13941 -1460 -261159 -35465 -53457 -125843 -253052 309212 75329 -183439
22840 -143619 -46191 -5789 -170774 -57390 -134187 -150829 148024 51268 -106247 32883 -484582
22828 -27684 -160288 -41010 -187717 -185173 123610 -97293 -242811 -364883 -166902 147764
22817 -106960 -215095 -448583 41202 -326138 226807 -214754 -292416 -172557 44958 -245478
22806 39675 36995 193457 101788 56842 149955 -198492 121980 -107522 -26833 11807 55369
22795 55369 -90331 -103419 -421861 -241035 -191385 -234451 -99558 3202 164710 -223625 18511
22783 -219116 -294235 162003 -81834 -95791 -36774 178444 57795 -48807 -482564 43989 255675
22772 255675 179673 39186 355994 -160288 -81195 -227174 219011 -145976 -248930 -73377
22761 293010 37900 -402228 -47335 -86796 1296 8194 203229 -24034 -172757 -217660 -392141
22750 -392141 82337 -309712 137624 -391976 -145877 -252036 -224838 -72178 316367 -76977
22739 165088 -43310 -57520 -191619 -194309 -159170 32966 33298 -162446 10568 -356632 -277077
22728 -277077 -295006 159793 99003 72793 116325 -152124 123232 -32098 295089 130079
22717 104236 49752 -203963 -151575 -2212 358905 70461 -200049 403264 104510 203260 -58735
22705 -22186 60108 -107488 -365574 155148 -8557 -100310 -225811 -268198 111082 -96327 -123660
22694 -123660 148699 121947 85829 -219142 33679 103957 79495 195234 -442961 124152
22683 -345310 235212 104562 -9970 119487 56125 -49767 65584 -268015 -92584 -187564 -192808
22672 -192808 18881 3293 -257425 92233 -165830 63936 303949 -240899 106934 -156264
22661 -38979 -269287 -102859 -448531 -264683 168226 -110340 17983 -38354 179847 19811
22650 57891 104392 10938 93976 -13519 -221493 -236266 558191 -130693 -206503 -55302 -219481
22639 -219481 34099 -45787 -151731 -194238 -308234 71289 208775 131558 -162290 186390
22628 -27385 244537 125494 42406 -172849 61506 25211 -81926 20224 -93722 248039 -175944
22616 129848 -202000 -23550 202425 124473 -86561 -294156 -136341 255301 80895 -155749
22605 -154492 -263637 -119053 -173329 -202028 -91877 33546 166765 -143231 -47614 153405
22594 -158490 -22275 -38797 -76481 -55637 4844 -207906 -229500 -6670 -110011 -4019 -170741
22583 -170741 -82067 12823 -136290 -267861 40095 -74907 -132048 -19400 428152 71559 -44596
22571 -34369 133248 23695 44276 -141365 -233850 -269119 -31180 9517 242923 -25470 -317530
22560 -317530 121106 168497 -19939 181517 162083 113850 178172 -93000 240864 -45135 101792
22548 -4431 186338 -99432 292063 49674 -238958 -450039 -210958 7502 -116925 -113631 159824
22536 -216520 -325400 -317624 59449 -89938 -119895 35157 14774 -96593 -336952 21229 -225914
22524 196670 -28050 -65654 217531 119564 -537849 315890 100306 -104180 -111530 28573 -332363
22512 -63160 -62699 25941 14050 6752 -128165 32029 86630 -298749 34444 169765 106514 37441
22499 82453 -209774 -111148 187421 -51036 272015 -315248 -265992 -125947 -79545 -13402 -163899
22488 -163899 -275989 -291595 202012 -47733 -52297 78061 148030 -41491 88003 384418 -124202
22476 -25001 96813 88805 328064 38057 355225 4109 -37846 -283452 135962 -138761 -98551
22465 -98551 -127402 -428638 20796 -13518 -78049 261034 -600825 -275064 -79620 72559 -170610
22453 -26156 -22649 -226189 140066 18275 -152311 176190 -67167 285162 -78615 -101861 176188
22441 -96927 -216440 -139041 -136240 123890 84054 -132178 -26216 3262 -839 42246 -84457 -116392
22429 -116392 -180386 132070 95618 40041 1026 -247424 -51387 34999 147764 -168066 -346408
22418 -346408 -177816 -69331 288069 -219681 122535 -143595 162267 -160789 91922 -156299
22407 -255792 -169635 80666 39190 232347 105566 45185 326144 236814 -185940 8048 66749
22396 66749 345666 324810 -42491 -181061 -139974 92211 -1544 -34223 42787 187555 -177410
22384 137939 -200564 186586 47226 -203510 -16856 -349455 -159611 147787 -51646 34562
22373 -65950 -226990 13168 57394 -25382 55150 195302 -303545 198600 161475 -81638 -12064
22361 -212842 143613 124739 -160306 41530 77548 -14669 -200896 52990 -88799 -47464 -8807
22349 -364585 -79184 -90439 121875 21470 -15545 124670 -161710 42622 96439 -206417 -5412
22337 60761 -96240 345021 240802 -108050 281575 168137 -232409 -154708 101282 -239569
22326 -524475 34239 275707 516082 135378 -102943 301134 -59862 -238419 -81629 -465273
22316 -465273 -109043 169935 -282782 -50930 77929 -400296 -104879 -175379 -199806 96949
22305 85553 -43705 -128498 -3416 -144241 -69006 -269912 -112137 -3294 -101111 -135456 97582
22293 -59198 130773 -149241 -125211 70963 262873 140490 553597 129659 200755 31812
22282 129695 -31662 -144636 59026 140644 -350181 -2306 -15786 -331113 83024 -471350 -124804
22270 -172795 39410 -39694 272150 -133217 -163407 -31857 83609 70688 12222 234747 -126369
22258 74146 -79630 138507 -198528 -67951 -926 -12839 -222805 20024 -62484 -33650 311102
22246 179444 -263811 210585 10780 -215358 -151201 205501 -485814 52625 -65448 83499
22235 -132549 -69652 -244813 -52565 -36189 -230129 -430372 46516 -47023 95288 -89477 94115
22223 -252014 -9491 2467 -28264 -132108 212416 -206904 -134746 -139456 -5588 62456 -418516
22211 -217659 13911 -241826 -377623 50191 -232894 -185366 91144 -39129 -104652 -26653 -437211
22200 -437211 -58198 97940 -171603 -146059 -233896 -110017 139470 14430 -168440 -143496 -81516
22189 -81516 -388108 260104 229716 46093 167986 26831 -44873 -167085 99660 54136 -244857
22177 105951 3454 -224144 -252439 -259036 -135524 -96504 441932 -224156 84442 130131 166664
22166 166664 66142 160733 -16809 110059 35961 135061 72435 -140260 -134388 -275153 -34394
22154 80124 -14473 14071 -174979 107544 279228 -150532 217046 -209349 -12969 -172337
22144 -172337 -31090 -616310 -81763 -518869 -188487 238388 191803 -87797 109693 192302
22134 192302 -50116 74225 -177981 -47863 -328024 35878 7067 51848 -396589 -180925 -105220
22123 -105220 252400 -145110 95979 80894 -200241 216922 -104889 -83362 284585 255721
22113 255721 -212905 -67106 130988 -6691 147485 68681 -25486 -69985 -230404 32069 213596
22102 213596 -30971 -191035 -265244 36963 -57053 382929 -240708 -127080 23079 -177185
22091 -295768 77446 123377 1672 -99853 121243 -259879 -312363 -88599 -81889 53198 160209
22080 160209 -191984 -3733 -62282 -55878 29023 -181988 -316415 -206949 3557 -131055 -163401
22069 -163401 -94006 248508 -214728 -366587 -84356 -145856 -194458 -235040 -159581 -208575 -262754
22058 -262754 -3201 -221190 -211427 80010 265015 244942 -70353 149682 -24193 -131498 185119
22046 -229532 115052 -372723 -89679 -117843 201980 -125654 -198945 -396545 -220600 -189910
22036 -189910 71358 -256483 -126902 -141398 107050 107386 51850 -371234 226258 -8450 -11613
22025 -11613 151487 -104150 -219478 178565 333948 -153311 -181170 -106670 57064 129235
22015 129235 75183 -213061 108775 2950 -300954 -252596 34187 50617 -8980 60189 -17554
22003 -236814 128321 -120599 -119807 80600 55256 -261116 -300709 96527 -409077 -70313 -266452
21992 -266452 -122473 228864 -299277 -61792 -247958 194429 792 -33398 51949 -278360 66524
21980 38240 153217 98378 295599 -339102 -90494 45680 -192634 -365077 -308149 -205990
21970 -205990 -15723 -229420 -79216 10921 -44271 -344403 -268253 -348792 232634 109912 169253
21959 169253 293763 196964 -250135 -341098 -118828 -269135 -16104 -2892 -40041 6639 -135026
21947 184916 207805 -152482 68448 112534 249346 -108505 -119059 95927 23140 -142814 -308178
21936 -308178 -259386 92434 -228864 43256 -154645 -22429 -230423 -426088 191225 -87436
21925 -322804 187801 168488 115807 1355 90935 -11921 2753 -194050 -96806 -58660 -271049
21914 -271049 -9866 110682 -319961 -37220 77664 -146765 -31553 -73544 159968 -160100 -146960
21903 -146960 -250984 68033 -41918 -169608 -136809 46406 102762 -11658 48727 293954 -318238
21891 -416992 218719 -119849 -18878 -25995 250569 -246878 140235 -7644 157317 -343997
21880 107023 40616 -82453 233024 -66463 -100045 8041 353890 119746 -219225 -34836 7979
21868 71170 184900 -20957 102159 59410 -155398 160253 22354 219077 -237517 119170
21857 -142639 -272771 -28076 -100493 69616 45552 -204865 161075 -6217 141687 -99701 -62127
21846 -62127 -125301 56027 263004 -121428 -137194 -307920 -26000 66521 -50670 71243 -189378
21834 232954 138897 220810 82472 -19939 -91209 -132583 -215546 -26804 83267 32763 -377077
21822 -412050 -127509 -145782 -267049 -119581 -54589 281259 86921 -259537 194017 272626
21812 272626 -101742 -17186 112131 14966 -493206 82646 79972 118808 -121240 -925 -61759
21801 -61759 -118837 -14759 29849 126340 -8924 -274226 -124357 46451 -85706 -473090 -25172
21789 69589 -45399 -23298 9325 -176810 -12852 -121064 330311 -40135 94019 305854 -161899
21777 -84987 107670 -132948 -536927 3637 52039 174412 46803 -14191 -104384 -132209 432298
21765 -240161 51974 32507 221269 165246 -217349 -307964 30583 117429 -424815 96988 -124568
21753 -79352 -108441 81266 -77989 -115345 -27435 527301 -350682 61635 -191390 -314040 76492
21741 110169 -257013 -238169 85844 -14220 -267667 -327732 -63937 -91201 198107 -389224 -210105
21730 -210105 -252050 -255893 -155334 -33494 -23120 -151424 100963 311975 290586 26088 26328
21719 26328 42434 307054 -171952 50637 -212035 127407 -17471 188035 43842 -15639 -2861
21707 -33870 301047 -74495 38938 111937 -343463 -117598 170784 -179584 -137697 -101245 -17934
21695 -86364 -234069 165823 -41276 -155419 182323 -96368 -54621 -357682 98957 3402 -119909
21683 -12157 132489 186097 -219108 8912 101363 86548 -342029 28809 -306336 127048 -16659
21671 -27596 104561 80230 -71524 -84392 -304192 -186255 -200832 147967 119424 -239486 -204728
21660 -204728 148275 36915 -145917 -112465 19141 -47016 90216 -35277 -168008 9853 11449
21649 11449 -171479 -118010 112544 -338221 -239450 -93735 -230099 -12219 -183488 185772
21638 -39275 -324862 299353 -96412 -116090 -107011 -157803 -325418 -57964 76883 21486 -2155
21626 51863 35393 208058 153880 19854 -175396 -114892 -138362 -284978 98210 -178205 -450290
21615 -450290 -154824 14241 96872 105174 229670 104564 23435 -244288 313521 -220574
21604 -226985 -29807 -290495 180295 107690 39455 -341312 -204630 195622 166808 -80963
21593 -185982 -274448 198346 47303 -133243 -201734 -178198 146183 -162085 -22259 263034
21582 -377733 337564 55047 -12576 -74879 310029 142105 67836 -26129 -95430 333375 -178559
21570 66645 -179170 412104 29897 186345 -23351 92174 187093 -389581 -24094 -44973 -229883
21559 -229883 -129621 -300976 72988 16109 139350 107892 -81270 59415 -122930 -219359 -47043
21547 -294653 377920 60749 51047 -484973 -92920 4807 -120543 -94833 4466 155994 -261073
21535 -34998 178946 136466 -44168 -66376 5986 -182824 -27428 92251 -10352 208253 104363
21524 104363 113330 187903 -330593 -392895 -31451 -18609 9264 69560 127079 76596 132173 -68722
21511 75632 245857 -161800 -212994 94109 91909 -259733 69990 -259852 -89265 -32528 87203
21499 -162825 213715 -170774 203397 -289851 -295257 -204403 -330763 143477 -166551 -231566
21489 -231566 162259 104761 -21245 -87880 -8274 -27648 -115892 42724 -277576 -203518 183421
21477 298072 50223 227473 -137555 -50800 8784 236919 62179 -195383 95407 -66410 -12308
21465 -259777 -96941 -22972 8451 96556 -129563 295172 106849 -251067 -102951 243356
21454 -36270 -27401 243752 -167572 150538 291 -424481 -83601 265799 243207 169076 414 185205
21442 185205 -22016 -159883 72413 306938 -109651 320861 218315 487377 208622 44048
21431 -37316 -46460 -392211 -47810 5117 -84578 -81878 188154 33990 36062 202620 -230532 -247964
21419 -247964 -34180 -408887 -92440 -53310 -261323 -25174 76235 -115811 -211208 126062 130070
21408 130070 138155 -32054 -111467 176640 194931 -67803 -351771 -206050 -178763 -145377 96260
21396 -133608 -160145 -248242 -243675 62347 -40916 263870 60502 -105630 -146499 -52955 -21667
21384 18096 -3265 -221162 -7052 -213307 -134408 92342 -126363 -28552 -65767 -6851 -315305
21373 -315305 -327493 -41424 -54149 -91366 -4465 -233009 124845 90906 157196 390919 217169
21362 217169 -202847 -140863 30783 342619 370128 -56566 -503457 114246 148662 -199322
21351 -73392 35102 139518 -253898 -235857 -242022 -135864 -49295 -323695 -362398 223422 42373
21339 501628 -67190 -149269 -141554 2310 204371 -11009 -156528 238347 -71095 44878 -35 309409
21326 248760 69606 173429 366155 -252240 -55345 23096 -95799 208339 132625 -309199
21315 -34262 -144583 127913 -92229 50298 -571073 -276044 90071 161480 30729 202706 91961
21303 163908 49580 161008 -241450 -65742 -156 183710 4970 79823 -510913 -354581 -138946
21291 260064 -57603 -82211 -158054 29488 -133869 -444612 -192472 364620 -184215 -229643
21281 -229643 -30260 -221769 1243 -149361 158754 16077 -206170 31526 -142171 -161631 -406611
21270 -406611 -186794 242439 -45092 -457300 14137 -98090 151172 -117353 -225512 248558
21259 -340958 -96738 188494 -233246 34514 188862 120668 135217 -84011 -245412 -196707 -149467
21248 -149467 -103888 -1868 -186851 82209 55631 -104568 144051 -191809 221820 160846 -259362
21236 25859 176680 -14676 155408 -194750 170940 95313 -74754 -655682 -227232 -4560 -249455
21225 -249455 -74274 -206194 -173567 132599 -90065 -288182 -131430 214385 -95618 111570
21214 -26856 6813 200845 -166026 -292258 -526248 -34255 21587 -79864 -71778 -266008 -140747
21203 -140747 -63993 -334448 47200 177428 -166371 -149157 148668 103021 -144457 59546
21192 -143625 -197325 -303889 -163599 180678 -323173 7239 21646 -316737 -110631 -70596
21182 -70596 153467 -306105 -49418 -294488 56968 114837 69725 -1144 -199949 -212435 -113519
21171 -113519 367056 110697 -398532 -80003 70722 82462 367106 -249842 125559 -239965
21160 74728 82457 -125848 -224816 2089 -227864 -123013 -1891 -515740 106238 147304 -17286
21148 -302205 -5159 -155291 211354 -107896 143487 -287741 -141584 89156 -227448 -31010
21137 36995 -174169 -264284 -36381 -111473 -128951 288769 -1537 328706 -16364 -73008 -45658
21126 -45658 -20230 248613 94790 -39345 -17998 -98184 116888 9183 -98758 53400 113756
21115 113756 -152331 25416 -45944 -259811 95427 -140463 -187533 -45344 117129 324199
21105 324199 -9567 -222134 -57878 26173 -247582 135538 -34513 -251084 -2049 -58796 77229
21093 71003 -90217 367016 -69989 -9286 -107906 63523 -71994 -256210 -70737 -47071 -52899 -30149
21081 -30149 -10413 40909 -241506 -2332 95541 -185418 -162324 -7552 43291 -358920 -230631
21070 -230631 -363530 -183009 -182427 -380579 -61308 -244319 207098 71351 -262269 -227658 -139318
21059 -139318 -218358 -158264 -412188 -15236 -334435 146973 -21431 -124640 -31168 -185016
21049 -185016 -295074 -13662 -18505 -54276 -92658 -32789 -425065 115107 219698 -65430 -259896
21038 -259896 6811 -20960 -169310 108554 -9997 11357 -23657 -82375 -332254 52412 252944
21027 252944 -87140 85443 74434 -303897 -2700 270359 -43642 -315645 -88512 139242 -296230
21015 -174641 -1006 -217198 5138 15657 -121700 -114049 59536 132305 -126218 235247 219512
21004 219512 101820 -137430 236728 -290485 57609 -221885 -48269 214010 -5377 -74500
20994 -74500 90288 47002 105195 5788 132394 -388225 -48798 -115724 225911 -206769 -79808
20982 -390435 -17766 17627 -153116 64145 49229 372562 -22366 -191047 109973 109243 -190530
20970 -9665 191052 18981 308775 21550 410583 101851 -306308 -307017 275168 -120716 54029
20958 -98241 -73900 -71567 31481 -35159 -163345 -92251 18193 -156275 -123826 111760 -142054
20946 -41830 130097 93417 -18117 141370 92993 -376790 29805 22628 -116631 -130035 -158586
20935 -158586 -307463 -248973 54364 -245889 -339376 -51891 -59313 -294427 55349 37695 -119272
20923 71912 -78379 243698 -158215 44112 170478 49132 -107657 -287614 -120594 -291978
20913 -291978 99438 22258 50367 331633 -40955 273081 -1528 -80872 -237331 106217 -131699
20901 145077 -132284 -122697 196094 -275486 331440 166187 64631 -100463 -65323 -110529
20891 -110529 -27873 14135 -182753 194712 -591919 -583258 44158 156285 232539 -181759 -179995
20880 -179995 106261 26661 -34814 94458 -59553 186648 -107311 115949 134802 -108551
20869 90633 -88943 45700 -27783 -78520 -347919 -153430 -212424 -55153 -196639 -52218 82441
20857 -99011 44225 -72908 -413769 105045 -341911 -175376 28848 112223 260650 171114 25898
20845 159454 -138361 6076 -224318 -124381 69662 255876 -391519 -81860 72773 -182236 -131775
20834 -131775 218202 -278575 133567 2732 -369970 166174 -20923 -41137 -321317 -13269
20823 450122 -33500 28170 -330223 -125061 -413108 -218941 132276 -396956 -44636 28753
20812 -402774 2005 -48882 34230 -75984 -86083 -61373 37545 -18850 -73998 147858 -195374
20800 -128196 -123499 81500 134348 6111 -368778 -196047 104503 -188956 -1384 -246618 -193548
20789 -193548 334265 -242149 -356677 -192973 88895 247658 535905 -266649 64016 -286242
20778 -59647 -35349 -5233 25180 109812 -211550 -108742 -103245 -192732 -67099 -373883 158171
20766 -182266 216082 -223154 257605 -102580 30894 -200785 -47332 383053 -195526 -67378
20755 -384028 -36485 -425783 -142902 76968 -352511 91876 280 32385 12040 5942 -299388
20743 -175005 89000 -292801 -244893 -420362 36493 127487 -369200 96747 -89581 -234183 14287
20731 -118259 23819 347550 132907 -42830 -416511 -254878 -139594 -179562 -23931 24485
20720 -377205 39373 -179365 -63635 -223767 -64959 26278 -446533 151272 -154543 -34615
20709 -156485 -105989 -316106 -212589 -424205 -68453 157833 -523729 -217968 -201089 211852
20698 10730 -74444 -203727 90469 191739 67748 -92707 68903 -272997 -182013 -28087 23215
20686 63352 -73632 482105 -71088 -3317 123036 112422 -24755 -343546 -78837 -39537 182971
20674 -187436 -6813 85661 -9307 10830 90074 221221 -43545 -295381 -354119 87091 187314
20663 187314 -130954 29925 -158352 -106888 -49936 -242902 299102 -211797 33363 -72717
20652 -384718 -99323 -264659 -288505 -126048 -68677 -182052 7479 124827 -18815 -61052 -6627
20640 81507 -82690 -65286 125674 -26223 -185377 61663 1479 32707 152362 -89738 54826
20628 -360555 -37417 -107282 252195 -40024 -180293 -125334 -36123 -31337 -129882 -120982 -203909
20617 -203909 -260462 -178192 -238956 -218567 144032 -69920 -421736 -65259 289659 -91185 230073
20605 -253483 34744 -63078 -60183 238837 -7565 142963 90217 -46955 24878 11817 35609
20594 35609 197392 -78767 -133681 -433177 13222 -57248 278001 149570 338413 168352
20583 247204 155001 49592 -48826 265838 151624 -242744 -68330 -31206 311639 -303951
20572 -376315 361819 -323791 -25817 345 -51921 -347656 -45935 80027 -264904 -172915 216384
20560 -3538 -113944 -48716 158650 -69615 -202757 -7431 -187178 -128531 -8733 -330286 -115536
20548 103130 205243 33771 165703 141646 -478404 -17258 -154753 -21863 -114966 -2742 -22994
20537 -22994 -296961 -353343 -116794 -103219 -226167 114192 199992 191241 131099 -184336 -62336
20525 30767 127355 111218 296864 -251700 -72659 -254955 34468 5577 121850 25182 66877
20514 66877 -603969 -60980 47287 -236477 149971 -173924 -13358 -99733 -300110 -86445 -238445
20503 -238445 -144231 -161348 113970 327211 -562876 198751 -137528 -323372 -98217 426237
20492 8010 209855 -246077 -201102 179146 -59969 238739 261584 -272799 -21818 -313430 -204999
20481 -204999 -434011 202256 -9203 -23885 115764 100 -112577 336002 -307691 179030 124148
20470 124148 47051 -64661 71875 78026 -216972 -197073 345656 -115102 373629 93827 -157661
20458 36966 307783 43548 -44918 -31972 -2453 -283506 -109378 397038 -30764 -48240 -360512
20447 -360512 -47213 -27658 59972 -90099 5347 -202319 -38616 -78868 -67715 -107619 31430
20435 69660 -339739 178817 242846 -196383 66755 -281797 -445351 -145794 45069 -123030
20424 6920 51742 -346269 -5092 -37034 203200 -251229 -176742 62481 -132791 99352 -332896
20412 168644 -165308 -159531 -126056 44251 -148608 107540 -182957 141655 236070 51361 9776
20400 53178 200495 -252080 -131969 4493 27445 -245215 127125 11973 -128955 -126433 127680
20388 -95406 -134765 -228362 109171 -129214 -205123 -65204 -18912 357445 14749 -118975 -100245
20377 -100245 210860 63978 87913 12512 -114758 -71389 -109596 -43582 164961 31897 -19902
20365 -251364 -218986 -92930 -438816 -302082 -93880 -143526 -184683 93461 -172958 -60033 64638
20353 373256 120561 -97238 -50500 100365 72487 -136561 -23912 250591 -153119 111170
20342 -153352 -112182 -13549 -276301 351460 -288249 -57561 -482960 -166520 120923 -279378
20331 -281421 227269 64803 -108719 -179779 -160107 -316643 -250320 150164 68270 -63464 -78603
20320 -78603 -221083 114717 204263 -219377 -179189 -150426 -258016 -195915 18118 -111248 -100682
20309 -100682 179092 63127 -144244 29482 -497138 165386 118359 95069 -226503 -29522
20298 -163422 87451 31767 360624 -395696 -7224 -83709 -90215 -350110 -234736 -336801 98530
20286 46802 -40343 15561 -323060 -82755 -14709 79239 -168004 96770 -49624 24314 284919
20275 284919 -147749 138968 279945 -10543 115615 35574 -110700 -334792 -245909 -88887
20264 -147308 -63418 -217735 50879 -68186 -236461 -39781 219534 84437 229103 -29407 -207176
20253 -207176 270175 -314229 96475 50307 80909 30956 -132351 -114666 -4106 -18842 -86676
20242 -86676 -100105 -110149 -155191 81978 -93445 -132776 -197748 60928 -135092 -175440 235512
20230 -64637 -389711 19873 141332 -123888 321866 -52559 -189525 -127457 162663 -150439
20219 -141740 -346495 -261547 -73048 -57316 -241453 -72997 -31807 -119684 10109 -85637 -156716
20208 -156716 -220884 -105499 -402751 -148202 74667 -129993 -155711 344281 -156234 -139748
20198 -139748 20258 -26499 -83339 -368485 -194221 -105933 -154489 -177317 -206411 -149194 -39633
20186 -51411 -32298 -45457 204516 -438398 -194001 -29484 -152557 20732 -288995 82786 151465
20175 151465 -119030 -267525 54380 -50450 -64292 53571 60288 158997 -293663 -24754 -129059
20164 -129059 -87170 -147960 224546 -254853 -185970 151454 4503 -75481 -39443 -122587 -669614
20153 -669614 -99377 -211211 13168 124430 -36321 -180053 17461 -275380 5090 48955 65426
20142 65426 -237332 122458 21879 -119627 177306 -80350 205611 -311838 16596 -142969
20131 -73597 -131317 -236186 337839 158089 1681 196985 -438651 132042 -62688 -190358
20121 -190358 -100532 -194083 -92586 32336 203132 -38453 12993 249891 -388678 64857 -45892
20109 -144347 -260901 -232114 -19203 -135942 -158856 -925 78413 -78851 163223 -184886 -57855
20097 -72527 -4822 -188918 -110847 -307 19872 57996 36527 -18885 -10900 34206 99467 191742
20085 191742 -300423 -409046 109297 -7868 -148101 -51982 -255871 67226 -290263 -37088
20074 -168134 -219486 -9708 184782 -170023 -244337 232396 -156032 -363711 -146383 113186
20063 -24990 -134992 -317001 -161327 -326123 23554 -25902 -173718 -237524 -370459 -18402
20052 -103781 193713 304988 97928 -192799 134456 17552 162147 336514 -62730 -92650
20042 -92650 -96281 111116 91040 -320684 -328154 2099 -356851 -197052 -242768 -85556 14629
20030 -125233 -242356 -94458 -37441 -59767 31842 301900 -152646 96351 -315217 -34666 122440
20018 -152834 56442 -11224 -129837 -53863 -173760 -78803 -67510 -159833 27895 182906 -87552
20006 78535 178008 -326897 -24143 -66597 -63002 64752 457356 -82563 163237 -45555 -6729
19994 -283196 29325 -70337 193636 65746 -256408 -139381 -219454 -236687 -98110 -317974 -65094
19982 54070 -112916 -92437 -174834 -211983 61507 330716 -344456 -116007 125628 72181 -269068
19970 -130618 217230 -190831 -326330 -49791 -165175 -218091 22870 30061 -282154 -13296 24373
19958 152835 -141211 -204250 97046 -209903 -31639 -40514 244501 -19977 135556 -218588 -395110
19947 -395110 40153 -342226 -216441 -278878 -165504 224069 -214080 14428 53386 -12534
19936 75472 -183999 -174254 -295072 -242490 103521 56534 -259176 -498574 -467035 -14424 65661
19924 49204 156254 17523 -146117 -232612 27705 26262 -135646 35702 108336 -37412 -194665
19913 -194665 -7626 25219 -53963 246751 -344966 -204107 89843 -101794 -161282 -219103 -428975
19902 -428975 -157495 8363 -2969 -53584 -213237 106960 160482 -141174 -610625 3764 -53352
19890 168403 10815 342866 65290 34864 -71935 143014 -64549 -254228 123664 57859 -141841
19878 -82307 -291927 296066 -66932 -4552 62796 263700 103863 330223 -121751 -77767 231767
19866 -100832 7995 -379596 33039 -98401 -23421 -229145 -159999 93336 -209748 48551 -334867
19854 -71740 -575258 36817 89580 -311774 -14769 -213401 42129 95510 156348 378345 -171476
19842 203311 146598 -139458 -167830 271909 -135707 -284678 110494 -97961 276210 -130584
19831 -184450 -19832 -125646 77830 75067 32585 -182961 -54769 85506 -248432 27356 -207263
19819 -485131 15967 -114972 185061 -75368 44689 101263 44442 108446 -99909 11090 -57938
19807 -182488 89864 -54113 53674 -45206 190629 237383 355455 324093 50105 -167122 -57955
19795 -282702 -90515 -186952 -142193 -285648 107667 -69778 281409 213741 -297837 -146749
19784 428374 117919 -82987 -178388 -20938 -205542 -67091 341037 -118802 -621061 -54039
19773 -356456 -154344 -95760 38820 -46846 -104184 -17850 376428 -353531 -76572 -89698 -210788
19762 -210788 -194531 134048 -101707 209727 190211 -170778 -208657 -2305 15403 -328165 81986
19750 -60144 -258879 110616 62551 -243639 -196133 42657 -214088 271003 199445 -262658
19739 -13453 146808 -152265 5488 343 -70333 -51457 -63060 -286940 121557 188639 45420
19727 -427667 52627 -6547 176963 -61981 50524 -96281 -77980 -37617 -93470 -211557 39480
19715 66280 175661 55083 -266575 62005 -50462 -28748 -107644 -72588 -29847 -405434 -257196
19704 -257196 -125868 -423583 -95756 -246398 -223756 18515 -33358 97740 -134838 156202
19693 -61710 21678 -118792 -52368 170657 61863 -62409 57664 -20360 237603 -258226 -228320
19682 -228320 -5147 28481 -132963 -401996 221190 334901 53934 -476151 -344121 -423773
19672 -423773 -44648 26006 122856 90129 -101775 -170256 85924 -21683 -194921 -91076 22262
19660 9851 -285551 91855 -165056 172680 310442 262473 -296435 -133914 -8951 -275859 -67095
19648 163315 235630 -66265 -184285 -245551 7588 207941 269262 229323 190202 -40850 -5715
19636 214523 47213 -50947 -25532 324065 71953 45572 -96736 -123756 -270583 -68074 -115542
19625 -115542 -71129 -40790 -193557 -118201 -103028 -507406 -362346 160905 -241466 -46739
19614 -194041 75295 -102982 61223 -411412 24787 -282973 -57183 12484 -63979 222814 117648
19603 117648 -22350 -206434 -63020 122649 -114182 -47646 -311071 -69475 2246 -39064 -98510
19592 -98510 -134712 12768 106295 -10074 113221 -137412 162106 -199767 -35251 4897 -212022
19580 -243791 -328821 -243188 79996 -231851 -209086 -5632 -10809 211939 -58092 -9322 76595 57738
19568 57738 -90992 -278165 -43948 176290 52566 437365 -60176 -48744 192191 -105987 -261039
19557 -261039 -179198 33259 -157914 6597 -304233 -126133 -128531 76146 -124998 -217476 -178734
19546 -178734 256464 -311672 -78342 188840 -189103 -59839 74219 671 -696316 95547 -152626
19534 -303290 -94378 250574 382222 -110607 -73144 -40883 69118 118560 -79088 196381 222289
19523 222289 110218 -2505 -39431 3634 23195 -6808 -183511 78099 -25253 -259639 146931
19511 96156 -188209 248428 -133186 -269089 -204892 237769 -209358 150642 56767 207540
19501 207540 -382863 -219925 -43713 108841 -84258 28824 48621 5030 -475376 -68253 -213847
19490 -213847 -129199 -43920 -47708 78615 37344 -344273 200194 -122516 -151030 -454971 -78602
19478 -221425 54302 -120207 -281856 -149589 -113726 -128562 158722 -56958 -213420 219041
19467 -245959 -91562 -176763 -64739 -116409 -199099 -15039 67674 -243122 -208811 -121291 -187200
19456 -187200 237088 147306 -14606 167871 54969 -52794 43687 237184 -40461 39126 92285
19445 92285 -301690 -415513 55619 -44393 -100593 -12254 -60726 -349966 -132637 -314557 -2804
19433 285517 -39655 -177019 -366461 -5035 -29468 -299541 201925 -162973 -180880 -25740 74381
19421 163027 -225862 64044 -11622 310215 200273 -155991 -164510 -42426 -9680 -54313 -131714
19410 -131714 -124369 -26846 -151081 237006 -34318 -37668 -241827 179891 -202377 2833 -22456
19398 -129694 6732 -28613 -26192 16289 -199550 -194996 345934 -133098 -63122 -204178 -262073
19387 -262073 58730 -125194 32232 27742 -96965 -126709 312647 -3040 -22058 -188299 -36578
19375 192891 46765 -91075 -21255 80523 -86149 237279 -64306 -41805 -159175 70720 -146939
19363 77754 -147251 -37821 -114561 7889 -94034 49908 -151208 -210378 172271 -109303 -93493
19352 -93493 -211188 155955 -225296 13484 206278 61932 -217472 51343 -287319 128109
19341 -311755 -11734 169144 -205677 124596 85210 -5769 -75275 141340 4936 87003 -13675
19329 -28794 -128813 -68157 -21724 8710 -404676 -66183 -246520 38947 -72969 -57552 -54820
19318 -54820 -160288 9630 -390207 39829 148909 251288 -77454 126905 216171 -277036 -133144
19306 -85312 -541 150737 -191159 -199439 -44720 70326 -436656 -212872 122834 -145187 -331498
19295 -331498 -48862 -177404 -31339 -278915 -237786 -336337 -461043 147663 -101833 -82451
19285 -82451 -214022 73873 -154752 -248678 135083 82286 -23975 -249045 -156098 -149619 -302784
19274 -302784 270995 -208367 -107537 -232149 -222661 269525 71494 -80215 -310929 51649
19263 152037 -281351 -157089 -196262 -112506 -7094 72650 -49382 -224777 -170270 -118530 -90955
19252 -90955 -226672 255175 -206615 -32187 113113 -263932 280836 -101558 -107118 61709
19241 -110399 -361460 -240462 199175 66162 -318154 22509 -36528 238028 83910 11924
19230 -335360 23906 -77796 -217901 -215860 -307494 34694 9739 83626 311243 39654 128813
19219 128813 32200 -25647 -212965 34318 -256463 -234367 -45136 98056 -63881 -178477 -54538
19207 6307 42509 50541 -89449 -167189 -173516 -132945 -30202 -411735 -439126 -131700 17203 -142428
19194 309818 21613 -154591 -461921 -107375 -78187 -163981 -110288 86159 -15570 246689 277901
19183 277901 -509497 -462257 170661 -255638 -124519 131627 342138 -40143 -8440 -202626
19173 -202626 -56205 -152141 -230201 266853 106630 -208918 127774 -197386 -139414 -457203
19163 -457203 22850 -48293 -403444 9367 9837 23254 -262850 32745 -313904 -39135 -66757
19152 -66757 -277735 -257183 136861 -80447 -153041 -491969 -159974 15174 -186016 171073
19141 -396557 -42262 7127 -173120 28717 -285270 -115657 -332443 157318 85522 -81458 -17329
19129 155248 -284057 -23109 49865 -484998 -54537 -97320 -278197 69974 -23324 -23459 19096
19117 135419 -282363 256665 -119518 -39660 248189 -209541 -96266 -103576 20157 -74319 23798
19105 228234 157568 84256 75204 76872 -61585 -33119 -123865 -146367 103405 -75930 -262943
19094 -262943 -46270 -301174 -59183 45528 2544 -177909 -190019 325140 -445873 59095 234556
19083 234556 -161244 -220771 -48877 -42825 163137 44096 -91161 -145882 -233431 69622 -214709
19071 -131367 -7664 2997 50336 -3416 -160553 -159117 -196315 -167296 -90141 -288363 -95669 122761
19058 -315118 -117966 105556 -143855 -101908 92893 -193504 167187 292827 262748 85803
19047 -13964 -30272 -283277 144385 107641 58940 -195859 160196 75945 -75407 -82601 -51561
19036 -51561 -47437 429141 154947 204605 -58977 -244682 -173620 -118089 -138253 -90734 214592
19024 -71494 67319 -187577 -183235 -5593 114590 388893 -5540 -35512 -123701 70069 81222 28754
19011 32817 70230 -185148 -145136 80407 -42303 -384140 151510 76467 72720 -13977 -37126
19000 -37126 -245855 106971 167297 96033 -23181 -204670 -263679 -205010 183265 102945 -513708
18988 -80606 224994 -156129 -164492 -240882 -177911 -212026 -40665 -237349 348807 -179280 274434
18976 -228147 102873 -97681 -181653 -225486 -222068 -426979 67649 -6405 165738 51732 -166305
18964 -202009 -191298 -260785 -98642 -143324 -82850 109395 -274654 91894 -196373 82792 -145115
18952 -133669 353640 -168852 42757 57709 158021 36478 64216 -237375 522873 45657
18941 -134036 131270 -730343 212065 -244091 -2676 460771 -173301 -326160 -128006 -387267
18931 -387267 191696 -196969 -215399 -181015 60352 23546 -101499 -136991 13601 72091 51878
18920 51878 307885 -45904 25670 -91456 155227 -122983 22999 46537 -433998 -7462 -123919
18909 -123919 3083 -309611 -113762 151000 -42534 -109109 -246467 164687 352767 -277416
18898 -154741 -253943 -387368 -19910 218374 205067 -54556 -158216 -289963 -95467 143702
18887 48116 -209487 111945 -252864 -125674 -4232 -171656 25663 73436 -333156 -36315 -53826
18876 -53826 -178909 -64374 -134912 -37932 -58137 23772 279566 54238 62764 -66880 -35975
18865 -35975 -30564 -335095 -109063 187451 -87280 -330512 -320060 -35263 148352 109959 55302
18854 55302 75966 -100077 -89482 107361 -266156 77929 -215318 27709 -51538 26866 40132
18843 40132 39160 -178319 -316822 -11890 108571 135006 -343470 136685 242714 119447 83860
18832 83860 -117014 -342114 -86574 105129 -266489 -93591 -184695 19749 261268 -11413 123242
18820 116194 243655 117321 -22081 -96609 226807 -78143 -250909 -182892 82912 245139
18810 245139 263286 19930 204780 148178 -420424 175044 -53620 -219169 57618 126336 -371066
18798 -221738 -240974 -113092 -206869 166085 -179935 -141358 74014 18050 22684 223504 -166878
18786 -177144 -175202 -130040 44399 -75378 -254614 94092 -36575 -145066 -129025 124592 -52653
18774 77163 263842 111686 -336418 83178 14497 -201198 314692 -180000 -147532 81081
18763 -129910 -17480 -10786 250620 -63428 -47060 222301 146293 -459287 -243410 -141532 42658
18751 -124690 311998 -103028 50817 -320305 237384 64482 -221550 -132636 -32072 -210822
18741 -210822 41414 -48725 -213785 -291392 -166120 329182 -66772 4518 275681 311443 -260985
18729 -419583 -204387 64113 -370570 -205379 -126768 -103671 27710 -136671 63503 162529 -82325
18717 371418 -23042 -36255 30024 -56304 -97672 38731 -143784 31534 67482 -12961 38024
18705 7911 -307199 193019 -258705 -39622 -136779 -12197 69198 -68151 -184240 -232616 -27807
18693 -107094 289408 -51769 -183540 -288144 72935 -226720 46771 18902 93232 -105810
18682 -218915 -30947 -9750 66140 -348661 -246957 11199 -90629 -246459 -86106 -25987 -299799
18671 -299799 -231685 -168784 -116557 -115052 181336 -102325 -134550 -120164 -14055 -2028 24504
18659 138143 -70117 137865 239226 -86161 -46575 -283909 -55807 -5545 -196232 -157765 59483
18647 -20007 -223127 30573 -235181 -174982 87456 -137597 90397 -270671 16093 244153 -301558
18635 -94412 71378 -257035 74396 78328 -75876 71359 -200638 -196295 317855 33249 -169050
18623 94050 -62945 -185106 46474 161762 -67602 -325356 -17070 -236105 309459 -113469
18612 -144643 -6691 -143053 13533 -431516 -180383 -168842 -448068 -69002 -82175 8537 77003
18601 77003 -146725 113620 267214 -390413 167508 6273 -47335 61400 -213001 -128904 74031
18589 67356 56603 186108 -255966 111541 -88162 66954 14334 18314 8241 -172747 -166618
18578 -166618 170657 135575 -167039 14702 -27639 -78935 -225082 -230255 -327294 99659 -17070
18566 99646 -143903 -64997 153554 -65439 143603 -96621 -89373 -152203 168653 -14391 -359590
18555 -359590 -171944 -122508 -339379 -216670 -466803 -198957 -164150 -87321 132896 -101575
18544 -47232 -64449 106971 -74443 -44717 58829 -129294 -105231 100853 -208400 -150854 -127570
18533 -127570 -76324 -104175 -96501 96675 49613 351017 -4931 -112408 -77367 -234282 2802
18521 -160155 -191707 -95124 -105849 -383751 -73073 -173100 -30572 -29620 -37670 169665 -41250
18509 -11637 -90187 68076 -362090 -112621 -153387 104130 -218285 -94933 -417271 135199
18498 -170166 -326411 278143 51426 -114868 -208368 -124149 33973 -165915 130931 202326
18488 202326 -10473 -12991 100037 -155123 -130498 81150 444871 43121 -21663 -190862 -319501
18477 -319501 -105550 -302185 53622 -407622 -246376 1096 333607 -125802 -12016 -192185
18467 -192185 269782 -63313 -100769 186193 -317084 -60055 -18047 -181043 -156286 -162903 -203106
18456 -203106 -171078 57329 -359812 77704 121268 -393982 -96065 13650 -218867 -296129 -451916
18445 -451916 -37680 -56219 64593 129420 -122400 -83108 -277952 -118007 -221751 -263370 188560
18433 -203094 -318362 -229280 -108038 -398405 -218099 2922 99934 -136564 -129054 -15789 -19413
18422 -19413 142524 137508 -41304 91838 52109 -240561 -41262 -58401 27405 103521 -26890
18410 -279336 150500 -80872 14851 -22139 -45260 71161 -89685 -197233 -119920 -73537 -304219
18399 -304219 -215808 82554 -77953 70758 -229731 -48041 -43993 -282971 304072 -14780 -109008
18388 -109008 -69226 274318 -63920 75396 -7582 161483 99101 101531 -167077 -125692 299729
18376 -235555 -69844 -75742 -141670 -183771 49852 55179 -66268 -141118 236250 118729 260945
18365 260945 112121 -53974 -15382 195675 420823 60295 235447 102996 -14278 -20024 -1506
18353 -12479 -100047 207125 -117474 -74237 -82410 -42724 -216603 -164443 -200910 -167429 285781
18341 123183 -220023 -225453 -141773 82667 -98194 -165436 -214190 -425400 -112527 -326748 -216050
18330 -216050 43472 213154 125322 -61416 162639 -348712 -102997 287636 349318 -114987
18319 -233050 -354673 -78440 -50628 -112137 -97105 -6480 -283818 171208 -9043 -107747 215339
18307 -92529 -130463 -128226 70628 -43191 -167696 -18985 185096 -46703 -37395 62372 262590
18296 262590 110451 98788 -13627 -503663 -136527 288574 -294740 -381661 -366620 54683
18285 72451 93467 38412 -119228 -18891 73590 -126809 100354 206640 -288771 -117423
18274 -59208 -48314 -331481 157794 -109462 223522 -74862 -106276 194474 -183968 -335096
18264 -335096 76 -15461 -201345 -177602 -42387 71258 -283071 -91958 -56204 74550 -154573
18252 277805 189961 -115119 309303 -26708 220228 -109324 105609 43167 -227339 -118342
18242 -118342 -178914 64386 -249736 -27085 121407 -181544 -100028 207766 99512 -145759
18231 -49542 -167778 195781 98780 -63323 -181065 -354690 261648 -1629 -93855 -227831 -7455
18219 351868 -339876 257820 212082 102669 130543 -128477 -198373 62978 -94299 -382806
18209 -382806 -362966 13411 -17108 -95373 1754 166162 -130726 69212 93800 70192 -233414
18197 46331 -82615 151481 418316 -60295 -434018 -88097 -118681 5439 -84868 -189624 -277478
18186 -277478 -307902 -247362 180007 18589 -130615 96086 270304 172982 -42968 -160648 33613
18174 -58675 -33473 18263 -187078 -158062 -86721 12983 1582 -220751 34266 -196932 41388
18162 -133464 -12041 -202209 -109011 -131922 72556 -67311 -50294 -286310 -139566 -53565 45786
18150 -324277 185363 285657 -195410 -43470 -153842 -134299 -44045 -173990 -118980 -86689
18140 -86689 -141801 124379 -105467 94266 224118 -7944 -12060 -406719 -100785 -89459 331344
18128 -45572 74571 329594 -78473 -150922 -69336 -171477 -68333 -549569 294300 -83917 -154884
18117 -154884 -228962 -120880 -178894 -110307 -18827 -229422 -135086 48974 88676 -200208 -198428
18106 -198428 -37800 -194177 -86836 27023 -63464 -117466 15529 -150311 -344158 -215380 18418
18094 -143972 221923 109092 84266 -4679 -60608 223617 80337 -297715 -146813 152219
18083 -14206 82903 243384 -33590 -64380 -140823 277844 194717 12513 -342549 141015 -18746
18071 22002 -152019 -28421 19516 -166020 -533866 -510003 74789 -6387 -153057 336561 182998
18060 182998 -291653 142667 15692 -63469 -159426 -142404 69118 18727 -45417 -330241 92540
18048 72274 -71287 -64362 231637 -268172 -111742 10431 256101 -36194 -92882 -149367 -43578
18036 173131 204179 -280948 43533 26887 1310 5684 -326210 -28191 -27554 -21194 -144113 -208199
18024 -208199 35992 259494 -150427 33858 205310 247513 -23529 52512 174826 -233939
18013 259704 187906 394148 272065 228433 -125273 -157298 -335599 -319672 -83853 119846
18002 97601 77881 -25694 209358 -111173 73201 -101809 316722 179668 -346607 -307084
17992 -307084 -152667 62778 131325 -60844 169518 95212 318265 -332763 77041 -200006
17981 130559 -24330 76331 154291 -74421 -133943 3879 -159684 224141 -124649 245491 -28297
17969 -17378 -133528 123985 -125919 327034 -245984 123427 225965 -14481 92028 41802
17958 292620 130073 26294 -4587 91247 -78180 22155 -109474 178339 -66090 184261 -60444
17946 -15874 -216326 253853 -66346 -41664 -213855 -7205 12768 74267 -106070 -71392 -117359
17935 -117359 80656 253705 75256 -103843 196659 295064 -15468 104632 200231 82256 25313
17923 85618 -16218 -8231 55001 108617 -81901 146273 199416 -26369 -180521 -184469 49662 122324
17911 122324 7858 12039 185403 -185711 54565 -332902 -110741 -178105 -194853 72222 -162222
17899 35655 223808 280867 134530 -236521 -294222 -149520 -97668 310138 289182 89442 -327556
17887 110604 -240021 166566 5679 -263427 53139 -234086 26746 -4762 58528 215924 181754
17876 181754 -124977 -423114 162707 -24181 -321547 -44664 -189313 -111195 60840 -80397
17865 -55870 77239 -37387 -87744 -62878 -200939 -84525 -161941 -30934 156439 -11160 126281
17853 -120858 124582 -271655 96684 -54695 -144285 60451 120720 225102 -1934 -32821 26086
17841 -37756 -129540 -449563 -219413 226583 -99848 94985 -120208 -123008 55791 71978 -2659
17829 166092 -258808 28048 -66581 -81107 161082 -16355 96339 -116927 -130847 -190777 108193
17817 108088 -10717 -120546 425706 -202303 -93315 -123177 7197 -88913 -131360 31478 -40757
17805 71286 -283922 -206448 316345 225172 -145213 -36968 137845 282312 21078 89971 141546
17794 141546 232559 -144445 -256 114685 -368073 483937 189428 -116280 215443 -24361
17783 283564 -103708 -186945 -239736 4097 176949 75565 -201176 -321712 -292121 -8836 -412279
17772 -412279 42735 -288046 -63124 -203812 -35217 116257 56871 -131534 -147293 -108804 134668
17760 -161884 237067 -210858 171639 -18059 150327 288502 181255 -198481 -7085 21489
17749 -221634 -208390 352120 -152672 -173372 51449 375865 198220 -221812 134960 -199085
17738 -62934 -7328 -62039 9410 -49160 -54083 -19933 65883 -221081 -60529 192379 -22864 262509
17725 -233932 135260 -92587 360139 65335 90441 95470 -44980 459301 -262331 -328934 39924
17713 71659 60706 161908 80435 81120 225033 -192966 73732 -158668 -30186 117281 -117818
17701 -207155 -78346 64896 -209611 -211855 243902 343144 151561 64208 24164 29099 141116
17690 141116 -114964 -106777 -141151 265661 191318 146198 109494 78610 -61968 304905 13341
17678 33766 -87279 -243895 -48027 43146 -305164 9605 217201 322899 35007 156985 181622
17667 181622 -436862 -6918 18160 220706 24796 -169511 -17596 -169955 80065 234739 -77811
17655 -219159 45249 104130 -209899 -214905 129936 -187196 -193378 -88393 -374713 161900 -80892
17643 -138839 -156667 -88235 106254 -167512 106505 507032 94686 -36838 81873 -12777 -3242
17631 -164680 69968 -219213 -231849 427107 39935 -57597 106774 -136915 240373 -43717
17620 97813 -62299 225250 -150405 -332840 43979 128862 -85102 -237504 -209540 52776 -16454
17608 -124465 104529 87013 83452 22960 114712 324155 314010 -158029 -37840 -132162 113476
17596 172940 199453 -101457 140012 87101 -307540 200584 -130956 139362 -82679 404677
17585 -133102 5318 499 -65381 -74268 272725 33034 -100449 5524 -62070 7065 31991 177396
17573 177396 354305 113432 106199 32910 372182 -23119 -307993 109054 -44192 187304
17562 132693 -78883 423322 261377 74835 308307 -109690 -296282 22286 65856 -35943
17551 242942 334214 -15992 140892 90181 20495 201400 104530 96785 84283 161224 -178782
17539 123109 160789 -50150 26634 -176347 48518 291082 291900 161935 -38391 -30834 -53910
17528 -53910 263611 290889 499733 -101887 66151 -245900 349596 17983 189581 130867
17518 130867 -1177 257447 62504 -424103 51061 -165789 -91999 85990 248390 102645 -25700
17506 21083 179714 -27123 -117792 75366 123728 244164 208552 354785 154255 -171040 268928
17494 151301 -18207 182329 181375 378704 -127371 159860 189635 146522 -270296 -79251 200297
17482 408411 230862 64847 126366 275613 84316 274194 -98051 -179758 40074 49938 -58367
17470 29779 313131 374412 26890 30757 27072 78617 97498 -47232 284077 -88291 -46112 240312
17457 280983 11065 -26154 7110 -104867 85200 11030 37138 221891 310311 278650 267404
17446 267404 331986 377608 500999 -28162 24835 212714 269799 146455 -73000 -277832 338089
17434 -212786 287995 109157 240956 136431 262168 221207 119878 47023 338862 519548
17424 519548 27440 111127 271417 29202 79344 422495 193195 85141 99465 36443 -15235
17412 605837 -152397 77037 -48451 104218 -10906 392497 -40153 -96872 305448 -57867 96783
17400 -43576 176766 162131 435781 311231 379429 -73615 82954 -76443 302293 216430 214833
17389 214833 146341 212270 83462 86326 173643 -26180 54127 381155 -106045 -89487 530849
17377 262760 150645 362818 -224971 521385 -60778 229746 748 151166 311257 -36002
17366 262673 -17996 443371 259922 290110 109975 313954 -120584 49771 365487 63754
17355 57344 229863 182225 -231030 -129887 305368 49213 273237 166225 164786 28596 210070
17344 210070 -38145 -10166 175354 -184773 272638 205394 -10130 122414 34110 123418 532466
17333 532466 242424 -7002 175347 120939 191606 18433 -75267 94072 138091 14098 33347
17322 33347 268023 26032 107366 85788 250841 191838 224711 -33050 69204 356385 429668
17311 429668 219965 126539 -52900 -3938 35185 109551 468943 138953 110973 -25621 -58790
17300 -58790 64776 152363 182602 43340 54841 182676 469471 144842 -78789 336945 380199
17289 380199 100275 194246 78560 392565 114469 239017 140200 309532 -68779 13962
17278 127796 20534 305555 335855 153504 -11813 7012 201704 313725 309675 -21564 299550
17266 63150 175471 196851 -113426 487464 -88686 323610 218328 -30419 526072 151114
17255 226713 54491 273296 275399 164329 219056 -160795 496175 110948 -12598 146979
17244 373732 144068 278083 300908 -115328 536281 -867 256721 56714 505551 198497
17233 41336 244551 99353 288158 201361 332734 52517 76496 326938 318485 -36458 2832
17221 119801 67560 -147951 -12453 349205 219296 118828 115971 123231 307468 67954 523557
17210 523557 120472 184779 391928 68098 214958 443490 275747 216775 52316 412312
17200 412312 261530 581690 69011 214030 235596 77704 347860 193584 134092 124984 219553
17189 219553 135232 309520 375315 262678 349224 -24387 53345 245290 429574 233218
17179 233218 426193 581174 156083 492521 35986 189144 395098 -77043 409198 527631
17169 527631 112897 262353 237866 -263751 256015 -28851 177236 336905 170486 25664
17158 406854 589425 111466 263604 264069 462970 97065 660956 224089 444025 29226
17147 153702 327398 182311 482340 239550 453564 454128 363369 786684 447189 440089 100858
17135 387108 500928 207610 447949 660557 488633 473850 368370 406673 237401 224113
17125 224113 759582 205133 358102 186901 308339 13108 187464 283622 223109 565605
17115 565605 518072 254083 491419 544686 581137 359077 291672 308885 294417 164286 206956
17104 206956 519222 41275 342564 554370 603771 539931 394579 569105 247613 626045
17094 626045 533391 186562 489679 563809 298971 503811 527423 186113 350388 512366
17084 512366 430133 643359 358748 547776 353629 335986 527031 227775 549841 428674
17074 428674 368847 159198 648665 472449 511485 477358 469567 778757 383952 790633
17064 790633 457582 288397 161057 404890 12587 605490 232116 339895 576180 452368
17054 452368 648769 417396 343942 295853 510011 362009 591071 610447 579030 473346
17044 473346 598443 566242 676109 144262 380565 532528 527221 809406 570550 668244
17034 668244 469867 368990 368344 421375 723594 554127 426504 442609 599452 560630 912304
17023 912304 529010 670189 619449 765472 644654 730791 326647 381742 810601 635998
17013 635998 588780 714900 662168 821047 332813 585261 547518 531413 774047 612877
17003 612877 475412 755662 554857 568410 468929 618846 704898 1024866 720862 813015
16993 813015 801138 914820 458188 562809 790353 732632 716336 1007551 755769 743396
16983 743396 621866 786667 952996 807080 801583 1006466 880683 887043 930754 803751
16973 803751 1084100 902118 1008946 777852 864260 901844 944308 857549 998839 784954
16963 784954 982869 1096984 776492 1014164 1168166 1044944 1203445 733463 918640 662467
16953 662467 1085063 889998 744517 1004775 998090 833723 868397 1110493 1099969 1143675
16943 1143675 1037518 1474594 1119790 1105086 1319893 1295088 1185404 1322603 1376756 1322146
16933 1322146 1063409 1351251 1327791 1192436 1236620 1141097 1309566 1302086 1450028 1320670
16923 1320670 1394677 1252989 1149235 1434713 1631733 1400737 1194391 1417355 1196189 1340679
16913 1340679 1712999 1150568 1567804 1678458 1475278 1459114 1690386 1646690 1656689 1755744
16903 1755744 1427790 1778874 1786579 1539901 1509388 1768350 1695221 1830444 1723009 2174898
16893 2174898 1818604 2155168 2208659 1928750 1924532 2200289 1809172 2359243 1978562 2397055
16883 2397055 2344975 2037749 1989415 2257980 2049601 2271248 2163987 2144314 2342099 2486989
16873 2486989 2310612 2159164 2443278 2671909 2189014 2224308 2659488 2757968 2575768 2831669
16863 2831669 2463332 2983482 2870376 2856495 2958596 3018251 2973123 2804433 3029540 2914155
16853 2914155 2849210 3198419 3527989 3493325 3345174 3083569 3396697 3596749 3771414 3425291
16843 3425291 3786682 4007806 3616922 3829147 3794778 4021973 3409811 4295526 3913105 4032376
16833 4032376 4247225 4322661 4675960 4451328 4364759 4400557 4625687 4704250 4860735 5020087
16823 5020087 4804814 5204208 5400674 5417248 5523123 5469087 5532394 5701405 6024778 5945171
16813 5945171 6351336 6040790 6348713 6780157 6615915 6905835 6846588 7338429 7289618 7730207
16803 7730207 7776707 8099809 8119090 8417885 8351880 8464134 8738574 9334554 9479980 9641677
16793 9641677 9745394 10076529 10067879 10175736 10797012 11156454 11389960 11859220 12220923 12421508
16783 12421508 12924104 13412217 13527629 14034185 14358102 15167642 15336391 15896381 16499092
16774 16499092 16618077 17297448 17965923 18709464 18932951 19977188 20657357 21481004 22314816
16765 22314816 23453214 23784840 24948028 25989168 26949799 28007526 28701670 30206910
16757 30206910 31734165 32736849 34442873 35470740 37591753 39268467 40927104 43097496
16749 43097496 44758242 47701562 50023075 52323059 54591361 58021906 60896699 64271019
16741 64271019 67715283 71656731 75501817 80040616 84627201 89597579 94544325 99906429
16733 99906429 106095759 112066777 118306644 125131370 132001459 138942310 145757829 152747712
16725 152747712 159900490 166245674 172455827 178027581 183028977 186681655 189449239 191425594
16717 191425594 192388579 191770440 190030515 187351411 183690584 178963857 173597851 166975911
16709 166975911 160490033 153373153 145994905 138327920 131029559 124390017 117728769 110812762
16701 110812762 104327397 98114015 92463464 87207708 82433889 77453366 73077456 68799119
16693 68799119 65299444 61682286 58526608 55471741 52461029 49600278 47100218 44635287
16685 44635287 42835960 39852735 38583413 37048122 35183572 33645687 31989886 30422728
16677 30422728 29488269 28076431 27041986 25744258 24627372 24072470 22851132 21983372
16669 21983372 21434672 20190909 19761493 19006997 18393023 17591905 16928505 16111159 15646203
16660 15646203 15606432 14844325 14381471 14146947 13735332 13101423 12718142 12340521 11824168
16651 11824168 11194221 11136272 11337425 10902019 10330663 10030635 9783045 9447784 9200491
16642 9200491 9188427 9133404 8710643 8145592 8064061 8239925 7895574 7493250 7502620 6947835
16632 6947835 7350745 6830398 6972232 6870832 6551154 6145208 6270230 6073676 6044294 5994846
16622 5994846 5344719 5798868 5419845 5160754 5191974 5353030 5138516 5154143 4956105 4920862
16612 4920862 4754129 4708700 4712635 4576243 3915176 4342525 4182149 4017981 4132630 3988926
16602 3988926 3756070 3914823 3819600 3634054 4012990 3581024 3517457 3449583 3564784 3256804
16592 3256804 3468374 3285259 3070954 3390460 3051853 3092909 3180120 3129671 2751141 2973443
16582 2973443 2879898 2739904 2433570 3034925 2709597 2334758 2803788 2255207 2479339 2194636
16572 2194636 2513621 2557269 2313078 2371089 2309695 2266046 2100482 2013488 2497249 2212130
16562 2212130 1963022 2007283 2130959 2184189 1908852 1756617 2039603 2049433 2063562 2125376
16552 2125376 2010105 1799943 2344613 1673608 1817841 1864376 1546304 1877566 2069531 1539193
16542 1539193 1564998 1588198 1731176 1306524 1606533 1505225 1361018 1711167 1591979 1297786
16532 1297786 1252142 1423361 1535117 1276961 1054555 1301407 1351702 1688196 1250776 1369594
16522 1369594 1387099 1306354 1003684 1184501 1292309 1368320 1082531 1302061 1352061 1356264
16512 1356264 1181900 1085088 1712943 1205379 1071788 1110093 1287648 1031675 1224271 1019728
16502 1019728 1220520 779948 1063015 1018493 1066414 1394750 1249317 1022885 962888 578834
16492 578834 1284989 1047239 1321828 1011002 870147 818082 1068373 1066818 1058130 1188635
16482 1188635 1015619 881505 1086161 682748 886809 1197751 893070 1038470 1015760 368663
16471 742582 918046 922639 700812 1012308 774656 769018 863923 1145743 798511 778504 639672
16460 639672 838272 501850 480604 494001 641364 601365 716952 603396 853498 535926
16450 535926 493271 932255 647005 741552 274802 997668 883097 577889 791518 600908
16440 600908 714684 576797 1067553 662420 709051 777625 497185 624265 864273 664552
16430 664552 476666 594683 683799 736889 712395 784264 635853 727883 776455 620286 490225
16419 490225 676456 642951 580768 494632 835682 477537 478565 700288 310904 414374
16409 414374 683102 845517 597946 825100 394523 644414 740097 682144 543640 577690
16399 577690 569972 561011 843733 603013 691325 742552 454005 581879 591137 53965 634476
16388 634476 533469 349644 372659 530650 -67863 468434 627023 727595 401518 480750
16378 480750 523771 265817 579435 499221 711631 332563 654491 533433 458892 600110
16368 600110 500971 213024 621338 102402 661142 294524 392613 73568 726908 491512
16358 491512 270336 162435 768972 495764 394394 612377 530711 554464 527199 140236
16347 178838 513302 571538 435496 352570 185821 644239 181492 328628 296660 346960
16337 346960 304062 444508 531474 453694 332685 348865 223364 711426 510798 555868
16327 555868 564448 225403 462166 420443 584505 431545 430796 69178 91230 345795 663620
16316 663620 573078 348114 318343 413426 287626 273162 303011 326517 200106 530699 377447
16305 377447 315663 535369 63187 264345 48196 358373 487795 -133567 317050 339761
16295 339761 79052 -26997 550675 376581 34221 652959 323615 419935 410953 238001 272418
16284 272418 280481 148911 87812 590014 512822 183133 566065 216335 102929 278432
16274 278432 433990 90309 462334 278010 374358 394126 321853 98455 323940 298353 413694
16263 413694 184024 187843 19541 -52414 165591 140921 361123 280804 334907 361572 161393
16251 425972 301538 500097 387664 298595 25256 120861 208091 420651 367981 434609 568111
16240 568111 262548 119571 67622 336598 308297 151428 198703 152274 401448 206814
16230 206814 224165 257069 269404 16728 76916 249467 309170 -106897 149457 301410 349063
16219 349063 44204 329458 1553 -43106 240766 -146420 -72497 118710 215894 285127 45476
16207 23450 89317 -101364 305883 203328 229086 22240 110805 86103 54907 155735 379364
16196 379364 175300 494708 142601 218424 370106 59628 97235 181692 242714 80208 52043
16185 52043 -68027 58127 241737 287104 -290846 -46599 -50094 -383088 47752 179027 585254
16174 585254 187310 -107702 215076 260933 439528 201597 211361 196338 281506 380111 58999
16162 152969 64879 -12427 191910 16023 92654 312616 311041 199604 417699 221050 103558
16150 76548 105835 248484 -80590 -45968 11356 28966 -9443 536953 -16172 453409 18291
16138 119055 -116437 53645 149732 186082 143379 -21493 -230206 -46645 327023 99328 299943
16127 299943 110927 -64352 -20535 247359 286765 -58335 140826 94225 63144 43032 -51790
16115 423755 14734 211958 37425 151823 118733 280739 -193064 183527 262773 240418
16105 240418 364829 -126693 -158455 90140 812 -19410 124697 -29852 -243113 -158121 180031
16093 59171 -57039 481114 -105546 234175 288159 -82162 64694 263241 -25818 -46185 -23944
16082 -23944 315118 -377905 -259534 -3606 243672 49738 183659 -30655 -5498 230937 -204254
16070 243479 174114 -118653 226457 -294757 -16158 69233 -171405 8972 30817 267083 106509
16058 -70321 -338605 117529 -18828 381692 226240 -5828 -15653 90294 -11384 123152 298480
16047 298480 -35487 -21730 -156511 93 101038 43871 -57468 246352 132884 288387 -363530
16035 93933 -115497 113775 -12988 -90145 81644 -242163 55211 -275850 174992 -227417
16024 76151 160231 190480 40476 -265256 188383 189228 196209 76618 141864 293520 189552
16013 189552 38230 -31566 39907 29736 194139 144770 -150285 -246380 -368345 92931 146419
16002 146419 -181270 -312925 35980 176270 -226696 89415 450117 -161238 -64547 -28223
15991 -3258 -158108 -153583 43150 -84020 237973 -486471 -154433 -55835 60108 248979 183238
15980 183238 148924 24243 52582 -175259 14193 62196 -82103 -176742 54843 -5043 73874
15968 212820 24315 391679 -230775 -72511 -305622 649 209591 -67234 15239 216455 198965
15957 198965 -210959 139481 -15179 217541 164813 168843 -273744 -188659 121624 56132 -43757
15945 -106122 -129214 -14960 -156974 -114190 -426225 -120967 109298 -117716 47966 61330
15935 61330 -212734 114388 114416 -255593 231365 161157 250207 115299 167086 18872 80472
15924 80472 -70527 -163208 -241102 17059 96414 -242855 -63639 -223491 -341430 282996 173014
15913 173014 126045 -128826 -134284 143368 65295 88247 -37580 178813 -331581 -194282 -37251
15901 155575 -323307 205930 119272 92915 -70998 -110552 -241947 53755 125354 -201164 23163
15889 115330 169262 -453650 -66686 -263760 50296 -240223 -215795 159890 -134796 37274
15878 274504 -31657 231913 319478 -226670 -382096 -24977 -81409 15410 -311908 141588
15867 141380 2135 -116035 -164654 -142281 -32622 56315 -273960 -296007 -111079 181501 170694
15856 170694 77693 166652 6962 221832 -89974 -42203 -345969 -25540 -23782 -20755 -120232 80682
15843 -133131 -73300 -23714 293172 -183452 405141 102364 -201764 368819 171802 131080
15833 131080 88598 -231723 105241 -35131 314239 -138842 -194710 191064 -32145 -176823
15823 -176823 -132513 -104454 -158064 -163949 -216671 150559 -52702 194518 -285765 -131782 -287230
15812 -287230 148968 162488 -411509 313445 196238 161274 9382 -149439 -21094 -134931
15802 -134931 -17937 63371 -224288 -183797 -95636 179596 -258024 -191081 115644 -28383 -430405
15791 -430405 -63245 -228596 -33825 -17721 237851 -73327 58383 16866 59126 -236729 -366032
15780 -366032 -39739 -56789 -25703 -328485 -7500 -98341 -130148 -411867 -159555 -264469 -203642
15769 -203642 -181436 -107754 62947 346024 -162002 -218933 -106035 -106394 15907 -50565 -24268
15757 -287314 -145007 -52519 61108 273793 217415 102108 224695 200156 120656 -47969 -59845
15746 -59845 188765 102370 -12944 -45330 -55410 107286 29309 227482 5788 167632 85466
15735 85466 -36516 -16583 27192 322454 161502 -97969 -137989 -56634 -117439 -200657 -115182
15724 -115182 -50363 119024 -177629 -324025 -512529 -186888 464664 -220182 -52220 -286646
15714 -286646 -46897 422697 2420 -43855 -271864 -28888 -283213 -85473 -148845 -5601 -432432
15703 -432432 191203 -79986 117427 -220463 -139009 -261540 -93227 -23614 -23555 -241378 133760
15691 309890 -30733 -89405 -219907 -350945 -148086 81489 255338 -4420 -108668 184661
15680 44482 -155769 226961 20167 -151180 -156510 13621 119437 185669 -234107 347225 -79184
15668 -161132 -196234 -39436 -110999 -49454 -88582 260483 -16164 -364859 59414 -207524 -195707
15657 -195707 -116760 15697 212035 -93782 38990 333497 -51206 -218534 255127 -141982
15646 -33492 84130 -188137 208683 -121577 87329 -425206 101266 -35279 -138263 -142716 -108375
15635 -108375 -92131 -73658 -23131 -62214 -254329 -226395 72092 -30263 186351 4215 162289
15624 162289 -152710 -173907 -243825 -134568 -54852 -118087 -80867 99461 22359 93973 138259
15613 138259 -541273 268220 -386145 -217037 202190 220186 -324225 -48541 307446 6103
15602 -191034 -147568 -119556 -290153 123408 -383069 -161979 -111561 -253505 123223 -238753
15591 -115426 -160115 98534 32659 -43243 344812 7579 -137125 103923 279909 354919 -247890
15579 -188456 -18497 63426 -410265 -17634 194967 -318058 -166825 20419 -290756 -97838
15568 -74804 -229700 -51396 -163019 120834 135438 -210156 435782 164303 -117213 -30446
15557 88638 -316778 236761 80994 70762 83830 -63231 -214931 59067 -300574 22240 151824
15546 151824 -103439 349338 -141769 -63175 -239757 -206089 -271822 117211 -385567 -118005
15535 24206 -197339 137218 483491 -220715 -311081 -15488 81566 420452 -22335 -126296
15525 -126296 68754 -75184 -8384 74561 271466 135885 100314 58658 -240939 161961 -87624
15513 -200008 -18470 86192 -134816 -166868 11675 273646 -34587 -131450 149311 -56953 -122202
15502 -122202 258334 -114956 331666 47802 -36438 -335515 107577 16130 85080 -323676
15491 -102575 -219412 -4157 179606 124275 295462 -164077 -56064 161275 380482 -189378
15480 239591 -28371 519010 509714 -105112 -116980 285150 77541 -102132 -179875 143767 -172543
15468 -46891 -201484 -58480 -21599 214816 -198089 -104242 43986 24611 163134 -3149 -639
15456 -239596 110874 138771 399783 -31294 -98255 231301 47007 -181168 26156 -27918 126982
15444 199605 52180 -164344 -304794 -318052 231884 -246038 147561 -42457 59408 -414702
15433 29398 41540 -371968 -202739 59233 -190878 -258378 -44578 137150 -139483 -159934 55146
15421 -72298 220805 5531 98115 -370092 -93093 240714 -122927 -8150 -84434 -75178 -142539
15410 -142539 46548 -209669 37348 166488 137032 333016 -127267 -311814 -209171 99176
15399 88644 -186446 205757 242012 -45726 185064 46207 220729 77202 179409 -35060 -215106
15388 -215106 16753 -85052 66148 131907 -60066 1829 -236997 -119408 -125299 -13969 -301741
15377 -301741 42340 60266 88103 -48809 -13502 -113562 -241851 114899 -115000 -130246 250013
15365 -126484 -251403 -260050 -148761 -211732 94497 -382635 -249882 84325 85239 304436 -56660
15353 -13387 -128690 -145891 -271769 34397 -274094 119661 11474 -50222 -289260 9667 186787
15342 186787 -51321 -49626 205939 -165627 -400670 244770 198039 -76041 -319140 49979 -391357
15330 -101710 207755 -108810 69047 -285160 169395 133154 -27219 547 -105010 189032 -203782
15318 316220 -128318 68774 42815 104407 -12824 -99970 -136985 93915 -4815 -85252 -146667
15307 -146667 -4319 84475 -51577 135248 24910 -174022 140089 161956 211571 110968 80235
15296 80235 97139 -41963 129728 194666 101553 46839 277127 116907 341451 420552 175940
15284 85281 75506 -23310 36368 185233 158725 171188 -52841 48995 65655 97084 241892
15273 241892 202290 207531 -78565 129407 326583 579149 -216335 167727 -185169 82201
15262 50680 87239 57683 57176 -6510 357533 257153 18810 155780 -355691 266856 7989
15250 221071 677117 662517 1200552 1447579 1377099 1127544 1078745 860426 418201 49300
15239 202904 63530 201683 116427 354337 -153660 -45400 185924 129772 207935 -276937
15228 374819 89427 -322073 153013 27643 98937 149561 -34088 -17240 180369 -39373 107898
15216 47324 196545 -117210 261159 -110416 -200665 2383 206510 233312 172640 -165905 -110253
15205 -110253 -204183 120983 184089 185398 68625 239848 -112877 138971 34754 200549 46422
15193 214916 -284826 -224413 -5653 55555 6882 5127 -172993 409490 -172275 158718 179455
15182 179455 -290817 -345952 46280 -42470 -238995 265919 -27266 -93467 274571 24582 498849
15171 498849 83419 180783 163228 -90548 87341 242941 -48888 254419 286912 159169 208209
15160 208209 158058 78784 12434 130995 351445 -43522 62931 59375 -230685 -77241 27539
15148 124223 146692 336577 13420 -3514 339005 106173 136651 183003 70336 -94859 -243895
15137 -243895 49205 -146271 -52059 255804 323782 -54930 67042 239415 111002 463568
15127 463568 -73113 173569 373663 137291 306143 255888 -198882 197628 -110935 316671
15116 265834 242062 -225013 175199 178388 320559 348975 36538 122971 -365479 -224318 -284397
15105 -284397 -163314 202605 322800 266041 354844 161064 -41232 781 127974 251008 689407
15094 689407 -150091 618199 187836 -328120 318982 70691 269697 121313 156427 110771
15084 110771 108268 -112520 -45472 219198 57647 174239 -22451 389143 386654 121161 66837
15073 66837 54883 210494 79526 197259 96844 620714 -98047 374712 41576 175211 51191
15061 92162 -14468 450523 109005 -100365 8082 221179 24450 155732 101600 151966 -204821
15049 325731 45889 -151777 367041 361710 56920 203529 294814 176440 365093 -22321 483951
15037 76521 235616 5876 9375 71631 162574 314022 298306 169959 296505 274857 73980
15025 423 386659 294085 35851 290286 268815 153292 259030 337547 62534 167049 253269
15014 253269 103955 405858 -31857 317180 327555 556055 176150 93099 -102109 675298
15003 384470 177264 74301 268644 107128 189416 -133463 522236 73428 585810 135385
14992 182700 167706 94670 160519 319625 3050 205871 304166 -662 152499 21049 214444
14981 214444 538071 90836 338382 -99499 53467 222009 195167 565130 229067 340407
14971 340407 132864 116845 415134 173373 276069 148252 125010 206561 -73749 345715
14960 395264 494923 246503 509058 300741 408195 192178 -84449 689528 43256 47685
14950 47685 63283 490939 355115 255558 121561 240063 146001 378857 21164 340321
14940 340321 309872 273813 238723 265583 142815 532657 476169 319908 319778 189645 635630
14929 635630 123646 384719 197401 14373 339264 468647 119115 182473 14559 425324
14919 425324 81701 313966 117920 206896 127798 140614 133338 290218 304681 49142 302956
14908 302956 392042 -30416 203146 316860 285792 307136 379600 316893 68636 114382 258679
14897 258679 65534 319470 390865 527767 273293 212600 382754 466936 392203 243991
14887 243991 355498 466943 604963 493007 432139 425466 497014 513135 337093 413934 348739
14876 348739 417029 546908 500698 443051 422126 57225 95687 356121 226012 454729 301001
14865 301001 237582 505488 401932 250538 58529 445270 184983 386523 473845 557248
14855 557248 437409 487246 209215 337462 408133 435363 583818 358149 340678 276503
14845 276503 547258 421557 552641 359523 204995 480274 116309 177244 217007 419900
14835 419900 576636 401628 362685 485192 231740 476140 518747 699196 684943 52867
14824 556874 479903 343353 484815 784019 188251 643879 439524 496277 801836 480568
14814 480568 527440 400814 804023 630782 700198 627130 306072 311884 349920 1026083 720251
14803 720251 576259 754079 527196 510886 370999 435039 521345 334884 187657 719617
14793 719617 641232 530410 692772 451963 608230 654088 745746 658203 459397 565827
14783 565827 578497 340416 397159 486382 416842 593424 606779 492082 684038 405753
14773 405753 576442 575134 588438 816790 542068 342156 768504 396552 369922 376116 593519
14762 593519 480128 219043 357041 529401 955104 725490 688892 793836 735604 523916
14752 523916 572627 728006 868365 798052 747320 743742 371184 716948 879102 646083
14742 646083 337679 518730 724663 1060728 405631 875951 746479 409538 475126 826835
14732 826835 448278 801158 886306 536571 623244 614039 492557 878307 755495 776203
14722 776203 1069026 373968 920307 684693 647383 939047 890127 963857 702971 597101
14712 597101 835408 1023204 437380 804322 892351 1065833 857018 724703 999228 628822
14702 628822 639974 903289 721180 1136085 869971 860173 1210879 1077667 996664 808165
14692 808165 1021570 960475 1032692 709402 863001 911853 806536 996432 1159593 873860
14682 873860 1027688 796093 970770 1113962 797223 1232518 1130132 881159 1212637 860184
14672 860184 928007 662103 1119694 807404 733926 955943 1301787 1162213 907447 960073
14662 960073 1382536 1134559 965007 1007425 890968 1345606 1152358 1402598 1051119 1218609
14652 1218609 971965 923386 1435574 1298925 1069207 1206805 1243774 1203050 1177350 1401895
14642 1401895 1356653 1405139 1293682 1512852 1658863 1108590 1198783 1246148 1678773 1241470
14632 1241470 969166 1567272 1698193 1171650 1117884 1765389 1538452 1165205 1553559 1449578
14622 1449578 1533040 1395022 1619334 1422107 1361589 1667467 1414083 1572333 1564581 1662760
14612 1662760 1476225 1593488 1675624 1216797 1616742 1655978 1603483 1663884 1429164 1589459
14602 1589459 1606566 1321502 1614253 1675006 1457343 1760351 1801153 1781388 1789002 1307181
14592 1307181 1725773 1658916 1743831 1884718 1512291 1530710 1886694 2010085 1924152 2007818
14582 2007818 2038033 2175505 2148580 1856423 1817315 1972780 1906096 1945308 2124597 2141454
14572 2141454 2416098 2244872 2253424 2548035 2207449 2248636 2341468 2344281 2344373 2488011 2871626
14561 2871626 2595071 2616963 2593871 3319786 3111556 3566394 4048978 4012849 4447046 4934790
14551 4934790 5693112 6509727 9129640 14245968 23826187 32998836 35870179 25204503
14543 25204503 12016025 6103876 3538985 2919323 2592219 2101453 1763035 2005558 1946159
14534 1946159 2227428 1962870 1925211 2173056 2402265 2239492 2219023 1940208 2578270 2368667
14524 2368667 2518108 2299701 2021658 2471664 2843683 2628913 2822015 2797050 2653121 2708831
14514 2708831 2715976 2618579 2964341 3005337 2724876 2751370 2948786 2887114 2702103 2955983
14504 2955983 2999882 3119826 2852016 3171762 3021440 3042138 3232198 3270289 3431787 3440747
14494 3440747 3776119 3487754 3333884 3484482 3789808 3365607 3618337 3218301 3567914
14485 3567914 3475777 3653229 3783369 3792709 3845562 4184396 4109342 3870780 4053684 4059877 4478401
14474 4478401 4175721 4189563 4608110 4374832 4342235 4314990 4486129 4449757 4494759 4556519
14464 4556519 4664965 4732719 4821268 5113148 4606239 5119786 5260991 5045345 4952125 5526119
14454 5526119 4996507 5387934 5387983 5255935 5651973 5139768 5919970 5614887 5789992 6129072
14444 6129072 6065773 5810297 5871644 6081564 5929764 6426158 6448793 6599319 6616987 6805235
14434 6805235 6550517 6637111 7006821 7317354 6880356 7362873 7457717 7385489 7827443 7787430
14424 7787430 8107062 8205030 8118219 7759293 8231863 8335862 8113280 8409222 8606431 8677050
14414 8677050 8801746 9095708 9224819 9474752 9597475 9250302 9590798 9758378 9815406 9864089
14404 9864089 10170172 10274842 10503994 10614939 10696985 11432934 11419130 11488764 11682018 12172258
14394 12172258 12201835 11957674 12421520 12714329 12837316 13163691 13185426 13663358 13498347 13937720
14384 13937720 13991843 14490190 14878369 15018521 15166476 15188896 15843541 15826865 16342345 16898397
14374 16898397 17300157 17019489 17799934 18200882 18642562 18991158 19112094 19531161 20102862
14365 20102862 20780268 20933049 21130118 22051115 22281161 23013104 23480278 23882819 24482540
14356 24482540 25011249 25326334 25936337 26546382 27655285 28216313 29145764 29754222 30238504
14347 30238504 31227873 32137803 32914736 33816781 34647163 35741998 36593990 37859330 39024867
14338 39024867 40127227 41278104 42522702 43878265 44981770 46335185 48005394 49068869
14330 49068869 50834881 52464274 54364792 56207890 57947141 59967578 61517669 64230261
14322 64230261 66292385 68505975 71212456 73754777 75939756 78941327 82336100 85680109
14314 85680109 89153315 92230826 96256333 100395312 104796879 109369524 113948194 119101347
14306 119101347 124374090 130077797 135755545 142208066 148750476 155970575 163463636 171068975
14298 171068975 179925350 188135853 197521283 207712468 218194611 228928527 240404533
14291 240404533 252977908 265284131 278880269 292595843 306997216 321616559 337151172
14284 337151172 352394704 368026764 383845403 399335515 414506632 429115774 442474709
14277 442474709 455211446 466178847 475701472 483081914 485989384 484976551 481122479 476064721
14269 476064721 475888095 476232247 469634520 460140270 447519233 433002512 417338450 400665409
14261 400665409 383600747 366246849 348802229 331437401 314885772 298851025 283652185
14254 283652185 269432964 255788921 242424377 229856277 217757103 206443076 196272707
14247 196272707 186080821 176769788 168383960 160349235 152577325 145273572 138687413 132050053
14239 132050053 126184883 120984719 115560674 110313872 105582817 101238840 97143360 93271627
14231 93271627 89924151 86042996 82821479 79567295 76402982 73310374 70854491 68203825
14223 68203825 65362858 63363566 61419704 59298492 57119177 55082603 53540641 51449762
14215 51449762 49992883 48768646 47222623 46123854 44184266 42760576 41881549 40651430
14207 40651430 39880364 38667991 37420827 36725937 35288394 34547934 33566845 32957214 32037383
14198 32037383 31142290 30291265 29505914 29245374 28155911 28017074 26924232 26033481 25431302
14189 25431302 25006427 24414764 23901420 23406632 22620989 22506208 21774696 21433275 20761072
14180 20761072 20402071 20266449 19365409 19028989 18862809 18449372 18046437 17612853 17364630
14171 17364630 17078497 16723164 16299368 16215050 16035903 15532267 15122156 14594076 14623347 14403598
14161 14403598 14389208 13397416 13938462 13212956 12774877 13166195 12642377 12726626 12322900 12063151
14151 12063151 11731029 11708583 11290634 11508090 11250886 10768615 10843128 10818741 10246345 10264488
14141 10264488 10345325 9928607 10075597 9268744 9429477 9374489 9342080 9014602 9538401 8868633
14131 8868633 8331833 8384970 8283178 8107678 8081439 7893603 8269824 7606051 7608282 7537731
14121 7537731 7609465 7467774 7029471 7323996 7457383 6795764 6847824 6921408 6386988 6604358
14111 6604358 6770997 6479221 6279605 6490653 6053386 6183262 6202087 5907623 6142252 6233018
14101 6233018 5759111 6094027 5894876 5582323 5485503 5148940 5424158 5441385 5336042 5172290
14091 5172290 5410123 5164467 5101107 4985096 4977743 5119364 4886843 4908593 4939656 4735139
14081 4735139 4422180 4669238 4552656 4757230 4752562 4543802 4495347 4287549 4100498 4132957
14071 4132957 4309674 4247884 4025068 4227846 4151082 4083837 3810600 4037436 3859201 4169835
14061 4169835 3685496 3517633 4301057 3798633 3992600 3564250 3643889 3507058 3765520 3557564
14051 3557564 3422848 3500115 3391388 3482157 3288741 2961195 3199850 3286779 3429659 3165570
14041 3165570 3538768 2912727 2843984 3194949 3208191 2950448 3141364 3184147 2670382 2988342
14031 2988342 2877487 3035039 3040265 2906830 2906806 2861619 2755689 2710523 2226125 2576169 2478478
14020 2478478 2237871 2251090 2269092 2412375 2680622 2559996 2364929 2121857 2301758 2434637
14010 2434637 2435135 2331684 2176243 2217987 2290698 2681028 2208189 2074588 2319295 1851260
14000 1851260 2368256 2437410 2172154 2499912 2131291 2303064 2375240 2362191 2705748 3015028
13990 3015028 3754526 5050496 9288275 17425668 28855705 34430115 27871633 14726936
13982 14726936 8524125 6086491 4956225 4352345 3585127 3346900 3020283 2811447 2836976
13973 2836976 2593537 2703689 2134299 2288723 2686010 2237914 2282252 2201513 2214705 1911462
13963 1911462 1896902 2036241 2258671 1956141 2089864 1987856 1964669 1835187 2124348 2112491
13953 2112491 1939241 1421880 2232431 2040642 1882950 1670787 1959135 1818272 1685039
13944 1685039 1661400 1408257 1333918 1825697 1712821 1680239 1905466 1406951 1648029 1568868
13934 1568868 1640129 1796243 1974969 1801365 1647265 1827219 1481849 1139719 1408657 1409200
13924 1409200 1230053 1170086 1389072 1327891 1355268 1716752 1520848 1523860 1226230 1270271
13914 1270271 1327163 1348325 1397909 1483277 982085 1380858 1540892 1154510 1142939 1430927
13904 1430927 1214169 1507265 1324375 1618977 1299999 1292392 1174012 1213381 1455550 1383654
13894 1383654 1183832 1093669 1012918 1365133 995163 1327612 1538349 1297624 1209550 1092954
13884 1092954 888445 1099031 991455 1143214 1446764 1161080 1015454 1245282 1443371
13875 1443371 1308082 1133311 928196 990034 1222643 1059104 983361 1036097 1233282 985831
13865 985831 1127286 1086808 1112675 905466 927946 847138 1165877 1516899 814476 1051882
13855 1051882 1217339 1096264 1058007 1001279 1047012 847814 1153491 988401 673853 958793
13845 958793 924116 865477 1029462 632922 864747 667798 1042368 587839 1242441 1083937
13835 1083937 755801 799447 1038401 971867 1120539 604553 1136053 678623 1039037 1109900
13825 1109900 857623 918989 780975 1046577 1197805 904665 566061 923880 687347 797925
13815 797925 855005 842751 1030369 835649 974479 962220 795597 525957 644327 730890
13805 730890 881958 970409 1067916 822938 684072 702647 716085 761676 608666 897597
13795 897597 456710 440012 485187 1059114 615922 966042 978276 925745 586587 701195
13785 701195 912977 564729 470252 553267 529738 862020 688281 621492 597947 750046
13775 750046 701654 558649 475139 909171 946774 617494 874393 647962 1306574 600360
13764 776905 723304 799606 898471 355907 890952 511613 703031 473825 432759 670302
13754 670302 488569 664674 699704 370036 418663 510223 518438 901509 462923 675881
13744 675881 765930 681242 219002 545295 382567 683293 535197 630828 91800 747645
13734 747645 344948 517880 594411 411242 473549 746326 607338 636894 497613 515407
13724 515407 340751 823450 478886 639374 652248 388205 142909 492823 732140 380265
13714 380265 604909 460044 819105 320365 569821 947399 474895 626617 371637 383701
13704 383701 465003 465549 771223 488676 966937 775530 647852 400750 452172 213670
13693 694909 517145 532969 129117 669406 514598 496494 498469 569172 221391 272718 256303
13682 256303 804005 682724 219759 577390 515141 249369 556790 416915 540466 605459
13672 605459 556835 572231 371372 307878 474623 249204 608664 116752 753033 255008
13661 332669 329403 607316 724265 218723 307078 263322 200140 599674 542876 450383 202483
13649 321602 200937 633649 318185 356321 141791 334899 496687 329203 490746 501845
13639 501845 506852 509855 695579 666303 349897 235414 -828 462409 584265 679783 312292
13627 242802 11454 81036 516035 442573 504184 42383 159486 393821 321610 172109 314145
13616 314145 315842 -73058 231677 411923 305729 300216 320442 443924 351047 217942 357202
13605 357202 283620 126297 216244 392618 458845 477414 217660 531190 371684 155596
13594 540890 723128 152769 364505 249637 456498 298907 348726 500414 333806 271987
13584 271987 115131 404327 399531 506593 239080 366075 148328 169389 714276 155985
13573 602812 397288 -51140 120411 231538 270241 214599 81099 242316 340717 269011 345942
13562 345942 304169 -45863 703832 549368 451015 363945 377321 200146 404542 451029 283620
13551 283620 402528 169883 621903 443255 263286 368527 435230 35403 -16395 9811
13540 212482 327988 407301 240852 110215 386368 272677 399017 68313 75764 374980
13530 374980 279206 155674 224338 -28786 61220 -65837 259798 198971 254989 80709 535975
13519 535975 428653 167548 310245 280077 341378 163095 410213 321593 246844 147058
13509 147058 232651 60843 316389 19909 357105 138651 258189 212395 525300 338583
13499 338583 243920 73935 -20041 63635 131954 149456 111075 283640 241469 121500 17583
13487 178660 332943 206070 53398 150210 62942 154315 403616 198224 61108 234644
13477 234644 442038 210063 546000 -69503 192549 185220 297330 -235424 246118 306133
13467 306133 -59597 187291 249282 -10882 16688 339433 158652 244978 287900 320743 317488
13456 317488 14157 112471 4537 158129 155870 140507 296782 -122756 112453 346465 440987
13445 440987 -87501 440397 287365 255950 65321 128064 375196 149273 310306 328178
13435 328178 161989 205402 -71726 -66140 148716 165354 363162 188415 194070 120627 203735
13424 203735 210027 191065 131947 -96059 173137 -81268 280270 143664 343789 240324 113867
13412 -112504 359677 505466 5525 310700 314583 -44062 235306 214338 222855 142161 176074
13401 176074 192391 175691 317995 -12501 224334 179961 199700 -178843 199704 292090 303916
13390 303916 34407 94568 478776 140616 36560 483949 343051 179206 166056 151510
13380 151510 293238 -14143 199210 488445 307986 -143482 110451 326453 377427 234645
13370 234645 328255 284290 -44314 379256 127177 16628 311090 239280 136547 461698
13360 461698 127087 82882 -66769 371276 -12551 60735 209927 516976 456964 125737
13349 196143 453601 29325 379340 456237 214091 121935 551051 589037 391834 179121
13338 252788 525993 520061 180535 212264 -298797 319706 362216 195985 234447 29866 136100
13327 136100 24153 15725 173118 159850 614438 356175 232498 524261 87864 148943 386791
13316 386791 -134517 43140 296675 81598 -20842 156619 109014 595090 37830 -306710
13305 -279374 194156 -274388 158314 -195708 -237977 648745 179515 -196279 -172859 -342044
13295 -342044 -200621 185685 -8553 118744 331090 204839 183518 322443 49669 221755
13285 221755 84887 -136067 90988 127265 279649 513066 199344 93918 148500 410413
13275 410413 398974 36698 245934 223935 -265796 168317 122181 125343 751166 44732 -3555
13263 371236 133449 476014 270934 116473 79632 -10852 -64480 49724 31967 43945 -339644
13251 67400 282763 338639 278567 -246946 200087 294688 -106794 250466 67993 46846 335459
13240 335459 340351 -1341 27286 242933 -145527 -307842 -69233 17306 655715 208505 -4954
13228 -115371 359076 289435 297873 37921 147890 -59586 119879 56629 54820 137131 181816
13217 181816 -63402 -25737 173233 261587 -141586 134242 -125477 114571 -116573 120590
13206 71281 121206 -81976 -172758 37779 89092 126035 209594 47690 21155 4670 70305 35430
13194 35430 -118115 -26636 107980 -52439 342819 189817 459353 143482 -45145 866 51758
13183 51758 321517 324403 98818 292188 -6552 152743 153186 32452 -75956 279823 -30025 42402
13170 -24240 99724 170502 41852 19884 189896 175872 23828 -180478 -34834 -22847 73159
13158 37460 170339 -92152 -9352 -188100 -79296 -91566 -46431 -228383 -167047 235399 -110262
13146 60306 -84205 50376 25945 42248 -132263 -104830 -4890 -258832 120738 95038 -4918
13134 -142349 -198790 161775 231572 69548 350253 244948 338987 319187 106010 140096 55410
13122 268808 173940 189717 -164642 217499 114485 -72185 79541 -239543 -123357 26877
13111 -140730 269777 206571 75476 -185769 -53063 186613 140221 2649 -292977 -24533 213066
13099 217203 -26751 195635 327514 206837 -137292 -120408 121949 73843 433062 18141
13088 -211478 143237 -223835 231870 -59971 -82166 -30558 251592 -105795 85761 426970
13078 426970 171101 294999 17874 234572 128366 -4316 -3493 -42434 131022 93882 202157
13067 202157 45930 89592 -47103 202319 -38867 -114460 156514 92355 19871 -97464 275323
13055 -60212 9888 175490 -43016 -55323 17703 -24066 10683 331988 63729 236204 187372
13044 187372 133981 186604 222650 89642 -134670 174777 67138 292660 78108 36296 194432
13033 194432 276878 110540 -166159 29393 279546 155735 84940 55143 -285985 37439
13022 -191495 99170 126914 315815 278218 446805 162324 255397 106850 139220 -58183 -51641
13011 -51641 275434 155724 281169 -25729 -171781 192085 212334 269518 157020 160515 139655
13000 139655 273820 -196398 48443 140972 299865 638695 211724 -45227 -169956 101724
12989 -54656 -155539 -155860 332357 -48978 424303 -53195 -120962 278633 77488 107856 141102
12978 141102 -97034 -10272 34449 205627 147619 63843 120093 85186 208076 52285 94908
12967 94908 -36390 126732 97314 19271 88919 -76920 78797 85199 -235332 -346 66176 249578
12955 249578 -146110 120460 -135915 -117738 -43105 47889 -33795 87639 21153 1786 -26520
12943 96006 245878 84723 164888 1070 16348 107843 313151 -295181 265411 -105311 5427
12931 -111712 84755 168278 528858 -111493 -28927 83745 3204 167179 142428 203262 -88331
12919 193096 -278300 66403 -42409 71330 -89787 149618 47656 -168327 286283 -206602
12908 -16492 12790 -414884 249104 290998 -28966 -84336 -332396 77826 -96331 59551 -84684
12896 135434 -127817 -132625 -124511 95810 331983 196631 91105 179262 198620 -135855 146516
12884 120458 -199241 -201532 182865 142806 -94426 -142151 -218700 89759 105626 -5278 322861
12872 -106978 -59948 -91499 147408 242553 -172891 32416 12614 -358775 -138458 -184916 13515
12860 254611 132857 118370 108106 121388 -263286 232051 -15199 30867 514711 95285 148912
12849 148912 160278 12623 58690 419611 -73730 -134241 -45384 233948 159451 165570 -165862
12837 -79958 -183047 342284 -28284 61415 233109 229180 -182837 -113668 -14205 -103119 32129
12825 -116254 -241965 115151 146033 144627 212893 204965 61162 -166403 -43756 -94283 -225388
12814 -225388 -233150 353052 -198497 217669 -54207 -284374 29126 -77828 -476282 206090
12803 42523 37210 105288 -93804 -284774 18823 14765 43586 191172 -21124 -173205 -436713
12792 -436713 -74349 159666 25431 34673 278182 75946 19605 -184551 170141 129980 215332
12781 215332 101842 258197 301564 58385 -171604 84729 134393 -120896 -178364 66027 188736
12770 188736 -44466 -70710 91139 -68427 -197303 72886 -94900 209238 -130761 -73982 -241233
12759 -241233 32743 168108 21423 -165918 218943 269628 -167719 119215 50455 -29359
12748 145270 -31961 144475 18917 165951 -96152 213857 302641 -144322 19739 -282135
12737 38657 26365 14800 22932 232819 32492 -129536 136598 159880 27817 63862 100802
12726 100802 74069 -126697 -275961 99111 111481 229716 58697 -100212 121821 111939 61462
12715 61462 91092 -114588 67070 -58848 4971 -38684 11708 96483 -110991 -212255 16932
12703 257664 -7883 66585 -145862 189066 63052 -102310 -58278 22628 204765 468378 91419
12691 297425 309328 363649 84168 173672 -327581 -196012 -20717 166235 195771 186169 -174429
12679 -376752 -361556 17454 126848 132379 5523 -95638 -72168 229463 334350 116493 345925
12668 345925 -221888 -5169 94351 -24685 147732 502747 43473 -160004 144663 127486 -35026
12656 179201 173113 53537 -356443 55870 248631 417501 390009 8499 136391 -148351 138123
12644 -12207 215332 -72576 287947 147476 187847 -33799 88204 135489 35921 197083 31823
12632 -62978 313214 331507 -79878 378164 422904 528409 167876 579272 254181 -34543
12621 -153738 327908 631645 150146 -127953 187503 11473 -18332 -58101 22234 273846
12611 273846 572029 47995 -174045 92170 -156764 385865 -10585 57967 15413 113803 217481
12600 217481 170986 257583 129744 37233 98003 -347898 -42743 -10392 233061 -8293 -22439
12589 -22439 24863 148609 -103049 218921 -161473 63783 270508 73740 91193 212099
12579 212099 113825 -141707 -97019 261953 88692 143045 22295 -183347 86212 -39703 73489
12567 291368 -200592 -167483 -51349 -164914 -78658 -221286 307509 -340403 -8176 5005 160596
12556 160596 -15348 25568 102487 23632 -73023 -34101 116993 -440196 73151 185904 430316
12545 430316 -202068 257558 -173461 -150628 135256 -237186 154757 -39829 -26245 207666
12534 83663 -73217 -30347 171132 99458 -198304 -45897 -44640 80784 190524 -353997 94651
12522 -101230 233003 355840 107605 80164 -118822 -7128 389776 130545 -37020 222141
12511 312836 -271367 -64820 130032 -138588 -242904 -148508 65184 230068 166547 -409 -95168
12500 -95168 168934 15626 -71510 25393 279301 -80282 90049 42672 -198233 68268 -44988
12488 27210 -79694 275330 218701 13108 232028 38475 101801 -155277 272185 -47298 330428
12476 11898 248381 297259 -113704 319933 -129087 186983 25691 -47929 -209384 -1621 -7630
12465 -7630 217818 -112202 22705 55924 -21594 -225537 224864 42331 -6662 123670 176631
12454 176631 89644 110917 -296642 280913 -50774 -50807 -82583 15622 -116845 -194914 -174537
12443 -174537 -5913 -290688 -246236 163651 181043 441487 165993 -157641 41918 -31308 228750
12431 -69306 -158505 -39690 100918 -115937 -256218 -87293 138593 -62992 -62788 -98203 60490
12419 -31002 123953 164893 -201301 -66682 -427402 211741 59813 -118940 81187 128837 -81825
12407 19959 342716 -33476 -378701 -156948 -87441 -43631 89969 -233195 -184486 -73399 -4521
12395 41599 204122 221737 48129 -188499 258990 -359013 222038 14283 -40430 -155219
12385 -155219 -569026 50788 154790 91826 97072 -41704 -142525 97745 64129 287918 -128718
12373 75506 187041 -8745 105036 -194502 -125923 -6599 -121639 -195761 -70860 -229048 85445
12361 26423 70005 -132007 166912 136613 -222021 71639 -21407 6412 -13840 67385 36835
12350 36835 38419 -109497 35723 -141985 270338 -247334 -138464 129393 -50927 -134813 373286
12338 -2584 218367 116930 -92821 91009 105812 -150758 -159173 -138483 95441 121407 167609
12327 167609 -80417 64447 -200240 162161 157253 244073 23276 -157877 -177617 139532 53997
12315 29005 -458714 301093 -195070 -124820 179658 -45334 68695 140642 -125642 -113194 -28208
12303 19472 -173028 172763 40216 -100174 -155158 65599 150775 192650 -157229 75762 -151120
12291 28567 95103 -53430 79249 191132 -200840 -33706 -57690 -100383 -39192 -30737 15795
12279 407948 181315 -102058 -3091 -28912 298206 215251 265759 -22552 -109283 261925 124546
12267 208595 137156 238003 265915 5357 -133668 37408 338031 292940 -44266 -143580 78975
12255 572779 287601 159592 11580 270936 99382 213921 306980 295771 410651 90676
12244 -91775 120373 283821 487084 95864 8067 217633 -94865 -242230 85065 55451 38965
12233 38965 167787 -292194 -45302 347801 423197 47302 444217 152658 -100521 91515
12222 297932 84541 217634 350945 215853 156025 8248 293287 -53289 404418 71953 211486
12211 211486 145355 -58070 308833 300406 190294 -271796 194773 103808 -18783 -105975 319474
12199 -69187 540536 -26063 203870 -57408 257610 -2813 38348 -60006 199858 272057 117266
12187 622953 -288419 71987 142407 90396 18416 -46573 68792 -183542 76889 -2365 20988
12175 375445 225076 229907 127433 98971 383358 48723 100753 262323 475730 232010
12164 -61298 -181613 140641 -80693 -135529 -3156 -319632 302232 -76375 -19576 198763 69589
12152 355158 -78633 155341 -53796 -229880 -73872 527661 -197640 38781 -103747 58309
12141 -85155 -47634 228131 -160809 124626 -39686 -169918 -148758 37635 265988 152696
12131 152696 146172 355425 -265267 -22578 306023 -126349 -197930 -152123 39798 207212 -158786
12119 -75570 -199426 161541 -498481 5468 -61177 295988 -45502 -167965 -8109 126797 42432
12107 -195896 15825 274308 142767 492905 -211820 -314314 -191266 -33490 -201427 -165540
12097 -165540 -29885 55122 -91213 -13073 -504157 192851 -77306 -162675 11179 -245266 -332209
12086 -332209 135522 55163 33071 2263 140500 184075 -174659 190506 -201234 9338 -153689
12074 82716 39005 144168 -56719 24128 -144365 -61163 -128018 320248 -23097 114227 49200
12062 -93017 -86651 -410037 -265426 408978 -20251 -410743 33650 129780 351321 -114130 -191131
12051 -191131 89207 60225 -325920 -55153 -464296 134270 100791 126542 116107 -265699 -25856
12039 -10435 206901 -51190 28597 185879 213798 85514 219993 156386 -26043 80933 62422
12028 62422 401927 289377 882468 323083 517164 347048 27182 -149998 184081 185978
12018 185978 98566 110091 -92151 -136086 -26002 315618 -229189 109976 -347547 169486
12007 -35881 37170 -273899 334749 48738 212712 -274001 -45556 -215796 186293 310198
11997 310198 -131074 -5243 -419136 34531 -69910 -77848 239009 -166835 1180 -232238 -123149
11986 -123149 -33459 -150685 -103702 -212315 181697 198997 11333 -155396 -110933 40157 247755
11975 247755 -153610 -261924 -173696 -3272 -73378 -226525 109648 -280241 107384 -42005
11964 306532 -161957 -220758 -155488 265377 -81689 -73208 48324 202555 -76723 -9666 -373012
11953 -373012 103891 286012 153794 244779 -43291 -123829 -391171 69494 -16357 -110937 274411
11941 12710 -33364 196695 38993 -39338 -86799 -191354 -96050 188209 -184153 -63714 -219938
11930 -219938 -37422 -206695 82536 -231549 -63936 -83226 -43606 -18228 -239704 -23352 -172353
11919 -172353 -124263 222936 132007 -126866 67826 -6887 55217 -216076 -61447 -199718 137969
11907 73392 170551 14075 271202 173617 356697 176766 -185430 -259874 69596 -127603 58528
11895 312 57613 -194518 999 -64722 254967 87101 103890 92834 181335 34382 -169307 83242
11882 -235773 -467661 -94801 -133931 -33886 -122169 40440 107601 -13889 340000 125792 -208725
11870 -42223 -306645 -65574 90779 -374623 210574 145589 -122402 178868 -1999 -25059 -261726
11859 -261726 109687 -119939 333920 -157678 -140256 -100600 -33041 183034 289263 88663
11848 218370 -241206 -308379 157629 163098 -391839 -9386 -233172 71169 91590 -122070 -273352
11837 -273352 30907 -33191 51726 -301551 159972 9189 -58196 -157837 -19027 -192759 -124691
11826 -124691 -298526 62226 84937 -177782 -212405 90475 -220161 -21405 183936 239226 -395878
11814 16967 -44625 191131 -277209 -40401 54856 170436 44129 -25110 15473 -226377 49948
11802 -170348 15401 -420678 -76800 -155926 269989 32512 -234832 230515 178449 320828
11792 320828 -65565 51829 206847 -123481 40675 43446 397764 -5581 -85501 -208382 194485
11780 -23776 -33303 -11224 52926 -33912 8293 -91195 78490 195120 274616 -157994 -187423 -154420
11768 -154420 -155103 43859 -93468 -65215 -247693 -380546 -119587 -34350 -27071 146664 128048
11757 128048 -128754 141287 -289193 -121683 21776 -232211 71745 146860 178214 -43708
11746 -231227 -258577 -237463 6763 62015 125378 220109 -226682 -246145 -111176 -11206 -48547
11735 -48547 -61913 -79030 -49973 116254 -147153 -25783 -117918 16902 -257944 -108225 -41705
11723 -332760 29903 59486 120490 187578 -63944 -242030 -170549 50245 -34310 -61956 81550
11711 -331180 -72139 137341 179353 -124589 -20651 2957 5274 212840 100451 88615 136458
11700 136458 24617 -277638 266745 -139194 200688 181059 -55925 111433 88640 -114288
11689 232802 82717 67580 15466 76784 -83390 526430 151257 220323 113073 112393 -24255
11677 282464 51583 310761 55900 -213910 -139139 196773 -81511 -26169 -238134 49234 7734
11665 -260198 -188606 -190045 37285 -185015 -221522 61187 -31738 198103 -104190 286033 -344078
11653 -29692 -22494 -134830 15249 89068 140601 -160827 16161 -306346 -2724 -111180 361142
11641 74182 365531 -164412 106014 -39450 -38580 435434 -254675 342975 141391 15392 -20193
11629 -159438 -151579 65168 -37130 63589 -22947 187899 -151947 147640 158149 188151 139738
11618 139738 -185091 71994 294164 236977 305058 90714 190943 85812 110438 98422 283841
11607 283841 256867 -36235 -139362 144491 -187705 63299 32436 186277 240032 332788 246162
11596 246162 -265642 -85954 172847 151950 -1533 96105 -105476 -68375 -6006 299409 80570
11584 -10602 -81300 306509 -72930 88668 206717 252651 161486 63574 -37319 -59122 126194
11572 -55763 4717 53728 -328475 -35200 57530 7077 6101 490983 187742 106409 -84179 118675
11559 -304784 506518 491 -238244 -17328 133964 -117235 29378 -223927 136158 -276348
11548 214992 163202 63174 -22152 82387 42495 -18161 303868 91503 5776 396670 -1406
11536 39319 90427 208204 142613 22452 -86901 -20145 315015 244369 280625 46448 -123664
11524 56320 15096 -62728 208935 164419 -200072 19056 184646 117625 80877 -142344 207637
11512 -308683 229956 36392 134160 -98634 3656 325817 -107478 381786 253488 356926
11502 356926 112768 86101 85151 92664 192207 -296966 -54828 124001 395433 406979 -44824
11490 38214 -120552 277493 -234917 581195 389088 -179901 389169 233083 52995 291614
11480 291614 196740 31895 138439 234720 252257 -16890 107455 353945 48657 32324 38959
11469 38959 327772 33988 166388 222685 300165 -157854 16354 66466 101561 275378 397202
11458 397202 501578 291644 -61880 294879 263917 233869 -14182 151948 127988 61662 166168
11447 166168 131279 48589 -65503 260296 205214 -249989 37711 278485 316715 -50906 99265
11435 407548 -356364 -25321 -258064 85990 19613 -144971 -246982 173523 236904 90608
11424 134651 87470 15090 288675 -128757 146930 -52150 -127060 -135525 -452690 172778 -150295
11412 168292 -327672 214933 123173 -40480 -120778 -219016 -320952 -30528 -269164 -273655 -74586
11400 -256768 231604 197659 179334 281226 199798 190730 -117972 -130276 51422 -23729 -87996
11389 -87996 120859 -318120 -103538 -253909 -65916 -198696 115335 -59309 15454 -120045
11378 -45215 87172 157473 -135614 16149 -309166 -77036 61021 -85806 282652 -47331 152621
11366 -245285 -10634 261903 -173623 203699 -196546 53118 -294293 -445759 151088 67526
11355 88380 31160 -119641 -155906 430349 -92071 38532 -13397 -161268 111485 217339 -87554
11343 -144210 986 -189585 -213832 170073 158308 -115710 284085 -370550 -97526 -130553 -99362
11332 -99362 -310716 -255586 25725 -310772 -76756 152914 -344022 -62171 -112295 87095 -4836
11320 -222709 -22568 233642 139518 -129661 -89427 168048 349584 134727 64578 214788
11310 214788 -118254 288483 374796 20038 -109846 147914 235955 -31741 110671 -138113
11299 201848 93046 -9444 -266640 -259955 -55129 -133114 -229326 -139498 -37469 -274359 157832
11287 303249 -72651 -150409 205136 -96002 -146845 193520 99834 85489 313414 -248498 98975
11275 -56664 159431 -31214 669 -45271 -204211 -238816 126422 169442 -116752 70528 -199925
11263 -196219 -121625 -84132 -126215 -126592 -32120 -235730 -467135 217921 162797 -216830 362259
11251 -5953 -337729 -15518 125364 -5263 -42936 -246832 90008 -133562 -46332 176216 -107659
11239 716659 -188878 294078 -230553 14524 -525727 -439336 493197 90924 -135671 -116190
11229 -116190 114683 -141580 67728 -69179 -52127 150953 137839 303857 73716 18650 -205560
11217 -137880 -133437 -117766 -199004 16553 38830 -89124 255620 -339573 -190066 123773 68598
11206 68598 -126889 93516 -15461 146204 71949 42564 349696 222919 -289465 -204842 18924
11194 82856 -162047 -151416 53157 -129676 -104454 -330429 8263 -261911 -259513 -310857 -71728
11182 -293731 -61181 -98841 -186598 -207 -332714 109035 -5329 -140365 -232515 -83503 273820
11170 -238129 31953 115110 -159621 -140107 -57273 43722 -50628 -277395 96340 140200 -41057
11158 35975 -12287 -73980 -236443 -39802 -165781 394770 24653 23511 -56064 -82968 216052
11146 41604 -306380 -119257 240634 292676 -318714 -60958 -347138 -142438 134280 -187567
11135 362174 -183007 10520 113470 -138037 -38166 135888 -140391 -29096 174018 112561
11125 112561 -22785 170500 99471 -1289 -13309 82491 6026 43087 22972 -141634 296827
11113 -248255 356821 -81489 231265 164736 45135 -85551 222986 -83914 -130177 299408 94339
11101 -356131 77925 -67400 85324 480527 35848 265838 25357 233872 124905 343994
11091 343994 129449 272 175001 379900 444146 137105 319916 206305 416622 192168
11080 267360 328018 -138389 154085 329498 478182 398460 64123 312628 409618 258841
11070 258841 302866 320163 344908 516299 356234 242253 398657 283348 417516 318648
11060 318648 695407 676031 484874 855277 522295 645084 656421 457386 744381 598768
11050 598768 633772 666667 979356 834114 634993 875176 888392 571773 486994 704519
11040 704519 909193 864731 1085483 821523 821240 837023 985156 898683 596587 729924 682888
11029 682888 805381 769644 750658 926364 647806 630607 628905 990590 669651 634790 725640
11018 725640 809007 722837 871083 780550 354601 473674 669370 583631 685370 673919
11008 673919 659435 611119 397711 566066 1021969 651473 732612 756518 873422 589188
10998 589188 792915 1093612 881190 773989 651829 672328 531444 761080 642881 878654
10988 878654 746949 1207467 897912 1064387 1338227 1308616 1497969 1481369 1599841 1593760
10978 1593760 1717800 1952283 2278478 2635275 2774943 2553844 3424273 3173403 3037484
10969 3037484 3481649 3492058 3254532 3159710 2990790 2012282 2073846 1969973 1799397 1850808
10959 1850808 1582376 1917313 1578353 1245076 1476960 1410935 979616 1136230 790484 880034
10949 880034 700194 416035 552601 356887 219517 336848 231919 234368 181684 106985
10939 106985 217364 94459 307356 170358 537962 344714 174952 66072 76146 -69043
10928 21210 -58313 288915 33678 105111 154254 90671 -91685 -232339 194069 179034 97176
10917 97176 -82143 -226884 -239954 85722 -83957 62864 -177340 71994 -103349 63496 -211624
10905 37212 -69189 -50131 -1735 -248028 -2383 -1838 -332399 -311975 -50770 160758 232156 4924
10892 -112958 -163898 145845 -56924 124060 100829 -171826 68117 318638 -58532 -63474 -26398
10880 -77511 -263855 -209890 -36148 -39677 -10163 -106458 228991 255528 -33961 -76699 -393954
10869 -393954 241885 -311819 -75245 -116381 286940 -76810 192570 74461 129724 -3932 131800
10857 -248050 -14897 -166815 53035 134537 101455 -181796 232134 166667 -144072 -107140 110335
10845 -53374 -120328 91096 64325 203425 14649 83455 -8113 67445 122378 -174252 170443
10833 -421183 46519 -66088 1630 -36237 89206 -171892 -73159 -146761 203066 -129073 2235
10821 -133164 -191271 -149058 -31556 197185 -42720 111360 91048 -242079 -286692 22932 -193728
10809 -69251 11330 173829 95234 -167415 -33980 77614 257589 117218 230743 -41088 -68034
10798 -68034 322406 -206450 80212 229018 -56138 -316878 245033 -259192 -52244 -60912 -378674
10787 -378674 -142891 -195734 -607981 -158077 -332378 121093 45851 183425 -204949 -212956
10777 -212956 5613 -60383 -45999 -364215 -133523 252801 -29612 224190 241126 -65502 372427
10765 27618 -32039 -174219 124051 -381893 -53938 -289121 252672 -61496 -187798 -236768
10755 -236768 -190977 43816 199453 -121685 -56452 219419 19031 -53202 203451 234543 -125085
10743 121704 -90835 92907 -22160 -328162 -140620 104101 -93827 -112318 -312796 87079 -288438
10731 -63178 234130 -203358 238294 -301603 -229249 -156061 -83032 -18697 -382826 -42247 -121207
10720 -121207 -133333 -187926 253810 -236239 -280493 -451310 90323 -181493 -136537 -157836 -133629
10709 -133629 -167062 10299 153707 -268064 -171725 -176617 73016 -196800 313286 -23481 -40561
10698 -40561 -101262 -180960 218757 315774 -236027 125659 -30597 222962 -46227 17494 81889
10687 81889 -109037 189387 201251 -82700 -137917 -34896 -88745 52022 -60980 104428 -138565
10675 -432995 55380 -172348 -179952 2153 -160028 38728 60534 59101 -368942 -145622 -136258
10664 -136258 -219010 62313 13972 61916 108985 6822 -144419 -254396 345000 -99453 218956
10652 -101866 173554 41526 65880 205814 252757 -11077 84594 -20820 -395 -944 73228 -11594
10639 72194 48400 79045 -276486 -137057 -203625 -126504 -384685 5644 4181 -89021 -52509
10628 -52509 -14864 -169912 15494 -37851 -133903 -312715 2978 67101 -127071 25454 -5507
10616 -234851 -176945 -85669 126905 -266283 100310 -130743 80543 -233700 41216 -235044
10605 -304035 -94499 61277 161074 199388 -85006 -274249 -58020 -212307 -10598 364320 -11260
10593 -443228 28884 -109756 -293563 -237274 145884 -97422 -171596 -95419 35038 -202369 -92861
10581 189888 107836 39040 -314130 130989 86634 -47099 220513 -171796 -325738 -127613
10570 -10298 101356 -232496 -73397 -154066 45140 -18318 358704 -195908 161810 -218642
10559 68990 203103 105984 342955 67861 -233858 -180093 -253139 -130749 45999 -156062 -229066
10548 -229066 -73418 40662 -183525 -58595 -44762 -37187 -256876 67566 -22351 -386786 20578
10536 -43676 -248772 -23283 -298 21799 14906 -352990 -459959 107264 129014 335066 291926
10525 291926 100996 241568 124146 81502 -106330 -157649 -535015 -375923 42064 340764
10515 340764 -149652 -40167 310706 175302 216996 -403538 -34701 137067 80543 -269111
10504 -171670 -214316 -69516 -455895 139692 -362992 -522826 22113 185198 -146913 54106
10493 -281705 -9203 -87594 -90769 60025 -153426 -126874 -237058 -112301 8372 73191 77064 237344
10481 237344 142864 -339599 229874 198684 53092 -115234 49931 -32707 17351 36505 150821
10470 150821 -163431 -226066 160446 -309850 -142948 -167587 245239 81027 98827 -17739
10459 -29964 -92878 -63893 -28218 402199 6758 91916 -1720 -86107 -235826 -13657 -107972 93621
10446 137869 201637 116343 -17434 122556 166185 -137856 145137 -253501 73906 8819 55190
10435 55190 -170628 -79070 240581 208275 -99327 11699 548105 -7232 22021 -36256 -47074
10424 -47074 20511 -142390 296600 159735 -169235 45706 -175948 161953 -84877 -170344
10414 -170344 121759 144828 -47630 164495 -71852 -271208 -101810 -135221 -71684 -80564 157608
10402 70692 -261478 -42653 -80595 159875 -416385 262319 -179655 178048 317888 175002
10392 175002 93360 -45923 483387 83556 1385 179710 354642 109339 212377 -15110 230272
10380 -20538 477059 8703 439807 265592 255452 242123 471173 436303 -104562 43739 511918
10369 511918 567282 107497 593009 344768 553358 474083 274518 56083 285333 97333
10358 131530 46906 206298 -104095 252361 -141 519473 397157 606078 609113 839485 620806
10347 620806 231791 335916 236701 318871 206553 332248 101794 307113 288515 180663
10337 180663 227674 164319 96520 79474 -148426 298692 237017 108653 297902 47032 -241572
10325 53125 -172876 452547 353155 107077 394839 141690 129114 211975 157991 2233 319889
10314 319889 219539 224564 546485 4849 -95239 -41507 -6725 91738 -124990 83674 -292923
10302 -3400 37214 103110 85831 72208 114298 127911 342986 153986 242412 4988 -310818
10290 31475 -199195 -7842 -48103 -92893 -180729 -39635 -306490 127169 -21592 -215164 46494
10278 -120125 -158991 -185767 -230609 -87601 -124108 168867 -155122 -74412 -24509 288521 330883
10267 330883 438345 70051 95751 97680 -158183 380811 108978 -108862 -39894 252443
10256 305343 391981 1242 -155297 88346 126634 164831 -109648 135880 -382489 -86324 -349186
10245 -349186 -107844 -6382 -239791 -156361 19910 -294651 -204384 -179080 -70844 120860 265441
10234 265441 127225 -137104 -226976 123249 -185782 200056 244668 200805 68987 75423 -229425
10222 -412657 62937 198055 -63533 -93327 -45486 -6920 21329 -128280 -14458 151261 -156594
10210 -347071 -342686 -215868 -247308 70426 65112 -151428 179331 -316009 46853 -191678 -23554
10198 -6136 133343 56441 78303 36907 -273979 -33015 -67433 8352 142443 -397546 -82162
10186 42814 24717 -87721 341011 -275433 368466 -133421 223836 -51133 -118552 63687 -149888
10174 73291 -64167 170836 -5392 176190 177369 34048 -3158 -305337 -428866 -216068 -209766
10163 -209766 -81436 -233998 -55740 -359886 -140422 -342650 167910 -33319 -285019 -266301
10153 -266301 -124332 -81823 -178175 74473 -229815 44661 -163055 -197149 -47205 -34288 9388
10141 -35842 -21052 249295 -4124 99964 228687 -145276 135025 262079 -9352 -26382 236108
10129 -78038 -102857 -39094 323751 -232116 -207243 -179902 -81399 -36348 37737 -430971 -151717
10117 -28261 -236163 27725 28816 -159550 -77836 -165413 -156218 -21298 -70966 -327465 -288773
10106 -288773 -151118 -200233 -175879 -216796 83546 30270 -38291 -184261 17588 -98972 -250141
10095 -250141 -203700 96642 -66975 132538 -416643 -48664 18213 170751 213005 -128018 -138919
10084 -138919 -137961 -24960 -53337 86567 201046 -116077 90393 141170 -191537 235900 -128053
10072 -36050 -140092 -70568 50894 -48976 -65117 -165806 -178529 -109391 -109143 -26107 -93652 2328
10059 -207266 -74942 53068 201460 170380 -270595 -26274 -188378 -49458 233195 -88396 -20943
10047 -331171 78697 -94556 -349950 82505 -205890 83711 -10076 -232599 6195 -41627 225874
10035 64287 -270525 -20712 -345974 14417 55138 38829 -242307 -67421 128790 -83919 -112942
10024 -112942 -340382 -180874 74672 100986 -341127 -107359 278180 98845 -193007 -156692
10014 -156692 -238923 -312725 -185906 288354 -475839 -241859 -131594 109974 167051 -93059
10003 -113015 -19565 -174992 -207443 -38510 -21244 -69430 -209133 149691 51041 -122939 -45907
9991 111216 -79886 -64316 -2598 -280123 -139187 -185198 185289 215847 -90073 -225453 -137324
9980 -137324 108335 31065 12574 -75965 196981 -464187 -30931 52438 273116 -440449 -394534
9969 -394534 -150283 -125340 156388 -245475 226473 -10002 -201011 176531 149857 -30867
9958 -66020 -241490 -20855 -126378 132050 97518 10870 -48715 -186207 -54280 79926 -203579
9946 181539 63663 140660 82979 48025 -385586 -101452 -229797 -307125 -8414 -280168 184719
9934 -135664 -7973 -185354 -20145 -323097 1661 542 -488513 -264990 -246836 -144844 -65454
9922 -169032 82586 -17293 -306957 -351779 -66130 221704 96511 -29236 -64684 -32211 -189040
9911 -189040 -386859 -268863 110942 -64206 99306 -113381 -321458 -297036 112591 400931
9901 400931 -54515 -278532 72940 13565 238656 -313990 224282 -170912 -179855 93096 99971
9890 99971 -172903 -225100 -244777 94635 -240701 296332 -301682 -225971 153853 93781 -3044
9878 -1045 -224859 -336541 -419510 315885 -149689 -238356 330984 -26880 -154983 72704 -264376
9866 -66339 -122525 -174293 -24788 53919 -158114 -339714 -411740 -367696 -15713 465363 -246084
9854 -108971 -251595 -419840 1761 -115413 80950 272529 -232109 -249502 -88130 173982 -170224
9842 256304 -423257 58405 -140330 -91909 -37860 -38737 -45579 173755 75476 -208606 -135268
9831 -135268 77871 358225 -6648 -163012 -137765 -123524 -256677 -205040 188594 60671 -266447
9819 246829 -173460 -124063 23232 159635 -107297 -123077 2276 -129902 -215002 -48303 -22108
9807 -74216 98345 -283681 -137187 -264121 -252310 -73746 -248496 133148 -68959 137925 -126298
9795 182340 -146163 -154602 235667 -46337 -73869 -399447 283095 503907 -154181 282238
9784 119192 -281562 -213919 -3516 55036 -377961 -155130 -368249 -315059 16634 -86449 -223591
9773 -223591 271355 -58328 90557 -390769 -141182 -60059 165799 -245939 36351 -678749
9762 -290200 -343827 -509194 217457 20848 114335 46480 45379 1768 -149967 147005 -42963
9750 109928 329559 55317 -180528 -351888 148508 -302530 -273420 -194269 198115 317952
9740 317952 121520 176539 200937 347145 -97424 -130917 -168250 129999 245165 -126642 -286604
9729 -286604 49779 -200048 77255 36786 -115155 -101175 -27378 -8769 -155660 -181301 21093
9717 -74410 -152226 -139365 10496 -208312 -49208 176076 -19256 90653 13047 -100856 4071
9705 20889 -508619 -340875 102249 -210905 -211613 -87344 -133409 -208139 -149245 -259392 -60068
9693 22508 -280506 136731 309164 -508323 205615 -9328 275333 -135243 -152223 155164
9682 196321 -37854 -4682 -156175 31807 254014 -190896 20864 18027 -179555 23532 146410
9671 146410 -154683 -54013 20357 -67659 303856 -91631 -491223 -201464 -333538 -163741
9660 -58441 -122323 191041 -68482 183983 131279 -409956 -22756 9361 -353735 -121815 -343568
9649 -343568 -212387 -80774 97398 -351832 208827 -197053 105400 10353 -7272 -198454 9677
9637 -215639 35949 -325101 28995 169477 -76639 -201388 27742 164480 -82376 -90262 128604
9625 -195917 -109298 83744 -169224 -76575 -111633 -486381 -149854 -22845 267201 97044 726
9613 135461 -104578 -310238 -79986 -106516 -161196 9938 -129334 -305290 103559 -78106 -310625
9602 -310625 22824 -281906 -77499 -137476 -234199 -90669 -210476 45975 -509094 180457 -324286
9590 127906 -110085 163865 -30732 114986 33516 107367 -181539 -158757 -9427 -461479 231735
9578 151535 -21485 -27608 -3846 97848 -87485 343862 -283950 -268844 99650 70195 -81272 140775
9565 32403 29780 25599 -47254 -38484 -369435 -40142 21185 -15864 -177206 -64771 -124398 224098
9552 -170832 -233224 -221156 -215676 -127578 3083 -243165 87785 -71736 -232125 -80312 32844 -26671
9539 141143 -258590 -21879 -184215 23489 135492 442 62268 44467 -65527 -351090 217352
9527 33919 -45649 -74150 282192 -173487 -204556 5080 -48173 -223776 82334 -231846 -85168
9515 7551 143153 -304773 113410 -263411 126844 44010 155642 -50331 -469718 75676 9788
9503 -24321 22504 -53701 -45636 -281380 -27452 -110592 -291153 -61521 44003 -217845 37693
9491 -232294 19691 -130155 -159604 -232615 -5096 61278 5311 -78548 -108763 -315439 -79533 -11903
9478 -25268 -149009 -93499 -285732 -203921 55379 81474 31432 218696 48794 -31927 -178512
9467 -178512 -462468 126622 145533 -4985 -144867 -129532 -122814 -209439 133013 -12242 -89765
9456 -89765 129951 -18179 -247191 33779 -164186 43989 -309880 -73166 -376171 51087 207135
9445 207135 350764 -43986 -259378 7669 -418718 102965 -38626 -199384 -440513 89900 -229611
9433 -167704 11007 -165820 171711 -137759 -222146 -228697 -229316 62613 355766 -116819 523499
9421 -103768 -86788 50952 232830 -402069 -96662 -279437 78217 245502 -94043 100832 -68861
9409 51480 8704 -123009 355999 -215692 -53831 -368475 -68851 -2379 -127205 -157094 31875
9397 -126385 -124782 -76004 22559 -183558 87863 -261149 221380 4897 -308356 -216352 47116
9385 96629 -219335 -180106 75125 -79078 -194573 277179 154256 49706 -25961 -128818 -291247
9374 -291247 -31387 -1323 -115000 51155 -17933 -9428 -143537 -151534 161330 -155508 28893
9362 100042 -538563 -43069 12475 -9602 343862 28988 -179832 223391 -147311 -33246 -416072
9351 -416072 208144 -211033 -368428 9095 201430 -21361 -59231 59155 112281 -105107 -61219
9340 -61219 84702 -215687 -99068 -158693 -111829 -13283 -298148 -179759 184996 25659 -185184
9328 -102491 -52318 -255723 -126879 -113231 -95650 -6912 -122777 -146828 -200446 -35777 -193413
9317 -193413 -428976 -62606 64528 359821 -21087 -82664 -233070 -272621 236333 -12385 -7456
9306 -7456 131857 -95580 -190033 -386046 150197 -112020 -245012 139896 -490081 81146 -529025
9294 -208494 109111 -158077 -195568 70903 27501 264987 197700 -112851 -149134 -264164 119976
9282 210940 110923 -124263 -94341 -6909 -45343 79610 -8820 33696 164930 211585 -50268
9270 228880 -78794 54027 223634 156000 -244288 -100807 -149695 -64649 -187197 -278563 -272400
9259 -272400 -24237 81249 40958 92123 -135062 -37950 -348703 -56360 -41488 -262952 5373
9247 -303858 -343152 -20320 -86843 -69984 -472627 -312671 -134975 -328006 -391979 17258 12605
9236 12605 152822 -267124 -246763 -367948 171356 -99338 -151580 -5477 -138527 -166946 144193
9224 -335085 -176532 -31130 204664 -326664 200323 -140897 -20600 -72651 -102346 138118
9213 -213376 107193 -101089 85205 -388300 -255031 38284 78426 173670 -163299 -415319
9203 -415319 48948 -146248 -154180 -383030 -30971 -80910 -159705 206293 -75102 24516 -258209
9191 133814 -140107 -72577 -141910 -303187 -19555 150713 52902 64036 -10210 -102550 -155233
9180 -155233 -227326 -82320 111419 -156107 -212551 61802 266723 243891 303082 48714 58086
9169 58086 -364772 -81801 -14930 -327180 -49877 206336 16829 17192 -136761 158320 -155918
9157 -332517 -197864 102402 -279429 -58653 -96432 -105590 -123491 24580 -213480 -96823 -319066
9146 -319066 254452 9950 -34128 -38577 -212216 -23301 -9557 -290221 -200589 74824 -103513
9134 -17962 68442 145197 -181993 23980 -173748 107641 227770 -56893 -366293 -125808 252020
9122 -75938 -146869 -92522 16678 -165237 189296 -382401 212498 6626 -75181 325462 -46041
9110 187969 -270477 -45081 -282440 -192984 79038 -456807 134893 -9218 -25705 -111348 -194054
9099 -194054 -100127 -197881 174298 48896 157368 -74999 -29716 78148 -21193 79826 130017
9088 130017 -175941 -127070 -111710 -224672 -54691 -113999 302891 -115194 -237955 -204369 -329146
9077 -329146 78621 -16306 -122734 -75999 -7198 23391 103285 -117391 -78202 354062 180277
9066 180277 98369 -204784 80456 38931 -105021 -150754 208551 -142995 30578 -378326 -239873
9055 -239873 -104744 -237576 20372 209236 81328 -18527 -162086 243614 -24385 -204228
9045 -204228 219915 -86807 85065 134588 -130478 65064 -339178 -38190 -72110 -87340 -270753
9034 -270753 -271606 97729 -168549 -28110 -637983 24155 -247502 205163 -14711 -572096 -6830
9022 5615 23275 18983 36110 -166262 -328966 165561 -248508 -8342 84526 -214359 -313310
9011 -313310 151139 -39602 -168625 -99875 23598 -138828 130090 -170150 78716 49078 -181238
8999 -416807 -52469 -145345 217519 43343 97659 -53356 183343 6984 -60383 -26506 -6773 -91907
8987 -91907 5921 -324043 182222 -88845 -356762 -234463 -266367 -109676 -171075 31750 38472
8976 38472 -57617 -158892 107737 36249 162299 -201253 -172926 -390779 -34802 -344739 63040
8964 -218313 -50690 -55818 -544140 -63535 -271590 168450 290972 -75078 -121100 7013 71074
8953 71074 -250206 154299 44694 -202557 61031 -261661 282904 -15330 -251286 196048
8942 18732 167728 25879 416572 429132 54720 112532 336976 434482 239888 75328 -139986
8930 372188 430326 231950 93840 532907 745559 1681779 3285610 8407182 11622270 12640071
8920 12640071 5460028 1591934 971306 221617 416888 270253 225321 -30585 345853
8910 282327 -362710 31239 590194 545360 10687 -149236 -205228 -208669 77320 -329016 121109
8898 -7097 -233026 -137508 -150099 -14075 25396 80510 -82126 -118464 -180071 133679 -33732 -192706
8886 -192706 214473 4991 -69050 -167295 -105053 -149262 -230779 43567 106480 -8946 -334716 27538
8873 -41121 -414887 -51204 -144915 337511 -89858 164870 -355337 132955 164927 44255 -338834
8861 176635 -220247 -108289 260869 150873 -324186 -174414 69067 61660 -168269 -299284
8851 -299284 -102740 271205 -260813 86756 -429604 -235548 -109427 -23070 -66698 82011
8840 -20148 -461767 83480 -87751 239199 -181277 161156 251429 -389246 365240 -258367
8829 47543 -237848 213577 351961 -264309 184458 290360 -207486 -242091 194219 -213298
8818 -79901 -39664 100776 33273 -201863 71936 -104332 30487 -143565 71502 64361 -192845
8806 114950 -420039 396194 173736 59817 -213605 33351 -51089 122196 10046 109032 -123317
8794 -213125 34248 -201311 -68665 23936 -318109 78849 -156141 -44100 202834 91320 88047
8783 88047 156530 -97005 -427070 -32168 75330 -41308 230666 -280614 138442 16287 -60456
8771 45439 -6656 157275 -36456 -120065 203407 -76604 -48766 102341 -83787 -103351 44944
8759 225851 -5917 -320223 230039 107720 356626 -16221 -404310 -258211 -9196 -9840 -149679
8748 -149679 313339 -82457 -299160 -75106 2338 -263862 331074 49147 -122879 63512 -283966
8736 -237317 -13313 85938 -295457 103859 177543 -149774 -84954 -403036 -379880 293954 -178231
8724 -219102 -185082 -214851 181722 -124911 -439987 -528685 77598 253836 -190807 -231453 -110286
8712 470909 -92448 -297116 -59504 -197753 34823 -13974 1444 -199635 -95938 -17414 213614
8700 -441393 -132279 78261 125020 156706 251534 28873 -157706 -203903 272303 108306 -231717
8688 -118207 -138411 -69705 -162200 -84239 -70750 -997 -293069 -93741 107649 8492 90069 -87522
8675 -323958 95314 62557 247666 258941 102726 90103 -111659 -42163 -140353 -93435 -60253
8664 -60253 -81480 297977 -121011 -59526 -218685 -11685 34835 -16367 -85264 -176045 -312531
8653 -312531 -457062 -71640 82081 74561 21237 -8753 56365 -230464 -147376 121251 178777
8642 178777 14037 -130100 -111735 -32969 -340803 222355 -85582 -109932 326570 -32690 -164503
8631 -164503 166718 107627 110544 -332254 189038 5099 416456 -198286 -120237 258415 -14305
8619 58163 34364 -55163 -279883 -159449 -94133 122619 -236314 64512 110747 -129634 -321990
8608 -321990 -20496 -97907 166175 -26955 -29123 -267860 -178455 73867 -164092 24752 357235
8597 357235 12426 -66847 -191753 -19104 64659 -241678 -243453 -17553 76056 343545 -28255
8585 -2294 -162774 -33720 -82955 137223 106558 78498 38417 -152337 -116363 272395 -101040
8573 255668 -215108 -338855 -105638 -197462 -230118 260428 -16181 -41782 -50439 4388 -215914
8561 334063 -64172 -71267 77166 222769 -74744 95755 -102440 211898 -334297 -190645 -215587
8550 -215587 -500428 -23423 -264173 -51363 -166294 -48823 -138036 -14032 -376673 -246049 207376
8538 -31674 -144970 -72745 -80042 90621 135429 187009 -114628 -594377 -154625 -92043 187961
8526 -37309 280598 -81141 55044 -202128 -49375 -38049 -101357 203992 -165784 127765 -231166
8514 -235603 -107888 42922 -227371 165176 -26974 -320986 -70362 53826 -134676 147091
8503 -107133 439846 -232675 290575 -43802 -508316 51952 -325407 -287320 114792 185068
8493 185068 -327656 -97609 132050 257782 -83138 -137727 -158995 -156897 34828 -321268 70778
8481 -113935 -222496 32234 238701 -88795 -123767 98071 -88529 118350 137697 -90420 221199
8469 -451094 -136041 -383013 98350 192585 -113604 116743 -281803 -281044 -97035 -499684 227256
8457 -171300 -59538 63339 -213694 -32182 -27957 -40109 64216 -71817 -118026 162199 -373486
8445 -326840 179946 -215762 -10314 -20126 69761 -185680 -98302 -31702 55578 29133 -93936
8433 126608 118544 -108701 -83827 -94912 -85873 -29432 232134 -272185 26677 169197 -112453
8421 -95351 109964 -244350 -65070 -8254 -347541 -74336 -1177 69296 -173689 -186944 -209237
8410 -209237 -153883 -18432 170216 28932 -103613 122081 -71914 -33730 98425 186254 -237367
8398 -9419 -505682 -498166 -1427 -65677 -299329 -29182 213094 54730 -47397 -132575 -27222 -118404
8386 -118404 -224501 -267703 -203589 -111913 115522 -280208 78613 70690 -183646 47219 -297498
8374 -198041 63917 -27423 261483 -167839 144529 146374 -2418 -241615 -363929 -343961 60107
8362 96149 -101370 -41682 -197207 -234935 -87356 -176903 -177661 -395417 -315302 -134338 25299
8350 -137774 -190001 11566 33471 -161247 -170434 59823 124 -141214 285438 -104409 264107
8338 -16364 -250481 197694 19282 -313390 197251 -143666 -153638 142273 75113 -330890 150482
8326 123537 70860 -396484 302378 -72460 -175714 20781 -84849 -316576 -156779 82913 -105291
8314 -312039 -230676 314414 -108184 -64957 73543 209036 -292989 -27987 -278854 -31747 -289169
8303 -289169 -494811 -151558 67248 -106641 -19580 -426561 213337 -182842 -253300 240721
8292 -619335 -259414 260859 86230 311112 65527 -64677 -130208 93383 -277712 -71226 155554
8280 -357850 -58626 289726 215615 -113735 -53810 269854 -208186 -238466 109044 -187183
8269 -147986 -132028 -31714 -97480 58992 -158045 108457 13991 294007 70212 -14988 105103
8257 -130190 -121625 -111297 -82921 -93776 73091 -81446 94773 -143669 -355941 -77524 -297124
8246 -297124 -331083 33356 117480 -285975 -26618 -75580 -98814 284571 -164556 -68520 355832
8234 -113864 -133448 -137769 -176730 29694 9437 -84938 -58725 -55376 -396968 103087 255940 -35795
8221 -179236 74380 120941 -244321 15893 -103137 -157682 131100 132122 -106756 55608 -327982
8209 -41868 -363830 -109030 -65303 -183072 18862 -158533 -130569 -81913 -216401 -155462 -242768
8198 -242768 -5671 -36197 -184780 -297465 -331541 -17878 -103496 -320362 -294349 -3450 126199
8186 207484 238256 -235318 -101421 18972 109178 -59280 -166475 -132809 -230288 -20561 92847
8174 -34726 -33411 -52122 143338 -211708 277487 -105692 -41207 -151605 -317267 34092 -362022
8162 14957 -141825 -140861 -183901 -44596 84920 89903 -222791 -320865 100173 -478982 295946
8150 -45372 93937 -93751 216212 -79512 -130908 -64797 -230140 -265205 146644 -225059 -229217
8139 -229217 -104786 -152889 24390 -92013 233328 -284163 -38707 20219 127835 185286 -461774
8127 -163850 -50632 100897 3593 266620 -226930 -183904 -62518 -488418 4164 -40897 -125944
8116 -125944 -160702 107967 -54318 13923 -80916 128706 15858 46107 32229 68417 132941
8105 132941 114914 -114857 43 -182791 -17503 90469 -53845 -123426 -172440 34014 -97869 -94852
8093 -94852 -282596 -160383 28557 15465 -258376 250264 -212667 283002 -114712 -182029
8083 -182029 -95065 333922 -13705 391678 43450 -339953 -141534 12443 -53872 -50968 40482
8071 121918 -293136 -410441 -188071 24969 228130 -55183 -140937 -102644 -50561 -213385 -60466
8059 62826 58069 -37493 -79438 254397 -99017 43281 -376822 -84589 230563 22646 77571
8048 77571 -88405 -105383 168909 -172199 -171752 51642 25952 -51624 -301932 152584 71071
8036 -320883 -194993 90377 116397 61017 200238 -167719 -101180 -20528 125114 -131021 -29569
8024 97408 -62546 53430 88913 -26416 -143783 23737 -109458 -1136 -232776 -1631 -38761 64312
8011 -81730 215992 -153658 362661 -191318 -208595 80112 -22786 -22378 -359631 72992 -155164
7999 -131298 255235 -31394 -75318 156501 -193278 47048 -85523 -68937 110761 168997 -294888
7987 100817 316903 79302 -245399 -124243 -44715 -377363 -52151 -318527 -31899 -18848 -382061
7976 -382061 35362 348503 -166872 -60551 355729 -78155 41384 -381250 -40556 -169207 -151812
7965 -151812 -90500 -32166 302359 53525 189533 -3583 -50643 5391 216584 84592 44252
7954 44252 176370 31606 18301 130433 -346519 -151543 -316469 -173596 -160641 -231410 -8535
7942 -185053 -229827 63381 -341747 218502 -171067 -309 135828 -135889 183213 50216 -88776
7930 -328985 336336 -3625 206775 -178555 28013 74196 17618 -19649 119571 -158542 -167938
7919 -167938 160006 263491 -104770 -2922 34744 -345570 -3039 -98223 11613 -67278 -169413
7908 -169413 -2719 464 -100308 285321 164847 -271088 212936 -152792 -66028 -68415 144501
7896 -173962 68825 -51950 56988 109929 -155613 -6806 -99221 -280527 -182481 -250206 -417384
7885 -417384 -86565 45018 173492 179130 1335 62950 102227 77610 278548 -241430 2395 -387943
7872 182721 -225999 -279149 -99575 -14151 -329291 -140269 188068 138293 -61428 -587274 46976
7860 -454013 -307727 61808 10422 -48515 -238053 -75194 -33350 -129217 -246926 -91293 -12481
7848 -15407 28566 99107 -28347 175996 102755 56536 310894 104194 -193745 -245466 -146226
7837 -146226 -59343 165760 -78545 -130438 40356 -457707 -118130 -345055 -212730 -287499 -6407
7825 -252293 24259 -170115 -151143 215349 -74771 50747 194090 -284415 64248 -130350 -141853
7814 -141853 -85976 196502 111836 -116656 169470 -140305 97039 176024 -73829 101879 -438045
7802 -30894 5229 -190890 97906 31937 -187940 138282 70989 15641 -120647 116694 31107
7790 68986 -94064 154569 -27321 -140418 -62134 113659 133546 -164087 -185794 -1254 -255899
7779 -255899 295727 -89784 239930 86777 352160 118667 -121221 -3377 -124548 -269192
7769 -269192 -246819 -179055 -116206 -138540 -199499 -221198 -449032 199314 -139026 147638 152839
7758 152839 187028 98969 -247053 13030 145877 -111641 -114369 -210878 91108 -106035 -86794
7747 -86794 72792 -167438 -58167 17475 -92815 238994 72651 144625 -205898 -117196 32015
7735 -318944 -105965 -413119 -322350 -116998 -512930 -39220 -78881 -26794 -104980 -19799 -275260
7724 -275260 201408 -170575 200396 -179334 44599 -53490 -44168 -91629 -32894 28043 -64296
7712 -256581 169381 273726 -14204 -395088 182511 275926 58298 -196818 -66606 -95463 -151010
7701 -151010 -226983 -14942 -55750 302374 -27078 51324 30520 -315999 53466 -70187 88107
7689 366238 102014 304369 -359452 -142638 -26814 -32101 -34282 227856 100000 84162 -165113
7677 -280268 -237894 -246498 -108454 57689 -174767 3610 -81911 -54220 -174668 -79372 -85181 78019
7664 -87419 -94227 -327241 118689 282859 -28130 165531 224660 -387641 265927 -91251 -185885
7653 -185885 -115628 -379919 283293 98335 -103242 58939 128884 55840 -208575 80897 92700
7642 92700 -32455 -275639 258182 304218 -103156 -36728 -18740 -436583 -239842 -522060 -107805
7630 29613 -89929 168748 172253 223528 91203 -88012 152734 -40734 -84291 313613 -191843
7618 -248626 24166 -199733 -176679 -81021 26998 -118749 14235 128804 62230 -242183 -294023
7607 -294023 -30267 -110587 90801 -343969 -264641 -19297 60212 -9913 -496649 -6291 -256297
7596 -256297 -153988 -88252 -304604 -30080 90884 -63864 -124666 -70112 -306054 230886 -99835
7584 345360 -44878 -257029 -165503 -262814 -80642 -53191 -282322 590 -182739 45268 22887
7573 22887 18748 -16195 -49525 92555 -155247 34520 -182762 -121497 107092 233421 -121783
7561 -19709 -400356 -146101 -36787 87082 31449 -127124 -205078 -359204 96833 167619 -80827
7549 145701 -105755 102364 -440767 -213898 -29849 173179 -271448 -70377 254571 -15651
7538 -28458 -104773 -159223 -169146 110399 181449 -10462 -42242 -92414 -276768 -226599 42037 103524
7526 103524 132835 159666 -70891 -73584 102019 36358 104904 -80755 -137226 -190846 -289563 -144550
7513 10340 143939 156400 137533 -444967 72156 152028 -130543 149975 -50054 60815 -93333
7501 82722 233305 123844 181671 87425 114237 76704 49054 -125090 -211195 -164290 105135
7489 39220 216600 232071 -220219 -111539 178386 -120845 395772 -74729 -201715 -143758
7479 -143758 -33754 -67567 16918 -85763 -129354 -38935 -162816 -137002 47232 229753 261045
7468 261045 377517 248548 56671 -75235 170568 -34796 -129613 -23290 -116646 -323627 118163
7456 -164914 21588 168526 -109466 -286208 53163 190870 70197 -200263 -204212 -104620 -218845
7445 -218845 201607 -9912 -99996 11672 -47373 204719 -15276 131406 -244512 85096 14316
7433 -98365 -114129 -190018 -203494 -17152 -185798 103557 -165322 -84968 -276249 -154665 374518
7421 -23597 180760 -339124 -27179 -180119 57415 -8078 -221253 -297015 -251083 -160632 -271129
7410 -271129 -58172 86888 -134065 381865 -170831 -41538 -63800 346207 -70173 -151331 -272583
7399 -272583 -84697 -104644 -458354 -77101 159995 -262044 -114318 -120620 -148807 -328711 47909
7387 -53480 -319867 312063 -233502 -341584 -240362 -178549 11099 -89594 266220 -334850
7376 227237 27838 244763 -69019 -65016 -1528 23826 137977 536 104411 175368 76955 -181270
7363 83217 -153921 -378437 51600 371669 -53605 -48747 122012 23237 -115406 -366838 -237839
7352 -237839 -58926 -63736 285341 -56900 95700 -329414 130611 248093 -90637 82811 62704
7341 62704 27355 19290 -87716 -20120 98001 132325 -9138 127873 -36775 -397095 37959 -7263
7328 225874 183072 46580 -182456 -15159 269664 -32501 -14003 -93917 -18560 242450 -183916
7316 67355 -203332 78354 75667 -108878 -147720 215854 37773 -343551 -303741 118348 -104009
7304 -77834 -78553 -181875 63799 20299 -105606 -99454 -138595 13991 14957 -289777 -11858 -115749
7292 -115749 133647 -121817 80943 -201782 42627 51976 -167652 -55404 102922 178624 35701
7280 61721 329339 -185689 213506 -7267 155959 -159927 -216901 60789 78470 274197 -150157
7268 79934 77787 -133070 -35415 -5077 -343095 73199 -203560 337487 -178389 132922 69615
7257 69615 -315403 -18403 -53719 114892 -25360 -126315 200484 -311204 -57153 103198 -10873
7245 -161044 193630 -269820 171399 -89794 159003 -251711 43995 -334464 -224200 6378
7234 -112905 33986 191462 25150 10908 -209465 -152881 -381724 -66543 -57270 13231 -366958
7222 -254709 124636 242696 -234436 -54996 -174213 328138 142127 -8836 33626 -172623
7211 -257450 -39961 -131366 -55843 105930 177286 -115649 110667 47577 -278074 14881 46552
7200 46552 19026 106282 278118 -183838 117121 -93663 -152809 -85959 111687 -208148 -46787
7188 -86368 -46397 145456 93565 57453 -303802 162840 -198143 26830 -206669 313970 6175
7176 -57958 66371 -26915 -501426 5317 -139712 -97382 49497 350512 -23232 -130775 -216933
7165 -216933 51111 -21324 238198 -138001 134691 -199396 -228089 -12530 -151789 -77528 -196184
7154 -196184 236771 9926 149322 -178957 -197853 -229472 -316833 29089 -69649 16990 -395149
7142 27609 -100152 -278526 105079 -164784 -152779 149313 -566796 -186846 166688 -80702
7131 -193221 5011 -63315 224292 235668 112825 -34722 157183 -99161 -6199 -94057 72050
7119 11083 133294 96808 -162190 72747 19918 -327969 -14324 208518 -1372 246981 107433
7107 -61039 152575 341724 12774 -42903 -52672 -272001 323194 -389076 -107758 -201961 77191
7095 37508 -82510 95225 -112969 -23675 -38851 107395 -315747 38886 88537 -38314 -169520
7084 -169520 -18053 76309 -105628 -83584 -133553 215406 251895 -103071 177395 63872 73113
7073 73113 17368 185099 -297873 233023 -62521 -275659 181507 -116796 -11084 -93109 -188743
7062 -188743 33232 -52522 -236863 -44561 -47255 -129394 -196485 71658 165222 30408 -69366 -173802
7050 -173802 -280569 -111727 321014 -136789 -140713 -139559 -204879 -348982 266952 165492 101286
7039 101286 -207953 101849 188053 227932 -128333 -74665 78493 -20647 -268768 95450 117823
7028 117823 336810 -36006 -105571 -107096 194045 2411 112102 -118422 15816 -54044 -120817
7017 -120817 -284978 273846 -4073 -43350 17161 138192 -40712 34024 -138408 205489 82389
7005 213516 90807 -142106 -55163 -87766 49860 201155 98010 -42718 -16662 175426 -160974
6993 -133670 237843 36949 -60268 -185775 98442 -169445 -300267 47490 -461161 120707
6982 113866 -280947 -87664 -164535 179649 -77577 -79216 369254 -177788 -17035 -106523 -241770
6971 -241770 -241831 -160112 78526 -26503 246530 -82523 -194213 -91672 -52089 -59050 251693 -161294
6958 -126938 -102748 -91792 -204044 -117742 104558 -68402 -282925 -393667 36050 -59042 -132687
6947 -132687 -4548 -174691 -55110 -267558 17164 61086 -297541 -260126 -76114 -31305 64058
6935 111687 80253 62370 156400 168687 -148745 -58106 -232782 -41335 274894 -103591 -172373
6924 -172373 105336 -274922 -240970 91763 -113854 -2592 117816 90184 168071 39749 45698
6913 45698 -501530 -163064 -8887 145165 -72621 -12860 65637 -119892 33381 255827 22119
6901 -32400 -135330 182278 70285 42766 9517 -73369 367499 -202386 -67865 -294523 432423
6889 165901 -103666 378983 105869 -97207 316492 48534 -392239 -209575 49402 455070
6879 455070 -215962 -72337 159591 81963 142621 144938 82175 123061 189821 213511 37176
6867 217576 -160854 -116609 -101899 24814 54216 74361 133060 -41657 128399 87171 244297
6856 244297 174425 -354819 258287 195924 -177990 78938 75248 -29552 -162625 -138378 -86217
6845 -86217 108238 221459 -84192 -48869 -45792 -276493 -6980 -167887 -286838 -33162 11466
6833 66722 -170751 -200107 -80399 45692 -281461 -244594 -19249 -153686 115518 24932 -42481
6821 -20465 9725 201467 -147597 83243 24146 -10981 -147968 -253438 81683 49228 -11030
6809 8028 -29349 -269173 149199 -6332 -33108 154624 -197392 -65922 -205871 -223132 326675
6797 65755 -13546 -164458 -116507 -86453 -159459 -165887 89037 214480 -282354 -78761 116674
6785 83936 -8562 -17259 -144806 -171067 -37157 -53607 -204947 19723 -28804 -16270 175042 177167
6773 177167 7289 -228360 -29454 -156475 307899 -148247 -127034 -237686 -32001 -224289 20161
6761 147943 169614 -133542 -244831 80297 71898 298090 -102273 185625 9702 50734 326281
6750 326281 142249 -18209 -178652 -82061 48450 34915 240242 -197760 -159027 -90189 -59908
6739 -59908 -36557 -16786 -205272 56326 -58104 43482 40594 -70280 -35338 -209101 110563
6727 211902 153352 255183 -395142 141593 -159338 226691 150960 10887 72896 116191 -168034
6715 -293732 127559 -338534 53458 100280 19493 -159368 -343992 79346 -264647 -162872
6705 -162872 60941 -99427 -52520 10205 245129 -191220 24481 369614 262499 -133659 20783
6693 -156925 -78804 -68382 -74331 88542 3282 -258244 -29294 15055 272351 -253281 -268646
6682 -268646 105124 63066 -87416 -20572 64271 98601 -6587 -219093 183796 66650 -243547
6670 159621 -155348 -90489 -12340 -39765 435762 -60160 188974 -45404 64777 -81704 -175900
6659 -175900 -155051 266742 74723 -117540 4116 1935 20202 -27582 225116 -287781 -38355
6647 -145399 81582 89780 299178 23092 -114044 164786 111666 -80032 -60079 -200524 -91906
6635 -79171 828 -48599 236381 258391 -44693 -165704 136839 -288001 281415 147486 176946
6624 176946 -16620 -12035 -293483 243810 161052 334694 93894 -220233 169204 11700 -128667
6612 12786 97070 25642 147075 62471 337788 66345 106976 -316753 -132520 58942 -59387
6600 -24455 -12773 -159396 132224 55598 21678 38176 -79435 -162739 -208703 10620 73749
6589 73749 -37165 -6167 142428 1557 -108914 90957 28926 37091 251220 -297082 -35652 -117504
6577 -117504 166441 -315387 -92575 -199209 -318242 -173202 -241390 -160481 109619 -17821
6566 -64916 -419665 -229944 -173441 -203255 -118085 -60854 -215842 -199252 -260992 61562 230281
6555 230281 -158180 -192999 71372 231805 -27578 174686 -54509 8671 105600 -55625 -70129
6544 -70129 -167853 -282855 18484 -226728 -52522 112074 -180943 363735 2455 -118221 -221398
6533 -221398 144774 335125 -275683 -6383 -66787 118036 -15487 42568 20863 -26925 -168741
6522 -168741 13691 270666 174981 -68429 200499 268280 -21722 -259328 -37309 -295096 150118
6510 -107780 -224352 -26413 -230658 -283690 264380 -152320 365388 74384 -30428 124303
6499 -122234 243618 86067 63228 -140711 -28058 169114 -34265 113190 120811 276298 119260
6487 -301176 -304321 103049 266739 30136 71958 -325468 379948 -322570 -19888 3875 -44927
6475 91159 96385 -37239 332339 114726 51802 -134336 74059 310718 47482 -82532 299561
6463 -26247 -155633 237104 124507 -113717 113850 -209092 -48518 -123196 87137 69574 -72314
6451 422967 312700 -256767 -250844 16797 85462 164563 77409 -247557 221944 -50933 -254743
6440 -254743 -78961 104028 34580 284044 -142107 -256809 -33815 76271 150037 215799 251031
6429 251031 6681 -413898 -182957 221846 46603 283850 -308945 90576 -87205 -256257 -117826
6417 1340 -366445 -245658 -94884 -227669 -136736 35342 -242894 -125595 -450070 96625 110444
6406 110444 -276911 33869 65878 43636 135618 -290459 -44391 -149656 -69937 -240476 192464
6394 -21410 -108902 234207 100510 -387778 186964 -137686 138089 -53601 131001 -47281
6383 -119994 -257682 -205144 -178821 120333 -311687 152220 -160457 -71460 -47600 -47348 -275097
6372 -275097 -240160 -82763 139521 321557 101714 132653 -131605 304873 379656 68867 -192363
6360 -88975 -135217 -216606 -110905 154433 -48298 117651 -139986 -187026 -135701 59122 117887
6349 117887 66289 -33859 140284 -305176 -59701 58260 90679 -216142 28880 -105935 -170421
6338 -170421 135891 -25693 -72326 187081 -331641 67026 69 372624 19519 -165835 -42648
6326 -96748 200342 96299 -80778 107874 -354168 -24087 187986 -362954 -175620 186718
6315 203878 -104566 72523 -26570 14544 119807 257883 -105382 -306549 210201 139997
6305 139997 256764 -273494 -48428 -342044 244612 214123 -65705 203738 155401 101380 -194751
6293 -48884 -94312 -226315 98238 -175338 141062 -50234 124222 -8476 124757 -90109 190520
6281 -321186 55981 78056 -18051 132412 -139225 -167310 34341 86571 -134437 -3891 153524
6269 -42770 -11168 63209 172503 -499971 -262562 399448 -39156 157448 100855 -208301 313721
6257 320295 154967 -312746 -176018 86409 157835 -41449 202642 -126994 -36966 12029 222875
6246 222875 -218083 89154 198030 -184135 397175 -122955 103078 285429 -71791 -242186
6236 -242186 274544 43118 -27079 4604 415240 37890 -1796 11332 -214998 102814 180208
6225 180208 48157 247989 127939 140714 -343589 -179336 276535 131687 284373 91777
6214 159250 121314 98232 210765 -45056 -261173 -28108 -160890 -107446 -248152 107747 -293889
6202 -382722 -149085 -57786 -56694 188402 -97168 -239518 -246031 -97906 44291 222114 290113
6191 290113 179593 -123382 7173 365938 34687 51580 160351 157001 -132897 172861 -4110
6179 522092 -98123 107925 127128 -257157 -66361 -99704 -271748 8718 9869 -323533 366457
6167 12808 -220762 191954 -213019 -116240 196542 94847 -288910 -198081 -47577 -89074 5320
6155 171282 149638 2338 80861 -189058 171597 48654 -95009 -236247 -127735 131922 166079
6144 166079 -329716 35593 -62831 182255 -51894 162774 -98321 -184438 72025 -112567 -202323
6133 -202323 -353722 -203189 113634 -111467 -228193 365586 64599 238181 41397 289540
6123 289540 -258698 -164595 -147620 -188681 14326 136851 37252 264564 -138379 -75536 7401
6111 74142 31055 105384 -81055 111877 146875 -93103 -53888 -269134 -50886 62130 29121
6099 24180 -56078 208164 -439330 -308626 538672 139498 -235207 155251 233778 -13363
6088 -185174 -285674 -76281 80487 67741 153949 -27462 248570 139818 253642 -147423 -218713
6077 -218713 163487 -207298 -10451 157129 230325 -135994 4964 65199 92332 -298470 -140368
6065 -185286 255606 163251 104337 50259 30820 -58297 51181 -116540 84350 -143630 124093
6053 53243 -133843 -60277 190463 106004 15784 -104460 -329632 -368031 37412 -261906 -228468
6042 -228468 -154993 359974 51855 169427 62744 -329897 -124172 32024 278636 120305
6031 102188 171444 165441 -55472 223379 -99151 30116 -252253 -87599 117520 -195529 191616
6019 1435 364965 153793 -162276 4976 -66444 -314092 110300 -205830 150933 -226422 -142483
6008 -142483 -211753 -263587 -340981 -81336 123715 -20966 31083 40931 -94742 100326 22925
5996 318872 -7599 28393 -105073 207477 -265022 69245 -263021 63770 -152054 128324 -49164
5984 -293019 200931 -37841 145818 -141321 301286 -125015 157708 -301149 -341360 -137294
5973 -213936 67322 171282 99642 -5460 194413 -53754 -311628 239009 32457 -386015 39438
5961 -272011 -138786 -307133 343163 63581 154539 113535 107357 225033 49868 -234573 -22715
5949 313203 326734 24190 493900 -288036 156169 4292 -182080 57004 -359695 60166 108081
5938 108081 -116526 91398 12277 76147 40355 393928 -37013 258686 -430631 -237614 -64857
5926 91261 -457863 -210274 38236 23470 -126310 -220788 198518 -118876 -29042 -249917 -254760
5915 -254760 -35355 158650 396761 -263420 -196586 -179777 58874 -163745 6819 -85542 -173980
5904 -173980 -181954 79669 121826 -564824 144944 308416 -18053 -146717 30550 74887 167976
5893 167976 -129137 -97819 73180 -94158 -130186 -80877 -215164 108369 115000 -224726 -63843
5881 -220193 75770 76477 -121861 81303 -48094 199621 113819 112410 182938 -43227 -253671 254325
5868 -200274 -80392 -8184 -253590 -54883 -308669 6261 -81332 45756 47815 -143052 208510
5856 424846 -294219 -43797 -61383 -114793 -160026 16348 48582 -8095 193330 -244382 62395
5844 -212865 -66068 -87424 169885 -99065 51583 33125 -136678 -86664 -178392 6123 -180402
5832 -82018 -175304 174406 169642 -103530 -38487 40184 41034 -235029 138001 370823 273047
5821 273047 160236 128649 -41538 59530 141935 -444536 134779 139556 119438 70922 194130
5810 194130 9896 -157711 50684 -72433 -297501 -33111 -182104 -101191 -95252 -148393 291689
5798 -117422 313475 -279035 177595 -94390 173605 -623962 -74787 -40778 84443 -186338
5787 -76864 -214445 -67198 36295 127943 -291267 78137 236238 382972 -194005 96816 263808
5776 263808 -115226 236952 -140059 -208446 232260 174133 324796 -271062 212232 -316112
5765 480 -182879 125647 -220111 -83156 35714 -70568 -121893 -157292 42738 -60833 -217931
5754 -217931 -44542 51468 67098 -26567 87999 60818 -196606 -59368 83132 -179811 -122177
5743 -122177 -133244 39013 285229 106421 -286175 -67826 -384236 -60366 8664 212121 179329
5732 179329 129962 142732 71720 221978 244819 -113489 -3208 367375 217600 161891 126256
5721 126256 64745 -182391 -146760 35038 76432 -140925 101450 -50364 158966 30830 -107317
5709 166909 -6603 -222373 -4770 -29199 132967 383089 83626 107510 979 -383104 -142027
5697 -117159 443619 43213 -286981 183306 167116 -177364 55693 130847 -161705 216019
5686 -85297 329674 285580 234046 365248 9831 -24173 -161134 -138939 448556 -178421 -54109
5674 156684 -235882 -87554 -14738 -70978 116573 -264212 -77126 -39726 -37857 174497 268939
5663 268939 219912 -71770 -296437 -236571 -293703 -310045 130330 40918 199905 50106 206487
5652 206487 -102906 -93369 35639 -187733 -284913 -87465 -112288 54502 222102 -16888 -258373
5641 -258373 209706 22717 307614 125794 135082 47599 -131665 -131514 -285420 -135207 258472
5629 -276186 -69644 -131822 63508 -103219 179527 28960 -131661 19282 60379 -66768 266485
5617 148723 -5348 -176342 204989 -99360 89615 -241123 -132728 -13278 26841 -89035 -217845
5606 -217845 -115588 240276 199841 -2518 -207186 1579 -51824 23959 -175854 -316679 -140463
5594 229003 123703 90360 202943 74171 -215640 -108690 -187682 59729 -45773 -106084 99466
5582 -61963 -76210 -145716 -164769 -41223 -41585 -107953 -91012 -12686 -47390 39737 280239 -55505
5569 10344 -79370 -46397 -249523 188280 -297156 230839 72147 -141929 -313530 -109387
5558 43489 -70979 176395 140477 -19308 62923 -62759 -4822 276089 -145745 64033 -69148
5546 -49762 3918 12208 84776 -115872 -195764 -239909 61148 131863 -436923 -74011 15151 166008
5534 166008 -91825 -5007 138720 -3794 -319731 94890 222581 181310 27318 280010 135611
5522 138899 347575 200842 77328 -153504 48742 165008 340063 -38066 153635 -131649
5511 1923 135527 23012 157660 92641 88009 155161 412985 -436930 -78569 10050 57157
5500 57157 11001 -246190 62912 -82496 -2912 159106 -397861 150014 -334840 409188 -10533
5488 142201 -199477 120593 -183558 138861 -293458 320 690757 -297605 79676 -25974 -85677
5477 -85677 370941 -154656 15560 -57213 -100118 -47658 104210 2999 345774 -225367 90399
5465 -18236 43224 -45657 14493 51220 71966 6560 131636 340842 -17521 -24740 -48596 -153360
5453 -153360 -306839 -369402 199940 16838 -168664 -86270 40691 -155174 249176 127859
5443 127859 -229972 134955 60025 297165 -410343 83724 -67769 -16693 194442 167559 5871
5431 -337882 -46835 197550 -6288 263449 11470 -60195 52004 -333719 -225863 84950 355631
5420 355631 6948 256545 -36264 -457481 214052 -116872 320482 141906 221747 -165540
5409 -151150 -103710 -33852 134867 -310916 -184431 -86901 75194 -133643 112998 335197
5399 335197 -31256 -110931 -7328 -114209 61257 202280 -139780 65865 -128689 -68206 50086
5387 -141484 -106540 -52106 99410 -52767 83923 -202988 -59914 -142861 247001 -239979 205949
5375 -175985 -191821 -188633 -118788 271289 -162399 -53758 39806 -216305 44456 292040 -35624
5363 289998 -325021 -159643 -35560 -234774 42055 104670 -72030 19618 -258898 106228 -32214
5351 -160660 -59827 260641 4113 -42813 1272 93525 -62056 119701 20272 -228930 -2675 -101017
5339 -101017 -172856 -196191 56558 181187 -35536 42625 110857 -187933 86002 -180715 -128955
5328 -128955 188974 -255044 105724 17332 235161 -104847 111375 -81933 -12064 338597
5317 -250697 -31257 -200212 96493 -43124 43639 -191736 66514 -4315 42820 383256 -152806
5305 245311 2969 150498 71449 49258 -40588 223853 -294118 -65600 73606 234744 -444482
5293 23088 -191257 194629 185578 209506 -19376 102225 410656 45476 -48393 -7486 159011
5281 154277 -194640 109683 130831 35942 -74300 -132836 -157669 -234934 -21023 44780 161919
5270 161919 -152528 36941 -87101 324837 -93767 -53246 192251 -161631 -67475 -342226 202574
5258 -262516 307786 -38018 133059 94573 294768 -136985 135244 -45933 -27457 139989
5247 -485468 -328035 316750 -42414 -73639 135951 295203 315553 75657 -164956 40979 -7690
5235 -126607 102283 451406 240687 63155 -90154 120977 112853 -247782 270698 -333091
5224 -39857 33149 302717 132847 -59048 -353943 37186 63589 -34171 -353991 296310 -20309
5212 18805 285649 -211690 -22858 53831 -77113 -178386 -184055 -303132 -26039 -36462 167522
5200 287569 -206314 -49831 45099 -172997 -54693 -314554 80258 -12745 83314 -171937 107418
5188 -93624 246130 55604 -101264 -33926 52459 -48098 -67807 -34998 143179 -118318 230585
5176 6595 321624 -82411 195186 -209133 87591 -68804 84662 -135422 -197465 91001 129721
5165 129721 291922 299924 194741 241405 42010 -262173 69827 -234965 -36074 216095 -268614
5153 -85023 36445 181422 -297035 261625 33800 -220661 -107322 -82364 -56418 26090 349597
5142 349597 -51241 -167779 -42384 -264836 -103758 -47430 43301 -214064 271388 -22033 231659
5130 -360664 -151507 173008 214600 -213396 -235503 123096 54778 -275515 -51117 357947
5119 287553 -131446 -161127 91286 237315 -114441 -167082 28452 -179522 56783 -106782 36014
5107 302692 272032 268406 -137766 -261226 97488 208622 379438 63677 -118766 90096 371079
5096 371079 -261565 -265050 134520 174869 -135738 -234329 200194 267678 55168 145597 -425418
5084 149599 -203872 77564 48921 -71968 -64294 -191149 -172622 37140 148825 328286 472937
5073 472937 -47785 28801 1534 73442 -67839 44942 88852 35421 -257891 -18868 -292940
5062 -292940 582644 243905 -310896 281719 52431 -55062 -153190 266118 -49189 -184622
5052 -184622 310539 194092 234879 101657 24848 -167465 49908 29687 47502 -15472 -9647
5041 -9647 -277522 136139 156852 -99986 106717 162161 -64996 182628 -193507 245363 -210092
5029 -49172 -87882 -335666 199458 7630 -111251 -218393 84153 48448 -143699 -91637 -15413
5017 -94615 -134574 56199 133300 50486 -88881 -173221 -98701 114568 -110792 153074 160735
5006 160735 393477 -60610 -188539 -30370 114392 -16478 -185764 -46885 349170 199353
4996 199353 216952 142578 -112029 -45779 389508 16695 -103563 -116889 57828 -122324 -1019
4984 55896 102788 92321 197516 115064 249677 268175 -104853 -153363 77590 -53918 196860
4972 52994 215604 56103 -11759 -58570 -57647 94496 -179921 134801 -218484 4298 -2803 152738
4959 95037 -65847 41254 80479 53753 -392147 -304928 -49707 38125 40355 -64624 60489 90033
4947 90033 29678 -102969 263832 292125 -318414 -164093 -32298 -282399 -44066 288362 172469
4936 172469 -45034 -30341 78516 -113832 -20696 -36349 -243557 -130100 -36055 120912 -37095
4924 30796 49400 175263 69212 203985 -46191 -69261 -61750 320179 50359 292010 -32913
4912 -49635 -56146 961 55625 -142624 -140453 67539 298262 -229724 -61810 -5920 -65162 -21040
4899 -5602 394691 91906 -110364 -37328 81813 -32650 -58436 97203 -146235 -125310 388871
4887 -53592 139853 311682 -291225 -63503 -120587 -197840 104671 -194332 133756 -29430 388212
4875 -76507 218186 105444 -216325 42736 469736 -18031 -26802 -394041 29662 -21185 -339850
4864 -339850 113993 -251741 95547 31955 -17398 -33865 127373 118538 -70105 304468 -199977
4852 -120168 31094 -170733 -339825 -164090 415401 -30410 195306 98751 -158186 -34043
4841 244960 -50974 -223058 67315 100629 -47134 146957 113218 -72705 111955 116498 -75741
4829 19464 52329 -113475 -237155 -90540 174579 -299495 -48254 -177551 103490 202011 230823
4818 230823 -22985 2019 -96325 -288740 -22379 -96689 77004 105740 208349 147650 -216215
4806 -250232 99327 -144858 234932 -159067 109525 -161681 -70945 -110599 -34506 -133325 81720
4794 18682 46378 134784 187090 -168084 -315401 -163145 103383 -202553 28441 -155800 369445
4782 140685 -55189 -51956 204409 81050 -288003 137248 -220579 398936 -72136 127492 78448
4771 78448 -161866 54048 9121 -102825 -7351 143722 151253 161707 57345 58130 -78709 112359
4758 -336009 121674 59283 -5656 -7363 -345587 -78399 -217873 -23290 249435 132695 -253277
4746 32673 -25410 71105 -246062 42011 60333 173129 246348 319389 6517 -58047 -129226 -56628
4733 57765 -146824 72214 -165395 -45969 34625 418435 91839 214695 -54403 187383 -245450
4721 -23660 269283 182846 -76736 -177720 87394 -57080 79906 400039 -213469 -203011 -195734
4710 -195734 56306 66251 297974 91908 -74086 40615 -73438 39947 -33143 -409389 320229
4698 298532 -89794 139499 309112 24371 244627 -340342 71881 37477 -190995 -187038 -72408
4686 -310527 -40238 -108043 -110499 186150 -121417 204195 -14490 -141657 -26849 60305 -293239
4674 -464461 -158810 285500 -156642 -34530 -266537 25624 21435 64391 -2013 -221476 55413
4662 -311104 371003 5715 216860 -111494 56146 -249781 350683 -155881 -115092 199884
4651 -81013 41433 224132 103998 73039 273442 91882 85572 107508 286178 109969 159296
4640 159296 208053 -218813 45524 -343918 162581 -309929 -169810 -216049 381021 93837
4629 51687 99772 -49231 -2050 -256038 155687 -164960 159739 29826 -14880 -194998 -42322
4617 -133798 -333880 -158771 212941 138120 132733 199627 -104558 148630 100100 140221 -24083
4605 1394 323886 270164 -48496 -149333 200819 238895 -60261 -310466 -330755 78591 263653
4594 263653 212183 -69948 -320394 -64334 -174767 11445 -56109 -112861 42109 201720 65812
4582 -110371 -34032 -29905 -121317 97757 64746 213162 379182 14653 -5631 49475 76031 -69105
4569 128445 -179425 -137090 108851 -74567 -44043 -83660 -175909 -118172 -235775 -6046 206052
4557 214183 181994 85260 -291233 -56517 36830 -253745 13345 429135 -36884 469579 9830
4545 -91350 264112 -92417 -17028 46895 107866 -91974 139185 -86393 -176883 -388976 171645
4533 -159063 104612 -3369 -52342 -358567 211996 335134 -67413 12370 -180649 -252325 -204298
4522 -204298 193257 -120074 -377631 289587 332866 -285934 -129678 114073 -163790 136637
$$ [...]
##END NTUPLES=NMR SPECTRUM
##END=
