##TITLE=AC1532_ROEFFECT0008_8214568_NnRS8ca380
##JCAMPDX= 6.0         $$ Bruker NMR JCAMP-DX V2.0
##DATA TYPE= NMR SPECTRUM
##DATA CLASS= NTUPLES
##ORIGIN= BRUKER
##OWNER= Administrator
$$ 1.72 TOPSPIN		Version 2.1
$$ 2013-10-11 15:38:26.642 -0700  Administrator@X
$$ Compression mode = diff/dup
##.OBSERVE FREQUENCY= 400.02188249412
##.OBSERVE NUCLEUS= ^1H
##.ACQUISITION MODE= SIMULTANEOUS (DQD)
##.ACQUISITION SCHEME= undefined
##.AVERAGES= 8
##.DIGITISER RES= 22
##SPECTROMETER/DATA SYSTEM= spect
##.PULSE SEQUENCE= zg30
##.SOLVENT NAME= COFFEE_meoh
##.SHIFT REFERENCE= INTERNAL, COFFEE_meoh, 1, 14.98509
##AUDIT TRAIL= $$ (NUMBER, WHEN, WHO, WHERE, PROCESS, VERSION, WHAT)
$$ ##TITLE= Audit trail, TOPSPIN		Version 2.1
$$ ##JCAMPDX= 5.01
$$ ##ORIGIN= Bruker BioSpin GmbH
$$ ##OWNER= Administrator
$$ $$ E:\/data/COFFEE/nmr/AC1532_ROEFFECT0008_8214568_NnRS8ca380/20/pdata/1/auditp.txt
$$ ##AUDIT TRAIL=  $$ (NUMBER, WHEN, WHO, WHERE, PROCESS, VERSION, WHAT)
(   1,<2013-10-11 15:38:20.144 -0700>,<Administrator>,<X>,<go>,<TOPSPIN 2.1>,
      <created by zg
	started at 2013-10-11 15:37:13.387 -0700,
	POWCHK enabled, PULCHK disabled,
       configuration hash MD5:
       C8 4E 4E 5D D3 5C D8 9E 9F 52 82 E0 59 8A DE 15
       data hash MD5: 64K
       9D D5 FE 0F 44 9C 34 3A 0C 45 2C BA 4A 6A 73 2F>)
(   2,<2013-10-11 15:38:23.249 -0700>,<Administrator>,<X>,<proc1d>,<TOPSPIN 2.1>,
      <Start of raw data processing
       efp LB = 0 FT_mod = 6 PKNL = 1 PHC0 = 0 PHC1 = 0 SI = 32K 
       data hash MD5: 32K
       A7 54 E2 83 CF 43 BA 53 34 F9 58 6A 44 EB 9C 07>)
(   3,<2013-10-11 15:38:23.500 -0700>,<Administrator>,<X>,<proc1d>,<TOPSPIN 2.1>,
      <pk PHC0 = 95.63049 PHC1 = 0 
       data hash MD5: 32K
       A6 CB 8E 98 4D B5 79 C6 52 B8 0E 55 59 FD 52 F0>)
(   4,<2013-10-11 15:38:23.583 -0700>,<Administrator>,<X>,<proc1d>,<TOPSPIN 2.1>,
      <abs ABSG = 1 
       data hash MD5: 32K
       8B D6 93 B7 B7 51 C6 2D 79 93 BD 7E B7 D2 80 33>)
(   5,<2013-10-11 15:38:23.625 -0700>,<Administrator>,<X>,<proc1d>,<TOPSPIN 2.1>,
      <abs ABSG = 2 
       data hash MD5: 32K
       8E 81 31 8B B8 ED 18 65 55 5C 7C 29 73 DD A3 81>)
(   6,<2013-10-11 15:38:23.695 -0700>,<Administrator>,<X>,<proc1d>,<TOPSPIN 2.1>,
      <abs ABSG = 3 
       data hash MD5: 32K
       7C 87 36 7A BD A7 52 C3 89 30 61 20 F7 80 91 E8>)
(   7,<2013-10-11 15:38:23.736 -0700>,<Administrator>,<X>,<proc1d>,<TOPSPIN 2.1>,
      <abs ABSG = 4 
       data hash MD5: 32K
       9E F3 62 38 CF 1F BA BF 8C E7 EE 7A DF BD E7 34>)
(   8,<2013-10-11 15:38:23.792 -0700>,<Administrator>,<X>,<proc1d>,<TOPSPIN 2.1>,
      <abs ABSG = 5 
       data hash MD5: 32K
       91 2C 9E EA 1B 27 ED 80 84 5B 63 F8 4C 20 95 BD>)
$$ ##END=
$$ 
$$ $$ hash MD5
$$ $$ 6C 8F AB 43 F6 47 8A 00 03 4D F7 A6 9E 9F 5C 27
##$RELAX= 
##$RELAX= 
##$RELAX= 
##$RELAX= 
##$RELAX= 
##$RELAX= 
##$RELAX= 
$$ Bruker specific parameters
$$ --------------------------
##$DU= <E:\>
##$EXPNO= 20
$$ [...]
##$TP= (0..7)
150 150 150 150 150 150 150 150
##$TP07= 0
##$TPNAME0= <>
##$TPNAME1= <>
##$TPNAME2= <>
##$TPNAME3= <>
##$TPNAME4= <>
##$TPNAME5= <>
##$TPNAME6= <>
##$TPNAME7= <>
##$TPOAL= (0..7)
0.5 0.5 0.5 0.5 0.5 0.5 0.5 0.5
##$TPOFFS= (0..7)
0 0 0 0 0 0 0 0
##$TUNHIN= 0
##$TUNHOUT= 0
##$TUNXOUT= 0
##$USERA1= <user>
##$USERA2= <user>
##$USERA3= <user>
##$USERA4= <user>
##$USERA5= <user>
##$V9= 5
##$VALIST= <valist>
##$VCLIST= <CCCCCCCCCCCCCCC>
##$VD= 0
##$VDLIST= <DDDDDDDDDDDDDDD>
##$VPLIST= <PPPPPPPPPPPPPPP>
##$VTLIST= <TTTTTTTTTTTTTTT>
##$WBST= 1024
##$WBSW= 4
##$XGAIN= (0..3)
0 0 0 0
##$XL= 0
##$YL= 0
##$YMAX_a= 614939
##$YMIN_a= -523866
##$ZGOPTNS= <>
##$ZL1= 120
##$ZL2= 120
##$ZL3= 120
##$ZL4= 120
##$ABSF1= 14.98509
##$ABSF2= -5.573092
##$ABSG= 5
##$ABSL= 3
##$ALPHA= 0
##$AQORDER= 0
##$ASSFAC= 0
##$ASSFACI= 0
##$ASSFACX= 0
##$ASSWID= 0
##$AUNMP= <proc_prof1d_extract_pilot.lims>
##$AXLEFT= 0
##$AXNAME= <>
##$AXNUC= <1H>
##$AXRIGHT= 0
##$AXTYPE= 0
##$AXUNIT= <>
##$AZFE= 0.1
##$AZFW= 0.1
##$BCFW= 0
##$BC_mod= 0
##$BYTORDP= 0
##$COROFFS= 0
##$CY= 15
##$DATMOD= 1
##$DC= 0
##$DFILT= <>
##$DTYPP= 0
##$F1P= 0
##$F2P= 0
##$FCOR= 0.5
##$FTSIZE= 32768
##$FT_mod= 6
##$GAMMA= 0
##$GB= 0
##$INTBC= 1
##$INTSCL= 1
##$ISEN= 128
##$LB= 0
##$LEV0= 0
##$LPBIN= 0
##$MAXI= 10000
##$MC2= 0
##$MEAN= 0
##$ME_mod= 0
##$MI= 0
##$NCOEF= 0
##$NC_proc= -8
##$NLEV= 6
##$NOISF1= 0
##$NOISF2= 0
##$NSP= 0
##$NTH_PI= 0
##$NZP= 0
##$OFFSET= 14.98509
##$PC= 1
##$PHC0= 95.63049
##$PHC1= 0
##$PH_mod= 1
##$PKNL= yes
##$PPARMOD= 0
##$PPDIAG= 0
##$PPIPTYP= 0
##$PPMPNUM= 2147483647
##$PPRESOL= 1
##$PSCAL= 4
##$PSIGN= 0
##$PYNMP= <proc.py>
##$REVERSE= no
##$SF= 400.02
##$SI= 32768
##$SIGF1= 0
##$SIGF2= 0
##$SINO= 400
##$SIOLD= 32768
##$SPECTYP= <>
##$SREGLST= <1H.CDCl3>
##$SSB= 0
##$STSI= 32768
##$STSR= 0
##$SW_p= 8223.68421052631
##$SYMM= 0
##$S_DEV= 0
##$TDeff= 65536
##$TDoff= 0
##$TI= <>
##$TILT= no
##$TM1= 0
##$TM2= 0
##$TOPLEV= 0
##$USERP1= <user>
##$USERP2= <user>
##$USERP3= <user>
##$USERP4= <user>
##$USERP5= <user>
##$WDW= 1
##$XDIM= 32768
##$YMAX_p= 457007069
##$YMIN_p= -689050
##$CURPLOT= <Network HP LaserJet P1505>
##$CURPRIN= <$Network HP LaserJet P1505>
##$DFORMAT= <normdp>
##$LAYOUT= <+/1D_H.xwp>
##$LFORMAT= <normlp>
##$PFORMAT= <normpl>
##$SURQMSG= 1
$$ End of Bruker specific parameters
$$ ---------------------------------
##NTUPLES= NMR SPECTRUM
##VAR_NAME=  FREQUENCY,     SPECTRUM/REAL,   SPECTRUM/IMAG
##SYMBOL=    X,             R,               I
##VAR_TYPE=  INDEPENDENT,   DEPENDENT,       DEPENDENT
##VAR_FORM=  AFFN,          ASDF,            ASDF
##VAR_DIM=   32768,         32768,           32768
##UNITS=     HZ,            ARBITRARY UNITS, ARBITRARY UNITS
##FACTOR=    0.250966925370066, 1,           1
##FIRST=     8223.43324360094, 106188,       146012
##LAST=      0,             -129728,         123725
##MIN=       0,             -689050,         0
##MAX=       8223.43324360094, 457007069,    0
$$ Real data points
##PAGE= N=1
##DATA TABLE= (X++(R..R)), XYDATA
$$ [...]
19575a94433Q3472d3909k3348G5122a96032B75706i6240J7390B4047b21404L0032
19564a91372A841c9988q6914e4670k11298f2880k87503A7324a34085L1805J4834
19553h7446B37115I9993h2836a4196j44398A83654c26934Q3444I729O3483J62094
19542B35306G5838N3226f0544r2655e8884j08831B17496e0123D4486M9352d2109
19530A2493J75405b54908D4455J81012H0298b29283J4946C05854a18964A43760
19519B08441H0512A8074d8584f547p2201H5811h7967j09265H8429a33144F9490
19507E9047a36348E9066b54685A25727j1436a02150J7448r8040F9870J856a67348
19495a03016B10499a28420j78008A01288b13746A11938J28409F0903a04224M4487
$$ y = [-194433, -110961, -43909, -67257, 75122, -196032, 275706, -96240, -78850, 24047, -221404, -191372, 1841, -39988, -126902, -54670, -265968, -62880, -350383, 17324, -134085, -102280, -87446, 237115, 99993, -82836, -14196, -158594, 183654, -326934, -243490, 9729, 73212, 235306, 75838, 129064, -60544, -153199, -58884, -167715, 217496, -50123, 44486, 93838, -42109, 12493, 187898, -254908, 44455, 225467, 80298, -229283, -214337, 305854, -118964, 143760, 208441, 80512, 18074, -48584, -6547, -78748, 85811, -87967, -197232, 88429, -133144, 69490, 59047, -136348, 59066, -254685, 125727, 114291, -102150, -84702, -182742, 69870, 71726, -167348, -103016, 210499, -128420, -306428, 101288, -213746, 111938, 240347, 60903, -104224, -59737]
19485e9737A60406a90847A44159A2718J09102a82439g8396R565D08124j42383
19475B65741F588c8836E0207M3952a82610a2575H4475h8679k69493A37149b3176
19463a90696P8608m58361a4373D92262a69273I3246A4964M580b41597I0024d8439
19451a28513c1285k12538P1869I3947C7102c33104g4853K9702A40567m3085h1525
19439I7557i7731i851k86971r438a19457j93197g0115n7564K5559B5388f9462
19427a87362A36014a76619j36870A53511B5067a56905A65582a92444a5473j91102
19417b06575A02245h1585k04650j3468C97837b7596a3493A506a43004f0938A36801
19405B87446K0318I0429c19666B43082j9554b7360O618B13261c39711A73483b73217
$$ y = [-59737, 160406, -190847, 144159, 12718, 121820, -182439, -78396, -68831, 408124, 265741, 6588, -38836, 50207, 94159, -182610, -12575, 84475, -88679, -358172, 137149, -23176, -190696, -112088, -570449, -14373, 492262, -169273, 93246, 14964, 19544, -241597, 90024, -48439, -128513, -31285, -243823, -171954, 93947, 37102, -333104, -74853, -45151, 140567, 97482, -81525, 97557, -97731, -9851, -296822, -306260, -119457, -312654, -70115, -127679, -102120, 25388, -69462, -187362, 136014, -176619, -313489, 153511, 25067, -156905, 165582, -192444, -15473, -206575, 102245, -81585, -286235, -299703, 397837, -27596, -13493, 1506, -143004, -60938, 136801, 287446, 307764, 90429, -319666, 243082, 223528, -27360, -20742, 213261, -339711, 173483, -273217]
19393A03027a11072A78736a44090I9626L4640a16018F3514b84172r8190C59209
19382A45091B6613b72358p4295B46954B4350b03335l9588J14360k06816C12725
19371b87400d7878A39035o6974a98185N9594d6356j31363l432E1545j8801i1981
19359c40383J43608a732F4957b7062n19514g0913j79524r449J23549B41131a36858
19347c4051j78519C30489L1734G6650b4907l76117e7651k94340a21446j6092d5988
19335a25990j13982M4364o317e1429k78930O0404C39304g2035n9782j33527e1096
19323F0864A1179g9552n4796j32171e8592m9945M7921C05113r9124J33213a04827
19311a87990j29555G46J29775g2552j52815i5980k20830a10323B53546j05660
$$ y = [103027, -111072, 178736, -144090, 99626, 134266, -116018, 63514, -284172, -382362, 359209, 145091, 26613, -272358, -346653, 246954, 24350, -203335, -242923, -128563, -335379, 312725, -287400, -47878, 139035, 72061, -198185, -138591, -46356, -177719, -181151, 51545, 32744, -91981, -340383, -196775, -1732, 64957, -27062, -546576, -70913, -250437, -259886, -136337, 241131, -136858, -34051, -212570, 330489, 362223, 76650, -24907, -401024, -57651, -351991, -121446, -137538, -45988, -125990, -239972, -195608, -201925, -51429, -330359, -269955, 339304, -72035, -131817, -265344, -51096, 60864, 11179, -79552, -134348, -266519, -58592, -108537, -60616, 305113, 205989, 339202, -104827, -187990, -317545, 746, 130521, -72552, -225367, -95980, -316810, -110323, 253546, 147886]
19301A47886m7219D8285b52878A27788n405a3520A28705b65861O9125b1686j19502
19290a41188g0524B88612a16805J7741A48996b60352A83329m6013c91074M9056
19280c42018f9395k7106q4446I4528a22767E39547a65735K2831j01126E400b01551
19268B36020p6477P309l9633a38273C0508e1993A41039D6577J55201a64723j4070
19257a78793F3350O0590l8199J0457b92622A78454b35894A4020K26897n6055l9971
19246A44891b15337e3656B76522m8911i0414l610A55671a40305L4151j7602B847
19234a91675h8599E0339e04822b33219B72366F8021a27093l59B08019e0572k0483
19223g1055D1307j3914a48403a7489I4839N6444g2153f722D13081a6532G1923
$$ y = [147886, 100667, 48285, -252878, 127788, 122383, -13520, 128705, -265861, -196736, -21686, -141188, -70524, 288612, -116805, -99064, 148996, -260352, 183329, 137316, -391074, -342018, -69395, -96501, -180947, 94528, -122767, 539547, -165735, -142904, -244030, 5400, -201551, 236020, 159543, 166852, 127219, -138273, 30508, -51993, 141039, 46577, 201778, -164723, -178793, 63350, 123940, 85741, 96198, -292622, 178454, -235894, 14020, 240917, 184862, 144891, -215337, -53656, 276522, 227611, -90414, -94024, 155671, -140305, -106154, -123756, 2847, -191675, -88599, 50339, -504822, -233219, 272366, 68021, -127093, -127452, 208019, -50572, -71055, 41307, 27393, -148403, -17489, 94839, 151283, -72153, -6722, 413081, -16532, 71923]
19211B48743b1060D5112j0452K1938c23347O4302N6770A23211i4355A80672c06580
19199a08537E1136p866K2135J13364i2049j56190M6956N4123o5012h0672A67877
19187a49620k328p346N3735P255j29634j09670g6208B93414A41868b45191M7718
19176a97473A2937g2208I0179d9619j18204a3011r1187B77118c8384B53163f2369
19164g8760A02917a58642M2402A15013C2777a98177A58923c73477a0928k4100
19154c5028G9493a10489L6372J0386C49642a37627e2024m0026j90420J34657C31598
19142A90307b946A41906j6483a44216f7787k05483c8896j7651o6918j45562M6387
19131b22640C29333E5607a25827k65017c559j13854a4618l04454F8625c05151
$$ y = [248743, -21060, 45112, 34660, 56598, -323347, -259045, -202275, 123211, -94355, 180672, -306580, -108537, 51136, 43270, 65405, 178769, -92049, -248239, -201283, -147160, -212172, -80672, 167877, -149620, -151948, -159294, -105559, -98304, -227938, -337608, -76208, 293414, 141868, -245191, -197473, 12937, -72208, 90179, -49619, -167823, -13011, -104198, 277118, -38384, 253163, -62369, -78760, 102917, -158642, -116240, 115013, 32777, -198177, 158923, -373477, -10928, -35028, 79493, -110489, -74117, -63731, 349642, -137627, -52024, -92050, -282470, -147813, 331598, 190307, -2946, 141906, 125423, -144216, -67787, -273270, -38896, -56547, -123465, -269027, -222640, 329333, 55607, -125827, -390844, -3559, -117413, -14618, -319072, 68625, -305151]
19120A1455i6996H5263a59990o7481d2094j04686A59234J11306b07805a7312d845
19108f5539j7781j55118A73655c7311A9700p424g09l25987A5228e7361B0316d71756
19095A35269L9582o9691O4905b35570c4792J6595B79828h0197A33670D9328J46969
19084A96297f9414A80930K72155c5898G1400C3389g4818K5166A15752a15897C11376
19072a0448G8891j7861i8656M0548A90435a40632m23338A01897e9167r3187j11079
19061b63433f8668k46986J15242j72344A97471F1893a04635E1412J35957a41442
19050E4048g2751k07504e3351B42235d66384b08421K8053N0277O3981C5322a1630
19038d0259A9896P4656b44151L7916e6674B58998n5668J17576b71268A86200L7586
$$ y = [11455, -96996, 85263, -159990, -227471, -42094, -146780, 159234, 270540, -207805, -17312, -4845, -65539, -83320, -238438, 173655, -37311, 19700, 12276, -709, -326696, 15228, -57361, 20316, -471756, 135269, 174851, 105160, 170065, -235570, -34792, -18197, 279828, -80197, 133670, 49328, 196297, -69414, 180930, 453085, -35898, 71400, 33389, -74818, -49652, 115752, -115897, 311376, -10448, 78891, 61030, -98656, -58108, 190435, -140632, -563970, 101897, -59167, -152354, -263433, -68668, -315654, -200412, -372756, 197471, 61893, -104635, 51412, 187369, -141442, 54048, -72751, -280255, -53351, 242235, -466384, -208421, -180368, -130091, -66110, 35322, -11630, -40259, 19896, 94552, -244151, -206235, -56674, 258998, 203330, 320906, -271268, 186200, 223786]
19027B23786A670J30903a62888C90211j33050d3607A71796a40321j00893h9320
19016E6351c1410A61432c28511B47775f8257J1748n9165B72430o3174h1060j38964
19005b20024k67303B31202a38813N4421A56170b27146g2829c2994m6652E3657
18994c05133a43458j27950A03823Q1971d44964i3365C97200d09763a56128l259
18984a59387B14494a32128k3413m0817e0479I775b13350R8173H8496c34453b6598
18972B33453D0812J97700G5106J6707k2015k7717d9437j03144C05627b45612B41190
18960A5922J23230b4315A34623b33267A67352p5869J03870G9787J01909o6807
18950A14889B2200f0339j04503e4496A54567c41838c6282C0342a50574j01005
$$ y = [223786, 1670, 132573, -162888, 390211, 257161, -43607, 171796, -140321, -241214, -89320, 56351, -31410, 161432, -328511, 247775, -68257, -56509, -115674, 272430, 209256, -81060, -220024, -487327, 231202, -138813, -84392, 156170, -227146, -72829, -32994, -79646, 53657, -305133, -143458, -271408, 103823, 185794, -444964, -93365, 397200, -409763, -156128, -159387, 214494, -132128, -155541, -196358, -50479, 9775, -213350, -115177, 88496, -334453, -26598, 233453, 40812, 238512, 75106, 91813, 69798, 42081, -49437, -152581, 305627, -245612, 241190, 15922, 139152, -24315, 134623, -233267, 167352, 91483, 195353, 79787, 181696, 114889, 22200, -60339, -164842, -54496, 154567, -341838, -36282, 30342, -150574, -251579]
18940b51579c6051A4444R6680c23936g2144E5380a14034m89o9849k57049a47752
18928A3081b14373c4741k14756l0113A25289a83626A07039c43485b7841q0689
18918a08530p8524g6298a5187k10368h8474r0959O9732A12850b16952b4258k2516
18907d6774E593d62163C9302b5026j03346e6375A4488c0291n866A24384a00979
18895g6709k42263a26273b0751k14471i6602m3152D4719N9813m5592b41248c8332
18883a06365A47662Q8637a9646F077a0305k50644L2135J03077j00896A04693e3361
18871c2364m4919C6649a8346k06565r1193a48507A8231a43840b0993k90977E9533
18859b82177R2252R878L7115H7104L4434B6777M44907a054j25003B17761a0354
$$ y = [-251579, -36051, 14444, 111124, -323936, -72144, 55380, -114034, -114523, -184372, -441421, -147752, 13081, -214373, -34741, -249497, -279610, 125289, -183626, 107039, -343485, -27841, -108530, -187054, -76298, -15187, -225555, -88474, -179433, -109701, 112850, -216952, -24258, -46774, 5593, -462163, 39302, -25026, -128372, -56375, 14488, -30291, -36157, 124384, -100979, -76709, -318972, -126273, -20751, -235222, -96602, -139754, 44719, 104532, 58940, -241248, -38332, -106365, 147662, 236299, -19646, 6077, -10305, -260949, -228814, -125737, -226633, 104693, -53361, -32364, -77283, 36649, -18346, -224911, -316104, -148507, 18231, -143840, -20993, -311970, 59533, -282177, -189925, -180047, -142932, 87104, 121538, 26777, 471684, -1054, -126057, 217761, -10354]
18847a4227n6245F0628J46181A1390J27978D5943J41351i1691B5200g1972r8164
18836a70136A36146d8681o8760k76366h9298C6059A5372e3423F0965B3269b20103
18824c89046A31125l7261i9110K2863c3681l3063o0661G0647d384j10900B03351
18812b08925D9892a33656n6577C01224E5462K41558b41380A79743f2791o6355
18802a29146B41344B5951f1040a2488G6390O9035m3319g7797j88365f8210E9273
18790a65961B93380b26723A55709D5036a4567l15282b8327G8682A86b57443f0404
18778E1432i8492I891a11754A66023b56575b2894N217A3129g8899I7670g3960
18766a65941l63472J61017A19741g4430A51841a97316B36869h6959B670N7950
$$ y = [-14227, -70472, 60628, 206809, 11390, 139368, 45943, 187294, -91691, 25200, -71972, -170136, 136146, -48681, -117441, -393807, -89298, 36059, 15372, -53423, 60965, 23269, -220103, -389046, 131125, 93864, -99110, -76247, -33681, -66744, -127405, 70647, -4384, -115284, 203351, -208925, 49892, -133656, -190233, 301224, 55462, 297020, -241380, 179743, -62791, -129146, 241344, 25951, -61040, -12488, 76390, 145425, 102106, -77797, -266162, -68210, 59273, -165961, 293380, -226723, 155709, 45036, -14567, -329849, -28327, 78682, 186, -257443, -60404, 51432, -98492, 9891, -111754, 166023, -256575, -22894, -17677, 13129, -78899, 97670, -73960, -165941, -529413, -368396, 119741, -74430, 151841, -197316, 236869, -86959, 2670, 60620]
18756F0620A4087n128a10640r5941A24677a67894d9916A71251a70181h4871q3110
18745a67981j76066J35671h899c137k86075a26726B3016c662j36808N7099A15041
18733B18318h7989j494r6296C9028l809b39453i9448B65815h4337J4315H1301
18721i2953n6729b4779j30483A02869b02912A40250B6445J17425n0794b40215
18710g0003N508j89061G2226c20020J54455G8011b94920C0769a68652k06334h8235
18698b42010A22006a0652B53944c4548k59181B43N3863a41670k32057J20108C13788
18686A66075a25773C02625a05352j95091q699A99768a30648j0694I402a40473
18675a49855n22297a5254A1874a55728A68266b38246A43444c4645A2042c05876
$$ y = [60620, 14087, 8959, -110640, -206581, 124677, -167894, -49916, 171251, -170181, -84871, -167981, -344047, -208376, -8899, -3137, -289212, -126726, 23016, -3662, -140470, -83371, 115041, 218318, -87989, -89483, -185779, 39028, 35219, -239453, -99448, 265815, -84337, -70022, 81301, -92953, -149682, -24779, -155262, 102869, -202912, 140250, 26445, 143870, 93076, -240215, -70003, -64495, -253556, 72226, -320020, -165565, 78011, -294920, 30769, -168652, -374986, -88235, -242010, 122006, -10652, 253944, -34548, -293729, 243, 54106, -141670, -373727, -253619, 313788, 166075, -125773, 302625, -105352, -300443, -309142, 199768, -130648, -141342, 9402, -140473, -149855, -672152, -15254, 11874, -155728, 168266, -238246, 143444, -34645, 12042, -305876]
18664I3733c9921j90649A04097c322j84997g6635I089J83165b03571q9295A45762
18652C32459F934b17139b2806j18104N8931C12784a00090L5920m9839B13892i7055
18640b36137d0472j47834A60199F6337a01116p3125j29803J12459A07443A8455
18629a63865E7269b71l2653j67585k4692R6821A33023b58879J23106B2403c31286
18617a25694E0221A289b3373F9438a16269A79006A7052b94199B85443A8612K8316
18606D6928a71835j05819O583I3036c25403h5348I4310C1781b28240G765Q980
18595A6745b73040L8174P6079c9666a7518o7797J9955j01315g5542b8761I645
18583a55227B0450e94p709j15357p4552a3007D739O9128b7368A66928e2953k22035
$$ y = [93733, -39921, -230570, 104097, -3322, -188319, -76635, 9089, 192254, -203571, -292866, 145762, 332459, 6934, -217139, -22806, -140910, -81979, 312784, -100090, -64170, -114009, 213892, -97055, -236137, -40472, -188306, 160199, 66337, -101116, -174241, -304044, -191585, 107443, 18455, -163865, 57269, -271, -32924, -200509, -225201, -128380, 133023, -258879, -135773, 22403, -331286, -125694, 50221, 1289, -23373, 69438, -116269, 179006, 17052, -294199, 285443, 18612, 46928, -171835, -277654, -271071, 93036, -325403, -85348, 94310, 31781, -228240, 7765, 16745, -273040, -234866, -158787, -39666, -17518, -85315, -65360, -166675, -75542, -28761, 9645, -155227, 20450, -594, -8303, -123660, -198212, -13007, 4739, 73867, -27368, 166928, -52953, -274988]
18571b74988i8474A92176A1796J66466q6901d7674A25315d0235m82465D5654g7611
18559i9575o3068b8043m3721B7563a89979d0281A08750J57667a04078B0021J21009
18548A41030P9934n7734a46328b222j49323A1349N2667b48178B51108j07442E5159
18536b5294j20745F4256I427a18737a7226k57867J33822B06883c37667A75930
18525g3233q2672L7559a8093A20005q262j8464M2388a78819A85165M0076J39225
18514C64466E3166c90866J17648g1664G9971d6110D3415d57969a18866D7806a56855
18502b76857J32320B84097b22693G8480g8088A56579n0005i5742j18203B09278
18491A02291c86011a67644j37646a28162m5051g4888A90253o0346a65209b0425
$$ y = [-274988, -98474, 192176, 11796, 178262, 91361, -47674, 125315, -40235, -522700, 45654, -77611, -99575, -162643, -28043, -71764, 27563, -189979, -40281, 108750, 266417, -104078, 20021, 141030, 220964, 163230, -146328, -2222, -151545, 11349, 64016, -248178, 251108, 143666, 55159, -25294, -146039, 64256, 9427, -118737, -17226, -275093, -141271, 206883, -337667, 175930, -73233, -155905, -118346, -18093, 120005, 111743, 93279, 135667, -178819, 185165, 225241, 364466, 53166, -390866, -273218, -71664, 79971, -46110, 43415, -457969, -118866, 47806, -156855, -276857, -144537, 284097, -222693, 78480, -78088, 156579, 106574, -95742, -213945, 209278, 102291, -386011, -167644, -305290, -128162, -173213, -74888, 190253, 129907, -165209, -20425]
18480A26914a27755G6924c75484e8199j50471d8580k62109A14899a27622M0941
18470h6681A82889b018k71114E8598b67109c2659a4915q2585B5211m927K5079
18459D5363b02121c1626J1463O36k7769K1029k38778B57588b65498j12374A55927
18447D7226g8849j84094H856c2157A6048d9390l01570f1261j76289N1915B10257
18435a315B01257a21681C6384J91581b69667H1870a11078E48O8503O6755b38941
18423a39929k56143a49616K7905A92082a07782d3589k31611A18070b05588G8785
18412b39679J15986b2284j51836N625A1152i8010d105l05358J41476e6416B23492
18400I9913K1987N6900f2268A73410R8690d13801K5938A344M1035J51922G8084
$$ y = [126914, -127755, 76924, -375484, -58199, -208670, -48580, -310689, 114899, -127622, -86681, 182889, -2018, -273132, 58598, -267109, -32659, -14915, -97500, 25211, 20284, 45363, -202121, -31626, -20163, -19527, -47296, -26267, -265045, 257588, -265498, -377872, 155927, 47226, -78849, -262943, 8856, -32157, 16048, -49390, -350960, -61261, -237550, -185635, 210257, -1315, 201257, -121681, 36384, 227965, -269667, 81870, -111078, 548, 69051, 135806, -238941, -139929, -396072, -149616, -121711, 192082, -107782, -43589, -275200, 118070, -205588, 78785, -239679, -123693, -22284, -174120, -168495, 11152, -98010, -4105, -309463, -167987, -56416, 223492, 99913, 121900, 178800, -62268, 173410, 272100, -413801, -387863, 1344, 42379, 194301, 78084]
18388B51145H6819r896Q690b13521A32920a65145C0657J03522M1393h614k3986
18377c2600A16102O6689L2164P5249n2519i9331I4926J07935a27717j34899E2310
18365e35597A891J62281a6520D1240i7273q1115A34789A3210c3288A06734B4515
18353G9731b9621L583D722a6752k64687A62629c08822N5931B63399b26439C1826
18341b16602P718K9513e8289j19292m0076M6989j3943j7341g6061D01112i964
18329h1732B7422c3563D5577a32352C22871B254H33K60597g2503B8071G113b43803
18316F6462K53285M669c9389J0928B76066d66066B7385d5642H9173d6007A11985
18304H1704a12131l76364K11143F9099B7642b71829D3664K8342a84224A04897
$$ y = [251145, 86819, 76923, 85613, -213521, 132920, -165145, 30657, 134179, 175572, -8614, -32600, 116102, 182791, 214955, 290204, 237685, -99331, 94926, 202861, -127717, -262616, 52310, -535597, 1891, 164172, -16520, 41240, -97273, -178388, 134789, 13210, -33288, 106734, 24515, 79731, -29621, -26038, 4722, -16752, -281439, 162629, -308822, -252891, 263399, -226439, 31826, -216602, -208884, -179371, -58289, -177581, -217657, -170668, -184611, -201952, -76061, 401112, -9964, -81732, 27422, -33563, 45577, -132352, 322871, 2254, 833, 261430, -72503, 28071, 7113, -243803, 66462, 319747, 324416, -39389, -28461, 276066, -466066, 27385, -45642, 89173, -46007, 111985, 81704, -112131, -488495, -277352, 69099, 27642, -271829, 43664, 72006, -184224, 104897]
18293C5558j5454N9303c0319j9341A4801L1826J07259D978J9681P7432a47962
18281C4494Q0638e6581A45997L0272g5083A13954c5833n4513j4437q2703J4498
18270a72988n4222p219g6919l43927C70865a00957J6812j38287A68450A5040a12162
18258a99880m9197e5290j85135c6854a1902B13763b2618F2486b04516B7975C013
18246a73764D7630b90965A26788e2990j90933h3169k92162a10511D998J39847
18236A44845b00240B57741b22847k7189A22526e8212B43716B0055h7293j30731
18226b18024A09276N5532r321a11863H5527e9464j18568D6865a02296M0426o1763
18215a23633L5492k33859a43613K4806n9840d3611j0059p5102k4150e1924B9400
$$ y = [35558, 20104, 79407, -30319, -49660, 14801, 46627, 153886, 4978, 24659, 102091, -147962, 34494, 115132, -56581, 145997, 176269, -75083, 113954, -35833, -90346, -104783, -187486, -172988, -227210, -234429, -76919, -420846, 370865, -100957, -84145, -222432, 168450, 15040, -112162, -199880, -249077, -55290, -240425, -36854, -11902, 213763, -22618, 62486, -204516, 27975, 3013, -173764, 47630, -290965, 126788, -52990, -243923, -83169, -375331, -110511, 4998, 144845, -200240, 257741, -222847, -250036, 122526, -58212, 243716, 20055, -87293, -218024, 109276, 164808, 155487, -111863, 85527, -59464, -178032, 46865, -102296, -61870, -123633, -88141, -322000, -143613, -118807, -178647, -43611, -53670, -128772, -152922, -51924, 29400]
18203a9628j60700m770F47b64270B7504b41555f1689A43621K5363a28985E6544
18191b94020A12034r033K3341Q1747b98457J37981E8202B6288a80690A77017J00065
18180B77082D044K22573E7940C638K31081C428b43295A93945C7857Q8365B6167
18168a73257r7605e6076A16056a17104j36730e3374J3201A64853c7894B48531
18157g3518n5035A71600k4079a13625C3159K67078g8933k06305e1975k89599n9608
18146d01182a03369A31857a21725q8889R79B10260b31935A11188d53242c7514
18135A85891b11742Q1129A4243a8080q4253l5781j2615l9976A26601c04122A31494
18123I4505b40655A05226a37410f7904p065b1391C26404A39259O8115C9415d7407
$$ y = [-19628, -180328, -185098, 647, -264270, 27504, -241555, -61689, 143621, 168984, -128985, 56544, -294020, 112034, 103001, 126342, 208089, -298457, -160476, 58202, 26288, -180690, 177017, 277082, 4044, 226617, 57940, 3638, 234719, 3428, -243295, 193945, 37857, 126222, 26167, -173257, -270862, -56076, 116056, -117104, -253834, -53374, -40173, 164853, -37894, 248531, -73518, -128553, 171600, 147521, -113625, 33159, 300237, -78933, -285238, -51975, -341574, -401182, -103369, 131857, -121725, -210614, -209635, 210260, -231935, 111188, -453242, -37514, 185891, -211742, -130613, 14243, -18080, -102333, -138114, -150729, -190705, 126601, -304122, 131494, 94505, -240655, 105226, -137410, -67904, -74969, -21391, 326404, 139259, 207374, 39415, -47407]
18111A39401a5421l3203j87043B07805b66332c9464A43312b43791A29821P9926
18101B09747a77955J7752k8718d1817I6514a61020B87748A2573c661E6856a22315
18089B10893e6378B16317H5657a41980L8669C18317d8825j04631c8265k02661
18079b40926d0394j75335L6973C51673f6517a4481j54982A37200a28026A04842
18068a05646A32264a66187I3030B8270K7563M7011J28097D6864B769P895a95791
18056f1418k79141k8491g3816C4787H814d7591A29040o0228P4915d85580a36704
18044F3842c25860g5736A18989a22291G3109J71385j18976e1109j93773d3849
18033D5732b47363A36881b37311L2227G7480B3501d4957q1260B06517b33955j29859
$$ y = [139401, -15421, -48624, -235667, 207805, -266332, -39464, 143312, -243791, 129821, 209747, -177955, -160203, -188921, -41817, 96514, -161020, 287748, 12573, -3661, 56856, -122315, 210893, -56378, 216317, 85657, -141980, -103311, 318317, -48825, -153456, -38265, -240926, -40394, -215729, -178756, 351673, -66517, -14481, -169463, 137200, -128026, 104842, -105646, 132264, -166187, 93030, 28270, 55833, 102844, 230941, 46864, 2769, 10664, -195791, -61418, -340559, -369050, -73816, 34787, 8814, -47591, 129040, 68812, 143727, -485580, -136704, 63842, -325860, -75736, 118989, -122291, 73109, 244494, 125518, -51109, -244882, -43849, 45732, -247363, 136881, -237311, -205084, 77480, 23501, -44957, -126217, 206517, -233955, -363814]
18022c63814A75054i8832K0541p7762j94675b3296j67908q7442F2031a50253D7629
18010B5589a0703o6893g337k14257i2400p6179R877P1095D8223J21536H1107b22137
17997A16029A6301M21847c65772A91723a76369A89562P160a76520C4911a16328
17986b38809A24295a2614H7201g6222c4035e618B3838g4873C8381c81677J64571
17975b17106k01322a30501R158A37039m0167g8191A86611a87686d7431C8624b7613
17963A9222b10817P020G5605b17110q2042a07036J9160j00815A08646J29325a57883
17951a63092d9742C75761i1809I59J18903b17363L0788A50999G4464j0973F000
17939E1162f0797F4605a42695A93888c72800A33103h2124B23030D5067a97333
$$ y = [-363814, 175054, -98832, -78291, -156053, -350728, -23296, -191204, -278646, 62031, -150253, 47629, 25589, -10703, -77596, -7337, -221594, -92400, -168579, -158702, -87607, 48223, 169759, 81107, -222137, 116029, 16301, 438148, -365772, 191723, -176369, 189562, 196722, -176520, 34911, -116328, -238809, 124295, -12614, 87201, -76222, -34035, -5618, 23838, -74873, 38381, -381677, -217106, -418428, -130501, -121343, 137039, 96872, -78191, 186611, -187686, -47431, 38624, -27613, 19222, -210817, -203797, 75605, -217110, -299152, -107036, -87876, -188691, 108646, 237971, -157883, -163092, -49742, 375761, -91809, 959, 119862, -217363, -186575, 150999, 74464, 63491, 6000, 51162, -60797, 64605, -142695, 193888, -372800, 133103, -82124, 223030, 45067, -197333]
17928e1903K3203I2106K3451b31362d4518j42350c4330A44095J17160A29175J3940
17917A43115i8907m9365l91156B59963a82976h9345l8486A38988k5603f4550l2206
17906i6756A52713c6664j0764m6430k2095B80960c31594A41036j8908C2654d997
17894a84204C04458I3588f6417A89159a29911B15396d0698A06700a19170A06830
17883A13418a43367H6318R0137I434R175b06655e1249H6010O1148G2477O8958
17872A41435m0947A3787J43113i278K078k78655a7307G2641B5903i1695j04902
17861a96597k07350C9965L0786O684B3230R8611J8177b3561B13425a74038c8535
17849a37476O525k98322B31228d5148A3093O3524h8462o3977A09151P8079a22423
$$ y = [-51903, -28700, 92106, 115557, -231362, -44518, -186868, -34330, 144095, 261255, 129175, 143115, -98907, -148272, -539428, 259963, -182976, -89345, -127831, 138988, 113385, -64550, -96756, 152713, -36664, -47428, -93858, -115953, 280960, -331594, 141036, 122128, 32654, -4997, -184204, 304458, 93588, -66417, 189159, -129911, 215396, -40698, 106700, -119170, 106830, 113418, -143367, 86318, 176455, 9434, 18609, -206655, -51249, 86010, 147158, 72477, 141435, 100488, 13787, 156900, -9278, -7200, -285855, -17307, 72641, 25903, -91695, -196597, -403947, 39965, 70751, 77435, 23230, 121841, 140018, -23561, 213425, -174038, -38535, -137476, -130951, -429273, 231228, -45148, 13093, 76617, -88462, -152439, 109151, 187230, -122423]
17837e2426A60945k9747g4504m5299K8322I1456J19818b59050A01835D1109b83898
17825A19200d0398p3680J1331c3324A29255a73066d6392E7970M3774l0278b00915
17813B2688c7808I7038a03208j65675c4037A02591Q4185a6806n6921j6894k35961
17802c26582a31257j08801f1487l2742B08657a73166e2464J1500o6345n1571J6194
17791a42686l1568B65230a40225M3304H1075a39277A03066m4491A9317a76474
17780I1524a81472B48513D2294b30099e9556A57993J73398c97149J14371g5390
17769H6396p882L79034B19697C9594b79974d460I176J81271b33339A3577a14513
17757E0918J67578e9248n7390F2957R1327i8105A22479c06936E6624a16410n4059
$$ y = [-52426, 160945, 131198, -74504, -119803, -91481, 91456, 211274, -259050, 101835, 41109, -283898, 119200, -40398, -114078, -102747, -33324, 129255, -173066, -46392, 57970, 101744, 71466, -200915, 22688, -37808, 97038, -103208, -268883, -34037, 102591, 186776, -16806, -73727, -90621, -326582, -131257, -240058, -61487, -94229, 208657, -173166, -52464, -40964, -107309, -158880, -142686, -174254, 265230, -140225, -96921, 81075, -139277, 103066, 58575, 19317, -176474, 91524, -181472, 248513, 42294, -230099, -59556, 157993, 331391, -397149, -282778, -75390, 86396, 78514, 457548, 219697, 39594, -279974, -4460, 9176, 190447, -233339, 13577, -114513, 50918, 218496, -59248, -116638, 62957, 154284, -98105, 122479, -306936, 56624, -116410, -170469]
17746a70469E0908b5406k13140J1774A17112R5894a94971E8072L15964F9861A2766
17734a74819A74810Q5314e9372B23051f6756j8856A61294F8944i344I8029K07253
17723C05282b00521A57793b7214k16566D6666h9936D2239M39821a60486a0415
17712B85572c14779C76157B7452R7790B3403a46956C61422A56487f7294H7339
17701D420b44056I4016K37964j50119c14765A94108B2000J09288g3079F3985Q2736
17690A46721b2741B14152c7670j49723A4389b06484c7126k53443P6236c7064j1084
17679d8148B59422B2901J8964J13052b06191B87616A08787G898f2000b9839C0390
17667A48299a25174A25582J84322D0913f6860C07a10178j55482A74525a8272k6172
$$ y = [-170469, 50908, -25406, -238546, -226772, 117112, 213006, -194971, 58072, 374036, 69861, 12766, -174819, 174810, 260124, -59372, 223051, -66756, -85612, 161294, 68944, -9344, 98029, 305282, -200521, 157793, -27214, -243780, 46666, -89936, 42239, 482060, -160486, -10415, 285572, -314779, 376157, 27452, 125242, 23403, -146956, 361422, 156487, -67294, 87339, 4420, -244056, 94016, 331980, 181861, -314765, 194108, 22000, 131288, -73079, 63985, 146721, -22741, 214152, -37670, -187393, 14389, -206484, -37126, -290569, -214333, -37064, -48148, 259422, 22901, 41865, 154917, -206191, 287616, 108787, 7898, -62000, -29839, 30390, 148299, -125174, 125582, 309904, 40913, -66860, 307, -110178, -265660, 174525, -18272, -44444]
17656d4444A43512J7147K12263a41057A26795n2462K0254a3911A19302c8491D833
17644c70815g8190B33907o0810l3846b2054A73348b21305B21856a76026A22410
17633a84324A25204J93851j38255c4857j91620B62820m9929A931a5543A10507
17622a17186A60947c08186D429g1108o8206r6707c6757j14455A66825O222i2538
17610A13397m518N3226j4919m0197d4097A62629D3802K18820A23701a83250C42834
17598a49767J0786A51876C0426J28180j7853a12531B0662Q6430A8386L78146C678
17586b42288E7168e3233r3281B84242A14109g9464j83670P0063G9498a20681c911
17574e2142J9180B99451M7939A47308d7485p2299K2425L7583B78513J23362A33765
$$ y = [-44444, 143512, 160659, 372922, -141057, 126795, 74333, 94587, -13911, 119302, -38491, 4833, -370815, -78190, 233907, 173097, 139251, -22054, 173348, -221305, 221856, -176026, 122410, -184324, 125204, 319055, 180800, -34857, -226477, 262820, 212891, 1931, -15543, 110507, -117186, 160947, -308186, 4429, -71108, -139314, -236021, -36757, -151212, 166825, 173047, -92538, 113397, 108879, 162105, 147186, 106989, -44097, 162629, 43802, 262622, 123701, -183250, 342834, -149767, -138981, 151876, 30426, 158606, 140753, -112531, 20662, 107092, 18386, 396532, 3678, -242288, 57168, -53233, -146514, 284242, 114109, -79464, -263134, -193071, 79498, -120681, -3911, -52142, -32962, 299451, 347390, 147308, -47485, -119784, -97359, -59776, 278513, 401875, 133765]
17562C0022N96396A0274h5986A1637a43778A31069C295b12189A09308m0708f1845
17550a45205c4855D5261b22141B5975J75245i0425A39149a69645B27677a2950
17539A76829b45602B5793K960K67846a3668m9996A82723H7901i748H7639B645
17527C16905b07485D9e2435o9715D6086c24296A1035b07383A15927K7403a73414
17515a73655C49914b442A11460A6819b84514h3654j18707B74670Q429o6392b10037
17503A79978c21986e8967B03917r0443i5032B49565J41652o5726A682J01260O5999
17492A68941a76652H3191a04525b0435A81815c99738E6294J39195G3021L6098
17482A09119K8165a343C10710A31447a28018A35762l2727J22066d0721A6442b103
$$ y = [30022, 626418, 10274, -85986, 11637, -143778, 131069, 3295, -212189, 109308, 68600, -61845, -145205, -34855, 45261, -222141, 25975, 201220, -90425, 139149, -169645, 227677, -12950, 176829, -245602, 25793, 28753, 296599, -13668, -63664, 182723, 87901, -9748, 87639, 2645, 316905, -207485, 49, -52435, -122150, 46086, -324296, 11035, -207383, 115927, 143330, -173414, -173655, 349914, -2442, 111460, 16819, -284514, -83654, -202361, 274670, 283099, 216707, -210037, 179978, -321986, -58967, 203917, 113474, -95032, 249565, 391217, 325491, 1682, 102942, 168941, -176652, 83191, -104525, -20435, 181815, -399738, 56294, 195489, 73021, 109119, 137284, -1343, 310710, 131447, -128018, 135762, 103035, 225101, -40721, 16442, -2103]
17470A00268h7266A64726R2741J49120c7663A8999N8689e6988k7852G1139a3495
17458A66872a20033c6384j33182A89540M1009R8356n2240A17459J08531j020k1458
17447B03512I5982M6490n7254L84911A48495Q0210p2044J01909J6470R6471j59867
17436B11644K31551B9155N48679k88524j1160r893k0567K89462g4771B74001J70510
17425D44511J3825D4839M72423k55114J20330j50691j00522d9836C51792L35011
17415F86803E3957L70826A5246K26632Q1765j15472o9459a03194C29944P9719
17405D09663j84615i206A50399c14815D08513A18959K65187K04176k21268I1702
17394b931A53983r980L4953a33017C28142A35125O7345G8259P8228J36291a38188
$$ y = [100268, -87266, 164726, 257467, 406587, -37663, 18999, 77688, -56988, -84840, 71139, -13495, 166872, -120033, -36384, -169566, 189540, 230549, 328905, 276665, 117459, 225990, 224970, 203512, 95982, 142472, 85218, 470129, 148495, 228705, 156661, 258570, 275040, 371511, 211644, 443195, 29155, 577834, 289310, 278150, 268257, 247690, 537152, -74771, 274001, 444511, 458336, 44839, 517262, 262148, 382478, 231787, 131265, -49836, 351792, 686803, 53957, 424783, 15246, 241878, 323643, 208171, 138712, -103194, 329944, 409663, 225048, -9206, 150399, -314815, 408513, 118959, 384146, 588322, 367054, 91702, -2931, 153983, 144003, 178956, -133017, 328142, 135125, 202470, 78259, 156487, 292778, -138188]
17382A87177p3435A270K22654m4734o5675M3478J69813A29219N7580m5222K70297
17371D11874A32406J63286H7852a14935A68345J91475i8231D85595a21144r1569
17361b12713F5201K37969d8036I5990J25901H8323O8066p318C0250K62113e1161
17349F3080a10763C83180f7687C01848j32695j9518a99138G4867F318J23580f1672
17337B90197l5161D5770Q3666n4247M05419j95105b9402j69422A18840N9996a67261
17325b11639E3149M57337A82162Q3173O7463a39635A09697b036r7926B13754K32984
17314D46738B08993O8481p938O2390A18110K5915N1630o1557J02932n9878K68402
17303D45554A54738K41677D7793M2472L36648c59397D38675r015j08051A42749
$$ y = [187177, 113742, 1270, 223924, 179190, 113515, 156993, 326806, 129219, 186799, 141577, 411874, 132406, 295692, 87852, -114935, 168345, 359820, -98231, 485595, -121144, -212713, 65201, 303170, -48036, 95990, 221891, 88323, 156389, 149071, 30250, 292363, -51161, 63080, -110763, 383180, -67687, 301848, 169153, 149635, -199138, 74867, 6318, 129898, -61672, 290197, 255036, 45770, 129436, 75189, 480608, 285503, -29402, -198824, 118840, 178836, -167261, -211639, 53149, 510486, 182162, 265335, 332798, -139635, 109697, -2036, -99962, 213754, 446738, 208993, 277474, 269536, 331926, 118110, 144025, 195655, 134098, 237030, 177152, 445554, 154738, 396415, 47793, 90265, 426913, -359397, 438675, 429660, 321609, 142749]
17292B08184r8397P4134J25030A08987K35437j71716J6894L1848r5800b46459
17281D1189L1697q845L64782e6377A75420K1600r5890a52867A66993J61949a71665
17269B26915m4148c8605A74564o4107K88745f7150D0430J9106J28651I2048M4199
17258A36247J93797m1015A41274m0986J23747a10831C97985A66604L48493F6370
17247C02945H8971K3698M2991F9614J83462H4441O7895L6454a32701G0064R0209
17236A60273p7946M89887h4671C47310A09882J37470M8842j34389G6001C2702
17225C94095p2372r0036b6115C71810F6892M38150A65695N17957B14187P62e1310
17213A18189J59098B7021k704K69048M9417j27497F7526B979L67997k4216A67189
$$ y = [208184, 109787, 183921, 308951, 108987, 344424, 172708, 189602, 221450, 125650, -246459, 41189, 72886, 64041, 428823, -56377, 175420, 197020, 101130, -152867, 166993, 328942, -171665, 226915, 182767, -38605, 174564, 110457, 399202, -67150, 40430, 59536, 188187, 92048, 136247, 330044, 289029, 141274, 100288, 224035, -110831, 397985, 166604, 515097, 66370, 302945, 88971, 112669, 155660, 69614, 253076, 84441, 152336, 188790, -132701, 70064, 160273, 82327, 572214, -84671, 347310, 109882, 247352, 296194, 161805, 76001, 32702, 394095, 321723, 231687, -26115, 371810, 66892, 505042, 165695, 683652, 214187, 214949, -51310, 118189, 277287, 27021, 24317, 293365, 342782, 215285, 67526, 2979, 370976, 346760, 167189]
17201B58180J65037j35594B6762J79J91504C1697J34276N23606l07174O5361F8209
17189a17355A87555h8178o8226B85947J4803b9222A36512K48819n1078K3304j52812
17178B04745o2863J6804L10430d2733a4345D11057r6000o1071q0972L71353p6864
17167D67503j63977A8685N36051A63985K60571I7670n812J43359N2931D0462J28493
17156A68955J5500J27516j37659D2774M84449A74783K73961k17788j06688K95983
17146D20251L46583C38579H5422J01092K53876k9667I0792K38761P9472R9391
17136E08416A82539J71038M5967J06102O1488k38215M9249j2026n5194M04721
17126G15669l43105A67011M5581N6352k3539L06760r2878n737Q901j92461J84261
$$ y = [258180, 423217, 287623, 26762, 26941, 218445, 31697, 165973, 689579, 382405, 447766, 68209, -117355, 187555, -88178, -156404, 285947, 300750, -29222, 136512, 385331, 334253, 357557, 204745, 141882, 158686, 469116, -42733, -14345, 411057, 315057, 253986, 173014, 544367, 467503, 303526, 18685, 554736, 163985, 424556, 97670, 91858, 235217, 288148, 40462, 168955, 184455, 311971, 174312, 42774, 527223, 174783, 448744, 230956, 124268, 420251, 766834, 338579, 85422, 186514, 440390, 410723, 90792, 329553, 409025, 508416, 182539, 353577, 399544, 505646, 567134, 328919, 378168, 366142, 310948, 715669, 372564, 167011, 212592, 268944, 245405, 552165, 459287, 453550, 462451, 269990, 454251]
17115D54251j18854O4203J03006k1484M1881k34486R2308D0279M17365A91973
17104B11326A7469L55827p7526H0694J88147R3980j28475J04440q3393J23918
17094C79311L5521j06216L6255L256m2659L47773l13899j27374J55483M6839A99708
17082C12256E7861M40269P5207k14834L28116B73863K17664Q4917o3859k5774
17072D86811J93198C05097K35531j24647j54466L53591P8957k21831O9232A56328
17061C68581M1336J31435j8941o114B56357L56152k31142j70618J49204L08050
17051F68003k67443P0904r336L61440k62740j25752j71684q9185p859O45156l47725
17040D63779J61856M0488k51647K59416k38428J69793j02770k02700K55470K78225
$$ y = [454251, 335397, 399600, 502606, 481122, 523003, 288517, 380825, 40279, 457644, 191973, 211326, 17469, 373296, 295770, 80694, 268841, 362821, 234346, 338786, 255393, 379311, 414832, 308616, 344871, 348127, 305468, 653241, 339342, 211968, 367451, 414290, 199708, 312256, 57861, 498130, 573337, 358503, 686619, 273863, 491527, 576444, 512585, 486811, 680009, 305097, 540628, 415981, 261515, 615106, 694063, 472232, 541464, 156328, 368581, 409917, 541352, 522411, 516297, 256357, 612509, 381367, 210749, 359953, 668003, 400560, 471464, 462128, 823568, 560828, 435076, 263392, 174207, 166348, 811504, 463779, 625635, 666123, 414476, 673892, 435464, 605257, 502487, 299787, 555257, 833482]
17030H33482l32648j65921Q9105J30154J26647K55583k28641j91611K07475k37316
17020D86309J82136j74549m6486B01201L86467J19186J90190C53851L31600K18149
17010I03600k50645j27434L68882D01608J40805L13115m13147P7523j95058J63935
17000D88781j43765K28928K38219j77244K09799k8432p2028k54709n4030K28350
16990F63869L10986q892J59539l87090J23480J95421k16173k28930j49343K68010
16980G30877J38705l4803J5945K44813p9268j75911M78647o13846L9148J42984
16970H87291k04813J53366n2407K87152l23656j3230k5272P850N11138l41031
16960H86388M827J15796O1879J52155j09234j36877k19608N49652l20705K02571
$$ y = [833482, 500834, 334913, 424018, 554172, 680819, 936402, 707761, 516150, 723625, 486309, 668445, 493896, 447410, 201201, 587668, 706854, 897044, 353851, 685451, 903600, 652955, 525521, 894403, 401608, 542413, 855528, 442381, 519904, 324846, 488781, 345016, 573944, 812163, 634919, 844718, 816286, 744258, 489549, 435519, 663869, 974855, 965963, 1125502, 738412, 861892, 1057313, 841140, 612210, 462867, 730877, 869582, 834779, 850724, 1095537, 1016269, 840358, 1319005, 705159, 744307, 887291, 682478, 835844, 783437, 1070589, 746933, 733703, 708431, 716281, 1227419, 886388, 891215, 1007011, 1068890, 1221045, 1111811, 974934, 755326, 1304978, 984273, 1186844]
16950A186844l69392J54621K26716k26203K31395l49239K97755p206o4521j09074
16940I71696L24579K63181m12620J39564r4220q9319m9829J44095k05932J97633
16930A188828j38334K83454j44673K81217k18537K08045p9096o6778J05156J40601
16920A559883j34934J25819n1140k73558J68841K16470j76886J69543j44134q979
16910A450925K00843L1164m02751K14036J68562l36651K23130L1418K97069K0715
16900A898460l28896p5745K28247M382L57952j75630k17545N1318K07982q720
16890A941805m1950M8512R3504k53893Q0427Q775L2451J50457r6758J50060k39565
16879A873825L78468j6483k66502J85262L0414J35883K5307J5595o0225K21300
$$ y = [1186844, 817452, 972073, 1198789, 972586, 1203981, 854742, 1152497, 1145291, 1080770, 971696, 1296275, 1559456, 1146836, 1286400, 1192180, 1102861, 1053032, 1197127, 991195, 1188828, 1050494, 1333948, 1189275, 1470492, 1251955, 1460000, 1380904, 1314126, 1419282, 1559883, 1424949, 1550768, 1499628, 1226070, 1394911, 1611381, 1434495, 1604038, 1459904, 1450925, 1651768, 1682932, 1280181, 1494217, 1662779, 1326128, 1549258, 1580676, 1877745, 1898460, 1569564, 1493819, 1722066, 1726448, 2084400, 1908770, 1691225, 1742543, 1950525, 1941805, 1899855, 1948367, 2041871, 1787978, 1868405, 1877180, 1909631, 2060088, 1963330, 2113390, 1873825, 2252293, 2235810, 1969308, 2154570, 2184984, 2320867, 2346174, 2361769, 2301544, 2522844]
16869B522844l20128J59102J57771n2640M8613P8258l08787L07157J37616J17288
16859B847094o448n3796J18941Q4437J8118j56461K7995J19842J48292l00392
16849B847622N71617k93369Q745L76715P0438j70630O4561n9255M07269J68699
16839C992412k95782k8584M0406M02382l62203L52609o7889J63863j17101K60026
16829D340139K79459Q8518k77797K75984P3178J46604J53190k15616K34320m4780
16819E053199L26517j75322M09667j08275K28242N6333j87450M86948j31860L24743
16809F282742K78932m4301J43202K19777J66552J48078J60266K77244J25099J99628
16799G957219m9801M71297L1138L83299K11052K4396M22887L3925M97768q532
$$ y = [2522844, 2202716, 2361818, 2519589, 2466949, 2515562, 2593820, 2285033, 2592190, 2729806, 2847094, 2840646, 2786850, 2905791, 2990228, 3008346, 2851885, 2879880, 2999722, 3148014, 2847622, 3419239, 3125870, 3134615, 3511330, 3581768, 3411138, 3475699, 3416444, 3823713, 3992412, 3696630, 3668046, 3708452, 4110834, 3748631, 4101240, 4033351, 4197214, 4080113, 4340139, 4619598, 4708116, 4430319, 4706303, 4779481, 4926085, 5079275, 4863659, 5097979, 5053199, 5379716, 5204394, 5614061, 5505786, 5734028, 5790361, 5602911, 6089859, 5957999, 6282742, 6561674, 6517373, 6660575, 6880352, 7046904, 7194982, 7355248, 7632492, 7757591, 7957219, 7907418, 8378715, 8409853, 8793152, 9004204, 9028600, 9451487, 9485412, 9983180, 9974648]
16789I974648L30719J67693N47057M55457L47609L45718K42215N45292n1406M92490
16779A3397492M03429J70852J199913r1976L84327R27054M40454L43004Q02827
16770A7977376M09036R05507L41075J123091P83620O27269J067226P72327N88713
16761B4595240J349537J102117J022038J263339J254122J227414J347153J701513
16753C4862473J572721J651931J929185J649522K439500K414138K237151K738092
16745E1494713K524210K882518L025075L848617L520312L614251M367752M678498
16737G9955946M623652M989323N439472N577125N852144O383056O809701O786389
16729A26416808O991583O953116P240848P112508O720646O435936N549902N079749
$$ y = [9974648, 10305367, 10473060, 11020117, 11475574, 11823183, 12168901, 12411116, 12956408, 12905002, 13397492, 13800921, 13971773, 15171686, 15079710, 15464037, 16391091, 16831545, 17174549, 17977376, 18386412, 19291919, 19632994, 20756085, 21539705, 22166974, 23234200, 24006527, 24595240, 25944777, 27046894, 28068932, 29332271, 30586393, 31813807, 33160960, 34862473, 36435194, 38087125, 40016310, 41665832, 44105332, 46519470, 48756621, 51494713, 54018923, 56901441, 59926516, 63775133, 67295445, 70909696, 75277448, 79955946, 84579598, 89568921, 95008393, 100585518, 106437662, 112820718, 119630419, 126416808, 133408391, 140361507, 147602355, 154714863, 161435509, 167871445, 173421347, 178501096]
16721A78501096L668092K890800J982896j99998o97072k197379k872940m650182
16713A76425313n357542o255170o540719p657187p109708p448821p032697p156247
16705A21867222p370317o630625o435977o281958n747060n270125m746608m725661
16697G4658891m310954m232734l722334l705793k955064l204052k775214k913952
16689D6838794k351010k202037k084463k415981j710600j648456j656638j561320
16681C1208289j016228j364775j421661j476221j065621r20828j085891q88595
16673B1968469r66672o97484p95420j080442l82693o97655m92766o13857m24600
16664A5816880l57078r04755m46100j095177L22945p89947R5945n52201n37012
$$ y = [178501096, 182169188, 185059988, 187042884, 186842886, 186145814, 183948435, 181075495, 176425313, 171067771, 164812601, 158271882, 150614695, 143504987, 136056166, 129023469, 121867222, 114496905, 107866280, 101430303, 95148345, 89401285, 84131160, 79384552, 74658891, 70347937, 66115203, 62392869, 58687076, 55732012, 52527960, 49752746, 46838794, 44487784, 42285747, 40201284, 37785303, 36074703, 34426247, 32769609, 31208289, 30192061, 28827286, 27405625, 25929404, 24863783, 23942955, 22857064, 21968469, 21001797, 20304313, 19508893, 18428451, 18045758, 17348103, 16855337, 16241480, 15816880, 15459802, 14555047, 14108947, 13013770, 13336715, 12546768, 12642713, 12090512, 11553500]
16655A1553500k78403l13586m49862l88677k63175k72517M2488j42737q24182
16646H662849K87397q55425L41749m20094j65077o7747l74241R936k20068m77271
16636F722008j54860j2630k30329Q131o33771K05930N9059l62806n9823j0840
16626E530069l59858J52066n51644M27498n07050m1351n34151N20235j45889j68325
16616D321600k35482J41935q3450N0139m10107L57763k05294l11173n3373k0128
16606C552430J18675M8905j33952r7441K1208k44562J17461k32017j73134K53662
16596C231235K1708o09614J26101J62292k0821p9421k21172J28569j25172j10369
16586B503336j63522L26394l53365J41044J91110j70569j19297l37378R4594j5069
$$ y = [11553500, 11275097, 10961511, 10511649, 10122972, 9859797, 9587280, 9629768, 9487031, 8662849, 8950246, 8094821, 8436570, 8016476, 7851399, 7783652, 7409411, 7419347, 7199279, 6722008, 6567148, 6554518, 6324189, 6332320, 5698549, 5904479, 5963538, 5600732, 5540909, 5530069, 5170211, 5322277, 4770633, 5198131, 4691081, 4649730, 4115579, 4635814, 4489925, 4321600, 4086118, 4228053, 4144603, 4194742, 3784635, 4142398, 3937104, 3625931, 3572558, 3552430, 3671105, 3720010, 3586058, 3488617, 3509825, 3265263, 3382724, 3150707, 2977573, 3231235, 3252943, 2643329, 2769430, 2931722, 2910901, 2831480, 2610308, 2738877, 2613705, 2503336, 2339814, 2666208, 2312843, 2453887, 2644997, 2474428, 2355131, 2017753, 2112347, 2097278]
16576B097278J73646j9954j20982p0707o9913j44561m6115P656K90420l91076
16566A705692J0778M4355L25049l22550N2797m69173M21449O6817M200j88751
16556A650663k47350k01119Q34789m11879l64689R8780M4715r6652L36050j47032
16546A496276P0148J5208l4324k71653p9364m3448L32801N4864l82232m3748L26446
16535A440974o11567J92698O0903J66792o2669O1687n23183J01157N95163j10122
16525A311833j14037m20507K98294m5645L93811l43123l28017L63005n6384n6095
16515A003135j27939K39895j81191L75239k87825j13196j48592K47313j98153
16506H08686J38857m8987P1644j50144J34678J80739j42868k64885j74705K55862
$$ y = [2097278, 2270924, 2250970, 2129988, 2059281, 1989368, 1844807, 1798692, 1806348, 2096768, 1705692, 1716470, 1760825, 2085874, 1763324, 1816121, 1346948, 1768397, 1835214, 1839414, 1650663, 1403313, 1202194, 2036983, 1625104, 1260415, 1359195, 1403910, 1307258, 1643308, 1496276, 1566424, 1581632, 1547308, 1275655, 1196291, 1152843, 1485644, 1540508, 1158276, 1114528, 1440974, 829407, 1022105, 1083008, 1249800, 1187131, 1248818, 725635, 826792, 1421955, 1311833, 1197796, 777289, 1075583, 1029938, 1423749, 1080626, 752609, 1115614, 1059230, 1003135, 875196, 1115091, 933900, 1309139, 1021314, 908118, 759526, 1006839, 808686, 947543, 898556, 970200, 820056, 954734, 1135473, 992605, 727720, 553015, 808877]
16496H08877q7721Q2179j21765K77801C74923J08355L47746J25626k60345j13976
16486E82329L36743k4059r3115j29015j132K13914l39970K33709K62002E12180
16475G06969o2958R906M4081j52319M90141m33463K1701r5445j005j483K28314
16464G54439C21448K70077M53549n17841J0075k21267N27021k17183Q6678B04000
16453D26964M31845C11790K75841j95185K04899r6061p3024M6812J8422N4654
16443E48148A60542M23132k8936N2550k08124J8169p2575j44346M09021I7771
16432G35651j94379k03211J38385j66341o5759L9678J0509R3908l0400k7313M14657
16421G45385j98492k06732m6718M22088C12217P3860j80779M96069j24714j26105
$$ y = [808877, 721156, 803335, 681570, 959371, 374923, 483278, 831024, 956650, 696305, 582329, 919072, 895013, 801898, 672883, 671751, 885665, 545695, 779404, 1041406, 512180, 706969, 644011, 653917, 697998, 545679, 1035820, 602357, 624058, 528613, 527608, 526125, 754439, 321448, 591525, 1045074, 527233, 537308, 316041, 843062, 625879, 712557, 204000, 426964, 858809, 311790, 587631, 392446, 597345, 501284, 428260, 475072, 493494, 548148, 160542, 583674, 554738, 607288, 399164, 417333, 344758, 200412, 609433, 97771, 735651, 541272, 338061, 476446, 310105, 244346, 284024, 294533, 388441, 358041, 330728, 745385, 546893, 340161, 293443, 715531, 312217, 386077, 205298, 701367, 576653, 450548]
16411D50548k00908K06712K59478B24397K04342B0876m492K36551b5623D83868
16400C26409q7289K47292j49179K0491l5454H4810K22147o9085K33706a59790
16389G94171B59169L4299A02558L1161K79804q8497p3461J77614j86382j19635
16379A23162p166M18561A19843J81422O8404j29243J80630k903D9925O21753C33353
16367E8628J60538o8686K07322K36754B60179l0364G2258L37273O8883A05224
16356B72749n5204J798k9112l1450N2702E1523P9236M4234J24454J2877k453L68726
16344F78597B60300R902J5613q592N259J91348A98013M7505b84195G1375L76772
16333D48147A73771B5729J79516J91803J0105A63500R0513j6328a07434E624J56721
$$ y = [450548, 249640, 456352, 715830, 224397, 428739, 20876, 16384, 252935, -25623, 483868, 326409, 239120, 486412, 337233, 357724, 322270, 84810, 306957, 237872, 471578, -159790, 794171, 259169, 293468, 102558, 133719, 413523, 325026, 251565, 429179, 242797, 123162, 115996, 534557, 119843, 301265, 369669, 240426, 421056, 418153, 49925, 671678, 333353, 58628, 219166, 150480, 357802, 594556, 260179, 229815, 72258, 409531, 478414, 105224, 272749, 217545, 219343, 190231, 158781, 211483, 51523, 130759, 174993, 299447, 312324, 309871, 678597, 260300, 270202, 285815, 277223, 282482, 473830, 198013, 245518, -284195, 71375, 448147, 173771, 25729, 205245, 397048, 407153, 163500, 254013, 237685, -107434, 5624, 162345]
16322A62345J1795F1088a34316A94189J38210e7149B56041m5938j7648M9288j9222
16311B22521E7838K51894d3036p1048q0845H7334N6844C3477Q9342P5868e4494
16299B55912j1671g6062q6592F0374J15442i4042A29561b6733D2261a00771B64506
16287i7656j57351A94129G4982K76940J36514c17442B05278J69948r5074E2187
16276A44642a42298A20161b19232A10733A3184R3328j2998Q1609j5327a06004
16265C80251B3812J22486b48506A92273O7140r7760o7403j9179a14708A85142
16254F3705e1380A17762a24259C86417J04400E9596f0097k7212A29050l9942M3665
16243A32773b4612a2233B67784j15755B3752M0393a16322d1554A77512a28407
$$ y = [162345, 174140, 61088, -134316, 194189, 332399, -57149, 256041, 210103, 192455, 241743, 222521, 57838, 309732, -43036, -114084, -194929, 87334, 144178, 33477, 122819, 198687, -54494, 255912, 244241, -76062, -162654, 60374, 175816, -94042, 129561, -26733, 42261, -100771, 264506, -97656, -255007, 194129, 74982, 351922, 488436, -317442, 205278, 375226, 280152, 52187, 144642, -142298, 120161, -219232, 110733, 13184, 106512, 93514, 175123, 159796, -106004, 380251, 23812, 146298, -248506, 192273, 259413, 161653, 94250, 75071, -114708, 185142, 63705, -51380, 117762, -124259, 386417, 490817, 59596, -60097, -87309, 129050, 89108, 132773, -24612, -12233, 267784, 152029, 23752, 64145, -116322, -41554, 177512, -128407]
16232A11657j0496l2450K83319j44721k2128J356A40a1948A9295Q8156P2189H821
16219I1206J00039A9869b08595G0794a24859m7697D2251g7298o7616B22539k7138
16208A95401q6543c04306A97069n8341a14270q4676B03829a55002B59737b31196
16197a27152j8463A47914J18542b8204B56685k8765d46681e2744A56134a34630
16186A17314a04785J6181m9962L7804b394E2695K03811D1739b43873A80552a88518
16174A11809K4468k1055c3733f567C36377A57063Q7109D1067K826J97720g7530
16162e5314K5019k65762J47445A00343a1521p5959a1167k32742G3200j2578a55755
16150B18728k5695C5299a33348o7757A63479K3237l9667n5843Q4298N4070E113
$$ y = [111657, 101161, 68711, 352030, 207309, 185181, 186537, 140, -11948, 19295, 107451, 179640, 8821, 91206, 191245, 19869, -208595, 70794, -124859, -172556, 42251, -77298, -144914, 222539, 195401, 108858, -304306, 197069, 138728, -114270, -198946, 203829, -155002, 259737, -231196, -127152, -145615, 147914, 266456, -28204, 256685, 227920, -446681, -52744, 156134, -134630, 117314, -104785, -88604, -138566, -100762, -2394, 52695, 256506, 41739, -243873, 180552, -188518, 111809, 136277, 115222, -33733, -6567, 336377, 157063, 244172, 41067, 43893, 241613, -77530, -55314, -30295, -296057, -148612, 100343, -11521, -87480, -11167, -243909, 73200, 60622, -155755, 218728, 193033, 35299, -133348, -201105, 163479, 186716, 147049, 91206, 175504, 229574, 5113]
16138E6867a21584b6994I5649a00531B29787G0209b5984D3676g4423K2456j09899
16127a61866A66467C0542h1832E9180f5310E6892J23476G1839E884b7459E9813
16115c32067h722A20229a1155A95351b6900l0714r1964A56303k8254F2886j6758
16104D6128A6564P8878K49296a56951B43829O099A2414b45316K0997C26011B1957
16092A58349a55019D05316A42715A113g3529q8980I6895a09486G1138l5297O5154
16081A00995b49344m3548g7632C62625j53251e01073A72916d8584J8216A7833
16070A07868a9097A15372b71297a5194C55213A5814J38950E5214a61479F3949
16059i7694k8754A059J9824M1704e6024l4456H1431Q1104c31309B09660q2284
$$ y = [56867, -121584, -26994, 95649, -100531, 229787, 70209, -25984, 43676, -74423, -51967, -161866, 166467, 30542, -81832, 59180, -65310, 56892, 180368, 71839, 5884, -27459, 59813, -332067, -8722, 120229, -11155, 195351, -26900, -57614, -149578, 156303, 128049, 62886, 46128, 16564, 95442, 344738, -156951, 243829, 249928, 12414, -245316, -224319, 326011, 21957, 158349, -155019, 405316, 142715, 1113, -73529, -162509, 96895, -109486, 71138, 35841, 100995, -249344, -292892, -77632, 362625, 209374, -501073, 172916, -48584, -30368, 17833, 107868, -19097, 115372, -271297, -15194, 355213, 15814, 154764, 55214, -161479, 63949, -97694, -126448, 1059, 20883, 62587, -56024, -90480, 81431, 162535, -331309, 209660, 127376]
16048A27376c3030B23223E5416Q5530g4429B10810b51924f7604A00160N4844g3143
16036B61625d240D7759J9730L9182c51000g2772j13179A15475M67829k56863c64795
16024A26140P2929c5618l91326C2045b66838A74179M8224B6788i7729k6428c7379
16012b48873J13093F6714d8714a788j15059A67676b16749j86363R0007O5268R9000
16001a48837B9901L56212a93292C0960c73345e9480j82380B61331J13061k5841
15991C48551a59753E3757a05605B16121r2648J95846C8612b49181A79489J09567
15981B89056j9528M3463H045J45319i706D04397c02634H9281c7276m17751b10404
15969c9487F9182a34860C45033j16872g3442K8764A06999C0792O3189a07154n1721
$$ y = [127376, -33030, 223223, 55416, 140946, -74429, 210810, -251924, -67604, 100160, 155004, -73143, 261625, -4240, 47759, 67489, 106671, -351000, -72772, -185951, 115475, 583304, 326441, -364795, 126140, 199069, -35618, -426944, 32045, -266838, 174179, 222403, 26788, -97729, -124157, -37379, -248873, -135780, 66714, -48714, -1788, -116847, 167676, -216749, -403112, -313105, -247837, -148837, 29901, 386113, -193292, 30960, -373345, -59480, -241860, 261331, 374392, 348551, -159753, 53757, -105605, 216121, 123473, 319319, 38612, -249181, 179489, 289056, 269528, 312991, 8045, 153364, -9706, 404397, -302634, 89281, -37276, -455027, -210404, -39487, 69182, -134860, 345033, 228161, -73442, -44678, 106999, 30792, 93981, -107154, -158875]
15958a58875F6748f1121A46314B0445c4517E0279k2506a17045K5177k04586C5486
15946a31083f3074J1764A07628m2547b20455B44413d00806f8788j24886k69946
15936d63620a00366n75914a60693k49330h3501C4222b03166M9994j52184J04140
15926b01216M5401H5591J00917e3147j61434K9138D978J28742b21082A69330K7282
15915A96612j2928b27102P2924c7771A12904l9902k4792b97146o68h9411m9666
15904a39077J10B3985K652c2583a1684J703B17672a44252j99546c8357j26889
15893a65246A1480b64500m6274a17398K2647A19765b62979A50163J93160b74381
15882h6078m067G0531J94723J2086C6443d17471A03179b04340o3335l0615a7581
$$ y = [-158875, 66748, -61121, 146314, 20445, -34517, 50279, 27773, -117045, -91868, -296454, 35486, -131083, -63074, -51310, 107628, 65081, -220455, 244413, -400806, -68788, -193674, -463620, -100366, -676280, -160693, -410023, -83501, 34222, -203166, -153172, -305356, -201216, -155815, 85591, 186508, -53147, -214581, -185443, 4978, 133720, -221082, 169330, 196612, 183684, -227102, -154178, -37771, 112904, 73002, 48210, -297146, -297814, -89411, -139077, -138967, 23985, 26637, -32583, -11684, -9981, 217672, -144252, -343798, -38357, -165246, 11480, -264500, -310774, -117398, -94751, 119765, -262979, 150163, 343323, -274381, -86078, -90145, 70531, 265254, 277340, 36443, -417471, 103179, -204340, -267675, -298290, -17581]
15870a28750B26113a27350e878j28k50241F7036K17757f7906k40739a23327F6135
15858A21002b82793I4370b91253D8898g6587J3889B47944k4697m4082b21118n0472
15847b71590E7990b73554a02200j25168A46071B3174J01823L2883d996A251d1250
15835a58063d8307A89005g3879N238j6900L547L0830B9330J2565D215a28314l10979
15823d39293a46679n5790i063A33729c3705B73419e16616A5485a09851q136j17440
15812b35427b5607j67452R4973o61b1752A52300A7640f8596K7810k54940J32516
15801a63210K3771D02133A72489k6528b9098A15005B203c20239c3480c455n0994
15790e4449G7104k5237j9969N3775J12520b371C07687a34172E70582D7595K39060
$$ y = [-128750, 226113, -127350, -5878, -6006, -256247, 67036, 284793, -67906, -308645, -123327, 66135, 121002, -282793, 94370, -291253, 48898, -76587, -62698, 247944, 223247, 179165, -221118, -271590, 57990, -273554, -102200, -227368, 146071, 23174, 124997, 157880, -4996, 1251, -41250, -158063, -48307, 189005, -73879, -68641, -85541, -81994, -51164, 29330, 41895, 4215, -128314, -439293, -146679, -202469, -9063, 133729, -33705, 273419, -516616, 15485, -109851, -117987, -235427, -25607, -193059, -98086, -98747, -21752, 152300, 17640, -68596, -40786, -295726, -163210, -139439, 402133, 172489, 145961, -29098, 115005, 2203, -320239, -33480, -3455, -54449, 77104, 51867, 31898, 85673, 198193, -2371, 307687, -134172, 570582, 47595, 286655]
15779B86655g9266l6490o6535E5890a61931B24738C1865J38811J56883a53635
15768A44029m7696d49455C965K39973p3722G023b31105A30509J39187a97870B21537
15756H8704J92916j13349o9978e3675j77989E6176a55671J7477D50688a5217C45949
15744a26550l4399L7994j13977G59N8090a20336F4539J2887b03721I3448K46045
15733C39493b07746p1528e0940E9679b03583m5646a01082E3923Q0860J50351A13095
15721c9747j28517F0076K52403b42551d607H4612c7795j70105M7516Q273C01478
15709f961B1526d78k17317P2363e1937A19577f0230j20006O510M8281j04135h6850
15696a90860B40199c7795C56421c47668i9442F0778R3869n5045M1160e2647a3106
$$ y = [286655, -79266, -115756, -182291, 55890, -161931, 224738, 31865, 170676, 327559, -153635, 144029, 96333, -449455, 3965, 243938, 170216, 7023, -231105, 130509, 269696, -197870, 221537, 88704, 281620, 168271, 98293, -53675, -231664, 56176, -155671, -138194, 450688, -15217, 345949, -126550, -160949, -122955, -236932, 759, 58849, -120336, 64539, 77426, -203721, 93448, 339493, -207746, -279274, -50940, 59679, -203583, -249229, -101082, 53923, 134783, 285134, 113095, -39747, -168264, 60076, 312479, -242551, -4607, 84612, -37795, -207900, -160384, -152111, 301478, -6961, 21526, -478, -217795, -145432, -51937, 119577, -60230, -180236, -173726, -125445, -229580, -86850, -190860, 240199, -37795, 356421, -347668, -99442, 60778, 154647, 99602, 140762, -52647, -13106]
15684b8635j00836j40047K6845i4833K3811n5160b3745j04530B65457G7660g7476
15672c26100A63575j3314N008l3902j5635b2390B63592J67998a93847F5659b58780
15660A05230l5408a81794j41930D7616J62916h7605j40583A6771J76424b87581
15649b12818L2647A44337o1391k5271a56419A97163H9605c50741B0097a53223
15638h2088a7212o1637B003a94528B5505J96586a61780j72687a14729e157j9032
15627b4189A45883b8275l07100G0925d7370p2000k51780a08004A15714N5003b07153
15615d172B2111c63781J13284A60271F834a44704B8093f4330A37046D2746a65034
15603d2343A59876a12217j63126A24317J86080D5930K0156f580G4133a40282B54922
$$ y = [-28635, -129471, -269518, -242673, -94833, -71022, -126182, -23745, -128275, 265457, 77660, -77476, -326100, 163575, 150261, 155269, 121367, 105732, -22390, 263592, 431590, -193847, 65659, -258780, 105230, 69822, -181794, -323724, 47616, 210532, -87605, -228188, 16771, 193195, -287581, -212818, -180171, 144337, 82946, 57675, -156419, 197163, 89605, -350741, 20097, -153223, -82088, -17212, -78849, 2003, -194528, 25505, 222091, -161780, -334467, -114729, -5157, -24189, 145883, -28275, -335375, 70925, -47370, -119370, -371150, -108004, 115714, 170717, -207153, -4172, 22111, -363781, -250497, 160271, 6834, -144704, 28093, -64330, 137046, 42746, -165034, -42343, 159876, -112217, -275343, 124317, 310397, 45930, 66086, -6580, 74133, -140282, 254922]
15591b87728J9872O6565B673b3803k10864Q8612d8291B05991H2734N7664a14966
15579c910j22092B36120h7816L2373A84045c2131N937D5548c22936D7391M56060
15568E03451a31757q899A85641J31734a9299o301f761j11262J8508k04860A18809
15556B47357C4348h6001A31239l0052D8864a95663q9170a22465j75900B66860
15545I0599b15973F0189o230a46718H7217a17544C25965A38075J552g1556r033
15534h0589q8793O6688j10695B8343M7756a28886A58054a88216B69840i7896l6512
15523a34408j1648J570e7976j17006H3506P1938a2729j70625N5116a2736A5399
15511f3737B00933o6722b1203I471D310a26086A46713n1321A6240b85438B01431
$$ y = [-287728, -267856, -201291, 2673, -23803, -234667, -146055, -48291, 205991, 82734, 140398, -114966, -3910, -126002, 236120, -87816, -55443, 184045, -32131, -26194, 45548, -322936, 47391, 503451, -131757, -140656, 185641, 317375, -19299, -25600, -6761, -118023, -99515, -304375, 118809, 247357, 34348, -86001, 131239, 101187, 48864, -195663, -284833, -122465, -298365, 266860, 90599, -215973, 60189, 53959, -146718, 87217, -117544, 325965, 138075, 139627, -71556, -80589, -169382, -102694, -213389, 28343, 76099, -128886, 158054, -188216, 269840, -97896, -134408, -146056, -144486, -57976, -174982, 83506, 155444, -12729, -183354, -128238, -12736, 15399, -63737, 200933, 134211, -21203, 9471, 4310, -126086, 146713, 95392, 16240, -285438, 201431]
15499A47991J20774a26052B3603a56190b3721B60794a08832A44826a32502A78694
15488G6134b3541k47446f3931j1816A53870e8250o5505j26877j45617A4964K19684
15477B34648c45247E7975a70001l0730A78392a06045C26510J60673C0913b56791
15466A14131n179E044g9394B04571b2536A38093a44930A32078c79013a14836q7962
15455b02798F728b86915A3371K66029b06647A49958J32112C2550J86590d3409
15444c54851a08913c4262A15687a70464f1145m9043K5728A95074a72680I7112
15433a78179A77675G8375L01939f9937p8360A30943a65388d3742r7969n5300A10059
15421C3332b9178H6878a2239j1525A40381P197a16694H3325j2551Q4628k1308
$$ y = [147991, 268765, -126052, 23603, -156190, -23721, 260794, -108832, 144826, -132502, 178694, 76134, -23541, -270987, -63931, -75747, 153870, -58250, -123755, -250632, -396249, 14964, 234648, -345247, 57975, -170001, -200731, 178392, -106045, 326510, 487183, 30913, -256791, 114131, 108952, 5044, -79394, 204571, -22536, 138093, -144930, 132078, -379013, -114836, -202798, 6728, -286915, 13371, 279400, -206647, 149958, 282070, 32550, 219140, -43409, -354851, -108913, -34262, 115687, -170464, -61145, -110188, -84460, 195074, -172680, 97112, -178179, 177675, 78375, 380314, -69937, -148297, 130943, -165388, -43742, -141711, -197011, 110059, 33332, -29178, 86878, -12239, -23764, 140381, 147578, -116694, 83325, 70774, 155402, 134094]
15410A34094m7321a05300A8072f562E5107f7731E8269a65401a4244A25839a02247
15398a24997I0148a26054C3327M7143g2255B10755O6248H033b63700a17030j5083
15387a32113A74493a4648C5322J53132J2762O5597r5908b4701p5723r1384B13553
15375a73493p2516B82300a11230N2696J9064B2567b87908e7526A55312N6600C3407
15363b7754C2127M22325A83003H8560o395C3819f2510A19105b03648A42931K0803
15352A63734K463d0061k22593O1799A07843D3631g4439k24264G5794a0546E2433
15340A95512b02479N714B3909K18345a15995A9040K34614a89279A71891c43399
15329b65025a14128C79969A20301a49932I4635J29204A5889a5832B18100g4605
$$ y = [134094, 86773, -105300, 18072, -6562, 55107, -67731, 58269, -165401, -14244, 125839, -102247, -124997, 90148, -126054, 33327, 80470, -72255, 210755, 277003, 8033, -263700, -117030, -132113, 174493, -14648, 35322, 188454, 201216, 266813, 170905, -24701, -100424, -191808, 213553, -173493, -246009, 282300, -111230, -58534, -39470, 22567, -287908, -57526, 155312, 211912, 33407, -27754, 32127, 454452, 183003, 88560, 82165, 33819, -62510, 119105, -203648, 142931, 163734, 166197, -40061, -262654, -200855, 107843, 43631, -74439, -298703, 75794, -10546, 52433, 195512, -202479, -196765, 23909, 242254, -115995, 19040, 253654, -189279, 171891, -343399, -265025, -114128, 379969, 120301, -149932, 94635, 223839, 15889, -15832, 218100, -74605]
15318B0067N53270C6107J7416a18647C01410c1988q4081n7751M9621A30941b18552
15306b24926H5630N2155a97575I878J75362b00358C1205M2847R8898a58706E5637
15294c2737a4247A19995E2064j6661L68029b48007K7567a7284M71A82174b34552
15282D08592c42358B78714a41026K9187C9495j852c4218k35990A70060m4100m9984
15271G5976c950C8113O985e5813A69633K18154a88984f5111E33153f9984B69940
15259c2525A44755L54830A99417a997A3317M69790D4120K67899C430K71602L7063
15248C12095M66379O71373l17720J10796K91278F43247F1216K11456e5825A59950
15237c23972b6806G5801e2237A54371b8406A02553K02119a90573A69682b22131
$$ y = [20067, 573337, 36107, 53523, -118647, 301410, -31988, -116069, -173820, -124199, 130941, -218552, -224926, 85630, 137785, -197575, 9878, 185240, -200358, 31205, 74052, 172950, -158706, 55637, -32737, -14247, 119995, 52064, 35403, 403432, -248007, -220440, -17284, -16813, 182174, -234552, 408592, -342358, 278714, -141026, -111839, 39495, 37643, -34218, -270208, 170060, 125960, 75976, -3950, 38113, 45098, -55813, 169633, 387787, -188984, -65111, 533153, -69984, 269940, -32525, 144755, 499585, 199417, -1997, 13317, 483107, 44120, 312019, 3430, 275032, 312095, 778474, 1449847, 1132127, 1242923, 1534201, 643247, 61216, 272672, -55825, 159950, -323972, -26806, 75801, -52237, 154371, -28406, 102553, 304672, -190573, 169682, -222131]
15226e8480F7690i233G5990L05141A71262j8944A3944K38700j14621L61106A19946
15214i4632A66599b43761G1565d1242B79501j29517l479O6463p7082P3247r7700
15203A11433e0848K4945D35635A86388n2501A2197a39840B25640k5342r0551b3988
15191a05174A15752D6241r220b27480D8819J36131c7955G5263b90796A46337O9812
15180B16149C9845f8797D2899J89138b16110D26958C3629b74738I923f9430B98176
15168A9993M77671A20721K93731L2431b5491A86089A2942J64349I595K6239h8429
15156H0079K13889F6496n89b52199p8555A43628d6704A31452N2909J75636j47360
15145B12637d8793b2604A74260D2489K11440j14017C9422N72J63145k2813J20371
$$ y = [-58480, 67690, -9233, 75990, 381131, 171262, 152318, 13944, 252644, 138023, 499129, 119946, -94632, 166599, -243761, 71565, -41242, 279501, 149984, 146505, 212968, 135886, 209133, 111433, -50848, -25903, 435635, 186388, 133887, 12197, -139840, 225640, 200298, 109747, -23988, -105174, 115752, 46241, 37021, -227480, 48819, 184950, -37955, 75263, -290796, 146337, 216149, 39845, -68797, 42899, 232037, -216110, 426958, 33629, -274738, 9923, -69430, 298176, 19993, 497664, 120721, 414452, 446883, -25491, 186089, 12942, 177291, 9595, 35834, -88429, 80079, 293968, 66496, 65907, -252199, -330754, 143628, -46704, 131452, 184361, 359997, 212637, -48793, -22604, 174260, 42489, 253929, 139912, 39422, 39994, 203139, 180326, 300697]
15134C00697c9970B42434q6728c5844r6204d20I1919a59594g2693E12723c7091
15122A64140B6509K86037j48932b6991A64829L2431o8211J9157R4730p854i6895
15110H1574a78220D7800J03616a08292B55076B2579O2052M6943J23114j00972
15100A53716L25409a15876G8803r025f5868b2783B20654L5056A15490e1885B30751
15088B53750N0639I5326K42129j55049J63157A14615J3843a40165A19599L85925
15078E05524c58794A67279P4816A14602n6624J97651F9052N1088C4134J20465
15068A54599N7980H680M73842A04282J08407P677r8617a22140G8666d7998A11734
15056A18045Q6055K60802a52517A89772J53874a58909g6805A94551e545A97506
$$ y = [300697, -39970, 242434, 155706, -35844, -132048, -420, 91919, -159594, -72693, 512723, -37091, 164140, 26509, 312546, 163614, -26991, 164829, 197260, 129049, 148206, 242936, 235082, -96895, 81574, -178220, 47800, 151416, -108292, 255076, 22579, 84631, 131574, 254688, 153716, 479125, -115876, 78803, 69778, -65868, -22783, 220654, 255710, 115490, -51885, 230751, 253750, 304389, 95326, 337455, 182406, 345563, 114615, 128458, -140165, 119599, 505524, -358794, 167279, 242095, 114602, 57978, 255629, 69052, 120140, 34134, 154599, 212579, 8680, 482522, 104282, 212689, 220366, 121749, -122140, 78666, -47998, 111734, 118045, 204100, 464902, -152517, 189772, 343646, -158909, -76805, 194551, -5545, 197506]
15045A22625K33510A39121K13711A03489c7680F5487M86670A68458C8957J21408
15035A60365p4745C1174J71911l4190A3470D27e9670I3526L3514C2050K48476
15024B80526R0668F8280c14179C05037J42039I5172L08923I1517J22877m6132
15014A68262i4500L1435A10657O6467J05326k3988g61C2333K7372f6296h205B19953
15001B16985r8077J99281a03416B58956a83613B58048F6395J97613H5624K42139
14991C27763K31972B31111A0186L99M5361K31980M8252J35524M9777A66999C0392
14979c8459B11523Q1710L9211l495j8273B2631K96083a70192A69558l9433M31120
14968E61245j21779A70184M34293k84205k4778H0938L72109F8918O2013q447K45237
$$ y = [122625, 356135, 139121, 352832, 103489, -37680, 65487, 552157, 168458, 38957, 160365, 85620, 31174, 203085, 168895, 13470, 427, -59670, 93526, 127040, 32050, 280526, 371194, 68280, -314179, 305037, 447076, 95172, 404095, 91517, 214394, 168262, -94500, -63065, 110657, 177124, 282450, 258462, -761, 32333, 59705, -66296, -8205, 219953, 216985, 118908, 318189, -103416, 258956, -183613, 258048, 66395, 264008, 85624, 327763, 559735, 231111, 10186, 10585, 55946, 287926, 336178, 471702, 521479, 166999, 30392, -38459, 211523, 293233, 332444, 328949, 310676, 22631, 318714, -170192, 169558, 130125, 561245, 439466, 170184, 604477, 320272, 295494, 80938, 453047, 68918, 130931, 122484, 367721]
14957C67721I7507c0913B8884L50484A61062J09067l2761I9376b0500A55640K87934
14946D43574b84608E17935A88326r4103J06101L02701k48634K15667j50251A44420
14935C22215A52946K63613j85578O5767J8810F1257K55744J80668A38237a81852
14924A38746J57272K85879B70717o7756F7761K32700a23221C5946J74952C7782
14913E54795B08944J45976A22482K33803m7858A48914L47653F509K23712K80218
14903E10439o6819q1457J86033k39131I1110K35332J31770e2149E95388j77829
14893D17559j27108I3370J65034J17485J57457A26113O77658B94885P2941L21739
14883F89565l17687M879q6622r2780L76696b2238B68537L8679A29961K22701n9140
$$ y = [367721, 97507, -30913, 28884, 379368, 161062, 270129, 237368, 99376, -20500, 155640, 443574, -284608, 517935, 188326, 94223, 200324, 503025, 254391, 470058, 319807, 144420, 322215, 152946, 416559, 230981, 296748, 315558, 61257, 317001, 497669, 138237, -181852, 138746, 296018, 581897, 270717, 202961, 67761, 300461, -123221, 35946, 210898, 37782, 554795, 208944, 354920, 122482, 356285, 308427, 148914, 496567, 6509, 230221, 510439, 443620, 362163, 548196, 309065, 91110, 326442, 458212, -52149, 595388, 417559, 290451, 93370, 258404, 375889, 533346, 126113, 803771, 294885, 367826, 689565, 371878, 376757, 290135, 197355, 574051, -22238, 268537, 307216, 129961, 352662, 293522]
14872B93522m3021M4519k3531K28535j37901n9329Q4993Q6776I3985a23071B89398
14860D63884r2337j54889J83919R3776q799P1140I57N12457j65760l6870J07229
14849D18013J16521l4083D6117L00058K67191k71020o78l3041P0709j73222k8373
14838A77741J01290n9479R2732K64817J75276B53276K6825K80561P2595l06992
14828C26265m1500j19737J93211K74583B32695Q5168J42467m4880Q4861m4363
14818D55948P6615j24905K7098M21616k68027J95090B73748l7785J28213J06012
14808D70188M0293k6983O730j69551L01273k27733k0617A28590K8535J33552j0714
14797B79963N7155K50732J38923J4631m217j14366k05847K16765n2783J37440
$$ y = [293522, 250501, 295020, 271489, 500024, 362123, 302794, 387787, 474563, 93985, -123071, 289398, 463884, 371547, 216658, 400577, 494353, 485554, 556694, 957, 513414, 347654, 310784, 418013, 534534, 500451, 46117, 346175, 613366, 342346, 341668, 308627, 379336, 206114, 177741, 279031, 219552, 312284, 577101, 752377, 253276, 280101, 560662, 633257, 326265, 284765, 165028, 358239, 632822, 232695, 317863, 460330, 415450, 500311, 455948, 532563, 407658, 434756, 856372, 588345, 783435, 273748, 235963, 364176, 470188, 510481, 483498, 490228, 320677, 621950, 394217, 373600, 128590, 157125, 290677, 279963, 337118, 587850, 726773, 741404, 737187, 622821, 416974, 633739, 580956, 718396]
14787G18396B28500N22917p5603j00067j08369J80529J59039k70356p3115j16132
14777C47343J98386L5971J34105l45900N4665r1382j4884J1219M11991k96456
14767D45058K56624O0629r7940j45280L2198n6327k10433L80984o2997K3784r2342
14756E33958j05342Q3394R3931J51535j73628J72175l15942M3163J83847K92275
14746I59366D10431o8037L37780j1813K44111R4215l00767k43763L21188O4335
14736H47680O9450r33M9935C10925M74861k59919K22797L3989C55153M54942k20334
14725E89761k36552K28254J07352K29768C61306P49513m05892M8847L66057m73597
14715F46234J26569K00683k94623j10466K03679J26289r1216k91875P43737n35167
$$ y = [718396, 228500, 751417, 675814, 575747, 467378, 647907, 806946, 536590, 463475, 347343, 545729, 581700, 715805, 369905, 424570, 333188, 318304, 329523, 741514, 445058, 701682, 762311, 664371, 519091, 551289, 494962, 284529, 665513, 602516, 626300, 533958, 428616, 512010, 605941, 757476, 583848, 756023, 440081, 483244, 667091, 959366, 410431, 342394, 680174, 668361, 912472, 1006687, 705920, 462157, 783345, 847680, 917130, 916197, 966132, 310925, 785786, 525867, 748664, 782653, 355153, 810095, 589761, 353209, 581463, 688815, 918583, 361306, 1110819, 704927, 753774, 1119831, 646234, 772803, 973486, 678863, 568397, 772076, 898365, 807149, 515274, 1259011, 723844]
14705G23844j84016K79902q1930L56866j70368j57885j07049j2061M0413K42839
14695I30555j81537J53322J58790D86499L37463J02515p0031J48847m51212M53183
14685A007264o4428k7888J7176l40724K64715J47750n3769O7889O6533j9608J00077
14674A164987m16541K53544n4198R7220k83791M64538n14966K88263j1152L18235
14664A306139k6415k78478J86545m10862M16032k18070Q5746j70682K16848K6830
14654A133633p5674j7725j21656R8463o9764J33312J7697n8891O585J8736K6685
14643A091401p5534j6757m1336L18852P6856j44630j39536K72150j32652j1901
14633A196913p5698J20857K0584K17124r0539p4418k18998k58348N25554m02625
$$ y = [723844, 539828, 819730, 737800, 1094666, 924298, 766413, 659364, 647303, 687716, 930555, 749018, 902340, 1061130, 486499, 823962, 926477, 856446, 1005293, 554081, 1007264, 942836, 914948, 932124, 591400, 856115, 1003865, 950096, 1017985, 1084518, 1064910, 1164987, 748446, 1001990, 947792, 1045012, 761221, 1225759, 710793, 999056, 987904, 1306139, 1279724, 1001246, 1187791, 776929, 1192961, 974891, 1060637, 889955, 1106803, 1133633, 1057959, 1040234, 918578, 1017041, 947277, 1080589, 1098286, 1039395, 1045980, 1064716, 1091401, 1015867, 999110, 957774, 1276626, 1353482, 1208852, 1069316, 1341466, 1208814, 1196913, 1121215, 1242072, 1262656, 1479780, 1389241, 1314823, 1095825, 837477, 1363031, 960406]
14623I60406J87655l5489P0862J49832K30728k56634J37525O4597j19467m21570
14613I68445K77344L80641j51972k67919P6260o1773P4189M23907m57466L48084
14603A609740N3756k50694P1186K55132l15649j53326K67708k73078L64646j14674
14593A514747p2824K66582K15393k14434J01213j22482k29710M9939N75991l48517
14583A735898K5091k3642K92158k75436j27514Q8543K05632L6421K16443k50754
14573A922840M18840k85049L958J26851j6307j36694J89987l37220L32532L0759
14563B250497N122j28486K55154J90262J2160j71972M74645L31425J55850j49554
14553C225103M42447J96993O21883M41424J495988L785214R679887K0758864L979185
$$ y = [960406, 1148061, 1112572, 1183434, 1333266, 1563994, 1307360, 1444885, 1509482, 1390015, 968445, 1245789, 1626430, 1474458, 1206539, 1282799, 1221026, 1295215, 1719122, 1261656, 1609740, 1663496, 1412802, 1483988, 1739120, 1423471, 1270145, 1537853, 1264775, 1629421, 1514747, 1441923, 1708505, 1923898, 1709464, 1810677, 1688195, 1458485, 1508424, 2084415, 1735898, 1760989, 1737347, 2029505, 1754069, 1626555, 1715098, 1920730, 1957151, 2173594, 1922840, 2341680, 2056631, 2060589, 2187440, 2171133, 2034439, 2224426, 1887206, 2219738, 2250497, 2255619, 2127133, 2382287, 2572549, 2584709, 2412737, 2887382, 3218807, 3374657, 3225103, 3667550, 3864543, 4486426, 4927850, 6423838, 10209052, 19888939, 40647803, 44626988]
14544D4626988A9198261I309606m620063k219511m50194k65774j64398Q2227M35897
14535B107790m6209j22155n8502k28998M70630o9054k6050J2608R005k47823K28975
14524B030217P9882J28105J9477m12q6789Q9632l0929O775K62077k06034K93472
14513B585473m5857J79517j00109j42453K40578J14599j40429J38397k37584K40588
14503B832720j14720J55730O91M2891R0206M0209j80271J97656M1326l7435J56624
14492C225627n3149L75309j20730j14861j96449K27171j35048J38037R1675k7180
14482C410402J62550p4279L17775m24710K76149O79L7644L96507k67547K27017
14472D062187r5460O4510j95652L6850P6913M77432m35464K90680K82441j7034
$$ y = [44626988, 19198261, 9309606, 4689543, 2470032, 2019838, 1754064, 1589666, 1671893, 2107790, 2061581, 1939426, 1880924, 1651926, 2122556, 2053502, 2027452, 2040060, 2049065, 1801242, 2030217, 2110099, 2238204, 2257681, 2257269, 2170480, 2260112, 2229183, 2235958, 2498035, 2292001, 2585473, 2539616, 2719133, 2619024, 2476571, 2717149, 2831748, 2691319, 2829716, 2592132, 2832720, 2718000, 2873730, 2874421, 2917312, 3007518, 3047727, 2867456, 3065112, 3106438, 3069003, 3225627, 3172478, 3547787, 3427057, 3312196, 3115747, 3342918, 3207870, 3345907, 3437582, 3410402, 3572952, 3498673, 3816448, 3391738, 3667887, 3668566, 3706210, 4102717, 3835170, 4062187, 3966727, 4031237, 3835585, 3872435, 3949348, 4426780, 3991316, 4281996, 4564437, 4547403]
14462D547403j33817M45302k18110n52961K23373L90624P1189j41071K08419k13001
14452D627350n7358L12652J23227o2781l2261K43964j64278L37019J12452r9223
14442E340763J24812q7625L73806j6625r8354J33272J3201M99774O2782j92169
14432F153637N24131k90901k68465L10039K76030N5750j73278M06375j39165O6234
14422F920387K93193j1041N1032N1101J43057N0261M70720p8331J60217l00033
14412G750563M40775l5967O16819l18310J13574p7774N47576M6460k3515R8387
14402I158588J97001K09913L6941J20745N40402r3126L92263j23307J79625N93577
14392A1212622N4694R8521P7047N26507l79789P44181N1577N38840N6320j14293
$$ y = [4547403, 4413586, 4858888, 4640778, 4087817, 4311190, 4701814, 4773003, 4631932, 4840351, 4627350, 4569992, 4882644, 5005871, 4943090, 4910829, 5154793, 4990515, 5327534, 5439986, 5340763, 5465575, 5377950, 5751756, 5735131, 5636777, 5770049, 5783250, 6283024, 6345806, 6153637, 6677768, 6386867, 6118402, 6428441, 6704471, 6760221, 6586943, 6993318, 6854153, 6920387, 7213580, 7202539, 7253571, 7304672, 7447729, 7497990, 7968710, 7890379, 8050596, 7750563, 8191338, 8155371, 8772190, 8453880, 8567454, 8489680, 9037256, 9083716, 9060201, 9158588, 9355589, 9565502, 9602443, 9723188, 10263590, 10170464, 10562727, 10439420, 10619045, 11212622, 11267316, 11365837, 11442884, 11969391, 11589602, 12333783, 12385360, 12924200, 12980520, 12866227]
14382A2866227K51893K91366L71427K52138M59743j37060M71530j45507L81046
14373A5062803Q11762N5422N46153M68703O6934L63883M50214K28461M45324M22789
14363A8922448J99491N17213J10822O74182N56356O88758L99854k3955J061126
14354B3106295N04823O15534N58632K31455P04407N77644P05568Q90872O42228
14345B8537458M75761Q79491Q96003O69212J145164O80650J158263J143957P79530
14336C6365489J030026J035240J379147Q84828J182798J138927J468732J208896
14328D5694083J697358J625565J399179J811771J827418J793554K402372J712699
14320E9963999K066707K297513K155934K379532L251466K171914L020572K998776
$$ y = [12866227, 13118120, 13409486, 13780913, 14033051, 14492794, 14355734, 14827264, 14681757, 15062803, 15874565, 15929987, 16476140, 16944843, 17011777, 17375660, 17825874, 18054335, 18499659, 18922448, 19121939, 19639152, 19749974, 20424156, 20980512, 21669270, 22069124, 22045169, 23106295, 23611118, 24226652, 24785284, 25016739, 25721146, 26298790, 27004358, 27895230, 28537458, 29013219, 29892710, 30788713, 31457925, 32603089, 33283739, 34442002, 35585959, 36365489, 37395515, 38430755, 39809902, 40694730, 41877528, 43016455, 44485187, 45694083, 47391441, 49017006, 50416185, 52227956, 54055374, 55848928, 58251300, 59963999, 62030706, 64328219, 66484153, 68863685, 72115151, 74287065, 77307637, 80306413]
14312H0306413L307337L250662L706775L956329M000520L937605M705383N069232
14304A12240256M966725N638852N580919O026877O505050O443412P428875P725712
14296A62556678Q087268R027789R208494R583517J0297776J0709765J1240821
14289B30712108J2329964J2638904J3082309J3374499J4340200J4445939J4734446
14282C25658369J4816544J5485850J4801715J4607196J4194642J3520006J2486086
14275D25570408J1008036R916387P298019L214219j361956j837061k075473j043460
14267D50689119n788935p174768q987755j1059358j2639918j4241093j5163719
14260C75633573j6349676j5852438j6095824j5779498j5432838j5177350j3490819
$$ y = [80306413, 83613750, 86864412, 90571187, 94527516, 98528036, 102465641, 107171024, 112240256, 117206981, 122845833, 128426752, 134453629, 140958679, 147402091, 154830966, 162556678, 170643946, 179671735, 188880229, 198463746, 208761522, 219471287, 230712108, 243042072, 255680976, 268763285, 282137784, 296477984, 310923923, 325658369, 340474913, 355960763, 370762478, 385369674, 399564316, 413084322, 425570408, 436578444, 446494831, 453792850, 457007069, 455645113, 453808052, 451732579, 450689119, 444900184, 437725416, 428737661, 417678303, 405038385, 390797292, 375633573, 359283897, 343431459, 327335635, 311556137, 296123299, 280945949, 267455130]
14253B67455130j3214227j3030210j2624169j1791428j1166675j0613618r745840
14246A85268963r675494q409496p909688p929090p167885p187330o568094n858944
14238A24562942n509213m721554n219170n166309m444852m285613l426449l465972
14230H8323810l602744l664849l354366l283261k382458k754074k614340k734034
14222F3933684k087636k199189j874253j894596k106266j905366j713941j394669
14214D8757768j264481j383937j596483j554161j133582j140217j435210m51041
14206C8798656j017979j466096j028822r92486j179554m36732p40026q05882j109347
14197C0021732q55434o61232p69852m79133m49618j046970q74848N4144q01234
$$ y = [267455130, 254240903, 241210693, 228586524, 216795096, 205628421, 195014803, 185268963, 175593469, 167183973, 159274285, 151345195, 144177310, 136989980, 130421886, 124562942, 119053729, 114332175, 109113005, 103946696, 99501844, 95216231, 91789782, 88323810, 84721066, 81056217, 77701851, 74418590, 72036132, 69282058, 66667718, 63933684, 61846048, 59646859, 57772606, 55878010, 53771744, 51866378, 50152437, 48757768, 47493287, 46109350, 44512867, 42958706, 41825124, 40684907, 39249697, 38798656, 37780677, 36314581, 35285759, 34293273, 33113719, 32676987, 31936961, 31131079, 30021732, 29166298, 28505066, 27735214, 27256081, 26806463, 25759493, 24884645, 24938789, 24137555]
14188B4137555p59928m04945o52121o42382k64994l91902l68474m82643l68333
14179A9801833o50958m34622l40677l65902l07058m80022r5660l01462m32744
14170A6392728n49853k14036o09223M752m44147L6767k76024r9478m98217q4844
14160A3658425n27384r2641l41698J9663j38596j71386l27925k21825m5057k27720
14150A1583856n08882n53571J02879K84335l78988P6861j12745m16312k04286
14141I873147j37445j0253k83390J30948k74700k54115p1838Q3179l03916k99260
14131H452357j98168p3571J24684j44638k11001k9167l48278K0559N9870m26952
14121G225695O4096k61205K55869j31076k07322O6983L7280k25463o37774N44266
$$ y = [24137555, 23377627, 22972682, 22320561, 21678179, 21413185, 21021283, 20652809, 20170166, 19801833, 19150875, 18716253, 18375576, 18009674, 17702616, 17222594, 17126934, 16825472, 16392728, 15842875, 15628839, 15019616, 15024368, 14580221, 14616988, 14340964, 14241486, 13743269, 13658425, 13131041, 13038400, 12696702, 12716365, 12577769, 12406383, 12078458, 11856633, 11811576, 11583856, 11074974, 10521403, 10624282, 10908617, 10529629, 10606490, 10493745, 10077433, 9873147, 9735702, 9725449, 9442059, 9573007, 9298307, 9044192, 8972354, 9055533, 8751617, 8452357, 8254189, 8180618, 8305302, 8160664, 7949663, 7920496, 7572218, 7592777, 7652647, 7225695, 7289791, 7028586, 7284455, 7153379, 6946057, 7013040, 7050320, 6824857, 6187083, 6731349]
14111F731349m22285K15449J9073k89120P7776l66499j21725K56680k47405m403
14101E848890m10461M30130k59993j55820O2562m5500j05739J85348l43990j09992
14091E095435R2578j47750o1229j29354j13824p9702M2238l40167K61057J35412
14081D754694l74231L4079K1737k38345L70059k72174j10339k83853P3204L89018
14071D363849m19975M06929l69452L8006K1212k44551J05736K533j90383R2355
14061C806259j17838k29964L10968L1129K85814n70004K84099l12676m2886j76708
14051C268193K26129r072l66780L83363m88193N31631k99739n5623j62631k761
14041C024517O6552j48309R7545R2287q7365R7572o5766J8696k01636k21223J04127
$$ y = [6731349, 6309064, 6524513, 6543586, 6254466, 6332242, 5965743, 5844018, 6100698, 5853293, 5848890, 5438429, 5868559, 5608566, 5452746, 5515308, 5469808, 5364069, 5549417, 5205427, 5095435, 5188013, 5040263, 4979034, 4849680, 4735856, 4656154, 4698392, 4358225, 4619282, 4754694, 4380463, 4414542, 4436279, 4197934, 4567993, 4295819, 4185480, 3901627, 3974831, 4363849, 3943874, 4350803, 3981351, 4019357, 4040569, 3796018, 3901754, 3904287, 3713904, 3806259, 3688421, 3458457, 3769425, 3800554, 4086368, 3516364, 3800463, 3487787, 3444901, 3268193, 3494322, 3485250, 3118470, 3501833, 3013640, 3545271, 3245532, 3189909, 3027278, 3024517, 3091069, 2942760, 3040305, 3132592, 3045227, 3142799, 3077033, 3095729, 2894093, 2672870, 2776997]
14030B776997K75478p6222k99930M26658l74706j6444K81421o88037K54628m2119
14020B517724J83614m06075L44394m93013L36782n1394k0348L7784k38737j18310
14010B092421M6465J15420j24080K78384k18166j86840K05017l55203K87327J48074
14000B288819l87975L33682n15989J40954k1843q6446M91274l6422m15756K69474
13990B059772L94066L96252K011267P658384K0816764J4478766k2897445A1496332
13981G386051j899510j180840n11858j32962o17424l50488l8604m2783n6058k35416
13971B320108R3347k74417K08785L1036o12685J89363M63742m28107J15895j17835
13961A989232l18413L93419k25023j92478M40777l55912J42543j63564J39628
$$ y = [2776997, 3052475, 2976253, 2676323, 3102981, 2728275, 2711831, 2993252, 2305215, 2559843, 2517724, 2701338, 2295263, 2639657, 2146644, 2483426, 2432032, 2411684, 2449468, 2210731, 2092421, 2138886, 2254306, 2130226, 2408610, 2190444, 2003604, 2208621, 1853418, 2140745, 2288819, 1900844, 2234526, 1718537, 1859491, 1837648, 1751202, 2242476, 2206054, 1790298, 2059772, 2453838, 2850090, 4861357, 12519741, 33336505, 47815271, 24917826, 11496332, 7386051, 5486541, 4305701, 3793843, 3660881, 3043457, 2692969, 2654365, 2611582, 2555524, 2320108, 2413455, 2139038, 2347823, 2378859, 1766174, 1955537, 2419279, 1991172, 2107067, 1989232, 1670819, 2064238, 1839215, 1646737, 2087514, 1731602, 1874145, 1710581, 1850209]
13952A850209j47626L39572l25920L6087l4357P735M5615k16828N8986r9278L27728
13941A841923l7558Q320j98000J34305j85507n7992j18084J53545k67395N38760
13931A812317m07239J08436p2316P1059j53474O3739K52963k52647N9939j79689
13921A303088J31328K24367k83667k153L12958m53232J17325l39575O24615k17628
13911A417426n910j84067L11083l52609J71326o4260q9251k2727K77334n6082
13901A402263j1020j16336j08411K11248O0391j15741l52418L87739n92487M72705
13891A237933k03699M88867l25050O1039K0478k2515P3572E99451M15861j18042
13881H97270M12327k76721J56604k81751j54590N26944J21293n00431N0421K83157
$$ y = [1850209, 1702583, 2042155, 1716235, 1752322, 1717965, 1725700, 1771315, 1554487, 1613473, 1514195, 1841923, 1804365, 1812685, 1614685, 1748990, 1563483, 1505491, 1387407, 1540952, 1273557, 1812317, 1405078, 1513514, 1441198, 1512257, 1358783, 1422522, 1675485, 1422838, 1482777, 1303088, 1434416, 1658783, 1375116, 1372963, 1685921, 1232689, 1350014, 1010439, 1635054, 1417426, 1411516, 1227449, 1538532, 1185923, 1357249, 1292989, 1203738, 1181011, 1458345, 1402263, 1391243, 1274907, 1166496, 1377744, 1438135, 1322394, 969976, 1357715, 765228, 1237933, 1034234, 1523101, 1198051, 1259090, 1279568, 1257053, 1330625, 599451, 1015312, 897270, 1309597, 1032876, 1189480, 907729, 753139, 1280083, 1401376, 900945, 951366, 1234523]
13871A234523j17174j13893K59074J65799m30101k09773J37796K12101k82736
13862H55616J86299q3102K23803r8727p8522L3740K8585j12797j39944K80769
13852A095720M0539j7268j35105K5651O1290l74629L81094k89967J52498j22758
13842H17065M49889l23161R8213m674m62959N22568j02389q8012k1749j19769
13832G65022r8177J16962K23969l10144J48854l9987k2076J00934J24068m7629
13822I61796l20500J89967J73415k40058k09279j8116L06057j99003K20550m21293
13812D43536K8565M63052k35100P2625N1183r7183K07664k67750n9096J21814
13802G29310O7437N1645j17003q9663J11149J81742j02805M9145k43008K35154
$$ y = [1234523, 1117349, 1003456, 1262530, 1428329, 998228, 788455, 926251, 1138352, 855616, 1041915, 958813, 1182616, 1083889, 1005367, 1039107, 1067692, 954895, 814951, 1095720, 1136259, 1118991, 983886, 1009537, 1070827, 696198, 1077292, 787325, 939823, 817065, 1266954, 943793, 1042006, 1037332, 574373, 1096941, 994552, 906540, 884791, 765022, 666845, 783807, 1007776, 697632, 846486, 806499, 784423, 885357, 1009425, 961796, 641296, 831263, 1004678, 764620, 555341, 537225, 843282, 644279, 864829, 443536, 472101, 935153, 700053, 772678, 823861, 726678, 934342, 666592, 607496, 729310, 796747, 848392, 731389, 641726, 752875, 934617, 831812, 880957, 637949, 873103]
13792H73103Q8875j94854j60180J12723l57943L78297q7047n8488J52502R4418
13782H41406j26317B31936M85078j00961B63204M99963k36043J22756J19819j37587
13772F32112J02554j37803J87486k27170J5649J57443j87699j28859N24688l02283
13762F36118o7196k19630L31584J1830l761q2707J32487j97257n1610J86853J19432
13751G96143l73404K26194o1565k03876L20459K61664l63525J68565k84208K21276
13741G07723K18428j84634J1100j96726m2495j44003L24356C23031K71532o1914
13731E32649k33871P15295D47770J2074B15073O78373m08008N2758L5621Q4053
13721F57870j80750J40286J28129j77509J4139q2742k1548L22643K22034D53830
$$ y = [873103, 961978, 767124, 606944, 719667, 361724, 740021, 652974, 594486, 746988, 841406, 715089, 231936, 717014, 616053, 263204, 763167, 527124, 649880, 769699, 632112, 734666, 596863, 784349, 557179, 572828, 730271, 542572, 413713, 938401, 636118, 568922, 349292, 680876, 692706, 688945, 606238, 738725, 541468, 489858, 676711, 796143, 422739, 648933, 587368, 383492, 703951, 965615, 602090, 770655, 486447, 707723, 926151, 741517, 752617, 555891, 513396, 369393, 693749, 323031, 594563, 532649, 298778, 1014073, 447770, 459844, 215073, 893446, 485438, 538196, 573817, 657870, 477120, 617406, 745535, 568026, 582165, 499423, 477875, 800518, 1022552, 453830]
13710D53253J20641k12071M4914m1166m5736M03762o4749j65938L0307J23404
13700F46621j27630k51348r883L93692l04595K3891K45815C02177K61301k33929
13690C29549K44855k60110K81489Q6932D7036J46343L37751M6789L3700j52873
13680D58746M1389Q0773j35106o0356N9301m7199j90313J32797J81655j14201
13670D07486m4335J53849m690B04802K30581l9238A51143L37779J89694C32041
13659D95993A56625L43569Q2465A26562M61266E6857N49023p868A18743L10411
13649D29154L80L0625p0249A19338M10498A80382J90188j31456n106J56502N2157
13638D42667M6029R7397q0307K5934O3706j50884A88039Q7143P2747p1586M7030
$$ y = [453253, 573894, 361823, 406737, 365571, 319835, 723597, 658848, 492910, 523217, 646621, 518991, 267643, 257760, 651452, 346857, 370748, 616563, 302177, 563478, 329549, 574404, 314294, 595783, 682715, 47036, 193379, 531130, 577919, 611619, 458746, 500135, 580908, 445802, 385446, 444747, 397548, 207235, 340032, 521687, 407486, 363151, 517000, 512310, 204802, 435383, 396145, 151143, 488922, 678616, 332041, 495993, 156625, 500194, 582659, 126562, 587828, 56857, 605880, 598012, 118743, 429154, 429534, 460159, 389910, 119338, 529836, 180382, 370570, 239114, 234008, 390510, 442667, 488696, 586093, 505786, 531720, 595426, 444542, 188039, 275182, 347929, 276343, 323373]
13627C23373A36375L91902j65670j61755J21210m7483M1731R425j06098m4651
13617A74986L59961k39496J83787I0514L37374o6231B0349N94044B64423M48106
13607G12529C17954K6186k9354o5946R5382M7282i4777D09212A1890O28656B08803
13595A89618K7862K79362k06770J48743j50134j397a43971D10079J03987n8083
13585D55983l510B15708p0101R3776J01857O4889D6455M03377j03703A05392L90480
13574D95872A20029P6831J7523K79999j20460J59016A72673L56007k44854q3852
13564A99974J7859J15953j14005J55956j37711K73224p7994j63326J10968r1730
13554B89168Q0047r4663K30418p9199D5269J32004Q9786J23685A6458K06143J33080
$$ y = [323373, 136375, 528277, 362607, 200852, 322062, 274579, 316310, 325735, 219637, 174986, 534947, 295451, 479238, 90514, 427888, 361657, 20349, 614393, 264423, 712529, 317954, 344140, 314786, 248840, 344222, 391504, -94777, 409212, 11890, 640546, 208803, 189618, 217480, 496842, 290072, 438815, 288681, 287284, -143971, 410079, 514066, 455983, 452473, 215708, 145607, 239383, 341240, 406129, 46455, 449832, 346129, 105392, 495872, 120029, 196860, 214383, 494382, 373922, 532938, 172673, 528680, 283826, 199974, 217833, 333786, 219781, 375737, 238026, 511250, 433256, 269930, 380898, 289168, 369215, 274552, 504970, 425771, 45269, 177273, 267059, 390744, 16458, 222601, 355681]
13543C55681G7317J88842o3164J68141O1549B11311I0991J0598K44719A0096J39083
13532A49179N48438I1406M1135P6460L00136B35245a90592E47479B106M7150R0733
13521A39989P0837K76953j72335K01893j63778k5131J04662G2989a5556B95592
13510A62455L81197p249B44805A17276f3320B46516J51492L50533C65025N001
13500C70026H0570J27863i9871C32585r529J87972k53803L09827A3291P0195G666
13488H3851L44901c781C82074j58395j3671J73976I9904M9966E2498J78349q7470
13477A43377L11085A67090K75168A16008L87451B31723k942c3780A98019m7549
13467A50470O4975J29142o1832J00750A53798G4219a73617D32990j73563k9075
$$ y = [355681, 77317, 266159, 202995, 371136, 432685, 211311, 90991, 101589, 346308, 10096, 149179, 697617, 91406, 132541, 209001, 509137, 235245, -190592, 547479, 2106, 49256, 139989, 210826, 487779, 315444, 517337, 353559, 328428, 433090, 72989, -15556, 295592, 162455, 543652, 536403, 244805, 117276, -63320, 246516, 398008, 748541, 365025, 370026, 80570, 208433, -99871, 332585, 323056, 511028, 257225, 567052, 13291, 83486, 7666, 83851, 428752, -3781, 382074, 223679, 210008, 383984, 99904, 149870, 52498, 230847, 143377, 454462, 167090, 442258, 116008, 503459, 231723, 228781, -33780, 198019, 150470, 215445, 344587, 282755, 383505, 153798, 74219, -173617, 432990, 259427, 230352]
13457B30352m3124N0813J70932A67721L81558d0221A18396m9189f6314o9824B59653
13445C17216n8414B270L67196i5946B4882K84777e1707r5524b962A00296b7066
13433G0598R3700c7017q7191B52247a0519A41954K3820M7564A04407O0876d5713
13421B77804K17485e531B21830P5296H5552O7714F1097K57262K8863j71138l5620
13410A40464J30788A22855Q6217J4420r3046N1669J04360I3878J78081b27113
13399A04276b6731C20070c7655m1795I3569K26430J18852j85697K28598j79462
13389C02290r0713p7850a46103B73202A26326A6142a99485F5972J92952K15609
13379D74533a13680A4780K46422O6751A41490B4732J76584n8258K25652l1724
$$ y = [230352, 187228, 238041, 408973, 167721, 549279, -40221, 118396, 69207, -66314, -136138, 259653, 317216, 258802, 2270, 369466, -95946, 24882, 309659, -51707, -147231, -2962, 100296, -27066, 70598, 164298, -37017, -124208, 252247, -10519, 141954, 165774, 213338, 104407, 165283, -45713, 277804, 495289, -5531, 221830, 297126, 85552, 153266, 61097, 318359, 347222, 176084, 140464, 271252, 122855, 209072, 223492, 130446, 182115, 286475, 93878, 271959, -227113, 104276, -26731, 320070, -37655, -79450, 93569, 319999, 438851, 253154, 481752, 302290, 211577, 133727, -146103, 273202, 126326, 16142, -199485, 65972, 258924, 474533, -113680, 14780, 261202, 327953, 141490, 24732, 201316, 143058, 368710, 336986]
13369C36986Q9274A65286F3207J84600J10732J62231I314J90575e9076A3826K88543
13358C02369A02517O0939l1921P1545l3248F4962N64215A06726K34222j64646
13348A76302n259L5534F2704K34644j41659P6147J38750j28004L8601n8042J01555
13337C24696R5248J44088b4327A78458N0384K14489A40426K56932j60891H4561
13326C38207J29952j40449G6380K44596O9706A13028M7475K06331G1977K09066
13316B81043e7560E32672e1803A78803P5603m0254C7600e4122G8493R0932j8571
13305A50854b14391i120A25527D230K49423F4979K97305a76778N1194A04989K10479
13294C15468p4768F2714N4488M31817C9385a34978L2755F0871J08775A3350K43909
$$ y = [336986, 426260, 165286, 63207, 247807, 358539, 520770, 9314, 199889, -59076, 13826, 302369, 102517, 163456, 131535, 203080, 169832, 64962, 629177, 106726, 340948, 176302, 171043, 206577, 62704, 297348, 155689, 231836, 370586, 242582, 281183, 223141, 324696, 419944, 564032, -24327, 178458, 228842, 443331, 140426, 397358, 236467, 84561, 338207, 468159, 327710, 76380, 320976, 390682, 113028, 160503, 366834, 71977, 281043, -57560, 532672, -51803, 178803, 254406, 214152, 37600, -54122, 78493, 169425, 150854, -214391, -9120, 125527, 4230, 253653, 64979, 362284, -176778, -125584, 104989, 315468, 240700, 62714, 117202, 549019, 39385, -134978, -102223, 60871, 169646, 13350, 257259]
13283B57259F5823M6800A6747J87942H4021K16650M5897p5041a1797F3429L51316
13272D14745A00918c038B55387p5629h8875H6423N49K28757j54131D5216N16933
13261E62149C0966J49461o4145l7330R8482c8902A23258B2399J04390E4682J27965
13250A82647i7633G4146J00251g7099A86015f354c141I8054K938a46075B39155
13238C26229g8491A23775m9491K81303B9822K9346K239c5291A42963a93158B61160
13226I6584H591f7009C33061C3257a42829f9292a0346A2744e1090A99475F0828
13214A02462m47L12588L5557j59101G4563b45259F5329L0831c4823H8869c8037
13202H6120d3103G0825N0214P7687B8718a26719M2055H2571d9148A82382L0380
$$ y = [257259, 65823, 112623, 16747, 204689, 84021, 300671, 346568, 271527, -11797, 63429, 414745, 100918, -3038, 255387, 179758, -88875, 86423, 86972, 315729, 161598, 45216, 562149, 30966, 180427, 116282, 78952, 177434, -38902, 123258, 22399, 126789, 54682, 182647, -97633, 74146, 174397, -77099, 186015, -6354, -3141, 98054, 100992, -146075, 239155, 326229, -78491, 123775, 74284, 355587, 29822, 59168, 61407, -35291, 142963, -193158, 261160, 96584, 8591, -67009, 333061, 33257, -142829, -69292, -10346, 12744, -51090, 199475, 60828, 102462, 102015, 414603, 450160, 291059, 74563, -245259, 65329, 96160, -34823, 88869, -38037, 86120, -43103, 70825, 121039, 198726, 28718, -126719, -84664, 82571, -49148, 182382, 212762]
13191B12762d9798l1346k1641j29413F4093a4799A36358f646k2657A37092m5244
13180I1848K07266L3169h5502E6505J72520L1710b04521A61597n8677c981q0955
13169h4936A88828F5030c9157A95017L899a14074A07369e8619E3862f2870A21940
13157A4014J65793E8895j8777K68602G5239a06538C33171D8566c59017G2257K40601
13146C12858A54225B5154f3958A75914b58279r8895D3725b4292B44671e2132C19148
13134I4221f855A91042k3691F320h7677b4986A44299I13R0581l7301Q9644K93567
13122D37404A3285L36654A22603a40432C33481c0357B35461A08595n2635O898
13112F2858K22033d8368A89411r4073M89330A75100G3446A4360m306f6252C6763
$$ y = [212762, -49798, -81144, -102785, -232198, 64093, -14799, 136358, -6646, -29303, 137092, 91848, 299114, 332283, -85502, 56505, 229025, 260735, -204521, 161597, 102920, -3981, -84936, 188828, 65030, -39157, 195017, 198916, -114074, 107369, -58619, 53862, -62870, 121940, 14014, 179807, 58895, 40118, 308720, 75239, -106538, 333171, 48566, -359017, 72257, 312858, 154225, 25154, -63958, 175914, -258279, -357174, 43725, -24292, 244671, -52132, 319148, 94221, -6855, 191042, 167351, 6320, -87677, -24986, 144299, 913, 91494, 54193, 143837, 437404, 13285, 349939, 122603, -140432, 333481, -30357, 235461, 108595, 55960, 62858, 284891, -48368, 189411, 95338, 584668, 175100, 73446, 14360, 10054, -66252, 36763]
13100A01745N9364E0187J06144N1544k8995E0158J9455a58236R087B13370a38526
13088A62720E1308K07103a25355C3713J59112g5505A68895b3045k4629C9775P4182
13077A13957b44423C26719A2543K06533k4365G9570K68301q5264a06304k02783
13067c09087A50257o4889J21830i3462B31394n3346E0148L07586A59486O3945
13057B23431L1116m3695a0294H4598F635L1314g2341A17334l9753a72448C20048
13045B99988B3694J50541l869p0766h493C9957J36033j0368a11472B36629N1284
13034B87913l384n2559a09771C6145J31345a42392B97119b9698F5780j1852j0835
13023D3093M6976a8827D18948A98332K7991d0458E21945a0351j61580A06592a66057
$$ y = [101745, 161109, 50187, 156331, 207875, 178880, 50158, 69613, -158236, -149149, 213370, -138526, 162720, 51308, 258411, -125355, 33713, 192825, -75505, 168895, -23045, -47674, 39775, 113957, -244423, 326719, 12543, 219076, 194711, 79570, 347871, 262607, -106304, -309087, 150257, 85368, 207198, -93462, 231394, 178048, 50148, 357734, 159486, 223431, 254547, 210852, -10294, 84598, 6635, 37949, -72341, 117334, 77581, -172448, 320048, 299988, 23694, 174235, 170366, 99600, -8493, 39957, 175990, 165622, -111472, 236629, 287913, 284529, 231970, -109771, 36145, 167490, -142392, 297119, -29698, 65780, 53928, 43093, 90069, -18827, 418948, 198332, 226323, -40458, 521945, -10351, -171931, 106592, -166057]
13011H6203R1678R8224J48530q2414j26377M5522j12067J90266E1460d3242l17802
13000c61044C14696j41391A7104L11790B0000N0036K6746L3749E6754L4293l349
12989H7698b49821B6259a97690r3509A00811g6935Q161K1555o1060l355M6285
12978f5349A26627M2491f8806B76904b04348C52976g454A8845a09194B17383a4431
12966A40981Q0402q9493N8063I0965Q7408H756c087o189j29855j0877C22937a0077
12953A10585K75564c84496A36526a39000p3552B71727b10836F0738O9805K11092
12943C41635A10213b8975m1120C7215i6119j49752b6763j34137A97740b07613
12932a39668j16404C51616c5461E7399B3851a46632A47742a46224b4632l66193
$$ y = [86203, 177881, 276105, 424635, 342221, 215844, 261366, 149299, 339565, 51460, -43242, -361044, 314696, 173305, 17104, 328894, 20000, 70036, 96782, 130531, 56754, 91047, 87698, -249821, 26259, -197690, -291199, 100811, -76935, -68774, -47219, -108279, -111634, -65349, 126627, 169118, -68806, 276904, -204348, 352976, -7454, 18845, -109194, 217383, -14431, 140981, 221383, 131890, 189953, 90965, 178373, 8756, -3087, -9276, -139131, -150008, 322937, -10077, 110585, 386149, -384496, 136526, -139000, -212552, 271727, -210836, 60738, 130543, 341635, 110213, -28975, -70095, 37215, -96119, -245871, -26763, -160900, 197740, -207613, -139668, -256072, 351616, -35461, 57399, 23851, -146632, 147742, -146224, -24632, -390825]
12922c90825A22677M6141a68737B14269H1782J11789e6801C14409i7031K0568
12912g6463A46634b34502f0198B68959c0675j42475B61187a66578L1054m8318
12902a83842j8876A20671b09043M0395E8823L1946k5624a26971g780A35748b86353
12890F6214c07133f2205A03862Q3714G2084Q1330a5941F5065O9770i3332b3989
12878A3910f4856D2928O5589a91424d8576a9754e3A02635a57774F4920a41550
12866c74543C47417A17242P7434J72411a04996C2579O4416a45459q3431B41729
12855h8274c4489B18596p0543i029A49947A22J27137k4469b57273P5130e1922
12843c361j11148M058D4943L17592C3005A4555J49431a03427C34673b34466A49259
$$ y = [-390825, 122677, 168818, -168737, 214269, 81782, 193571, -56801, 314409, -97031, -76463, 146634, -234502, -60198, 268959, -30675, -173150, 261187, -166578, -135524, -183842, -202718, 120671, -209043, -168648, 58823, 90769, 65145, -126971, -7780, 135748, -286353, 66214, -307133, -62205, 103862, 187576, 72084, 153414, -15941, 65065, 134835, -93332, -23989, 13910, -64856, 42928, 108517, -191424, -48576, -19754, -53, 102635, -157774, 64920, -141550, -374543, 347417, 117242, 194676, 367087, -104996, 32579, 96995, -145459, -228890, 241729, -88274, -34489, 218596, 148053, -9029, 149947, 122, 127259, 102790, -257273, -182143, -51922, -3361, -114509, -110451, 44943, 362535, 33005, 14555, 163986, -103427, 334673, -234466, 149259]
12831A68231b0969A61458F926e4622l10297C07486A23057D0753O9935g7646a124
12819C28121I0271R0333h6425A6458J89847h817I0687A0138a81253A67141a56286
12807c9649A4076a07650m0826E3114a49357k16409r376A89882d8520j133C2621
12795C91724h8382k91783Q1247C1982a20412A85696b29176k77263f1073l17118
12785c78191F551O7460Q479O6644E1120f6814A44534E8981K47765H9538a02583
12773A17807O9608E8831L48281F85J68513a64439k12551g8035A10500N3678K14207
12762C78385E5209L2728g5849B435K85220i8328C66290D3143L8101Q5604b90C7389
12749a57380m5073B13492b33852A60273c5829j7701j30154G8592c9132j91820
$$ y = [168231, -20969, 161458, 6926, -54622, -364919, 307486, 123057, 40753, 110688, -77646, -1124, 328121, 90271, 180604, -86425, 16458, 206305, -8817, 90687, 10138, -181253, 167141, -156286, -39649, 14076, -107650, -148476, 53114, -149357, -365766, -375142, 189882, -48520, -49653, 32621, 391724, -88382, -380165, -298918, 31982, -120412, 185696, -229176, -506439, -61073, -378191, 6551, 74011, 82490, 149134, 51120, -66814, 144534, 58981, 306746, 89538, -102583, 117807, 187415, 58831, 407112, 685, 169198, -164439, -376990, -78035, 110500, 164178, 378385, 55209, 87937, -75849, 2435, 287655, -98328, 366290, 43143, 81244, 166848, -290, 37389, -157380, -202453, 213492, -233852, 160273, -35829, -53530, -183684, 78592, -39132, -230952]
12739b30952B35031J5629g8537a5731k36010A56700o2743R4245a52329G641K88306
12728B95947L8914m964f5061B8629N8287N3544d29131A29298a21694D64198j90594
12717B73604C7523a2301B99375a07433A11751B4750a7419G6895a40366A95956
12706D01568R1254B09929n4755B6885J05076c373j29894d9720A00759A7478K0092
12695C7570c42333B7449a74807a1077B68833A8425N162J979J02594b58205A85899
12683I3475K7131J32318k4487m4953J98617q1472j2326A2967K77211D1990a80587
12671b04478C234a87919G2712b32724d2748J132k0715A19189R8134C942c58208
12659d61494D09188B1958N177a16299b3279C17982n9547n0024g6480A25805k8730
$$ y = [-230952, 235031, 250660, -78537, -15731, -251741, 156700, 93957, 188202, -152329, 7641, 295947, 334861, 329897, -65061, 28629, 86916, 140460, -429131, 129298, -121694, 464198, 273604, 37523, -12301, 299375, -107433, 111751, 24750, -17419, 76895, -140366, 195956, 401568, 492822, 209929, 155174, 26885, 131961, -3373, -133267, -49720, 100759, 17478, 37570, -342333, 27449, -174807, -11077, 268833, 18425, 23587, 25566, 128160, -258205, 185899, 93475, 120606, 252924, 228437, 183484, 382101, 300629, 288303, 12967, 290178, 41990, -180587, -204478, 3234, -187919, 72712, -232724, -42748, -41616, -62331, 119189, 217323, 3942, -358208, -461494, 409188, 21958, 27135, -116299, -23279, 317982, 258435, 208411, -76480, 125805, 97075]
12648I7075b97728C63389a88422B19843C7267K7543J4404J52817M980c3478G3339
12636G138a5593j20821H8438K51757b72727E933K3055n879J35001K13038c74194
12624D02378G0138n324a30838C95186A71466E1070a083j88848C62884j40335j6445
12613B06104a94499g9818D3998h7968A82421R8311F6235h9121a3651B02042q0716
12602A21326e5368B33588H8159k3908K05767j0682j16297d9488k03369h9119p3959
12591a63078D4718R4301J49234b8498j89550A72573C639P3091K94514A7208J63389
12580A80597B3971J04125a76191j36768b3j83510A40234o8951a70769B38503D9496
12568D3483p015J45469e2759A34708c4697B46127G446K29712G0671b32654G8661
$$ y = [97075, -297728, 363389, -188422, 219843, 37267, 64810, 79214, 232031, 237011, -33478, 73339, 7138, -15593, -136414, 88438, 340195, -272727, 5933, 28988, 23109, 158110, 371148, -374194, 402378, 70138, 64814, -130838, 395186, 171466, 51070, -1083, -189931, 362884, 222549, 206104, -194499, -79818, 43998, -87968, 182421, 280732, 66235, -89121, -13651, 202042, 121326, -55368, 233588, 88159, 64251, 270018, 259336, 143039, -49488, -252857, -89119, -163078, 44718, 139019, 288253, -28498, -218048, 172573, 3639, 76730, 371244, 17208, 180597, 23971, 128096, -176191, -312959, -23, -183533, 140234, 71283, -170769, 238503, 49496, 43483, 36468, 181937, -52759, 134708, -34697, 246127, 7446, 237158, 70671, -232654, 78661]
12556A49321i5970A77494c5475P929B42514N8399a05739A5866a17810A37254A619
12544b11293b2626B1198J16669m9009J00367d7355C76759j79001B2054J84280
12534B06334a47080G7500a46251A45352a40216D7416J6225j7431J67214A04931
12523b94535E1041b19464D5374J2267b85575I6820b11193k10697C1640c8733F5770
12511A33922a3396B3783d325l41041A00362a5546j06465C11757a599E1591a01705
12499c8618D480J20799a03979k61561B1898K93044C9882b6770p5211r1136f4638
12487c46405J5804J40327A01131A9934a9898A65389d2577j2614C07730G4735J12797
12476A87532a64256c148D43928C812J3463J84896a04173A04473f7689k032B90387
$$ y = [149321, -95970, 177494, -35475, -27546, 242514, 300913, -105739, 15866, -117810, 137254, 1619, -211293, -22626, 21198, 137867, 88858, 189225, -47355, 376759, 197758, 22054, 206334, -147080, 77500, -146251, 145352, -140216, 47416, 63641, 46210, 213424, 104931, -294535, 51041, -219464, 45374, 57641, -285575, 96820, -211193, -421890, 31640, -38733, 65770, 133922, -13396, 23783, -4325, -345366, 100362, -15546, -122011, 311757, -1599, 51591, -101705, -38618, 4480, 125279, -103979, -365540, 21898, 314942, 39882, -26770, -101981, -193117, -64638, -346405, -330601, -190274, 101131, 19934, -19898, 165389, -42577, -55191, 307730, 74735, 187532, -164256, -3148, 443928, 3812, 17275, 202171, -104173, 104473, -67689, -69721, 290387]
12464B24462a24586k47891d7962m8587A54916n7505J10407B988L9973a39234B30733
12452B68763a88837K9767A40740b0174q7844c9839k31515f8790A27393b5458k50620
12441b76078j61534b4217D2501a03988k85424d1552A40393B0042L35544b55549
12430b57752C2275K8085J52078a06865M0726B2704K78058G3039a21626p5212L5138
12419a61700C95890I5291g2456A11772L2814a7603r6854I9814J67294G3531a52040
12407c4720p9838E67088k66808j44960B8641d252D24379a69065A71096K7545a81530
12395B40699P3316f5942B28885c7181r3869N4136c1564I8167m2270A3785K51441
12384B65226b33925a16417a1648A46062a44400G08f5676l8001A99827a19565B9103
$$ y = [224462, -124586, -372477, -47962, -96549, 154916, 97411, 207818, 2988, 42961, -139234, 230733, 268763, -188837, -159070, 140740, -20174, -108018, -39839, -271354, -68790, 127393, -25458, -276078, -437612, -24217, 42501, -103988, -389412, -41552, 140393, 20042, 355586, -255549, -257752, 32275, 60360, 212438, -106865, -66139, 22704, 300762, 73039, -121626, -196838, -161700, 395890, 95291, -72456, 111772, 144586, -17603, -114457, 99814, 267108, 73531, -152040, -34720, -114558, 567088, 300280, 155320, 28641, -4252, 424379, -169065, 171096, 198641, -181530, 240699, 314015, -65942, 228885, -37181, -131050, -76914, -31564, 98167, 55897, 13785, 265226, -233925, -116417, -11648, 146062, -144400, 708, -65676, -103677, 199827, -119565, 29103]
12372a12947k12243F4662b82683R1250I6855N6960h3460B1894f4726m43428D5025
12360A96978i0614j79479A14172a06970j03629B04017f9380B13904H9385c8904
12349a73514F6322K26477F8989a87261I0400f6009A49860F941J17888b27976A29294
12337A17318L276a85241h7499C12658c0101F2681e4949D654K66571b62605e6907
12325h0130I0858g4303A28306a19530A79020b11232B02544K8204c09724A13902
12314B22996Q0674F3719A4336b39872C50073A30181j9888d1571A49856c71506
12303c12780J30093h885j65493I2009E726e5001B7807M8590N1061b33951E9154
12291a61158A16120P4075o8058M2966a29962A28626F796J80665F3282a68019B33240
$$ y = [-112947, -325190, 64662, -282683, -191433, 96855, 153815, -83460, 21894, -64726, -508154, 45025, 196978, -90614, -270093, 114172, -106970, -210599, 204017, -69380, 213904, 89385, -38904, -173514, 66322, 292799, 68989, -187261, 90400, -66009, 149860, 6941, 124829, -227976, 129294, 117318, 120594, -185241, -87499, 312658, -30101, 62681, -54949, 4654, 271225, -262605, -56907, -80130, 90858, -74303, 128306, -119530, 179020, -211232, 202544, 230748, -309724, 113902, 222996, 303670, 63719, 14336, -239872, 350073, 130181, 110293, -41571, 149856, -371506, -312780, -182687, -8885, -174378, 92009, 5726, -55001, 27807, 76397, 127458, -233951, 59154, -161158, 116120, 190195, 122137, 165103, -129962, 128626, 6796, 187461, 63282, -168019, 233240]
12279A02036d539l7146C06958A01362P210a23777H1674l7575E027M1068J2201
12268E8296a41605E4204K05210G7956J51442E8813b12275C74398A29187a80752
12257A22227J79537C3490L4826f3961J5645I7825r108e6568j92212C89376A53650
12245a67006I9803P9361R7278a30911M1433A78330n7445L5221a34566A17184C9026
12233b6294G6176k8138b7122A87568Q3484F946J41827K24984A4347K40291J05204
12222C59842M330F7774B1232K58506N7772I1116B729K96437A00294K99417h0988
12210b90165b7650C2660b67461b708A45283c00746C44086a33680e7638B08293
12199A06717R286q867j7012k7289O4419n0259g3520D29741G0110a07868k7086
$$ y = [102036, -4539, -41685, 306958, 101362, 108572, -123777, 81674, 44099, 5027, 46095, 58296, -141605, 54204, 259414, 77956, 229398, 58813, -212275, 374398, 129187, -180752, 122227, 301764, 33490, 68316, -63961, -48316, 97825, 88717, -56568, -248780, 389376, 153650, -167006, 99803, 179164, 276442, -130911, -89478, 178330, 120885, 156106, -134566, 117184, 39026, -26294, 76176, 48038, -27122, 187568, 271052, 6946, 148773, 373757, 14347, 254638, 359842, 364172, 67774, 21232, 279738, 337510, 91116, 2729, 299166, 100294, 399711, -80988, -290165, -27650, 32660, -267461, -2708, 145283, -300746, 344086, -133680, -57638, 208293, 106717, 116003, 107136, 90124, 62835, 127254, 76995, -73520, 429741, 70110, -107868, -134954]
12188a34954A84821c87252A19530K27351A40340F0322K07645j12255o9382P4119
12178A60449c5089n4358l70562D54830c1940q4427c5835A18770N7660E4920O5028
12167A19948l0274c8409A74081L020A4001O7111i1616c8852j65155h4416H269
12155B33271f9501D08016a13966A79680m0116A4759a64603P5906A17438D4028
12144h6388I154J21041l8973n128a2953l350A81158F4892C0971a88726J4635Q2316
12132i1775C10592j01547E6736J43332h6306F1574g7729B83354E166R7058a78723
12120E6686c2784H3485b59957J7338G5703N1512c6602E6223a14687A7279K05686
12109B22965H1766L4398k1386J06884a50397C7907d66773I7198j8243g5928E2104
$$ y = [-134954, 184821, -387252, 119530, 346881, 140340, 60322, 267967, 155712, 86330, 160449, -35089, -89447, -460009, 454830, -31940, -116367, -35835, 118770, 176430, 54920, 119948, 89674, -38409, 174081, 177101, 14001, 81112, -91616, -38852, -204007, -84416, 8269, 233271, -69501, 408016, -113966, 179680, 139564, 14759, -164603, -88697, 117438, 44028, -86388, 9154, 130195, 91222, 86094, -12953, -16303, 181158, 64892, 30971, -188726, -174091, -91775, 310592, 209045, 56736, 200068, -86306, 61574, -77729, 283354, 5166, 102224, -178723, 56686, -32784, 83485, -259957, -242619, 75703, 127215, -36602, 56223, -114687, 17279, 222965, 81766, 116164, 94778, 201662, -150397, 37907, -466773, 97198, 78955, -75928, 52104]
12097A1681J78447J87453n8800j28335E4322a12985C18100e2537H6853j1306C747
12085A59297C7785J74736C5882a93939b3998H7896A7157K66460L2788N43334J196583
12074B056322q75384B41074e4833k51944F7168e6805o5356j72111A0187L6510
12064D6697J19313l0268J2605a63119A08858L6818b2517A35390b67893J18254
12054a49639A39511j9173b86410a05274A47486F163h4483E2444K05189b20466
12043a41866j16266J20762A49694o2151b55557f5629p8605j04004a20515m7107
12033a67622L2200C3520K67838E1229a18266j02030j9359m0700f2984a9051l32717
12022c51768A3503b19116a01012B01250d0048l8741F3124B7281d6659A055M4735
$$ y = [11681, 190128, 377581, 318781, 190446, 54322, -112985, 318100, -52537, 86853, 75547, 3747, 159297, 37785, 212521, 35882, -193939, -23998, 87896, 17157, 283617, 316405, 859739, 2056322, 1180938, 241074, -54833, -306777, 67168, -56805, -122161, -294272, 10187, 46697, 166010, 135742, 148347, -163119, 108858, 145676, -22517, 135390, -267893, -149639, 139511, 120338, -286410, -105274, 147486, 6163, -84483, 52444, 257633, -220466, -141866, -258132, -137370, 149694, 87543, -255557, -65629, -144234, -248238, -120515, -167622, -135422, 33520, 301358, 51229, -118266, -220296, -239655, -280355, -62984, -19051, -351768, 13503, -219116, -101012, 201250, -40048, -78789, 63124, 27281, -46659, 1055, 45790]
12011D5790i0908B2841E938b00902B0452b2652A11654g2925A72507q4221a23213
11999a28680r9407e6697A46668a65089C58492i6118J0537B4454J05780E5915A7122
11987b15838a9578B20410i4742A22975a24512A35757g6358a8382n0210J9306B04081
11975F9395f6772J9394C12108E9749a58400A8301Q4181J04006K61201h5922K4727
11964f1195j6493o8362K7553k7783d7920B0862a27804l172j8886J8327q9990J08224
11952a13301r0122I1849B2025d4622B83400d1309j45294b824A39098D4900K818
11941D7718h2499j08824B258L2152e76595i8347D7218b80176B43684A8717J78723
11930A97440E3295j5171i6418a1034j55871B05088G4784a89903n9602H7212a32365
$$ y = [45790, -90908, 22841, 5938, -200902, 20452, -22652, 111654, -72925, 172507, 88286, -123213, -128680, -228087, -56697, 146668, -165089, 358492, -96118, -85581, 24454, 130234, 55915, 17122, -215838, -19578, 220410, -94742, 122975, -124512, 135757, -76358, -18382, -68592, -49286, 204081, 69395, -66772, -47378, 312108, 59749, -158400, 18301, 102482, 206488, 467689, -85922, -61195, -77688, -146050, -118497, -146280, -47920, 20862, -127804, -130976, -149862, -131535, -221525, -113301, -203423, 91849, 22025, -44622, 283400, -41309, -186603, -2824, 139098, 44900, 47718, -82499, -191323, 2258, 34410, -576595, -98347, 47218, -280176, 243684, 18717, 197440, 53295, 38124, -96418, -11034, -166905, 205088, 74784, -189903, -249505, 87212, -132365]
11918A21038j837b64049G6437K34562n9305R4352A288P3236d966C2733K29300
11907B62033G678h8935F0988L58037a28211q6833B53778a96947A61119g7823G7722
11895a07134A1575c26127a30353k00560c6773A92237f0104a1740j68864A5628
11884e5450n1288B80922c3691k62605D7381e4569E32962a24251j02757B82563
11873B64676D4877J5140a33462b0753l43501B6068b26242j59944I7877J55152
11863B53029c22250G2576J5138A7310d3685k88432E1237J1010a71698b2220A06485
11851H4402b8387m79877a314I0096J26112i2212p9012F1719B055b79580G984K73646
11839B81630d08358B52018b46563Q8517O0436c9841j15945B46401H7031l07a04751
$$ y = [121038, 119201, -264049, 76437, 310999, 251694, 346046, 1288, 74524, -4966, 32733, 262033, 7678, -88935, 60988, 419025, -128211, -215044, 253778, -196947, 161119, -77823, 77722, -107134, 11575, -326127, -130353, -330913, -36773, 192237, -60104, -11740, -180604, 15628, -55450, -106738, 280922, -33691, -296296, 47381, -54569, 532962, -124251, -227008, 282563, 264676, 44877, 60017, -133462, -20753, -364254, 26068, -226242, -386186, 97877, 253029, -322250, 72576, 87714, 17310, -43685, -332117, 51237, 62247, -171698, -22220, 106485, 84402, -28387, -508264, -1314, 90096, 216208, -92212, -171224, 61719, 2055, -279580, 7984, 281630, -408358, 252018, -246563, -158046, -97610, -39841, -155786, 246401, 87031, 86724, -104751]
11827b50961a04184A2509R3669m8200c47418a65090k71377E2471a62389M8546
11817a13843A00074L00N2369a14717j07853m6409I6471g5522b0588A54182b60491
11805A33042b6761k09312J4778J08633I2301a48758j67798i6782j96636a8590
11794d0906J5230q334l48835R3025a05077B4811g6535J1088j36000C9168a36444
11782b41479C88651e6401A99122a45965e2076j41460B37781A08107Q1085a64213
11771B4633e361A8892J39463m283A4205b13993j20719E7390A1974a05096b5068
11759E7997d60257B71687a94766j23419B03955E2832O3825J43311a40343Q818
11749a31525A80131N6012b68892J18878D26114C3246M3245b29128a00409J6121
$$ y = [-250961, -104184, 12509, 106178, 57978, -347418, -165090, -436467, 52471, -162389, -113843, 100074, 100374, 152743, -114717, -222570, -268979, 96471, -75522, -20588, 154182, -260491, 133042, -26761, -236073, -221295, -112662, 92301, -148758, -316556, -96782, -293418, -18590, -40906, -25676, -34010, -382845, -289820, -105077, 24811, -76535, -65447, -201447, 39168, -136444, -241479, 388651, -56401, 199122, -145965, -52076, -193536, 237781, 108107, 189192, -164213, 24633, -5361, 18892, 158355, 154072, 14205, -213993, -334712, 57390, 11974, -105096, -25068, 57997, -460257, 271687, -194766, -318185, 203955, 52832, 116657, 259968, -140343, -131525, 180131, 236143, -268892, -150014, 426114, 33246, 76491, -229128, -100409, -84288]
11739h4288A09095E1982N6668e2112B22291a43641e4789J1914H433K04101a0544
11727f0983A79134c09904f8497b3606l85144c5565j07897H3425l3992h2878Q711
11716g4167o2939B56226J35516A86601a50435B36761O2697a37316G3383a92334
11705c1130F9198c6320A89600q2528K5333n0112e8427I8337a33407C34424H0928
11693a03272b2256r1998B24610j8906r5166r459b28470C39134a06553D0185d3054
11681h2707A43720D1065f3798C0741a30739N4910A23054J47056J6276j23538J53533
11670C16381j36032M3770c6839j85202c5898R068o0641J2676A27554b2087k72954
11659b95041F9997A0473a27530p5202g8097C01483c8050C6607p648J69071a08371
$$ y = [-84288, 109095, 51982, 108650, -52112, 222291, -143641, -54789, -42875, 8433, 212534, -10544, -60983, 179134, -309904, -68497, -23606, -408750, -35565, -143462, 83425, 49433, -82878, -74167, -137106, 256226, 391742, 186601, -150435, 236761, 299458, -137316, 73383, -192334, -31130, 69198, -36320, 189600, 107072, 132405, 82293, -58427, 98337, -133407, 334424, 80928, -103272, -22256, -114254, 224610, 205704, 110538, 101079, -228470, 339134, -106553, 40185, -43054, -82707, 143720, 41065, -63798, 30741, -130739, -75829, 123054, 270110, 286386, 162848, 316381, 180349, 224119, -36839, -222041, -35898, -26830, -87471, -74795, 127554, -22087, -295041, 69997, 10473, -127530, -202732, -78097, 301483, -38050, 36607, 28959, 198030, -108371]
11647b57671b3814l7621H1923J70737A8872c3256B29735b987B75401j7967j8625
11636B38809F0120J23825o3321a9760E2185n695A2989b3578I3191a02956K2911
11625h0045H067J75084a67070k88274C33349A62134f5938k9729l0626Q577E5055
11613e3316A93465i2308j48800B11231J4666b25890A5450a03459k9601A92822
11602A56530b28508a04801B12818a05590B62876q7632A8381b23349i4239I4331
11591C4968J27140c290o2568A44302h4442O690D70056j94457C3394J54904n699
11580A82599a9766o6782A51391b15425F5476M6358P058P3718D8557h5185C48718
11568A1654Q9921f1514q1990j05202f858B41713M9756G6940g1860C22997b46301
$$ y = [-257671, -23814, -61435, 81923, 252660, 18872, -33256, 229735, -2987, 275401, 257434, 238809, 60120, 183945, 120624, -19760, 52185, 46490, 12989, -23578, 93191, -102956, -80045, 8067, 183151, -167070, -455344, 333349, 162134, -65938, -95667, -126293, -117716, 55055, -53316, 193465, -92308, -241108, 211231, 225897, -225890, 15450, -103459, -133060, 192822, 156530, -228508, -104801, 212818, -105590, 262876, 175244, 18381, -223349, -94239, 94331, 34968, 162108, -3290, -65858, 144302, -84442, -77752, 470056, 275599, 33394, 188298, 182599, -19766, -86548, 151391, -215425, 65476, 111834, 118892, 192610, 48557, -85185, 348718, 11654, 101575, -61514, -143504, -248706, -6858, 241713, 291469, 76940, -71860, 322997, -246301]
11556A13101N2358a04900B67291c00320F6664a4565A20717K250R7877p9793g0480
11544A86736e2975C13598Q5159o4206a27829L1054A86745n8234e4535A75681Q3584
11533B59265a3283H6914J65820i4180M7078k8257L7210B14320M07500B08608H9789
11521H6100j8880a67385N3270A94390O2677A27374K00421P9372c54662F1294O9643
11510A30937h6057j35233G0687R4178a09883I3114k3576J36647K18339A82871
11499B59919b31457A78880L1047A0468g9189C7714J22853K05116b74220a4042
11488B75115R0159j62100b07173A8853J73306K8115C8989K2030K52358F8996j4896
11477E4100L18513j65115J16911b3344A82853c9443A35794Q7875E4341a30404
$$ y = [113101, 165459, -104900, 267291, -300320, 66664, -14565, 120717, 122967, 220844, 141051, -70480, 186736, -52975, 313598, 398757, 334551, -127829, -96775, 186745, 128511, -54535, 175681, 259265, -13283, 86914, 252734, -94180, -47102, -75359, -38149, 214320, 621820, 208608, 89789, 86100, 67220, -167385, -114115, 194390, 257067, 127374, 327795, 407167, -354662, 61294, 130937, -86057, -221290, 70687, 164865, -109883, 93114, 69538, 206185, 424524, 182871, 259919, -231457, 178880, 209927, 10468, -79189, 37714, 160567, 365683, -274220, -14042, 275115, 365274, 203174, -207173, 18853, 192159, 220274, 38989, 61019, 313377, 68996, 54100, 372613, 207498, 324409, -23344, 182853, -39443, 135794, 223669, 54341, -130404]
11466C08928A07498L15191a53416B9599b27323E3504N2665J56656F6741j4407
11456E2334a65141G8288l5929a71078G6132a03404k49246d1168I3665J71c0745
11444a94805I2280l1702A1674K28077A5615b24829C46032F9233k2680h234D8694
11432a051m06158C8474P1139l4126K1325A1633d4604k76150a02957n6982f8611
11420b24014a00782B98952a86408A73124G4309a03234G1136Q1505b10220A30913
11409i5419C60662n7995E3708i823E9805a30699G432J7275P3873k3761N1722e0428
11396A05447Q5889a18395o4354g312j47618l3008I883J01761p10f5164A4406M8892
11384F3298K2740h0434B71193a24836C98667j24709D3909b1824j98451A33081
$$ y = [308928, 107498, 422689, -153416, 29599, -227323, 53504, 106169, 262825, 66741, 52334, -165141, 78288, 42359, -171078, 76132, -103404, -352650, -41168, 93665, 93836, -30745, -194805, 92280, 60578, 11674, 239751, 15615, -224829, 346032, 69233, 46553, -8234, 48694, -1051, -407209, 38474, 109613, 75487, 96812, 11633, -44604, -320754, -102957, -159939, -68611, -224014, -100782, 298952, -186408, 173124, 74309, -103234, 71136, 152641, -210220, 130913, -95419, 360662, 302667, 53708, -9823, 59805, -130699, 7432, 24707, 98580, 74819, 126541, -50428, 105447, 191336, -118395, -182749, -7312, -154930, -187938, 9883, 111644, 110934, -65164, 14406, 63298, 86038, -80434, 271193, -124836, 398667, 273958, 43909, -21824, -220275, 133081]
11373A06361J39144p1097J01660a15579C0349L3982a39132I4900a54732H5270
11362A44274Q7902e2035l8250L7464J7459c21C13452c51214A54212j1915M2977
11351A85274G2916B8253d88275a57968e3652j11028n8420b3594j91813q0239B36676
11339b77477B20109h6346K2656C0927b70980E033d22901B92700b3820H4769b46414
11327h0189B84144n6446b59667A76686e03443a14584K0905E7463a1840G5326M9226
11316A24552P9975a96695C1463a46679C53815A30616b16248A40580C2810b62988
11305A98356k2032E7188o512F275J76748J11892c32587J03044D390a98789A12615
11293c95570d4364j16489a8763A13556O1338a21760M4073B2022b50818l3381J35982
$$ y = [106361, 245505, 174408, 276068, -115579, 30349, 64331, -139132, 94900, -154732, 85270, 144274, 232176, -52035, -90285, -52821, -35362, -321, 313452, -351214, 154212, 142297, 185274, 72916, 28253, -488275, -157968, -53652, -164680, -223100, -23594, -215407, -295646, 236676, -277477, 220109, -86346, -63690, 30927, -270980, 5033, -422901, 292700, -23820, 84769, -246414, -80189, 284144, 227698, -259667, 176686, -503443, -114584, -93679, 57463, -11840, 75326, 124552, 204527, -196695, 31463, -146679, 353815, 130616, -216248, 140580, 32810, -262988, 198356, 176324, 57188, 50676, 6275, 183023, 294915, -332587, -229543, 4390, -198789, 112615, -395570, -44364, -160853, -18763, 113556, 174894, -121760, -77687, 22022, -250818, -284199, -148217]
11282a48217A30803J1475b93736J08538p9817j11058i3562n662B03158c78493
11271b09178B77125a46442b8780J2299D9061a43054d3098m034A6627L2785J13448
11260A62860g2852B1198a58558c5889a3302l6107B25516e7159A64145f8762A20773
11248I7641b69020B8716c10831O9141K2267j12659a03991j01005h0444H7293d3513
11236a67867a2363j25148L7287K0926r6318A054a47715J3802A9216f1205C29342
11224d5949o7655L0139F8634J08849c8412k18381c3126n9236c9390D5304b14250
11212A69625a38215G4142f4248J3470B66327f0328B267a15008p2327B20224a22360
11200i7113J5736l22o3815j19790a16080C6780e5011C2553b45674j9583J03150
$$ y = [-148217, 130803, 142278, -293736, -185198, -265015, -376073, -93562, -99224, 203158, -378493, -209178, 277125, -146442, -28780, -16481, 49061, -143054, -43098, -47132, 16627, 49412, 162860, -72852, 21198, -158558, -35889, -13302, -49409, 225516, -57159, 164145, -68762, 120773, 97641, -269020, 28716, -310831, -241690, -219423, -332082, -103991, -204996, -80444, 87293, -43513, -167867, -12363, -137511, -100224, -79298, -175616, 1054, -147715, -133913, 19216, -61205, 329342, -45949, -113604, -83465, 68634, 177483, -38412, -256793, -33126, -92362, -39390, 45304, -214250, 169625, -138215, 74142, -64248, -50778, 266327, -60328, 2267, -115008, -187335, 220224, -122360, -97113, -81377, -81699, -145514, -265304, -116080, 36780, -55011, 32553, -245674, -265257, -162107]
11189a62107r5342O6674j84857A36157p138A6963L7218a94273l37234B9998J10097
11178A40095c8215A7961Q6580b1327A72692b91409N4015e0406A71586B7743J47238
11167A74981a50917g2106p1722A4887b07269A58193d15424A9005b37290C0397
11156c47576A40347L6219g7543A61750N0784I9719R662h1307D7318d7235A12949
11144c1770a5827F1607b27036B03119A3392b94095B38030J1802d1454j57684A62786
11132h8758q6618d3774n942l1896H861J74781a43735P0349A42137b20520m571
11121b25091A14717h8168B1225a45868B40712b02207a9436C9028K08381l2494
11111B14915F4532l698i6927A51665Q8329b4819A15933C8515J9509L9903a96967
$$ y = [-162107, -257449, -190775, -375632, 136157, 129019, 16963, 54181, -194273, -531507, 29998, 140095, -38215, 17961, 104541, -21327, 172692, -291409, -237394, -50406, 171586, 27743, 174981, -150917, -72106, -143828, 14887, -207269, 158193, -415424, 19005, -237290, 30397, -347576, 140347, 176566, -77543, 161750, 212534, 99719, 109381, -81307, 47318, -47235, 112949, -31770, -15827, 61607, -227036, 203119, 13392, -294095, 238030, 249832, -41454, -199138, 162786, -88758, -175376, -43774, -49716, -81612, 8861, 183642, -143735, -73386, 142137, -220520, -225091, 114717, -88168, 21225, -145868, 240712, -202207, -19436, 39028, 247409, 214915, 64532, 60834, -96927, 151665, 239994, -24819, 115933, 38515, 58024, 97927, -196967]
11099A59833a6058j30308C14549a82821E9446N5463a24901C84955A08476e6833
11088B46514L04m0762F1419a29306D91567c1241A47322J21743j24645K21536j14861
11077B51095E323J88656q5919j2519J27070L07271j52456A19115O6021J70251
11067C55387K29183A95988L08987o9746m7350J48572k08426O3432K95732k88171
11057C99018K70273k05238K9713j25207M4034N0522J51577j89481K20744j04163
11047E41792O5879j12671j7621k4858j58102N8055O8589M768J96390L379j60824
11036D64776P8116k63132K61156q5560J10346P6253k71088M38709B71980N65393
11026H37373j5934k71027K64833k7005l11446J92341j6309B46754N89162C42949
$$ y = [159833, -16058, -146366, 314549, -182821, 59446, 114909, -124901, 384955, 108476, -56833, 246514, 246818, 206056, 61419, -129306, 491567, -31241, 147322, 269065, 144420, 365956, 251095, 5323, 193979, 108060, 95541, 222611, 529882, 377426, 119115, 185136, 355387, 584570, 195988, 504975, 435229, 387879, 536451, 328025, 391457, 687189, 399018, 669291, 464053, 493766, 368559, 412593, 463115, 614692, 425211, 645955, 541792, 607671, 495000, 477379, 452521, 294419, 352474, 421063, 425831, 622221, 625600, 464776, 542892, 279760, 540916, 455356, 565702, 641955, 370867, 809576, 271980, 837373, 821439, 550412, 815245, 788240, 476794, 669135, 652826, 246754, 835916, 342949]
11015D03837L4549j4524R1487O2858j90833r3127J03770R3654B17143R8740K46525
11004E62408A74102L57581j4615R6841m551k16254L04801k38403m2217J11152
10994E28437J57304k2167j08671k72505P81823k20784m10860L23569j00986K34962
10984H90122l6512p0938l2179L18725k62520K01844j3862K37590L17643L19760
10974A869673k49140N71984J20792r4029K78761m58834K95052Q0253k48333o50721
10964A515458l6301r3813l30555L52606O1583J4817J74497m5883k2000J17542
10954A707951L2192k93202k39637k41207k89111L17401D06596A81882L44898H7882
10943B83231J95404j20538j53806l9210n10O7993M6028b89538B91877A709J08380
$$ y = [403837, 438386, 423862, 515349, 578207, 387374, 294247, 398017, 491671, 217143, 315883, 562408, 174102, 531683, 517068, 613909, 609358, 393104, 697905, 459502, 417285, 528437, 685741, 663574, 554903, 282398, 1064221, 843437, 432577, 756146, 655160, 890122, 853610, 782672, 750493, 1069218, 806698, 1008542, 994680, 1232270, 1549913, 1869673, 1620533, 2192517, 2313309, 2219280, 2498041, 2039207, 2334259, 2414512, 2166179, 1515458, 1479157, 1385344, 1054789, 1407395, 1468978, 1483795, 1658292, 1612409, 1590409, 1707951, 1740143, 1446941, 1207304, 966097, 676986, 994387, 406596, 181882, 526780, 87882, 283231, 478635, 358097, 204291, 165081, 164571, 232564, 278592, -289538, 291877, 1709, 110089]
10932A10089a14199A4086J77083M0932J00946j29885I685R2683e2772j99813e3693
10920e7609a5729j160j2583A02445G232J7081e0440J6393j73705B09793a86628
10908a03156g364D0310e40262C09472b48162g865k9670A45900g1197b3953m6949
10897g0902F8142i8927A53386o3783l807m1513J12492b55585g9742a1990j06414
10886a18404A40609f1926A2234M2074a36948j30902c1526o6933I6862K14377b48583
10874B48453a08921a934j11844C9512J02934d2327J9836A43253A4888M7816p849
10863E4855b29578l155Q8953a3623A59762a10522r435d5361j37420b6752k553
10852b9305k63820J41690n1255J9693J3012B44319p0385i4091A60028a7442A90060
$$ y = [110089, -114199, 14086, 191169, 232101, 333047, 203162, 9685, 102368, -52772, -252585, -53693, -57609, -15729, -16889, -29472, 102445, 7232, 24313, -50440, -34047, -207752, 209793, -186628, -103156, -7364, 40310, -540262, 309472, -248162, -7865, -37535, 145900, -71197, -23953, -70902, 68142, -98927, 153386, 89603, 85796, 44283, 156775, -255585, -79742, -11990, -118404, 140609, -61926, 12234, 54308, -136948, -267850, -31526, -98459, 96862, 311239, -248583, 248453, -108921, -1934, -113778, 39512, 142446, -42327, -22491, 143253, 14888, 62704, 54855, -229578, -232733, -143780, -13623, 159762, -110522, -119957, -45361, -182781, -26752, -29305, -293125, -151435, -202690, -182997, -169985, 244319, 173934, -94091, 160028, -17442, 190060]
10840I6400O1431J67109c0199B57035O7492A9714g6955j31213d30F2738a54067
10828C248J17294R0866g998A43154h4656G8011N9368b39499g0157C2245L935f1886
10815a14737E9172k3856a70772N5192B71536a1820C96139B9281a52070E6412h8800
10803d8552n4064p7584c4907A00137e20222a85253G8202j6429J7595j3577b69136
10791c0970D13946j89837e4625j29765o6350j92518b09036A16531e1478o2907
10781a14385N6502k7387n9430f331A582b16722D9936M9645d3611k33062K8915
10770b47758F433M1819J56303a79946C42310c34338B78786G0975d4806j35975
10760a80781b3594J0712l77707a17560B4121d3555H5274M07625a75937D4412K61823
$$ y = [96400, 157831, 324940, -30199, 257035, 324527, 19714, -76955, -208168, -430, 62738, -154067, 3248, 120542, 211408, -7998, 143154, -84656, 78011, 137379, -239499, -70157, 32245, 36180, -61886, -114737, 59172, 35316, -170772, -115580, 271536, -11820, 396139, 29281, -152070, 56412, -88800, -48552, -102616, -180200, -34907, 100137, -520222, -185253, 78202, 61773, 79368, 65791, -269136, -30970, 413946, 224109, -54625, -184390, -250740, -443258, -209036, 116531, -51478, -114385, -57883, -85270, -144700, -6331, 1582, -216722, 49936, 99581, -43611, -276673, -247758, 6433, 48252, 204555, -179946, 342310, -334338, 278786, 70975, -44806, -180781, -23594, -12882, -390589, -117560, 24121, -43555, 85274, 492899, -175937, 44412, 306235]
10749C06235b6815j449k28501e8101j04313A32297g8241j93877J18096C69974
10738b2935A75073a29878k1792j19306H9101b31142B9767K74351d2708j50532
10728a93240d354k37495A01121b25768A00694d8853l01161A66753d17842B23808
10717B44023a08582A04632O5567C7122j2361b1526j50894A04053A1539a5353c303
10705A99149e15040b54810A000K52122b26546q760a230B4555J15842D0260c04794
10693g9001G5061J9137b75386e1206o920A12697k3741I419a02325d7923k3223
10682g1146b2762q2076n907A43281m2120b38755Q6651j22089e9991l20550a09574
10670E5835a25468j27287f6173H164c69097F9756K17353B9342a67372c3707M730
$$ y = [306235, -26815, -28264, -256765, -58101, -162414, 132297, -78241, -272118, -154022, 369974, -22935, 175073, -129878, -151670, -270976, 89101, -231142, 29767, 304118, -42708, -193240, -4354, -241849, 101121, -225768, 100694, -48853, -350014, 166753, -417842, 223808, 244023, -108582, 104632, 170199, 37122, 24761, -21526, -172420, 104053, 11539, -15353, -3303, 199149, -515040, -254810, 1000, 253122, -226546, -235306, -1230, 24555, 140397, 40260, -304794, -79001, 75061, 94198, -275386, -51206, -58126, 112697, 88956, 9419, -102325, -47923, -71146, -22762, -104838, -110745, 143281, 101161, -238755, -152104, -274193, -59991, -380541, -109574, 55835, -125468, -252755, -66173, 8164, -369097, 69756, 287109, 29342, -167372, -33707, -28977]
10659b8977l06907C3287q389g6210r4574F8715b83715H5771d69086a13520j71939
10648b85459E9759c374m3505B09051B0192a6415q3185j47856A62670a23299b4622
10636a1072A0853f2437B06606a66394J4253j51544f0631A1580b80659k1313B80640
10624B9508a63023n1873E2589c85576a50523g3570I1591a05632d4409E4497K2391
10613G6888b66903a19440e8113A02807a96165r0148N5319R7491l2121G3423b46607
10601d1639J0312p5574j48737p965B32497a72882O2675N4279j32072e3790Q34
10590e2956j56635B4999A0006a78155H96b6778j64429a1644l41845J52599e3019
10578c30338A47694g3381I892k226h6695C5344a37913b3048D2266J18461Q9592
$$ y = [-28977, -335884, 33287, 24898, -76210, -170784, 68715, -283715, 85771, -469086, -113520, -285459, 59759, -3374, -46879, 209051, 20192, -16415, -99600, -247456, 162670, -123299, -24622, -11072, 10853, -62437, 206606, -166394, -152141, -303685, -60631, 11580, -280659, -301972, 280640, 29508, -163023, -214896, 52589, -385576, -150523, -73570, 91591, -105632, -44409, 54497, 76888, -266903, -119440, -58113, 102807, -196165, -286313, -230994, -133503, -165624, 73423, -246607, -41639, -31327, -106901, -255638, -263603, 232497, -172882, -110207, -55928, -188000, -53790, -52956, -209591, 24999, 10006, -178155, 896, -26778, -191207, -11644, -353489, -200890, -53019, -330338, 147694, -73381, 9892, 7666, -86695, 35344, -137913, -23048, 42266, 160727, 250319]
10567B50319b74j46624A6485c83648B40060O7863c9055D2191K5740J30041g8789
10555a98161B89228A44237a24807A11988N4755K6101n1521M77445F9642r948J60899
10544B20593p5333c71143h2110L6104B38202f1231A06148g8087q2715j4169k34669
10533d09640G6157B6096O9603f9434A49187a13794q528j34565L1908m168B1145
10521i7507B53409c1462l28134B67136D4429R1196F5107c17631a21050J4292J1260
10510i5498n4506A35414a17988A64529f5711k95480B81069b37373A03800h529
10499A40434a39629b7178j70848g1392j18204A74021J4122J5983b63483R4521
10489a68962H9130e5442K3134A8337C569a18798D38220C0405K23424K98173j21157
$$ y = [250319, -274, -146898, 16485, -383648, 240060, 307923, -39055, 42191, 67931, 197972, -78789, -198161, 289228, 144237, -124807, 111988, 166743, 192844, 141323, 618768, 69642, 59694, 220593, 145260, -371143, -82110, -46006, 238202, -61231, 106148, -78087, -160802, -174971, -409640, 76157, 26096, 95699, -69434, 149187, -113794, -122322, -256887, -224979, -229147, 21145, -97507, 253409, -31462, -359596, 267136, 44429, 135625, 65107, -317631, -121050, -106758, -95498, -150004, 135414, -117988, 164529, -65711, -361191, 281069, -237373, 103800, -8529, 140434, -139629, -27178, -198026, -71392, -189596, 174021, 188143, 204126, -263483, -168962, 89130, -55442, -32308, 18337, 3569, -118798, 438220, 30405, 253829, 552002, 430845]
10478D30845L13211c6238D7850K26657A05189R741Q1455C1963m796N8169J80381
10467B65717a76063o619o7763a9181A47189E6749Q695b1195k36284B0425b99396
10455D26896b618k01784F6295d00480a46490A72434E5880a41426A46723j5072
10445A31651a66294k09428a02931B39771B4195d8268l31575B86825a28930j253
10435a30183j50902D6445a06580j81354d3721j82905A69850c8795F0592f2293
10424a12239B1854M18742G1821a62604M3700L8186A01977c64237L8730A63089
10413B02296c2155E8711f0438r5126a6887n01760K27682C58460d1103l37062A77257
10401b08072A10256A6021b70914R4096j44741C8014a17754m6802j76552i9998
$$ y = [430845, 744056, -36238, 47850, 274507, 105189, 114930, 196385, 31963, 27167, 85336, 265717, -176063, -182682, -250445, -19181, 147189, 56749, 65444, -21195, -257479, 20425, -299396, 426896, -2618, -204402, 66295, -400480, -146490, 172434, 55880, -141426, 146723, 131651, -166294, -375722, -102931, 239771, 24195, -48268, -379843, 286825, -128930, -130183, -281085, 46445, -106580, -287934, -43721, -226626, 169850, -38795, 60592, -62293, -112239, 21854, 440596, 71821, -162604, -118904, -80718, 101977, -364237, -325507, 163089, 202296, -32155, 58711, -60438, -155564, -16887, -518647, -290965, 358460, -41103, -378165, 177257, -208072, 110256, 16021, -270914, -176818, -321559, 38014, -117754, -164556, -341108, -99998]
10390I8399J06722c68411b7435I5759B0310J53258c35733B20074d7805p4810A31425
10378H2871K31492d9914C27550c6017A0484K60630K4030G6131K54186j33796K82547
10367D79068P4050j63398j59633I9941O2749J02140I2605k8323K97114K87163
10357F48559a96394B02401j5408q0375c87C06770m7062J02949p2607n1217o578
10346B32255L6568f8881F26514B40832L45288J6326A99963J67788J81419A6154
10335B02914p2797L21193a02939A16023a11148A85147G0618J86139I230J07492
10325A16722m3860K37046N7065o4846p0893G6986J30911m1380B3812J03533J6341
10314A43686J55173a08656F3126K14782b78021A69994E3360O7308c1076l8253
$$ y = [98399, 205121, -368411, -27435, 95759, 20310, 173568, -335733, 220074, -47805, -122615, 131425, 82871, 314363, -49914, 327550, -36017, 10484, 271114, 295144, 76131, 330317, 196521, 479068, 553118, 389720, 230087, 99941, 162690, 264830, 92605, 64282, 361396, 648559, -196394, 202401, 186993, 106618, -387, 306770, 259708, 362657, 290050, 238833, 232255, 268823, -68881, 626514, 240832, 586120, 602446, 199963, 367751, 549170, 16154, 202914, 130117, 451310, -102939, 116023, -111148, 185147, 70618, 256757, 9230, 116722, 72862, 309908, 366973, 302127, 231234, 76986, 207897, 166517, 23812, 127345, 143686, 298859, -108656, 63126, 277908, -278021, 169994, 53360, 120668, -31076, -69329]
10304f9329D8351L22149A29063a29548A75576K34508C2317J65774a42866n7628
10294b00494H6991i9610j85269E433a49178J4113A18186a28882r9913g0487I0147
10282c03812D3552a24577A49093c31214D2060a04583c1708k3660D443a02009A50151
10270B8429N691M1827a51740L5059A85562D3914g3569B09237E5301Q8425N9418
10259B03144K5431r2810N04707A56927J34589e9578m8541P287C69340i4987A5937
10247B6509N4444J6121Q9106n2740d5816A66399m6003E8572e1081C1396a64166
10235h8055B51881A01232l4471b48817E8369h6238j71372B81328d19790B27214
10224a31536q7298j00233a14444j36944a0619q5754d6497E8331b57111A19450
$$ y = [-69329, 48351, 370500, 129063, -129548, 175576, 410084, 32317, 198091, -142866, -200494, 86991, -99610, -284879, 5433, -149178, -135065, 118186, -128882, -228795, -70487, 90147, -303812, 43552, -124577, 149093, -331214, 42060, -104583, -31708, -55368, 4443, -102009, 150151, 28429, 34120, 75947, -151740, -116681, 185562, 43914, -73569, 209237, 55301, 143726, 203144, 228575, 135765, 640472, 156927, 291516, -59578, -108119, -100832, 369340, -94987, 15937, 26509, 80953, 97074, 186180, 133440, -45816, 166399, 120396, 58572, -51081, 31396, -164166, -88055, 251881, 101232, 66761, -248817, 58369, -86238, -257610, 281328, -419790, 227214, -131536, -218834, -319067, -114444, -251388, -10619, -96373, -46497, 58331, -257111, 119450]
10213e41046F7646C624O918b31146a04508B39654i6956m28373A22024l0359K2198
10202A13863N3409J07811d2403C49066g2241k3106k12738a5639j47849B12995
10191b17826j09457E4439K25676e1274J0637k47644a33652e6832p9799O0456c166
10179h9495J3350k33385J43201A70620a4186k94534D5211c66891a67869A36327
10168B81985b66320F3711h4852j59372L7745A27521a42768q0124J05197L4673
10158h3022B08676f5795q8776M0848a5325j74883e5146m176C8579J0175h9020
10146d60897A67500a06487c6223k97291a29315k00731A33358d0879l50354J82728
10136b08505H9463a92833j90621B8521a9267q9078k33767B84094a43997A2481
$$ y = [-541046, 67646, 3624, 10542, -231146, -104508, 239654, -96956, -525329, 122024, 91665, 113863, 167272, 275083, -42403, 349066, -72241, -95347, -308085, -15639, -163488, 212995, -217826, -327283, 54439, 280115, -51274, -40637, -288281, -133652, -56832, -136631, -76175, -3166, -89495, -76145, -309530, -166329, 170620, -14186, -308720, 45211, -366891, -167869, 136327, 281985, -266320, 63711, -84852, -244224, -206479, 127521, -142768, -222892, -117695, -83022, 208676, -65795, -154571, -113723, -15325, -190208, -55146, -59322, 38579, 48754, -89020, -460897, 167500, -106487, -36223, -333514, -129315, -330046, 133358, -40879, -391233, -208505, 89463, -192833, -383454, 28521, -19267, -108345, -342112, 284094, -143997, 12481]
10125A68213b82644K2286l8754J15535q4393L533A24297d9946J2239j15394c1347
10113e9388a3825p1805A0071d2543F6622a4120j7786D1013i7905I6553l3677J35174
10101A98050c04060A38392i6348c9665k567q0325E8253B490K02660g8522B18403
10089B7361J61240D0521J34326o2446a08435B8283L7556R7493G0104j3289b41507
10077b0402j53206d7792r6813c6560A76307E6367c02036a00m63205a49862d8529
10065a49605o9572A7622g0465I4156k9340d3049a0890E8841h3775o1424l06542
10054d51741J03990e4414j89901E8452J17158k6534b50236a12653k30036d0991
10043a08006k1687j4758K873k03665e4691B1892K42432h0092D3082i3494B2095
$$ y = [168213, -282644, -260358, -299112, -183577, -267970, -264437, 124297, -49946, -37707, -153101, -31347, -59388, -13825, -85630, 10071, -42543, 66622, -14120, -31906, 41013, -97905, 96553, 62876, 198050, -304060, 138392, -96348, -39665, -42232, -122557, 58253, 2490, 205150, -78522, 218403, 27361, 188601, 40521, 174847, 112401, -108435, 28283, 65839, 163332, 70104, 56815, -241507, -20402, -173608, -47792, -144605, -36560, 176307, 56367, -302036, -100, -463305, -149862, -48529, -149605, -219177, 17622, -70465, 94156, 64816, -43049, -10890, 58841, -83775, -145199, -451741, -347751, -54414, -244315, 58452, 175610, 149076, -250236, -112653, -342689, -40991, -108006, -129693, -144451, -141578, -345243, -54691, 21892, 264324, -80092, 43082, -93494, 22095]
10031b20031D8802J60652r1195g5253n4851d9333D1944R129A9766a32745k10562
10020c43307d2347N294J2163A07870i8751k40906j13584C5141a00879K4609j7030
10009i3300D7144J1134a29508p2169B50867c1565A6953a65216A63909a3360A1364
9997d47258a16587k047B663a47341k17226c1606k670k11214D8322M9181e5301
9985g9072j50172J00354o9848h1810E6792A9806a33035c6832I771b12279O4401
9974a47878j34131j19532a31392b7852E1768c8335A77766a12866c2977k0750G2341
9962c8341k4980a9339l5226m87062a90898i4052d4563D087K8724j393L08736m119
9950C36035a07332q722J2775l6540A59927E2451c39380E6173c40274H296a00711
$$ y = [-220031, 48802, 209454, 118259, -75253, -130104, -49333, 41944, 51073, 19766, -132745, -343307, -42347, -37053, -24890, 107870, -98751, -339657, -453241, 35141, -100879, -76270, -93300, 47144, 58278, -129508, -201677, 250867, -31565, 16953, -165216, 163909, -13360, 11364, -447258, -116587, -118634, 2663, -147341, -364567, -31606, -34276, -245490, 48322, 97503, -55301, -79072, -229244, -128890, -198738, -81810, 56792, 19806, -133035, -36832, 9771, -212279, -147878, -282009, -401541, -131392, -27852, 51768, -38335, 177766, -112866, -32977, -53727, 72341, -38341, -63321, -19339, -54565, -541627, -190898, -94052, -44563, 4087, 32811, 31418, 340154, 336035, -107332, -116054, -103279, -139819, 159927, 52451, -339380, 56173, -340274, 8296, -100711]
9938a96289C15171a67864j65836j47749B05194p8837b58368q2382G5216c4352
9927A25475B4679a25911A63068a92133f693q2357D30386d8314o2975m6666L8906
9916a19049B29c5928j50377h8029L6169i477B7497c05431A249N583a22391k01896
9904c24287J5519m5970A44032a01818h231k08575g4489j76322m96D8189a596k31986
9892b33582I4809a4163k53643C03986a48611F7734a4584o4439a4923j01534d6952
9880b0106A39567a12763a6051A76014g6005j15862j5161R733A5592N1332b34888
9868b57771C23505a67562H1952b58237F1728b84152J16593e6565a0611j50499
9858a61110B12326H3103c44344g1622l78676b23572a2600k85082a29629Q68A31095
$$ y = [-196289, 315171, -167864, -333700, -481449, 205194, 126357, -258368, -340750, 75216, -34352, 125475, 24679, -125911, 163068, -192133, -6693, -89050, 430386, -48314, -111289, -157955, -119049, 229, -35928, -186305, -88029, -51860, -9477, 27497, -305431, 1249, 6832, -122391, -324287, -308768, -354738, 144032, -101818, -8231, -216806, -74489, -250811, -251307, 48189, -1596, -233582, 94809, -14163, -267806, 303986, -148611, 67734, -14584, -79023, -14923, -116457, -46952, -20106, 139567, -112763, -16051, 176014, -76005, -191867, -207028, -197295, 15592, 66924, -234888, -257771, 323505, -167562, 81952, -258237, 61728, -284152, -167559, -56565, -10611, -161110, 212326, 83103, -344344, -71622, -450298, -223572, -12600, -297682, -129629, -128761, 131095]
9846a80147B34964p7987a5310B1219d6241E9267a04814n8754A77774a74378f5246
9834b20776q7856B22543b58770j6010J04385p4656j4920d119F7637a17504b4671
9822A69194b4504k83429B3604b00354d6746a1492k14265o6449a27186A75235D0832
9810b9636B55407e259p7074l0570A10794b05296B0805a41529d1636j60879j48606
9799c51121A17559e9638j52220i1559E833a96777f7515N92l65115h7304k3313
9788a10617J4320k08496H2995P2354c9216k1876B98480e3824p1303L7980A01179
9776B24055b02960A30747b25693J3392i2497p5741G6896i7946B4951h0739o2603
9765a43342k617m596c8856m320j12223a2027B4584a44163B9303b38368A64823
$$ y = [-180147, 234964, 156977, -15310, 21219, -46241, 59267, -104814, -163568, 177774, -174378, -65246, -220776, -308632, 222543, -258770, -274780, -170395, -245051, -259971, -4119, 67637, -117504, -24671, 169194, -24504, -307933, 23604, -200354, -46746, -11492, -225757, -292206, -127186, 175235, 40832, -29636, 255407, -5259, -82333, -112903, 110794, -205296, 20805, -141529, -41636, -202515, -351121, 117559, -59638, -211858, -91559, 5833, -196777, -67515, -66923, -432038, -87304, -110617, -96297, -304793, 82995, 155349, -39216, -61092, 298480, -53824, -125127, -87147, 101179, 224055, -202960, 130747, -225693, -212301, -92497, -168238, 76896, -97946, 24951, -80739, -143342, -145959, -150555, -38856, -43176, -155399, -12027, 24584, -144163, 29303, -238368, 164823]
9753a87891A20314D0657b13865B81374A884c98041F2796B4649J66708E8025O2631
9742A20656e9489I0217A288g4882F1930f3325l03151Q6960J30314A92559a1338
9730E9996A8410b92780a25677I1454K4146A4566a51838b2507p4025j12010K0551
9719a87991o9955P1971L3156a303A40500a76933B47797H2424a28331k04909O9276
9708b63964F5867d166j1503B91846a19302l13303a89498I127b81743J39989I0071
9696B09895c614q108l02439h3832j26093C9257c09998c39j18263D4149b9802k61044
9684b90846G461c27216M3911a26644j40811J14706o5826L9596f284k00366e5826
9672A30294J99401A35202Q3418H7047f9623q0111J7256j6128D1555b8645k78506
$$ y = [-187891, 120314, 40657, -213865, 281374, 1884, -398041, 62796, 24649, 191357, 58025, 120656, -59489, 90217, 1288, -74882, 61930, -63325, -366476, -279516, -149202, 192559, -11338, 59996, 18410, -292780, -125677, 91454, 115600, 14566, -151838, -22507, -96532, -208542, -187991, -257946, -185975, -152819, -1303, 140500, -176933, 247797, 82424, -128331, -333240, -263964, 65867, -4166, -15669, 291846, -119302, -432605, -189498, 9127, -281743, -141754, 90071, 209895, -3614, -11722, -314161, -83832, -209925, 39257, -309998, -339, -118602, 44149, -29802, -290846, 7461, -327216, -283305, -126644, -267455, -152749, -218575, -178979, -6284, -206650, -55826, 130294, 329695, 135202, 218620, 87047, -69623, -149734, -132478, -148606, 41555, -28645, -307151]
9661c07151a42120A40607e9118A34900O3312d1110j8979j2745A49001f4742C6013
9649a23658A97239j6661b84505C3304b50693d0491a2514j19444k46374d8817j05074
9638a53891o9219c2145D9709M2250b09566G0230b91352a09925I2391d14511I0528
9626A98157g8969j18475j56094a62041N4006l0817a1507k02039B01368I9688R503
9615A09191P466K49812a38543D7135P9214C6082c55544A64403a87822K016A23086
9603b16558A63121J16330j29132a1082k62165a01549q154L4660L2728K1053B9631
9591F9121b70203f0361n0760k8569F6149A563a0722B8157a82901B1430a03365
9579c11026c3666n4615C3723c4178n1920j11717G4289M0205b78885N3128R8738
$$ y = [-307151, -142120, 140607, -59118, 134900, 198212, -41110, -60089, -72834, 149001, -64742, 36013, -123658, 197239, 180578, -284505, 33304, -250693, -40491, -12514, -131958, -378332, -48817, -153891, -223110, -32145, 49709, 91959, -209566, 70230, -291352, -109925, 92391, -414511, 90528, 198157, -78969, -197444, -353538, -162041, -108035, -138852, -11507, -213546, 201368, 99688, 109191, 116657, 366469, -138543, 47135, 126349, 36082, -355544, 164403, -187822, -185806, 123086, -216558, 163121, 279451, 150319, -11082, -273247, -101549, -109703, -75043, -42315, -21262, 29631, 69121, -270203, -60361, -111121, -139690, 66149, 1563, -10722, 28157, -182901, 21430, -103365, -311026, -33666, -88281, 33723, -34178, -86098, -197815, 74289, 114494, -278885, -225757, -127019]
9568a27019A26688c7017A13314b27561B87264a08550a9431B1796i9680j45669
9558b45349A73963a76978k51077c0312l1963j12509A26184a78329H3506b9367
9547A20003L5143a8381j09588E7738a16605j085j2260M0777L18B28J19518E0880
9534d08868H023a58469f4534A14894K33995b6799p3958L2509j43699A34991K03462
9523C38453a39255k5209H8888b70248I4406a46799N0746H4447c57821k8149a0248
9511C74057a10815A02537m0583b68892H1837N2114h4982a7157E5997a87237m7338
9500b34575h0962c1168A02635a08724M9414B8751d285A27090c49424a25497N7078
9489f8419A21991a89759A27782c2936B73029k3178b37850a11821j18285B87953
$$ y = [-127019, 126688, -37017, 113314, -227561, 287264, -108550, -19431, 21796, -99680, -245349, 173963, -176978, -428055, -30312, -62275, -174784, 126184, -178329, 83506, -29367, 120003, 155146, -18381, -127969, 57738, -116605, -117690, -129950, -89173, -88855, 228, 119746, 50880, -408868, 8023, -158469, -64534, 114894, 348889, -26799, -100757, -68248, -211947, 134991, 338453, -139255, -164464, 88888, -270248, 94406, -146799, -96053, 84447, -357821, -385970, -10248, 374057, -110815, 102537, 61954, -268892, 81837, 133951, -84982, -17157, 55997, -187237, -234575, -80962, -31168, 102635, -108724, -59310, 28751, -4285, 127090, -349424, -125497, -68419, 121991, -189759, 127782, -32936, 273029, 249851, -237850, -111821, -230106, 287953]
9478a80714N9547e5937j02976E6474Q9607i9971L1683r4477b7238l64105C53078
9466d4011k82486p9320B9884c30192B26054C2836a53651b8662k2270F5126a95561
9454E2626b22383A464J71581E064K37842i9759D4568a34724q2375A0101a54670
9442b41533C21078a13229D6611d310j05090q5356m9961n169O0011O0356A55707
9430a65660j42203A38075a25981B94685a03940b860m9633a4737k28138e3893q0910
9419a34803o1683O4340o168k4174j14571A1268b3950A83177b26613B03029e6770
9407b87263i5036A25155g2434j05653m74569B56009b15598l02871a96100M4280
9397a51820h324k3784k7569k30649B47584a74414H260a59263F2062c2437j71388
$$ y = [-180714, -121167, -55937, -158913, 56474, 146081, -99971, -68288, -162765, -27238, -391343, 353078, -44011, -326497, -405817, 29884, -330192, 226054, 32836, -153651, -28662, -50932, 65126, -195561, 52626, -222383, 1464, 173045, 5064, 242906, -99759, 44568, -134724, -217099, 10101, -154670, -241533, 321078, -113229, 46611, -4310, -109400, -194756, -244717, -249886, -189875, -129519, 155707, -165660, -307863, 138075, -125981, 294685, -103940, -2860, -52493, -14737, -242875, -53893, -134803, -196486, -132146, -138314, -162488, -277059, 11268, -23950, 183177, -226613, 203029, -56770, -287263, -95036, 125155, -72434, -178087, -652656, 256009, -215598, -518469, -196100, -151820, -8324, -32108, -59677, -290326, 247584, -174414, 8260, -159263, 62062, -32437, -203825]
9386b03825A4769b2559k86771a39942E424K18591d5225A50163K4485E7197e0954
9374A28614f4598A34091a72355q7366N1505A58659d3215A12945P8121a69036F4198
9362c17285D5503b15004N1578j63340B20230B6825p428c0475j58063L9726k705
9351a51517C29340j01375C350g5638j47773j34697B60996A13314a23938B4821
9340b48674i3393n7323A55592A4549J26384b44532J816P1340e6552K0499j30345
9329a66398E8032a32328K2320k86280a08754d1337k36592q217D0697a15736A34513
9317E596K39007g9630l15644B7552c12042d3483B11877b7791A68209d8996E4588
9305A1268b29488p3576B3820O6799e98254g2607B88477a81815j0942d8378A38769
$$ y = [-203825, 14769, -22559, -309330, -139942, 5424, 224015, -45225, 150163, 174648, 57197, -50954, 128614, -64598, 134091, -172355, -259721, -208216, 158659, -43215, 112945, 191066, -169036, 64198, -317285, 45503, -215004, -163426, -326766, 220230, 26825, 19397, -30475, -188538, -148812, -151517, 329340, 227965, 3350, -75638, -223411, -358108, 260996, 113314, -123938, 24821, -248674, -93393, -150716, 155592, 14549, 140933, -244532, -242716, -171376, -56552, -36053, -166398, 58032, -132328, -110008, -396288, -108754, -41337, -277929, -286146, 40697, -115736, 134513, 5596, 244603, -79630, -395274, 27552, -312042, -43483, 211877, -27791, 168209, -48996, 54588, 11268, -229488, -303064, 23820, 90619, -598254, -72607, 288477, -181815, -192757, -48378, 138769]
9293B47359b24677D01633I6007b39081A1793J78136i30A55489o0067a16072j1838
9282a27910G6173a70900j66890C44996a89439b9638k21875A23575n8154K2294
9272H7715c2585b909A66390a94516j96689g4819I8845C5551j6933i6632F1680
9260a47149D78110C1946a68559d6592p4009O0279l2626b2394R567j1548j72769
9249a97144A80225q4901j701b60413F3992a77834m3133r7907j9392c3183j38789
9238a71972f3810j7239q8101A55410i9979j38123A70912p3717P4186a23281B98200
9226a78533G7974f4701I1724a52006A95097a06930j04568O4782p2578J01950L3502
9215h3842j4895C03436i8286J3790C1521b68965C3754j4585b16995h6935l02903
$$ y = [247359, -224677, 401633, 96007, -239081, 11793, 189929, -930, 155489, 95422, -116072, -127910, 76173, -170900, -337790, 344996, -189439, -29638, -251513, 123575, 65421, 87715, -32585, -2909, 166390, -194516, -391205, -74819, 98845, 35551, 18618, -96632, 61680, -147149, 478110, 31946, -168559, -46592, -120601, -60322, -92948, -22394, -12827, -24375, -197144, 180225, 95324, 93623, -260413, 63992, -177834, -220967, -318874, -338266, -33183, -171972, -63810, -81049, -169150, 155410, -99979, -238102, 170912, 97195, 171381, -123281, 298200, -178533, 77974, -64701, 91724, -152006, 195097, -106930, -211498, -146716, -219294, -117344, -83842, -98737, 303436, -98286, -84496, 31521, -268965, 33754, 19169, -216995, -86935, -389838]
9204c89838F4201b16466A6259P4834b72049d7558o1288A36982g0461A72370c20964
9192A2189d4431A29418b40881M3031f0596m1805J173A59651a19529l7750c5521
9180A93657h3257E2299a22105k72269a53700j43446J31198B57212L44b21784C1812
9168C9705f2156A0986b02339A3768k437i16j19915E5890a95626k12918C04220
9156c07094a8508p8944A60920B7637c0028j87130k7604A66967a25390m19e6380
9144a32406P016b4274A42569A1199h8652l19883b4769k88858c2555j9731A64823
9132a85681C4122a00161k4979C1581J27543g7098D2176a93614B3657a72993Q5584
9121h7409b9836n0378C0489a86748B77158F6937a46505j94084C62987h0482K4219
$$ y = [-389838, 64201, -216466, 16259, 91093, -272049, -47558, -108846, 136982, -70461, 172370, -320964, 12189, -44431, 129418, -240881, -197850, -60596, -102401, -101228, 159651, -119529, -157279, -35521, 193657, -83257, 52299, -122105, -394374, -153700, -297146, -165948, 257212, 257556, -221784, 31812, 39705, -62156, 10986, -202339, 13768, 11331, -916, -120831, 55890, -195626, -408544, 304220, -307094, -18508, -97452, 160920, 27637, -30028, -217158, -244762, 166967, -125390, -125809, -56380, -132406, -125390, -24274, 142569, 11199, -88652, -408535, -24769, -313627, -32555, -52286, 164823, -185681, 34122, -100161, -125140, 31581, 159124, -77098, 42176, -193614, 23657, -172993, -87409, -29836, -80214, 30489, -186748, 277158, 66937, -146505, -340589, 362987, -80482, -56263]
9110e6263j89849B28287E8192J10532a3373A65955c36676A5217L9724J63443a0967
9098h3380A18654J8529f811k84220C21958c12615j61626a01723j90606C9970j7560
9087B2410J17550c07692A53538d3263G3880A5378b9887a145C431R203f2592k30109
9075b92701a4355k5148B8524a30964M4802A7073a19365j07246c4673k60610B26318
9063h7350j64567F7173b94929f3485A50623C8692g2976l37078a53854A02299c96866
9051g2591B68861G199c06966b0690A8291c21230a03484I2063K16530A06668C8135
9039B38310d02847N9226A15960M2338a86730K2405e7314B9862b188o4520o1838
9028a28546C35304b01966A00345A3810a37249q6678B11172j4445d65947B18750
$$ y = [-56263, -246112, 228287, 58192, 168724, -13373, 165955, -336676, 15217, 54941, 218384, -10967, -83380, 118654, 137183, -6811, -291031, 321958, -312615, -474241, -101723, -292329, 39970, 22410, 139960, -307692, 153538, -43263, 73880, 15378, -29887, -1145, 3431, 12634, -62592, -292701, -14355, -39503, 28524, -130964, -86162, 17073, -119365, -226611, -34673, -295283, 226318, -87350, -251917, 67173, -294929, -63485, 150623, 38692, -72976, -410054, -153854, 102299, -396866, -72591, 268861, 7199, -306966, -20690, 18291, -321230, -103484, 92063, 308593, 106668, 38135, 238310, -402847, -343621, 115960, 158298, -186730, -164325, -57314, 29862, -2188, -66708, -128546, 335304, -201966, 100345, 13810, -137249, -223927, 211172, 196727, -465947, 218750]
9017A19123L60237a11550B56420a4022E6013R77c10889G1525i3366B25239b20423
9005h0373A27787J7405F7036C3449a25964J3077J0530p8752e2860l9398j66061
8994b58319E9049d08711B8897b08264A48211o9745A8246P8358g3321k7343A99474
8982E6148a02931j87393A09836D8187J13560a34217M4585n2351K28I5472a24552
8970b8475E7263c24133G8739N6942J00923a64232I2491b26744B62473b21916B6732
8958A03982b54504a25530P693k5448O7498D2559J83698b00034A25828a21311c7223
8946b38930I2901j359a90909q6076a23377D9793g4732R445k86480a6219A40051
8934e1271C70675a26959o4585c3364A21211a04698M4976H3123b6783B36445O439
$$ y = [119123, 479360, -111550, 256420, -14022, 56013, 56990, -310889, 71525, -93366, 225239, -220423, -80373, 127787, 145192, 67036, 33449, -125964, -112887, -102357, -181109, -52860, -92258, -258319, 59049, -408711, 28897, -208264, 148211, 78466, 18246, 96604, -73321, -100664, 199474, 56148, -102931, -290324, 109836, 48187, 161747, -134217, -89632, -141983, -141755, 95472, -124552, -28475, 57263, -324133, 78739, 135681, 236604, -164232, 92491, -226744, 262473, -221916, 26732, 103982, -254504, -125530, -117837, -143285, -75787, 42559, 226257, -200034, 125828, -121311, -37223, -238930, 92901, 91542, -190909, -276985, -123377, 49793, -74732, -65287, -351767, -16219, 140051, -51271, 370675, -126959, -191544, -33364, 121211, -104698, -59722, 83123, -26783, 236445, 242884]
8923B42884J513265M791735J0112312E395152I69025p7843m34769k24935a71468
8913h6790b6477j75169B65659K4874c264B46830N0894a88957G5521K72929a83026
8901b0506D6190a43487A23255f7459I1286B7826b11791A9854Q170M6311a26166
8889b16145m2275C7491L36603A04141a59885A064h4915I3777a80963p2401j56047
8878d09411g6113A09763K1246b27683j8278E9802J71949a6730j78716O5893E1864
$$ y = [242884, 1756149, 6547884, 16660196, 5395152, 969025, 891182, 456413, 231478, -171468, -86790, -26477, -201646, 265659, 290533, -3264, 246830, 297724, -188957, 75521, 348450, -183026, -20506, 46190, -143487, 123255, -67459, 91286, 27826, -211791, 19854, 28024, 74335, -126166, -216145, -258420, 37491, 374094, 104141, -159885, 1064, -84915, 93777, -180963, -253364, -409411, -76113, 109763, 131009, -227683, -245961, 59802, 231751, -16730, -195446, -129553, 51864]
$$ [...]
##END NTUPLES=NMR SPECTRUM
##END=
