##TITLE=AC1536_ROEFFECT0010_8214420_KJPr5HqVP5
##JCAMPDX= 6.0         $$ Bruker NMR JCAMP-DX V2.0
##DATA TYPE= NMR SPECTRUM
##DATA CLASS= NTUPLES
##ORIGIN= BRUKER
##OWNER= Administrator
$$ 1.72 TOPSPIN		Version 2.1
$$ 2013-10-11 16:51:48.158 -0700  Administrator@X
$$ Compression mode = diff/dup
##.OBSERVE FREQUENCY= 400.02188249412
##.OBSERVE NUCLEUS= ^1H
##.ACQUISITION MODE= SIMULTANEOUS (DQD)
##.ACQUISITION SCHEME= undefined
##.AVERAGES= 8
##.DIGITISER RES= 22
##SPECTROMETER/DATA SYSTEM= spect
##.PULSE SEQUENCE= zg30
##.SOLVENT NAME= COFFEE_meoh
##.SHIFT REFERENCE= INTERNAL, COFFEE_meoh, 1, 14.98509
##AUDIT TRAIL= $$ (NUMBER, WHEN, WHO, WHERE, PROCESS, VERSION, WHAT)
$$ ##TITLE= Audit trail, TOPSPIN		Version 2.1
$$ ##JCAMPDX= 5.01
$$ ##ORIGIN= Bruker BioSpin GmbH
$$ ##OWNER= Administrator
$$ $$ E:\/data/COFFEE/nmr/AC1536_ROEFFECT0010_8214420_KJPr5HqVP5/10/pdata/1/auditp.txt
$$ ##AUDIT TRAIL=  $$ (NUMBER, WHEN, WHO, WHERE, PROCESS, VERSION, WHAT)
(   1,<2013-10-11 16:51:41.736 -0700>,<Administrator>,<X>,<go>,<TOPSPIN 2.1>,
      <created by zg
	started at 2013-10-11 16:50:35.971 -0700,
	POWCHK enabled, PULCHK disabled,
       configuration hash MD5:
       C8 4E 4E 5D D3 5C D8 9E 9F 52 82 E0 59 8A DE 15
       data hash MD5: 64K
       2B 16 E7 D6 EE 8C 12 32 03 13 AD C7 72 7E 4F DA>)
(   2,<2013-10-11 16:51:44.549 -0700>,<Administrator>,<X>,<proc1d>,<TOPSPIN 2.1>,
      <Start of raw data processing
       efp LB = 0 FT_mod = 6 PKNL = 1 PHC0 = 0 PHC1 = 0 SI = 32K 
       data hash MD5: 32K
       48 96 A9 56 39 49 BE 8D D1 09 8D 5F E8 C8 6B C6>)
(   3,<2013-10-11 16:51:44.924 -0700>,<Administrator>,<X>,<proc1d>,<TOPSPIN 2.1>,
      <pk PHC0 = 96.08093 PHC1 = 0 
       data hash MD5: 32K
       90 58 62 CD 6C AA 12 AB CA 23 89 31 40 A8 1A 50>)
(   4,<2013-10-11 16:51:45.002 -0700>,<Administrator>,<X>,<proc1d>,<TOPSPIN 2.1>,
      <abs ABSG = 1 
       data hash MD5: 32K
       79 9A 00 3F 03 F1 37 47 57 02 4B 37 C1 5D 7C DA>)
(   5,<2013-10-11 16:51:45.064 -0700>,<Administrator>,<X>,<proc1d>,<TOPSPIN 2.1>,
      <abs ABSG = 2 
       data hash MD5: 32K
       1D 85 81 E2 4F 36 CC 57 1A 9A CA BD 0A AB 52 F0>)
(   6,<2013-10-11 16:51:45.158 -0700>,<Administrator>,<X>,<proc1d>,<TOPSPIN 2.1>,
      <abs ABSG = 3 
       data hash MD5: 32K
       DD 22 25 BC 19 E0 37 E3 FB 01 B0 2E 1B 6A 70 EF>)
(   7,<2013-10-11 16:51:45.205 -0700>,<Administrator>,<X>,<proc1d>,<TOPSPIN 2.1>,
      <abs ABSG = 4 
       data hash MD5: 32K
       76 45 29 D6 04 C8 29 EF 1B AD 56 10 84 6A 51 66>)
(   8,<2013-10-11 16:51:45.268 -0700>,<Administrator>,<X>,<proc1d>,<TOPSPIN 2.1>,
      <abs ABSG = 5 
       data hash MD5: 32K
       26 D9 70 D6 A5 75 54 4F 1D 87 63 99 A5 F6 DE BC>)
$$ ##END=
$$ 
$$ $$ hash MD5
$$ $$ DF 19 43 2E D3 8F 6A 24 62 BE 4B 3A 1F 3A C5 7B
##$RELAX= 
##$RELAX= 
##$RELAX= 
##$RELAX= 
##$RELAX= 
##$RELAX= 
##$RELAX= 
$$ Bruker specific parameters
$$ --------------------------
##$DU= <E:\>
##$EXPNO= 10
$$ [...]
##$TP= (0..7)
150 150 150 150 150 150 150 150
##$TP07= 0
##$TPNAME0= <>
##$TPNAME1= <>
##$TPNAME2= <>
##$TPNAME3= <>
##$TPNAME4= <>
##$TPNAME5= <>
##$TPNAME6= <>
##$TPNAME7= <>
##$TPOAL= (0..7)
0.5 0.5 0.5 0.5 0.5 0.5 0.5 0.5
##$TPOFFS= (0..7)
0 0 0 0 0 0 0 0
##$TUNHIN= 0
##$TUNHOUT= 0
##$TUNXOUT= 0
##$USERA1= <user>
##$USERA2= <user>
##$USERA3= <user>
##$USERA4= <user>
##$USERA5= <user>
##$V9= 5
##$VALIST= <valist>
##$VCLIST= <CCCCCCCCCCCCCCC>
##$VD= 0
##$VDLIST= <DDDDDDDDDDDDDDD>
##$VPLIST= <PPPPPPPPPPPPPPP>
##$VTLIST= <TTTTTTTTTTTTTTT>
##$WBST= 1024
##$WBSW= 4
##$XGAIN= (0..3)
0 0 0 0
##$XL= 0
##$YL= 0
##$YMAX_a= 651425
##$YMIN_a= -553685
##$ZGOPTNS= <>
##$ZL1= 120
##$ZL2= 120
##$ZL3= 120
##$ZL4= 120
##$ABSF1= 14.98509
##$ABSF2= -5.573092
##$ABSG= 5
##$ABSL= 3
##$ALPHA= 0
##$AQORDER= 0
##$ASSFAC= 0
##$ASSFACI= 0
##$ASSFACX= 0
##$ASSWID= 0
##$AUNMP= <proc_prof1d_extract_pilot.lims>
##$AXLEFT= 0
##$AXNAME= <>
##$AXNUC= <1H>
##$AXRIGHT= 0
##$AXTYPE= 0
##$AXUNIT= <>
##$AZFE= 0.1
##$AZFW= 0.1
##$BCFW= 0
##$BC_mod= 0
##$BYTORDP= 0
##$COROFFS= 0
##$CY= 15
##$DATMOD= 1
##$DC= 0
##$DFILT= <>
##$DTYPP= 0
##$F1P= 0
##$F2P= 0
##$FCOR= 0.5
##$FTSIZE= 32768
##$FT_mod= 6
##$GAMMA= 0
##$GB= 0
##$INTBC= 1
##$INTSCL= 1
##$ISEN= 128
##$LB= 0
##$LEV0= 0
##$LPBIN= 0
##$MAXI= 10000
##$MC2= 0
##$MEAN= 0
##$ME_mod= 0
##$MI= 0
##$NCOEF= 0
##$NC_proc= -8
##$NLEV= 6
##$NOISF1= 0
##$NOISF2= 0
##$NSP= 0
##$NTH_PI= 0
##$NZP= 0
##$OFFSET= 14.98509
##$PC= 1
##$PHC0= 96.08093
##$PHC1= 0
##$PH_mod= 1
##$PKNL= yes
##$PPARMOD= 0
##$PPDIAG= 0
##$PPIPTYP= 0
##$PPMPNUM= 2147483647
##$PPRESOL= 1
##$PSCAL= 4
##$PSIGN= 0
##$PYNMP= <proc.py>
##$REVERSE= no
##$SF= 400.02
##$SI= 32768
##$SIGF1= 0
##$SIGF2= 0
##$SINO= 400
##$SIOLD= 32768
##$SPECTYP= <>
##$SREGLST= <1H.CDCl3>
##$SSB= 0
##$STSI= 32768
##$STSR= 0
##$SW_p= 8223.68421052631
##$SYMM= 0
##$S_DEV= 0
##$TDeff= 65536
##$TDoff= 0
##$TI= <>
##$TILT= no
##$TM1= 0
##$TM2= 0
##$TOPLEV= 0
##$USERP1= <user>
##$USERP2= <user>
##$USERP3= <user>
##$USERP4= <user>
##$USERP5= <user>
##$WDW= 1
##$XDIM= 32768
##$YMAX_p= 456547961
##$YMIN_p= -672983
##$CURPLOT= <Network HP LaserJet P1505>
##$CURPRIN= <$Network HP LaserJet P1505>
##$DFORMAT= <normdp>
##$LAYOUT= <+/1D_H.xwp>
##$LFORMAT= <normlp>
##$PFORMAT= <normpl>
##$SURQMSG= 1
$$ End of Bruker specific parameters
$$ ---------------------------------
##NTUPLES= NMR SPECTRUM
##VAR_NAME=  FREQUENCY,     SPECTRUM/REAL,   SPECTRUM/IMAG
##SYMBOL=    X,             R,               I
##VAR_TYPE=  INDEPENDENT,   DEPENDENT,       DEPENDENT
##VAR_FORM=  AFFN,          ASDF,            ASDF
##VAR_DIM=   32768,         32768,           32768
##UNITS=     HZ,            ARBITRARY UNITS, ARBITRARY UNITS
##FACTOR=    0.250966925370066, 1,           1
##FIRST=     8223.43324360094, -51708,       -97125
##LAST=      0,             -125116,         110629
##MIN=       0,             -672983,         0
##MAX=       8223.43324360094, 456547961,    0
$$ Real data points
##PAGE= N=1
##DATA TABLE= (X++(R..R)), XYDATA
$$ [...]
$$ plain form
19553 -62168 -129372 -118151 181649 177689 -135491 -118953 -46806 -349232 159204 -372619 -105180
19541 -201959 -279709 -344256 107764 -171901 -56406 -219977 -22129 -30651 96972 68980 21564
19529 181394 -24895 132764 37314 -55693 -221850 -132652 375580 43356 -261549 -52660 167950
19517 9274 3559 72025 -27585 -121321 -171935 114732 177462 -96020 -153232 -316476 132123
19505 -250666 -209830 -44783 8491 96017 -203001 -120034 175171 -239166 -80747 -103311 347030
19493 -195543 -55959 14273 -84731 -92052 -172469 53861 -206821 -2938 -4789 61814 -157095 -66839
19480 -119559 -222728 -38978 -144412 226215 -12538 -252267 39602 -216800 -324315 -137599
19469 -17837 222630 -170020 -142632 -50160 -113214 -61266 -408196 -131736 227686 -67408 104014
$$ packed form
19553f2168o7204J1221A81649l960a35491J6538d6806l02426A59204c72619a05180
19541b01959p7750o4547A07764a71901e6406j63571b2129q522I6972k7992B1564
19529A81394b4895A32764C7314e5693j66157Q9198C75580D3356b61549e2660A67950
19517I274C559O8466b7585r3736n0614A14732O2730i6020n7212j63244A32123
19505b50666M0836d4783H491Q7526b03001Q2967A75171b39166h0747k2564C47030
19493a95543e5959A4273h4731p321q0417E3861b06821b938j851F1814a57095f6839
19480a19559j03169c8978j05434B26215a2538k39729C9602b16800j07515a37599
19469a7837B22630a70020K7388e0160o3054N1948l46930a31736B27686f7408A04014
$$ plain form
19457 132793 278336 431330 267752 210932 -147195 -204819 -477153 -184085 -85850 -45027
19447 -45027 188847 22807 151262 -140860 -74961 1511 -191169 -106872 -10343 -508091 -157811
19435 -263244 -1889 -131494 3156 463220 -105768 -399777 -63468 -256471 -3794 152246 -144847
19423 -72056 -173659 -167588 157918 -96109 -330437 11744 -175728 173844 -268692 62679 142223
19412 142223 -107637 226286 -1606 7528 -244274 67741 87835 -355435 -18012 -297886 -98351
19400 83419 199675 -23652 111410 -43865 185680 137662 -19460 241779 -170022 -145821 72482
19388 -248749 -93843 63049 33980 -118208 82959 312583 -187666 50524 -151086 -254659
19378 -254659 -24 -67737 296448 98864 128769 -184949 -98681 -82752 71071 -295813 -49007
$$ packed form
19457A32793J45543J52994j63578n6820a47195n7624k72334a84085h5850M0823
19447d5027A88847B2807J28455a40860O5899A511a91169Q4297a0343m97748a57811
19435b63244a889j29605C156M60064a05768k94009f3468j93003c794A52246a44847
19423g2056j01603O071A57918i6109k34328A1744a75728A73844b68692F2679P9544
19412A42223a07637B26286a606G528b44274F7741K0094c55435a8012k79874i8351
19400H3419J16256b3652A11410d3865A85680m8018a9460B41779a70022K4201G2482
19388b48749i3843F3049k9069a18208H2959K29624a87666E0524a51086j03573
19378b54659b4o7713B96448I8864K9905a84949Q6268J5929G1071b95813d9007
$$ plain form
19366 101182 10818 37461 -63247 75421 -111905 -398381 -216764 192918 -240886 -357780
19356 -357780 -154756 188775 -358219 78842 -317081 -348870 -220052 -112974 -108370 -43223
19345 37188 136115 -151053 -28210 182392 -6902 -99381 -82719 73511 -20896 -142542 -13065
19333 -82708 -199477 -262843 -235629 -196820 -143828 -208144 60825 -47674 -168741 -89022 152887
19321 -79717 -311742 -93034 -111529 -84246 99657 -42697 -50242 -25806 -199394 41961 123277
19310 123277 -145356 -299254 16339 -221607 -238616 -49864 -97059 134271 -264007 -201237
19300 -201237 -65129 11076 -73667 -54845 -254734 165886 130453 97880 55407 -132347 -106928
19289 -106928 48791 -109977 85790 -134935 -218718 -284453 -208231 -128491 -102406 -81075 64087
$$ packed form
19366A01182A0818K6643f3247G5421a11905k86476J81617A92918b40886j16894
19356c57780a54756A88775c58219G8842c17081l1789J28818J07078M604d3223
19345C7188R8927a51053b8210A82392f902r2479J6662G3511b0896j21646a3065
19333h2708j16769o3366K7214L8809N2992o4316F0825d7674j21067P9719A52887
19321g9717k32025i3034j8495K7283I9657d2697p545K4436j73588D1961Q1316
19310A23277a45356j53898A6339b21607j7009d9864m7195A34271b64007O2770
19300b01237f5129A1076g3667J8822j99889A65886l5433l2573m2473a32347K5419
19289a06928D8791a09977H5790a34935q3783o5735P6222P9740K6085K1331F4087
$$ plain form
19277 50046 246951 109331 -166328 -113040 -140962 -41912 164511 20354 -383051 89641 16315
19265 -45266 21954 -132479 161843 68010 -120521 -287269 312757 -293594 58146 -256682
19254 -117016 -132546 -163447 -193150 112295 -82124 -87750 183787 -269199 31569 -68550 -194783
19243 -194783 -258970 19288 24415 52587 -282645 -405593 82438 46291 215078 -27592 248462
19231 53695 368514 -290455 278266 -332161 45764 41361 136393 -137315 -325360 -475945
19221 -475945 -6977 -18914 138057 -176508 -107655 -267992 -16051 57450 35863 -2612 -312683
19210 -312683 21872 -8826 -219375 194266 -129192 42204 -156884 -306196 -212818 103796
19199 16367 -65580 -272998 -134921 36954 -90673 178582 -41955 -199159 193640 -109509
$$ packed form
19277E0046J96905A09331a66328N3288k7922d1912A64511B0354c83051H9641A6315
19265d5266B1954a32479A61843F8010a20521j66748C12757b93594E8146b56682
19254a17016j5530l0901k9703A12295h2124n626A83787b69199C1569f8550j26233
19243a94783o4187A9288N127K8172b82645j22948H2438l6147J68787b7592B48462
19231E3695L14819b90455B78266c32161D5764m403R5032a37315j88045j50585
19221d75945f977j1937A38057a76508O8853j60337a6051E7450k1587b612l10071
19210c12683B1872h826k10549A94266a29192D2204a56884j49312R3378A03796
19199A6367f5580k07418a34921C6954i0673A78582d1955j57204A93640a09509
$$ plain form
19188 -262559 133580 29611 -109522 124825 -9956 128277 -30196 -163261 58849 -59047 -26418
19176 89469 -108676 -181247 -485192 92218 77581 -91916 161717 191175 58674 53556 -204674
19164 -118328 -144429 -450173 -156860 -26972 -305246 67804 287759 -249870 -157608 -334153
19154 -334153 -217974 104071 191131 -339318 -182933 296829 -2588 -110913 -14813 82228
19143 -97464 -165618 -37031 18307 -174064 79265 -76612 -151859 -176778 121848 106258 74648
19132 74648 -246717 130101 -259486 -17975 314650 -261619 46985 -399760 105267 -44160
19121 -98054 -220149 152432 -113786 229988 83677 -194469 -113663 -155268 41199 10421 56176
19110 56176 -166344 48676 -268958 125654 -466512 -75843 -233823 -154195 -84790 -5557 -197879
$$ packed form
19188b62559A33580B9611a09522A24825i956A28277c0196j33065E8849e9047b6418
19176H9469a08676p2571l03945I2218j4637i1916A61717K9458E8674n118b04674
19164a18328k6101l05744a56860b6972k78274F7804K19955b49870R2262j76545
19154c34153J16179A04071Q7060c39318J56385B96829b588j08325a4813H2228
19143i7464o8154c7031A8307a74064G9265g6612p5247k4919A21848j5590l1610
19132G4648b46717A30101b59486a7975C14650b61619D6985c99760A05267d4160
19121i8054j22095A52432a13786B29988H3677a94469Q0806m1605D1199A0421M5755
19110E6176a66344D8676b68958A25654d66512g5843j57980P9628O9405e557j92322
$$ plain form
19099 -197879 -239410 -73238 -89138 -268582 36768 147087 -153429 -158089 12694 -244390 -311117
19088 -311117 -61177 223523 13488 210518 363590 128770 -7978 -5030 -238037 5077 -54418
19076 -183070 -263810 86863 -318587 -72992 -848 309859 -49483 172265 -187230 -80372 -121344
19065 -121344 46876 120611 -239887 -63155 -88815 -394518 443760 -228717 -172575 -63228 91822
19053 -144118 -374399 6882 -154301 -115811 6166 24614 -97642 -25749 -115614 -211928 -303816
19042 -303816 -197420 -324152 -87786 2722 52487 7359 220604 -426259 -459154 84145 -43028
19030 -73943 41025 -246227 -205937 245901 -103546 -339668 16675 258162 95731 -381996
19019 -40840 215899 7482 155415 260 -85498 -34721 -304577 95171 -134793 -129335 -234277
$$ packed form
19099a97879m1531g3238j5900j79444C6768J10319a53429m660A2694b44390o6727
19088c11117f1177B23523A3488J97030J53072A28770g978K948k33007E077e4418
19076a83070q0740H6863c18587g2992h48C09859d9483A72265a87230h0372m0972
19065a21344D6876P3735b39887f3155k5660l05703D43760b28717N6142f3228I1822
19053a44118k30281F882a54301L8490F166J8448i7642b5749q9865r6314r1888
19042c03816J06396j26732h7786B722M9765G359K13245d26259l2895H4145d3028
19030g3943D1025b46227M0290B45901a03546k36122A6675K41487I5731c81996
19019d0840B15899G482J47933B60h5498c4721k69856I5171a34793N458j04942
$$ plain form
19008 -234277 64743 133837 -1869 -134799 199151 -45691 -72769 138555 141956 -311063 -271346
18997 -271346 -122494 75527 -133825 -116556 325404 180839 -111871 -41537 -71393 -10379
18986 2181 -443948 -70201 -92590 -56344 108322 -20697 -146156 -332329 237427 57561 69890
18975 69890 234741 115917 317673 -167075 -228520 -18798 59553 -336896 -65479 116456
18964 121110 -239380 137548 -32693 -228914 11499 200128 -245127 -116434 -46462 -231622
18954 -231622 -481654 101187 -180867 -365377 -35169 402822 -150807 -422280 -145842 101268
18943 -325419 -97658 -215275 74766 -196574 25758 70691 -382860 67776 -158270 -80626 -12623
18931 42112 42253 173316 89258 144339 52625 -121155 -201184 115448 69533 -121563 -141515
$$ packed form
19008b34277F4743O9094a869j32930A99151d5691k7078A38555L401c11063L9717
18997b71346a22494G5527a33825J7269C25404j44565a11871d1537k9856a0379
18986B181d43948g0201k2389L6246A08322b0697j25459j86173B37427E7561J2329
18975F9890J64851A15917K01756a67075o1445a8798E9553c36896f5479A16456
18964A21110b39380A37548c2693j96221A1499J88629b45127a16434d6462j85160
18954b31622k50032A01187a80867j84510c5169D02822a50807k71473a45842A01268
18943c25419i7658j17617G4766a96574B5758M4933c82860F7776a58270P7644a2623
18931D2112J41J31063q4058N5081E2625a21155q0029A15448m5915a21563j9952
$$ plain form
18920 -141515 -276855 -117067 125316 -124520 -331056 -291685 313029 -81201 -62558 -97700
18910 -97700 182181 -153074 61280 24633 -108076 -257630 110105 -11144 -1051 33270 -45820
18898 -110678 -215731 -136957 -118020 -72604 -8974 -530293 41944 -10499 -218575 215650 180988
18887 180988 -104302 -85449 48298 56191 -148581 88832 319988 171193 77380 110323 139718
18876 139718 -161141 -183698 183550 161709 -136673 109145 -78799 -199380 -142705 53248
18865 -176225 -4266 30380 -92321 12675 -30420 27307 12694 126234 58835 -30084 -212082
18854 -212082 -286437 -389584 -173190 -31889 367700 111813 70860 -258236 82821 -279324
18843 -485083 -220044 -79952 105706 81205 -92216 138870 -111886 -18391 -193266 -56349
$$ packed form
18920a41515j35340a17067A25316a24520k06536L9371C13029h1201J8643l5142
18910i7700A82181a53074F1280B4633a08076j49554A10105a1144a051C3270d5820
18898a10678j05053P8774J8937M5416h974n21319D1944a0499k08076B15650l4662
18887A80988a04302J8853D8298P893a48581H8832K31156j48795G7380L2943K9395
18876A39718a61141k2557A83550k1841a36673A09145g8799j20581N6675E3248
18865a76225d266C0380i2321A2675c0420B7307A2694J13540E8835c0084j81998
18854b12082p4355j03147a73190c1889C67700A11813m0953b58236H2821b79324
18843d85083b20044g9952A05706k4501i2216A38870a11886a8391j74875e6349
$$ plain form
18832 -2415 -7258 270709 -100701 -85231 180564 -238737 40519 -310116 -147573 -94410 -171490
18821 -171490 -102536 -35695 63624 135414 -151815 -110866 83093 91725 -227297 768 -93364 212640
18808 -103526 69640 166934 -406882 -40029 -144168 9663 -191079 312861 82719 47172 -183473
18796 -117775 32768 126886 45807 304524 -84339 -182492 -100633 176678 164286 -158699 -250258
18785 -250258 149718 -268780 -252452 -52376 -342820 -177238 -370317 209924 -221125 140340
18774 -180564 80803 -183915 27296 -307239 -93332 394619 -26875 -80307 -57638 -132183 -153089
18763 -153089 112193 -252292 -197515 -94537 9780 29084 -17515 41821 -4236 -199532 -183757
18752 -183757 35124 51259 -23152 -322356 -101059 -239856 -225487 -116687 -102045 -17745 71398
$$ packed form
18832b415m843B70709a00701J5470A80564b38737D0519c10116a47573N3163p7080
18821a71490O8954c5695F3624P1790a51815M0949H3093Q632b27297G68i3364B12640
18808a03526F9640R7294d06882d0029j04139I663a91079C12861H2719l5547a83473
18796a17775C2768R4118D5807K58717h4339r8153Q1859A76678j2392a58699r1559
18785b50258A49718b68780J6328e2376k90444J65582j93079B09924b21125A40340
18774a80564H0803a83915B7296c07239i3332C94619b6875n3432K2669p4545k0906
18763a53089A12193b52292N4777i4537I780J9304a7515D1821d236j95296J5775
18752a83757C5124J6135b3152k99204a01059j38797J4369J08800J4642a7745G1398
$$ plain form
18740 184801 92783 -398165 119703 -276280 -173265 350828 -73393 31566 206994 -197687
18729 75526 -92492 -165047 33989 -111722 113989 27692 -146527 181102 -194418 3701 299815
18718 299815 -20194 -377946 -133168 -273915 34968 123975 -99037 18539 -371599 42222 -429987
18706 -106232 93528 49183 -337578 -292790 -98240 -163431 38988 125152 -325715 -43063 -408616
18695 -408616 -293703 -482285 11898 -149925 -74450 81806 -68785 -326511 -50879 162913
18684 19413 83808 -39580 89556 -213064 -335324 -127560 106898 265730 49552 -39770 -136601
18673 -136601 -135382 14527 -95615 -161645 130209 -243259 -86344 -239330 -37276 -377023 135451
18661 352167 -11225 207686 -243430 -191624 50653 -404428 12652 -198236 -310655 -66894
$$ packed form
18740A84801r2018c98165A19703b76280J03015C50828g3393C1566J75428a97687
18729G5526i2492p2555C3989a11722A13989B7692a46527A81102a94418C701K96114
18718B99815b0194l57752a33168j40747C4968Q9007i9037A8539c71599D2222d29987
18706a06232I3528m4345c37578M4788i8240o5191C8988Q6164c25715d3063l65553
18695d08616J14913j88582A1898a49925g4450H1806f8785k57726e0879A62913
18684A9413O4395c9580H9556b13064j22260a27560A06898J58832D9552c9770r6831
18673a36601J219A4527i5615o6030A30209b43259h6344j52986c7276l39747A35451
18661C52167a1225B07686b43430N1806E0653d04428A2652a98236j12419f6894
$$ plain form
18650 -404763 110419 36947 104676 -243340 -158491 -141788 9658 -14637 108409 -195993 -6043
18638 208756 -45288 305331 -66235 -272418 59118 -319037 -61917 -281395 -396311 -1436 -194426
18627 -194426 10280 18491 -11459 15400 -82718 311005 -65187 -250329 -95505 -256281 41449
18615 -130251 75234 -174473 35267 226849 85095 21678 -287204 53091 46608 -63619 34443
18603 -74558 -23018 -98411 70574 -64550 10894 55801 7796 371093 -100127 -2501 218925
18591 -33119 105513 88186 -270337 225433 -150065 72713 -185239 -190223 58691 104364 67593
18580 67593 244209 -138770 -218594 -47373 -30241 -30717 150822 -341006 -141281 -116688 -253460
18569 -253460 -93622 -143353 15906 18019 3858 -34482 -323777 -295410 -88594 -11129 -168227
$$ packed form
18650d04763A10419C6947O7729b43340Q4849J6703I658a4637A08409a95993f043
18638B08756d5288C05331f6235k06183E9118c19037f1917k19478j14916a436j92990
18627a94426A0280Q211a1459A5400h2718C11005f5187j85142i5505j60776D1449
18615a30251G5234a74473C5267J91582H5095B1678b87204E3091o483f3619C4443
18603g4558b3018p5393G0574f4550A0894M4907G796L63297a00127b501B18925
18591c3119A05513j7327b70337B25433a50065G2713a85239m984E8691M5673l6771
18580F7593J76616a38770p9824d7373J7132m76A50822c41006a41281K4593j36772
18569b53460i3622m9731A5906K113C858c4482k89295K8367h8594a1129j57098
$$ plain form
18558 -168227 210446 103176 -270978 -111304 -68675 -173800 -55462 -110325 191239 -86224
18547 75470 -403055 -113874 -133189 5997 296530 -457601 -267971 105223 138246 13009 -224164
18535 -216265 -19073 -310760 -220861 53677 36324 92390 141321 346111 -120598 -40655 -67042
18524 -67042 -194512 36024 -187325 -137857 -73120 -219929 57205 -216743 123504 52781 -25414
18512 -132274 27011 -122353 -337535 176139 189220 76695 -124924 26731 155329 225192
18502 225192 -323837 -63809 -91957 -38343 -249809 -73917 212461 90496 -342304 133470
18491 5139 4190 -236193 -107026 -60627 99752 -14107 109536 -6831 -237705 -340458 -105163
18479 -204296 57390 -138670 -205305 45497 187268 -198166 -53669 -129187 61724 215390 100289
$$ packed form
18558a68227B10446A03176b70978a11304M2629j05125e5462n4863A91239h6224
18547G5470d03055a13874j9315E997K90533d57601J89630A05223L3023A3009b24164
18535b16265a9073k91687Q9899E3677j7353N6066M8931K04790a20598d0655k6387
18524f7042j27470C6024a87325M9468O4737j46809E7205b16743A23504E2781b5414
18512a32274B7011a22353k15182A76139J3081G6695a24924B6731J28598O9863
18502B25192c23837f3809k8148c8343k11466g3917B12461I0496c42304A33470
18491E139r49b36193a07026M6399I9752a4107A09536f831k30874j02753a05163
18479b04296E7390a38670o6635D5497J41771a98166e3669p5518F1724J53666A00289
$$ plain form
18467 141272 337943 -9732 53714 -217043 -265327 75198 -229346 18598 -36421 143200 227791
18456 227791 -125969 185289 218051 -210168 -18571 51391 -66358 47608 -158769 -52830 -511950
18445 -511950 54922 -177733 -169327 172239 -177035 -161509 -4742 -147025 42926 454829 -18027
18433 -13437 -231685 -301151 134911 -486055 136593 -116701 117014 -13449 -246353 23633
18422 -406092 -97068 216708 -253664 -228310 125274 -260808 54195 58929 95374 -135112 167144
18410 50600 118443 -149007 20856 -103189 13248 -164472 61565 -206297 -33803 -339398 -66732
18398 -181008 -18434 -96681 -2079 -339563 -62234 -134268 81836 21121 -59617 44767 -467115
18386 125603 -141207 -182376 -24406 24536 -148828 81663 -228288 -63190 -34572 -173060 -95784
$$ packed form
18467A41272J96671i732E3714b17043m8284G5198b29346A8598c6421A43200Q4591
18456B27791a25969A85289L2762b10168a8571E1391f6358D7608a58769e2830m59120
18445e11950E4922a77733Q406A72239a77035J5526d742j42283D2926M11903a8027
18433a3437k18248o9466A34911d86055A36593a16701A17014a3449k32904B3633
18422d06092i7068B16708b53664K5354A25274b60808E4195M734L6445a35112A67144
18410E0600O7843a49007B0856a03189A3248a64472F1565b06297c3803l05595f6732
18398a81008a8434p8247b079l37484f2234p2034H1836B1121e9617D4767d67115
18386A25603a41207m1169b4406B4536a48828H1663b28288f3190K8618j38488P7276
$$ plain form
18375 -95784 -43640 -340167 -130983 -92798 -186396 181396 12562 -157048 90364 117233 -162814
18363 -12386 -205949 -263614 95510 -38881 -24394 166060 -10656 -204906 -33417 65944 -263614
18351 -119991 -6629 184583 -19777 -34393 169858 -326640 -99258 -321419 -202105 -163392 -52343
18339 154881 -274596 -199201 70317 60853 -79795 -53721 9046 160670 120171 407101 40757
18327 -237791 -420774 -118673 176455 -67820 -66066 -388804 -185491 -19378 249171 364188
18317 364188 42384 4339 115681 116431 18386 -4806 10948 -4048 206385 -209177 -42082 13742
18304 -46846 52291 99983 -104386 64411 53819 219785 -57003 194972 -150178 32689 91880
18293 91880 -72531 -525814 -178399 268288 125806 40122 141516 -170885 90054 79246
$$ packed form
18375i5784d3640k96527a30983L8185r3598A81396A2562a57048I0364K6869a62814
18363a2386j93563n7665I5510c8881J4487A66060a0656j94250c3417F5944b63614
18351a19991f629A84583a9777j4616A69858c26640i9258k22161J19314L8713e2343
18339A54881b74596P5395G0317r464g9795K6074I046J51624m0499K86930D0757
18327b37791j82983a18673A76455f7820J754l22738a85491a9378B49171J15017
18317C64188D2384D339J11342P50A8386d806A0948d048B06385b09177d2082A3742
18304d6846E2291M7692a04386F4411j0592J65966e7003A94972a50178C2689N9191
18293I1880g2531m53283a78399B68288A25806D0122J01394a70885I0054j0808
$$ plain form
18283 79246 79994 -315322 -235146 165005 302801 -7157 77295 228753 -243814 262560 46933
18271 -249421 87732 -73632 83935 97419 -147083 309980 34483 -253205 -33309 295410 203951
18260 203951 183480 195025 -199884 220433 -237457 53632 -258569 74210 -18350 -181550
18250 -181550 -176905 -206960 74476 -213382 93141 -282461 -3594 -237102 -209401 24233 211723
18239 211723 -8252 94514 -93143 -61974 -35104 -139318 -147121 107088 1516 151140 -106084
18227 347699 95931 -53385 -95878 -153819 -102368 -142575 -105897 -8205 -171827 -123880 -403067
18216 -403067 349114 -20268 -90375 80426 -250603 135157 -17085 -280815 -171577 -225852
18206 -225852 -118030 394589 -82740 1004 -152424 -165963 -97710 120152 -392334 93927 96603
$$ packed form
18283G9246P48c15322Q0176A65005J37796g157G7295J51458b43814B62560D6933
18271b49421H7732g3632H3935J3484a47083C09980C4483b53205c3309B95410r1459
18260B03951k0471J1545a99884B20433b37457E3632b58569G4210a8350j63200
18250a81550M645l0055G4476b13382I3141b82461c594k33508K7701B4233J87490
18239B11723h252I4514i3143L1169K6870j04214p803A07088A516J49624a06084
18227C47699I5931e3385m2493n7941N1451m0207L6678h205j63622M7947k79187
18216d03067C49114b0268p0107H0426b50603A35157a7085k63730J09238n4275
18206b25852J07822C94589h2740A004a52424j3539O8253A20152c92334I3927K676
$$ plain form
18195 96603 -102010 48309 123137 107972 -137565 232692 197230 37012 -251302 -151953 -71037
18183 -201630 99556 119197 -345865 -93757 -149020 63231 -72985 -557689 65868 -34588 31759
18171 -114133 -152598 -36056 69212 -104556 -47610 -211747 -158778 -336511 188998 253833 -184606
18159 -315290 -65889 54133 -98977 -303009 -330363 949 -65578 -221293 -295572 27020 -19129
18147 44321 -203318 71298 -142295 -47901 141687 -78944 -20289 -88234 147079 -354466 82483
18135 98919 -255418 -434815 -166713 -387627 205746 116750 -198757 296184 988 -53259 -13220
18123 92516 -307832 -162212 -205352 -47701 111656 -81242 -45387 -5172 -120704 224876 158823
18112 158823 -199324 -111566 -90471 -86963 131068 -230984 -103682 214473 -153690 -337158
$$ packed form
18195I6603a02010D8309P4828j5165a37565B32692l5462C7012b51302R9349g1037
18183b01630I9556J9641c45865i3757n5263F3231g2985m84704F5868c4588C1759
18171a14133l8465c6056F9212a04556d7610j64137N2969j77733A88998O4835a84606
18159c15290f5889E4133i8977k04032k7354I49f5578j55715p4279B7020a9129
18147D4321b03318G1298a42295d7901A41687g8944b0289o7945A47079c54466H2483
18135I8919b55418j79397a66713k20914B05746q8996a98757B96184I88e3259a3220
18123I2516c07832J45620m3140d7701A11656h1242L5855e172j15532B24876o6053
18112A58823a99324Q7758K1095L508A31068b30984a03682B14473a53690j83468
$$ plain form
18102 -337158 -110907 -180834 -207425 -12177 -9225 -142956 -134160 39162 -91401 -210282 76020
18090 -90640 131944 -268560 -100022 -95442 220094 -41815 190489 397462 193484 24858
18079 55531 -133340 36610 -151380 -94435 -31591 -140322 -290766 37171 31178 43129 62996
18068 62996 -169657 -89398 -88667 6090 -369837 -157964 233980 119671 134893 -118095 -12842
18056 -236424 139663 186900 -192263 41529 272579 -333495 -93922 -309819 -158176 71901
18045 84468 -156010 36222 -78704 -134357 12427 28773 3785 83294 -174159 -115559 291214
18033 73897 -219435 39605 -96847 -185958 -344859 297540 45821 -185588 95813 -210672 -71331
18021 -19722 -361097 354182 176230 -32633 -210506 -109661 61244 -23345 111494 295061
$$ packed form
18102c37158a10907o9927k6591a2177K952j33731Q796C9162i1401j18881G6020
18090i0640A31944b68560a00022M580B20094d1815A90489K06973A93484B4858
18079E5531a33340C6610a51380N6945c1591j08731j50444C7171n993J1951J9867
18068F2996a69657Q0259P31F090c69837a57964B33980j14309J5222a18095a2842
18056b36424A39663M7237a92263D1529K31050c33495i3922k15897J51643G1901
18045H4468a56010C6222g8704n5653A2427J6346C785P9509a74159N8600B91214
18033G3897b19435C9605i6847q9111j58901B97540D5821a85588I5813b10672g1331
18021a9722l41375C54182A76230c2633j77873J00845F1244b3345A11494J83567
$$ plain form
18011 295061 -47363 361321 94744 -213599 126606 -88316 -151840 48585 34584 -98989 -90519
18000 -90519 124053 -34093 231548 166579 57316 -81611 -69960 290783 -18057 158661 266786
17989 266786 -112213 66658 -41857 186773 29474 -188122 -388610 -199634 313693 -243660
17978 -66213 87857 153606 -158458 340138 -85487 -315541 -68397 -3538 575368 -106416 247624
17966 -359801 318691 -9897 -158506 -161705 157904 -288712 -864 63997 118624 -181904 -123027
17955 -123027 46929 3357 -186758 66132 -15850 38753 -57061 -14245 2716 -155683 -59797
17943 75490 357343 -309576 5236 -180806 -174774 -185913 -82488 -7117 95121 7298 -448583 -87356
17930 -113724 -111288 -71132 206630 -52907 7240 174923 15585 -131915 -270408 169310 -17660
$$ packed form
18011B95061d7363C61321I4744b13599A26606h8316o3524D8585j4001i8989Q470
18000i0519A24053c4093B31548o4969E7316h1611J1651B90783a8057A58661J08125
17989B66786a12213F6658d1857A86773B9474a88122k00488J88976C13693b43660
17978f6213H7857O5749a58458C40138h5487k30054f8397c538E75368a06416B47624
17966c59801C18691i897j48609l199A57904b88712h64F3997N4627a81904N8877
17955a23027D6929C357a86758F6132a5850C8753e7061a4245B716a55683e9797
17943G5490K81853c09576E236a80806O032j1139h2488g117I5121G298d48583h7356
17930a13724K436M0156B06630e2907G240J67683A5585a31915j38493A69310a7660
$$ plain form
17918 -108728 109161 -81451 -374215 64025 18089 -97761 309336 -60713 66707 248755 -130028
17906 -16341 -163180 -40721 5174 -19124 -89278 166403 158879 282850 -54536 33007 82121
17895 82121 -9998 162175 168727 -168883 -113166 -400592 -89777 -68877 -301929 -324567 28168
17883 93044 -106197 185437 -51256 10082 44988 285873 -109711 78417 53600 329627 -232044
17871 407383 112071 -12998 -32731 -287186 -26509 -51788 -258631 80458 -131046 20595 28475
17860 28475 -267315 -421852 259341 141192 -202041 -26856 -114553 213644 4442 223887
17850 223887 91052 25626 30006 -473731 -59781 -8526 -173219 92962 10938 229419 -256588
17838 90730 577669 182239 -53726 -964 109426 69281 -158960 447250 4393 -151732 -160329
$$ packed form
17918a08728A09161h1451k92764F4025A8089i7761C09336f0713F6707J82048a30028
17906a6341j46839d0721E174a9124p0154A66403p524J23971e4536C3007M9114
17895H2121i998A62175O552a68883N5717k87426h9777K0900k33052k2638B8168
17883I3044a06197A85437e1256A0082L4906K40885a09711G8417k4817K76027b32044
17871D07383A12071a2998j9733k54455b6509k5279k06843H0458a31046B0595P880
17860B8475b67315j54537B59341j18149b02041b6856q7697B13644D442K19445
17850B23887I1052B5626M380d73731e9781h526j64693I2962A0938K18481b56588
17838I0730M86939A82239e3726i64A09426m0145a58960D47250D393a51732q597
$$ plain form
17827 -160329 32271 -133010 -97647 119538 82992 132229 -112762 -91379 126542 176459 -104614
17815 31319 -280934 -133007 -222043 103677 527422 -268253 -51620 -380884 -117435 -329075
17805 -329075 -208689 -116943 -56306 -2575 -291869 90714 -161301 550320 -195054 27367 153970
17794 153970 158412 -38818 -2747 -320955 -7487 172543 114358 111031 -4533 164473 76574 257069
17782 257069 201859 64450 -124692 -41073 35770 -76249 39959 213223 -85549 120554 -121901
17770 119415 -71581 55621 83521 86039 262409 -96716 220178 89300 303489 199901 32752
17758 171960 145678 -345292 251263 52364 -22686 172279 -242499 8693 261746 -303642
17747 -31816 -112661 126290 -155381 -266367 -23279 177466 182354 264432 -189610 -205467 67384
$$ packed form
17827a60329C2271a33010L5363A19538l6546M9237a12762K1383A26542M9917a04614
17815C1319b80934a33007q9036A03677M23745b68253e1620l29264a17435k11640
17805c29075J20386R1746e6306b575k89294I0714a61301E50320a95054B7367J26603
17794A53970M442c8818b747l18208g487A72543n8185l327d533A64473G6574J80495
17782B57069n5210F4450a24692d1073C5770g6249C9959J73264h5549A20554a21901
17770A19415g1581E5621K7900K518J76370i6716B20178H9300K14189j03588C2752
17758A71960k6282c45292B51263E2364b2686A72279b42499H693K53053c03642
17747c1816q0845A26290a55381j10986b3279A77466M888Q2078a89610j5857F7384
$$ plain form
17735 -31895 -7718 158028 44070 -174986 -129903 -113994 -134722 -217714 130147 316112 405908
17724 405908 57137 55999 108896 -80880 -106488 -179905 99629 -219618 -85231 8662 417807
17713 417807 -198025 28585 -242209 -51897 -126300 7037 136279 169684 -125765 -109060 -147810
17702 -147810 134959 221509 -170812 -360838 300854 54999 -224997 346009 87715 -21883
17691 104426 150311 -132873 121451 16239 -21620 -10311 -76941 -98741 -19478 -180167 -262824
17680 -262824 393808 -141910 -113505 191234 266521 -25279 441533 42992 108837 -140807
17669 -116453 86453 169257 129098 -83706 -130651 -141291 -220790 67775 -130122 -176464 -90893
17658 -90893 94938 273334 -49654 99773 -55535 -112646 69978 276490 20555 190195 -30704
$$ packed form
17735c1895g718A58028D4070a74986M5083J5909k0728q2992A30147J85965Q9796
17724D05908E7137j138N2897h0880k5608p3417I9629b19618h5231H662M09145
17713D17807a98025B8585b42209e1897p4403G037J29242L3405a25765J6705l8750
17702a47810A34959Q6550a70812j90026C00854E4999b24997C46009H7715b1883
17691A04426M5885a32873A21451A6239b1620a0311o6630k1800a9478j60689q2657
17680b62824C93808a41910K8405A91234P5287b5279D41533D2992O5845a40807
17669a16453H6453Q2804m0159h3706m6945j0640p9499F7775a30122m6342Q5571
17658i0893I4938J78396d9654I9773e5535n7111F9978K06512B0555J69640c0704
$$ plain form
17646 -182793 248548 250460 162681 135707 159933 -117937 31926 188443 -208520 95446 -122854
17634 96942 77731 21240 -57391 87979 -87349 107839 -137480 137695 -42268 237088 99708
17622 99570 10957 -31344 213483 575006 179459 15496 -276191 36658 162513 108286 208120
17611 208120 179079 -242668 80105 -148550 -109788 319730 -42592 -62389 -79163 222283 -117964
17599 -68824 120228 20278 -112510 -84194 -201912 160079 335037 -93022 266533 76576
17588 -178502 -25149 30873 111827 -223909 -15124 -330814 84350 -195190 -22415 -168138 -166200
17577 -166200 184306 -19871 214624 -217423 -75204 -385321 210351 -70857 47726 328223
17567 328223 -177407 84061 55234 185275 170403 198121 -31148 346174 134830 -254365
$$ packed form
17646a82793B48548J912q7779k6974K4226a17937C1926J56517b08520I5446a22854
17634I6942j9211B1240e7391H7979h7349A07839a37480A37695d2268B37088I9708
17622I9570A0957c1344B13483L61523A79459A5496b76191C6658J25855n4227R9834
17611B08120k9041b42668H0105a48550L8762C19730d2592j9797j6774B22283a17964
17599f8824A20228B0278a12510K8316j17718A60079J74958i3022B66533G6576
17588a78502b5149C0873Q0954b23909a5124l15690H4350a95190b2415j45723J938
17577a66200A84306a9871B14624b17423g5204l10117B10351g0857D7726K80497
17567C28223a77407H4061k8827J30041j4872K7718c1148C46174A34830b54365
$$ plain form
17556 134977 41625 182637 -212613 -30684 -43702 -77490 -26380 83290 97926 134655 -5868
17544 140368 -298246 288905 185399 -276400 212754 -301619 194064 99960 12202 -276121
17533 -304710 -103557 -121044 90629 -247267 -46622 159016 160163 213168 126121 -27375 232985
17521 95288 46504 -55871 -117386 -69318 -80347 285899 2921 62218 27200 326753 -122774
17509 15826 -55636 272540 -92830 396580 214172 331246 179894 19694 -289341 -34767
17498 86717 9932 203895 -19706 94368 221430 326717 -25042 74294 -195779 -138632 18083
17486 471427 74913 37644 451886 287806 134498 140995 153242 446678 -87798 121739 34045
17474 1812 308399 230159 359251 409589 312214 -80709 -83343 -113166 -54403 168557 302620
$$ packed form
17556A34977D1625J41012b12613c0684j3018l3788b6380H3290J4636L6729e868
17544A40368b98246B88905j03506b76400B12754c01619A94064r4104A2202b76121
17533c04710a03557j7487I0629b47267d6622A59016J147N3005q7047b7375B32985
17521I5288D6504e5871o1515M8068j1029B85899B921N9297B7200K99553a22774
17509A5826e5636B72540i2830C96580j82408J17074j51352A9694b89341c4767
17498H6717I932J93963a9706I4368J27062J05287b5042G4294a95779N7147A8083
17486D71427G4913l7269M14242j64080A34498O497J2247K93436h7798A21739C4045
17474A812L06587p8240J29092N0338r7375h0709k634k9823e4403A68557J34063
$$ plain form
17463 302620 -152861 97400 16401 115248 -226400 274980 -184996 -202151 137613 -52939
17452 148837 3691 194531 575054 288910 169103 379046 -63666 129534 -9664 53902 325807
17441 325807 263549 76073 287959 168471 93062 503009 513898 -186772 168589 -20905
17430 228607 538182 129910 257873 -76503 4673 167314 426612 234695 68091 377280
17420 377280 482262 190369 282734 48014 277290 245476 199784 192796 252474 79631 451205
17409 451205 232100 52726 312461 -5355 101399 69048 48719 253237 333396 19480 303982
17398 303982 63642 270529 -72712 105718 327509 179255 183625 483538 -160842 70536
17387 405923 -31255 75226 143182 4842 73417 105708 285920 -81308 34631 -71172 270794
$$ packed form
17463C02620a52861I7400A6401R8847b26400B74980a84996j7155A37613e2939
17452A48837C691J90840L80523k86144j19807K09943f3666A29534i664E3902K71905
17441C25807o2258G6073K11886j19488p5409M09947J0889a86772A68589b0905
17430B28607L09575A29910J27963g6503D673J62641K59298j91917F8091L09189
17420C77280J04982A90369R2365D8014K29276l1814m5692o988N9678G9631L71574
17409D51205k19105E2726K59735e355A01399l2351k0329K04518Q0159A9480K84502
17398C03982F3642K06887g2712A05718K21791j48254M370K99913a60842G0536
17387D05923c1255G5226O7956D842O8575L2291J80212h1308C4631g1172B70794
$$ plain form
17375 223166 259462 -23540 296330 395847 93433 -201925 387049 -106369 25850 -103749
17364 34752 244545 79154 18922 316457 278545 237942 33410 -212550 -174263 344138 254776
17353 254776 352020 269716 46292 210161 -21867 167410 -220041 194075 -234780 -152001
17343 -152001 139120 -119056 201969 7160 111421 319775 118365 491614 59927 84688
17333 84688 184043 -78077 244257 -120672 -64978 123433 226073 255137 223709 -231782 147077
17321 146448 301874 206627 96985 531816 121640 -114623 334984 191053 -86041 317466
17310 -38185 255478 362386 350374 48426 341555 67700 526840 -169251 392356 3430 -96601
17298 106601 155936 -17048 386818 186523 143288 -2518 18634 209718 42896 -89570 10358
$$ packed form
17375B23166L6296b3540B96330R9517I3433b01925C87049a06369B5850a03749
17364C4752K09793G9154A8922K97535l7912m0603C3410b12550L8287C44138q9362
17353B54776R7244q2304D6292J63869b1867A67410b20041A94075b34780Q2779
17343a52001A39120a19056B01969G160J04261K08354A18365L73249E9927K4761
17333H4688R9355g8077B44257a20672N5694A23433J02640K9064l1428b31782A47077
17321A46448J55426r5247I6985M34831A21640a14623C34984j43931h6041C17466
17310c8185B55478J06908j2012D8426K93129F7700M59140a69251C92356C430i6601
17298A06601M9335a7048C86818A86523m3235b518A8634J91084D2896h9570A0358
$$ plain form
17286 -232463 91209 345454 183513 295567 5939 308416 252282 533701 12633 -154916
17275 303061 81031 -47991 198211 284931 148594 150276 206262 67326 -129690 144726 224681
17264 224681 248562 22448 5604 27594 70820 35066 210031 196632 321159 128866 117712
17253 117712 159858 379177 -117382 145066 295375 247066 -144372 465985 479605 426197
17243 426197 13500 418221 324566 103335 166842 121242 66756 125037 54135 213014 92300
17231 39020 28544 378296 21328 -36728 37954 118694 4774 -7438 393322 219570 272975
17220 272975 -64658 195110 179357 547257 182983 336511 149769 -40474 91470 67294
17210 67294 189057 41766 196033 201828 488409 286735 -16764 28032 42718 175574 -161685
$$ packed form
17286b32463I1209K54245j61941J12054E939L02477n6134K81419A2633a54916
17275C03061H1031d7991A98211Q6720j36337J682N5986F7326a29690A44726P9955
17264B24681K3881B2448E604K1990M3226C5066J74965j3399J24527A28866j1154
17253A17712M2146K19319a17382A45066J50309m8309a44372D65985J3620n3408
17243D26197A3500M04721r3655A03335O3507m5600n4486N8281E4135J58879I2300
17231C9020j0476L49752B1328c6728C7954Q0740D774g438C93322j73752N3405
17220B72975f4658A95110j5753L67900A82983J53528A49769d0474I1470k4176
17210F7294J21763D1766J54267N795K86581k01674a6764B8032J4686J32856a61685
$$ plain form
17198 125089 26489 -50442 579666 145900 78190 302363 144906 752532 171627 287844
17188 287844 286856 216730 275138 294792 463301 -152580 268881 407688 275253 329264 408264
17177 408264 281537 319876 20620 -93218 118182 610692 220326 21323 310396 739402
17167 739402 223129 180312 64221 187855 463352 444436 413992 303614 16426 -69263 245931
17155 333882 253133 670368 229789 491103 105820 117559 336901 390131 444354 115741
17144 388136 337988 464088 440609 -18943 202561 215615 134686 386449 131713 299360
17134 299360 330021 419079 -73699 319707 193404 234915 376104 594134 351759 523896
17124 523896 -7573 554687 251213 639749 258381 429302 507912 336947 445378 160481
$$ packed form
17198A25089B6489e0442E79666A45900o7710K24173A44906O07626A71627J16217
17188B87844r88p0126N8408J9654J68509a52580B68881J38807j32435N4011P9000
17177D08264j26727L8339B0620i3218A18182M92510B20326B1323K89073M29006
17167G39402B23129m2817F4221J23634K75497j8916l0444j10378A6426f9263B45931
17155C33882q0749M17235B29789K61314A05820J1739K19342N3230N4223A15741
17144C88136n0148J26100k3479a8943B02561J3054q0929K51763A31713J67647
17134B99360L0661Q9058g3699C19707j26303M1511J41189K18030k42375J72137
17124E23896g573E54687B51213L88536B58381J70921P8610j70965J08431A60481
$$ plain form
17113 242029 350103 264603 42891 406722 171730 186430 22451 324022 352032 465744
17103 465744 376178 616462 113669 346283 265868 532181 187853 154191 398284 368506
17093 368506 299724 131390 285553 109139 144661 432776 365763 436778 392324 825237
17083 825237 481530 406416 450422 551030 256284 464743 695460 128700 427189 738633
17073 738633 422729 437702 584639 375920 134696 394956 343176 801804 295008 -9761
17062 851180 615351 584690 146345 499266 326809 825320 249203 529464 680482 312364
17051 223850 341335 336604 582461 322194 894337 192867 609832 298513 716813 715990
17041 715990 551300 472674 318400 437666 358678 504689 591597 139875 504987 599758
$$ packed form
17113B42029J08074q5500D2891L63831A71730J4700B2451L01571K8010J13712
17103D65744q9566K40284A13669K32614q0415K66313A87853l3662K44093k9778
17093C68506o8782A31390J54163A09139L5522K88115o7013P1015m4454M32913
17083H25237l43707p5114M4006J00608B56284K08459K30717A28700K98489L11444
17073G38633l15904J4973J46937k08719A34696K60260n1780M58628B95008i761
17062H51180k35829l0661A46345L52921j72457M98511B49203K80261J51018C12364
17051B23850J17485m731K45857k60267N72143A92867M16965B98513M18300q23
17041G15990j64690p8626j54274J19266p8988J46011Q6908A39875L65112R4771
$$ plain form
17031 599758 592042 790392 739560 649828 450941 357433 254043 510690 533558 578845 402931
17020 402931 535623 678173 310624 625328 693758 225972 673774 640260 835028 502378
17010 502378 638573 817135 968670 503883 906466 482940 685265 699859 601446 729905
17000 729905 525693 498734 494337 946733 576892 768986 593299 1012537 882292 581877
16990 581877 772225 1035378 624035 728323 906447 789136 970545 852352 795087 818880
16980 818880 927647 715547 970841 1081863 888361 810873 638613 692703 1171351 638638
16970 638638 846942 957339 773058 924870 688503 1225636 758178 871624 1154498 956662
16960 956662 633142 1263027 867130 1001533 1298971 1382923 903788 1161678 1064354 1383320
$$ packed form
17031E99758p716J98350n0832q9732j98887r3508j03390K56647K2868M5287j75914
17020D02931J32692J42550C10624L14704O8430B25972M47802l3514J94768l32650
17010E02378J36195J78562J51535m64787M02583m23526K02325J4594r8413J28459
17000G29905k04212k6959m397M52396l69841J92094j75687M19238j30245l00415
16990E81877J90348K63153m11343J04288J78124j17311J81409j18193n7265K3793
16980H18880J08767k12100K55294J11022j93502p7488j72260N4090M78648n32713
16970F38638K08304J10397j84281J51812k36367N37133m67458J13446K82874j97836
16960I56662l23520O29885l95897J34403K97438Q3952m79135K57890r7324L18966
$$ plain form
16950 1383320 1222174 1417832 1134650 882410 804836 1114814 1320233 929939 1334527 1261344
16940 1261344 848536 1108939 954947 1558794 1123159 1233152 1416235 1324615 1276291 1208811
16930 1208811 964363 1465054 1398004 1466279 1058227 1528045 1144604 1396823 1160180 1419630
16920 1419630 1351406 1177608 1316511 1597735 1277978 1264104 1257930 1321942 1553910 1383307
16910 1383307 1683488 1497519 1546986 1730824 1181885 1455215 1460447 1565801 1713643 1890273
16900 1890273 1428712 1583615 1940360 1929377 1728964 2094877 1727447 1891774 1530463 2033043
16890 2033043 1702159 2012313 1871176 1745025 2112136 2090064 1884083 2372799 2188738 2226726
16880 2226726 2423406 2067256 2101369 2306787 2106929 2229093 2563685 2130967 2296051 2467773
$$ packed form
16950A383320j61146J95658k83182k52240p7574L09978K05419l90294M04588p3183
16940A261344m12808K60403j53992O03847m35635J09993J83083r1620m8324o7480
16930A208811k44448N00691o7050O8275m08052M69818l83441K52219k36643K59450
16920A419630o8224j73798J38903K81224l19757j3874o174O4012K31968j70603
16910A383307L00181j85969M9467J83838n48939K73330N232J05354J47842J76630
16900A890273m61561J54903L56745j0983k00413L65913l67430J64327l61311N02580
16890B033043l30884L10154j41137j26151L67111k2072k05981M88716j84061L7988
16880B226726J96680l56150L4113K05418j99858J22164L34592m32718J65084J71722
$$ plain form
16870 2467773 2491990 2636195 2442729 2353590 2659637 2539688 2540190 2646756 2526392 2687633
16860 2687633 2478871 2870864 2961859 3222289 3040424 2705467 2838610 3167914 3087429 3148642
16850 3148642 3177487 3203407 3398318 3143464 3417663 3122361 3897882 3944340 3752069 3431362
16840 3431362 3663950 3863810 3901917 3903567 4036073 4265048 3975627 4156299 3997610 4027343
16830 4027343 4618597 4471124 4526132 4663521 4863082 4704652 4848332 5268371 4939477 5263344
16820 5263344 5053874 5281985 5490792 5279784 5576797 5580397 5802807 6084521 5913839 6230418
16810 6230418 6300784 6574584 6714234 6614573 6952754 7354066 7268223 7560928 7373942 7782561
16800 7782561 7664552 7994601 8060337 8358544 8486342 9105078 9030946 9434936 9593188 9979696
$$ packed form
16870B467773K4217J44205j93466q9139L06047j19949N02J06566j20364J61241
16860B687633k08762L91993R0995K60430j81865l34957J33143L29304q0485O1213
16850C148642K8845K5920J94911k54854K74199k95302P75521M6458j92271l20707
16840C431362K32588J99860L8107J650J32506K28975k89421J80672j58689K9733
16830D027343N91254j47473N5008J37389J99561j58430J43680M20039l28894L23867
16820E263344k09470K28111K08807k11008K97013L600K22410K81714j70682L16579
16810F230418P0366K73800J39650r9661L38181M01312q5843K92705j86986M08619
16800G782561j18009L30049O5736K98207J27798O18736p4132M03990J58252L86508
$$ plain form
16790 9979696 10226819 10513724 10656494 11205133 11306113 11407581 11852805 12498548 12468654 13133532
16780 13133532 13190665 13666374 14253012 14479821 15105727 15703326 16279163 16444700 16901478
16771 16901478 17428487 18101394 18739677 19498332 20234729 21143680 21436354 22669468 22963440
16762 22963440 24216855 25461686 26208130 27240982 28660156 29805467 31111980 32531220
16754 32531220 33849461 35524538 37175346 38653377 40884325 42475366 44879865 46722870
16746 46722870 49441603 51986157 54755756 57824573 60917888 64434900 68409813 72093436
16738 72093436 76878451 81266442 85850947 90946645 96925024 102380055 108909909 115303359
16730 115303359 122248626 129263988 136624643 143945072 151669966 159221593 166267641 173107706
$$ packed form
16790I979696K47123K86905J42770N48639J00980J01468M45224O45743k9894O64878
16780A3133532N7133M75709N86638K26809O25906N97599N75837J65537M56778
16771A6901478N27009O72907O38283P58655P36397R08951K92674J233114K93972
16762B2963440J253415J244831P46444J032852J419174J145311J306513J419240
16754C2531220J318241J675077J650808J478031K230948J591041K404499J843005
16746D6722870K718733K544554K769599L068817L093315L517012L974913L683623
16738G2093436M785015M387991M584505N095698N978379N455031O529854O393450
16730A15303359O945267P015362P360655P320429P724894P551627P046048O840065
$$ plain form
16722 173107706 179513767 185043276 189423558 193098878 195512969 196626883 196568337 194597435
16714 194597435 192379717 187900367 183155140 177056347 170486482 163316799 155527525 148249515
16706 148249515 140473659 132455051 125191391 118100299 111396857 104574373 98660954 92857823
16698 92857823 87415268 82416648 77401229 72876174 68862337 64825224 61389956 58100231
16690 58100231 54723059 51834428 49266288 46739013 44451113 42178994 40125920 38153410
16682 38153410 36526638 34736157 33485573 31651275 30379400 28816661 27619437 26847216
16674 26847216 25662027 24391188 23520076 22362642 21451435 20871964 19885503 19101368 18749660
16665 18749660 17767906 17638803 16441248 15951713 15299233 15128431 14264587 14021367 13613635
$$ packed form
16722A73107706O406061N529509M380282L675320K414091J113914n8546j970902
16714A94597435k217718m479350m745227o098793o569865p169683p789274p278010
16706A48249515p775856q018608p263660p091092o703442o822484n913419n803131
16698I2857823n442555m998620n015419m525055m013837m037113l435268l289725
16690E8100231l377172k888631k568140k527275k287900k272119k053074j972510
16682C8153410j626772j790481j250584j834298j271875j562739j197224p72221
16674B6847216j185189j270839q71112j157434r11207n79471r86461p84135l51708
16665A8749660r81754j29103j197555m89535o52480j70802q63844k43220m07732
$$ plain form
16656 13613635 13327750 12783162 12584389 11908491 11711525 11532023 11083524 10587509 10486918
16647 10486918 10149145 9585640 9731860 9420341 9088399 8658269 8846798 8204733 8277481
16638 8277481 8223121 7444885 7459879 7443122 7295680 7081221 6946422 6282111 6307613 6275287
16628 6275287 6210646 6133682 6068312 5634494 5630879 5049690 5041813 5197181 5216017 4574424 4905705
16617 4905705 4922456 4780138 4371846 4476202 4126691 4534790 4555660 4092097 3919922 4081469
16607 4081469 3827936 4003249 3823285 3966693 3720169 3574670 3414857 3107912 3730753
16598 3730753 3514023 3036633 3229852 3209617 3249382 3255818 3035621 2965273 2793146 3029721
16588 3029721 2995039 2713340 2881028 2784381 2698535 2718869 2559026 2572197 2572961 2421691 2414818
$$ packed form
16656A3613635k85885n44588j98773o75898j96966j79502m48499m96015j00591
16647A0486918l37773n63505J46220l11519l31942m30130J88529o42065P2748
16638H277481n4360p78236J4994j6757j47442k14459j34799o64311K5502l2326
16628F275287o4641p6964o5370m33818l615n81189p877J55368J8836o41593L31281
16617D905705J6751j42318m08292J04356l49511M08099K0870m63563j72175J61547
16607D081469k53533J75313j79964J43408k46524j45499j59813l06945O22841
16598C730753k16730m77390J93219k0235L9765O436k20197p0348j72127K36575
16588C029721l4682k81699J67688r6647q5846K0334j59843J3171P64j51270o873
$$ plain form
16577 2414818 2563677 2478922 2291867 2232105 2239729 2222968 2344642 2359673 1971338 2186203
16567 2186203 1955192 1790256 2243345 1690104 1987133 1881977 1470728 1849598 1855950 1876743
16557 1876743 1705686 1546995 2049573 1842119 1634043 1527854 1754512 1880850 1557533
16548 1557533 1664839 1719202 1666269 1335319 1392413 1550159 1612680 1591891 1560783 1578934 1438889
16537 1438889 1191979 1340013 1275548 1404490 1369257 1018113 1089388 1376979 1082529 1382211
16527 1382211 1275362 1254391 1003392 1297504 931771 1101935 1123766 802172 1092710 1052746
16517 1052746 1032192 1009761 1030474 869568 1208855 820369 672292 888913 1419330 986723
16507 986723 1177014 996802 957508 1059915 977980 1157802 551224 878521 1070961 972531
$$ packed form
16577B414818J48859q4755j87055n9762P624j6761J21674J5031l88335K14865
16567B186203k31011j64936M53089n53241K97029j05156m11249L78870O352K0793
16557A876743j71057j58691N02578k07454k08076j06189K26658J26338l23317
16548A557533J07306N4363n2933l30950N7094J57746O2521k0789l1108J8151j40045
16537A438889k46910J48034o4465J28942l5233l51144P1275K87591k94450K99682
16527A382211j06849k0971k50999K94112l65733J70164K1831l21594K90538l9964
16517A052746k0554k2431K0713j60906L39287l88486j48077K16621N30417m32607
16507I86723J90291j80212l9294J02407q1935J79822E51224L27297J92440r8430
$$ plain form
16497 972531 981339 853468 1087549 717255 771834 914625 609208 1106143 994457 877279
16487 877279 1022020 711911 1107914 502925 558823 887370 720523 701664 604321 640773
16477 640773 851171 749891 926652 354200 645582 828492 925581 673039 607450 424252
16467 424252 985684 553450 358435 736403 426654 855362 764350 661647 414181 357628
16457 357628 478385 577012 448013 646618 697622 388568 280149 486458 604220 677284
16447 677284 690596 627684 263405 564625 490926 397101 358800 599758 463174 188149
16436 538707 455289 384711 622801 337093 620570 425969 662295 509239 634224 707557
16426 707557 665705 457517 325536 271490 706271 691802 606111 339525 352819 558256
$$ packed form
16497I72531Q808j27871K34081l70294N4579J42791l05417M96935j11686j17178
16487H77279J44741l10109L96003E02925N5898L28547j66847j8859r7343L6452
16477F40773K10398j01280J76761C54200K91382J82910R7089k52542o5589j83198
16467D24252N61432m32234j95015L77968l09749M28708r1012j02703k47466n6553
16457C57628J20757R8627j28999J98605N1004l09054j08419K06309J17762P3064
16447F77284J3312o2912B63405L01220p3699r3825l8301K40958j36584A88149
16436E38707q3418p0578K38090k85708K83477j94601K36326j53056J24985P3333
16426G07557m1852k08188j31981n4046M34781j4469q5691k66586J3294K05437
$$ plain form
16416 558256 333713 389261 382599 119168 403475 355132 468973 269007 144396 199781
16406 199781 392366 308311 342325 663585 434462 504869 433150 351748 441087 228093 327734
16395 327734 318248 379931 337345 364427 312369 141636 505475 497869 289903 436387 437613
16384 437613 236874 226101 598570 229592 458580 265389 461547 271858 172600 143303
16374 143303 316824 296311 248252 136897 500699 122566 184004 250525 311821 132190
16363 434683 308061 219787 524132 234311 -25475 110457 -45830 24747 758593 -5780 522525
16351 -55564 354385 142238 106952 102720 110396 -9966 381732 339642 425492 131115 -94411
16339 159973 108523 -24531 406300 495060 199485 470515 165433 100785 78170 116164 346663
$$ packed form
16416E58256k24543N5548o662A19168K84307m8343J13841j99966j24611N5385
16406A99781J92585q4055L4014L21260k29123P0407p1719q1402Q9339k12994R9641
16395C27734r486O1683m2586K7082n2058A41636L63839p606k07966J46484J226
16384D37613k00739j0773L72469B29592K28988j93191J96158j89689r9258k9297
16374A43303J73521k0513m8059j11355L63802A22566O1438O6521O1296A32190
16363D34683j26622q8274L04345B34311b5475A10457d5830B4747P33846e780E22525
16351e5564C54385A42238l5286m232P676i966C81732m2090Q5850A31115i4411
16339A59973n1450b4531D06300Q8760A99485K71030A65433o4648k2615L7994K30499
$$ plain form
16328 346663 329568 183365 203698 402001 266585 -30982 93426 290447 473268 -36041
16317 438152 319559 121651 -49815 335705 115856 36908 251444 -82574 227434 -60465
16306 202639 -235758 289734 197075 504915 116417 184324 31006 -2436 50405 403616 206586
16295 206586 82883 439706 231629 -494548 104308 -108061 -19305 28278 80933 66222
16285 66222 -20789 151748 -7934 530343 177849 74402 335191 327757 -182095 311770 186945
16274 186945 -76446 56394 159918 133309 203256 -81469 66171 321340 405147 -11292 -96176
16263 -96176 -29551 58149 -77186 -156756 137328 -3666 -2570 36453 83014 429226 47629 79874
16251 79874 466769 -83218 49578 294086 -68504 158054 232130 72838 -7914 -29389 -98255
$$ packed form
16328C46663j7095j46203K0333J98303j35416c0982I3426J97021J82821c6041
16317D38152j18593A21651d9815C35705A15856C6908K14536h2574B27434f0465
16306B02639b35758B89734r2659L07840A16417O7907C1006b436E0405L53211j97030
16295B06586H2883L56823k08077d94548A04308a08061a9305B8278N2655j4711
16285F6222b0789A51748g934E30343A77849G4402K60789p434a82095C11770j24825
16274A86945g6446E6394J03524k6609O9947h1469F6171K55169Q3807a1292q4884
16263i6176b9551E8149g7186p9570A37328c666J096C6453M6561L46212D7629L2245
16251G9874L86895h3218D9578K44508f8504A58054P4076G2838g914k1475o8866
$$ plain form
16240 -98255 -21088 189399 117975 190876 71689 182303 214131 -4060 94529 152888 140249
16229 140249 242158 251292 76704 -201472 284711 162456 -77275 10196 101576 105635 -119776
16217 59669 43139 122433 -17544 10010 168590 276075 67020 -89367 98718 182015 117178
16206 117178 19364 25801 279981 -172758 254767 -255569 153812 -76862 -11081 -15416 111965
16194 38597 -67638 160491 -77966 -77289 90681 -42687 301985 226282 -151674 -108373 -120736
16183 -120736 -65720 -97787 -87608 318275 -220365 -99353 114470 -6387 184756 170156 139383
16172 139383 -39446 -18316 -107097 10827 -143946 195468 226704 23109 -258990 32393 143260
16161 143260 119585 343736 5507 266133 287616 -188924 80569 13110 145459 -238149 142437
$$ packed form
16240i8255b1088A89399p1424P2901G1689J10614L1828d060I4529N8359j2639
16229A40249J01909R134G6704b01472B84711j22255g7275A0196R1380M059a19776
16217E9669j6530P9294a7544A0010J58580J07485F7020h9367I8718Q3297o4837
16206A17178A9364O437K54180a72758B54767b55569A53812g6862a1081m335A11965
16194C8597f7638A60491g7966O77I0681d2687C01985p5703a51674M3301j2363
16183a20736N5016l2067J0179C18275b20365i9353A14470f387A84756j4600l0773
16172A39383c9446a8316q8781A0827a43946A95468L1236B3109b58990C2393J10867
16161A43260k3675K24151E507K60626K1483a88924H0569A3110J32349b38149A42437
$$ plain form
16149 70985 -231434 -187866 -56044 97237 284924 54801 -291321 28043 84307 294952 -7582
16137 -239555 75519 359280 17768 187781 -220604 110948 121567 127240 -2231 332444 75250
16125 212194 32781 122526 275541 -403041 161000 107136 313062 325339 206853 122868
16115 122868 87274 155107 293171 -57380 45392 -113584 -90256 -57922 -86425 34918 -139023
16103 95140 146275 93304 9309 -91615 -378552 -276119 -31591 -102055 -489211 -109533 121134
16091 65 -289355 -110796 221330 -357685 220645 283747 18339 -598791 -234180 28732 -14719
16079 -197129 165935 -107539 4822 29170 98097 -4053 80659 -29880 -62522 -65829 -123601 79189
16066 156486 -111734 -78554 18661 110216 -50400 99797 18811 -79322 -110568 16567 -9628
$$ packed form
16149G0985b31434M3568e6044I7237J87687E4801b91321B8043N6264K10645g582
16137b39555G5519K83761A7768J70013b20604A10948J0619N673b231C32444G5250
16125B12194C2781Q9745J53015d03041A61000n3864K05926J2277j18486q3985
16115A22868l5594O7833J38064e7380D5392a13584K3328L2334k8503C4918a39023
16103I5140N1135n2971I309i1615k86937J02433c1591p0464l87156a09533A21134
16091F5b89355a10796B21330c57685B20645O3102A8339e98791b34180B8732a4719
16079a97129A65935a07539D822K4348O8927d053H0659b9880l2642l307n7772G9189
16066A56486a11734L3180A8661R1555e0400I9797A8811g9322l1246A6567i628
$$ plain form
16054 188732 -165263 -166092 118263 40671 -291480 -226457 -211565 -144794 57443 21901 -163696
16042 -176454 27907 47784 73497 -13057 122386 21296 -80066 -207109 245725 -75536 156971
16030 -242189 178408 26464 -3398 -491392 -19722 2619 -275038 248097 -69901 117198 -145983
16018 -28654 62725 -155389 -160865 -89889 -160923 95047 -95796 -188924 -347530 246651 -402931
16006 29091 -123545 -195515 -131277 -21771 77679 -193252 -190462 -50850 -270684 56975 23075
15994 48148 30700 -141842 203056 -207480 166323 -17402 23303 71704 -9269 165841 387057
15983 387057 253138 147352 370579 273219 337005 282426 -31046 232223 147592 129050 164405
15972 164405 -174399 53272 -31120 13310 -124302 -56959 -80652 -192342 -105700 171011 -184519
$$ packed form
16054A88732a65263q29A18263D0671b91480O5023J4892O6771E7443B1901a63696
16042a76454B7907J9877K5713a3057A22386B1296h0066j27043B45725g5536A56971
16030b42189A78408B6464c398m87994a9722B619b75038B48097f9901A17198a45983
16018b8654F2725a55389n476P0976p1034I5047i5796r3128j58606B46651d02931
16006B9091a23545p1970O4238b1771G7679a93252K790e0850k19834E6975B3075
15994D8148j7448a41842B03056b07480A66323a7402B3303M8401i269A65841K21216
15983C87057j33919j05786K23227r7360O3786n4579c1046B32223q4631j8542L5355
15972A64405a74399E3272c1120A3310a24302e6959k3693j11690Q6642A71011a84519
$$ plain form
15960 82387 176957 119620 -334433 -43038 -195707 -133906 -4077 -254143 23323 272861 165424
15949 165424 136653 99748 275991 -362527 307936 -363698 158405 -56066 168029 -98527
15938 -345602 -321004 -189619 21799 -163872 51673 13597 -71678 -78886 317865 -395703 77953
15926 -76858 107688 139284 -147873 60033 -15378 -116684 -28981 -65312 170766 -28236 -38886
15915 -38886 34869 732 -23944 -210491 -143250 -11565 -66898 24992 -14615 325676 -301184
15903 389991 -225086 -182879 -37115 -75097 -155493 -60701 -346642 231594 85277 168005 -32538
15891 74964 -276933 18336 -43122 160092 57077 -264229 -198445 -79739 303526 -49459 391057
15879 24895 34150 -78031 285554 -50439 -342911 -93472 56315 -343746 105432 135836 -204345
$$ packed form
15960H2387R4570n7337c34433d3038j52669O1801d077k50066B3323K49538j07437
15949A65424k8771l6905J76243c62527C07936c63698A58405e6066A68029i8527
15938c45602K4598J31385B1799a63872E1673A3597g1678p208C17865c95703G7953
15926g6858A07688L1596a47873F0033a5378j01306b8981l6331A70766b8236j0650
15915c8886C4869G32b3944j86547O7241a1565n5333B4992a4615C25676c01184
15903C89991b25086M2207c7115l7982q0396f0701k85941B31594H5277Q2728c2538
15891G4964b76933A8336d3122A60092E7077b64229O5784g9739C03526d9459C91057
15879B4895R255g8031B85554e0439k92472i3472E6315c43746A05432L0404b04345
$$ plain form
15867 24876 -160904 -104135 -14078 249218 44333 -137569 -97391 -135903 28858 -12233 21624
15855 -117794 337030 155310 -243950 -16919 220689 160058 103491 -104811 60237 -198860
15844 154921 -22104 -123201 -85376 -180709 -100493 -201672 36006 -63484 -293392 130312 318668
15833 318668 -220148 23207 -182861 -178004 -6465 -5761 -24423 -162168 -358765 24346 393220
15822 393220 166541 214074 -217364 -245960 -47946 47083 230913 -92821 70829 217381 -406155
15810 -302605 8993 -193900 -140052 -97385 -134396 -428748 270215 239254 -97114 -306952 -77582
15798 -29377 -81973 -149330 -124025 -121902 -170108 -110667 130161 234562 -209025 -40527 5961
15786 615 16496 -14264 -287614 19350 -54962 -204182 296144 223744 -43809 -247192 -338693
$$ packed form
15867B4876a60904N6769a4078B49218D4333a37569M0178l8512B8858a2233B1624
15855a17794C37030A55310b43950a6919B20689o0631n6567a04811F0237a98860
15844A54921b2104j01097L7825r5333Q0216j01179C6006f3484k29908A30312J88356
15833C18668b20148B3207a82861M857f465P04j8662j37745j96597B4346L68874
15822C93220A66541M7533b17364k8596d7946D7083J83830i2821G0829J46552d06155
15810c02605H993a93900N3848M2667l7011k94352B70215l0961i7114k09838g7582
15798b9377n2596o7357K5305K123m8206N9441A30161J04401b09025d0527E961
15786F15J5881a4264k73350A9350e4962j49220B96144p2400d3809k03383r1501
$$ plain form
15775 -338693 -44143 -80578 5847 -209440 -304782 200745 -306657 353257 101911 155816 -251267
15763 25336 -240275 230909 -198064 195376 125251 119054 -103851 300816 318171 234067 150946
15752 150946 455027 80488 108477 139453 -179233 -46185 180004 66187 147532 238118 17267
15740 108853 -74471 -154933 99439 32503 17525 -285104 250169 124766 129068 -132800 -114924
15729 -114924 -111166 240161 -98650 -117224 -122371 -107944 -86694 -111032 -415884 -375641 -208431
15718 -208431 -187828 190904 -134852 -60953 -42826 -94344 -131918 99871 150115 -261595 182572
15706 -65931 -173477 425171 -184981 -238222 -177320 -407573 -102626 -40217 -184939 -68412
15695 60781 93653 -298714 -10404 -134856 202258 47434 467350 250431 108202 -258100
$$ packed form
15775c38693d4143l6435E847b09440r5342B00745c06657C53257A01911N3905b51267
15763B5336b40275B30909a98064A95376p0125o197a03851C00816J7355q4104q3121
15752A50946L04081H0488K7989L0976a79233d6185A80004F6187Q1345R0586A7267
15740A08853g4471q0462I9439C2503j4978b85104B50169A24766M302a32800J7876
15729a14924L758B40161i8650j8574n147J4427K1250k4338l04852M0243J67210
15718b08431K0603A90904a34852f0953J8127n1518l7574I9871N0244b61595A82572
15706f5931j07546D25171a84981n3241O0902k30253a02626d0217j44722f8412
15695F0781L2872b98714a0404j24452B02258D7434M19916k16919A08202b58100
$$ plain form
15684 170899 -199135 -244331 -4403 -137906 46167 67720 -33901 -131768 42887 118821 -13320
15672 211793 3376 24543 -205618 100490 160100 -52082 -95714 -67015 130647 69469 26990
15660 -113267 22090 -106727 60766 99870 27521 -102882 -326693 -179772 -180816 21861 -272462
15648 27541 -58346 156749 -296247 -215629 -30077 65010 420945 -179005 -146538 179548 160324
15637 160324 -142580 42252 -151304 -284659 -79033 -104745 -31224 -56648 -224654 -78744 88871
15625 -297532 -155231 -49881 39610 165744 19634 -7799 103772 220469 7023 -12939 -3595
15613 39730 87072 -209782 51230 -30752 238815 -59346 -85861 -17803 -156796 -23040 212193
15601 64253 -223593 -250685 -98217 -131967 -285288 38236 20365 -67820 107448 58688 -565083
$$ packed form
15684A70899a99135m5196d403j33503D6167K1553c3901r7867D2887P5934a3320
15672B11793C376K1167b05618A00490N9610e2082m3632K8699A30647o1178B6990
15660a13267B2090a06727F0766L9104B7521a02882k23811J46921j044B1861b72462
15648B7541e8346A56749b96247Q0618c0077F5010L55935a79005L2467A79548j9224
15637A60324a42580D2252a51304j33355g9033k5712c1224k5424j68006g8744H8871
15625b97532J42301d9881C9610J26134A9634g799A03772J16697G023a2939c595
15613C9730M7342b09782E1230c0752B38815e9346k6515a7803j38993b3040B12193
15601F4253b23593k7092i8217l3750j53321C8236j7871f7820A07448m8760e65083
$$ plain form
15589 64147 170750 -14241 159511 -118191 254619 59200 -45022 -297817 -63318 23104 -188301
15577 -59465 165323 66837 136187 121235 -95347 -125973 309601 75730 -174065 15967 224061
15566 224061 123595 91989 30323 -155813 -214015 -127566 16401 18769 253341 -7510 190868
15554 -97167 -83434 -30058 -239145 -36733 -83157 -18728 -78132 251229 -237867 51900 77102
15543 77102 -251222 -174943 -122649 139418 -213481 134206 -56257 -100595 216852 -165027
15532 216815 -94086 -65603 15799 -186571 148800 -140256 125671 -177312 -198789 13692
15521 133940 69322 -142621 136998 43007 -40896 -100689 -131307 75055 -116801 214152 233954
15510 233954 -113527 -110659 -310566 -78976 206127 202950 -267197 -122781 -430173 -52512 -150098
$$ packed form
15589F4147J06603a4241A59511a18191B54619E9200d5022k52795f3318B3104a88301
15577e9465A65323F6837O9350j4952i5347l0626C09601G5730a74065A5967K08094
15566B24061j00466l1606C0323a55813n8202Q6449A6401K368K34572g510A90868
15554i7167J3733c0058k09087c6733m6424a8728n9404B51229b37867E1900K5202
15543G7102b51222P6279N2294A39418b13481A34206e6257m4338B16852a65027
15532B16815i4086K8483A5799a86571A48800a40256A25671a77312k1477A3692
15521A33940o4618a42621A36998D3007d0896n9793l0618G5055a16801B14152J9802
15510B33954a13527K868j99907g8976B06127l177b67197a22781l07392e2512r7586
$$ plain form
15499 -150098 -163141 -168766 -178596 79622 -13096 184103 84378 -47259 -68037 319263 -82323
15487 -169147 29496 -257741 159696 128118 131735 -152551 74313 49561 -87297 -2747 83628
15475 -231960 -85527 115176 -175836 98490 -17992 29699 -107360 -234337 -196982 -155561 96189
15463 -31484 -66907 -124146 -4693 89045 -140385 -52047 265170 -357525 337823 127007 -41454
15451 -47669 -199602 -32510 81184 -32690 -54851 101419 -498726 -82309 138750 286772 314537
15440 314537 -239007 -216005 78472 -8904 115540 -164459 -187199 104311 107488 -98277 2651
15428 -97798 83631 102697 200699 210435 308524 -119939 -111850 -66463 215582 201563 -573929
15416 -146102 194323 62143 -127167 -1276 94512 56750 -8285 -25866 2607 -13614 -31231 -59717
$$ packed form
15499a50098j3043n625r830G9622a3096A84103H4378d7259k0778C19263h2323
15487a69147B9496b57741A59696l1578L617a52551G4313k4752h7297b747H3628
15475b31960h5527A15176a75836I8490a7992B9699a07360j26977L7355M1421I6189
15463c1484l5423n7239d693H9045a40385e2047B65170c57525C37823A27007d1454
15451d7669j51933c2510H1184c2690k2161A01419d98726h2309A38750J48022K7765
15440C14537b39007K3002G8472h904A15540a64459k2740A04311L177i8277B651
15428i7798H3631J9066R8002R736R8089a19939Q089M5387B15582j4019e73929
15416a46102A94323F2143a27167a276I4512l7762h285j7581B607a3614j7617k8486
$$ plain form
15404 -59717 -189613 216697 -194490 14591 -30610 -112610 -211523 145629 107656 -74217 29383
15392 -224106 -2671 27506 161880 70184 169683 -44122 21788 -221378 56103 36030 133482
15381 133482 152799 -244790 40977 77823 144674 -91962 -190182 185052 97549 -182468 -172782
15370 -172782 188580 -66272 239339 124334 22534 344192 141361 -23393 -87110 -512732
15360 -512732 -107607 100588 95758 441053 89598 -45910 124987 32713 141941 162393 -107433
15348 267175 158029 93636 566053 -12416 -38532 -30714 -260726 39177 -106149 99256 143841
15337 143841 -188135 32231 -203564 257936 -121795 1437 -671 -188127 -2722 -237661 -216494
15326 -216494 -271801 -40896 -49678 -34864 -105392 -95849 -262334 105008 281515 6458 345853
$$ packed form
15404e9717j29896B16697a94490A4591c0610q2000r8913A45629l7973g4217B9383
15392b24106b671B7506J34374G0184R9499d4122B1788b21378E6103k0073R7452
15381A33482J9317b44790D0977L6846O6851i1962r8220A85052q7503a82468R686
15370a72782A88580f6272B39339j15005B2534L21658A41361b3393o3717m25622
15360e12732a07607A00588m830L45295H9598d5910A24987C2713J09228K0452a07433
15348B67175j09146o4393M72417a2416k6116P818k30012C9177a06149I9256M4585
15337A43841a88135C2231b03564B57936a21795A437f71j87456b722k34939K1167
15326b16494n5307d0896q782J4814p0528R543j66485A05008J76507F458L39395
$$ plain form
15315 345853 396 -40491 -96276 -3601 -69179 76164 38272 -6280 -42736 258552 126148 92445
15303 92445 -53542 -156347 -131733 284211 29558 -124954 78878 312211 409571 31376 182289
15292 182289 26828 80941 183218 15910 -216690 -229903 94038 115464 -78188 -19363 70430
15280 -7093 269842 -96792 383199 158115 39222 -388529 -60241 152267 -78986 97944 123079
15269 123079 255194 389629 -111878 169865 114516 -40860 -99437 104394 106989 436193
15259 436193 238548 224885 26028 216894 247784 248627 319003 239316 -36979 31984 788253
15248 788253 1880889 1322282 899959 1573346 599441 374107 -14072 -197176 110843 -84765
15237 402845 140743 -5861 19490 3823 -277657 -64942 -19157 -77829 216294 209548 -215756
$$ packed form
15315C45853C96d0491n5785c601o5578G6164l7892f280l6456B58552A26148l3703
15303I2445e3542j02805K4614B84211B9558a24954G8878K33333R7360C1376J50913
15292A82289B6828N4113J02277A5910b16690j3213I4038K1426g8188a9363G0430
15280g093B69842i6792C83199A58115C9222c88529f0241A52267g8986I7944K5135
15269A23079J32115J34435a11878A69865n5349d0860n8577A04394K595L29204
15259D36193j97645j3663B6028J90866L0890Q43P0376p9687c6979C1984P56269
15248G88253J092636n58607m22323O73387E99441k25334a4072j83104A10843h4765
15237D02845A40743e861A9490C823b77657f4942a9157n8672B16294o746b15756
$$ plain form
15225 62873 297779 -8007 166368 -27688 96150 29116 7794 45739 240644 -113176 62932
15213 308486 191301 -72544 112964 -39288 -22098 -356300 80345 -117673 241231 -114048
15202 4018 292498 40205 -19657 84416 -163284 116322 133945 191405 12953 11292 -23875
15190 106387 52391 164875 -7645 -267245 49943 169687 -85447 -48419 382714 207106 -79852
15178 127762 168953 15401 -40425 190996 246496 147186 -63312 209969 -93843 83896 1125
15166 -412594 283340 163148 111321 235086 149249 -266964 8820 140168 -184927 -129217
15156 -129217 82896 156048 -299334 51783 349647 175380 -16922 -78165 -115073 183466 -271825
15144 349505 -250121 221273 -50075 21117 66722 181401 -140265 -10791 87310 168194 185202
$$ packed form
15225F2873K34906h007A66368b7688I6150B9116G794L7945J94905a13176F2932
15213C08486j17185g2544A12964c9288J7190l34202H0345a17673B41231a14048
15202D018K88480D0205a9657H4416a63284A16322J7623N7460A2953j661b3875
15190A06387E2391J12484g645k59600D9943J19744h5447L7028C82714j75608g9852
15178A27762M1191A5401d0425A90996N5500r9310f3312B09969i3843H3896A125
15166d12594B83340j20192n1827J23765q5837b66964H820J31348a84927N5710
15156a29217H2896P3152b99334E1783K97864j74267a6922o1243l6908A83466b71825
15144C49505b50121B21273e0075B1117M5605J14679a40265a0791H7310Q0884J7008
$$ plain form
15133 185202 -204044 -80208 487529 499569 358859 75854 79359 64295 -150021 971 -19333
15121 -71809 83924 269129 380946 32692 42704 262255 260603 287389 433054 171672 237523
15110 237523 295685 231432 93636 386026 169451 316116 -108707 368280 188479 -193962
15099 -94237 145172 68597 -48976 133403 219765 -35199 -12876 -184555 124278 -120505 -29415
15087 130194 359700 210433 187435 -73638 29290 -174447 -52436 -78581 -76097 -48043 133927
15075 47094 122431 24361 375662 192293 142899 47310 -236625 -49225 268787 35812 -241470
15063 287374 387389 104972 313098 390314 449801 -16397 320273 117623 6642 -81363 201635
15051 263652 310819 -18655 150739 -122900 35367 238570 287252 270074 462994 192766
$$ packed form
15133A85202b04044h0208D87529J2040j40710G5854L505j5064a50021I71a9333
15121g1809H3924J85205J11817C2692J0012K19551j652K6786J45665A71672O5851
15110B37523N8162o4253I3636K92390A69451J46665a08707C68280j79801a93962
15099i4237A45172F8597d8976A33403Q6362c5199a2876j71679A24278a20505b9415
15087A30194K29506j49267k2998g3638B9290a74447e2436k6145K484K8054A33927
15075D7094P5337B4361L51301j83369m9394D7310b36625d9225B68787C5812b41470
15063B87374J00015A04972K08126P7216N9487a6397C20273A17623F642h1363B01635
15051B63652M7167a8655A50739a22900C5367K03203M8682j7178J92920A92766
$$ plain form
15040 27125 512308 251772 62373 499739 234928 306855 426479 234725 115615 384034
15030 384034 -273667 80474 476311 311935 89033 207668 311027 206805 416559 -34674
15019 157990 136745 55967 365442 204171 -24427 265863 161359 -193921 82406 199185
15009 199185 421340 65340 352881 114815 205883 356751 402189 122535 256159 141771
14999 141771 241189 194034 126076 519156 257508 316033 118756 74380 224284 415639
14989 415639 341224 -1204 218973 271293 175747 371660 295964 13129 152899 138006 93578
14978 93578 317304 -43167 220052 245987 300590 245039 298863 325826 71330 -104786 508801
14966 291077 508145 386001 256570 566184 287836 221599 277975 104307 438762 341531
$$ packed form
15040B7125M85183B51772F2373M37366B34928P1927J19624j91754A15615K68419
15030C84034b73667H0474L95837j64376H9033J18635J03359j04222K09754c4674
15019A57990k1245E5967L09475j61271b4427B65863j04504a93921H2406J16779
15009A99185K22155F5340K87541A14815R1068J50868M5438A22535J33624j14388
14999A41771R9418m7155o7958L93080B57508N8525A18756m4376J49904J91355
14989D15639p4415a204B18973N2320r5546J95913p5696A3129J39770j4893m4428
14978I3578K23726d3167B20052K5935N4603n5551N3824K6963G1330a04786E08801
14966B91077K17068j22144j29431L09614k78348o6237N6376A04307L34455r7231
$$ plain form
14956 341531 283008 77680 157233 52508 189039 211151 102041 -37251 161176 100015 201641
14945 201641 368670 96557 114214 169325 399636 401191 226200 163281 277239 246793 472051
14934 472051 127940 -8357 407127 281379 267287 498474 275633 233566 209082 222305 368758
14923 368758 190923 460664 541793 240819 247540 51176 229393 494042 176501 272235
14913 272235 57824 36111 484169 370610 126337 305756 396961 176466 37499 -49765
14902 -187297 604482 572459 -29590 25009 259850 294956 718525 258039 239030 351414
14892 351414 236815 374360 381377 257491 180364 -12144 295340 93049 109551 659533 518360
14881 518360 463930 252931 254368 148611 419678 352557 571784 478729 325654 508811
$$ packed form
14956C41531n8523G7680P9553E2508J36531K2112A02041c7251A61176o1161J01626
14945B01641J67029I6557J7657N5111K30311J555j74991o2919J13958l0446K25258
14934D72051A27940h357D07127j25748j4092K31187k22841m2067k4484J3223J46453
14923C68758j77835K69741Q1129B40819O721E1176J78217K64649A76501R5734
14913B72235E7824k1713M48058j13559A26337J79419R1205A76466C7499d9765
14902a87297F04482l2023b9590B5009K34841L5106M23569B58039j9009J12384
14892C51414j14599J37545P017j23886p7127a2144B95340I3049J6502N49982j41173
14881E18360n4430k10999J437j05757K71067o7121K19227r3055j53075J83157
$$ plain form
14871 508811 612499 544159 289274 123478 508028 166999 453602 382271 343306 489839
14861 489839 142982 212048 484258 313986 350085 520099 267605 421710 364159 540681
14851 540681 254583 481696 652407 344206 546034 9152 328220 533789 175854 341670
14841 341670 206294 539646 603763 319199 830724 297122 457082 657454 372282 421726
14831 421726 501812 166929 459203 430934 638449 459177 425897 380594 691254 525508
14821 525508 486385 471533 478792 399154 401307 571161 440729 253296 617507 587365 736921
14810 736921 650075 763424 537210 627178 372564 773968 672912 371007 460572 502708
14800 502708 528355 617711 281668 580888 802211 604682 697605 276189 401512 836872
$$ packed form
14871E08811J03688o8340k54885A23478L84550A66999K86603p1331l8965J46533
14861D89839A42982O9066K72210j70272L6099J70014k52494J54105n7551J76522
14851E40681B54583K27113J70711l08201K01828I152L19068K05569A75854J65816
14841C41670j35376L33352O4117k84564N11525B97122J59960K00372k85172M9444
14831D21726Q0086A66929K92274k8269K07515j79272l3280m5303L10660j65746
14821E25508l9123j4852P259p9638K153J69854j30432j87433L64211l0142J49556
14810G36921q6846J13349k26214Q9968k54614M01404j01056l01905Q9565M2136
14800E02708K5647Q9356B81668K99220K21323j97529R2923B76189J25323M35360
$$ plain form
14790 836872 379124 544881 466220 355572 594092 525541 262072 589803 552035 314075
14780 314075 142201 286174 348483 453780 441555 528236 641181 590199 743966 511649
14770 511649 571505 446208 525987 575786 571173 279229 682859 624304 871379 732310 490249
14759 490249 413022 944131 471555 582103 812864 557861 512845 336168 370293 888137
14749 888137 771875 817374 755838 805898 560512 519393 714082 858565 711468 656117
14739 656117 611296 298138 937914 656822 830356 602532 388672 734216 967904 731226
14729 731226 652098 1093368 409354 1030218 816666 700645 663813 914013 727029 753120
14719 753120 557494 846448 870856 294258 499003 688329 627772 814595 637926 637507
$$ packed form
14790H36872C79124J65757p8661j10648K38520o8551B62072L27731l7768k37960
14780C14075A42201J43973O2309J05297j2225Q6681J12945n0982J53767k32317
14770E11649N9856j25297P9779M9799m613B79229M03630n8555K47075j39069k42061
14759D90249p7227N31109D71555J10548K30761k55003m5016j76677L4125N17844
14749H88137j16262M5499o1536N0060k45386m1119J94689J44483j47097n5351
14739F56117m4821B98138O39776k81092J73534k27824k13860L45544K33688k36678
14729G31226p9128M41270D09354O20864k13552j16021l6832K50200j86984K6091
14719G53120j95626K88954K4408B94258K04745J89326o0557J86823j76669m19
$$ plain form
14709 637507 670259 1014986 944271 1019500 935981 650113 795966 841798 990600 762741
14699 762741 894764 869951 1123492 1101778 1151527 1010662 937122 888336 1029715 869921
14689 869921 793693 916082 693120 1047098 821280 922357 698904 817332 898175 884167
14679 884167 1028577 1052496 1049939 1255591 972046 843233 1036728 896126 1082713 1211445
14669 1211445 1096071 866986 1236852 1100057 788284 932227 1137843 952709 1182014
14660 1182014 1088931 1061501 905228 1067978 772948 1247939 1171096 1162405 883420 988428
14650 988428 1453578 1153622 1152854 1103385 1482667 1171636 1398009 853434 1397999 1083710
14640 1083710 1350490 1243539 1129951 1017726 1431076 1452329 1345878 1439500 1052852 1119996
$$ packed form
14709F37507L2752L44727p0715P5229q3519k85868J45853M5832J48802k27859
14699G62741J32023k4813K53541k1714M9749j40865p3540m8786J41379j59794
14689H69921p6228J22389k22962L53978k25818J01077k23453J18428Q0843j4008
14679H84167J44410K3919k557K05652k83545j28813J93495j40602J86587J28732
14669A211445j15374k29085L69866j36795l11773J43943K05616j85134K29305
14660A182014r3083k7430j56273J62750k95030M74991p6843q691k78985J05008
14650I88428M65150k99956p68m9469L79282l11031K26373n44575N44565l14289
14640A083710K66780j06951j13588j12225M13350K1253j06451R3622l86648O7144
$$ plain form
14630 1119996 1441512 1198885 1154776 1435776 1317324 1110296 1384762 1238356 1560896 1530255
14620 1530255 1194296 1605392 1323697 1281598 1313420 1402983 1138722 1428731 996634 1867238
14610 1867238 1608522 1527156 1355644 1538699 1575974 1568727 1822066 1555328 1451794 1810782
14600 1810782 1730668 1924645 1588129 1495904 1451386 1955523 2079281 1594489 1557950 1620129
14590 1620129 1894198 1683254 1884616 1861520 1758306 1516433 1932087 1588645 1857184 2097304
14580 2097304 1987437 1868009 2218292 2254097 2185313 1892204 2099841 2093071 2315101 2348152
14570 2348152 2265120 2116137 2411009 2602884 2451945 2415696 2648271 2383019 2519294 2408579
14560 2408579 2311156 2925007 2941084 3120386 3145518 3079727 3666526 3938297 4370210 4886149
$$ packed form
14630A119996L21516k42627m4109K81000j18452k07028K74466j46406L22540l0641
14620A530255l35959M11096k81695m2099L1822Q9563k64261K90009m32097Q70604
14610A867238k58716q1366j71512J83055L7275p247K53339k66738j03534L58988
14600A810782q0114J93977l36516r2225m4518N04137J23758m84792l6539O2179
14590A620129K74069k10944K01362k3096j03214k41873M15654l43442K68539K40120
14580B097304j09867j19428L50283L5805o8784k93109K07637o770K22030L3051
14570B348152q3032j48983K94872J91875j50939l6249K32575k65252J36275j10715
14560B408579r7423O13851J6077J79302K5132o5791N86799K71771M31913N15939
$$ plain form
14550 4886149 5802427 8258779 13034160 21030977 35996061 47680129 23552955 9182269
14541 4370522 2854847 2484089 2113176 2123153 1870118 2182865 1684723 2212168 1985858 2147296
14531 2147296 2188016 2529181 2155330 2674829 2229905 2486964 2483507 2708571 2422025 2722783
14521 2722783 2780916 2300718 2469104 2455956 2643881 2736087 2835092 2800511 2624426 2871185
14511 2871185 2779076 2894323 2910613 3001367 2837614 2789402 2849481 3011929 3041066 2999756 3280737
14500 3280737 3062573 3174408 3156244 3171096 2917740 3419531 3061383 3264910 3700912 3478504
14490 3478504 3807248 3305326 3765336 3548082 3644761 3545860 4081825 3920965 3977947 4298946
14480 4298946 4217447 3822501 4123318 4161692 3943510 3917924 3990307 4344627 4217733 4044230
$$ packed form
14550D886149R16278K456352M775381P996817J4965084J1684068B3552955I182269
14541D370522j515675l70758l70913R977k53035L12747m98142N27445k26310J61438
14531B147296M0720L41165l73851N19499m44924K57059l457K25064k86546L00758
14521B722783N8133m80198J68386j3148J87925R2206R9005l4581j76085K46759
14511B871185r2109J15247J6290R0754j63753m8212O0079J62448K9137m1310K80981
14500C280737k18164J11835j8164J4852k53356N01791l58148K03527M36002k22408
14490C478504L28744n01922M60010k17254R6679r8901N35965j60860N6982L20999
14480D298946q1499l94946L00817L8374k18182k5586P2383L54320j26894j73503
$$ plain form
14470 4044230 4179194 4167756 4179290 4495033 4541994 4639860 4702894 4712941 4776013 4613495 5265706
14459 5265706 4718209 4976126 5041796 4941246 5181471 5011732 5275781 5458592 5290853 5602310
14449 5602310 5681990 5701223 5705444 6209744 5792026 5489859 5863880 6198997 6212980 6230781
14439 6230781 6343409 6349863 6442518 6633443 6612474 6541976 6780676 6959073 7085404 6992861
14429 6992861 7207210 7348064 7298246 7377561 7536837 7428916 7761625 7791791 7967788 7814092
14419 7814092 8267405 8102222 8496502 8857507 8813456 8948030 8804215 9181857 9033718 9486772
14409 9486772 9383340 9433333 9632205 9631420 10015552 9922376 10128057 10024222 10707241 10737673
14399 10737673 11113625 11148414 11092523 11317056 11680242 11773451 12164563 12339938 12308648 12497714
$$ packed form
14470D044230J34964j1438J1534L15743M6961R7866O3034J0047O3072j62518O52211
14459E265706n47497K57917O5670j00550K40225j69739K64049J82811j67739L11457
14449E602310P9680J9233M221N04300m17718l02167L74021L35117J3983J7801
14439F230781J12628O454R2655J90925k0969p0498K38700J78397J26331r2543
14429F992861K14349J40854m9818P9315J59276j07921L32709L0166J75997j53696
14419G814092M53313j65183L94280L61005m4051J34574j43815L77642j48139M53054
14409I486772j03432M9993J98872p85L84132r3176K05681j03835O83019L0432
14399A0737673L75952L4789n5891K24533L63186R3209L91112J75375l1290J89066
$$ plain form
14389 12497714 12774054 13093474 12998701 13413772 13880385 13844597 14054561 14641312 14393079 15179537
14379 15179537 15239517 15788880 15823181 16192026 16593646 16561291 17028487 17444437 17339991 18358051
14369 18358051 18528891 18775379 19352262 19903553 20033378 20406474 20974400 21324743 21610467
14360 21610467 22429573 22852790 23285233 23708382 24316620 24827830 25618516 26136877 26354791
14351 26354791 26928134 27988260 28738738 29537046 29994321 30833726 31614620 32502521 33263278
14342 33263278 34177303 35273279 36050841 37061868 38190112 38840621 40417374 40954295 42609142
14333 42609142 43793656 45534176 46350430 48157804 49388602 50749342 52539631 54367044
14325 54367044 56224477 57792602 60021312 61879975 64334517 66230183 69116350 71559902
$$ packed form
14389A2497714K76340L19420r4773M15071M66613l5788K09964N86751k48233P86458
14379A5179537N9980N49363L4301L68845M01620l2355M67196M15950j04446J018060
14369A8358051J70840K46488N76883N51291J29825L73096N67926L50343K85724
14360B1610467Q19106M23217M32443M23149O08238N11210P90686N18361K17914
14351B6354791N73343J060126P50478P98308M57275Q39405P80894Q87901P60757
14342C3263278R14025J095976P77562J011027J128244O50509J576753N36921J654847
14333D2609142J184514J740520Q16254J807374J230798J360740J790289J827413
14325E4367044J857433J568125K228710J858663K454542J895666K886167K443552
$$ plain form
14317 71559902 74106161 76788679 79980846 82779951 86237469 89496564 92830561 96762014
14309 96762014 101031945 105255815 109756038 114528196 119323869 124621346 130553061 136278711
14301 136278711 142716677 149258997 156151498 163897261 171702152 180169083 189026959 198458073
14293 198458073 208297017 218682418 229739783 241307216 253327527 265873024 278910114
14286 278910114 292763001 307050703 321222989 335915970 350939387 365518497 379842010
14279 379842010 394244434 407333860 419772816 431098291 440871441 448575662 453250461
14272 453250461 454032997 454212122 454998876 456547961 454968285 451481059 445994859 437496020
14264 437496020 427268493 415154110 401839966 387478426 372813661 357839654 342411234
$$ packed form
14317G1559902K546259K682518L192167K799105L457518L259095L333997L931453
14309I6762014M269931M223870M500223M772158M795673N297477N931715N725650
14301A36278711O437966O542320O892501P745763P804891Q466931Q857876R431114
14293A98458073R838944J0385401J1057365J1567433J2020311J2545497J3037090
14286B78910114J3852887J4287702J4172286J4692981J5023417J4579110J4323513
14279C79842010J4402424J3089426J2438956J1325475R773150P704221M674799
14272D53250461P82536J79125P86754J549085j579676l487226n486200q498839
14264D37496020j0227527j2114383j3314144j4361540j4664765j4974007j5428420
$$ plain form
14257 342411234 327290884 312316254 298067870 284635679 271119187 258037400 245357692
14250 245357692 233484031 222297353 211363233 201537536 191539176 182629121 174186496
14243 174186496 166061797 158624219 150846544 144224880 137624047 131987033 126897303 121242375
14235 121242375 115761319 110768692 106521333 102208843 98324169 94763375 90900258 87408207
14227 87408207 83819546 80930928 77854732 74707179 71978601 69761237 67711949 65461058
14219 65461058 62995494 60846837 58973528 56731610 55190587 53600730 52405182 50675422
14211 50675422 49079859 47580690 45883606 44772627 44056244 42811806 41338617 40146418
14203 40146418 39145435 37970563 37077637 36364135 35028498 34329304 33255751 32236594
$$ packed form
14257C42411234j5120350j4974630j4248384j3432191j3516492j3081787j2679708
14250B45357692j1873661j1186678j0934120r825697r998360q910055q442625
14243A74186496q124699p437578p777675o621664o600833n637014n089730n654928
14235A21242375n481056m992627m247359m312490l884674l560794l863117l492051
14227H7408207l588661k888618l076196l147553k728578k217364k049288k250891
14219F5461058k465564k148657j873309k241918j541023j589857j195548j729760
14211E0675422j595563j499169j697084j110979p16383j244438j473189j192199
14203D0146418j000983j174872q92926p13502j335637o99194j073553j019157
$$ plain form
14195 32236594 31463538 31151852 30263993 29679415 28824576 28309097 27098938 26534428 26150597
14186 26150597 25543260 25106984 24469984 23898803 23042727 22663507 22036760 22042901 21371537 20943525
14176 20943525 20615884 20074094 19604577 19467082 18890269 18779379 18089275 17837799 17447814
14167 17447814 17355422 16766863 16705861 16040203 15894534 15687925 15407617 15335235 14598403 14501758
14157 14501758 14075752 14021640 13708485 13528994 13408275 13309705 13021548 12756516 12722657 12216971
14147 12216971 12081232 11928051 11742904 11516580 11435948 11435341 10992702 11082081 10503832 10254058
14137 10254058 10398709 9964468 9958549 9829349 9644891 9505768 9200302 9483943 9392756 9115205
14127 9115205 9114948 9074044 8694149 8593470 8533289 8218263 7982744 7985858 8150147 7947056 7990369
$$ packed form
14195C2236594p73056l11686q87859n84578q54839n15479j210159n64510l83831
14186B6150597o07337m36276o37000n71181q56076l79220o26747O141o71364m28012
14176B0943525l27641n41790m69517j37495n76813j10890o90104k51476l89985
14167A7447814r2392n88559o1002o65658j45669k06609k80308p2382p36832r6645
14157A4501758m26006n4112l13155j79491j20719r8570k88157k65032l3859n05686
14147A2216971j35739j53181j85147k26324q0632o07m42639Q9379n78249k49774
14137A0254058J44651m34241n919j29200j84458j39123l05466K83641r1187k77551
14127I115205k57m0904l79895j00679o0181l15026k35519L114J64289k03091M3313
$$ plain form
14116 7990369 7747490 7805410 7440605 7543762 7182076 7129183 6984512 7044759 7013638 7169451
14106 7169451 6950649 6934262 6554788 6554343 6628692 6314436 6153738 6698938 6359663 5980503
14096 5980503 5960669 6042060 5856484 5875644 5673060 5792729 5602923 5439552 5457176 5560916
14086 5560916 5181297 5433278 5236073 5481225 5334086 5175758 5268950 4936287 5011890 4885699
14076 4885699 5104249 4910019 4497377 5122023 4924891 4443413 4406443 4553322 4499423 4224918
14066 4224918 4543153 4416567 4398103 4434264 4266588 4250976 4176630 4673128 4414063 4008200
14056 4008200 4124305 4138289 4143145 4092640 3751150 3884759 4032330 3744876 3876570 3825303
14046 3825303 3853375 3791521 3742180 3528413 3549541 3619362 3575801 3400798 3228802 3281216 3505052
$$ packed form
14116G990369k42879N7920l64805J03157l61686n2893j44671O0247l1121J55813
14106G169451k18802j6387l79474m45P4349l14256j60698N45200l39275l79160
14096E980503j9834Q1391j85576J9160k02584J19669j89806j63371J7624J03740
14086E560916l79619K51981j97205K45152j47139j58328R3192l32663P5603j26191
14076D885699K18550j94230m12642O24646j97132m81478l6970J46879n3899k74505
14066D224918L18235j26586j8464L6161j67676j5612p4346M96498k59065m05863
14056D008200J16105J3984M856n0505l41490J33609J47571k87454J31694n1267
14046C825303K8072o1854m9341k13767K1128O9821m3561j75003j71996N2414K23836
$$ plain form
14035 3505052 3507027 3241548 3350415 3169271 3048741 3390562 3005699 3325215 3151592 3129608
14025 3129608 3105931 2950574 2773421 2748448 2797008 2814954 2812983 2665424 2737706 2819625 3070733
14014 3070733 2481198 2422155 2481318 2733314 2713903 2457095 2550136 2311486 2093887 2437190
14004 2437190 2573490 2159472 2256941 2128248 2117499 2267054 2253404 2231999 2220723 2371297
13994 2371297 2059644 2381475 2445885 2593294 3134622 4197217 7646418 14522329 29291412
13985 29291412 48190834 28005216 13846104 8339353 6111767 5055634 4352721 3669177
13977 3669177 3436494 3155608 3181103 2881038 3179432 2885098 2559767 2707844 2901644 2731878
13967 2731878 2552878 2584333 2465490 2098618 2394529 2541377 2351881 1939020 2377551 2321573
$$ packed form
14035C505052J975k65479J08867j81144j20530L41821l84863L19516j73623k1984
14025C129608k3677j55357j77153k4973M8560J7946j971j47559P2282Q1919K51108
14014C070733n89535n9043N9163K51996j9411k56808R3041k38650k17599L43303
14004B437190J36300m14018R7469j28693j0749J49555j3650k1405j1276J50574
13994B371297l11653L21831O4410J47409N41328J062595L449201O875911J4769083
13985B9291412J8899422k0185618A3846104n506751k227586j056133p02913o83544
13977C669177k32683k80886K5495l00065K98394k94334l25331J48077J93800j69766
13967B731878j79000L1455j18843l66872K95911J46848j89496m12861M38531n5978
$$ plain form
13957 2321573 2309579 2118662 1967712 2015048 2183159 2027275 2044413 2289507 1877133 2175224
13947 2175224 2020455 1772296 1712490 1741924 1863466 2148729 2019609 1909987 1957117 2215268
13937 2215268 2155656 1844899 1824120 1901564 1631121 2070714 1700653 1479062 1618010 1923697
13927 1923697 1900874 1573464 2046385 1810115 1424682 1688042 1604237 1663727 1328330 1457168
13917 1457168 1548953 1625560 1355814 1774622 1632327 1578457 1461174 1666984 1676533 1200839
13907 1200839 1599251 1324937 1345648 1224179 1577486 1759563 1359017 1512611 1326173 1321205
13897 1321205 1323726 1675426 1514176 1467086 1378228 1608827 1501431 1155716 1284453 1241797
13887 1241797 1542433 1397493 1328229 1231922 1846247 1453640 1489164 1307158 1286353 1189103
$$ packed form
13957B321573j1994j90917j50950M7336J68111j55884J7138K45094m12374K98091
13947B175224j54769k48159n9806K9434J21542K85263j29120j09622M7130K58151
13937B215268n9612l10757k0779P7444k70443M39593l70061k21591J38948L05687
13927A923697k2823l27410M72921k36270l85433K63360q3805N9490l35397J28838
13917A457168R1785P6607k69746M18808j42295n3870j17283K05810R549m75694
13907A200839L98412k74314K0711j21469L53307J82077m00546J53594j86438m968
13897A321205K521L51700j61250m7090q8858K30599j07396l45715J28737m2656
13887A241797L00636j44940o9264r6307O14325l92607L5524j82006k0805r7250
$$ plain form
13877 1189103 1067213 839723 1330338 1216715 1262813 1584282 1315459 1317551 1262884 1246793
13867 1246793 1350658 1282629 1013909 1192464 1118212 1247119 1109174 1050604 1289942 1330008
13857 1330008 1241298 1009393 910209 1269500 1022527 1177847 1386993 1052720 1193209 1305423
13847 1305423 1025664 1263588 1158636 1036512 1249072 973316 962588 976325 873863 677789
13837 677789 1022297 855604 796614 1081162 938825 993996 1038266 926975 807332 650010
13827 650010 872469 800345 1222566 939094 978144 873824 1258516 1050538 855533 866119
13817 866119 975023 1024630 831721 1296645 1105681 1035455 896237 800499 1001043 870810
13807 870810 947689 1237893 914220 945430 799054 868954 858062 930465 785084 803838 899930
$$ packed form
13877A189103j21890k27490M90615j13623M6098L21469k68823K092n4667j6091
13867A246793J03865o8029k68720J78555p4252J28907j37945n8570K39338M0066
13857A330008q8710k31905r9184L59291k46973J55320K09146l34273J40489J12214
13847A305423k79759K37924j04952j22124K12560k75756j0728J3737j02462j96074
13837F77789L44508j66693n8990K84548j42337N5171M4270j11291j19643j57322
13827F50010K22459p2124M22221k83472L9050j04320L84692k07978j95005J0586
13817H66119J08904M9607j92909M64924j90964p0226j39218r5738K00544j30233
13807H70810P6879K90204l23673L1210j46376O9900j0892P2403j45381J8754R6092
$$ plain form
13796 899930 1050086 759541 644433 959097 1119050 914589 947010 1380301 868116 816790
13786 816790 1021155 988628 873672 1078369 817697 704096 962250 768706 875705 952087
13776 952087 807305 855498 887693 496641 650934 757279 659777 849296 845493 491264
13766 491264 932225 573032 725529 735418 804680 484910 333696 718553 957454 805937
13756 805937 740713 545767 564844 860225 642452 529291 912462 447760 664971 762161
13746 762161 435171 318896 541783 688521 714411 690110 361087 699065 380361 409951
13736 409951 682930 400733 717477 667414 670940 684719 927403 572748 771171 545989
13726 545989 916732 713797 959176 413692 536758 718758 653331 1024660 623146 808856
$$ packed form
13796H99930J50156k90545j15108L14664J59953k04461L2421M33291n12185n1326
13786H16790K04365l2527j14956K04697k60672j13601K58154j93544J06999P6382
13776I52087j44782M8193L2195l91052J54293J06345r7502J89519l803l54229
13766D91264M40961l59193J52497R889O9262l19770j51214L84857K38901j51517
13756H05937o5224j94946J9077K95381k17773j13161L83171D47760K17211R7190
13746G62161l26990j16275K22887J46738K5890k4301l29023L37978l18704K9590
13736D09951K72979k82197L16744n0063L526J3779K42684l54655J98423k25182
13726E45989L70743k02935K45379D13692J23066J82000o5427L71329m01514J85710
$$ plain form
13716 808856 635397 622946 619772 379846 680464 843405 542173 708511 514569 667922
13706 667922 638569 380098 765530 443029 718918 797697 675008 649389 615145 705338
13696 705338 720554 828094 355840 439853 548526 433899 532403 632854 642130 536300
13686 536300 543558 311385 332641 332995 453862 577921 196007 372255 754198 470714 433208
13675 433208 439972 449602 718068 1085778 433589 614869 257403 628523 769944 537438
13665 537438 484150 64922 501499 139737 632362 469670 616968 700801 412470 406819
13655 406819 251039 518310 202741 618991 546417 474777 227177 475945 231798 396530
13645 396530 637778 697965 464992 334886 216567 362122 401848 374124 294905 451498
$$ packed form
13716H08856j73459j2451l174k39926L00618J62941l01232J66338j93942J53353
13706F67922k9353k58471L85432l22501K75889P8779j22689k5619l4244R0193
13696G05338J5216J07540C55840Q4013J08673j14627R8504J00451R276j05830
13686E36300P258k32173K1256L54J20867J24059A96007J76248L81943k83484l7506
13675D33208O764R630K68466L67710D33589J81280B57403L71120J41421k32506
13665E37438n3288F4922M36577A39737M92625j62692J47298Q3833k88331n651
13655D06819j55780K67271B02741M16250p2574p1640B27177K48768B31798J64732
13645C96530K41248O0187k32973j30106j18319J45555L9726k7724p9219J56593
$$ plain form
13635 451498 432855 286082 714001 711571 338457 17577 439284 230505 348610 159944
13624 601087 576701 413966 385273 285050 418728 370000 298420 412997 93547 306846
13614 306846 407259 315095 275006 476611 228755 459860 511348 700721 249578 142206
13604 142206 531938 347999 707667 866158 421419 576539 557772 239926 228410 238457
13594 238457 305007 266274 570217 488056 443606 568236 508724 532539 -102338 269914 4941
13582 465308 188332 709942 616401 425263 267617 288620 376015 556944 297730 403872
13572 403872 353954 326414 331386 361753 465180 436398 200142 187182 319863 655535 349502
13561 349502 145742 160673 170054 315668 137292 416791 305053 400624 337541 160375
$$ packed form
13635D51498j8643j46773M27919k430C38457A7577M21707k08779J18105A59944
13624F01087k4386j62735k8693j00223J33678m8728p1580J14577I3547K13299
13614C06846J00413r2164m0089K01605B28755K31105N1488J89373B49578j07372
13604A42206L89732j83939L59668J58491D21419J55120j8767B39926j1516J0047
13594B38457O6550l8733L03943q2161m4450J24630n9512K3815a02338B69914D941
13582D65308A88332N21610r3541j91138j57646K1003Q7395J80929k59214J06142
13572D03872m9918k7540M972L0367J03427k8782B00142j2960J32681L35672l06033
13561C49502A45742J4931R381J45614A37292K79499j11738R5571o3083A60375
$$ plain form
13550 53368 483485 439477 314259 595079 233724 215772 314002 491963 276872 158910
13540 158910 184308 381358 451060 751439 383276 195188 219709 60515 462125 354928
13530 354928 318771 99275 298957 609659 293394 726568 72992 407124 392513 658574
13520 658574 190843 316805 495555 20072 488650 128992 591920 301068 487500 395278
13510 395278 284113 169123 103987 444788 484426 32090 423309 672693 155006 433149
13500 433149 348975 356027 -187239 237296 358677 346774 305403 107944 527690 179093
13489 470308 176979 217667 387154 402535 310602 507440 184536 163958 214054 76597 416114
13478 416114 239352 602409 603879 325415 264875 69719 235313 118332 392184 302951
$$ packed form
13550E3368M30117m4008j25218K80820B33724j7952R8230J77961k15091j17962
13540A58910K5398J97050O9702L00379l68163j88088K4521F0515M01610j07197
13530C54928l6157I9275J99682L10702B93394M33174G2992L34132j4611K66061
13520F58574A90843J25962J78750B0072M68578A28992M62928k90852J86432r2222
13510C95278j11165j14990o5136L40801L9638C2090L91219K49384A55006K78143
13500D33149q4174P052a87239B37296J21381j1903m1371A07944M19746A79093
13489D70308A76979M0688J69487J5381r1933J96838A84536k0578N0096G6597L39517
13478D16114j76762L63057J470k78464o0540F9719J65594j16981K73852q9233
$$ plain form
13468 302951 527767 326753 299825 419108 321873 502539 398584 303231 114416 108154
13458 108154 344471 126689 162316 184003 -58609 157013 315115 40975 211214 -234318
13447 326309 231719 361977 21130 -138659 -6978 97588 229870 17611 385047 422175 352339
13436 352339 254540 132631 366847 184604 195055 509149 50045 273422 276028 -105224
13425 122106 231897 421499 -144067 98707 248649 -346 266063 408835 270525 383864
13415 383864 395705 161924 -39892 368633 59155 214193 424457 406962 -107359 59407
13404 541502 194731 157803 207804 367295 -240161 676243 107682 630003 376579 104761
13393 168709 315434 422742 802 282399 268017 -47718 317559 298370 344148 -91234 110821
$$ packed form
13468C02951K24816k01014k6928J19283r7235J80666j03955r5353A14416o262
13458A08154K36317A26689L5627K1687e8609A57013J58102D0975J70239b34318
13447C26309r4590J30258B1130a38659f978I7588J32282A7611L67436L7128o9836
13436C52339r7799j21909K34216j82243J0451L14094E0045K23377K606a05224
13425A22106J09791J89602a44067I8707J49942c46B66063J42772j38310J13339
13415C83864J1841A61924c9892C68633E9155J55038K10264j7495a07359E9407
13404E41502A94731l6928N0001J59491b40161F76243A07682N22321k53424A04761
13393A68709J46725J07308H02K81597j4382d7718C17559j9189M5778i1234A10821
$$ plain form
13381 173158 556496 205531 171532 329425 210022 337997 340441 365239 19562 261128
13371 261128 259865 139014 -53022 187610 317582 32890 201354 665604 107051 211436
13361 211436 170515 258 88762 535106 208816 207171 235523 448342 206414 94553 273131
13350 273131 291202 169759 202011 83194 190509 257121 455859 532379 253343 451596
13340 451596 453174 385248 603364 313788 411196 397119 12201 177711 393496 383152 290862
13329 290862 308372 204489 189104 -27428 260718 51759 144528 85827 88000 268701 508182
13318 508182 313740 184630 372415 417065 116133 229067 402188 250724 58718 375353
13308 375353 71526 176560 163281 231183 198093 -162964 225673 65459 439944 218968
$$ packed form
13381A73158L83338B05531l3999J57893j19403J27975K444K4798A9562K41566
13371B61128j263j20851e3022A87610J29972C2890J68464M64250A07051J04385
13361B11436m0921B58Q8504M46344B08816j645K8352K12819B06414I4553J78578
13350B73131J8071j21443L2252H3194J07315O6612J98738P6520B53343J98253
13340D51596J578o7926K18116k89576R7408j4077A2201J65510K15785j0344r2290
13329B90862J7510j03883j5385b7428B60718E1759R2769n8701K173J80701K39481
13318E08182j94442j29110J87785M4650A16133J12934J73121j51464E8718L16635
13308C75353G1526J05034j3279O7902l3090a62964B25673F5459L74485B18968
$$ plain form
13297 308318 276539 114806 30016 334099 59903 249580 174236 269027 462037 142102
13286 -45085 319771 533568 286916 189900 247151 233118 176251 -65857 457770 673014 -207684
13274 138939 227320 483971 19098 218571 59857 506164 -161417 179239 30752 87931
13264 87931 73708 -8612 364072 95381 82407 -58243 63068 187202 -26279 409047 -60823
13252 156269 387968 -40658 -129241 250313 105467 205853 290094 385653 69476 274318
13242 274318 242730 121259 79741 79227 45108 304596 201805 97116 -211477 292951 285200
13231 285200 -22213 18424 163018 180303 288277 -50960 38809 162453 -83916 -304590 -84942
13219 -118653 81835 87824 -172651 1185 484472 111138 379071 282576 -80853 104210 -35922
$$ packed form
13297C08318l1779A14806C0016L04083E9903J89677p5344R4791J93010A42102
13286d5085C19771K13797k46652r7016N7251j4033n6867f5857D57770K15244b07684
13274A38939Q8381K56651A9098J99473E9857M46307a61417A79239C0752N7179
13264H7931j4223h612C64072I5381j2974e8243F3068J24134b6279D09047f0823
13252A56269K31699d0658q8583B50313A05467J00386Q4241R5559F9476K04842
13242B74318l1588A21259m1518n14l4119K59488j02791I7116b11477B92951p751
13231B85200b2213A8424J44594J7285J07974e0960C8809J23644h3916k20674h4942
13219a18653H1835N989a72651A185M83287A11138K67933r6495h0853A04210c5922
$$ plain form
13207 -329156 440752 277743 155328 -165702 83864 60446 -35045 -15179 421622 169497
13196 93637 189263 -112546 580592 -85662 -33746 81058 95213 -144652 -43148 -62325 291851
13184 235033 175408 -73233 194731 312135 -62767 21636 15234 242031 332248 332240 345248 258439
13172 258439 -45756 -53557 223932 -315761 55117 -68580 220048 254565 115498 6203 223194
13161 223194 65737 73895 -99233 194800 -34346 112464 242504 92389 486153 -62143 -62182
13150 -62182 169463 -177444 78042 229855 274804 40383 178082 252115 138768 -87728 32189
13138 -32369 289691 187318 217833 291378 220543 -76296 -281117 7416 -40424 -99733 133984
13126 239452 150447 586133 -158235 49197 118809 -78668 95468 153934 197127 -84799 137310
$$ packed form
13207c29156D40752j63009j22415a65702H3864k3418c5045a5179D21622A69497
13196I3637R5626a12546E80592h5662c3746H1058J4155a44652d3148j9177B91851
13184B35033n9625g3233A94731J17404f2767B1636o402K26797R0217qJ3008q6809
13172B58439d5756p801B23932c15761E5117f8580B20048L4517A15498F203K16991
13161B23194F5737Q158i9233A94800c4346A12464J30040I2389L93764f2143l9
13150f2182A69463a77444G8042J51813M4949D0383J37699P4033j13347h7728C2189
13138c2369B89691j02373L0515P3545p0835g6296k04821G416d0424n9309A33984
13126B39452q9005M35686a58235D9197O9612g8668I5468N8466M3193h4799A37310
$$ plain form
13114 -65438 271195 202541 -64345 196403 -144852 -109401 143977 147316 232407 225788 305954
13103 305954 48595 34706 -57299 -107619 -125113 204404 -100978 82543 18455 -230034 262513
13091 -13656 -84640 37672 -287157 -146949 -21932 -187870 153349 -171417 -64382 27570 -51738
13079 -249179 172108 -411933 341520 109918 256364 142187 146122 306101 325854 -42087
13068 188829 302279 168023 10168 281091 -70421 390836 103563 -175790 369409 130577
13057 343543 -86675 98061 357009 160029 -57153 353588 127171 573663 147721 -116807
13046 154973 58398 145039 138529 61040 146877 -5258 3639 373129 -19336 266709 355166 140715
13033 3384 506356 195129 6160 254225 146870 278018 208132 259977 44806 -14016 64055
$$ packed form
13114f5438B71195o8654f4345A96403a44852L5451A43977L339Q5091o619Q0166
13103C05954D8595j3889e7299n0320j7494B04404a00978H2543A8455b30034B62513
13091a3656p0984C7672b87157J40208b1932j65938A53349a71417f4382B7570e1738
13079b49179A72108d11933C41520A09918J46446j14177L935J59979J9753d2087
13068A88829J13450j34256A0168K70923g0421C90836A03563a75790C69409A30577
13057C43543h6675I8061K58948A60029e7153C53588A27171M46492A47721a16807
13046A54973E8398Q6641o510F1040Q5837e258C639L69490a9336B66709Q8457A40715
13033C384N02972A95129F160K48065j07355J31148o9886N1845D4806a4016F4055
$$ plain form
13021 283990 332589 -110702 -47311 42754 69150 388895 -141304 253767 18940 406540
13011 406540 502877 226055 -71695 102248 89386 125713 107869 114438 218986 -28111 296790
12999 185306 -64128 133673 63952 132094 -296423 -252743 192925 141221 244283 248231 230075
12988 230075 117441 -77026 -217438 -71477 266312 132776 -5468 371813 -92102 -39735 6231
12976 51836 -98070 285259 -76197 -193543 -92586 115590 -132847 -182686 -217179 232077 147674
12965 147674 -130445 96915 272189 37618 -162045 357831 136798 -5768 122345 -34848
12954 -203611 363182 43612 144178 371621 193573 91492 79296 89445 287368 -44556
12943 -93113 256032 -30770 -127233 256176 232534 221208 -35505 -283885 149625 629834 267689
$$ packed form
13021B83990M8599a10702d7311D2754K6396L19745a41304B53767A8940L87600
13011D06540R6337B26055g1695A02248j2862L6327j7844O569J04548b8111B96790
12999A85306f4128A33673F3952O8142b96423M3680A92925n1704J03062L948j8156
12988B30075j12634g7026j40412g1477B66312A32776e468C71813i2102c9735F231
12976E1836i8070B85259g6197j17346i2586A15590a32847m9839l4493B32077q4403
12965A47674a30445I6915J75274C7618a62045C57831A36798e768A22345c4848
12954b03611C63182D3612J00566K27443j78048I1492j2196J0149J97923d4556
12943i3113B56032c0770r6463B56176k3642j1326c5505k48380A49625M80209B67689
$$ plain form
12931 39751 69592 -83867 223575 12610 56145 103801 6696 397171 27867 153528 -44611
12919 -84172 189125 201842 192691 442228 -272091 -176666 -26010 398520 40566 219018 231320
12908 231320 121138 -160171 -153397 -162606 121368 65420 201618 3510 178099 184139 302756
12897 302756 -108097 -65129 -150947 -116086 -19006 175924 26940 5727 -55184 75014 109836
12886 109836 62300 -129646 68689 65881 -378571 106017 258692 -80862 -160940 184098 73044
12874 -111497 324679 151295 56508 -70004 -69671 -241539 -106882 207242 -489544 -50144 -54735
12863 -54735 -20232 -170695 220283 -202358 504954 -35380 338822 165962 -147609 187392
12852 241209 34386 203948 -79216 169595 -106957 63972 10818 -205776 8669 -171758 17863
$$ packed form
12931C9751K9841h3867B23575A2610M3535M7656F696L90475B7867J25661d4611
12919h4172A89125J2717r151K49537b72091R5425b6010C98520D0566J78452J2302
12908B31320j10182a60171O774r209A21368n5948J36198C510J74589O040J18617
12897C02756a08097M2968q5818L4861a9006A75924B6940E727e5184G5014L4822
12886A09836m7536a29646F8689k808c78571A06017J52675h0862q0078A84098G3044
12874a11497C24679A51295E6508g0004L33j71868a06882B07242d89544e0144m591
12863e4735b0232j50463B20283b02358E04954c5380C38822A65962a47609A87392
12852B41209C4386J69562g9216A69595a06957F3972A0818b05776H669a71758A7863
$$ plain form
12840 -217326 12050 -2013 70863 365053 -56413 168924 66258 29418 247636 93070 277538
12829 277538 122939 63386 -183439 208958 248857 136837 138949 237203 -191699 -283224 115623
12817 -157851 -71571 -367573 -282923 124945 -177565 173073 -82368 52590 235745 103671
12806 41153 -217784 196504 218464 315954 -11227 7080 -102951 121141 -3679 45774 83440
12795 83440 93902 -47351 61374 24825 264103 144974 -51633 -51839 211625 88001 40026
12783 -23784 -153592 132925 -123704 127690 225042 -90190 -204952 -65752 41013 -5556 212077
12771 114277 51839 84093 436654 56400 -294547 138747 290770 -152682 -13540 10237
12760 205183 255475 50589 102333 -323091 62596 334998 264357 -407509 151987 -167488
$$ packed form
12840b17326A2050b013G0863K94190e6413A68924F6258B9418K18218I3070J84468
12829B77538A22939n9553a83439B08958L9899j12020K112R8254a91699r1525A15623
12817a57851g1571k96002Q4650A24945a77565A73073h2368E2590J83155A03671
12806D1153b17784A96504K1960R7490a1227G080a02951A21141c679D5774L7666
12795H3440J0462d7351F1374B4825K39278j19129e1633k06B11625H8001D0026
12783b3784j29808A32925a23704A27690R7352i0190j14762f5752D1013e556B12077
12771A14277E1839L2254L52561E6400b94547A38747J52023a52682a3540A0237
12760B05183N0292E0589N1744c23091F2596K72402p0641d07509A51987a67488
$$ plain form
12749 -18163 -88121 46884 -48598 193475 -180553 146521 -27405 -74134 -75617 37729 537788
12738 537788 -84000 69451 44650 -77755 80605 318210 39446 47877 70929 -115859 182975
12726 323489 100162 161506 209315 194244 137827 -37660 146909 -144510 131265 -75520 -45772
12715 -45772 138824 -67899 -17455 103013 389512 273171 206785 337247 -124824 -62282
12704 295033 381728 379733 307551 544859 69506 237369 120847 -132846 40611 23455 -60458
12692 207048 186521 -21007 -266725 -15025 12143 236514 95599 -36290 154726 36491 413854
12681 413854 163712 -127842 -42541 98278 349187 115640 44042 88884 157672 219238 -177113
12669 627946 75910 75915 125491 60488 186786 -44629 179055 12071 175081 -11202 -51832 -50784
$$ packed form
12749a8163o9958D6884d8598A93475a80553A46521b7405m6729j483C7729N00059
12738E37788h4000F9451k4801g7755H0605K37605C9446Q431K3052a15859A82975
12726C23489A00162O1344M7809j5071n6417c7660A46909a44510A31265g5520K9748
12715d5772A38824f7899a7455A03013K86499j16341o6386J30462a24824f2282
12704B95033Q6695j995p2182K37308F9506J67863j16522a32846D0611j7156f0458
12692B07048k0527b1007k45718a5025A2143K24371I5599c6290A54726C6491L77363
12681D13854A63712a27842d2541I8278K50909A15640D4042M4842O8788O1566a77113
12669F27946G5910NM9576F0488J26298d4629A79055A2071J63010a1202m0630J048
$$ plain form
12657 -50784 -98279 387330 151552 367794 104783 56926 71864 311615 -173151 102240
12646 15081 198709 384736 363407 -291017 87247 232649 -161870 -248724 113909 397091
12636 397091 11997 335043 113026 108996 270038 158455 352077 316937 475815 367404
12626 367404 298380 263872 119542 526074 16176 110913 -84105 64866 -38942 -320096 -163454
12615 -163454 -43699 433929 220472 28893 33775 121014 -101683 -5023 79243 -184908 276119
12603 114268 57919 -148978 190491 -147585 -169187 132929 -11990 -91598 33979 138011
12593 138011 344328 188655 6299 186242 1972 -29189 328493 411252 -328153 -107898 -174538
12582 -174538 -12367 116242 90549 145947 1039 61565 170738 351070 267249 -84488 -159615
$$ packed form
12657e0784m7495C87330A51552K16242A04783m7857J4938K39751a73151A02240
12646A5081J83628J86027k1329b91017H7247J45402a61870q6854A13909K83182
12636C97091A1997L23046A13026m030J61042j11583J93622l5140J58878j08411
12626C67404o9024l4508A19542M06532A6176R4737h4105F4866c8942k81154J56642
12615a63454d3699D33929k13457B8893M882Q7239a01683e023G9243a84908B76119
12603A14268n6349a48978A90491a47585k1602A32929a1990p9608C3979J04032
12593A38011K06317j55673F299J79943A972b9189C28493Q2759c28153a07898o6640
12582a74538a2367A16242k5693N5398A039O0526J09173J80332q3821h4488p5127
$$ plain form
12571 -159615 265036 124421 78793 -153024 -288761 -55355 -49948 -28138 -46050 -276078 288207
12559 349227 -182126 -150556 -148953 163202 246592 187442 231945 -80596 61413 100986 -211868
12547 58758 84470 137284 40032 -107782 119139 18892 32643 -239183 54721 -11834 93360
12535 -270772 -7380 200496 211506 -30021 113956 55233 -82080 -41970 -93581 -46695 95368
12523 305720 89357 -235460 -141337 -272950 75503 -41208 102403 -51983 132610 220265 -328356
12511 -182864 -389947 114622 -92222 -200648 132727 51901 162092 95493 177293 -268946
12500 174912 -141331 -138584 208822 -121330 -161531 -136447 286789 142625 164077 -6688 29913
12488 294341 300543 270094 -5391 -398102 -108497 228527 10991 -39205 -200824 -15058 313776
$$ packed form
12571a59615B65036A24421m5628a53024j35737e5355N407K1810j7912k30028B88207
12559C49227a82126L1570J603A63202Q3390n9150M4503h0596F1413L9573b11868
12547E8758K5712N2814D0032a07782A19139A8892J3751b39183E4721a1834I3360
12535b70772g380B00496J1010c0021A13956E5233h2080M0110n1611d6695I5368
12523C05720H9357b35460R4123j31613G5503d1208A02403e1983A32610Q7655c28356
12511a82864k07083A14622i2222j08426A32727E1901J10191o6599Q1800b68946
12500A74912a41331K747B08822a21330m0201K5084B86789A42625K1452f688B9913
12488B94341O202l0449e391l92711a08497B28527A0991c9205j61619a5058C13776
$$ plain form
12476 -7295 179192 139983 -112223 87228 -101739 95514 227519 -42583 -138340 -57188 89137
12464 14261 -297416 -122794 93627 -167055 350737 86385 16761 259210 182946 78371 242427
12453 242427 115881 -11032 -34491 -339762 -17986 -197878 137599 89188 34544 188820
12443 188820 -39812 98875 -123824 -236152 130624 402829 -185153 -149560 -523732 71978
12432 348574 -63675 -115509 123198 83758 -94391 155108 -74494 -137264 53609 167140 203432
12421 203432 -327687 -56745 -279645 258990 -165811 60180 222870 -52897 -37545 -236088
12411 -236088 120637 -94313 -48387 -221811 52369 132106 -110815 60732 -39633 289957 -12982
12399 -76498 162384 23783 69166 74845 -116511 368735 147966 110935 47958 -198471 -60404
$$ packed form
12476g295A79192l9209a12223H7228a01739I5514J32005d2583r5757e7188H9137
12464A4261b97416a22794I3627a67055C50737H6385A6761K42449p6264G8371J64056
12453B42427A15881a1032k3459l05271a7986j79892A37599m8411C4544J54276
12443A88820c9812I8875a23824j12328A30624K72205a85153L5593l74172G1978
12432C48574f3675n1834A23198l9440i4391A55108g4494o2770E3609J13531L6292
12421B03432c27687e6745k22900B58990a65811F0180J62690e2897J5352j98543
12411b36088A20637i4313M5926j73424E2369P9737a10815F0732c9633B89957a2982
12399g6498A62384B3783M5383N679a16511C68735A47966l7031D7958a98471f0404
$$ plain form
12387 214095 -36183 -234061 312175 228735 -98584 121262 -139927 -27515 -120622 -254076
12377 -254076 -19657 1267 -56655 -113231 -53097 216680 -23892 33898 62748 -95380 57342
12365 -34555 246111 -18816 79321 46575 -204206 212629 274920 289422 46787 137000 -172179
12353 -13898 35676 112189 -250359 37484 161012 -122125 -51633 -298638 -54004 196273 -25176
12341 62781 41172 15442 -124585 252543 389822 5789 -71163 568189 209851 -55797 209464
12329 177914 92075 -113272 -40457 -116700 22726 106456 138822 173273 67514 213215 -23621
12317 -108590 231998 135727 121531 20525 96675 -169607 -129438 -59065 -82935 -236168 73715
12305 138301 167544 48786 44605 217350 263639 232498 -103277 -86879 -32687 -90193 -484671
$$ packed form
12387B14095c6183j97878C12175q3440i8584A21262a39927b7515r3107j33454
12377b54076a9657A267e6655n6576e3097B16680b3892C3898K8850i5380E7342
12365c4555B46111a8816G9321l2746b04206B12629O2291J4502D6787R0213a72179
12353a3898C5676P6513b50359C7484J23528a22125e1633k47005e4004A96273b5176
12341F2781k1609A5442a24585B52543J37279E789g1163E68189B09851e5797B09464
12329A77914q5839a13272d0457p6243B2726Q3730L2366L4451F7514J45701b3621
12317a08590B31998r6271j4196B0525P6150a69607M0169e9065k3870j53233G3715
12305A38301K9243D8786m181J72745M6289l1141a03277J6398c2687n7506l94478
$$ plain form
12294 -484671 182312 19740 -201084 102795 144294 288230 281341 -153234 13185 465556
12284 465556 4322 109619 -117032 173459 -39290 271473 196805 114692 -236950 239247
12273 88807 161805 435962 -170534 106384 -103313 37413 376640 183460 299640 202317
12263 202317 -91166 36612 756 -74713 92146 178023 160464 -60554 76711 -51559 229825 -220685
12250 160540 155657 89014 -105729 -72719 103238 -163153 137071 -120 298187 -35781 -10992
12238 42272 119391 -10113 176287 87793 406144 202711 155845 -218797 52623 555630 -224993
12226 224603 -52226 381950 239063 256790 237321 297334 9683 171520 226551 -207511 185305
12214 342171 173932 322564 126277 -206061 439760 122383 -39511 334974 355574 267282
$$ packed form
12294d84671A82312A9740b01084A02795M1499J43936o889a53234A3185M52371
12284D65556D322J05297a17032A73459c9290B71473p4668q2113b36950B39247
12273H8807P2998K74157a70534A06384a03313C7413L39227A83460J16180r7323
12263B02317i1166C6612G56g4713I2146Q5877j7559f0554G6711e1559B29825b20685
12250A60540m883o6643a05729L3010A03238a63153A37071a20B98187c5781a0992
12238D2272P7119a0113A76287H7793L18351B02711m6866b18797E2623N03007b24993
12226B24603e2226C81950j42887J7727j9469O0013I683J61837N5031b07511A85305
12214C42171j68239J48632A26277b06061D39760A22383c9511C34974K0600q8292
$$ plain form
12204 267282 421392 89848 164577 434202 332774 101232 73534 332223 337506 268312 100343
12192 15152 203448 103104 53643 17995 184602 -349404 221251 -8642 366743 -18032 -74412
12181 -74412 368083 165612 -31925 250617 -72216 142977 -67614 315422 -8677 19091 467117
12170 467117 -251360 470645 58842 226965 374831 235528 173874 308005 -49657 531230
12159 661 299697 90461 186643 52614 112392 174469 45646 65271 309172 -218245 31296
12147 442502 131164 242982 53962 -166747 15898 -174849 -208707 103462 184723 89364
12136 4769 148048 -220190 206471 -88339 2765 -330517 -48844 112262 94579 32448 182239
12125 182239 -77454 263696 107417 -215863 -245401 387467 -150603 188011 162829 69698
$$ packed form
12204B67282J54110H9848P4729K69625j01428A01232k7698K58689N283o9194A00343
12192A5152J88296j00344m9461A7995J66607c49404B21251h642C66743a8032n6380
12181g4412C68083A65612c1925B50617g2216A42977f7614C15422h677A9091M48026
12170D67117b51360D70645E8842J68123J47866j39303o1654J34131d9657E31230
12159F61K99036I0461R6182E2614N9778O2077D5646J9625K43901b18245C1296
12147D42502A31164J11818E3962a66747A5898a74849l3858A03462Q1261H9364
12136D769J43279b20190B06471h8339B765c30517d8844A12262j7683C2448J49791
12125A82239g7454B63696A07417b15863k9538C87467a50603A88011k5182F9698
$$ plain form
12114 -102101 -151931 -248288 210037 -31975 131574 -211268 158386 -36586 193024 107352
12104 107352 -50887 -28546 -113585 -32749 75051 15900 -118277 120692 316546 -48646 75863
12092 58050 -404897 197357 -121195 -58698 213830 43331 -200313 -42622 -304009 177676
12081 -62246 265054 140284 203735 279373 908070 1558114 825999 373745 -93186 194771
12070 63993 101875 284575 51044 136665 -90266 156607 20110 -269868 65769 198047 -61738
12058 -298352 -170768 -318140 -310092 -79400 39316 -16146 35057 -9646 108237 109004 -65041 -151385
12046 -151385 -25317 -337753 -54592 -276028 49350 -68915 142653 137117 26766 -51197 -95719
12035 -95719 -95161 -61961 37648 -235142 -88414 66716 -60524 -145115 -193971 930 -268053 58225
$$ packed form
12114a02101m9830r6357B10037c1975A31574b11268A58386c6586A93024q5672
12104A07352e0887K2341q5039c2749G5051A5900a18277A20692J95854d8646G5863
12092E8050d04897A97357a21195e8698B13830D3331b00313d2622k61387A77676
12081f2246B65054j24770O3451P5638O28697O50044p32115C73745i3186A94771
12070F3993L7882J82700E1044Q5621i0266A56607B0110b69868F5769J32278f1738
12058b98352J27584j47372Q048g9400C9316a6146C5057i646A08237P67f5041q6344
12046a51385b5317l12436e4592k21436D9350f8915A42653n536B6766e1197m4522
12035i5719N58L3200C7648b35142h8414F6716f0524q4591m8856I30b68053E8225
$$ plain form
12022 49249 -146756 238984 168131 117661 -223447 323418 302401 158534 254596 89618 -384378
12010 398370 107668 -256250 82376 -166582 -162652 -112760 327947 302531 -55778 -30173 -115174
11999 -115174 -61307 -102805 -84422 -119673 4092 -58039 223685 -146417 -33158 56943 -174288
11987 10225 -28649 -90082 11211 -50246 -241347 213689 -95071 75798 -123960 207393 51526
11975 -49021 -61774 2100 -137084 -69102 -162814 -136134 -77444 87889 -220096 105684 16838
11963 -202525 64345 -59705 66493 244367 -128658 -194135 -122413 -190555 -10281 -11013 61028
11951 83143 -31925 52269 5183 -33186 -120198 -66821 43954 -200349 5214 90461 -29101 410041
11938 93760 -59126 -133485 -61755 -79365 -62077 114188 -123180 -102445 -116061 -82493 -164364
$$ packed form
12022D9249a46756B38984p0853n0470b23447C23418k1017j43867R6062H9618c84378
12010C98370A07668b56250H2376a66582L930M9892C27947k5416e5778K5605q5001
11999a15174N3867m1498J8383l5251D092e8039B23685a46417c3158E6943a74288
11987A0225b8649o1433A1211e0246j91101B13689i5071G5798a23960B07393E1526
11975d9021j2753B100a37084O7982r3712K6680N8690H7889b20096A05684A6838
11963b02525F4345e9705F6493J77874a28658o5477P1722o8142a0281p32F1028
11951H3143c1925E2269E183c3186q7012N3377D3954b00349E214Q5247b9101D10041
11938I3760e9126p4359f1755j7610J7288A14188a23180K0735j3616L3568q1871
$$ plain form
11927 -164364 239324 -184412 -169585 95743 -116791 233349 -204017 -188302 7808 -287438
11916 366167 -545232 -22242 -207023 -253103 309022 103588 -30391 -329758 -102826 -24833
11905 -562071 -35754 -186954 -103118 -66388 148359 110540 -396587 415251 89680 -182634
11894 193305 -25983 43214 5993 113940 70259 75116 -199579 -219504 -152553 -256725 304528
11882 292477 -115164 -132584 406198 41842 -122916 -134648 -113653 169305 -131114 -87705
11872 -87705 -82059 195727 -273922 -32076 -176148 -62083 63080 11317 72434 -118727 53635
11860 215318 -56052 -3407 -260886 -364636 308009 72668 -68925 -248550 80524 107102 -328047
11848 151120 107396 52304 -265868 81707 -94283 352907 31766 -175178 2333 362585 -226063
$$ packed form
11927a64364B39324a84412J4827I5743a16791B33349b04017J5715G808b87438
11916C66167e45232b2242j84781m6080C09022A03588c0391k99367a02826b4833
11905e62071c5754j51200Q3836L6730A48359l7819c96587D15251H9680a82634
11894A93305b5983D3214E993J07947m3681M857a99579j9925O6951j04172C04528
11882B92477a15164j7420D06198D1842a22916j1732K0995A69305a31114M3409
11872h7705N646A95727b73922c2076j44072f2083F3080A1317O1117a18727E3635
11860B15318e6052c407k57479j03750C08009G2668f8925j79625H0524K6578c28047
11848A51120m3724E2304b65868H1707i4283C52907C1766a75178B333L60252b26063
$$ plain form
11836 47871 11130 -134351 251496 36240 -195570 76768 -104312 -210177 330750 389860
11826 389860 -836 -167311 -537327 -294962 19252 73858 -20097 -48256 219026 -220818 126782
11814 -127587 -19788 -219006 -159180 321067 -272375 -146001 -44880 -41562 -63157 27664 97719
11803 97719 109655 47198 281722 -187901 -271797 11598 -340610 -330315 -152908 -107886 -120598
11792 -120598 -300674 -166676 231382 178054 88749 288489 101456 -4722 -132601 -83351
11782 -83351 -432035 95955 187910 -242675 145373 -143586 136034 427375 157488 245516
11772 245516 -47986 -200701 78418 -222308 328794 30431 -19113 132083 1663 6777 -301759
11760 -39568 318721 -100759 153612 -50195 82826 31019 -54081 14772 117070 -342883 83636
$$ packed form
11836D7871A1130a34351B51496C6240a95570G6768a04312j05865C30750N9110
11826C89860h36j66475l70016K42365A9252N4606b0097k8159B19026b20818A26782
11814a27587a9788j99218N9826C21067b72375J26374d4880L318k1595B7664P0055
11803I7719J1936D7198K34524a87901q3896A1598c40610J0295a52908M5022j2712
11792a20598j80076J33998B31382n3328H8749J99740A01456d722j27879M9250
11782h3351l48684I5955R1955b42675A45373a43586A36034K91341A57488Q8028
11772B45516d7986j52715G8418b22308C28794C0431a9113A32083A663N114c01759
11760c9568C18721a00759A53612e0195H2826C1019e4081A4772J02298c42883H3636
$$ plain form
11748 -139104 105379 -175560 51664 -176932 4811 -176546 -248634 62262 -340743 239589
11737 40367 11899 -137325 -1752 -167609 -166904 -327980 55084 -183894 -67036 -196315 103245
11725 -1190 -342835 259608 14794 61739 74301 -34105 -44104 26607 -146118 118254 110681
11714 110681 261449 132340 -63107 -107681 134469 283340 -154681 125856 118210 138912
11704 138912 77781 270275 44066 70698 335579 -81875 249512 -58319 86546 -65997 -100912
11693 -100912 -70179 69052 -233356 -223927 191585 349154 57563 -43079 -29778 -79070 156416
11681 231456 -120567 372652 176646 45113 409083 216126 63041 -44626 -91297 -378723
11671 -378723 -2259 186280 277750 -48505 200071 374671 52977 -63805 40741 -21409 -87905
$$ packed form
11748a39104A05379a75560E1664a76932D811a76546p2088F2262c40743B39589
11737D0367A1899a37325a752j65857P05j61076E5084a83894f7036j29279A03245
11725a190l41645B59608A4794M6945J2562c4105r999B6607a46118A18254p573
11714A10681J50768j29109f3107m4574A34469J48871a54681A25856p646K0702
11704A38912o1131J92494D4066K6632K64881h1875B49512e8319H6546f5997l4915
11693a00912L0733F9052b33356R429A91585J57569E7563d3079J3301m9292A56416
11681B31456a20567C72652A76646D5113L63970j92957F3041d4626m6671k87426
11671c78723b259A86280R1470d8505B00071J74600E2977f3805D0741b1409o6496
$$ plain form
11660 -87905 24174 206203 -16672 71285 -146331 -76843 -162934 342323 -23565 -106714 -216165
11649 -216165 -194949 93296 -10211 115772 -129845 108958 136942 -103224 177265 -85194
11638 71338 10641 -240235 -319602 -104799 -59009 45679 -201196 -211200 -4256 -38944 49841
11626 278852 365891 58721 167676 -469785 163205 -200161 -39237 19121 -204340 -501392
11616 -501392 334848 164999 205393 57746 -195782 -164312 359580 174960 -2577 -196374
11606 -196374 157054 381365 -113723 12636 -62616 227802 103813 204463 378604 35111
11595 290599 120326 13934 -78963 241537 115208 43027 319042 209427 86589 177071
11585 177071 101346 197160 415484 -30002 -2389 -266985 81319 -77877 12080 138916 -45346
$$ packed form
11660h7905B4174J82029a6672G1285a46331O9488q6091C42323b3565q3149j09451
11649b16165K1216I3296a0211A15772a29845A08958K7984a03224A77265h5194
11638G1338A0641b40235p9367a04799M5790D5679b01196j0004d256l4688D9841
11626B78852Q7039E8721J08955d69785A63205b00161c9237A9121b04340k97052
11616e01392C34848A64999M0394E7746a95782L1470C59580A74960b577j93797
11606a96374A57054K24311a13723A2636f2616B27802A03813J00650J74141C5111
11595B90599A20326A3934g8963B41537A15208D3027K76015j09615H6589R0482
11585A77071p5725R5814K18324c0002b389k64596H1319g7877A2080J26836d5346
$$ plain form
11573 377192 184190 -173001 127281 293411 -167840 -16586 -1281 -185902 -91730 172025
11562 -45294 54088 -70065 -119745 -171196 163813 147007 4856 160140 -95856 18854 112009
11551 112009 7750 -2154 222104 -182501 -13605 111324 16059 188074 34401 229629 114262
11539 -95215 77037 193871 405949 157230 190836 104888 118557 94167 289212 76168 426166
11528 426166 225046 205809 23282 161807 307898 197842 146082 161731 150244 168189 128902
11517 128902 24246 266184 157508 -218805 137170 306232 536043 -195121 193178 253368
11507 253368 -18451 172886 120491 9121 177876 482329 197618 3018 -178396 -1877 -60182
11496 -60182 26686 -167016 -147998 72747 30288 421460 352039 313530 97045 293062 283326
$$ packed form
11573C77192A84190a73001A27281J66130a67840a6586a281j84621i1730A72025
11562d5294E4088g0065m9680n1451A63813j6806D856J55284i5856A8854R3155
11551A12009G750b154B22104a82501a3605A11324A6059J72015C4401J95228A14262
11539i5215G7037J16834K12078A57230L3606q5948J3669k4390J95045G6168L49998
11528D26166k01120j9237B3282J38525J46091j10056n1760J5649j1487J7945l9287
11517A28902B4246K41938j08676b18805A37170J69062K29811a95121A93178O0190
11507B53368a8451A72886n2395I121J68755L04453A97618C018a78396a877n8305
11496f0182B6686a67016J9018G2747C0288L91172o9421l8509I7045J96017r736
$$ plain form
11485 283326 35977 171917 47069 221403 140141 247479 577211 82486 192986 98868
11475 98868 377500 48755 175726 141535 83103 123410 -4949 193473 -83182 294302 47619
11463 -147616 395476 188368 -427397 355878 191286 157995 234726 101044 125282 296231
11453 296231 -33627 -40928 -245776 241376 385833 268338 -276474 262400 336145 -317153
11442 -106549 -81281 196239 306254 -124504 33195 17760 -19808 164684 -61368 -52603 237647
11430 300092 211031 -10013 141325 589 151731 105089 9466 -24073 -72472 169127 82507
11418 -128460 -212427 330120 155312 6841 52096 15800 -202671 7375 31651 -42952 95631
11406 152937 -107434 -14676 183542 26912 -145014 -14937 -124379 292365 131984 97388
$$ packed form
11485B83326C5977J35940D7069J74334q1262J07338L29732H2486J10500r4118
11475I8868K78632D8755J26971l4191n8432M0307d949A93473h3182B94302D7619
11463a47616C95476A88368d27397C55878j64592l3291P6731A01044K4238J70949
11453B96231c3627p301k04848B41376J44457j17495b76474B62400P3745c17153
11442a06549K5268A96239J10015a24504C3195j5435a9808A64684f1368Q765B37647
11430C00092q9061a0013A41325E89J51142m6642I466b4073m8399A69127H2507
11418a28460q3967C30120A55312F841M5255A5800b02671G375K4276d2952I5631
11406A52937a07434a4676A83542B6912a45014a4937j09442B92365A31984l4596
$$ plain form
11396 97388 -58778 73273 -265916 295106 79858 -132191 -22933 -72650 132538 270675 39676
11384 127163 -116131 143781 -47602 212302 188187 106684 16487 80551 -110225 365068
11373 -175871 -5960 -174820 589926 -55753 -20728 357382 -95722 -60427 167609 -321678 4599
11361 -111074 -247197 -109129 -71064 -133113 -258005 119761 -79057 -588 -55760 -90771 -182027
11350 -182027 -138848 -184377 307560 83477 50060 219477 79864 -102895 -134859 -439355 301039
11338 113344 377406 -158127 -48506 154158 123528 -154447 -118160 205989 194413 114035
11328 114035 18964 23071 184866 99229 -165371 29039 159403 -213095 44016 -55612 -217570
11317 -217570 -21977 -104614 23533 110420 174766 86333 4774 29294 30886 162875 -184290
$$ packed form
11396I7388e8778G3273b65916B95106G9858a32191b2933m9717A32538J38137C9676
11384A27163a16131A43781d7602B12302k4115q1503A6487O4064a10225C65068
11373a75871e960j68860E89926e5753b0728C57382i5722L5295A67609c21678D599
11361a11074j36123a09129L8065o2049j24892A19761g9057e88n5172l5011r1256
11350a82027M3179m5529C07560H3477l3417J69417G9864a02895l1964l04496C01039
11338A13344K64062a58127d8506A54158l0630a54447L6287B05989j1576q0378
11328A14035A8964M107J61795q5637a65371B9039J30364b13095D4016e5612j61958
11317b17570b1977q2637B3533Q6887O4346H6333D774K4520J592J31989a84290
$$ plain form
11305 -8486 -154 -86284 19632 -236504 -107375 89067 93003 -3900 -227459 257627 107389 5791
11292 -4876 -147078 -135422 145763 127178 72904 -154428 -87727 175483 14195 -83039 66276
11280 -47966 -24075 123472 -130513 58781 283215 -21481 -130251 -3948 17868 -102262 -451421
11269 -451421 138562 -79411 -92105 238819 -196743 118354 -317092 162921 -91771 -56737
11259 -56737 -204469 181269 70798 -94324 212753 -62021 -234904 266407 -139961 -165138
11249 -165138 -32523 -224460 -160482 29984 -248713 117110 378288 -20088 200941 -126542
11238 -45354 -12490 -220037 56558 -307357 -152680 -213509 157575 -190693 259584 -109778
11227 -215212 67568 16910 -129652 -278972 -244388 -233748 -288404 -133239 -92070 -104172 38487
$$ packed form
11305h486a54q6130A9632b36504a07375H9067L936c900k23559B57627A07389E791
11292d876j42202J1656A45763j8585n4274a54428O6701A75483A4195h3039F6276
11280d7966K3891A23472a30513E8781K24434b1481j08770c948A7868a02262l49159
11269d51421A38562g9411j2694B38819a96743A18354c17092A62921i1771L5034
11259e6737j47732A81269G0798i4324B12753f2021j72883B66407a39961k5177
11249a65138c2523j91937O3978B9984b48713A17110K61178b0088B00941a26542
11238d5354a2490k07547E6558c07357a52680o0829A57575a90693B59584a09778
11227b15212F7568A6910a29652j49320L4584J0640n4656a33239M1169j2102C8487
$$ plain form
11215 48074 27527 -94193 237628 -257333 -170380 368694 -82947 311380 -38157 17377 -221187
11203 -470370 27251 166225 25112 -321590 -86193 -352260 139073 -311032 -81956 84950
11192 -1138 86463 53784 -160933 165962 -121863 21470 -63362 -65881 195257 -16292 -136126
11181 -136126 -158425 -334591 -203212 56648 -302380 -321401 -35256 -214559 -178225 -131523 -67695
11170 -67695 113226 13686 -225188 -107462 251752 41840 -8636 161459 -162713 -180951 77615
11158 -255106 -137895 -203965 141974 -90744 34423 -44663 -138351 102020 99982 -276023 26916
11146 -121622 70157 40248 -202478 -36743 272974 -272656 71148 -152156 124909 -75015
11135 -223636 -205422 263137 155233 278289 151050 -107933 174009 40964 -53359 82479
$$ packed form
11215D8074k0547i4193B37628b57333Q6953C68694h2947C11380c8157A7377b21187
11203d70370B7251J38974B5112c21590h6193k66067A39073c11032h1956H4950
11192a138H6463l2679a60933A65962a21863B1470f3362k519A95257a6292j19834
11181a36126k2299j76166J31379E6648c02380j9021c5256j79303L6334M6702O3828
11170f7695A13226A3686b25188a07462B51752D1840h636A61459a62713j8238G7615
11158b55106J17211o6070A41974i0744C4423d4663r3688A02020k038b76023B6916
11146a21622G0157k9909b02478c6743B72974b72656G1148a52156A24909g5015
11135b23636J8214B63137j07904J23056j27239a07933A74009D0964e3359H2479
$$ plain form
11124 48394 6828 -83801 -368413 200948 99288 -181754 199295 231692 -83893 -84912 33030
11112 -174095 35781 -21806 491097 157140 155962 -153126 142074 -45738 74503 324180 -297273
11100 123125 -103457 264787 304452 103735 60966 32985 312306 268685 -196992 14820
11089 353315 116514 307006 96300 118578 -93710 127447 306109 143759 418802 469521
11079 469521 381832 716405 -70606 308949 260118 -36572 -77475 465324 434612 -131464 268373
11067 471566 305428 204684 338791 479325 565162 421449 287789 478700 297485 479288
11057 479288 550849 436072 508454 806245 537500 650565 944122 525841 691675 572421
11047 572421 705297 699413 706136 717599 705418 735393 905868 888361 605496 515800 500865
$$ packed form
11124D8394F828h3801k84612B00948I9288a81754A99295L2397h3893j019C3030
11112a74095C5781b1806D91097A57140j178a53126A42074d5738G4503K49677b97273
11100A23125a03457B64787L9665A03735m2769k7981K79321m3621a96992A4820
11089C53315A16514J90492I6300K2278i3710A27447J78662A43759K75043N0719
11079D69521q7689L34573g0606C08949m8831c6572m0903D65324l0712a31464B68373
11067D71566j66138j00744J34107J40534Q5837j43713j33660J90911j81215J81803
11057D79288P1561j14777P2382K97791k68745J13065K93557m18281J65834j19254
11047E72421J32876n884O723J1463j2181K9975J70475j7507k82865q9696j4935
$$ plain form
11036 500865 473096 373806 869023 792479 669515 641812 592811 688665 475047 651284 638586
11025 638586 773432 820055 528985 699357 560933 424534 802646 564874 736273 390456
11015 390456 610555 837278 470188 324061 502364 531985 619822 608225 651884 725094
11005 725094 895646 786507 803720 313817 705005 616691 757655 538919 469261 559990
10995 559990 448563 801004 712140 594282 810914 1002619 575496 1168481 1139714 638381
10985 638381 903156 629515 977513 1089117 1085537 1076242 1118585 1239176 1674805 1470172
10975 1470172 1916714 2038365 2490469 2459814 2532859 2518673 1973314 2267044 2411419 2338154
10965 2338154 1561129 2002821 1608633 1725589 1862544 1853118 1724234 2211261 2309138 2084861
$$ packed form
11036E00865k7769r9290M95217p6544j22964k7703m9001R5854k13618J76237j2698
11025F38586J34846M6623k91070J70372j38424j36399L78112k37772J71399l45817
11015C90456K20099K26723l67090j46127J78303K9621Q7837j1597M3659P3210
11005G25094J70552j09139J7213C13817L91188q8314J40964k18736o9658R0729
10995E59990j11427L52441q8864j17858K16632J91705m27123N92985k8767n01333
10985F38381K64775k73641L47998J11604l580r295M2343J20591M35629k04633
10975A470172M46542J21651M52104l0655P3045j4186n45359K93730J44375p3265
10965B338154p77025M41692l94188J16956J36955r426j28884M87027R7877k24277
$$ plain form
10955 2084861 2102038 1684623 1217612 1539461 982686 870274 559993 574944 625354 452767
10945 452767 597117 109123 468674 225426 533271 360425 75482 269890 126920 -15323
10934 -43390 22301 259102 155479 -122018 94451 -84384 -375590 29147 84590 189135 150077
10923 150077 -107792 199595 122008 66986 157770 -55383 -23451 433655 266418 86486 45286
10912 45286 131615 219424 -49126 -138958 -166727 -36817 117413 47081 -57321 -254380 112380
10900 -85352 157552 -216529 44276 -220668 -86475 184656 183234 -310069 -94550 -71848 216890
10888 59809 395718 154675 83698 -18922 231204 -27576 -146461 45112 -119697 -6765 -181885
10877 -181885 -77028 -18280 -291177 -116427 23278 -55477 -160493 147503 210365 -6057 -68627
$$ packed form
10955B084861J7177m17415m67011L21849n56775j12412l10281J4951N0410j72587
10945D52767J44350A09123L59551B25426L07845j72846G5482J94408A26920a5323
10934d3390B2301K36801j03623a22018I4451h4384k91206B9147N5443J04545l9058
10923A50077a07792A99595p7587n5022R0784e5383b3451D33655j67237H6486m1200
10912D5286Q6329Q7809d9126q9832k7769c6817A17413D7081e7321j97059A12380
10900h5352A57552b16529D4276b20668h6475A84656j422c10069i4550K2702B16890
10888E9809L35909A54675p0977a8922B31204b7576j18885D5112a19697f765j75120
10877a81885g7028a8280k72897a16427B3278e5477j05016A47503O2862f057o2570
$$ plain form
10866 -68627 101538 -248718 -263631 -12236 123688 132734 90444 -5470 132378 -245845 44417
10854 -300010 -259038 3096 162920 -3270 -79725 -83786 78383 -170546 77347 11363 -247277
10842 -55378 44661 24005 -183275 -171555 -173587 -273652 81711 254517 133394 -170033 274836
10830 -149699 -80469 -130755 -225391 -26617 103269 -51724 60635 -412398 -6117 1618 -18143
10818 -285419 225882 188094 -199984 -286463 -29604 135740 -60025 -63856 53322 106718 44140
10806 41026 -341334 -55049 218664 -150426 48821 -414951 -184984 -235963 -73113 -330819
10796 -330819 92952 -34143 -113640 -56956 -219176 241981 253109 114605 -495139 225984
10785 -149952 -244760 151102 -60516 -146202 25135 -91052 121282 -128490 141548 -186677
$$ packed form
10866f8627A01538b48718j4913a2236A23688R046m2290e470A32378b45845D4417
10854c00010M0972C096J59824c270p6455m061G8383a70546G7347A1363b47277
10842e5378D4661k0656a83275J1720k032j00065H1711J72806j21123a70033B74836
10830a49699O9230n0286r4636b6617A03269e1724F0635d12398f117A618a8143
10818b85419B25882l7788a99984q6479b9604A35740f0025l831E3322N3396D4140
10806D1026c41334e5049B18664a50426D8821d14951a84984n0979g3113k57706
10796c30819I2952c4143p9497N6684j62220B41981J1128A14605d95139B25984
10785a49952r4808A51102f0516q5686B5135i1052A21282a28490A41548a86677
$$ plain form
10774 -56296 109275 42227 116845 216558 213159 -316096 75663 -605297 104535 482050 -212568
10762 -84298 69658 31440 -69998 -233389 -190959 -71598 63665 -41567 -244609 -17800 -149893
10751 -149893 -133604 40531 -153588 49709 161344 -63096 -96474 -72760 86837 -63045 -190987
10740 -190987 252675 -101312 245742 161566 111846 150717 256001 25541 259736 123446
10729 209855 -87187 88259 -92016 113278 -113498 -401329 182488 -211470 -320170 -42671
10718 -84785 15583 79215 -60037 125788 -244726 36802 195563 33255 -66655 73203 331607
10707 331607 -69301 -94098 -52828 -43312 -336228 -320684 131446 67415 186429 -194008 31957
10695 -135863 -87538 -227005 157749 -139896 -22042 -182626 31394 -61308 -96917 134030
$$ packed form
10774e6296A09275D2227P4618R9713l399c16096G5663f05297A04535L77515b12568
10762h4298F9658C1440f9998j63391M2430g1598F3665d1567k03042a7800j32093
10751a49893J6289D0531a53588D9709J11635f3096l3378K3714H6837f3045j27942
10740a90987B52675a01312B45742q4176m9720L8871J05284B5541K34195A23446
10729B09855h7187H8259i2016A13278a13498k87831A82488b11470j08700d2671
10718h4785A5583O3632f0037A25788b44726C6802J58761C3255f6655G3203K58404
10707C31607f9301k4797M1270R516k92916J5544A31446o4031J19014a94008C1957
10695a35863M8325j39467A57749a39896b2042j60584C1394f1308l5609A34030
$$ plain form
10684 -108001 -71537 -55498 294012 -343018 -31188 -39538 -143872 180421 89644 -401028 -160642
10672 36342 7918 -245200 -107365 -67941 -83621 -17261 36627 -156756 -68122 -363210 -118350
10660 106628 -117105 103709 -17637 -158379 -245894 -99505 -72760 -358029 41505 284873
10650 284873 39204 -155699 102822 154952 295900 47397 -88235 42771 -317648 -3184 -37234
10639 -37234 -40750 -203362 5578 170418 -143656 -6652 2080 -365543 -153116 64210 79330
10628 79330 65690 -29899 -60188 -227336 48103 -46861 82062 -215802 -32173 -90678 161648
10616 98669 -61626 -386124 2132 -188457 161102 -266673 -213654 -58210 233233 43359 -68136
10604 -27424 336316 -111638 -472216 237204 -128524 11874 -380040 -14212 1082 -72686 -63987
$$ packed form
10684a08001L6464J6039B94012c43018c1188q350j04334A80421H9644d01028a60642
10672C6342G918b45200a07365L9424j5680a7261C6627a56756f8122k95088a18350
10660A06628a17105A03709a7637j40742q7515i9505K6745k85269D1505K43368
10650B84873C9204a55699A02822N2130J40948D7397h8235D2771c17648c184l4050
10639c7234l516j62612E578J64840a43656f652B080c65543a53116F4210J5120
10628G9330j3640b9899l0289j67148D8103d6861H2062b15802c2173n8505A61648
10616I8669f1626l24498B132a88457A61102b66673N3019e8210B33233D3359f8136
10604b7424C36316a11638l60578B37204a28524A1874c80040a4212A082g2686Q699
$$ plain form
10593 -63987 -65034 -134202 -57733 -6788 -40172 -28310 -52740 -157271 -206122 -269874 190365 78841
10580 -225212 -188430 -111000 -46959 174509 10973 109790 239119 -305403 376265 -150910
10569 -251873 -383533 89890 435745 -228589 -138545 -6516 283619 44313 170189 -356492
10558 -93161 -155894 -75170 21134 -75213 -397783 7338 -263704 -305888 -275194 152057 -31941
10546 -191521 162836 -309416 67589 97772 -221239 -293771 -309716 -190558 -17536 95742 -217566
10534 261547 -28687 168908 -169062 118239 -156115 -437724 133362 37628 -17404 -173706
10524 -173706 212623 134331 -264737 -287218 -2350 -158727 80802 -120712 -147685 -221844 -202499
10513 -202499 -46549 125498 -232505 -32343 -86143 33094 -175011 -16452 -111394 -172417 -261054
$$ packed form
10593f3987j047o9168e7733f788l3384J1862k4430j04531m8851o3752A90365G8841
10580b25212L6782P7430d6959A74509A0973R8817J29329c05403C76265a50910
10569b51873j31660H9890L45855b28589R0044f516B83619D4313J25876c56492
10558i3161o2733g5170B1134g5213l22570G338b63704m2184L0694A52057c1941
10546a91521A62836c09416F7589L0183b21239p2532j5945J19158a7536I5742b17566
10534B61547b8687A68908a69062A18239a56115k81609A33362C7628a7404j56302
10524a73706B12623p8292b64737k2481b350j56377H0802a20712k6973p4159J9345
10513b02499d6549A25498b32505c2343n3800C3094a75011a6452r4942o1023q8637
$$ plain form
10502 -261054 -143038 -194502 -71122 -105531 -169998 -156518 -199909 -182816 -71418 -199329 163359
10490 -491513 -360225 -33385 147380 66076 27404 290330 524128 228316 -46624 91825
10479 462546 181632 8940 389384 -356001 387550 95157 146900 3445 257199 140506 -512031
10467 295850 -283662 110978 -394158 124785 -1995 -45189 -79776 112101 -538054 37652
10456 -310402 -23663 167188 139993 433068 -252491 143704 -341985 -163161 86223 -78792
10445 -168325 -87029 181082 99589 -158621 -124575 74979 -24423 -119365 -75194 -305854 13901
10433 360331 36748 274369 -33973 10877 153575 -184058 -143070 -92563 107137 -178318
10422 22352 -115857 -49017 68721 -138898 82379 35665 31962 -159953 -36125 -190438 -110597
$$ packed form
10502b61054J18016n1464g1122l4409o4467J3480m3391J7093g1418j27911A63359
10490d91513J31288c3385A47380F6076B7404K62926K33798B28316d6624I1825
10479D62546A81632H940L80444c56001C87550I5157N1743C445K53754j16693e12031
10467B95850b83662A10978c94158A24785a995m3194l4587A12101e38054C7652
10456c10402b3663A67188k7195K93075b52491A43704c41985a63161H6223g8792
10445a68325Q1296A81082q1493a58621L4046G4979b4423r4942M4171k30660A3901
10433C60331C6748K37621c3973A0877J42698a84058M0988N0507A07137a78318
10422B2352a15857d9017F8721a38898H2379C5665l703a59953c6125j54313P9841
$$ plain form
10411 -110597 -238939 -347009 -275468 -173743 199338 -382371 112585 35755 -47801 -276794
10401 -276794 104176 -5258 -111509 130638 -103149 269684 86973 5773 -20197 204714 15420
10389 -59160 -36512 155480 117848 -70808 142612 80250 192310 313593 83032 -129554 44582
10377 424367 354728 336983 322367 -83148 -21315 282073 277424 257023 -79544 331068 252936
10366 252936 349033 335272 504687 -30568 -62080 47155 -32184 251983 125301 280420 368068
10355 368068 322246 -31581 588300 282165 248200 525106 414186 239298 269422 686498
10345 686498 -26701 114235 473616 -34574 323322 -5125 501291 -10087 95714 116112 136155
10334 136155 55994 27667 -6044 73875 -164534 357858 44424 113769 318250 -5708 159113
$$ packed form
10411a10597j28342j08070P1541J01725A99338c82371A12585C5755d7801k28993
10401b76794A04176e258j06251A30638a03149B69684H6973E773b0197B04714A5420
10389e9160K2648A55480l7632g0808A42612o2362J12060J21283H3032a29554D4582
10377D24367o9639j7745j4616h3148b1315B82073m649k0401g9544C31068p8132
10366B52936R6097j3761J69415c0568l1512D7155c2184B51983A25301J55119Q7648
10355C68068m5822c1581E88300B82165l3965K76906j10920j74888L0124M17076
10345F86498b6701A14235L59381c4574C23322e125E01291a0087I5714K0398K0043
10334A36155E5994B7667f044G3875a64534C57858D4424O9345K04481e708A59113
$$ plain form
10322 296696 129547 304261 -43643 621651 87620 -27067 -3211 75939 283774 225745 266577
10311 266577 -221553 17496 -202448 129235 8021 142552 102236 106863 29029 -181519 -53858
10299 -168139 291538 37821 64914 -59339 -140356 -178404 -229666 -208511 -275442 -202788 10 -147366
10286 -10272 205224 -291420 -122420 -16100 -113236 -93362 135586 77908 -117515 212354
10275 37813 121948 -317312 -131412 -269636 98359 -191568 283462 487907 -131504 107151
10264 -51544 95365 69069 160977 263198 644841 499933 217264 269041 492883 569835 -217211
10252 -3747 -43925 145509 188355 -207185 -182941 -18409 16102 -70100 80620 -242723 29636
10240 -221246 -215060 222106 57145 -254011 -216038 -76706 126625 -424929 -135397 -12657 -256129
$$ packed form
10322B96696A29547J74714d3643F21651H7620b7067c211G5939K07835n8029M0832
10311B66577b21553A7496b02448A29235H021J34531m0316M627B9029a81519e3858
10299a68139B91538C7821K7093e9339q1017l8048n1262K1155o6931P2654A0a47366
10286a0272B05224b91420a22420a6100r7136J9874A35586n7678a17515B12354
10275C7813Q4135c17312a31412j38224I8359a91568B83462K04445a31504A07151
10264e1544I5365k6296R1908J02221L81643j44908B17264N1777K23842P6952b17211
10252c747m0178A45509M2846b07185K4244a8409A6102g0100H0620b42723B9636
10240b21246O186B22106E7145b54011L7973g6706A26625d24929a35397a2657k43472
$$ plain form
10229 -256129 -359940 14994 -79645 -90015 132364 -295289 42538 65337 -164784 -295146
10219 -295146 58977 -194333 -284928 30211 166707 -73278 4029 165643 -110581 349762 204049
10208 204049 373453 163153 26307 57243 -9017 -97839 52267 319402 84223 177321 38686
10196 -94835 -90719 1201 31854 -170131 -122209 60359 -215201 -58695 47603 -21385 -183375
10185 -183375 -122266 -169616 -398005 -338713 201614 -262267 -67055 -351105 -137400 -36002
10174 -117573 30576 6210 83926 173944 -219265 -156640 44016 -215202 98719 1012 -28937
10162 -125815 250683 48859 -227968 125292 130828 296368 -94033 -30059 272005 -58148 95616
10150 -206145 -399031 -587597 -221961 -103016 -2469 -249111 64692 3203 94098 -45169 4120
$$ packed form
10229b56129j03811A4994g9645j0370A32364b95289D2538K2799a64784j30362
10219b95146E8977a94333r0595C0211J36496g3278D029J61614a10581C49762j45713
10208B04049J69404A63153B6307L0936i017q8822E2267K67135H4223R3098C8686
10196i4835M116A201L0653a70131M7922F0359b15201e8695D7603b1385j61990
10185a83375O1109m7350k28389N9292B01614b62267f7055k84050a37400c6002
10174a17573C0576F210P7716R0018b19265O2625D4016b15202I8719A012b8937
10162a25815B50683D8859b27968A25292N536J65540i4033c0059B72005e8148I5616
10150b06145j92886j88566b21961a03016b469k46642F4692C203R0895d5169D120
$$ plain form
10138 -176761 -82000 178757 -272481 -164946 180214 -83651 -36576 132185 -55822 -3738 -165766
10127 -165766 -24034 -98012 -66546 -120920 -140883 -75542 -471873 36405 44575 -227352 -131198
10116 -131198 -90637 -108227 -188044 173197 -121183 -45055 62385 -147500 -341365 25271 -454019
10104 -48659 -34275 -2596 429304 -225808 99470 4731 145439 55843 -5465 56120 15062 -171732
10091 392185 -274059 -142786 -104177 15511 56746 78751 138652 -223468 122500 -218492
10080 68771 -414027 -90443 -84390 7069 -318041 -54291 -132369 -661 70219 -74837 -285339 -204432
10068 -204432 -17033 5651 88234 -31141 -231206 200301 -20215 -230075 80039 77087 -150551
10056 -415601 -201027 -37602 50426 68400 -79905 -445177 288390 180925 -223320 -226344 28776
$$ packed form
10138a76761h2000A78757b72481J07535A80214h3651c6576A32185e5822c738j62028
10127a65766b4034p3978L1466n4374j9963O5341l96331C6405Q170b27352R6154
10116a31198M0561j7590p9817A73197a21183d5055F2385a47500j93865B5271d54019
10104d8659J4384b596D29304b25808I9470D731J40708E5843e465E6120A5062a71732
10091C92185b74059J31273L8609A5511M1235K2005N9901b23468A22500b18492
10080F8771d14027i0443O053G069c18041e4291p8078f61G0219g4837k10502Q0907
10068b04432a7033E651Q2583c1141k00065B00301b0215k09860H0039k952a50551
10056d15601b01027c7602E0426J7974g9905l65272B88390j07465b23320l024B8776
$$ plain form
10044 13887 -78390 -70576 55242 -160401 116349 32814 62304 -87446 48756 -14156 -147742
10033 -147742 -179883 -107945 82317 -238939 100510 -371954 -221833 111782 -49119 21285
10022 9851 50115 -321575 -145864 -158595 -86992 -195830 117551 -167669 18724 -389604 -138622
10010 -29947 -205288 -46365 -165203 -230961 -135863 84634 -394283 -207347 -297230 -42055 183664
9998 -191943 -122667 251074 131311 -263238 -379337 -303503 -165615 -319967 84461 24813
9987 -152858 2892 -193465 -210991 -468996 152347 98058 -110723 -247962 -298770 169314 -22942
9975 -167287 -436184 162287 -26475 -171209 -308874 -146503 342707 -74724 376934 187802
9964 -157714 -180931 -95683 141195 -235060 -135672 -217053 -1886 -209706 137505 275345 -29679
$$ packed form
10044A3887g8390P814E5242a60401A16349C2814K9490h7446D8756a4156j33586
10033a47742l2141P1938H2317b38939A00510c71954J50121A11782d9119B1285
10022I851M0264c21575a45864j2731P1603j08838A17551a67669A8724c89604a38622
10010b9947j75341d6365j18838o5758R5098H4634c94283J86936q9883d2055A83664
9998a91943O9276B51074j19763b63238j16099P5834J37888j54352H4461B4813
9987a52858B892a93465j7526k58005A52347n4289a10723j37239n0808A69314b2942
9975a67287k68897A62287b6475j44734j37665a46503C42707g4724C76934A87802
9964a57714k3217Q5248A41195b35060R9388q1381a886k07820A37505J37840b9679
$$ plain form
9952 -14193 -179183 -54843 -100758 -16239 91511 86352 -51222 -167730 210652 -537009 -289685
9941 -289685 99262 -191951 99844 41103 -357285 37003 -53235 101637 -326538 45194 189493
9930 189493 252244 90884 295117 80241 -84530 268651 -192464 141899 -61370 -56715 -16030
9918 -63475 -47484 -123694 -16401 -74753 87971 -179391 -274931 360947 142518 139632 94038
9907 94038 56926 -230 -194431 286571 45257 -30197 53568 -143184 195192 -83620 -98267
9896 -98267 139822 160051 116299 30521 -251942 78172 -173632 -50513 92515 -337411 -8126
9884 118403 3783 491113 -213310 -134617 -377097 169210 -32968 -179676 -37255 8156 -106885
9872 66242 -185041 41199 -273762 36974 -93635 89760 -9971 253399 50053 -277893 71581
$$ packed form
9952a4193j64990e4843m5915a6239I1511n159e1222j16508B10652e37009K47324
9941b89685I9262a91951I9844D1103c57285C7003e3235A01637c26538D5194J44299
9930A89493O2751I0884K04233H0241h4530B68651a92464A41899f1370M655a6030
9918f3475J5991p6210a6401n8352H7971a79391r5540C60947A42518k886m5594
9907I4038l7112b30j94201B86571D5257c0197E3568a43184A95192h3620j4647
9896i8267A39822K0229m3752C0521b51942G8172a73632e0513I2515c37411h126
9884A18403C783M87330b13310P8693k42480A69210c2968j46708c7255H156a06885
9872F6242a85041D1199b73762C6974i3635H9760i971B53399E0053b77893G1581
$$ plain form
9860 -101631 -169264 149639 -11171 -165388 -171180 -224423 -268193 -245801 50374 -128243 -79443
9849 -79443 59107 -367090 -73433 -233645 -326470 -162349 -112430 202372 -179254 -129797 -36446
9837 -172742 -150426 -49718 47319 -12357 -280354 -409380 3717 185131 -4429 201628 121731
9826 121731 268524 159127 -251243 -15677 -19274 -14270 -16579 -251348 -13210 -95242 293798
9814 -290235 -27244 241098 -228598 -53696 281091 -72996 11761 -5634 158178 -73492 -274850
9803 -274850 -240144 -187495 10933 243638 -45041 -385971 17763 -249387 -149414 -9991 34700
9791 -406146 70663 -168250 -242318 -369646 143254 252874 -346958 189135 -27462 -166088
9781 -166088 -147611 -87450 -82393 106643 343524 183611 -217426 -104250 44699 -393358 -92379
$$ packed form
9860a01631o7633A49639a1171j54217n792n3243m3770K2392E0374a28243M8800
9849g9443E9107c67090g3433j60212r2825a62349M9919B02372a79254M9457c6446
9837a72742K2316d9718D7319a2357k67997j29026C717J81414d429B01628p9897
9826A21731J46793j09397b51243a5677l597N004k309k34769a3210q2032B93798
9814b90235b7244B41098b28598e3696B81091g2996A1761e634A58178g3492k01358
9803b74850L4706N2649A0933K32705d5041l40930A7763b49387R9973i991C4700
9791d06146G0663a68250p4068j27328A43254J09620c46958A89135b7462j38626
9781a66088J8477O0161N057A06643K36881j59913b17426a04250D4699c93358i2379
$$ plain form
9769 89092 -204428 -365114 -240860 -260004 61456 -61061 -130815 -239917 362675 -50493 -190220
9758 -190220 -180267 -51160 -114733 -317885 -183168 -243757 -149380 -299595 -86380 -71594 80669
9746 -291045 -39603 8674 -194102 -116230 -135390 79934 -177370 -199440 -282927 -219038 -391271
9735 -391271 -99713 -266263 -26240 -50112 -10139 -58271 -114819 -332146 -57462 -98507 -64763
9724 -64763 -156577 -531679 153708 -125530 254938 -98354 27925 76729 138738 25496 -203767
9712 -230178 -36410 32995 -58930 190313 -55799 40083 101603 29203 86260 -157416 120452
9700 13257 -233583 159976 -41046 -22947 -16610 -28900 276958 52023 -234574 -151328 -22775
9688 -149169 -300600 -83965 -188919 -193654 43362 -6413 -94772 -64967 65968 -265958 168388
$$ packed form
9769H9092b04428j60686J24254j9144F1456f1061o9754j09102C62675e0493j39727
9758a90220R953e1160o3573k03152J34717o0589R4377j50215h6380J4786H0669
9746b91045c9603H674a94102P7872j9160G9934a77370k2070q3487O3889j72233
9735c91271i9713j66550b6240k3872a0139m8132n6548k17327e7462m1045L3744
9724f4763r1814l75102A53708a25530B54938i8354B7925M8804O2009B5496b03767
9712b30178c6410C2995e8930A90313e5799D0083O1520B9203N7057a57416A20452
9700A3257b33583A59976d1046J8099O337j2290B76958E2023b34574Q3246b2775
9688a49169j51431h3965j04954m735D3362f413q8359K9805F5968b65958A68388
$$ plain form
9676 4397 -261419 -147869 -197667 -106687 -111093 -122982 -38125 96129 -257369 -415605 123731
9664 -139247 -175165 -51518 100059 -385584 287951 -63678 -85893 378300 -90748 -105660 7640
9652 -138875 38661 -88974 41541 34507 122557 125826 9716 255252 265575 30662 -269436 -412891
9640 -412891 -138841 48856 -96205 -100063 -275274 -62697 296986 -326138 -291745 111227 -30180
9628 -441027 -109135 16849 -120684 -242412 -107610 -224382 176240 145241 53040 -280514
9617 -3803 -408261 -237631 -67043 21090 -35328 -46929 -8441 211884 17536 -56174 -270601
9606 -270601 -71996 -183701 -36152 -61372 3721 -175491 170720 154352 31587 -188451 99495
9594 -114279 -227952 -138013 -39700 -344838 -78360 -301223 159324 -127209 66374 -88022 -4094
$$ packed form
9676D397b61419J13550m9798R0980m406j1889c8125I6129b57369j58236A23731
9664a39247l5918e1518A00059c85584B87951f3678k2215C78300i0748j4912G640
9652a38875C8661h8974D1541p034Q8050L269I716K45536J0323C0662b69436j43455
9640d12891a38841D8856i6205l858j75211f2697B96986c26138L4393A11227c0180
9628d41027a09135A6849a20684j21728a07610j16772A76240l0999E3040b80514
9617c803m04458J70630f7043B1090c5328j1601h441B11884A7536e6174k14427
9606b70601g1996j11705c6152k5220C721a75491A70720j6368C1587a88451I9495
9594a14279j13673Q9939c9700l05138g8360k22863A59324a27209F6374h8022d094
$$ plain form
9582 272193 -125475 -316162 -21317 126316 -89575 -460808 -222679 184562 125543 -421115
9571 -131292 -315529 -116473 60369 -402032 -85512 -169569 -5646 180085 18568 -108254 -11506
9559 -368037 -153209 175765 76400 -6988 -147005 -76381 141278 85362 268223 -108329 -143154
9548 -143154 115002 -295089 -11054 165190 23486 -74893 -371371 -143299 -137839 323902 -173999
9536 -180298 -150381 -2482 10000 -295614 -161929 -31558 110418 -64749 -536385 134274 50760
9524 41705 -295565 -175872 -265536 100639 -78899 -205585 -176268 -91800 -217020 -289262 -259581
9513 -259581 -63222 -201013 -307380 -73514 23595 74238 -163601 -50601 -83192 -543536 56533
9501 -228101 186889 -283011 -103244 -146165 214891 -79453 -80682 19706 66745 -66130 28659
$$ packed form
9582B72193a25475j90687b1317A26316h9575l71233b22679A84562n9019d21115
9571a31292j84237a16473F0369d02032h5512q4057e646A80085A8568a08254a1506
9559c68037a53209A75765G6400f988j40017P0624A41278n5916J82861a08329l4825
9548a43154A15002b95089a1054A65190B3486g4893k96478a43299N460C23902a73999
9536a80298K9917b482A0000b95614J33685c1558A10418f4749m71636A34274E0760
9524D1705b95565J19693q9664A00639g8899j26686K9317Q4468j25220p2242K9681
9513b59581f3222j37791j06367g3514B3595N0643a63601e0601l2591m60344E6533
9501b28101A86889b83011a03244m2921B14891g9453j229A9706M7039f6130B8659
$$ plain form
9489 215763 -55240 -96434 -142708 137701 -206408 27489 -132220 -321462 226022 223316 -101970
9477 358839 222932 -127959 -217723 294333 91648 260378 340173 163872 228781 -234238
9466 -11752 -418493 -27259 -16058 169711 -247686 -69357 -94770 212824 -152186 -85005 246219
9454 -142149 86708 -184306 -82131 -114385 -211226 -106522 -28569 -284790 -339473 77721 -101042
9442 -362834 -83809 213402 -126863 -74795 -180985 -21644 -100189 -134697 -331717 229845 -148764
9430 86448 -452425 -207360 -6305 -89546 10310 48236 -220788 231521 19902 128128 36370
9418 -72930 -65346 69614 94234 -112029 232327 242725 -127562 35807 -289558 190798 -39267
9406 -365695 -187911 170112 -132173 -81221 54944 -141250 141351 -206925 -45505 235586
$$ packed form
9489B15763e5240m1194m6274A37701b06408B7489a32220j89242B26022k706a01970
9477C58839j35907a27959q9764B94333I1648J68730P9795A63872O4909b34238
9466a1752m06741b7259J1201A69711b47686f9357k5413B12824a52186O7181B46219
9454a42149H6708a84306h2131l2254r6841J04704b8569k56221n4683G7721a01042
9442c62834h3809B13402a26863N2068j06190b1644p8545l4508j97020B29845a48764
9430H6448d52425b07360f305q3241A0310L7926b20788B31521A9902J08226C6370
9418g2930P584F9614K4620a12029B32327J0398a27562C5807b89558A90798c9267
9406c65695J77784A70112a32173N0952E4944a41250A41351b06925d5505B35586
$$ plain form
9395 -56046 455565 36268 205153 -187223 60230 -48098 -127876 -81801 -53735 -69630 -117515
9384 -117515 -63905 -113085 -38409 14859 -336243 20471 43162 -60629 -37307 100374 -32620
9372 184179 -574079 -301337 -85707 -99934 145416 -42326 -205053 -344940 -121001 -187035
9362 -187035 -92661 -176369 -182882 -64898 -147206 15017 -78985 -214891 -216160 -207844 50675 -354185
9349 -384016 -200995 -281274 63919 12665 69661 13381 -146380 -149463 -2327 93543 -8534 -80197
9337 -80197 -17625 280889 -123999 -351815 137193 -149944 -364676 24632 45133 -137876
9326 177881 -169435 -156004 225588 -221087 -19449 -392227 -55896 -38208 -53828 -158454 -177002
9315 -177002 -197239 -376793 -52921 -193929 -69056 -266761 -321138 -59280 -24373 -99559 -114065
$$ packed form
9395e6046D55565C6268J68885a87223F0230d8098p9778M6075K8066j5895m7885
9384a17515N3610m9180c8409A4859c36243B0471K2691f0629K3322A00374c2620
9372A84179e74079K72742h5707j4227A45416d2326j62727j39887a21001o6034
9362a87035i2661q3708o513f4898q2308A5017g8985j35906j269Q316E0675c54185
9349c84016J83021q0279F3919A2665N6996A3381a46380l083b327I3543h534p1663
9337h0197a7625B80889a23999k27816A37193a49944k14732B4632K0501a37876
9326A77881a69435J3431B25588b21087a9449l72778e5896J7688j5620j04626j8548
9315a77002k0237j79554e2921j41008f9056j97705n4377e9280b4373p5186j4506
$$ plain form
9304 -114065 -194527 153225 -512004 -384456 48498 -36978 -125737 -221630 -83753 -47715 7425
9292 -219470 31442 3811 -266444 8872 49961 -160162 33808 36510 -94193 -268132 -153286
9281 -153286 -77570 -100175 186231 -251751 159701 15108 10054 -194966 59965 133848 155610
9270 155610 -441324 385507 -20536 -99534 -163460 54785 -169611 -299235 -491456 114984
9259 -184968 21643 4015 -40939 -167180 -108928 139515 123602 -33923 119676 247869 -471468
9247 -214778 -96806 -101404 -202748 -203227 -109100 -9499 -236507 55953 90925 -117687 -245391 10376
9234 -73415 169738 34152 107497 -179825 139728 -99567 34933 135761 91661 -298000 -104941
9222 -306833 -112511 -78093 -125969 -318403 -10777 -95271 -6757 160401 -302774 45981 -140963
$$ packed form
9304a14065q0462A53225e12004J27548D8498c6978q8759r5893h3753L6038G425
9292b19470C1442C811b66444H872M1089a60162C3808K702i4193j73939J14846
9281a53286P5716k2605A86231b51751A59701A5108n054a94966E9965P3883K1762
9270A55610d41324C85507b0536p8998o3926E4785a69611j29624j92221A14984
9259a84968B1643D015d0939j26241N8252A39515j5913c3923A19676J28193d71468
9247b14778i6806m598j01344m79R4127i499k27008E5953L4972a17687j27704A0376
9234g3415A69738C4152P3345a79825A39728i9567C4933J00828m4100b98000a04941
9222c06833a12511L4418m7876j92434a0777q4494f757A60401c02774D5981a40963
$$ plain form
9210 -160496 -15549 -105443 -184754 -336329 -199701 -83548 -4929 -102624 -145439 86644 25728
9198 185616 -122264 -190093 -95543 -114905 -152563 79889 188013 264989 -120508 105383 24299
9186 -155850 -220438 49987 -93821 169210 -139439 -107116 -147014 -66116 130749 -88331 70103
9174 159381 -191230 158341 258711 -204986 -113274 -53032 -88107 -84237 29242 160941 295721
9163 295721 39116 -119191 151905 270348 34859 -169932 260098 -19233 69891 -119831
9152 -176827 166422 -30735 -185011 -33532 -77579 93166 -203110 -132022 66035 -141285 -307777
9141 -307777 17285 11907 -73968 -86634 64756 93838 -81272 309195 -240055 101109 62271
9130 62271 86028 36156 185975 -252799 -82045 251040 183396 -180342 215053 102338 206645
$$ packed form
9210a60496a5549q9894p9311j51575J36628h3548d929r7695m2815H6644B5728
9198A85616a22264o7829R4550j9362l7658G9889J08124P6976a20508A05383B4299
9186a55850o4588D9987i3821A69210a39439L2323l9898f6116A30749h8331G0103
9174A59381a91230A58341J00370b04986R1712e3032l5075L870B9242J31699J34780
9163B95721C9116a19191A51905J18443C4859a69932B60098a9233F9891a19831
9152a76827A66422c0735j54276c3532m4047I3166b03110P1088F6035a41285j66492
9141c07777A7285n378g3968j2666F4756K9082h1272C09195b40055A01109l8838
9130F2271K3757C6156J49819b52799h2045B51040o7644a80342B15053A02338J04307
$$ plain form
9119 206645 -18918 -215536 91349 -294195 -222533 59412 -254303 59089 -104560 217504 87771
9107 30239 125543 -240491 -117832 -360674 199259 189271 66272 -131981 212617 293092 94982
9095 -161544 38005 89808 -169338 223040 -1613 221136 121432 -110622 -41863 87273 97969
9084 97969 57751 -264431 -218551 -301878 33267 -61379 127090 -14085 344388 -90208 154153
9072 14235 64265 -248160 -266879 -4980 -51461 95541 -114015 -39898 -363628 70927 -403141
9060 -203726 -322387 -184248 160415 47834 63975 -117292 -69326 101872 -83582 74019 83480
9049 83480 -216036 77632 -72301 227190 224631 55295 -117121 60748 222263 -44404 -78874
9038 -78874 -556916 -143233 -150106 -167389 103827 -249330 -18435 70560 -68750 -90606 -124136
$$ packed form
9119B06645a8918j96618I1349b94195P1662E9412b54303E9089a04560B17504H7771
9107C0239R5304b40491a17832k42842A99259r988F6272a31981B12617Q0475I4982
9095a61544C8005N1803a69338B23040a613B21136r9704a10622d1863H7273J0696
9084I7969m0218b64431M5880q3327C3267f1379A27090a4085C44388i0208A54153
9072A4235N0030b48160j8719d980m6481I5541a14015c9898l23730G0927d03141
9060b03726j18661J38139A60415D7834J6141a17292M7966A01872h3582G4019R461
9049H3480b16036G7632g2301B27190k559E5295a17121F0748J61515d4404l4470
9038g8874m78042a43233o873j7283A03827b49330a8435G0560f8750k1856l3530
$$ plain form
9027 -124136 -427916 -76474 188713 -111293 25335 -207614 30162 -192312 178230 -61173
9016 -243932 -223036 -7154 26179 -248989 -203620 -100077 -295238 -110928 131362 312297 78927
9004 -273889 21940 -293075 84587 70999 -173459 -221719 -354642 73896 111472 14988 -134419
8992 -431075 -192625 -226295 -20745 299202 115113 111338 -172582 -29776 175835 93733 -103279
8980 -483125 -7771 -84 -278990 -115521 -175780 -31062 209805 -108683 18501 -339754 958 -169502
8967 -152680 32052 217834 249243 -84298 -112063 33973 -197458 -320637 -292953 -36230 -35092
8956 -35092 -320422 -175717 197852 -70402 -152211 -384 307452 108629 -275371 328475 -168850
8944 -114338 231775 -151517 -411422 101121 -55917 47519 -62595 -237878 141171 325313
$$ packed form
9027a24136l03780g6474A88713a11293B5335b07614C0162a92312A78230f1173
9016b43932K0896g154B6179b48989M5369a00077j95161a10928A31362J80935G8927
9004b73889B1940b93075H4587j3588a73459m8260j32923G3896L7576A4988a34419
8992d31075a92625l3670b0745B99202A15113l775a72582b9776A75835q2102a03279
8980d83125g771h4k78906a15521o0259c1062B09805a08683A8501c39754I58a69502
8967a52680C2052J85782L1409h4298k7765C3973a97458j23179K7684c6230J138
8956c5092k85330J44705A97852g0402q1809c84C07452A08629b75371C28475a68850
8944a14338B31775a51517k59905A01121e5917D7519f2595j75283A41171J84142
$$ plain form
8934 325313 480868 -42926 19460 39269 13251 -91578 222296 112424 270537 908802 1777867
8923 1777867 4284373 10390325 15216901 3717038 1360272 421269 359073 471380 451188
8914 451188 182392 353839 105471 -232803 203154 211994 939345 223002 -285042 -70359
8903 -111260 151839 51988 -49109 -222214 -57748 162921 -151144 241771 -23415 -305484
8893 -305484 -189764 83623 -68855 -128303 39315 -23109 -36525 -181275 105316 201746 77020
8881 -331901 46005 -400 -1074 156933 -439 -209976 -28764 -92250 96691 264918 169024 -115090
$$ packed form
8934C25313J55555d2926A9460J9809A3251i1578B22296j09872J58113O38265Q69065
8923A777867K506506O105952M826576C717038A360272D21269o2196J12307k0192
8914D51188A82392J71447A05471b32803B03154Q840P27351B23002b85042g0359
8903a11260A51839E1988d9109j73105e7748A62921a51144B41771b3415k82069
8893c05484J15720H3623f8855n9448C9315b3109j3416j44750A05316R6430G7020
8881c31901D6005d00o74A56933d39k09537b8764o3486I6691J68227r5894a15090
$$ [...]
##END NTUPLES=NMR SPECTRUM
##END=
