##TITLE=AC1536_ROEFFECT0010_8214420_KJPr5HqVP5
##JCAMPDX= 6.0         $$ Bruker NMR JCAMP-DX V2.0
##DATA TYPE= NMR SPECTRUM
##DATA CLASS= NTUPLES
##ORIGIN= BRUKER
##OWNER= Administrator
$$ 1.72 TOPSPIN		Version 2.1
$$ 2013-10-11 17:04:46.818 -0700  Administrator@X
$$ Compression mode = diff/dup
##.OBSERVE FREQUENCY= 400.02188249412
##.OBSERVE NUCLEUS= ^1H
##.ACQUISITION MODE= SIMULTANEOUS (DQD)
##.ACQUISITION SCHEME= undefined
##.AVERAGES= 64
##.DIGITISER RES= 22
##SPECTROMETER/DATA SYSTEM= spect
##.PULSE SEQUENCE= noesygpps1d.comp
##.SOLVENT NAME= COFFEE_meoh
##.SHIFT REFERENCE= INTERNAL, COFFEE_meoh, 1, 14.9609
##AUDIT TRAIL= $$ (NUMBER, WHEN, WHO, WHERE, PROCESS, VERSION, WHAT)
$$ ##TITLE= Audit trail, TOPSPIN		Version 2.1
$$ ##JCAMPDX= 5.01
$$ ##ORIGIN= Bruker BioSpin GmbH
$$ ##OWNER= Administrator
$$ $$ E:\/data/COFFEE/nmr/AC1536_ROEFFECT0010_8214420_KJPr5HqVP5/12/pdata/1/auditp.txt
$$ ##AUDIT TRAIL=  $$ (NUMBER, WHEN, WHO, WHERE, PROCESS, VERSION, WHAT)
(   1,<2013-10-11 17:04:41.599 -0700>,<Administrator>,<X>,<go>,<TOPSPIN 2.1>,
      <created by zg
	started at 2013-10-11 16:53:11.939 -0700,
	POWCHK enabled, PULCHK disabled,
       configuration hash MD5:
       C8 4E 4E 5D D3 5C D8 9E 9F 52 82 E0 59 8A DE 15
       data hash MD5: 64K
       E2 7D C3 F1 C7 02 F5 7C 9F C4 ED C6 AD C3 9A 64>)
(   2,<2013-10-11 17:04:44.771 -0700>,<Administrator>,<X>,<proc1d>,<TOPSPIN 2.1>,
      <Start of raw data processing
       efp LB = 0.3 FT_mod = 6 PKNL = 1 PHC0 = 0 PHC1 = 0 SI = 128K 
       data hash MD5: 128K
       63 99 3A 1B 0A A3 75 FF 76 B7 4C 23 45 EA C8 52>)
(   3,<2013-10-11 17:04:45.771 -0700>,<Administrator>,<X>,<proc1d>,<TOPSPIN 2.1>,
      <pk PHC0 = -81.73828 PHC1 = 0 
       data hash MD5: 128K
       D5 AE D1 34 A2 94 3B 31 1F 2D B7 54 62 5C 76 80>)
(   4,<2013-10-11 17:04:46.224 -0700>,<Administrator>,<X>,<proc1d>,<TOPSPIN 2.1>,
      <abs ABSG = 1 
       data hash MD5: 128K
       A3 22 AA 4A 59 62 2B 47 53 17 3F 46 1A C0 3E DE>)
(   5,<2013-10-11 17:04:46.318 -0700>,<Administrator>,<X>,<proc1d>,<TOPSPIN 2.1>,
      <abs ABSG = 2 
       data hash MD5: 128K
       CF 84 CF 5A 45 41 DA 68 CE 8F EB 5D 42 C5 CB BA>)
(   6,<2013-10-11 17:04:46.427 -0700>,<Administrator>,<X>,<proc1d>,<TOPSPIN 2.1>,
      <abs ABSG = 3 
       data hash MD5: 128K
       B6 4B 1F 63 31 10 A7 79 00 FC 41 0B DC A5 AD 52>)
(   7,<2013-10-11 17:04:46.505 -0700>,<Administrator>,<X>,<proc1d>,<TOPSPIN 2.1>,
      <abs ABSG = 4 
       data hash MD5: 128K
       03 FE 21 2B C5 4A 31 76 72 2F 7E 55 C8 80 D6 CA>)
(   8,<2013-10-11 17:04:46.615 -0700>,<Administrator>,<X>,<proc1d>,<TOPSPIN 2.1>,
      <abs ABSG = 5 
       data hash MD5: 128K
       F7 65 0A DF 22 58 61 88 3E E0 22 76 A1 95 A2 E9>)
$$ ##END=
$$ 
$$ $$ hash MD5
$$ $$ 7C 27 7B E7 75 C1 9E A8 91 AD E7 F5 DF EB 51 9E
##$RELAX= 
##$RELAX= 
##$RELAX= 
##$RELAX= 
##$RELAX= 
##$RELAX= 
##$RELAX= 
##$RELAX= 
$$ Bruker specific parameters
$$ --------------------------
##$DU= <E:\>
##$EXPNO= 12
$$ [...]
150 150 150 150 150 150 150 150
##$TP07= 0
##$TPNAME0= <>
##$TPNAME1= <>
##$TPNAME2= <>
##$TPNAME3= <>
##$TPNAME4= <>
##$TPNAME5= <>
##$TPNAME6= <>
##$TPNAME7= <>
##$TPOAL= (0..7)
0.5 0.5 0.5 0.5 0.5 0.5 0.5 0.5
##$TPOFFS= (0..7)
0 0 0 0 0 0 0 0
##$TUNHIN= 0
##$TUNHOUT= 0
##$TUNXOUT= 0
##$USERA1= <user>
##$USERA2= <user>
##$USERA3= <user>
##$USERA4= <user>
##$USERA5= <user>
##$V9= 5
##$VALIST= <valist>
##$VCLIST= <CCCCCCCCCCCCCCC>
##$VD= 0
##$VDLIST= <DDDDDDDDDDDDDDD>
##$VPLIST= <PPPPPPPPPPPPPPP>
##$VTLIST= <TTTTTTTTTTTTTTT>
##$WBST= 1024
##$WBSW= 4
##$XGAIN= (0..3)
0 0 0 0
##$XL= 0
##$YL= 0
##$YMAX_a= 6513309
##$YMIN_a= -12623633
##$ZGOPTNS= <>
##$ZL1= 120
##$ZL2= 120
##$ZL3= 120
##$ZL4= 120
##$ABSF1= 14.9609
##$ABSF2= -5.597281
##$ABSG= 5
##$ABSL= 3
##$ALPHA= 0
##$AQORDER= 0
##$ASSFAC= 0
##$ASSFACI= 0
##$ASSFACX= 0
##$ASSWID= 0
##$AUNMP= <proc_prof1d_extract.lims>
##$AXLEFT= 0
##$AXNAME= <>
##$AXNUC= <1H>
##$AXRIGHT= 0
##$AXTYPE= 0
##$AXUNIT= <>
##$AZFE= 0.1
##$AZFW= 0.1
##$BCFW= 0
##$BC_mod= 0
##$BYTORDP= 0
##$COROFFS= 0
##$CY= 15
##$DATMOD= 1
##$DC= 0
##$DFILT= <>
##$DTYPP= 0
##$F1P= 0
##$F2P= 0
##$FCOR= 0.5
##$FTSIZE= 131072
##$FT_mod= 6
##$GAMMA= 0
##$GB= 0
##$INTBC= 1
##$INTSCL= 1
##$ISEN= 128
##$LB= 0.3
##$LEV0= 0
##$LPBIN= 0
##$MAXI= 10000
##$MC2= 0
##$MEAN= 0
##$ME_mod= 0
##$MI= 0
##$NCOEF= 0
##$NC_proc= -2
##$NLEV= 6
##$NOISF1= 0
##$NOISF2= 0
##$NSP= 0
##$NTH_PI= 0
##$NZP= 0
##$OFFSET= 14.9609
##$PC= 1
##$PHC0= -81.73828
##$PHC1= 0
##$PH_mod= 1
##$PKNL= yes
##$PPARMOD= 0
##$PPDIAG= 0
##$PPIPTYP= 0
##$PPMPNUM= 2147483647
##$PPRESOL= 1
##$PSCAL= 4
##$PSIGN= 0
##$PYNMP= <proc.py>
##$REVERSE= no
##$SF= 400.020009675457
##$SI= 131072
##$SIGF1= 0
##$SIGF2= 0
##$SINO= 400
##$SIOLD= 131072
##$SPECTYP= <>
##$SREGLST= <1H.CDCl3>
##$SSB= 0
##$STSI= 131072
##$STSR= 0
##$SW_p= 8223.68421052631
##$SYMM= 0
##$S_DEV= 0
##$TDeff= 65536
##$TDoff= 0
##$TI= <>
##$TILT= no
##$TM1= 0
##$TM2= 0
##$TOPLEV= 0
##$USERP1= <user>
##$USERP2= <user>
##$USERP3= <user>
##$USERP4= <user>
##$USERP5= <user>
##$WDW= 1
##$XDIM= 131072
##$YMAX_p= 438371605
##$YMIN_p= -13777
##$CURPLOT= <Network HP LaserJet P1505>
##$CURPRIN= <$Network HP LaserJet P1505>
##$DFORMAT= <normdp>
##$LAYOUT= <+/1D_H.xwp>
##$LFORMAT= <normlp>
##$PFORMAT= <normpl>
##$SURQMSG= 1
$$ End of Bruker specific parameters
$$ ---------------------------------
##NTUPLES= NMR SPECTRUM
##VAR_NAME=  FREQUENCY,     SPECTRUM/REAL,   SPECTRUM/IMAG
##SYMBOL=    X,             R,               I
##VAR_TYPE=  INDEPENDENT,   DEPENDENT,       DEPENDENT
##VAR_FORM=  AFFN,          ASDF,            ASDF
##VAR_DIM=   131072,        131072,          131072
##UNITS=     HZ,            ARBITRARY UNITS, ARBITRARY UNITS
##FACTOR=    0.0627417313425164, 1,          1
##FIRST=     8223.62146879497, 1122,         -64275
##LAST=      0,             3574,            -63951
##MIN=       0,             -13777,          0
##MAX=       8223.62146879497, 438371605,    0
$$ Real data points
##PAGE= N=1
##DATA TABLE= (X++(R..R)), XYDATA
$$ [...]
63911B823116k24630k08328j91089j72954j54164j35838j19250j04843r2247q1001
$$ 2823116 2598486 2390158 2199069 2026115 1871951 1736113 1616863 1512020 1419773 1338772
63901A338772p0986o2264n4757m8190m2306l7166l3015k9877k7435k5499k4264
$$ 1338772 1267786 1205522 1150765 1102575 1060269 1023103 990088 960211 932776 907277 883013
63890H83013k3826k3718k3317k2542k1754k1069k0234j9087j7699j6092j4284
$$ 883013 859187 835469 812152 789610 767856 746787 726553 707466 689767 673675 659391
63879F59391j2554j1129r558o960l168Q43L935N880P228Q455R643J0734J1772
$$ 659391 646837 635708 626150 619190 616022 616865 620800 626680 633908 642363 652006 662740 674512
63866F74512J2806J3731J4310J4335J3835J3057J2234J1430J0665R972R196P943
$$ 674512 687318 701049 715359 729694 743529 756586 768820 780250 790915 800887 810083 818026
63854H18026N973L494Q78j641l882n726p479r694j2198j3931j4357j4486j5581
$$ 818026 823999 827493 828371 826730 822848 817122 809643 799949 787751 773820 759463 744977 729396
63841G29396j7395j8760j9505k0504k1881k2668k2532k2423k2840k2768k1256
$$ 729396 712001 693241 673736 653232 631351 608683 586151 563728 540888 518120 496864
63830D96864j9072j7743j7528j7309j6191j4391j2676j1546j0919j0247r170q114
$$ 496864 477792 460049 442521 425212 409021 394630 381954 370408 359489 349242 340072 331958
63818C31958p829q205q236p456o592o277n982m978l637k828k547k092j301o10
$$ 331958 324129 315924 307688 300232 293640 287363 281381 276403 272766 269938 267391 265299 263998 263388
63804B63388j75K27N33M70K11J63J22n34j811k964l483l523l329k882k312k049
$$ 263388 263213 263440 263973 264443 264654 264817 264939 264405 262594 259630 256147 252624 249295 246413 244101 242052
63788B42052k265k631k796k766k670k498k240j943j573j058n64m17o96j096j235
$$ 242052 239787 237156 234360 231594 228924 226426 224186 222243 220670 219612 219048 218631 217935 216839 215604
63773B15604r66m27N9K14O1j64l39n06m96MP37Q53J3r60j106n84k88m97p21o40
$$ 215604 214638 214211 214270 214484 214545 214381 214042 213536 213040 213044 213781 214634 214647 213687 212581 211997 211709 211212 210491 209851
63753B09851m30j79K50P25Q32N11K28M12J085K009K754K761J896Q55M88P30Q43
$$ 209851 209421 209242 209492 210217 211049 211560 211788 212200 213285 215294 218048 220809 222705 223560 224048 224778 225621
63736B25621O64R18K042L375L892L318K277J569J514J828J979J831J775K143K674
$$ 225621 226285 227203 229245 232620 236512 239830 242107 243676 245190 247018 248997 250828 252603 254746 257420
63721B57420K957L106L519M179M674M794M515L610J955J67q09q07n81p98j415
$$ 257420 260377 263483 267002 271181 275855 280649 285164 288774 290729 290896 290087 289280 288699 287901 286486
63706B86486k086k522k399j621p46n13q20q18k03L50K78K7L72J348K293K691K653
$$ 286486 284400 281878 279479 277858 277112 276599 275779 274961 274758 275108 275386 275413 275785 277133 279426 282117 284770
63689B84770K663K952L099K469J294Q11J697K905K894J731Q03O41M09k64m81L14
$$ 284770 287433 290385 293484 295953 297247 298058 299755 302660 305554 307285 308088 308729 309138 308874 308393 308707
63673C08707J169R92J10m15k94N0L29L88j3o60o45M46J650J761Q39k73j369k738
$$ 308707 309876 310868 310978 310563 310269 310319 310648 311036 311023 310363 309718 310164 311814 313575 314414 314141 312772 310034
63655C10034m047m503m112l705l719l860l915m026l991l313k096j185j056j299
$$ 310034 305987 301484 297372 293667 289948 286088 282173 278147 274156 270843 268747 267562 266506 265207
63641B65207j337j080n41M22J633K460K626K672L097L537L341K731K682L673N079
$$ 265207 263870 262790 262249 262671 264304 266764 269390 272062 275159 278696 282037 284768 287450 291123 296202
63626B96202N946O010N822O051O901Q062R076R725J0125J0506J0962J1461J2179
$$ 296202 302148 308158 313980 320031 326932 334994 344070 353795 363920 374426 385388 396849 409028
63613D09028J3587J5936J8647K0596K1239K1238K1688K2870K4185K5076K5517
$$ 409028 422615 438551 457198 477794 499033 520271 541959 564829 589014 614090 639607
63602F39607K5477K4509K2182J8593J4249R653N266J545j210k971l890m235m480
$$ 639607 665084 689593 711775 730368 744617 754270 759536 761081 759871 756900 753010 748775 744295
63589G44295n054n948o938q332j0951j4989j9271k2141k2995k2631k2162k1901
$$ 744295 739241 733293 726355 718023 707072 692083 672812 650671 627676 605045 582883 560982
63577E60982k1237j9427j6557j3668j1733j0569r108o740l907j266J009K871M032
$$ 560982 539745 520318 503761 490093 478360 467791 458683 451943 448036 446770 447779 450650 454682
63564D54682M496M874N638O432O766O892P351Q045Q499Q825R582J0841J2165J3490
$$ 454682 459178 464052 469690 476122 482888 489780 497131 505176 513675 522500 532082 542923 555088 568578
63550E68578J5185J7231J9074K0568K2361K5018K8283L1422L3722L4376L2440
$$ 568578 583763 600994 620068 640636 662997 688015 716298 747720 781442 815818 848258
63539H48258K7487K0197J1971M101k573p492j0294j0896r604p261n184m542n528
$$ 848258 875745 895942 907913 912014 909441 901949 891655 880759 871155 863894 858710 854168 848640
63526H48640p362r320j1555j4748j9138k4161k8817l2081l3144l1856k9156k6677
$$ 848640 841278 831958 820403 805655 786517 762356 733539 701458 668314 636458 607302 580625
63514E80625k5417k4874k3713k1324j8397j5943j4175j2593j0815q917p130n688
$$ 580625 555208 530334 506621 485297 466900 450957 436782 424189 413374 404457 397327 391639
63502C91639m879m813n123n209m828m060k947j590n02j69k77q3M06M43q3l15J76
$$ 391639 386760 381947 376824 371615 366787 362727 359780 358190 357688 357519 357242 357159 357565 358008 357925 357610 357786
63485C57786O27L29k21k40J28L67O78J413K051J971J771K435L485L408K010P72
$$ 357786 358413 358742 358521 358281 358409 358776 359454 360867 362918 364889 366660 369095 372580 375988 377998 378770
63469C78770N28K75j045k764l566l412l390m077m992n414n004l817k301j167p43
$$ 378770 379298 379573 378528 375764 372198 368786 365396 361319 356327 350913 345909 342092 339791 338624 337881
63454C37881n63j5P71J185J087J044J572K548L424L837L917M122M760N694O639
$$ 337881 337318 337303 338074 339259 340346 341390 342962 345510 348934 352771 356688 360810 365570 371264 377903
63439C77903P682R203J1174J3036J4480J5886J7718J9825K1820K3697K5387K5915
$$ 377903 385585 394788 405962 418998 433478 449364 467082 486907 508727 532424 557811 583726
63427E83726K3918J9324J3923R907Q090P875Q530R890J1887J4031J5846J7589
$$ 583726 607644 626968 640891 650798 658888 666763 675293 685183 697070 711101 726947 744536
63415G44536K0007K3312K6709K9135L0232L0244K9103K6102K0711J3493N947m99
$$ 744536 764543 787855 814564 843699 873931 904175 933278 959380 980091 993584 999531 999032
63403I99032n203q202r705r908r219q408q378r651j2158j5512j9328k3280k6933
$$ 999032 993829 985627 975922 966014 956795 948387 940009 930358 918200 902688 883360 860080 833147
63390H33147k9797l1537l2029l1319k9641k7450k5229k3138k0996j8624j6178
$$ 833147 803350 771813 739784 708465 678824 651374 626145 603007 582011 563387 547209
63379E47209j3958j2012j0042p721m995k021J088M194O855Q524R242R851J1102
$$ 547209 533251 521239 511197 503476 498481 496460 497548 501742 508597 517121 526363 536214 547316
63366E47316J2703J3682J3629J3140J2971J3315J4021J5029J6331J7925K0032
$$ 547316 560019 573701 587330 600470 613441 626756 640777 655806 672137 690062 710094
63355G10094K2862K5958K8302K9396K9694K9527K8210K4896J9899J4385R054L940
$$ 710094 732956 758914 787216 816612 846306 875833 904043 928939 948838 963223 972277 976217
63343I76217p05m186o245p408q307r107r780j0436j1304j2672j4880j7995k1528
$$ 976217 975512 971326 965081 957673 949366 940259 930479 920043 908739 896067 881187 863192 841664
63330H41664k4824k7638k9890l1069l0545k8495k5880k3370k0849j8080j5197
$$ 841664 816840 789202 759312 728243 697698 669203 643323 619953 599104 581024 565827
63319E65827j2297r162n788k963j970l677p756j2476j5559j5843j4234j2531j1433
$$ 565827 553530 544368 538580 535617 533647 529970 522214 509738 494179 478336 464102 451571 440138
63306D40138j0248q404o345m734l593k608j686p75K71J323J939J987J814J497
$$ 440138 429890 421486 415141 410407 406814 404206 402520 401745 402016 403339 405278 407265 409079 410576
63292D10576N57j196l087m370n051n510n752n684n650o040o545o449n582m504
$$ 410576 411133 409937 406850 402480 397429 391919 386167 380483 374833 368793 362248 355799 350217 345713
63278C45713l819l561l284k559j545j028j490k177j799l40O75K70n28k05J024
$$ 345713 341894 338333 335049 332490 330945 329917 328427 326250 324451 324111 324786 325056 324528 324323 325347
63263C25347J633J027J06k53j05L76J388K750L596L464K993L002L383L620L824
$$ 325347 326980 328007 328113 327860 327755 328131 329519 332269 335865 339329 342322 345324 348707 352327 356151
63248C56151M535N653O413O433O211O375O929P487P921Q444R240J0343J1692J3063
$$ 356151 360686 366339 372752 379185 385396 391771 398700 406187 414108 422552 431792 442135 453827 466890
63234D66890J4046J4452J4724J5537J6970J8417J9395K0059K0664K1028K0870
$$ 466890 480936 495388 510112 525649 542619 561036 580431 600490 621154 642182 663052
63223F63052K0395K0032J9850J9707J9744K0199K0811K1049K0793K0317J9621
$$ 663052 683447 703479 723329 743036 762780 782979 803790 824839 845632 865949 885570
63212H85570J8416J6704J4705J2188Q632M217j36l906p419j0873j3738j5604j6882
$$ 885570 903986 920690 935395 947583 956215 960432 960296 956390 948971 938098 924360 908756 891874
63199H91874j8035j8739j8357j6771j4128j0398n838j468J720L771N371O782P835
$$ 891874 873839 855100 836743 819972 805844 795446 789608 788140 789860 793631 799002 805784 813619
63186H13619Q708R952J1849J4300J7126J9993K2306K3866K5268K6983K8431K8805
$$ 813619 822327 832279 844128 858428 875554 895547 917853 941719 966987 993970 1022401 1051206
63174A051206K8547K8900L0017L0644K9904K8306K6627K4623K1564J7357J2512
$$ 1051206 1079753 1108653 1138670 1169314 1199218 1227524 1254151 1278774 1300338 1317695 1330207
63163A330207P348J776m359j1175j8705k6558l3799l9580m3824m7007m9266n0081
$$ 1330207 1337555 1339331 1334972 1323797 1305092 1278534 1244735 1205155 1161331 1114324 1065058 1014977
63151A014977m8903m6018m2577l9669l7380l4921l1707k8044k4581k1523j8700
$$ 1014977 966074 920056 877479 837810 800430 765509 733802 705758 681177 659654 640954
63140F40954j6159j4167j2741j1617j0569r385p710n446l177j602o09M92J821
$$ 640954 624795 610628 597887 586270 575701 566316 558606 553160 549983 548381 547772 548264 550085
63127E50085K747L012L264M135N407O554P611Q828R848R868Q603O632M706L021
$$ 550085 552832 555844 559108 563243 568650 575204 582815 591643 601491 611359 619962 626594 631300 634321
63113F34321J277p26k701m085m595m517m317m164l971l800l788l725l138j982
$$ 634321 635598 634872 632171 628086 623491 618974 614657 610493 606522 602722 598934 595209 592071 590089
63099E90089q79m17n09o18m54j97j32l08m58k50L06P26N00k42p83n77K47J244
$$ 590089 589210 588793 588284 587666 587212 587015 586883 586575 586117 585867 586173 586899 587399 587157 586374 585797 586044 587288
63081E87288K222L207L993M058L160J950J731L214N511O875O683O173O731P975
$$ 587288 589510 592717 596710 600768 603928 605878 607609 610823 616334 623209 629892 636065 642796 650771
63067F50771Q442P876P712R085J1351J3100J3903J4408J5272J6733J8893K1676
$$ 650771 659213 667089 674801 683886 695237 708337 722240 736648 751920 768653 787546 809222
63055H09222K4602K7037K8818L0339L2149L4588L7546M0328M2091M2753M3200
$$ 809222 833824 860861 889679 920018 952167 986755 1024301 1064629 1106720 1149473 1192673
63044A192673M4207M5454M6093M6008M5883M6176M6625M6853M6850M6702M6290
$$ 1192673 1236880 1282334 1328427 1374435 1420318 1466494 1513119 1559972 1606822 1653524 1699814
63033A699814M5463M4211M2480M0025L6588L2019K6149J8873J0472J574p377j6409
$$ 1699814 1745277 1789488 1831968 1871993 1908581 1940600 1966749 1985622 1996094 1997668 1990291 1973882
63021A973882k5559l4350m1904m7498n0873n2094n1410m9162m5669m1121l5697
$$ 1973882 1948323 1913973 1872069 1824571 1773698 1721604 1670194 1621032 1575363 1534242 1498545
63010A498545k9674k3303j6570r316j688N758J2555J8869K5253L1904L8354M3984
$$ 1498545 1468871 1445568 1428998 1419682 1417994 1423752 1436307 1455176 1480429 1512333 1550687 1594671
62998A594671M8573N2240N5036N6912N7960N8436N8543N8378N8031N7504N6568
$$ 1594671 1643244 1695484 1750520 1807432 1865392 1923828 1982371 2040749 2098780 2156284 2212852
62987B212852N5020N3018N0753M7678M2563L4695K4673J3656K089j0363k3788
$$ 2212852 2267872 2320890 2371643 2419321 2461884 2496579 2521252 2534908 2536997 2526634 2502846
62976B502846l7532n0754o2921p3540q1939q7723r1270r3279r3904r2706q9472
$$ 2502846 2465314 2414560 2351639 2278099 2196160 2108437 2017167 1923888 1829984 1737278 1647806
62965A647806q4757p9450p4056o8568o2890n7126n1521m6346m1869l8279l5527
$$ 1647806 1563049 1483599 1409543 1340975 1278085 1220959 1169438 1123092 1081223 1042944 1007417
62954A007417l3316l1263k9079k6724k4500k2892k2098k1688k1030k0029j9146
$$ 1007417 974101 942838 913759 887035 862535 839643 817545 795857 774827 754798 735652
62943G35652j8561j7677j5866j3486j1722j1304j1743j1906j1101r453p471n594
$$ 735652 717091 699414 683548 670062 658340 647036 635293 623387 612286 602833 595362 589768
62931E89768m143l398l475m060m461m079k903j504n25k59n93j196j734k080k399
$$ 589768 585625 582227 578752 574692 570231 566152 563249 561745 561220 560961 560368 559172 557438 555358 552959
62916E52959k875l347l456l175k920k962l088l030k978l263l756l989l830l618
$$ 552959 550084 546737 543281 540106 537186 534224 531136 528106 525128 521865 518109 514120 510290 506672
62902E06672l601l640l488l110k610k082j650j415j275r79m83p2Nn6J95Q75J453
$$ 506672 503071 499431 495943 492833 490223 488141 486491 485076 483801 482822 482339 482267 482272 482216 482411 483286 484739
62885D84739J260L01n94p26l70k75n05l67L52Q90O44J41J34L36o1q76j025j96
$$ 484739 485999 486300 485706 484980 484610 484335 483830 483463 483815 484705 485349 485490 485624 485960 485899 485023 483998 483802
62867D83802N61J69j147k336k708k371j820j452j285r86l97L7j69o23m10N41J190
$$ 483802 484363 484532 483385 481049 478341 475970 474150 472698 471413 470427 470030 470067 469898 469275 468865 469406 470596
62850D70596Q33J13K7N32Q14N62K03K1k49q20j384j491j152q59j043j585j969
$$ 470596 471429 471542 471569 472101 472915 473477 473680 473701 473452 472632 471248 469757 468605 467746 466703 465118 463149
62833D63149j933j846k136k558k431j659q93n23j01Q44J940K481K464K546L051
$$ 463149 461216 459370 457234 454676 452245 450586 449693 449170 449069 449913 451853 454334 456798 459344 462395
62818D62395L574L565K966K257K038K499L158L257K619J874J710K137K725L219
$$ 462395 465969 469534 472500 474757 476795 479294 482452 485709 488328 490202 491912 494049 496774 499993
62804D99993L655M038M320M501M532M375M372N188O959Q874J0067J0639J1336
$$ 499993 503648 507686 512006 516507 521039 525414 529786 534974 541933 550807 560874 571513 582849
62791E82849J2485J3888J5527J7656K0187K2693K5126K7974L1540L5552L9644
$$ 582849 595334 609222 624749 642405 662592 685285 710411 738385 769925 805477 845121
62780H45121M3777M8031N2384N6840O1326O5312O8009O9244O9706O9925O9334
$$ 845121 888898 936929 989313 1046153 1107479 1172791 1240800 1310044 1379750 1449675 1519009
62769A519009O6737O1536N4101M4983L4325K2254R498k833j4182k4918l5506m5478
$$ 1519009 1585746 1647282 1701383 1746366 1780691 1802945 1812443 1809610 1795428 1770510 1735004 1689526
62757A689526n3665n9454o3377o6212o8038o8517o7698o5955o3373n9839n5717
$$ 1689526 1635861 1576407 1513030 1446818 1378780 1310263 1242565 1176610 1113237 1053398 997681
62746I97681n1774m8326m4956m1218l7205l3327k9863k6870k4166k1382j8377
$$ 997681 945907 897581 852625 811407 774202 740875 711012 684142 659976 638594 620217
62735F20217j5613j3628j2148j0357q086o061m705l510k001n62L34J071K266L641
$$ 620217 604604 590976 578828 568471 560385 554324 549619 546109 544108 543546 543880 544951 547217 550858
62721E50858M442M647M900N454O151P323R570J2495J4792J6038J7389J9897K3086
$$ 550858 555300 559947 564847 570301 576452 583775 593345 605840 620632 636670 654059 673956 697042
62708F97042K6001K8857L2529L6972M1351M5581N0511N6502O2887O9092P5324
$$ 697042 723043 751900 784429 821401 862752 908333 958844 1015346 1078233 1147325 1222649
62697A222649Q1695Q7651R2805R7532J01994J05288J06466J05864J04367J01554
$$ 1222649 1304344 1391995 1484800 1582332 1684326 1789614 1896080 2001944 2106311 2207865
62687B207865R5617Q5230P0684N3139L3636J3106p478k7441m6453o3932p8890
$$ 2207865 2303482 2388712 2459396 2512535 2546171 2559277 2551799 2524358 2477905 2413973 2335083
62676B335083r0757r9845j06599j10831j12138j10710j07168j01971r5490q8469
$$ 2335083 2244326 2144481 2037882 1927051 1814913 1704203 1597035 1495064 1399574 1311105
62666A311105q1745p5540o9499o3432n7575n2178m7310m3050l9396l5926l2066
$$ 1311105 1229360 1153820 1084321 1020889 963314 911136 863826 820776 781380 745454 713388
62655G13388k7909k4305k1851k0153j8489j6839j5736j5207j4446j2850j0860
$$ 713388 685479 661174 639323 619170 600681 583842 568106 552899 538453 525603 514743
62644E14743r489r080q959q307p012n576m432l609k936k265j558r01m56k32k8
$$ 514743 505254 496174 487215 478908 471896 466320 461888 458279 455343 453078 451520 450619 450163 449931 449903
62629D49903K17R6q41k409l793m332l983l021j694l60M54N00J06k16k81j31L97
$$ 449903 450120 450216 449375 446966 443173 438841 434858 431837 430143 429783 430237 430737 430843 430627 430346 430215 430612
62612D30612J553L208M784N795O278O618P048P404P471P433P865R163J1075J3025
$$ 430612 432165 435373 440157 445952 452230 458848 465896 473300 480771 488204 496069 505232 516307 529332
62598E29332J4689J6104J7359J8680K0630K3683K7467L0919L3371L4983L5976
$$ 529332 544021 560125 577484 596164 616794 640477 667944 698863 732234 767217 803193
62587H03193L6024L4772L2410K9229K5047J9599J3278O886P78n261j1353j7195
$$ 803193 839217 873989 906399 935628 960675 980274 993552 1000438 1001216 995955 984602 967407
62575I67407k2351k6538k9627l1633l2733l3054l2568l1296k9529k7562k5418
$$ 967407 945056 918518 888891 857258 824525 791471 758903 727607 698078 670516 645098
62564F45098k3036k0584j8351j6505j5093j4024j2924j1355r420p717o447n136
$$ 645098 622062 601478 583127 566622 551529 537505 524581 513226 503806 496089 489642 484506
62552D84506l591k475k301k455k047j273r37r72m80P29J827K300K582K988L009
$$ 484506 480915 478440 476139 473684 471637 470364 469427 468455 467975 468704 470531 472831 475413 478401 481410
62537D81410K268J388J259J882K594L020L261L402L404L460M041N574Q158J1371
$$ 481410 483678 485066 486325 488207 490801 493821 497082 500484 503888 507348 511389 516963 525121 536492
62523E36492J4352J6415J7828J9627K2433K5814K9101L2395L6261M0681M4976
$$ 536492 550844 567259 585087 604714 627147 652961 682062 714457 750718 791399 836375
62512H36375M8724N2266N6027N9711O2415O3488O2994O1282N8366N3883M7593
$$ 836375 885099 937365 993392 1053103 1115518 1179006 1242000 1303282 1361648 1415531 1463124
62501A463124L9638L0283J9758Q580k273j1871j9924k6543l1625l4799l5892l5028
$$ 1463124 1502762 1533045 1552803 1561383 1559110 1547239 1527315 1500772 1469147 1434348 1398456 1363428
62489A363428l2332k7966k2396j6217r706k924L835J0198J6313K2639K9037L4592
$$ 1363428 1331096 1303130 1280734 1264517 1254811 1251887 1255722 1265920 1282233 1304872 1333909 1368501
62477A368501L8631M1290M2737M2252L8675L1641K2179J2110L009m700j1913k0051
$$ 1368501 1407132 1448422 1491159 1533411 1572086 1603727 1625906 1638016 1641025 1636325 1624412 1604361
62465A604361k9777m0388n0365n8330o3586o6255o7048o6639o5101o2153n7937
$$ 1604361 1574584 1534196 1483831 1425501 1361915 1295660 1228612 1161973 1096872 1034719 976782
62454I76782n3166m8385m3509l8333l3116k8353k4190k0266j6095j1552p187l930
$$ 976782 923616 875231 831722 793389 760273 731920 707730 687464 671369 659817 652630 648700
62442F48700k135j028M43K258L509L909M274N216O200O536O484O580O385M926
$$ 648700 646565 645537 645980 648238 651747 655656 659930 665146 671346 677882 684366 690946 697331 702257
62428G02257K154q97l431n525p391q797r575j0089j0752j1371j1434j0846j0116
$$ 702257 704411 703514 700083 694558 687167 678370 668795 658706 647954 636583 625149 614303 604187
62415F04187r806j0002j0289j0119r288q111p222p069p553q153q361p970p016
$$ 604187 594381 584379 574090 563971 554683 546572 539350 532281 524728 516575 508214 500244 493228
62402D93228n602l947k516j791j779j946j786j293p35j78N11J339K119K607K529
$$ 493228 487626 483679 481163 479372 477593 475647 473861 472568 471833 471655 472166 473505 475624 478231 480760
62387D80760J813R58P98J468K073J940J725K486M094N504O381P270Q184Q378P813
$$ 480760 482573 483531 484329 485797 487870 489810 491535 494021 498115 503619 510000 517270 525454 533832 541645
62372E41645P627Q488R632J0211J0580J1421J2455J3102J3697J5023J7049J9231
$$ 541645 549272 557760 567392 577603 588183 599604 612059 625161 638858 653881 670930 690161
62360F90161K1609K4647K8203L1693L5002L8391M1694M4520M7111M9905N2285
$$ 690161 711770 736417 764620 796313 831315 869706 911400 955920 1003031 1052936 1105221
62349A105221N2795N0744M6696M1297L4582K6770J8711J1068L758l316r641j4815
$$ 1105221 1158016 1208760 1255456 1296753 1331335 1358105 1376816 1387884 1391642 1388326 1378685 1363870
62337A363870j9393k4295k9601l4398l7724l9326l9566l8865l7260l4522l0716
$$ 1363870 1344477 1320182 1290581 1256183 1218459 1179133 1139567 1100702 1063442 1028920 998204
62326I98204k6565k2937k0089j7760j5907j4890j4820j5302j5993j6959j8252
$$ 998204 971639 948702 928613 910853 894946 880056 865236 849934 833941 816982 798730
62315G98730j9511k0306k0628k0758k0818k0671k0079j8843j6943j4690j2521
$$ 798730 779219 758913 738285 717527 696709 676038 655959 637116 620173 605483 592962
62304E92962j0625q907p376o184n277m372l384k513j748o88Q59K490L722M605
$$ 592962 582337 573430 566054 559870 554593 550221 546837 544324 542576 541888 542747 545237 548959 553564
62290E53564N477O347P008P541Q247R083R575R440Q953Q517Q107P363O127M729
$$ 553564 559041 565388 572396 579937 588184 597267 606842 616282 625235 633752 641859 649222 655349 660078
62276F60078L700L347L590M060M326M191L944M243N520P458R257J0408J1134J1941
$$ 660078 663778 667125 670715 674775 679101 683292 687236 691479 696999 704457 713714 724122 735256 747197
62262G47197J2999J4138J5327J6926J9354K2639K6322K9857L3244L7085M1847
$$ 747197 760196 774334 789661 806587 825941 848580 874902 904759 938003 975088 1016935
62251A016935M6956N0931N2584N1839M9404M5846M1202L5196K7730J9367J1309
$$ 1016935 1063891 1114822 1167406 1219245 1268649 1314495 1355697 1390893 1418623 1437990 1449299
62240A449299M501j422p861j5684k4342l2703m0133m6350n0876n3422n4356n4074
$$ 1449299 1453800 1452378 1444517 1428833 1404491 1371788 1331655 1285305 1234429 1181007 1126651 1072577
62228A072577n2258m8611m4055m0106l7103l3945k9869k5560k2149j9794j7804
$$ 1072577 1020319 971708 927653 887547 850444 816499 786630 761070 738921 719127 701323
62217G01323j5674j3452j1375r554p977o603n448m580l916l192k331j621j217
$$ 701323 685649 672197 660822 651268 643291 636688 631240 626660 622744 619552 617221 615600 614383
62204F14383p26J96J127J507J675K517M087N554O551P578Q774R399R031Q364Q130
$$ 614383 613657 613853 614980 616487 618162 620679 624766 630320 636871 644449 653223 662622 671653 680017 688147
62189F88147P995P367O560O318O588O748O751P127P985Q808R237R338R088Q293
$$ 688147 696142 703509 710069 716387 722975 729723 736474 743601 751586 760394 769631 778969 788057 796350
62175G96350P113O145N724N680N865O521P961J0106J2602J5120J7599K0272K3471
$$ 796350 803463 809608 815332 821012 826877 833398 841359 851465 864067 879187 896786 917058 940529
62162I40529K7132L0587L3112L4588L5328L5307L3964L0823K6014K0098J3676
$$ 940529 967661 998248 1031360 1065948 1101276 1136583 1170547 1201370 1227384 1247482 1261158
62151A261158P301J472l560p957j2128j6345k0467k4044k6731k8635l0145l1384
$$ 1261158 1268459 1269931 1266371 1258414 1246286 1229941 1209474 1185430 1158699 1130064 1099919 1068535
62139A068535l1965l1321k9239k6001k2241j8692j5781j3358j0960q528o545n448
$$ 1068535 1036570 1005249 976010 950009 927768 909076 893295 879937 868977 860449 853904 848456
62127H48456n139n287n743o398o911o952o501n625m228k319l30J226K138K233
$$ 848456 843317 838030 832287 825889 818978 812026 805525 799900 795672 793353 793023 794249 796387 798620
62113G98620J104j361m342o610p628p652o928n482l705k480k480l753o058q979
$$ 798620 799724 798363 794021 787411 779783 772131 765203 759721 756016 753536 751056 747303 741245 732266
62099G32266j1533j2433j1281r093p167n770m374k771j318j97Q88K127L206L760
$$ 732266 720733 708300 697019 687926 680759 674989 670615 667844 666526 666329 667217 669344 672550 676310
62085F76310L898M060M530N358O607Q303J0095J1330J1739J1923J2802J4531J6289
$$ 676310 680208 684268 688798 694156 700763 709066 719161 730491 742230 754153 766955 781486 797775
62072G97775J7206J7240J6983J6978J7404J8121J8657J8455J7669J7388J8529
$$ 797775 814981 832221 849204 866182 883586 901707 920364 938819 956488 973876 992405
62061I92405K0604K2274K3034K3519K4057K3803K1809J8266J4013R446M613rl776
$$ 992405 1013009 1035283 1058317 1081836 1105893 1129696 1151505 1169771 1183784 1193230 1197843 1197834 1194058
62048A194058o853j0186j4371j9118k3837k8199l1978l4924l7001l8345l8792
$$ 1194058 1187205 1177019 1162648 1143530 1119693 1091494 1059516 1024592 987591 949246 910454
62037I10454l7952l6006l3900l2342l0931k8793k5849k2921k0623j8707j6617
$$ 910454 872502 836496 802596 770254 739323 710530 684681 661760 641137 622430 605813
62026F05813j4366j2545j1568j1141j0524r358q046p240p010o822o401o182o595
$$ 605813 591447 578902 567334 556193 545669 536311 528265 521025 514015 507193 500792 494610 488015
62013D88015p187o945n526l737k659k605l040l267k943k123j126l32J53O74J666
$$ 488015 480828 473883 468357 464620 461961 459356 456316 453049 450106 447983 446857 446525 446678 447352 449018
61998D49018K969L721L282K131J497J917K579K388J408O80Q02J279J305N42j031
$$ 449018 451987 455708 458990 461121 462618 464535 467114 469502 470910 471590 472392 473671 474976 475518 474487
61983D74487l309n671p074p180p005p665q838r150p982o142m747m210m303m479
$$ 474487 471178 465507 458433 451253 444248 436583 427745 418595 410613 404471 399724 395514 391211 386732
61969C86732l997k479o56J18n52j608j860j288n79o0M13R26J410J856K156K072
$$ 386732 382735 380256 379600 379718 379166 377558 375698 374410 373831 373771 374184 375110 376520 378376 380532 382604
61953C82604J683J530J892K354K480K540L005L734M268M644N291O259P180P927
$$ 382604 384287 385817 387709 390063 392543 395083 398088 401822 406090 410734 416025 422284 429464 437391
61939D37391Q698R485J0040J0305J0481J0638J0656J0492J0190R721R192Q929
$$ 437391 446089 455574 465614 475919 486400 497038 507694 518186 528376 538097 547289 556218
61927E56218Q894Q321O596M257K465J582J022L96q2l96j024k107l110l588l734
$$ 556218 565112 573433 580029 584286 586751 588333 589355 589751 589669 589273 588249 586142 583032 579444 575710
61912E75710l719l188j788K56K536M965P503R749J1304J2180J2498J2060J0677
$$ 575710 571991 568803 567015 567271 569807 574772 582275 592024 603328 615508 628006 640066 650743
61899F50743Q761P070N924M948L610J899M65J19R70K128K537K124J760K049K626
$$ 650743 659504 666574 672498 677446 681056 682955 683420 683539 684509 686637 689174 691298 693058 695107 697733
61884F97733K841K614K284J898J034p83l677p230j0569j2949j4371j5357j6079
$$ 697733 700574 703188 705472 707370 708404 707621 703944 696714 686145 673196 658825 643468 627389
61871F27389j6125j5246j3873j2597j1570j0660r781q684o942m546k203n52N90
$$ 627389 611264 596018 582145 569548 557978 547318 537537 528853 521911 517365 515162 514610 515200
61858E15200J719K776L432M036N446P774J0014J1248J1833J2928J4972J7124J8228
$$ 515200 516919 519695 523127 527163 532609 540383 550397 561645 573478 586406 601378 618502 636730
61845F36730J8031J7200J6360J5534J4566J3545J2467J0882Q351N141K000o85
$$ 636730 654761 671961 688321 703855 718421 731966 744433 755315 763666 768807 770807 770122
61833G70122l030n016o316o772o558n809m541k949j253P91L538O546Q705R459
$$ 770122 767092 762076 755760 748988 742430 736621 732080 729131 727878 728669 732207 738753 747458 756917
61819G56917R277Q678P550N771L694J584p47l232n186o266p087q188r028q765
$$ 756917 766194 774872 782422 788193 791887 793471 792724 789492 784306 778040 770953 762765 753737 744972
61805G44972p557o230n122m209m028n389q111j0911j2750j3719j4413j5022j5135
$$ 744972 737415 731185 726063 721854 717826 712437 704326 693415 680665 666946 652533 637511 622376
61792F22376j4182j2019r302p100n867n079m161l325l003k956k655k194k015j987
$$ 622376 608194 596175 586873 579773 573906 568827 564666 561341 558338 555382 552727 550533 548518 546531
61778E46531j636j064p28m07N76K082L048K998K757L245M336N376O200P086Q127
$$ 546531 544895 543831 543103 542696 543272 545354 548402 551400 554157 557402 561738 567114 573314 580400 588527
61763E88527R211J0407J1872J3539J5140J6495J7562J8291J8626J8588J8232J7530
$$ 588527 597738 608145 620017 633556 648696 665191 682753 701044 719670 738258 756490 774020
61751G74020J6215J3764R806M705m88n009r009j2876j6289j8463j9211j9111j8715
$$ 774020 790235 803999 813805 818510 818022 813013 804004 791128 774839 756376 737165 718054 699339
61738F99339j8116j7335j6474j5466j4165j2764j1624j0611r145p083n050l710
$$ 699339 681223 663888 647414 631948 617783 605019 593395 582784 573639 566556 561506 557796
61726E57796l102k819k459j798r40m03o83j544k130j876j018j68K33O5m37p44
$$ 557796 554694 551875 549416 547618 546678 546275 545592 544048 541918 540042 539024 538856 539089 539154 538717 537973
61710E37973o10n10j056j984k451k310k293k772l239l346l627m484n220m936l944
$$ 537973 537363 536853 535797 533813 531362 529052 526759 523987 520748 517402 513775 509291 504071 499135 495191
61695D95191l399l727m215m174l755l485l522l652l678l571l453l537l892m164
$$ 495191 491792 488065 483850 479676 475921 472436 468914 465262 461584 458013 454560 451023 447131 442967
61681D42967l787k660j490j150j686k170j771p63j93n91j422j914j965j879j617
$$ 442967 439180 436520 435030 433880 432194 430024 428253 427490 427297 426706 425284 423370 421405 419526 417909
61666D17909r04P6P25Q60R96J632K594L257L247K791K556L130M478N887O603O468
$$ 417909 417005 417081 417806 418666 419662 421294 423888 427145 430392 433183 435739 438869 443347 449234 455837 462305
61650D62305N781M796L663K615J805R86j90j579k675l211l270k860j915o69M51
$$ 462305 468086 472882 476545 479160 480965 481951 481761 480182 477507 474296 471026 468166 466251 465582 466033
61635D66033J304K034K615K880K970L243L691L876L494K546J076p85k554l803
$$ 466033 467337 469371 471986 474866 477836 481079 484770 488646 492140 494686 495762 494977 492423 488620
61621D88620m774o037p530q553q722q284p503o410n258m449l947l479l321m052
$$ 488620 483846 477809 470279 461726 453004 444720 437217 430807 425549 421100 417153 413674 410353 406301
61607D06301n323n899n207m020l232k879k720k857l216l274k935k854l307l547
$$ 406301 400978 395079 389872 385852 382620 379741 377021 374164 370948 367674 364739 361885 358578 355031
61593C55031l022k348k236k307j900j411j610k178k096j272n92n15o39o76q04
$$ 355031 352009 349661 347425 345118 343218 341807 340197 338019 335923 334651 334059 333544 332905 332229 331425
61578C31425r19n15M00J049R12L97K03M15N86L60j58n48l60M56J461K095K158
$$ 331425 330506 329991 330391 331440 332352 332749 332952 333367 333953 334313 334155 333607 333247 333703 335164 337259 339417
61561C39417J804J368J249J672K324K551K163J713J635J680J513J341J338J095
$$ 339417 341221 342589 343838 345510 347834 350385 352548 354261 355896 357576 359089 360430 361768 362863
61547C62863L82k5P05J974K255J078m65j252j257r36l81L96J034J191J008P90
$$ 362863 363245 363220 363925 365899 368154 369232 368767 367515 366258 365322 364941 365337 366371 367562 368570 369360
61531C69360N16k6q26j559j811j371m89J62J24l31n96n63o54j087j595j842j685
$$ 369360 369876 369850 369024 367465 365654 364283 363794 363956 364080 363749 363153 362590 361936 360849 359254 357412 355727
61514C55727j005J43J198J464J044Q58J474K380K730K407K006K068K683L558M187
$$ 355727 354722 354865 356063 357527 358571 359429 360903 363283 366013 368420 370426 372494 375177 378735 382922
61499C82922M139L570L284L920N177O146O355O172O124O131N740M863L912L145
$$ 382922 387061 390631 393915 397835 403012 409158 415513 421685 427809 433940 439680 444543 448455 451600
61485D51600K265R94k33o25n1Q21J472K069K840L470L589L470L638L969L729K476
$$ 451600 453865 454859 454626 454001 453950 454771 456243 458312 461152 464622 468211 471681 475319 479288 483017 485493
61469D85493N04j562l229m208m454m177l695l237l022l300m050m776m927m445
$$ 485493 485997 484435 481206 476998 472544 468367 464672 461435 458413 455113 451063 446287 441360 436915
61455D36915l654k839k179j807j570r98O7J053J342J135J129J487J773J822J971
$$ 436915 433261 430422 428243 426436 424866 423868 423935 424988 426330 427465 428594 430081 431854 433676 435647
61440D35647K368K601K230J302K45n09p30n62m71p41j046q55j17P64J484J937
$$ 435647 438015 440616 442846 444148 444393 443884 443154 442592 442121 441380 440334 439479 439362 440126 441610 443547
61424D43547J984J651J423J698K093J931J326J075J419J761J730J739K073K192
$$ 443547 445531 447182 448605 450303 452396 454327 455653 456728 458147 459908 461638 463377 465450 467642
61410D67642J469J43r66j406j320j037p88p52r89j431j955k364k371j903j397
$$ 467642 469111 469254 468288 466882 465562 464525 463737 462985 461996 460565 458610 456246 453875 451972 450575
61395D50575j363j641j564q96r9M24P77J078J172J134J453K297L113L437L634
$$ 450575 449212 447571 446007 445111 445012 445436 446213 447291 448463 449597 451050 453347 456460 459897 463531
61380D63531M276N187N696N656N568N808O225O545O687O615O205N361M156K823
$$ 463531 467807 472994 478690 484346 489914 495722 501947 508492 515179 521794 527999 533360 537516 540339
61366E40339J754J296J353J273M22j143k673l458l457l232l341l721l688k709
$$ 540339 542093 543389 544742 546015 546437 545294 542621 539163 535706 532474 529133 525412 521724 519015
61352E19015j133N9L18J05K83J200K394L049K556R49j018k342k481j657m69N57
$$ 519015 517882 517941 518259 518364 518647 519847 522241 525290 527846 528795 527777 525435 522954 521297 520828 521385
61336E21385J102J100Q74Q89J179J282R02L91K83N68Q21Q63R16J075J067P52N81
$$ 521385 522487 523587 524461 525350 526529 527811 528713 529104 529387 529955 530776 531639 532555 533630 534697 535449 536030
61319E36030J208K621L967M441M269M436N483O911P927Q440Q930R668J0475J1229
$$ 536030 537238 539859 543826 548267 552536 556972 562455 569366 577293 585733 594663 604331 614806 626035
61305F26035J2121J3298J4588J5634J6070J5531J3787J0967P600M363J782r7j822
$$ 626035 638156 651454 666042 681676 697746 713277 727064 738031 745631 749994 751776 751679 749857
61292G49857l983o302p783q094q224r156j0391j0755j0261j0013j0353j0409r655
$$ 749857 745874 739572 731789 723695 715471 706315 695924 685169 674908 664895 654542 644133 634478
61279F34478q665p850o662m821l280k948l200k709j274K05J188J855K206J834
$$ 634478 625813 617963 611301 606480 603200 600252 597052 594343 593069 593274 594462 596317 598523 600357
61265F00357P55k91o43k41O90J937L190M138M833N499N892N373L834K102J124
$$ 600357 601112 600821 600178 599937 600627 602564 605754 609892 614725 620224 626116 631489 635323 637425 638549
61250F38549J035J278J452J694K309L222L885L798L041K202J709J406R56L73j45
$$ 638549 639584 640862 642314 644008 646317 649539 653424 657222 660263 662465 664174 665580 666536 666909 666764
61235F66764p20j639k689l209k900k203j559p28P57K721M451N567O308O941P362
$$ 666764 666044 664405 661716 658507 655607 653404 651845 651117 651874 654595 659046 664613 670921 677862 685224
61220F85224P532P810Q374Q700Q153O963O032N798N842N698N497N465N378M934
$$ 685224 692756 700566 708940 717640 725793 732756 738788 744586 750428 756126 761623 767088 772466 777400
61206G77400M288L804L527L288L102L086L270L752M751O167P481Q483R602J1036
$$ 777400 781688 785492 789019 792307 795409 798495 801765 805517 810268 816435 823916 832399 842001 853037
61192H53037J2086J2080J1398J0752R831P710M488J378q48k491l927n025n827
$$ 853037 865123 877203 888601 899353 909184 916894 921382 922760 921912 919421 915494 910469 904642
61179I04642o766p834q415q448q792r895j0847j0551r218q035p752q226r038r903
$$ 904642 897876 890042 881627 873179 864387 854492 843645 833094 823876 815841 808089 799863 790825 780922
61165G80922j0624j1073j1180j0828j0030r263r149r608r870r493q798q126p241
$$ 780922 770298 759225 748045 737217 727187 717924 708775 699167 689297 679804 671006 662880 655639
61152F55639n879m274k797j495l35O00J382K130K393J399p53k875m093m789n563
$$ 655639 649760 645486 642689 641194 640859 641459 642841 644971 647364 648763 648010 645135 641042 636253 630690
61137F30690o094n683m404k933j653n14N75J774L265M774N676O028O816Q609J0662
$$ 630690 624596 618913 614509 611576 609923 609409 609984 611758 615023 619797 625473 631501 638317 646926 657588
61122F57588J2064J3072J4419J5979J7136J8046J9472K1506K3437K4737K5447
$$ 657588 669652 682724 697143 713122 730258 748304 767776 789282 812719 837456 862903
61111H62903K5676K5497K5212K5097K4901K4173K2951K1684K0612J9609J8357
$$ 862903 888579 914076 939288 964385 989286 1013459 1036410 1058094 1078706 1098315 1116672
61100A116672J6386J3361R741O530L995J290k123n537q147j0250j2318j3745j3815
$$ 1116672 1133058 1146419 1156160 1162690 1166685 1167975 1165852 1160315 1152168 1141918 1129600 1115855 1102040
61087A102040j3225j3259j3823j3700j2566j1394j0825j0424r666q567p223n599
$$ 1102040 1088815 1075556 1061733 1048033 1035467 1024073 1013248 1002824 993158 984591 977368 971769
61075I71769l953k699j804j009m20j30M58J903L612M342L818K887K374K587L664
$$ 971769 967816 965117 963313 962304 961884 961754 962212 964115 967727 972069 975887 978774 981148 983735 987399
61060I87399N255O172N553M212L693M250M963N495O224O888O733O097O282P565
$$ 987399 992654 998826 1004379 1008591 1012284 1016534 1021497 1026992 1033216 1040104 1046837 1052934 1059216 1066781
61046A066781Q891R716J0646J1933J2901J3378J4192J5724J7268J8431J9758K1448
$$ 1066781 1075672 1085388 1096034 1107967 1120868 1134246 1148438 1164162 1181430 1199861 1219619 1241067
61034A241067K2784K3531K4620K6720K9297L1676L3960L6347L8642M0907M3367
$$ 1241067 1263851 1287382 1312002 1338722 1368019 1399695 1433655 1470002 1508644 1549551 1592918
61023A592918M5399M6128M6418M8723N4368O2416P1709Q2240R3992J06470J20260
$$ 1592918 1638317 1684445 1730863 1779586 1833954 1896370 1968079 2050319 2144311 2250781 2371041
61012B371041J37175J58267J83985K17003K61659L18956L85105M57103N36607
$$ 2371041 2508216 2666483 2850468 3067471 3329130 3648086 4033191 4490294 5026901
61003E026901O26258P26679Q41253R79324J148548J347418J570733J811622K035645
$$ 5026901 5653159 6379838 7221091 8200415 9348963 10696381 12267114 14078736 16114381
60994A6114381K149028K023645J594300R44835K81491j97053m09905l90273k10735
$$ 16114381 18263409 20287054 21881354 22826189 23107680 22910627 22500722 22110449 21899714
60985B1899714N2121K87558L41367R3358m38812j088073j644174j977878k079012
$$ 21899714 21951835 22239393 22580760 22674118 22235306 21147233 19503059 17525181 15446169
60976A5446169k008261j836412j618818j394247j185153r98840q35308o94731
$$ 15446169 13437908 11601496 9982678 8588431 7403278 6404438 5569130 4874399
60968D874399n77002m78931l96417l28054k73832k31891j99000j73063j52847
$$ 4874399 4297397 3818466 3422049 3093995 2820163 2588272 2389272 2216209 2063362
60959B063362j36304j21348j07696r6049q5976p6209o6571n7942n0583m3919l7934
$$ 2063362 1927058 1805710 1698014 1601965 1515989 1439780 1373209 1315267 1264684 1220765 1182831
60948A182831l3539l1403l1205l1885l2097l0786k8061k5212k3262k1915k0512
$$ 1182831 1149292 1117889 1086684 1054799 1022702 991916 963855 938643 915381 893466 872954
60937H72954j9290j8809j8706j8121j7033j6223j5969j5731j5086j4159j3154
$$ 872954 853664 834855 816149 798028 780995 764772 748803 733072 717986 703827 690673
60926F90673j2033j0842r811r053q508q094p693p129o467o028n914n827n605n411
$$ 690673 678640 667798 657987 648934 640426 632332 624639 617510 611043 605015 599101 593274 587669 582258
60912E82258n105m094k388j118j232k134k445j788r83o87p50q06p09l44K94P95
$$ 582258 577153 573059 570671 569553 568321 566187 563742 561954 560971 560284 559534 558728 558019 557675 557969 558764
60896E58764O93J24m48r92j749k406k348j823j993l383m990n489m893m472n213
$$ 558764 559457 559581 559133 558141 556392 553986 551638 549815 547822 544439 539449 533960 529067 524595 519382
60881E19382o775p949p893o794n481m532l919l421l072k959k938k815k626k384
$$ 519382 512607 504658 496765 489971 484490 479958 476039 472618 469546 466587 463649 460834 458208 455824
60867D55824j829q39J16M81M59Q12J817K980L892M747N721O330N847M217K233
$$ 455824 453995 453156 453272 453753 454212 455024 456841 459821 463713 468460 474181 480511 486358 490575 492808
60852D92808P81P4l22p92j098o75N37J817K412K192J407J51j403k589k787k319
$$ 492808 493589 493663 493341 492549 491451 490776 491313 493130 495542 497734 499141 499292 497889 495300 492513 490194
60836D90194k212k904l800m243m413m896n760o530o790o478n758m816l824k930
$$ 490194 487982 485078 481278 477035 472622 467726 461966 455436 448646 442168 436410 431594 427770 424840
60822D24840k294k140k540l179l518l350k954k667k521k431k438k598k816l017
$$ 424840 422546 420406 417866 414687 411169 407819 404865 402198 399677 397246 394808 392210 389394 386377
60808C86377l278l614l765l445k707j902j323r95p72n14k06K3L0r7n6L84J119
$$ 386377 383099 379485 375720 372275 369568 367666 366343 365348 364576 364062 363856 363879 363909 363812 363756 364140 365259
60791C65259J744J835J241K42n43o23p8N20P27O52P39J166J551J325L93o09q88
$$ 365259 367003 368838 370079 370321 369778 369155 369077 369597 370324 370976 371715 372881 374432 375757 376150 375541 374653
60774C74653l21M10N97J87l55n57j85O90J586J875J507J117J100R97L53l11k02
$$ 374653 374332 374742 375339 375526 375171 374614 374429 375119 376705 378580 380087 381204 382304 383301 383654 383343 383141
60757C83141L97N06M7p3M15O29R0l56J03R58J278J169J326J766K000K017K033
$$ 383141 383538 384044 384091 384018 384433 385062 385152 384796 384899 385857 387135 388304 389630 391396 393396 395413 397446
60740C97446J630K12j734k963l091k977l286l674l617l260k972k755k509k362
$$ 397446 399076 399288 397554 394591 391500 388523 385237 381563 377946 374686 371714 368959 366450 364088
60726C64088k369k248j721q75LN84N32j82q99p73K37J338J949K128J971J314L83
$$ 364088 361719 359471 357750 356875 356878 357462 357994 357812 356913 356140 356377 357715 359664 361792 363763 365077 365460
60709C65460r6J37M48L05M6J57M17M14L48N81P94M40k62n78l20j2l1k57m72n52
$$ 365460 365364 365501 365949 366254 366300 366457 366874 367288 367636 368217 369011 369451 369189 368611 368291 368279 368248 367991 367519 366967
60689C66967l30K44P74P84L47o4k03j12K35Q21J265J236J029J241J845K244K146
$$ 366967 366637 366881 367655 368439 368786 368722 368519 368407 368642 369463 370728 371964 372993 374234 376079 378323 380469
60672C80469J780J383J134J440K456L282K589L22k018l130l174k979k759k242
$$ 380469 382249 383632 384766 386206 388662 391944 394533 394855 392837 389707 386533 383554 380795 378553
60658C78553j427n81P0K65k15r37q48M28J826K101J470J209J880K824L337L431
$$ 378553 377126 376545 376615 376880 376665 375728 374880 375308 377134 379235 380705 381914 383794 386618 389955 393386
60642C93386L272K602J165p15k391l486m003m066l787l259k504j579p82n51r51
$$ 393386 396658 399260 400425 399710 397319 393833 389830 385764 381977 378718 376214 374635 373853 373302 372351
60627C72351j360r88K80J666K218J720P91J30j88n57j122j495j235m01N08J006
$$ 372351 370991 370003 370283 371949 374167 375887 376678 376808 376620 376063 374941 373446 372211 371810 372318 373324
60611C73324R92P26N84P41J034J183J104R49Q18O94O42Q41J281J590J371O77P7
$$ 373324 374316 375042 375626 376367 377401 378584 379688 380637 381455 382149 382791 383632 384913 386503 387874 388551 388628
60594C88628K12J222K497L097K614J575Q65Q06J024J088R15O10K98J51K41L19
$$ 388628 388840 390062 392559 395656 398270 399845 400710 401516 402540 403628 404543 405153 405451 405602 405843 406162
60578D06162J48j4K91Q82J075Q28J028K256L878M953N539O351P553Q662R530J0487
$$ 406162 406310 406296 406587 407469 408544 409372 410400 412656 416534 421487 427026 433377 440930 449592 459122 469609
60562D69609J1375J1268R546O823M265K255K31k166m316n292n020m283l570k528
$$ 469609 480984 492252 501798 508621 512886 515141 515372 513206 508890 503598 498578 494295 490725 488197
60548D88197q42Q96J900K412L417N189O955Q159R204J0600J2195J3711J5312J7099
$$ 488197 487355 488251 490151 492563 495980 501169 508124 516283 525487 536087 548282 561993 577305 594404
60534E94404J8660J9734K0663K1500K1273J9013J5005J0226N020o41o018r946
$$ 594404 613064 632798 653461 674961 696234 715247 730252 740478 745498 744857 738839 728893
60522G28893j2274j3870j5131j5534j4817j3565j2227j0530q317o215m905m183
$$ 728893 716619 702749 687618 672084 657267 643702 631475 620945 612628 606413 601508 597325
60510E97325l295j825P4J986L564M924O716R411J2481J5019J7222K0330K4830
$$ 597325 594030 592205 592279 594265 597829 602753 609469 618880 631361 646380 663602 683932 708762
60497G08762K9628L3599L6972M0386M3316M4531M3809M2117M0195L7862L4798
$$ 708762 738390 771989 808961 849347 892663 937194 981003 1023120 1063315 1101177 1135975
60486A135975L1154K7122K2530J7140J0996M182l477j2254k2153l2691m2801n1021
$$ 1135975 1167129 1194251 1216781 1233921 1244917 1249099 1245622 1233368 1211215 1178524 1135723 1084702
60474A084702n6192n8168n7654n5380n1671m6869m1716l6954l2724k8633k4467
$$ 1084702 1028510 970342 912688 857308 805637 758768 717052 680098 647374 618741 594274
60463E94274k0587j7559j5530j4138j2939j1769j0651r576q563p753p156o428
$$ 594274 573687 556128 540598 526460 513521 501752 491101 481525 472962 465209 458053 451625
60451D51625n208l735k744k666l135l471l372k996k582k256j990j647j057l68
$$ 451625 446417 442682 439938 437272 434137 430666 427294 424298 421716 419460 417470 415823 414766 414398
60437D14398qk02o07p31n46m76p98j350j787j900j641j101n55l51n53p89n96O5
$$ 414398 414390 414188 413581 412850 412304 411828 411030 409680 407893 405993 404352 403251 402696 402345 401792 401003 400407 400472
60419D00472P00P74L19o9J52R07J649J962J906J798J843J999K050J814J398J190
$$ 400472 401172 401946 402265 402196 402348 403255 404904 406866 408772 410570 412413 414412 416462 418276 419674 420864
60403D20864J477K035K350K181J723J292J135J486K389L360L679L222K621K388
$$ 420864 422341 424376 426726 428907 430630 431922 433057 434543 436932 440292 443971 447193 449814 452202
60389D52202K260J865J542J943K934L610L390K632K023J924K387L303M161M125
$$ 452202 454462 456327 457869 459812 462746 466356 469746 472378 474401 476325 478712 482015 486176 490301
60375D90301K932J460R05J418J990J770R63L41K91O65J164J477J286O04K3J72
$$ 490301 493233 494693 495598 497016 499006 500776 501739 502080 502371 503036 504200 505677 506963 507567 507590 507762
60359E07762R35J628J969K380L166M012M547M962N598O242O432O202N925N499
$$ 507762 508697 510325 512294 514674 517840 521852 526399 531361 536959 543201 549633 555835 561760 567259
60345E67259M328K255kj632k580l357m313n334o097o365o146n755n599n805o043
$$ 567259 571587 573842 573840 572208 569628 566271 561958 556624 550527 544162 538016 532261 526662 520857 514814
60330E14814n872n212m417l872l627l387k963k563k534k818k933k625k146j724
$$ 514814 508942 503730 499313 495441 491814 488427 485464 482901 480367 477549 474616 471991 469845 468121
60316D68121j048K24J735K760L189L646M605N969P525R228J0739J1310J0574R135
$$ 468121 467073 467297 469032 471792 474981 478627 483232 489201 496726 505954 516693 528003 538577 547712
60302E47712P986P523P404P026N849L598O00k222m220n738p545r591j0856j0575
$$ 547712 555698 563221 570625 577651 583500 587098 587698 585476 581256 575518 567973 558382 547526 536951
60288E36951r139p576o448n579m663l648k619j641r31q27j343j909j880j309q83
$$ 536951 527812 520236 513788 508209 503546 499898 497279 495638 494707 493880 492537 490628 488748 487439 486556
60273D86556j102j790k507l053l402l488l311l057k820k437j898j567j640j642
$$ 486556 485454 483664 481157 478104 474702 471214 467903 464846 462026 459589 457691 456124 454484 452842
60259D52842r81J18P60M80l01r38j210j205r42l69M99J513K384K802K762K604
$$ 452842 451861 451979 452739 453219 452918 451980 450770 449565 448623 448254 448753 450266 452650 455452 458214 460818
60243D60818K505K211J620J232J390J461O74m35n12O08J425Q27l85o25N11K167
$$ 460818 463323 465534 467154 468386 469776 471237 471911 471476 470964 471572 472997 473824 473439 472814 473325 475492
60227D75492L530M420M939N189N269N113M573L984M163N426O976P806P858P738
$$ 475492 479022 483442 488381 493570 498839 503952 508525 512509 516672 522098 529074 536880 544738 552476
60213E52476P745P860Q293R253J0332J0889J0964J1108J1302J0903R780Q717Q402
$$ 552476 560221 568081 576374 585627 595959 606848 617812 628920 640222 651125 660905 669622 678024
60200F78024Q623Q790Q687Q347P651O618N709N354N283M790L637K291J229M04
$$ 678024 686647 695437 704124 712471 720122 726740 732449 737803 743086 747876 751513 753804 755033 755437
60186G55437m50j284j817k037k285k785l359l728l954m299m755m979m770m359
$$ 755437 754987 753703 751886 749849 747564 744779 741420 737692 733738 729439 724684 719705 714935 710576
60172G10576m144m284m602m760m491l825l143k956l502m549n478n597m644l226
$$ 710576 706432 702148 697546 692786 688295 684470 681327 678371 674869 670320 664842 659245 654601 651375
60158F51375k444k758l416l356k492j566r73m19K85Q37J033J078J062P50J82j47
$$ 651375 648931 646173 642757 639401 636909 635343 634370 633951 634236 635073 636106 637184 638246 638996 639178 639031
60142F39031p6q7m00m22L11J231J514J348J618K533L419L814M044M531N101N279
$$ 639031 638955 638868 638468 638046 638357 639588 641102 642450 644068 646601 650020 653834 657878 662409 667510 672789
60126F72789M892M144L364K790K560K762L439M477N501O132O457O962P847Q742
$$ 672789 677681 681825 685189 687979 690539 693301 696740 701217 706718 712850 719307 726269 734116 742858
60112G42858R296R715J0353J0954J0751R349P317N810N577O208O450N493L774
$$ 742858 752154 761869 772222 783176 793927 803276 810593 816403 821980 828188 834638 840131 843905
60099H43905K225R70n13k121k987k818k463k643l012l093l374m598o459p943q597
$$ 843905 846130 847100 846587 844466 841479 838661 836198 833555 830543 827450 824076 819478 813019 805076 796479
60084G96479q750q746q711q836r244r669r801r652r188q111o659n926o500p266
$$ 796479 787729 778983 770272 761436 752192 742523 732722 723070 713882 705771 699112 693186 686686 679420
60070F79420o680m998m024m729o203p082o941o068m856l811l340l245l023k822
$$ 679420 672740 667742 663718 658989 652786 645704 638763 632695 627839 624028 620688 617443 614420 611598
60056F11598l272m195m460l542k327j821j822j554r28l53K04J083J984K132J465
$$ 611598 608326 604131 599671 596129 593802 591981 590159 588605 587677 587324 587528 588611 590595 592727 594192
60041E94192R95J644L113M271M526M372M563N005M874L732K187J191R77R90O86
$$ 594192 595187 596831 599944 604215 608741 613113 617676 622681 627555 631287 633474 634665 635642 636632 637318
60026F37318Q1m90q92j394k437m091n756o692o897p092p696q280q282p758p111
$$ 637318 637399 636909 636017 634623 632186 628095 622339 615647 608750 601658 593962 585682 577400 569642 562531
60011E62531o466n781n134m441l390k188j822k891m539n304m765l659k764k343
$$ 562531 556065 550284 545150 540709 537319 535131 533309 530418 525879 520575 515810 512151 509387 507044
59997E07044k378k495j930m46R64J225P89J073K466L931M661M974N383N774N856
$$ 507044 504666 502171 500241 499795 500759 501984 502773 503846 506312 510243 514904 519878 525261 531035 536891
59982E36891N668N290M790M534M835N194M658L143J521L62n88j558k411l322m742
$$ 536891 542559 547849 552639 557173 562008 567202 571860 575003 576524 576886 576298 574740 572329 569007 564265
59967E64265o306o801n775m330l713l875l955l451k371r16M10R44O54L40N93J110
$$ 564265 557959 551158 545383 541053 537340 533465 529510 526059 523688 522772 523182 524126 524780 525120 525713 526823
59951E26823J358J339J310J360J597K191K873L049K722K581K859K933K502K272
$$ 526823 528181 529520 530830 532190 533787 535978 538851 541900 544622 547203 550062 552995 555497 557769
59937E57769K821L566L612K968K219J571R53N75P31J382K469M094N940P051O864
$$ 557769 560590 564156 567768 570736 572955 574526 575479 576054 576785 578167 580636 584730 590670 597721 604585
59922F04585N940N129M561M033L704L731L805L733L958M742N443N385M926M802
$$ 604585 610525 615654 620215 624248 627952 631683 635488 639221 643179 647921 653364 658749 663675 668477
59908F68477M940M785M339L877L013J160j260l093l925m382m958n428n525n383
$$ 668477 673417 678202 682541 686418 689431 690591 689331 686238 682313 677931 672973 667545 662020 656637
59894F56637n165m760m070l088j728l5J557K616L297M025M794N252N374N459N598
$$ 656637 651472 646712 642642 639554 637826 637791 639348 641964 645261 649286 654080 659332 664706 670165 675763
59879F75763N700N939O564P325P637P379O962O598N950M653K811R32m52j144j475
$$ 675763 681463 687402 693966 701291 708928 716307 723269 729867 735817 740470 743281 744213 743761 742617 741142
59864G41142j980k766l381l553l566l677l631l173k569k135j670q97rP89J850
$$ 741142 739162 736396 733015 729462 725896 722219 718588 715415 712846 710711 709041 708144 708135 708924 710774
59849G10774L454N086O014O289O361O076M853K734L41j942m004n391n507m440
$$ 710774 714228 719314 725328 731617 737978 744054 748907 751641 751982 750040 746036 740645 735138 730698
59835G30698k845j181K39O82m93k760m743n683n827n460m500l182k163j714j532
$$ 730698 727853 726672 726911 727593 727100 724340 719597 713914 708087 702627 698127 694945 692782 691068 689536
59820F89536j519j932k560k685k123j428p87L74K171L569L624K751K044J783J331
$$ 689536 688017 686085 683525 680840 678717 677289 676502 676876 679047 682616 686240 688991 691035 692818 694149
59805F94149J49j643l459m549m399l308k344k243k658k856k817l077l734m291
$$ 694149 694298 692655 689196 684647 680248 676940 674596 672353 669695 666839 664022 660945 657211 652920
59791F52920m422m332m202l880l345l046l375l992m108l387k253j277o33k93l42
$$ 652920 648498 644166 639964 636084 632739 629693 626318 622326 618218 614831 612578 611301 610668 610375 610033
59776F10033p05q82m32L74Q83R81J080J334J591K169L724N931P273O876N777N552
$$ 610033 609328 608446 608014 608388 609271 610252 611332 612666 614257 616426 620150 626081 633354 640230 646007 651559
59760F51559O308O985P161P412Q071Q826R599J0748J2166J3011J2795J2017J1390
$$ 651559 657867 664852 672013 679425 687496 696322 705921 716669 728835 741846 754641 766658 778048
59747G78048J0942J0243R050P417N512L548J701m5j711l025l592l342k627j914
$$ 778048 788990 799233 808283 815700 821212 824760 826461 826416 824705 821680 818088 814746 812119 810205
59733H10205j680k278l418m072l490k148j097n97j65K65K13k46l11K98Q48P80
$$ 810205 808525 806247 802829 798757 795267 793119 792022 791425 791260 791525 791738 791492 791181 791479 792327 793107
59717G93107O60J377K909M386N031M656L645K895L301M849O469P167P131P373
$$ 793107 793767 795144 798053 802439 807470 812126 815771 818666 821967 826816 833285 840452 847583 854956
59703H54956Q502J0198J1737J2719J3268J3724J4244J4648J4722J4454J3929J3187
$$ 854956 863458 873656 885393 898112 911380 925104 939348 953996 968718 983172 997101 1010288
59691A010288J2337J1568J0751R370P305N331M212L556K347M70j174k152l116
$$ 1010288 1022625 1034193 1044944 1054314 1061619 1066950 1071162 1074718 1077065 1077535 1076361 1074209 1071093
59678A071093m604o115o953p393q252r662j0825j0988j0215r242q700q502p949
$$ 1071093 1066489 1060374 1053421 1046028 1037776 1028114 1017289 1006301 996086 986844 978144 969642 961693
59665I61693o541m605k866j533j77J596L748O087Q462J0649J2513J4180J5714
$$ 961693 955152 950547 947681 946148 945971 947567 951315 957402 965864 976513 989026 1003206 1018920
59652A018920J6707J6775J6311J6025J5702J4314J1432P721L716r21o354j1633
$$ 1018920 1035627 1052402 1068713 1084738 1100440 1114754 1126186 1133907 1137623 1136702 1130348 1118715
59640A118715j5600j8303k0659k3017k4808k5475k5100k4053k2631k1112j9741
$$ 1118715 1103115 1084812 1064153 1041136 1016328 990853 965753 941700 919069 897957 878216
59629H78216j8441j6782j4527j2126j0487j0144j0734j1421j1808j2162j2764
$$ 878216 859775 842993 828466 816340 805853 795709 784975 773554 761746 749584 736820
59618G36820j3386j3674j3679j3618j3452j3052j2493j1731j0311q028n607m012
$$ 736820 723434 709760 696081 682463 669011 655959 643466 631735 621424 613396 607789 603777
59606F03777l265k629j822j172p31j64M11M33mk2O97J296J026L35J09M40P57P68
$$ 603777 600512 597883 596061 594889 594158 593994 594405 594838 594834 594812 595509 596805 597831 598166 598275 598715 599472 600240
59588F00240N61J03p62j923k972l561l642l512l583l896l919l255k385k175k675
$$ 600240 600801 600904 600142 598219 595247 591686 588044 584532 580949 577053 573134 569879 567494 565319 562644
59573E62644l103l010k711k412j835j024o48j012j448j278o86k18O0L16M66N33
$$ 562644 559541 556531 553820 551408 549573 548549 547901 546889 545441 544163 543477 543259 543319 543635 544101 544634
59557E44634R50J831K411J892N75m46n13J80J158K084K785L328M083N352O961
$$ 544634 545584 547415 549826 551718 552293 551847 551334 551514 552672 554756 557541 560869 564952 570304 577265
59542E77265Q443R520J0294J1083J2162J3524J5010J6855J9595K2701K3634J9620
$$ 577265 585708 595228 605522 616605 628767 642291 657301 674156 693751 716452 740086 759706
59530G59706J0870J071n897r000r494q581o707m421k532j360o57l06m97j211k106
$$ 759706 770576 771647 765750 756750 747256 738675 731968 727547 725015 723655 722998 722692 722195 720984 718878
59515G18878k891l472l840m173m869o092p463q467r004r268r334r157q755q111
$$ 718878 715987 712515 708675 704502 699633 693541 686078 677611 668607 659339 650005 640848 632093 623982
59501F23982p174o143n415n024m578l922l373k991k163m81J475K782L292L567
$$ 623982 616808 610665 605250 600226 595648 591726 588353 585362 583199 582718 584193 586975 590267 593834
59487E93834M025M689N502O308O741O640O506P027Q104Q804Q337O914N464M683
$$ 593834 597859 602548 608050 614358 621099 627739 634245 641272 649376 658180 666517 673431 678895 683578
59473F83578M383L884K951J981J123j96k268m144m533l507k376j963j982k081
$$ 683578 687961 691845 694796 696777 697900 697704 695436 691292 686759 683252 680876 678913 676931 674850
59459F74850k254k088q51J203K821L550M380N958P430P925P987Q407Q683P865
$$ 674850 672596 670508 669657 670860 673681 677231 681611 687569 694999 702924 710911 719318 728001 735866
59445G35866O194M604L148J227j070l047m655o458q505j0061j0545r974q651p058
$$ 735866 742060 746664 749812 751039 749969 746922 742267 735809 727304 717243 706698 696724 688073 681015
59431F81015n853n357n137m577l594k391j047K67J198J944L371N799Q370J0270
$$ 681015 675162 669805 664668 660091 656497 654106 653059 653326 654524 656468 659839 665638 674008 684278
59417F84278J1756J3247J4346J4772J5333J6820J8852K0944K3622K6674K7218
$$ 684278 696034 709281 723627 738399 753732 770552 789404 810348 833970 860644 887862
59406H87862K1907J1093r77j0228j5448j7030j5336j1048n457O24P062J2671J4517
$$ 887862 909769 920862 919885 909657 894209 877179 861843 850795 845338 845962 853024 865695 880212
59393H80212J0246P81j0015j8062k1396k0694j8261j6092j4434j2284r173n859
$$ 880212 890458 891239 881224 863162 841766 821072 802811 786719 772285 760001 750828 744969
59381G44969l265j535l93L07P74J403K244K800K701K306K263K716L111K767J626
$$ 744969 741704 740169 739776 740083 740857 742260 744504 747304 750005 752311 754574 757290 760401 763168 764794
59366G64794N54O11J853L165L615L523L748M390M974N423O040O790P410Q110R335
$$ 764794 765348 765959 767812 770977 774592 778115 781863 786253 791227 796650 802690 809480 816890 825000 834335
59351H34335J1000J2662J4184J5553J6440J6829J7634J9595K1786K2504K1596
$$ 834335 845335 857997 872181 887734 904174 921003 938637 958232 980018 1002522 1024118
59340A024118K0613K0606K0939K0508J8967J6486J3312R964O989M221J085k342
$$ 1024118 1044731 1065337 1086276 1106784 1125751 1142237 1155549 1165513 1172502 1176723 1177808 1175466
59328A175466n401q073j0953j3949j6133j7234j8042j8916j9150j8384j7522j7437
$$ 1175466 1170065 1161992 1151039 1137090 1120957 1103723 1085681 1066765 1047615 1029231 1011709 994272
59316I94272j7730j7680j7582j8116j8961j9053j8001j6484j5276j4417j3331
$$ 994272 976542 958862 941280 923164 904203 885150 867149 850665 835389 820972 807641
59305H07641j1527r158o940n303l746j465J552M570P017Q498Q098M728j390q349
$$ 807641 796114 786956 780016 774713 770967 769502 771054 775624 782641 791139 799237 803965 802575 794226
59291G94226j4016j7286j8016j6661j4333j2212j0450q305n634l349k047j096
$$ 794226 780210 762924 744908 728247 713914 701702 691252 682947 677313 673964 671917 670821
59279F70821L51K242M084N780P339Q386Q725Q943R867J1646J3744J5482J6333
$$ 670821 671172 673414 677498 683278 690617 699003 707728 716671 726538 738184 751928 767410 783743
59266G83743J6161J5440J4796J4130J2820J0843Q921P247N049J924j262l500m929
$$ 783743 799904 815344 830140 844270 857090 867933 876854 884101 889150 891074 889812 886312 881383
59253H81383o208p297p684p462p279p382p383o919o054n037m073l270k560j731
$$ 881383 875175 867878 860194 852732 845453 838071 830688 823769 817715 812678 808605 805335 802775 801044
59239H01044p53Q0M22J82m07q49p10k03k40j322k677l193l015l271m295n239n590
$$ 801044 800291 800371 800793 800975 800568 799719 799009 798806 798566 797244 794567 791374 788359 785088 780793 775554 769964
59222G69964n960o921q064q758r021r074q708p768o645n814n328n079n004m672
$$ 769964 764004 757083 749019 740261 731240 722166 713458 705690 699045 693231 687903 682824 677820 673148
59208F73148l559j996j160j518k115j884r32M9J012K352M019N466O259O283N748
$$ 673148 669589 667593 666433 664915 662800 660916 659984 660033 661045 663397 667416 672882 679141 685424 691172
59193F91172N212N265N919O758P727R007J0144J0321R768R676J0334J0509R405
$$ 691172 696384 701649 707568 714326 722053 731060 741204 751525 761293 770969 781303 791812 801217
59180H01217P989P403P165O138M396K768J206r89l590n480o236o636p408q358
$$ 801217 809206 816609 823774 829912 834308 837076 838282 837293 833703 828223 821987 815351 807943 799585
59166G99585q867q576p474n888m429l606l381l422l571l844m191m517m796m953
$$ 799585 790718 782142 774668 768780 764351 760745 757364 753942 750371 746527 742336 737819 733023 728070
59152G28070n005n374o513q049q895q565p753p270p121p007o923o758o010m743
$$ 728070 723065 717691 711178 703129 694234 685669 677916 670646 663525 656518 649595 642837 636827 632084
59138F32084m109n040o800p654o759m828l138k443k544k538j638n1J326K164K979
$$ 632084 627975 622935 616135 608481 601722 596894 593756 591313 588769 586231 584593 584542 585868 588032 591011
59123E91011M023M759M946N288O367P714Q667R329J0008J0432J0366J0274J0490
$$ 591011 595034 599793 604739 610027 616394 624108 632775 642104 652112 662544 672910 683184 693674
59110F93674J0388R303P662O286N180L983L046K890L052K612J557O23Lp63j782
$$ 693674 704062 713365 721027 727313 732493 736476 739522 742412 745464 748076 749633 750256 750259 749496 747714
59095G47714k660l261l699l724l026k046j673k070k505k350j631p51j54j50n99
$$ 747714 745054 741793 738094 734370 731344 729298 727625 725555 723050 720700 719069 718318 718164 718014 717415
59080G17415r72j168j781l105m425m969n037n308n606n279m413l659l168k681
$$ 717415 716443 715275 713494 710389 705964 700995 695958 690650 685044 679765 675352 671693 668525 665844
59066F65844k402k811l656m110l902l469l156l004l225l984m786m918m472m171
$$ 665844 663442 660631 656975 652865 648963 645494 642338 639334 636109 632125 627339 622421 617949 613778
59052F13778m203m025l343k533k010j763j601j351q93l96l63r32j427j174m64
$$ 613778 609575 605550 602207 599674 597664 595901 594300 592949 592056 591660 591297 590365 588938 587764 587300
59037E87300m0%J09L67M73M76O58Q18M40l58p41r0J414L129M468N280O052P433
$$ 587300 587260 587260 587369 587736 588209 588685 589343 590161 590601 590243 589502 589412 590826 593955 598423 603703 609755 617188
59019F17188R236J0393J0304R665R344R111Q204O574M657K528K56j384j660j096
$$ 617188 626424 636817 647121 656786 666130 675241 683445 690019 694676 697204 697460 696076 694416 693320
59005F93320r21j441j881j649q48L11J655K761L259L371L432L212K501J881K058
$$ 693320 692399 690958 689077 687428 686580 686891 688546 691307 694566 697937 701369 704581 707082 708963 711021
58990G11021K695K897K578K315K136J552O21n0k93m04k89M20J547K611L783N649
$$ 711021 713716 716613 719191 721506 723642 725194 725815 725765 725472 725068 724779 725199 726746 729357 733140 738789
58974G38789Q092J0395J2318J4087J5544J6331J6756J7319J7530J6469J4477J3016
$$ 738789 746881 757276 769594 783681 799225 815556 832312 849631 867161 883630 898107 911123
58962I11123J2618J2257J1034R299P653N907L593P46k267n121p465r123j0517
$$ 911123 923741 935998 947032 956331 963984 969891 973484 974230 971963 966842 959377 950254 939737
58949I39737j2313j4490j6361j7502j7954j7609j6306j4602j3465j3011j2327
$$ 939737 927424 912934 896573 879071 861117 843508 827202 812600 799135 786124 773797
58938G73797j0836r044p580o317m851l380k534k487k580j909l67J028J247O33
$$ 773797 762961 753917 746337 740020 735169 731789 729255 726768 724188 722279 721912 722940 724187 724820
58924G24820M90J173J560R64L25O65J404J469J152J457K272K719K822L297L991
$$ 724820 725310 726483 728043 729007 729332 729997 731401 732870 734022 735479 737751 740470 743292 746589 750580
58909G50580M082L646L555M008M597N628P829J0707J2797J3685J4355J5360J6135
$$ 750580 754662 758308 761863 765871 770468 776096 783925 794632 807429 821114 835469 850829 866964
58896H66964J6332J6437J6688J6616J6030J5380J4911J4523J4618J5892J8120
$$ 866964 883296 899733 916421 933037 949067 964447 979358 993881 1008499 1024391 1042511
58885A042511K0274K1847K2958K3214K1927J9551J7452J6000J4305J2022R971
$$ 1042511 1062785 1084632 1107590 1130804 1152731 1172282 1189734 1205734 1220039 1232061 1242032
58874A242032Q583P160N110K695K00k398m594n577n641o091p342q463q983r735
$$ 1242032 1250615 1257775 1262885 1265580 1265780 1263382 1258788 1253211 1247570 1241479 1234137 1225674 1216691 1206956
58860A206956j1329j3133j4459j5565j6831j8050j9007j9821k0266j9908j9154
$$ 1206956 1195627 1182494 1168035 1152470 1135639 1117589 1098582 1078761 1058495 1038587 1019433
58849A019433j8975j9273j8943j7797j6947j6759j6112j4452j3008j2948j3639
$$ 1019433 1000458 981185 962242 944445 927498 910739 894627 880175 867167 854219 840580
58838H40580j3743j3001j1940j0846r916r508r392q649p043n553m886m445l520
$$ 840580 826837 813836 801896 791050 781134 771626 762234 753585 746542 740989 736103 731658 728138
58825G28138k492j939j463k92J527L310M608N344N595N642N751N732N369N125
$$ 728138 725646 723707 722244 721952 723479 726789 731397 736741 742336 747978 753729 759461 764830 769955
58811G69955N443N596M464K499J327J260R16l69j544j874k210l247m219m403m435
$$ 769955 775398 780994 785458 787957 789284 790544 791460 791091 789547 787673 785463 782216 777997 773594 769159
58796G69159m978n419n119m770n142n545m851l270j884r83j5J309K781M234N594
$$ 769159 764181 758762 753643 748873 743731 738186 733335 730065 728181 727198 727183 728492 731273 735507 741101
58781G41101O837Q224J0128J2300J4020J5085J5803J5978J5005J3053J0901Q473
$$ 741101 747938 756162 766290 778590 792610 807695 823498 839476 854481 867534 878435 886908
58769H86908M996Q12k624m942p320j0225j2513j3468j3967j4682j4907j4161j3268
$$ 886908 891904 892716 890092 885150 877830 867605 855092 841624 827657 812975 798068 783907 770639
58756G70639j2754j1829j0124q742q314p666n890m130l753m134l910l173k775
$$ 770639 757885 746056 735932 727190 718876 711210 705320 701190 697437 693303 689393 686220 683445
58743F83445k514j693n47L03J064K088K945L316L835M800N210M419L629M190N365
$$ 683445 680931 679238 678691 678994 680058 682146 685091 688407 692242 697042 702252 706671 710300 714490 719855
58728G19855N415M073K518J547J141J245J655J751J352J221J887K814L594M744
$$ 719855 725270 729343 731861 733408 734549 735794 737449 739200 740552 741773 743660 746474 750068 754812
58714G54812O403P511P405O959O929O556N113L478K599J748j14k437m246n990
$$ 754812 761215 768726 776131 783090 790019 796575 801688 805166 807765 809513 809399 806962 802716 796726
58700G96726q516j1232j3130j4635j6662j8646j9319j8691j7664j6418j4754j3173
$$ 796726 788210 776978 763848 749213 732551 713905 694586 675895 658231 641813 627059 613886
58688F13886j2086j0755q618o658n916n650m728l761l901m495m013k605j633j286
$$ 613886 601800 591045 582427 575769 569853 564203 559475 555714 551813 547318 543305 540700 539067 537781
58674E37781o82J83O18R30K010L460M054L769L749M501N680P270R313J0872J0857
$$ 537781 537099 537282 537900 538830 540840 544300 548354 552123 555872 560373 566053 573323 582636 593508 604365
58659F04365R535P773N369J770k188n012o635q028r210r347q503p634p068o476
$$ 604365 613900 621673 627042 628812 626624 621612 614977 606949 597739 588392 579889 572255 565187 558711
58645E58711n987n889n722n035m412m386m116k701r44r0K93J233K139J775P11
$$ 558711 552724 546835 541113 536078 531666 527280 523164 520463 519519 519429 519722 520955 523094 524869 525580
58630E25580N62J238J296O04L80P47N72k98p21k81K75O85J401K150K080J418J304
$$ 525580 526142 527380 528676 529280 529660 530407 530979 530681 529960 529679 529954 530639 532040 534190 536270 537688 538992
58613E38992J973K720L515M907O443O868O038N050M473L967L489L370L321K752
$$ 538992 540965 543685 547200 552107 558550 565418 571456 576506 580979 584946 588435 591805 595126 597878
58599E97878J929J503J231N33k06l21k83q79j564j236j2J328K863M870O496P035
$$ 597878 599807 601310 602541 603074 602868 602547 602264 601385 599821 598585 598573 599901 602764 607634 614130 621165
58583F21165P626R591J1971J2920J2670J2790J3234J2781J1747J1504J1671J0602
$$ 621165 628791 638382 650353 663273 675943 688733 701967 714748 726495 737999 749670 760272
58571G60272Q516P467Q034Q740Q862R360J0705J2193J3711J5968J8730K0913K2560
$$ 760272 768788 776255 784289 793029 801891 811251 821956 834149 847860 863828 882558 903471 926031
58558I26031K4521K6150K5654K2973J9978J7503J4399R927M963M33l544o606q190
$$ 926031 950552 976702 1002356 1025329 1045307 1062810 1077209 1087136 1092099 1092532 1088988 1082382 1074192
58545A074192q796r440r752q586o499n571o710r044j1945j5520j9097k1386k2370
$$ 1074192 1065396 1055956 1046204 1037618 1031119 1025548 1018838 1009794 997849 982329 963232 941846 919476
58532I19476k3046k3374k2388k0317j8488j7181j5526j3409j1505r709p598o029
$$ 919476 896430 873056 850668 830351 811863 794682 779156 765747 754242 744533 736935 730906
58520G30906o087o876o656n678n428n710n146m033l798m036l112j423r48j680
$$ 730906 724819 717943 711287 705609 700181 694471 689325 685292 681494 677458 674346 672923 671975 670295
58506F70295j730q87r05k058k574j832j016m09R29K555K757J581P33M72k82p90
$$ 670295 668565 667678 666773 664715 662141 660309 659293 658884 659813 662368 665125 666706 667439 667911 667629 666839
58490F66839R29M186N943N476N147O054O731O798Q015J0627J2446J2746J3483
$$ 666839 667768 671954 677897 683373 688520 694574 701305 708103 716118 726745 739191 751937 765420
58477G65420J5425J6651J6249J5965J6652J6399J3885J0449P311L718o56m385
$$ 765420 780845 797496 813745 829710 846362 862761 876646 887095 894406 898124 897468 893083
58465H93083o774q889j0817j0852q655o298m955l372p04K064M493P440J0508J1916
$$ 893083 886309 877420 866603 855751 847096 840798 835843 832471 831767 833831 838324 845764 856272 868188
58451H68188J1812J2358J3682J3275J0435P461N206J490m464r894j2658j3947
$$ 868188 880000 892358 906040 919315 929750 937211 942417 943907 939443 929549 916891 902944
58439I02944j5062j5071j3577j2255j1722j0251p298m889l833k245M44J920J371
$$ 902944 887882 872811 859234 846979 835257 825006 817708 812819 808986 806741 807185 809105 810476
58426H10476J523M048O770P717Q227R552J0050Q470O480N436L876P75k105l503
$$ 810476 811999 816047 822817 830534 838761 848313 858363 866833 873313 878749 882625 883400 881295 877792
58412H77792m875p022p973o754n706o485p245o324n251n403n244l565k023j805
$$ 877792 872917 865895 857922 851168 845462 838977 831732 825408 820157 814754 809510 805945 803922 802117
58398H02117j311K59P50p96j607K57K492K723K378L335M320L878L419M131M349
$$ 802117 800806 801065 801815 801019 799412 799669 802161 804884 807262 810597 814917 818795 822214 826345 830694
58383H30694L055K431L874N135M476L897N090O182N778O157Q813J0922J0058Q479
$$ 830694 833749 836180 840054 845189 849665 853562 858652 864834 870612 876769 885582 896504 906562 915041
58369I15041Q889R798R161Q640J0109J1592J0953J0059J1096J2341J1723J1000
$$ 915041 923930 933728 942889 951529 961638 973230 984183 994242 1005338 1017679 1029402 1040402
58357A040402J2210J3518J2775J1577J1596J0743P292L950L329L283J309m14P34
$$ 1040402 1052612 1066130 1078905 1090482 1102078 1112821 1120113 1124063 1127392 1130675 1131984 1131570 1132304
58344A132304K541K060J220L030N742O151N450O539Q640R598J0409J2608J4448
$$ 1132304 1134845 1136905 1138125 1141155 1146897 1153048 1158498 1165037 1173677 1183275 1193684 1206292 1220740
58331A220740J4369J4773J7550J9708J8331J5926J5744J5846J3288J0002Q876
$$ 1220740 1235109 1249882 1267432 1287140 1305471 1321397 1337141 1352987 1366275 1376277 1385153
58320A385153Q118N256K654L115M136K585R78K861O076P032P497J0574J4058J4529
$$ 1385153 1393271 1398527 1401181 1404296 1408432 1411017 1411995 1414856 1420932 1427964 1435461 1446035 1460093 1474622
58306A474622J4030J5919J8201J7746J6923J8976K1222K0089J8392K0126K2567
$$ 1474622 1488652 1504571 1522772 1540518 1557441 1576417 1597639 1617728 1636120 1656246 1678813
58295A678813K1421J9266K0656K3253K2509K0732K2655K6115K6223K4818K6615
$$ 1678813 1700234 1719500 1740156 1763409 1785918 1806650 1829305 1855420 1881643 1906461 1933076
58284A933076K9815K9830K8522L0308L2937L1916L0156L3174L8373L9426L7708
$$ 1933076 1962891 1992721 2021243 2051551 2084488 2116404 2146560 2179734 2218107 2257533 2295241
58273B295241L8981M2179M2289M1064M3888M9023N0810N0580N3511N7853N8391
$$ 2295241 2334222 2376401 2418690 2459754 2503642 2552665 2603475 2654055 2707566 2765419 2823810
58262B823810N7436O0940O6871O8986O8924P2701P8447P9733P7920P9037Q1697
$$ 2823810 2881246 2942186 3009057 3078043 3146967 3219668 3298115 3377848 3455768 3534805 3616502
58251C616502Q0566P8304Q1226Q6789Q8475Q9144R5863J05623J10558J13186J21543
$$ 3616502 3697068 3775372 3856598 3943387 4031862 4121006 4216869 4322492 4433050 4546236 4667779
58240D667779J33424J40921J46353J57632J72060J81443J88892K03217K21080
$$ 4667779 4801203 4942124 5088477 5246109 5418169 5599612 5788504 5991721 6212801
58231F212801K32946K42214K59411K82009K99830L15836L40667L71182L96259
$$ 6212801 6445747 6687961 6947372 7229381 7529211 7845047 8185714 8556896 8953155
58222H953155M19305M52296M92441N28717N66350O19245O83383P44838Q08951
$$ 8953155 9372460 9824756 10317197 10845914 11412264 12031509 12714892 13459730 14268681
58213A4268681Q92838R94404J099611J215177J361400J538131J732949J957719
$$ 14268681 15161519 16155923 17255534 18470711 19832111 21370242 23103191 25060910
58205B5060910K240141K585618K988033L471902M081093M834436N738415O828076
$$ 25060910 27301051 29886669 32874702 36346604 40427697 45262133 51000548 57828624
58197E7828624Q135325R628333J1250494J3012408J4978296J7183904J9657374
$$ 57828624 65963949 75592282 86842776 99855184 114833480 132017384 151674758
58190A51674758K2490451K5757836K9366911L3087369L6586151L9046564L8695831
$$ 151674758 174165209 199923045 229289956 262377325 298963476 338010040 376705871
58183C76705871L3317686K1973458O374590r783517k3080491l2039593l6931883
$$ 376705871 410023557 431997015 438371605 428588088 405507597 373468004 336536121
58176C36536121l8605758l7814320l5271816l1738978k7845990k3973800k0349804
$$ 336536121 297930363 260116043 224844227 193105249 165259259 141285459 120935655
58169A20935655j7133460j4381674j2049120j0080572q453652p128804o032808
$$ 120935655 103802195 89420521 77371401 67290829 58837177 51708373 45675565
58162D5675565n113705m358500l744975l227019k778841k407185k108593j855150
$$ 45675565 40561860 36203360 32458385 29231366 26452525 24045340 21936747 20081597
58154B0081597j631023j444495j295022j163219j041068r39474q58705p81656
$$ 20081597 18450574 17006079 15711057 14547838 13506770 12567296 11708591 10926935
58146A0926935p02780o34975n81882n30513m76830m32372l99815l66950l30600
$$ 10926935 10224155 9589180 9007298 8476785 7999955 7567583 7167768 6800818 6470218
58137F470218l02907k87965k74464k56856k42661k33648k20429k01132j85871
$$ 6470218 6167311 5879346 5604882 5348026 5105365 4871717 4651288 4450156 4264285
58128D264285j77623j67242j52180j41691j38599j33670j23239j15345j13290
$$ 4264285 4086662 3919420 3767240 3625549 3486950 3353280 3230041 3114696 3001406
58119C001406j09494j00887r4650r3514r0432q2783p7359p6410p2984o4886n9420
$$ 3001406 2891912 2791025 2696375 2602861 2512429 2429646 2352287 2275877 2202893 2138007 2078587
58108B078587n9434n8093n2325m8412m9301m9100m5131m3078m5170m5221m0560
$$ 2078587 2019153 1961060 1908735 1860323 1811022 1761922 1716791 1673713 1628543 1583322 1542762
58097A542762l7307l8617l8804l4440l0678l1125l1506k8557k5863k5809k4728
$$ 1542762 1505455 1466838 1428034 1393594 1362916 1331791 1300285 1271728 1245865 1220056 1195328
58086A195328k0765j7985j8397j8191j5776j5141j7687j9092j7732j7716k0200
$$ 1195328 1174563 1156578 1138181 1119990 1104214 1089073 1071386 1052294 1034562 1016846 996646
58075I96646k0402j6820j4753j6797j8322j6294j4397j5274j5643j3278j1348
$$ 996646 976244 959424 944671 927874 909552 893258 878861 863587 847944 834666 823318
58064H23318j1785j1504q960p486q601q980p305p113r760j1633j1381j2589j6162
$$ 823318 811533 800029 791069 783583 774982 766002 758697 751584 741824 730191 718810 706221 690059
58051F90059j7582j5092j3159j4208j4297j0900p685p538p648n669m126m759m842
$$ 690059 672477 657385 644226 630018 615721 604821 597136 589598 581950 576281 572155 567396 562554
58038E62554l084k812n473p240n951n078p033q740p884p286r026j0240q897p862
$$ 562554 559470 556658 551185 543945 537994 532916 525883 517143 509259 501973 492947 482707 473810 465948
58024D65948r119r786p973o814q369r285o927m350m647n654m722l622m224m285
$$ 465948 456829 447043 439070 432256 423887 414602 407675 403325 398678 393024 388302 384680 380456 376171
58010C76171k010o5p39j678p01j21k029l847k970j424j654j981m76Q96K60k36
$$ 376171 374161 374096 373357 371679 370978 370857 368828 364981 362011 360587 358933 356952 356476 357372 357632 357396
57994C57396J382K957K499K160L814M885K983N38M12Q19q34k874k786k064l043
$$ 357396 358778 361735 364234 366394 370208 375093 378076 378614 379026 379845 379011 376137 373351 371287 368244
57979C68244m163l032j075o94q00N32J853J088l33j60N43o0o42P24K639K921K417
$$ 368244 364081 361049 359974 359280 358480 359012 360865 361953 361620 361460 362003 361943 361301 362025 364664 367585 370002
57962C70002K701K607P89j018j000p37k106l467k767j641k465m012l936l076l421
$$ 370002 372703 375310 376099 375081 374081 373344 371238 367771 365004 363363 360898 356886 352950 349874 346453
57947C46453m135l485k422k493k498q56R56J063Q79K526M835N589N503O301P109
$$ 346453 342318 338833 336411 333918 331420 330564 331520 332583 333462 335988 340823 346412 351915 358216 365325
57932C65325O512N913P007Q050O449L127O18j154l559n813o545o901q391r643
$$ 365325 371837 377750 384757 392807 399256 402383 403001 401847 398288 392475 385930 379029 370638 360995
57918C60995q885p588p840q278o578m004l334l968l250j202J61Q50K255L706L537
$$ 360995 352110 344522 336682 328404 321826 317822 314488 310520 307270 306068 306229 307079 309334 313040 316577
57903C16577K460K242K243Q49r56j212p89j772l336l136j692j355j817p64J632
$$ 316577 319037 321279 323522 324371 323415 322203 321414 319642 316306 313170 311478 310123 308306 307542 309174
57888C09174K812K178J597J827J831J537K008K954L000K222J786J570O46m82p35
$$ 309174 311986 314164 315761 317588 319419 320956 322964 325918 328918 331140 332926 334496 335142 334660 333925
57873C33925o88j302j589l13J188R03k47K0J289J329J70k37K60R8n93j10J501
$$ 333925 333237 331935 330346 330033 331221 332124 331877 331897 333186 334515 334685 334448 334708 334806 334213 334103 335604
57856C35604K465K472K818L539L448K822L130M097L963K586J582J423J027J96
$$ 335604 338069 340541 343359 346898 350346 353168 356298 360395 364358 366944 368526 369949 370976 371172
57842C71172j03J23j54r39j348j505k089k398j203Q49J925J718J319J009L34k34
$$ 371172 371069 371192 371038 370099 368751 367246 365157 362759 361556 362405 364330 366048 367367 368376 368710 368476
57826C68476k3J74n65j153q9J717K200J376P27L13o78j475p53M89O4j982l843
$$ 368476 368453 368627 368062 366909 366820 368537 370737 372113 372840 373153 372475 371000 370247 370736 370800 368818 364975
57809C64975n216p098r016r512q979q999r314q457o879o220n938m073j168J03
$$ 364975 359759 352661 343645 334133 325154 316155 306841 298384 291505 285285 279347 275274 274106 274209
57795B74209o76j105r2P91O55P69J842K756K861L003L478L366K608K394K972L202
$$ 274209 273533 272428 272336 273127 273782 274551 276393 279149 282010 285013 288491 291857 294465 296859 299831 303033
57779C03033K812K820L387L465L008L212M134M285L089J660P59l4q06j003r36
$$ 303033 305845 308665 312052 315517 318525 321737 325871 330156 333245 334905 335664 335630 334824 333821 332885
57764C32885j619k805l162k537k149k390k400j886j416r04J79J191J042L86R02
$$ 332885 331266 328461 325299 322762 320613 318223 315823 313937 312521 311617 311796 312987 314029 314415 315317
57749C15317K442L214K836K815L821M791N017M892M384K900J034K74P07R12L08
$$ 315317 317759 320973 323809 326624 330445 335236 340253 345145 349529 352429 353463 353737 354444 355356 355664
57734C55664l05n61q68r98l47M35K11n08k79O19O36j52j01J062J826J544J099
$$ 355664 355359 354798 353930 352932 352585 353020 353231 352723 352444 353063 353699 353547 353446 354508 356334 357878 358977
57717C58977Q67L58j26J60M10q00k746l250k182j542k040k442k345k695l213k350
$$ 358977 359844 360202 360076 360236 360646 359846 357100 353850 351668 350126 348086 345644 343299 340604 337391 335041
57701C35041l33P20K07j83L13N06O8L36J464J670L41r07j236j853l190l696k704
$$ 335041 334708 335428 335635 335452 335765 336271 336339 336675 338139 339809 340150 339243 338007 336154 332964 329268 326564
57684C26564j843k171k396j411j46O05J938M834Q386J1556J4771J8471K1891K4697
$$ 326564 324721 322550 320154 318743 318597 319202 321140 325974 334360 345916 360687 379158 401049 425746
57670D25746K8103L3157L9415M6305N4013O1863O7110O6250N6566L6794Q819k0915
$$ 425746 453849 487006 526421 572726 626739 688602 755712 821962 878528 915322 924141 903226
57658I03226m4386n7830o3104o3222n9226n2012m3964l6902l0574k4555j9707
$$ 903226 858840 801010 737906 674684 615458 563446 519482 482580 452006 427451 407744
57647D07744j6473j3762j0832q415o899n394l552k307j786p50R18J541N69k09
$$ 407744 391271 377509 366677 358262 351363 345969 342417 340110 338324 337574 338492 340033 340602 340393
57633C40393L25Q07Q7p24n58m62j548k864l186l070l400l694l480l647m720n493
$$ 340393 340718 341525 341612 340888 340330 339868 338320 335456 332270 329200 325800 322106 318626 314979 310259 304766
57617C04766n035m364m554m801m003k722k002j692j378j403j726j371k90J5r32
$$ 304766 299731 295367 290813 286012 282009 279287 277285 275593 274215 272812 271086 269715 269425 269440 268508
57602B68508j408k96R29O66l55q33j146j974k490j976j607k564l805l722k642
$$ 268508 267100 266804 267733 268399 268044 267211 266065 264091 261601 259625 258018 255454 251649 247927 245285
57587B45285j856j471j033r30j395j436m89K70j09o06j09M52j62j219j450j314
$$ 245285 243429 241958 240925 239995 238600 237164 236675 236945 236836 236230 236121 236573 236411 235192 233742 232428
57571B32428j821k414k166j859k705m012m233l445k858k767k767l084l821l904
$$ 232428 230607 228193 226027 224168 221463 217451 213218 209773 206915 204148 201381 198297 194476 190572
57557A90572k545q33k12l36j25K48J91K80J131J776J120Jk31o6p03j616j474o21
$$ 190572 188027 187194 186982 186646 186521 186769 186960 187240 188371 190147 191267 191268 191037 190971 190268 188652 187178 186557
57539A86557l79n59R4J426K067J704J230Q83J57o63p03r3K11J7n0K25O13J199
$$ 186557 186178 185619 185713 187139 189206 190910 192140 193023 193180 192517 191814 191721 191932 191949 191899 192124 192737 193936
57521A93936J902J922R06l0J90R41J130J131J888K897K912K021J364J283J272
$$ 193936 195838 197760 198666 198636 198826 199767 200897 202028 203916 206813 209725 211746 213110 214393 215665
57506B15665J229J236P53n50j722j764j174r97j132j024j040j629k079j723j400
$$ 215665 216894 218130 218883 218333 216611 214847 213673 212676 211544 210520 209480 207851 205772 204049 202649
57491B02649j957k388j333M59J234R57Q58R69M10m56m00L50L84m39p92j79M34
$$ 202649 200692 198304 196971 197430 198664 199621 200479 201448 201858 201402 201002 201352 201736 201297 200505 200326 200760
57474B00760L34k32j080k309l468l839l550l312l244l084l001l119k852j937j274
$$ 200760 201094 200862 199782 197473 194005 190166 186616 183304 180060 176976 173975 170856 168004 166067 164793
57459A64793j505j678p41N82J079J108J588J977J239N8n9P83J340J405J514J194
$$ 164793 163288 161610 160869 161451 162530 163638 165226 167203 168442 168500 168441 169224 170564 171969 173483 174677
57443A74677k13j642j479j63O13Q02J638K830K797J633J175J912K286J575J069
$$ 174677 174464 172822 171343 171180 171793 172595 174233 177063 179860 181493 182668 184580 186866 188441 189510
57428A89510J716K608K619J925J238Q78J001J553J839J309O85R56J610J362L25
$$ 189510 191226 193834 196453 198378 199616 200494 201495 203048 204887 206196 206881 207837 209447 210809 211134
57413B11134k34r2j95p82j060p51k91L23J276J780R49n19j246j396k035k794k377
$$ 211134 210900 210808 210613 209831 208771 208020 207729 208052 209328 211108 212057 211538 210292 208896 206861 204067 201690
57396B01690j129p75j572k019j479q68n62J34J189J630J424J520J825J307L45
$$ 201690 200561 199786 198214 196195 194716 193848 193286 193420 194609 196239 197663 199183 201008 202315 202660
57381B02660N64K035K903K350J636J572J331N50L76J302J970J238j90j149j520
$$ 202660 203224 205259 208162 210512 212148 213720 215051 215601 215977 217279 219249 220487 220297 219148 217628
57366B17628j562j203o81m73j67J084K675K921J668O06N96O76L19M19J321J916
$$ 217628 216066 214863 214182 213709 213542 214626 217301 220222 221890 222496 223092 223768 224087 224506 225827 227743
57350B27743J727J819K644K959K029J036J007J148N42j20N6M96L49Q8N47J380
$$ 227743 229470 231289 233933 236892 238921 239957 240964 242112 242654 242534 242590 243086 243435 243523 244070 245450
57334B45450J754J611J288P78K11J11M56N42L34O96J685K079J388P92J223J933
$$ 245450 247204 248815 250103 250881 251092 251203 251659 252201 252535 253231 254916 256995 258383 259175 260398 262331
57318B62331K034K028K609L231L088K513K267K308K274K273K388K280K046K448
$$ 262331 264365 266393 269002 272233 275321 277834 280101 282409 284683 286956 289344 291624 293670 296118
57304B96118L596M440M295L739L390L022K627K976M175M971M523L675L536L909
$$ 296118 299714 304154 308449 312188 315578 318600 321227 324203 328378 333349 337872 341547 345083 348992
57290C48992M234M828N969O764O224M791L644L196L177L590M540N677O576P307
$$ 348992 353226 358054 364023 370787 377011 381802 385446 388642 391819 395409 399949 405626 412202 419509
57276D19509Q051Q683R139R525R632R144Q482Q485R060R342R356J0082J1479J2030
$$ 419509 427560 436243 445382 454907 464539 473683 482165 490650 499710 509052 518408 528490 539969 551999
57262E51999J0941R311Q400Q090P885P973Q411Q537Q117P914Q274Q476Q262Q580
$$ 551999 562940 572251 580651 588741 596626 604599 613010 621547 629664 637578 645852 654328 662590 671170
57248F71170R913J1250J1809J2388J3813J5329J5825J5578J5572J6022J6585J7063
$$ 671170 681083 692333 704142 716530 730343 745672 761497 777075 792647 808669 825254 842317
57236H42317J7034J5920J4261J3683J4604J5478J5305J5411J7192J9595K0612
$$ 842317 859351 875271 889532 903215 917819 933297 948602 964013 981205 1000800 1021412
57225A021412K0128J9492J9116J8400J7428J7035J7394J7960J8535J9155J9218
$$ 1021412 1041540 1061032 1080148 1098548 1115976 1133011 1150405 1168365 1186900 1206055 1225273
57214A225273J7960J5614J3259J1746J1465J2578J4660J6685J8125J9607K1805
$$ 1225273 1243233 1258847 1272106 1283852 1295317 1307895 1322555 1339240 1357365 1376972 1398777
57203A398777K4408K6810K8953L0825L1993L2512L3274L4623L5517L4991L3503
$$ 1398777 1423185 1449995 1478948 1509773 1541766 1574278 1607552 1642175 1677692 1712683 1746186
57192A746186L1877K9938K7352K4901K3654K3549K3799K4111K4547K4880K5012
$$ 1746186 1778063 1808001 1835353 1860254 1883908 1907457 1931256 1955367 1979914 2004794 2029806
57181B029806K5397K6250K7100K7805K9065L1124L2999L3841L4024L3958L3088
$$ 2029806 2055203 2081453 2108553 2136358 2165423 2196547 2229546 2263387 2297411 2331369 2364457
57170B364457L1087K8915K7472K6286K4710K3259K2509K1804K0438J8938J7775
$$ 2364457 2395544 2424459 2451931 2478217 2502927 2526186 2548695 2570499 2590937 2609875 2627650
57159B627650J6027J2894R513P417O134M232J954Q60J326K336L495N421Q223J1163
$$ 2627650 2643677 2656571 2666084 2673501 2679635 2683867 2685821 2686681 2688007 2690343 2693838 2699259 2707482 2718645
57145B718645J3963J7083K0719K4651K8918L3554L7847M0965M3198M5559M8476
$$ 2718645 2732608 2749691 2770410 2795061 2823979 2857533 2895380 2936345 2979543 3025102 3073578
57134C073578N1563N4232N5656N5006N2841N1616N3380N7363O0914O2128O0432
$$ 3073578 3125141 3179373 3235029 3290035 3342876 3394492 3447872 3505235 3566149 3628277 3688709
57123C688709N5594M8226M1199L8627M2659N1713O1777O9120P2575P4388P8351
$$ 3688709 3744303 3792529 3833728 3872355 3915014 3966727 4028504 4097624 4170199 4244587 4322938
57112D322938Q6110R5617J03818J10119J16303J24262J35269J50702J71856J99317
$$ 4322938 4409048 4504665 4608483 4718602 4834905 4959167 5094436 5245138 5416994 5616311
57102E616311K33703K76431L28454L88930M56559N31776O16167P10198Q12751
$$ 5616311 5850014 6126445 6454899 6843829 7300388 7832164 8448331 9158529 9971280
57093I971280R22181J036140J150929J262978J370788J473613J568103J647486
$$ 9971280 10893461 11929601 13080530 14343508 15714296 17187909 18756012 20403498
57085B0403498J703736J729072J716360J661597J567752J444283J299715J133303
$$ 20403498 22107234 23836306 25552666 27214263 28782015 30226298 31526013 32659316
57077C2659316R33795O87201L87406M1504l33343p17039j090501j434810j730481
$$ 32659316 33593111 34280312 34667718 34709222 34375879 33658840 32568339 31133529 29403048
57068B9403048j960473k114301k189551k191341k131316k025055j887637j730948
$$ 29403048 27442575 25328274 23138723 20947382 18816066 16791011 14903374 13172426
57060A3172426j564786j398251j238224j087865r48509q22132p10481o13148n28587
$$ 13172426 11607640 10209389 8971165 7883300 6934791 6112659 5402178 4789030 4260443
57051D260443m56237l95731l44977l01184k63226k31062k03562j79067j57441
$$ 4260443 3804206 3408475 3063498 2762314 2499088 2268026 2064464 1885397 1727956
57042A727956j39390j24188j10164r7052q5650p5606o5735n6222m8206m1268l3660
$$ 1727956 1588566 1464378 1354214 1257162 1171512 1095906 1030171 973949 925743 884475 850815
57031H50815k4951j6210p629J736J1950K2229L2797M3516N0034M4749K3887p583
$$ 850815 825864 809654 802025 803761 815711 837940 870737 914253 964287 1009036 1032923 1025340
57019A025340l9265o2549p4321p6203p2127o5836n9173n2429m5971m0486l5793
$$ 1025340 986075 923526 849205 773002 700875 635039 575866 523437 477466 436980 401187
57008D01187l1003k6146k2332j9977j8181j6204j4291j2772j1535j0638j0241
$$ 401187 370184 344038 321706 301729 283548 267344 253053 240281 228746 218108 207867
56997B07867r843q758p408o840o905o350m717k749q84J137L159M717O315Q916
$$ 207867 198024 189266 181858 175018 168113 161763 157046 154297 153413 154550 157709 162426 168741 177657
56983A77657J2025J3944J4008J2862J0453N875l58n935r398j1454j2966j3406
$$ 177657 189682 203626 217634 230496 240949 246824 246466 240531 231133 219679 206713 193307
56971A93307j2215j0121q054n931l393o93J747L756N100N772O733R051J2234J4795
$$ 193307 181092 170971 162917 156986 153593 152900 154647 158403 163503 169275 176008 185059 197293 212088
56957B12088J6527J8443K0244J9756J5537Q448J45q273j5552k0137k1711k1524
$$ 212088 228615 247058 267302 287058 302595 311043 311188 302915 287363 267226 245515 223991
56945B23991k0417j7919j3941r734o327l371l47K423M772P357J0577J3930J7024
$$ 223991 203574 185655 171714 161980 155653 152282 151935 154358 159130 166487 177064 190994 208018
56932B08018K0117K3089K5215K6164K5810K2770J5127L379q997j8728k5034k8274
$$ 208018 228135 251224 276439 302603 328413 351183 366310 369689 360692 341964 316930 288656
56920B88656k8422k6051k3016k0658j8543j5944j3315j1333r794q435p611p261
$$ 288656 260234 234183 211167 190509 171966 156022 142707 131374 121580 113145 105534 98273
56908I8273o498n035l731k921j745Q9J411J423R47R00J090J460K856N380P561
$$ 98273 91775 86740 83009 80088 78343 78432 79843 81266 82213 83113 84203 85663 88519 93899 101460
56893A01460Q427Q910J0100J1630J3061J5068J7906K0294K1372K2091K2960K2079
$$ 101460 109887 118797 128897 140527 153588 168656 186562 206856 228228 250319 273279 295358
56881B95358J7459J0066K577l749r002j2571j3515j2342j0452q145m901j111K276
$$ 295358 312817 322883 325460 321711 312709 300138 286623 274281 263829 255684 250783 249672 251948
56868B51948N341Q840J2663J6240K0091K5237L1293L6733M1026M4940M8483M9736
$$ 251948 257289 266129 278792 295032 315123 340360 371653 408386 449412 494352 542835 592571
56856E92571M6011L5618J8982q72j9177l1981l8258l9334l6860l1972k5673j8780
$$ 592571 638582 674200 693182 692310 673133 641152 602894 563560 526700 494728 469055 450275
56844D50275j1581m193L022R871J6631K3495L0382L7705M6300N6002O5350P3317
$$ 450275 438694 434501 437523 447394 464025 487520 517902 555607 601907 657909 723259 796576
56832G96576P9787Q3111P8705O2275L4373P17l1502n6833p2526p8623p7421p1691
$$ 796576 876363 959474 1038179 1100454 1134827 1135544 1104042 1047209 974683 896060 818639 746948
56820G46948o3204n3173m3045l3677k4426j4447m464L963J0668J7072K4360L2450
$$ 746948 683744 630571 587526 553849 529423 514976 510512 514475 525143 542215 566575 599025
56808E99025M0620M8201N4411N7924N6495M7147K8135J702k5818m7845o1401o7118
$$ 599025 639645 687846 742257 800181 856676 903823 931958 933660 907842 859997 798596 731478
56796G31478o6861o2469n5836m8455m0830l3062k5604j8808j2343n917K3N102
$$ 731478 664617 602148 546312 497857 457027 423965 398361 379553 367210 361293 361316 366418
56784C66418R821J4733J9469K3513K7023K9827L0185K5759J5749J590j3835k7203
$$ 366418 376239 390972 410441 433954 460977 490804 520989 546748 562497 564087 550252 523049
56772E23049l6030m0114m1249m0896l8907l4991l0200k5900k2283j8914j5915
$$ 523049 487019 446905 405656 364760 325853 290862 260662 234762 212479 193565 177650
56761A77650j3572j1619r861q599p733o452m741l856m270m547l556k364k341k755
$$ 177650 164078 152459 142598 133999 126266 119814 115073 111217 106947 102400 98844 96480 94139 91384
56747I1384k106p16j3k4L50J158J383P79K6o27j310j525p64K60M40K9P6N63O43
$$ 91384 89278 88562 88549 88525 88875 90033 91416 92195 92221 91594 90284 88759 87995 88255 88695 88724 88800 89363 90006
56728I0006L08L01O03N68L28O67J538K125K185K175K221K127K089K274K077R53
$$ 90006 90314 90615 91218 91786 92114 92781 94319 96444 98629 100804 103025 105152 107241 109515 111592 112545
56712A12545m14r13n33ON41J163J334O41q2K21J174J643J452J114N36m67j065
$$ 112545 112131 111218 110685 110691 111232 112395 113729 114370 114288 114509 115683 117326 118778 119892 120428 119961 118896
56695A18896m09P84J228J137J596K419K369J331M99N35R86J376J536J126J52m23
$$ 118896 118487 119271 120499 121636 123232 125651 128020 129351 129850 130385 131371 132747 134283 135409 135561 135138
56679A35138J58J133J443J487K149K790K128N47m08m81p60j496j798j390r31o13
$$ 135138 135296 136429 137872 139359 141508 144298 146426 146973 146565 146084 145324 143828 142030 140640 139709 139096
56663A39096n5M89M22J13L49P51L22p33j335j349j390j214j29J297J828J543J448
$$ 139096 139041 139530 139952 140065 140414 141165 141487 140754 139419 138070 136680 135466 135337 136634 138462 140005 141453
56646A41453J416N53o89q40K06J120J341J446J459Q85K84O62J381Q55p31j613
$$ 141453 142869 143422 142733 141893 142099 143219 144560 146006 147465 148350 148634 149296 150677 151532 150801 149188
56630A49188j382j362j893j730n75J78j48n28l15j91m28j80O88J090O32K52L01
$$ 149188 147806 146444 144551 142821 142246 142424 142276 141748 141433 141242 140814 140634 141322 142412 143044 143296 143597
56613A43597j09j144j558p61K11N25O42Q69N73m10j184j334j458j677j268l18
$$ 143597 143488 142344 140786 140025 140236 140761 141403 142272 142845 142435 141251 139917 138459 136782 135514 135196
56597A35196K4m44n07K59O93K61J55J203K338K281J327M28j41l97j58L05L00o8
$$ 135196 135220 134776 134269 134528 135221 135482 135637 136840 139178 141459 142786 143214 143073 142676 142518 142823 143123 143055
56579A43055N6O47O94J16P8R18J489J202J018J635K348K508K583K997L316L392
$$ 143055 143111 143758 144452 144568 144646 145564 147053 148255 149273 150908 153256 155764 158347 161344 164660 168052
56563A68052L896N048O211P201Q592J0336J1639J2455J3293J3237J0333M689q11
$$ 168052 171948 176996 183207 190408 199000 209336 220975 233430 246723 259960 270293 274982 274171
56550B74171l844m822n024m646l754l239l506l700l328l089l293l063k043j237
$$ 274171 270327 265505 260481 255835 252081 248842 245336 241636 238308 235219 231926 228863 226820 225583
56536B25583j344j793k225l075l998l654k016r02j195j613j164p48j110j389j126
$$ 225583 224239 222446 220221 217146 213148 209494 207478 206576 205381 203768 202604 201856 200746 199357 198231
56521A98231j490k939l780k771j273r13r90k32O47K79p60r45l32j20m98p32o99
$$ 198231 196741 193802 190022 187251 185978 185065 184075 183843 184490 184769 184009 183064 182732 182612 182114 181382 180683
56504A80683p56p83o60r44j872k524k142j323r02o14J6N53M85J77N4j25l55k2
$$ 180683 179927 179144 178484 177540 175668 173144 171002 169679 168777 168163 168179 168732 169217 169394 169448 169323 168968 168946
56486A68946P96J031M14J8K49O8q23j016K24J452J388Q92J145J596J312P66O24
$$ 168946 169742 170773 171187 171205 171454 171522 170699 169683 169907 171359 172747 173639 174784 176380 177692 178458 179082
56469A79082M03j67m0J238K205J671O59M44M11l76j143q88l57n49p53JR33R72
$$ 179082 179485 179318 179278 180516 182721 184392 185051 185495 185906 185530 184387 183499 183142 182593 181840 181841 182774 183746
56451A83746P46J147J375M87m79j33Q22R69P34J340K262K091R47l9p68j640k022
$$ 183746 184492 185639 187014 187501 187022 186889 187711 188680 189414 190754 193016 195107 196054 196015 195247 193607 191585
56434A91585j259l01k50l44N83J661J306r1r31j027j188j107l1J146Q72n09j277
$$ 191585 190326 190025 189775 189431 190014 191675 192981 192890 191959 190932 189744 188637 188606 189752 190624 190115 188838
56417A88838r82n24j89M17R11O10M9K88J155J761K066K330J978P24j21O12J891
$$ 188838 187856 187332 187143 187560 188471 189081 189130 189418 190573 192334 194400 196730 198708 199432 199311 199923 201814
56400B01814K040J376J233J421Q21k59o07l15l75o97n17p9j5K00J226K224K080
$$ 201814 203854 205230 206463 207884 208705 208446 207839 207524 207149 206452 205935 205856 205841 206041 207267 209491 211571
56383B11571J352J052O93l85j018K0J485J448M84M72J225J191O12R62J904J736
$$ 211571 212923 213975 214668 214283 213265 213285 214770 216218 216702 217174 218399 219590 220202 221164 223068 224804
56367B24804N25k2M42P65P60J217J785J479R03J332K043J347j62l15Q81J294M06
$$ 224804 225329 225307 225749 226514 227274 228491 230276 231755 232658 233990 236033 237380 237218 236903 237784 239078 239484
56350B39484n8N96J025N41J68M61P69R84J731K537K124Q36M98J617K865L472L970
$$ 239484 239426 240022 241047 241588 241756 242217 242986 243970 245701 248238 250362 251198 251696 253313 256178 259650 263620
56333B63620M458M319L808L872M357M278L725L504L395K845K770M149N494M532
$$ 263620 268078 272397 276205 280077 284434 288712 292437 295941 299336 302181 304951 309100 314594 319126
56319C19126J946N19Q39R10p4p56n22l21k86M92J547J345K76M78K243L553L576
$$ 319126 321072 321591 322430 323340 323266 322510 321988 321667 321381 321873 323420 324765 325041 325519 327762 331315 334891
56302C34891L682M462M733M194M217N254O091O357P024P924P554O070N582O689
$$ 334891 338573 343035 347768 351962 356179 361433 367524 373881 380905 388829 396383 402453 408035 414724
56288D14724P455O796O160O801P945Q657R263R995J0337J0474J1220J2123J1944
$$ 414724 422179 428975 435135 441936 449881 458538 467801 477796 488133 498607 509827 521950 533894
56275E33894J1241J1927J3921J5104J4950J5272J6847J8337J9315K1265K4600
$$ 533894 545135 557062 570983 586087 601037 616309 633156 651493 670808 692073 716673
56264G16673K7686K9874L2670L6791M0890M4349M8545N4158N9912O5247P1613
$$ 716673 744359 774233 806903 843694 884584 928933 977478 1031636 1091548 1156795 1228408
56253A228408P9910Q9086R8497J09114J21332J33910J46109J58432J70413J80298
$$ 1228408 1308318 1397404 1495901 1605015 1726347 1860257 2006366 2164798 2335211 2515509
56243B515509J87725J94022J98964K00145J96485J89406J79385J64444J43433
$$ 2515509 2703234 2897256 3096220 3296365 3492850 3682256 3861641 4026085 4169518
56234D169518J17917Q9433N7775K3528j0576m2461p2316r9993j23533j41862j56380
$$ 4169518 4287435 4376868 4434643 4458171 4447595 4405134 4332818 4232825 4109292 3967430 3811050
56223C811050j68221j76327j79746j79520j76893j71969j65286j58321j51233
$$ 3811050 3642829 3466502 3286756 3107236 2930343 2758374 2593088 2434767 2283534
56214B283534j42584j32312j22411j13772j05195r6438q9120q3524p7654p0691
$$ 2283534 2140950 2008638 1886227 1772455 1667260 1570822 1481702 1398178 1320524 1249833
56204A249833o4296n9252n4140m8589m4321m1560l8001l2973k8944k7083k5138
$$ 1249833 1185537 1126285 1072145 1023556 979235 937675 899674 866701 837757 810674 785536
56193G85536k1740j8972j8307j7687j5303j2780j1856j1223r492q083q215q104
$$ 785536 763796 744824 726517 708830 693527 680747 668891 657668 648176 640093 631878 623774
56181F23774o148m027l661l812k728j474j573j847o09J143J700J613K085K535
$$ 623774 617626 613599 609938 606126 603398 601924 600351 598504 597895 599038 600738 602351 604436 606971
56167F06971K277K421L719M750M567M690O243P746P979Q337R873J0938J0368J0113
$$ 606971 609248 611669 615388 620138 624705 629395 635638 643384 651363 659700 669573 680511 690879 700992
56153G00992J1988J4613J6312J8260K1810K5559K8092L0920L5657M0950M5261
$$ 700992 712980 727593 743905 762165 783975 809534 837626 868546 904203 945153 990414
56142I90414N0107N7385O5946P3750Q0926Q7771R2278R2649Q9789Q4554P5509
$$ 990414 1040521 1097906 1163852 1237602 1318528 1406299 1498577 1591226 1681015 1765569 1841078
56131A841078O2506M9573M0872L6143L2977L0645K8518K3884J5095M522m749j2618
$$ 1841078 1903584 1953157 1994029 2030172 2063149 2093794 2122312 2146196 2161291 2165813 2161064 2148446
56119B148446j9545k3904k5335k7655l4604m5198n6572o8228p9903q8486r1230
$$ 2148446 2128901 2104997 2079662 2052007 2017403 1972205 1915633 1847405 1767502 1679016 1587786
56108A587786q9402q5158p7859o7180n6514m8972m2995l5943k9045k4506k0947
$$ 1587786 1498384 1413226 1335367 1268187 1211673 1162701 1119706 1083763 1054718 1030212 1009265
56097A009265j6191j1701r690q621o036l062j725q01J348K914K164J534L472N633
$$ 1009265 993074 981373 971683 963062 957026 953964 952239 951438 952786 955700 957864 959398 962870 968503
56083I68503N110M039N660Q099P818O151O576Q258Q178P171Q031R970J0597J1045
$$ 968503 973613 977652 983312 991411 999229 1005380 1011956 1020214 1028392 1035563 1043594 1053564 1064161 1075206
56069A075206J3580J6511J7046J6653J8134K0034J9641J8616J9844K1572K0695
$$ 1075206 1088786 1105297 1122343 1138996 1157130 1177164 1196805 1215421 1235265 1256837 1277532
56058A277532J8948J9631K1147K0192J8384J9108K0702J9580J7299J7563J9046
$$ 1277532 1296480 1316111 1337258 1357450 1375834 1394942 1415644 1435224 1452523 1470086 1489132
56047A489132J8283J6917J8667K1818K2183K1042K2556K5777K6872K6838K9243
$$ 1489132 1507415 1524332 1542999 1564817 1587000 1608042 1630598 1656375 1683247 1710085 1739328
56036A739328L2705L3370L2548L4101L6809L7228L7284M0827M5457M6297M4996
$$ 1739328 1772033 1805403 1837951 1872052 1908861 1946089 1983373 2024200 2069657 2115954 2160950
56025B160950M6219M8353M6907M4180M5761N0128N1645N1284N4288N9654O2401
$$ 2160950 2207169 2255522 2302429 2346609 2392370 2442498 2494143 2545427 2599715 2659369 2721770
56014B721770O3693O8183P3798P5131P4472P8205Q4740Q7609Q8106R2742J00421
$$ 2721770 2785463 2853646 2927444 3002575 3077047 3155252 3239992 3327601 3415707 3508449 3608870
56003C608870J04642J06387J12178J21288J27795J33206J43780J57442J66944
$$ 3608870 3713512 3819899 3932077 4053365 4181160 4314366 4458146 4615588 4782532
55994D782532J73838J85324J99763K09994K18388K33103K52169K67365K81114
$$ 4782532 4956370 5141694 5341457 5551451 5769839 6002942 6255111 6522476 6803590
55985F803590L02366L28695L50659L71112M00946M38386M72813N06624N51791
$$ 6803590 7105956 7434651 7785310 8156422 8557368 8995754 9468567 9975191 10526982
55976A0526982O07128O61736P18769P91813Q79837R71350J071440J197545J350528
$$ 10526982 11134110 11795846 12514615 13306428 14186265 15157615 16229055 17426600 18777128
55967A8777128J519356J712876J955907K256196K609654L036785L577506M252195
$$ 18777128 20296484 22009360 23965267 26221463 28831117 31867902 35445408 39697603
55959C9697603N066800O048555P225210Q571314J0032710J1607526J3347979J5293104
$$ 39697603 44764403 50812958 58038168 66609482 76642192 88249718 101597697 116890801
55951A16890801J7477101J9990997K2922736K6217185K9681706L3036062L5615453
$$ 116890801 134367902 154358899 177281635 203498820 233180526 266216588 301832041
55944C01832041L5887547L1713406K1794854P183164q819007k2500229l1660267
$$ 301832041 337719588 369432994 391227848 398411012 389592005 367091776 335431509
55937C35431509l6088850l6767291l4948769l1739713k7985640k4212884k0669598
$$ 335431509 299342659 262575368 227626599 195886886 167901246 143688362 123018764
55930A23018764j7471477j4690976j2337959j0357794q694881p321948o201832
$$ 123018764 105547287 90856311 78518352 68160558 59465677 52143729 45941897
55923D5941897n273329m491936l845214l316759k871625k487465k165920j902629
$$ 45941897 40668568 36176632 32331418 29014659 26143034 23655569 21489649 19587020
55915A9587020j675814j473080j301228j160943j037306r22918q26115p48878
$$ 19587020 17911206 16438126 15136898 13975955 12938649 12015731 11189616 10440738
55907A0440738o79041o11215n54040n10167m69151m26518l90695l64809l39700
$$ 10440738 9761697 9150482 8596442 8086275 7617124 7190606 6799911 6435102 6095402
55898F095402l11053k86219k68269k49717k27808k10176j99534j87816j71261
$$ 6095402 5784349 5498130 5229861 4980144 4752336 4542160 4342626 4154810 3983549
55889C983549j56929j48630j40060j27574j16752j10602j03682r3443q5765q4037
$$ 3983549 3826620 3677990 3537930 3410356 3293604 3183002 3079320 2985877 2900112 2816075
55879B816075q3716q2337q3901q8649q9489q3588p7355p5211p3359o9103o6339
$$ 2816075 2732359 2650022 2566121 2477472 2387983 2304395 2227040 2151829 2078470 2009367 1943028
55868A943028o6881o5865o0707n5856n4077n1540m6085m1864m1286m0450l6947
$$ 1943028 1876147 1810282 1749575 1693719 1639642 1588102 1542017 1500153 1458867 1418417 1381470
55857A381470l4357l4724l4194l0468k7184k6793k6233k3675k2453k4223k5224
$$ 1381470 1347113 1312389 1278195 1247727 1220543 1193750 1167517 1143842 1121389 1097166 1071942
55846A071942k3313k2071k3838k5267k3777k2009k2022k1315j8491j6749j7816
$$ 1071942 1048629 1026558 1002720 977453 953676 931667 909645 888330 869839 853090 835274
55835H35274j8330j6069j4039j4598j5172j3544j1852j1738j0937q249o522p256
$$ 835274 816944 800875 786836 772238 757066 743522 731670 719932 708995 700746 694224 686968
55823F86968p568n966n606q289j0688j0283r662j1154j2452j1532j0740j1946
$$ 686968 679400 673434 667828 659539 648851 638568 628906 617752 605300 593768 583028 571082
55811E71082j2520j0350q081q181q296n817k705j502o21K041M642M897M486N796
$$ 571082 558562 548212 540131 531950 523654 517837 515132 513630 513009 515050 519692 524589 529075 534871
55797E34871P491P327O199N622M316J017k265l418l805n307o766o686o431p362
$$ 534871 542362 549689 555888 561510 565826 566843 564578 561160 557355 552048 545282 538596 532165 524803
55783E24803p694n730l458l663n987q830j2256j5929j7195j4581j0673q329o631
$$ 524803 517109 511379 507921 504258 498271 489441 477185 461256 444061 429480 418807 410478 403847
55770D03847l590l3K418M407O512O507K547l104o898q471r299r191p451n505n097
$$ 403847 400257 400224 402642 407049 413561 420068 422615 419511 412613 404142 394843 385652 378201 372696 367599
55755C67599n439m982m194m044l774k792k640m346n919n305l823l850n036n624
$$ 367599 362160 357178 352984 348940 345166 342374 339734 335388 329469 324164 320341 316491 311455 305831
55741C05831n571n641n192l613k190k059k127j411j332l130n123n293m543m693
$$ 305831 300260 294619 289427 285814 283624 281565 279438 278027 276695 273565 268442 263149 258606 253913
55727B53913n239m890m325m619m791l712k592k820l258k440j480j852k274r77
$$ 253913 248674 243784 239459 234840 230049 226337 223745 220925 217667 215227 213747 211895 209621 208644
55713B08644Q48J136Q05K069M369N346M788M308M073L018J539R11P23m27k309
$$ 208644 209492 210628 211433 213502 217871 223217 228005 232313 236386 239404 240943 241854 242577 242150 239841
55698B39841l681m666o097p325p178o187n554m929l471j997j691j801r98J39M30
$$ 239841 236160 231494 225397 218072 210894 204707 199153 194224 190753 188756 187065 185264 184266 184405 184835
55683A84835N57J735L143L367L192M233N910O429N798N180M348K533P00J78P9
$$ 184835 185392 187127 190270 193637 196829 201062 206972 213401 219199 224379 228727 231260 231960 232138 232217
55668B32217j051k177j458L5l03k189k869j632m95m39k61N78R78O06O48J551K293
$$ 232217 231166 228989 227531 227566 227263 225074 222205 220573 220078 219639 219378 219956 220934 221540 222188 223739 226032
55651B26032K221J713Q15p26k111k166j361j298k298l343m002m550m602l770l227
$$ 226032 228253 229966 230781 230055 227944 225778 224417 223119 220821 217478 213476 208926 204324 200554 197327
55636A97327m347o152o434n137m218m405m486l828l202k922k401j709j560j629
$$ 197327 192980 186828 180394 175257 171039 166634 162148 158320 155118 152196 149795 148086 146526 144897
55622A44897q85M29J073R75J150J535J081j02p87q35j297k265k693k402k243k262
$$ 144897 144012 144441 145514 146489 147639 149174 150255 150153 149366 148531 147234 144969 142276 139874 137631 135369
55606A35369j742j077j422k416k459j384o85q48p36l9l1j264k468k550j991j584
$$ 135369 133627 132550 131128 128712 126253 124869 124184 123336 122600 122561 122530 121266 118798 116248 114257 112673
55590A12673j362j254j410j454p77J82L70j44l62k18n42j167r02M84J929K860
$$ 112673 111311 110057 108647 107193 106416 106598 106968 106824 106462 106244 105702 104535 103633 104117 106046 108906
55574A08906L600L997L464K574K742M065N203N529N594N392M194K371J357J361
$$ 108906 112506 116503 119967 122541 125283 129348 134551 140080 145674 151066 155260 157631 158988 160349
55560A60349R74n16k282l698n012n909n501m240l750m215l985k432j061r19r94
$$ 160349 161323 160807 158525 154827 149815 143906 138405 134165 130415 126200 122215 119783 118722 117803 116809
55545A16809l16L61K68K20J064K043K124J680J548J496R10J35j27L7J40K27N59
$$ 116809 116493 116854 117122 117342 118406 120449 122573 124253 125801 127297 128207 128342 128215 128252 128392 128619 129178
55528A29178R63J087Q33J72q38j652j758j657k300l474l967l496l104l406l784
$$ 129178 130141 131228 132061 132233 131395 129743 127985 126328 124028 120554 116587 113091 109987 106581 102797
55513A02797l698l422l035k148j036p19j280j559r89m23n56r15j045j275j665
$$ 102797 99099 95677 92642 90494 89458 88739 87459 85900 84911 84488 83932 83017 81972 80697 79032
55498G9032j549q36m38o67o37M5M78J37j57J34J43p02j311n73P61J271R23O32
$$ 79032 77483 76647 76209 75542 74905 74950 75428 75565 75408 75542 75685 74983 73672 73099 73860 75131 76054 76686
55480G6686O14N51O18J098J505J353J201J785K550K261P91p66j574j744j641j433
$$ 76686 77300 77851 78469 79567 81072 82425 83626 85411 87961 90222 91013 90247 88673 86929 85288 83855
55464H3855j288j369j550j552j323r85n51j5M49N78K48m38j034r80l12P9n06j522
$$ 83855 82567 81198 79648 78096 76773 75788 75237 75222 75671 76249 76497 76059 75025 74045 73733 73812 73306 71784
55446G1784j886j476j067r05m78L09Q12O97L43M3k89m75j81K33j2p49q86m5Q98
$$ 71784 69898 68422 67355 66450 65972 66281 67093 67790 68133 68176 67887 67412 67231 67464 67452 66703 65817 65772 66670
55427F6670J112P32K37j34j75J34K45j31q4J291K914K727Q05m60K54J518J580
$$ 66670 67782 68514 68751 68617 68442 68576 68821 68690 68606 69897 72811 75538 76343 75883 76137 77655 79235
55410G9235O36k32q00j174r62j66K53j92o33l45J1k53m82J27R75R56R1q05j396
$$ 79235 79871 79639 78839 77665 76703 76537 76790 76598 75965 75620 75631 75378 74896 75023 75998 76954 77045 76240 74844
55391G4844j679j356m12L79M24J49J13O7k40l02J90M64k03j208j524j166p43k70
$$ 74844 73165 71809 71397 71776 72200 72349 72462 72529 72289 71987 72177 72641 72438 71230 69706 68540 67797 67527
55373F7527M62R51N38m82j265j533j472j018q2Q90J407J576J634J370O53l8k37
$$ 67527 67989 68940 69478 68996 67731 66198 64726 63708 63626 64516 65923 67499 69133 70503 71156 71118 70881
55356G0881j58j38m8J56M1n03p54j83O87J113J120J038P56J29n50j057j484j600
$$ 70881 70723 70585 70537 70693 70734 70231 69477 69294 69981 71094 72214 73252 74008 74137 73587 72530 71046 69446
55338F9446r15J38K95o83j433j040k95j5L59J262J611N35p52n86N41Q44j4q71
$$ 69446 68531 68669 68964 68281 66848 65808 65513 65498 65857 67119 68730 69265 68513 67927 68468 69312 69298 68427
55320F8427j211j526j798j437n97o4J62P57J634J963J553R94M45m00j224j232
$$ 68427 67216 65690 63892 62455 61858 61794 61956 62713 64347 66310 67863 68857 69302 68902 67678 66446
55304F6446n49k19o86j273j298p96o3O26Q94O47M93R00J222N47p17j275q50m53
$$ 66446 65897 65678 64992 63719 62421 61625 61562 62188 63082 63729 64222 65122 66344 66891 66174 64899 64049 63596
55286F3596o73r33o90k88j67j34J84P47J309J688J736J427J027P44L06n55j418
$$ 63596 62923 61990 61300 61012 60845 60711 60895 61642 62951 64639 66375 67802 68829 69573 69879 69324 67906
55269F7906j572r79k13L83Q56J150J118R49R05Q32M66N1l2K2k82q87j231j047
$$ 67906 66334 65355 65142 65525 66381 67531 68649 69598 70503 71335 71801 71852 71820 71842 71560 70673 69442 68395
55251F8395n02J68O83O91K66O8M07O42K12l53k19M02P23P34J004J454J416Q09
$$ 68395 67893 68061 68744 69435 69701 69769 70176 70818 71030 70677 70458 70860 71583 72317 73321 74775 76191 77000
55233G7000K14j11m31p61q25p03o75n57j2N91N12k69j044j378j327r03k08J44
$$ 77000 77214 77103 76672 75911 75086 74383 73708 73151 73139 73730 74242 73973 72929 71551 70224 69321 69113 69257
55215F9257l54j138j169l97K39J80k58o44p84l87O79J825K232J918J549J337R38
$$ 69257 68903 67765 66596 66199 66438 66618 66360 65716 64932 64545 65224 67049 69281 71199 72748 74085 75023
55198G5023L07k06n19p15n25K75J062R94K76j63j08j70n23o67n14n59q39p22K7
$$ 75023 75330 75124 74605 73890 73365 73640 74702 75696 75972 75809 75701 75531 75008 74341 73827 73268 72429 71707 71734
55179G1734Q17J141J111R77Q00P31Q94R67N26k31p35p85m79K65J245J570P11m34
$$ 71734 72551 73692 74803 75780 76580 77311 78205 79172 79698 79467 78732 77947 77468 77733 78978 80548 81259 80825
55161H0825o95l71n01q47k65J100J772J243N98M72J24q77j608j333p37p24j046
$$ 80825 80130 79759 79258 78411 78146 79246 81018 82261 82859 83331 83455 82578 80970 79637 78900 78176 77130
55144G7130j016o82n00n35o59q51q71l30N20Q50M92K31N19Q33P28N36N53M49N1
$$ 77130 76114 75432 74932 74397 73738 72887 72016 71686 72206 73056 73548 73779 74298 75131 75859 76395 76948 77397 77448
55125G7448j71P2L99N84R29J337J066j9q76p47j96l0r1L9M2m81j084j192j081
$$ 77448 77277 77349 77748 78332 79261 80598 81664 81645 80769 80022 79826 79796 79705 79744 79786 79305 78221 77029 75948
55106G5948j236j292o26M61J136J279J443J749J730J166M31k2oM38J022J306J152
$$ 75948 74712 73420 72794 73255 74391 75670 77113 78862 80592 81758 82189 82167 82161 82599 83621 84927 86079
55089H6079Q59O42L29j17k51K44R79J308J043M51j52m63k85K10O20Q96J308J691
$$ 86079 86938 87580 87909 87792 87541 87785 88764 90072 91115 91566 91414 90951 90666 90876 91496 92392 93700 95391
55071I5391J465N95j59l21l20n34n43L8O59N62n1l78k01j6j74n49q57r06o30k98
$$ 95391 96856 97451 97292 96971 96651 96117 95574 95612 96271 96833 96782 96404 96203 96187 96013 95464 94607 93701 93071 92773
55051I2773m20j049j477j045k7P22P73L83k9k83m26o41j023j361j378j195j148
$$ 92773 92353 91304 89827 88782 88755 89477 90250 90633 90604 90321 89895 89254 88231 86870 85492 84297 83149
55034H3149j089m82N76J109N11m94o99J37J149J452Q92l0o47o20k25m3l24q32
$$ 83149 82060 81578 82154 83263 83774 83280 82581 82718 83867 85319 86211 86181 85534 84914 84689 84646 84322 83490
55016H3490j293j608j600j063j95N09Q39R79R91P42M43N83J191J732J872J753
$$ 83490 82197 80589 78989 77926 77731 78240 79079 80058 81049 81791 82234 82817 84008 85740 87612 89365
55000H9365J421Q14L41O74J587J971J382O75O42Q45N03k19o03m85l00l15m58n83
$$ 89365 90786 91600 91941 92615 94202 96173 97555 98230 98872 99717 100220 100001 99398 98913 98613 98298 97840 97257
54982I7257n14r0M37N20M9m71o67o24l29M34J353J533P27k00m43k14k1J29K71
$$ 97257 96743 96653 97090 97610 97659 97188 96521 95897 95568 96002 97355 98888 99615 99415 98972 98758 98737 98866 99137
54963I9137N3n13o79q5M16l4r68j279p45RO38J274J848K027J665Q87j10r10j022
$$ 99137 99190 98677 97998 97913 98329 98295 97327 96048 95303 95312 95950 97224 99072 101099 102764 103651 103541 102631 101609
54944A01609n25o4Q1K63N10K31o09j019m54K37K25Q2O29J341J170L60L5M12P45
$$ 101609 101084 101020 101101 101364 101874 102105 101496 100477 100023 100260 100485 100567 101196 102537 103707 104067 104102 104514 105259
54925A05259P99J071J706K347K925L675M398M784N230O310P561P868P008N795
$$ 105259 106058 107129 108835 111182 114107 117782 122180 126964 132194 138504 146065 153933 160941 166736
54911A66736M679L267J345o37k311l765m969n609n654n457n156m579l825l306
$$ 166736 171415 174682 176027 175390 173079 169314 164345 158736 153082 147625 142469 137890 134065 130759
54897A30759l159l121l019k861k537j946j317r04n45o0K41R9k4M59J262J685J737
$$ 130759 127600 124479 121460 118599 116062 114116 112799 111895 111350 111290 111531 111630 111606 112065 113327 115012 116749
54880A16749J947K248K141J847K250L562M932N614N716N635N497N280M870L940
$$ 116749 118696 120944 123085 124932 127182 130744 135676 141290 147006 152641 158138 163418 168288 172228
54866A72228K373O58o84j992l856n844o819o496n746n246m838m338m053m045l829
$$ 172228 174601 175259 174575 172583 168727 162883 156064 149568 143822 138576 133738 129400 125347 121302 117473
54851A17473l138k323j734j350j213j427j557q83L58Q61r0j583k259j846j033
$$ 117473 114335 112012 110278 108928 107715 106288 104731 103848 104206 105067 104977 103394 101135 99289 98256
54836I8256l38J60L73J84j63j91K80R33J288J107N37l8l57m60m37k58J1J08n1
$$ 98256 97918 98078 98451 98635 98472 98281 98561 99494 100782 101889 102426 102388 102031 101571 101134 100876 100887 100995 100944
54817A00944j42O4K77J81j7KO6q8j89J01M44K75k16m18k94k39j16N46J511J988
$$ 100944 100802 100866 101143 101324 101307 101309 101375 101287 101098 101199 101643 101918 101702 101284 100990 100751 100635 101181 102692 104680
54797A04680J812J515J204M42o26j113o36J47N98P81P80L19n56j154j064o61l31
$$ 104680 106492 108007 109211 109653 109027 107914 107278 107425 108023 108804 109584 109903 109347 108193 107129 106468 106137
54780A06137J53R86J803K139J998J558R36M92P44J600K343K628K917L567M223
$$ 106137 106290 107276 109079 111218 113216 114774 115710 116202 116946 118546 120889 123517 126434 130001 134224
54765A34224M520M718N144N536N498N152M883M735M466L833K646Q38j283l210
$$ 134224 138744 143462 148606 154142 159640 164792 169675 174410 178876 182709 185355 186193 184910 181700
54751A81700m762n951o483o076n254m968n259n241m640m245m378m056k443l10
$$ 181700 176938 170987 164504 158428 153174 148206 142947 137706 133066 128821 124443 120387 117944 117634
54737A17634R12Q84L68l6k98m21l13n8K44O55J120J341J326J533K128K632K780
$$ 117634 118546 119430 119798 119762 119464 119043 118730 118672 118916 119571 120691 122032 123358 124891 127019 129651 132431
54720A32431L105M031M981N189M929N046N496N270L724J348q83k431l431m364
$$ 132431 135536 139567 144548 149737 154666 159712 165208 170478 174202 175550 174667 172236 168805 164441
54706A64441n429o190o061n235m574m361l816k413r81p03j489k206k169j647j088
$$ 164441 159012 152822 146761 141526 136952 132591 128775 126362 125381 124678 123189 120983 118814 117167 116079
54691A16079p38q21j319j624j119j74K47n2k95l8J36m02j303j687j273n56o7N5
$$ 116079 115341 114520 113201 111577 110458 110284 110531 110479 110184 110146 110282 109880 108577 106890 105617 105061 104994 105049
54673A05049r7m68r73j378j364q15LO15P38N10K68K15K76K24p1l99l47J51N85
$$ 105049 104952 104484 103511 102133 100769 99954 99957 100572 101310 101820 102088 102303 102579 102803 102732 102333 101986 102137 102722
54654A02722M83Q4l1R6j40q22j154n32N44J114Q87L36K2J83P37J291J360Q81K84
$$ 102722 103205 103289 103258 103354 103214 102392 101238 100706 101250 102364 103251 103587 103609 103792 104529 105820 107180 108061 108345
54635A08345j77p20j387j604r85j37k4o74j217j086n70j29J59L32K31j83n21l00
$$ 108345 108168 107448 106061 104457 103472 103335 103311 102637 101420 100334 99764 99635 99794 100126 100357 100174 99653 99353
54617I9353M84J261J427R42M22N31J235J771J464M35o10j116j027o47l74n58j205
$$ 99353 99837 101098 102525 103467 103889 104420 105655 107426 108890 109325 108715 107599 106572 105925 105551 104993 103788
54600A03788j831j710n64J034K029J782O81k97o56p59j059j332j050k80L66N40
$$ 103788 101957 100247 99683 100717 102746 104528 105209 104912 104256 103497 102438 101106 100056 99776 100142 100682
54584A00682M39L15K00J51K38K83M4l05l80k12j05Q3P75J696J944J293N84M38
$$ 100682 101121 101436 101636 101787 102025 102308 102352 102047 101667 101455 101350 101433 102208 103904 105848 107141 107725 108163
54566A08163L74k03r13r36j60R09J836K304J912P13m22o54k24j3k71m65k10L00
$$ 108163 108537 108334 107421 106485 106325 107234 109070 111374 113286 113999 113577 112923 112699 112686 112415 111950 111740 112040
54548A12040P78J181J498J598J462J247J091J007R34P71M56J16p8k37o15j066
$$ 112040 112818 113999 115497 117095 118557 119804 120895 121902 122836 123607 124063 124179 124101 123864 123249 122183
54532A22183j106o59k79l70o28o24m15k51j38j03m02r70j167n93K13M35M0m06
$$ 122183 121077 120418 120139 119769 119141 118517 118102 117851 117713 117610 117208 116238 115071 114478 114691 115126 115166 114760
54514A14760n94n51k05M72J047J019N37J85J49P0l03q07j133j101p38l41k46l12
$$ 114760 114166 113615 113410 113882 114929 115948 116485 116670 116819 116889 116586 115779 114646 113545 112807 112466 112220 111908
54496A11908l8N54O71p3p98l90R08J772J421L11p10j219j177p34j95K30O80J292
$$ 111908 111870 112424 113095 113022 112224 111834 112742 114514 115935 116246 115536 114317 113140 112406 112211 112441 113121 114413
54478A14413J766J656J029M26K53N22J040J495J572J309J097J039P17J9l27L31
$$ 114413 116179 117835 118864 119290 119543 120065 121105 122600 124172 125481 126578 127617 128334 128353 128026 128357
54462A28357J511K229K240J948J393L33q41j222n92L14Q14P96K77p72j905k324
$$ 128357 129868 132097 134337 136285 137678 138011 137170 135948 135356 135670 136484 137280 137557 136785 134880 132556
54446A32556j878j326j335j650j606j005k12L05L17p1n13p61q35p22j66Q49J631
$$ 132556 130678 129352 128017 126367 124761 123756 123544 123849 124166 124095 123582 122821 121986 121264 121098 121947 123578
54429A23578J419M05l80k48N50J267J294M75o54j027p3J428K090J443K03q34j420
$$ 123578 124997 125402 125022 124774 125324 126591 127885 128360 127706 126679 126606 128034 130124 131567 131770 130936 129516
54412A29516j432p52J76N07J5n84o44l09N7N18J186J693J627J167Q24P55P46O79
$$ 129516 128084 127332 127508 128015 128030 127446 126802 126493 126550 127068 128254 129947 131574 132741 133565 134320 135066 135745
54394A35745O40O40N81N00N91Q75J056Q32L24JN7O0m67j231j397o87K23O48O33
$$ 135745 136385 137025 137606 138106 138697 139572 140628 141460 141784 141785 141842 141902 141435 140204 138807 138120 138343 138991 139624
54375A39624M88J46m38q18n70P6O72J260K038K740L072L331L821M017L276K076
$$ 139624 140112 140258 139820 139002 138432 138508 139180 140440 142478 145218 148290 151621 155442 159459 162735 164811
54359A64811J490J572J344M45l58n33n68j016j631j914j843j593j230r86j259
$$ 164811 166301 167873 169217 169662 169304 168771 168203 167187 165556 163642 161799 160206 158976 157990 156731
54344A56731j949k391k263j964j821j546r35m08l72n17l51k0m2m94r37j047r15
$$ 156731 154782 152391 150128 148164 146343 144797 143862 143454 143082 142565 142214 142194 142152 141658 140721 139674 138759
54327A38759p66o38l94K5L21K5q42j494j195j79O60Q95Q27P55O80O70Q52R04L19
$$ 138759 137993 137355 136961 136986 137307 137332 136490 134996 133801 133622 134282 135177 136004 136759 137439 138109 138961 139865 140184
54308A40184p34j414j390j265j605k091k088j535q75m66l37k89rN83J057R41M16
$$ 140184 139450 138036 136646 135381 133776 131685 129597 128062 127187 126721 126384 126095 126086 126669 127726 128667 129083
54291A29083Q5Q1Rk17j58L91J037J393J463J303R60P82J071J366Q60k37p80l47
$$ 129083 129168 129249 129258 129041 128883 129274 130311 131704 133167 134470 135430 136212 137283 138649 139509 139272 138492 138145
54273A38145J21j72p35q11o17o72o67K4J107J607J172M12JM9K96M67M63M68P30
$$ 138145 138266 138094 137359 136548 135931 135259 134592 134616 135723 137330 138502 138914 138915 138964 139260 139727 140190 140658 141388
54254A41388J077R28R8p64q34nJ133J881J885J283O05J89k55j076j810j594n18
$$ 141388 142465 143393 143491 142727 141893 141888 143021 144902 146787 148070 148675 148864 148609 147533 145723 144129 143611
54237A43611L11K74q9k27m20r11j120n40L63Q66J013J165J134O22J5j13J01J36
$$ 143611 143922 144196 144107 143880 143460 142549 141429 140889 141252 142118 143131 144296 145430 146052 146067 145954 146055 146191
54219A46191o3k32m08o49n52J14O79L55n51j067r73q84j098j204r21m87j36J58
$$ 146191 146128 145896 145488 144839 144287 144401 145080 145435 144884 143817 142844 141960 140862 139658 138737 138250 138114 138272
54201A38272L36K90K28M42P02N08n2l05N6N75P31N80M70N49O84O86M98L30M61
$$ 138272 138608 138898 139126 139568 140270 140778 140726 140421 140477 141052 141783 142363 142833 143382 144066 144752 145250 145580 146041
54182A46041P89P48Q0o43n96L05J460K346K813K781K155J090l0q68j228j080p69
$$ 146041 146830 147578 147658 147015 146419 146724 148184 150530 153343 156124 158279 159369 159339 158471 157243 156163 155394
54165A55394q80j515j987j673q70l22j88j17n5l06q28j117r52o73o25p49p93o43
$$ 155394 154514 152999 151012 149339 148469 148147 147959 147842 147787 147481 146653 145536 144584 143911 143286 142537 141744 141101
54147A41101l64j68k97o62p70k81M82R20Q40M56n0m85m44K73J132J356R08M65
$$ 141101 140737 140569 140272 139610 138840 138559 139041 139961 140801 141257 141207 140722 140278 140551 141683 143039 143947 144412
54129A44412M04L66n1o40q89n86P1P24J116J174J006P96P40J012J605K176K350
$$ 144412 144816 145182 145131 144491 143602 143016 143087 143811 144927 146101 147107 147903 148643 149655 151260 153436 155786
54112A55786K176K036K089K169K280K602K892K643K062K122L101L899L551K603
$$ 155786 157962 159998 162087 164256 166536 169138 172030 174673 176735 178857 181958 185857 189408 192011
54098A92011K091J777O36j227k487k508k126k228k548k348j562p42k80j74k30
$$ 192011 194102 195879 196515 195288 192801 190293 188167 185939 183391 181043 179481 178739 178459 178285 178055
54083A78055j79J91P66J066O61m10j591k186j919j230p27l87L25J420K140K113
$$ 178055 177876 178067 178833 179899 180560 180150 178559 176373 174454 173224 172497 172110 172435 173855 175995 178108
54067A78108J982K261K311J378J05j86N64J097P33J55J16L91M37K52P5r5j84J55
$$ 178108 180090 182351 184662 186040 186145 185959 186523 187620 188353 188508 188624 189015 189452 189704 189779 189684 189500 189655
54049A89655J019J948K503K836L334M022M615M894M847M686M806N453O290O686
$$ 189655 190674 192622 195125 197961 201295 205317 209932 214826 219673 224359 229165 234618 240908 247594
54035B47594O551O534P180Q226Q943Q973Q544Q022P448O549N208L828L025K904
$$ 247594 254145 260679 267859 276085 285028 294001 302545 310567 318015 324564 329772 333600 336625 339529
54021C39529K869K394J658J166R53O02j60j248k500l880n375o881q105q586q156
$$ 339529 342398 344792 346450 347616 348569 349171 349011 347763 345263 341383 336008 329127 321022 312436 304280
54006C04280p406p165p359p057n968n039n098n623n623n034m398l783k959k204
$$ 304280 296874 289709 282350 275293 269325 264286 259188 253565 247942 242908 238510 234727 231768 229564
53992B29564j982k149k320k544k781k366j070r3o52k033k462j586o02j17L85R90
$$ 229564 227582 225433 223113 220569 217788 215422 214352 214259 213607 211574 209112 207526 206924 206807 207192 208182
53976B08182J033O19Q54K046L158L583M006M893N585N691O034P318Q883R617R101
$$ 208182 209215 209834 210688 212734 215892 219475 223481 228374 233959 239650 245684 253002 261885 271502 280603
53961B80603P199L753n00l861n504o358p284p609o573n069m414m259l278j389
$$ 280603 287802 291555 291055 287194 281690 275332 268048 260439 253866 248797 244383 240124 236846 235457
53947B35457K71J231K059K996L572L681L877M400M831M830M533M159L933M309
$$ 235457 235728 236959 239018 242014 245586 249267 253144 257544 262375 267205 271738 275897 279830 284139
53933B84139N437O523O509N432M412M265M800N443N825N725N226N008N779P277
$$ 284139 289576 296099 302608 308040 312452 316717 321517 326960 332785 338510 343736 348744 354523 361800
53919C61800Q466Q813Q734Q671Q501Q189Q333R459J1183J2528J2845J2114J0597
$$ 361800 370266 379079 387813 396484 404985 413174 421507 430966 442149 454677 467522 479636 490233
53906D90233Q576O346M139J964k28k209l499l895l864m211n257o554p550q230
$$ 490233 498809 505155 509294 511258 511030 508821 505322 501427 497563 493352 488095 481541 473991 465761
53892D65761q912r615j0100j0378j0741j1227j1582j1705j1654j1243j0257r146
$$ 465761 456849 447234 437134 426756 416015 404788 393206 381501 369847 358604 348347 339201
53880C39201q715q911q666p314n525m330l851l576l295l131l086l167l611m405
$$ 339201 330486 321575 312909 305595 300070 295740 291889 288313 285018 281887 278801 275634 272023 267618
53866B67618m961m856m543m692n160n260m743l926l065k298j961k242k707k749
$$ 267618 262657 257801 253258 248566 243406 238146 233403 229477 226412 224114 222153 219911 217204 214455
53852B14455k388j964j411n76M1j52o25k02J173K128J737O68m0m69j272k266k539
$$ 214455 212067 210103 208692 208116 208157 208005 207380 207178 208351 210479 212216 212884 212844 212375 211103 208837 206298
53835B06298j805p94k68j81j1N05J168J580J465Q54J25k07J10Q81J661K091K051
$$ 206298 204493 203699 203431 203250 203239 203744 204912 206492 207957 208811 208936 208729 208839 209720 211381 213472 215523
53818B15523J637J160J085J592K204K122J244N30R68K418L872M742N315N935O405
$$ 215523 217160 218320 219405 220997 223201 225323 226567 227097 228065 230483 234355 239097 244412 250347 256752
53803B56752O512O552O912P404P459O872O088N779O239P045P332O648N496M688
$$ 256752 263264 269816 276728 284132 291591 298463 304551 310330 316569 323614 330946 337594 343090 347778
53789C47778M239L489K338J572J620J710R45m13j430j940k644l894n164n874o163
$$ 347778 352017 355506 357844 359416 361036 362746 363691 363278 361848 359908 357264 353370 348206 342332 336169
53774C36169o545p206p847q140q050p764p350o680n789n140n168n630n805n362
$$ 336169 329624 322418 314571 306431 298381 290617 283267 276587 270798 265658 260490 254860 249055 243693
53760B43693m609l883l204k631k319k028j233r1M18k09j185j496j204j015j096
$$ 243693 239084 235201 231997 229366 227047 225019 223786 223695 224113 223904 222719 221223 220019 219004 217908
53745B17908j096r71r28q24l95K9j39p15q42j37Q28J262Q79j44j321j900j385
$$ 217908 216812 215841 214913 214089 213694 213723 213584 212869 212027 211890 212718 213980 214859 214715 213394 211494 210109
53728B10109j48Q54J088Q97Q56J104J376J416J191Q97P73Q38R03R51J259J898
$$ 210109 209961 210815 211903 212800 213656 214760 216136 217552 218743 219640 220413 221251 222154 223105 224364 226262
53712B26262K416K336J765J184Q64Q38J156J760K283K456K507K773L089L062K779
$$ 226262 228678 231014 232779 233963 234827 235665 236821 238581 240864 243320 245827 248600 251689 254751 257530
53697B57530K770L280M013M504M495L989L263K684K328J951J457J023O15r0r81
$$ 257530 260300 263580 267593 272097 276592 280581 283844 286528 288856 290807 292264 293287 293902 293812 292831
53682B92831j390j158j105j815k569k393j558j055j015p59j37L28N34Q71J203
$$ 292831 291441 290283 289178 287363 284794 282401 280843 279788 278773 278014 277877 278205 278739 279610 280813
53667B80813Q74p8p33o29l50m64o92n70j75J70L82M73M05L87P26J227J293P66
$$ 280813 281687 281609 280876 280247 279897 279433 278741 278171 277996 278166 278548 279021 279426 279813 280539 281766 283059 283825
53649B83825J23l20o87r00m93N67J538J799J545J239J044J037J448K190K682K566
$$ 283825 283948 283628 282941 282041 281548 282115 283653 285452 286997 288236 289280 290317 291765 293955 296637 299203
53633B99203K198K055K136K298K634L076L094K339J308Q27J126J766K229K238
$$ 299203 301401 303456 305592 307890 310524 313600 316694 319033 320341 321168 322294 324060 326289 328527
53619C28527J821J432J727K768L754L891L369L049L330L780L861L554L241L164
$$ 328527 330348 331780 333507 336275 340029 343920 347289 350338 353668 357448 361309 364863 368104 371268
53605C71268L203L073K664K123J677J406J320J404J508J338Q35L38O9k70r80j625
$$ 371268 374471 377544 380208 382331 384008 385414 386734 388138 389646 390984 391819 392157 392226 391956 390976 389351
53589C89351j383j86J041J306L85j227k717l372l130k673k578k487j716n62j28
$$ 389351 387968 387782 388823 390129 390514 389287 386570 383198 380068 377395 374817 372330 370614 370052 369924
53574C69924q18j749j934j326n30j27m74j459k218j852p06j03n75j171r63k72
$$ 369924 369106 367357 365423 364097 363567 363440 362966 361507 359289 357437 356731 356628 356053 354882 353919 353647
53558C53647K03N12Q94R02J52p29q32k97J40M22R69J486J285P24J043K467L609
$$ 353647 353850 354362 355256 356158 356310 355581 354749 354452 354592 355014 355983 357469 358754 359478 360521 362988 366597
53541C66597L342K354K148L101M295M912N049N187N448N568N387N189N555O789
$$ 366597 369939 372293 374441 377542 381837 386749 391798 396985 402433 408001 413388 418577 424132 430921
53527D30921Q492R851J0458J0662J0995J1489J1816J1908J2115J2700J3526J4349
$$ 430921 439413 449264 459722 470384 481379 492868 504684 516592 528707 541407 554933 569282
53515E69282J5153J6049J7044J8177J9598K1218K2478K2943K3040K3626K4774
$$ 569282 584435 600484 617528 635705 655303 676521 698999 721942 744982 768608 793382
53504G93382K5571K5359K4537K3767K3060K2218K1534K1281K0945J9873J8450
$$ 793382 818953 844312 868849 892616 915676 937894 959428 980709 1001654 1021527 1039977
53493A039977J7651J7529J7147J6120J5239J5201J5674J6030J6273J6681J7129
$$ 1039977 1057628 1075157 1092304 1108424 1123663 1138864 1154538 1170568 1186841 1203522 1220651
53482A220651J7336J7361J7349J7164J6702J6209J5768J4886J3048J0415P553
$$ 1220651 1237987 1255348 1272697 1289861 1306563 1322772 1338540 1353426 1366474 1376889 1384442
53471A384442M747K040l42k193l792n657p870j0038j1833j3150j3828j3676j2956
$$ 1384442 1389189 1391229 1390887 1388694 1384902 1379245 1371375 1361337 1349504 1336354 1322526 1308850 1295894
53458A295894j2471j2915j4244j5830j7126j8066j8851j9496j9774j9535j8971
$$ 1295894 1283423 1270508 1256264 1240434 1223308 1205242 1186391 1166895 1147121 1127586 1108615
53447A108615j8460j8236j8229j8066j7283j5775j4082j2792j1656r854p367n358
$$ 1108615 1090155 1071919 1053690 1035624 1018341 1002566 988484 975692 964036 954182 946815 941457
53435I41457m668m611m068l142k629k300j064J173L101L805L854M252N227O562
$$ 941457 936789 932178 928110 924968 922339 920039 918975 920148 923249 927054 930908 935160 940387 946949
53421I46949Q206R996J1526J2813J4427J6523J8463J9858K1221K3040K4906K6320
$$ 946949 955155 965151 976677 989490 1003917 1020440 1038903 1058761 1079982 1103022 1127928 1154248
53409A154248K7634K9461L1613L3380L4531L5418L6356L7502L8978M0681M2204
$$ 1154248 1181882 1211343 1242956 1276336 1310867 1346285 1382641 1420143 1459121 1499802 1542006
53398A542006M3400M4663M6305M8054M9563N0906N2150N2990N3244N3163N2802
$$ 1542006 1585406 1630069 1676374 1724428 1773991 1824897 1877047 1930037 1983281 2036444 2089246
53387B089246N1799N0274M9149M8830M8276M6375M3571M1091L9030L6392L2744
$$ 2089246 2141045 2191319 2240468 2289298 2337574 2383949 2427520 2468611 2507641 2544033 2576777
53376B576777K8670K4565K0132J5194J0159N438J110k844o627j1016j6878k4069
$$ 2576777 2605447 2630012 2650144 2665338 2675497 2680935 2682045 2679201 2672574 2661558 2644680 2620611
53364B620611l1357l7513m2044m4943m6391m6923m7237m7620m7911m8026m8045
$$ 2620611 2589254 2551741 2509697 2464754 2418363 2371440 2324203 2276583 2228672 2180646 2132601
53353B132601m7785m6767m4887m2702m0914l9798l9209l8882l8702l8760l9133
$$ 2132601 2084816 2038049 1993162 1950460 1909546 1869748 1830539 1791657 1752955 1714195 1675062
53342A675062l9474l9148l7949l6351l4797l3134l1155k9198k7683k6408k4843
$$ 1675062 1635588 1596440 1558491 1522140 1487343 1454209 1423054 1393856 1366173 1339765 1314922
53331A314922k2866k0671j8421j6542j5828j6451j7323j7331j6831j6876j7306
$$ 1314922 1292056 1271385 1252964 1236422 1220594 1204143 1186820 1169489 1152658 1135782 1118476
53320A118476j6861j5168j3287j2028j0942r482q059p218o538n172l060q92Q27
$$ 1118476 1101615 1086447 1073160 1061132 1050190 1040708 1032649 1025431 1018893 1013721 1010661 1009769 1010596
53307A010596K165L387M657N991P313Q578R940J1577J3399J5138J6732J8287J9737
$$ 1010596 1012761 1016148 1020805 1026796 1034109 1042687 1052627 1064204 1077603 1092741 1109473 1127760 1147497
53294A147497K0981K2276K3930K5590K6425K6139K5296K4557K4048K3582K2901
$$ 1147497 1168478 1190754 1214684 1240274 1266699 1292838 1318134 1342691 1366739 1390321 1413222
53283A413222K1654J9716J7688J6360J5419J3433R632N013J132j646m030o397
$$ 1413222 1434876 1454592 1472280 1488640 1504059 1517492 1527124 1532137 1533269 1531623 1527593 1521196
53271A521196q426r964j1386j3030j4824j6725j8917k1276k3142k4014k4274k4702
$$ 1521196 1512770 1502806 1491420 1478390 1463566 1446841 1427924 1406648 1383506 1359492 1335218 1310516
53259A310516k5401k5718k5402k5201k5845k6839k6983k6009k4920k4502k4339
$$ 1310516 1285115 1259397 1233995 1208794 1182949 1156110 1129127 1103118 1078198 1053696 1029357
53248A029357k3770k3149k3310k4175k4765k4544k3958k3529k3107k2269k1030
$$ 1029357 1005587 982438 959128 934953 910188 885644 861686 838157 815050 792781 771751
53237G71751j9835j9074j8765j8494j7648j5990j3988j2364j1259j0215q941p782
$$ 771751 751916 732842 714077 695583 677935 661945 647957 635593 624334 614119 605178 597396
53225E97396p333p862r146j0590j1531j1719j1541j1621j2136j2783j3265j3525
$$ 597396 590063 582201 573055 562465 550934 539215 527674 516053 503917 491134 477869 464344
53213D64344j3509j3087j2258j1220j0151r074p920o695n599n046n258n828o003
$$ 464344 450835 437748 425490 414270 404119 395045 387125 380430 374831 369785 364527 358699 352696
53200C52696n561n055n001n302n775o549p476p694o579m730l310k729k630k806
$$ 352696 347135 342080 337079 331777 326002 319453 311977 304283 297704 292974 289664 286935 284305 281499
53186B81499l226l504l241k804k812k993k471j254l68l89q16j063j178j257j065
$$ 281499 278273 274769 271528 268724 265912 262919 260448 259194 258826 258437 257621 256558 255380 254123 253058
53171B53058o78p27j428k048j847j063m81m64q51j359j718j748j636j758k002
$$ 253058 252380 251653 250225 248177 246330 245267 244786 244322 243471 242112 240394 238646 237010 235252 233250
53156B33250j767q88k2K63L35Q67J702J994J309K00m50l96k49o66j406j502n42
$$ 233250 231483 230595 230573 230836 231171 232038 233740 235734 237043 237243 236793 236397 236148 235482 234076 232574 232032
53139B32032O08Q53L61K57R54J606J370M84k25l76j48J20K00P2k9R4K73K50J63
$$ 232032 232640 233493 233854 234111 235065 236671 238041 238525 238300 237924 237776 237896 238096 238168 238139 238233 238506 238756 238919
53120B38919K76M18L33L69J004J770J672Q07M82J313K259K109J067J02n06j102
$$ 238919 239195 239613 239946 240315 241319 243089 244761 245568 246050 247363 249622 251731 252798 252900 252394 251292
53104B51292j668j819j557j273j151j014p33l97j95k90o67r27o57n8J89j17m70
$$ 251292 249624 247805 246248 244975 243824 242810 242077 241680 241485 241195 240528 239601 238944 238886 239075 238958 238488
53087B38488n05m96p13r45j083j479k178k456j730n34J48J67J53M20O58O56O55
$$ 238488 237983 237487 236774 235829 234746 233267 231089 228633 226903 226369 226517 226684 226837 227257 227915 228571 229226
53070B29226Q45Q95K73j024k155k130j014j43o37j926k498j935j243j069p30L91
$$ 229226 230071 230966 231239 230215 228060 225930 224916 224773 224136 222210 219712 217777 216534 215465 214735 215126
53054B15126J596J793J059L83L46P41J145J247R77P21R93J466J080l43j363p01
$$ 215126 216722 218515 219574 219957 220303 221044 222189 223436 224413 225134 226127 227593 228673 228330 226967 226266
53038B26266Q83J536P11m42q21m38K11P81R84O18ql04j41Q8J06%j35k34k1P26
$$ 226266 227149 228685 229396 228954 228133 227695 227906 228687 229671 230289 230281 229977 229836 229924 230030 230030 229895 229661 229640 230366
53018B30366J621J904J333M36j29j37J92M20J91l21m42J48Q11O94j19p61p09k30
$$ 230366 231987 233891 235224 235660 235531 235394 235586 236006 236197 235876 235434 235582 236393 237087 236968 236207 235498 235268
53000B35268K69O26O14p1j222j970j621l92Q89J671J987K057J870J375R20J030
$$ 235268 235537 236163 236777 236706 235484 233514 231893 231501 232390 234061 236048 238105 239975 241350 242270 243300
52984B43300J651J989J485P15O39J251J693J645J605J683J207K4q70o73Q1N12
$$ 243300 244951 246940 248425 249140 249779 251030 252723 254368 255973 257656 258863 258887 258017 257344 257425 257937
52968B57937O96J081J348R28J17l52m40m65p3J164K358J936j74k229k812k293
$$ 257937 258633 259714 261062 261990 262107 261755 261315 260850 260777 261941 264299 266235 266061 263832 261020 258727
52952B58727j774j555j349j197j458k072k477k246j553r90r96j362j436r54l88
$$ 258727 256953 255398 254049 252852 251394 249322 246845 244599 243046 242056 241060 239698 238262 237308 236920
52937B36920k40l39j99J80L62J39l15p69r42n17M17J157J183Q10N93M54J58J29
$$ 236920 236680 236341 236142 236322 236684 236823 236508 235739 234797 234280 234697 235854 237037 237847 238440 238894 239052 239181
52919B39181Q12J530J135k62j279j197p98q98j117o96K07P34M29m27j284j733
$$ 239181 239993 241523 242658 242396 241117 239920 239122 238224 237107 236411 236618 237352 237781 237354 236070 234337
52903B34337j692j451j310j133n26M46J184J301J108J128J451J677J293J45j173
$$ 234337 232645 231194 229884 228751 228225 228671 229855 231156 232264 233392 234843 236520 237813 237958 236785
52888B36785j541m19J305K122J582O29K53L89M13J41n1J89P90J343J511J418J566
$$ 236785 235244 234825 236130 238252 239834 240463 240716 241105 241518 241659 241608 241797 242587 243930 245441 246859 248425
52871B48425K160K765K878K566K104J386L38m18k23M65N00k96q74n82j44n40j706
$$ 248425 250585 253350 256228 258794 260898 262284 262622 262204 261981 262446 262946 262650 261776 261194 261050 260510 258804
52854B58804k909l764m299m440m059l328k535j788j140q74j250k098k884l098
$$ 258804 255895 252131 247832 243392 239333 236005 233470 231682 230542 229668 228418 226320 223436 220338
52840B20338k529j398l22R4k25q18j212j252r53l78L16R32J367J556J365Q92N71
$$ 220338 217809 216411 216089 216183 215958 215140 213928 212676 211723 211345 211661 212593 213960 215516 216881 217773 218344
52823B18344O55P25K77l81m34K28P80O16R8j24K3K11M12R40J880K746K810J823
$$ 218344 218999 219724 220001 219620 219186 219414 220194 220810 220908 220784 220807 221018 221430 222370 224250 226996 229806 231629
52805B31629M40k84J4O23O63L3p92j489j946j967j546j161j182j282r88n35m54
$$ 231629 232069 231785 231799 232422 233085 233118 232326 230837 228891 226924 225378 224217 223035 221753 220765 220230 219776
52788B19776o49o98p64j303j987j902q52M46J407J970K014J342L80p6O9K30K21
$$ 219776 219127 218429 217665 216362 214375 212473 211621 212067 213474 215444 217458 218800 219180 219104 219173 219403 219624
52771B19624L85O12L81j78l40j10k39p46o88J12N08j77j067j174p41l50K02J162
$$ 219624 220009 220621 221002 220824 220484 220374 220135 219389 218701 218813 219321 219144 218077 216903 216162 215812 216014 217176
52753B17176J943K006J806J853J696Q89K02O30J811K537K492K365K544K687K517
$$ 217176 219119 221125 222931 224784 226480 227369 227571 228201 230012 232549 235041 237406 239950 242637 245154
52738B45154K107J557J035R73J518K075K017J532J181J080J082J238J366Q15n50
$$ 245154 247261 248818 249853 250826 252344 254419 256436 257968 259149 260229 261311 262549 263915 264730 264180
52723B64180j674j646j126j348k154k303j473o72o54j153j754k383k683k022n40
$$ 264180 262506 260860 259734 258386 256232 253929 252456 251784 251130 249977 248223 245840 243157 241135 240595
52708B40595P43J170J092J022R29O63L55J7n42j115j049k30N48O13K84K37M37
$$ 240595 241338 242508 243600 244622 245551 246214 246569 246586 246044 244929 243880 243650 244198 244811 245095 245332 245769
52691B45769L15k90q72q95l57K47L94O3k37p5K40Pq63j669j803j439j079q46o21
$$ 245769 246084 245794 244922 244027 243670 243917 244311 244374 244137 244062 244302 244309 243446 241777 239974 238535 237456 236610 235989
52672B35989n21p68j165j144m42N37J148J093N10l01j011j208n95O52J910K746
$$ 235989 235468 234700 233535 232391 231949 232486 233634 234727 235237 234936 233925 232717 232122 232774 234684 237430
52656B37430L260L636L604K825J662J007J279K000K465K329J470j42k072l392
$$ 237430 240690 244326 247930 250755 252417 253424 254703 256703 259168 261497 262967 262825 260753 257361
52642B57361l457k520j389p04o59j034j320j186r34j012j059k02J455K542K172
$$ 257361 253904 251384 249995 249291 248632 247598 246278 245092 244158 243146 242087 241885 243340 245882 248054
52627B48054J242J181K119L069L441L311K559Q53j401l060l433k878k162j728
$$ 248054 249296 250477 252596 255665 259106 262417 264976 265829 264428 261368 257935 255057 252895 251167
52613B51167j640j688j446p22M0J97k21n75m87j98k2N6J49K03J10j59n08o77l78
$$ 251167 249527 247839 246393 245671 245711 245908 245687 245112 244625 244427 244405 244461 244610 244813 244923 244764 244256 243579 243201
52594B43201K25M80J6o34o71l3O95J160J454J572J341Q33L54N5n3K51J117K087
$$ 243201 243426 243906 243922 243288 242617 242584 243279 244439 245893 247465 248806 249639 249993 250048 249995 250246 251363 253450
52576B53450K413J950J233O81K63k8j2J96J16m96j287j730j632j180p61p03r36
$$ 253450 255863 257813 259046 259727 259990 259962 259950 260146 260262 259766 258479 256749 255117 253937 253176 252473 251537
52559B51537j014p54o08q79r60n4J502K374J825M52p03j162r87m44K9Q9p6j7J93
$$ 251537 250523 249769 249161 248282 247322 247268 248770 251144 252969 253421 252718 251556 250569 250125 250154 250243 250167 250150 250343
52540B50343J5n78q51l75K79L26j81n04j27Q25J794K173J737Q70J76k53p01j024
$$ 250343 250358 249780 248929 248554 248833 249159 248978 248474 248347 249172 250966 253139 254876 255746 255922 255669 254968 253944
52522B53944n75O81J672J446M42r4K40O70N48K57N36J379K075K191K096K391L097
$$ 253944 253369 254050 255722 257168 257610 257516 257756 258426 258974 259231 259767 261146 263221 265412 267508 269899 272996
52505B72996L682L735L276K391R52j010k965m238m560m114l241k372j982k156
$$ 272996 276678 280413 283689 286080 287032 286022 283057 278819 274259 270145 266904 264532 262550 260394
52491B60394k371k080j420r69r22r32p13l57l9K21M90Q33J293J745J920J827J819
$$ 260394 258023 255943 254523 253554 252632 251700 250987 250630 250591 250812 251302 252135 253428 255173 257093 258920 260739
52474B60739J955J680O93k39o8J102K145K417K281K158J925J509J304J552J956
$$ 260739 262694 264374 265067 264828 264760 265862 268007 270424 272705 274863 276788 278297 279601 281153 283109
52459B83109K227K454K615K298J364L43k56p08j571k834l916m385m258l781l267
$$ 283109 285336 287790 290405 292703 294067 294410 294154 293446 291875 289041 285125 280740 276482 272701 269434
52444B69434k931k643k008r36M2L59J03j06J13N28O58L48p3j80J8N5l03o39m17
$$ 269434 266503 263860 261852 260916 260958 261317 261420 261314 261427 261955 262613 262961 262888 262708 262726 262781 262478 261839 261422
52425B61422J95N39M15L39O86J121J124P20L40K34L47N94J015J612K233K626K661
$$ 261422 261617 262156 262571 262910 263596 264717 265841 266561 266901 267135 267482 268076 269091 270703 272936 275562 278223
52408B78223K554K725L363M230N044N798O474O703O051M493K301k29k676m383
$$ 278223 280777 283502 286865 291095 296139 301937 308411 315114 321165 325658 327959 327730 325054 320671
52394C20671m981m767m155l187k046j501j973k685k626k020j680j332j8J942L019
$$ 320671 315690 310923 306768 303581 301535 300034 298061 295376 292750 290730 289050 287718 287700 289642 292661
52379B92661K773K424K690K646J641P81J337K820L977M706N601O361O169N231
$$ 292661 295434 297858 300548 303194 304835 305616 306953 309773 313750 318456 324057 330418 336587 341818
52365C41818M458L942L083K029J558J494P17r99k423k604k023j487q90J53J209
$$ 341818 346276 350218 353301 355330 356888 358382 359099 358100 355677 353073 351050 349563 348673 348826 350035
52350C50035J523J218J178J873K825L288L072K603K466K876L511L890L945M090
$$ 350035 351558 352776 353954 355827 358652 361940 365012 367615 370081 372957 376468 380358 384303 388393
52336C88393M675N603O544P332Q033Q713R378J0048J0801J1737J2919J4266J5543
$$ 388393 393068 398671 405215 412547 420580 429293 438671 448719 459520 471257 484176 498442 513985
52323E13985J6539J7322J8205J9343K0447K1021K0856K0173J9261J8193J7061
$$ 513985 530524 547846 566051 585394 605841 626862 647718 667891 687152 705345 722406
52312G22406J6301J6310J6732J6583J5368J3698J2508J2057J2121J2661J3550
$$ 722406 738707 755017 771749 788332 803700 817398 829906 841963 854084 866745 880295
52301H80295J3966J3000J0972R235Q504Q169P507O563N378L301m6l752o499q088
$$ 880295 894261 907261 918233 927468 935972 944141 951648 958211 963589 966890 966844 963092 956593 948505
52287I48505r214j0067j0112r233q128p355o690n670m253k631q19J292L581N689
$$ 948505 939291 929224 919112 909879 901751 894396 887706 882036 877783 875152 874333 875625 879206 884895
52273H84895P220Q075Q677R698J1294J2834J3672J3985J4337J4633J4242J3159
$$ 884895 892115 900190 908867 918565 929859 942693 956365 970350 984687 999320 1013562 1026721
52261A026721J2292J2326J2894J3225J3154J2944J2599J1915J1083J0624J0668
$$ 1026721 1039013 1051339 1064233 1077458 1090612 1103556 1116155 1128070 1139153 1149777 1160445
52250A160445J0719J0250R214P848O198M129J667q42k974m542n698o723p674q255
$$ 1160445 1171164 1181414 1190628 1198476 1204674 1208803 1210470 1209628 1206654 1202112 1196414 1189691 1182017 1173762
52236A173762q148p478o799o513o454o213n698n169m791m443l946l226k172p17
$$ 1173762 1165614 1158136 1151337 1144824 1138370 1132157 1126459 1121290 1116499 1112056 1108110 1104884 1102712 1101995
52222A101995Q87K106K653K732K709K810L247M168N314O133O485O850P444P695
$$ 1101995 1102882 1104988 1107641 1110373 1113082 1115892 1119139 1123307 1128621 1134754 1141239 1148089 1155533 1163228
52208A163228P188O610O951P960Q322P370N831M770M470M612M925N301N677O085
$$ 1163228 1170416 1177026 1183977 1191937 1200259 1207629 1213460 1218230 1222700 1227312 1232237 1237538 1243215 1249300
52194A249300O548O857O742O319N923N573N083M664M788N272N130L666J257j205
$$ 1249300 1255848 1262705 1269447 1275766 1281689 1287262 1292345 1297009 1301797 1307069 1312199 1315865 1317122 1315917
52180A315917l245m929o519q230j0032j1451j1943j1580j0981j0503r871q726
$$ 1315917 1312672 1307743 1301224 1292994 1282962 1271511 1259568 1247988 1237007 1226504 1216633 1207907
52168A207907p093n258l629k753k829l133k566r60P25J731K231K592K698K439
$$ 1207907 1200814 1195556 1191927 1189174 1186345 1183212 1180646 1179686 1180411 1182142 1184373 1186965 1189663 1192102
52154A192102K144J982J521M08r83k058k684l002l009k762k532k371k009j425
$$ 1192102 1194246 1196228 1197749 1198157 1197174 1195116 1192432 1189430 1186421 1183659 1181127 1178756 1176747 1175322
52140A175322r76p20l15J02k25j393k262j822m28J005K319L769N166O298P700
$$ 1175322 1174346 1173626 1173311 1173413 1173188 1171795 1169533 1167711 1167283 1168288 1170607 1174376 1179542 1185840 1193540
52125A193540J0027J2978J5760J8235K0748K3127K4760K5546K5936K6167K6128
$$ 1193540 1203567 1216545 1232305 1250540 1271288 1294415 1319175 1344721 1370657 1396824 1422952
52114A422952K5780K5072K3724K1746J9832J8564J7581J6190J4362J2322R839
$$ 1422952 1448732 1473804 1497528 1519274 1539106 1557670 1575251 1591441 1605803 1618125 1627964
52103A627964O851M309L140K761J845L39o86j008j625k941m118m696n563p557
$$ 1627964 1634815 1639124 1642264 1645025 1646870 1647209 1646523 1645515 1643890 1640949 1636831 1632135 1626572 1619015
52089A619015j0102j2042j3111j3863j4640j5208j5107j3950j1788r325p397o016
$$ 1619015 1608913 1596871 1583760 1569897 1555257 1540049 1524942 1510992 1499204 1489879 1482482 1476466
52077A476466m426k138N95L397O109Q402R785J0315J0644J1180J1791J2557J3893
$$ 1476466 1472040 1469902 1470497 1473894 1480003 1488405 1498190 1508505 1519149 1530329 1542120 1554677 1568570
$$ [...]
##END NTUPLES=NMR SPECTRUM
##END=
